FailedConsole Output

Started by an SCM change
Building in workspace /home/hudson/genie.unide/.jenkins/jobs/Unide Java Binding/workspace
[WS-CLEANUP] Deleting project workspace...
[WS-CLEANUP] Done
Cloning the remote Git repository
Cloning repository https://github.com/eclipse/unide.java
 > /usr/local/bin/git init /home/hudson/genie.unide/.jenkins/jobs/Unide Java Binding/workspace # timeout=10
Fetching upstream changes from https://github.com/eclipse/unide.java
 > /usr/local/bin/git --version # timeout=10
 > /usr/local/bin/git fetch --tags --progress https://github.com/eclipse/unide.java +refs/heads/*:refs/remotes/origin/*
 > /usr/local/bin/git config remote.origin.url https://github.com/eclipse/unide.java # timeout=10
 > /usr/local/bin/git config --add remote.origin.fetch +refs/heads/*:refs/remotes/origin/* # timeout=10
 > /usr/local/bin/git config remote.origin.url https://github.com/eclipse/unide.java # timeout=10
Fetching upstream changes from https://github.com/eclipse/unide.java
 > /usr/local/bin/git fetch --tags --progress https://github.com/eclipse/unide.java +refs/heads/*:refs/remotes/origin/*
 > /usr/local/bin/git rev-parse refs/remotes/origin/master^{commit} # timeout=10
 > /usr/local/bin/git rev-parse refs/remotes/origin/origin/master^{commit} # timeout=10
Checking out Revision 7fda95790eb0414c79fa265beffc2dae30c9166e (refs/remotes/origin/master)
 > /usr/local/bin/git config core.sparsecheckout # timeout=10
 > /usr/local/bin/git checkout -f 7fda95790eb0414c79fa265beffc2dae30c9166e
Commit message: "refact(version): prepare for next dev cycle"
 > /usr/local/bin/git rev-list --no-walk 021f6275b759f12f161f29ebc4dc2aa4adeb631a # timeout=10
Parsing POMs
Modules changed, recalculating dependency graph
Established TCP socket on 49215
[workspace] $ /shared/common/jdk1.8.0_x64-latest/bin/java -Xmx2G -Djava.io.tmpdir=/tmp/genie.unide -cp /home/hudson/genie.unide/.jenkins/plugins/maven-plugin/WEB-INF/lib/maven35-agent-1.12-alpha-1.jar:/shared/common/apache-maven-latest/boot/plexus-classworlds-2.5.2.jar:/shared/common/apache-maven-latest/conf/logging jenkins.maven3.agent.Maven35Main /shared/common/apache-maven-latest /home/hudson/genie.unide/.jenkins/war/WEB-INF/lib/remoting-3.14.jar /home/hudson/genie.unide/.jenkins/plugins/maven-plugin/WEB-INF/lib/maven35-interceptor-1.12-alpha-1.jar /home/hudson/genie.unide/.jenkins/plugins/maven-plugin/WEB-INF/lib/maven3-interceptor-commons-1.12-alpha-1.jar 49215
Picked up JAVA_TOOL_OPTIONS: -Xmx2G -Djava.io.tmpdir=/tmp/genie.unide
<===[JENKINS REMOTING CAPACITY]===>channel started
Executing Maven:  -B -f /home/hudson/genie.unide/.jenkins/jobs/Unide Java Binding/workspace/pom.xml clean deploy -DenableEclipseJarSigner
[INFO] Scanning for projects...
[INFO] 
[INFO] ------------------------------------------------------------------------
[INFO] Building ppmp-java-binding 0.3.0-SNAPSHOT
[INFO] ------------------------------------------------------------------------
[WARNING] The POM for org.eclipse.iot.unide.ppmp:ppmp-schema:jar:3.0.0-SNAPSHOT is missing, no dependency information available
Started calculate disk usage of build
Finished Calculation of disk usage of build in 0 seconds
Started calculate disk usage of workspace
Finished Calculation of disk usage of workspace in 0 seconds
[INFO] ------------------------------------------------------------------------
[INFO] BUILD FAILURE
[INFO] ------------------------------------------------------------------------
[INFO] Total time: 2.343 s
[INFO] Finished at: 2018-03-26T09:33:18-04:00
[INFO] Final Memory: 26M/1379M
[INFO] ------------------------------------------------------------------------
[ERROR] Failed to execute goal on project ppmp-java-binding: Could not resolve dependencies for project org.eclipse.iot.unide.ppmp:ppmp-java-binding:bundle:0.3.0-SNAPSHOT: Could not find artifact org.eclipse.iot.unide.ppmp:ppmp-schema:jar:3.0.0-SNAPSHOT -> [Help 1]
[ERROR] 
[ERROR] To see the full stack trace of the errors, re-run Maven with the -e switch.
[ERROR] Re-run Maven using the -X switch to enable full debug logging.
[ERROR] 
[ERROR] For more information about the errors and possible solutions, please read the following articles:
[ERROR] [Help 1] http://cwiki.apache.org/confluence/display/MAVEN/DependencyResolutionException
[JENKINS] Archiving /home/hudson/genie.unide/.jenkins/jobs/Unide Java Binding/workspace/pom.xml to org.eclipse.iot.unide.ppmp/ppmp-java-binding/0.3.0-SNAPSHOT/ppmp-java-binding-0.3.0-SNAPSHOT.pom
Sending e-mails to: axel.meinhardt@bosch-si.com
channel stopped
Started calculate disk usage of build
Finished Calculation of disk usage of build in 0 seconds
Started calculate disk usage of workspace
Finished Calculation of disk usage of workspace in 0 seconds
Sending e-mails to: axel.meinhardt@bosch-si.com
Finished: FAILURE