FailedConsole Output

Started by user Dmitry Kornilov
Rebuilds build #84
Running as Dmitry Kornilov
Agent basic-7bxjj is provisioned from template basic
---
apiVersion: "v1"
kind: "Pod"
metadata:
  annotations: {}
  labels:
    jenkins: "slave"
    jenkins/label: ""
  name: "basic-7bxjj"
spec:
  containers:
  - env:
    - name: "JENKINS_SECRET"
      value: "********"
    - name: "JENKINS_TUNNEL"
      value: "jenkins-discovery.tyrus.svc.cluster.local:50000"
    - name: "JENKINS_AGENT_NAME"
      value: "basic-7bxjj"
    - name: "JENKINS_REMOTING_JAVA_OPTS"
      value: "-showversion -XshowSettings:vm -Xmx256m -Dsun.zip.disableMemoryMapping=true\
        \ -Dorg.jenkinsci.remoting.engine.JnlpProtocol3.disabled=true -Dorg.jenkinsci.plugins.gitclient.CliGitAPIImpl.useSETSID=true"
    - name: "JAVA_TOOL_OPTIONS"
      value: ""
    - name: "_JAVA_OPTIONS"
      value: ""
    - name: "OPENJ9_JAVA_OPTIONS"
      value: "-XX:+IgnoreUnrecognizedVMOptions -XX:+IdleTuningCompactOnIdle -XX:+IdleTuningGcOnIdle"
    - name: "JENKINS_NAME"
      value: "basic-7bxjj"
    - name: "JENKINS_AGENT_WORKDIR"
      value: "/home/jenkins/agent"
    - name: "JENKINS_URL"
      value: "http://jenkins-ui.tyrus.svc.cluster.local/tyrus/"
    image: "docker.io/eclipsecbi/jiro-agent-basic:remoting-4.2.1"
    imagePullPolicy: "Always"
    name: "jnlp"
    resources:
      limits:
        memory: "4096Mi"
        cpu: "2000m"
      requests:
        memory: "4096Mi"
        cpu: "1000m"
    securityContext:
      privileged: false
    tty: true
    volumeMounts:
    - mountPath: "/home/jenkins/.m2/toolchains.xml"
      name: "m2-dir"
      readOnly: true
      subPath: "toolchains.xml"
    - mountPath: "/home/jenkins/.mavenrc"
      name: "m2-dir"
      readOnly: true
      subPath: ".mavenrc"
    - mountPath: "/opt/tools"
      name: "volume-0"
      readOnly: false
    - mountPath: "/home/jenkins"
      name: "volume-2"
      readOnly: false
    - mountPath: "/home/jenkins/.m2/repository"
      name: "volume-3"
      readOnly: false
    - mountPath: "/home/jenkins/.m2/settings-security.xml"
      name: "m2-secret-dir"
      readOnly: true
      subPath: "settings-security.xml"
    - mountPath: "/home/jenkins/.m2/wrapper"
      name: "volume-4"
      readOnly: false
    - mountPath: "/home/jenkins/.m2/settings.xml"
      name: "m2-secret-dir"
      readOnly: true
      subPath: "settings.xml"
    - mountPath: "/home/jenkins/.ssh"
      name: "volume-1"
      readOnly: false
    - mountPath: "/home/jenkins/agent"
      name: "workspace-volume"
      readOnly: false
    workingDir: "/home/jenkins/agent"
  nodeSelector:
    beta.kubernetes.io/os: "linux"
  restartPolicy: "Never"
  securityContext: {}
  volumes:
  - name: "volume-0"
    persistentVolumeClaim:
      claimName: "tools-claim-jiro-tyrus"
      readOnly: true
  - name: "m2-secret-dir"
    secret:
      secretName: "m2-secret-dir"
  - emptyDir:
      medium: ""
    name: "volume-2"
  - configMap:
      name: "m2-dir"
    name: "m2-dir"
  - configMap:
      name: "known-hosts"
    name: "volume-1"
  - emptyDir:
      medium: ""
    name: "workspace-volume"
  - emptyDir:
      medium: ""
    name: "volume-4"
  - emptyDir:
      medium: ""
    name: "volume-3"

Building remotely on basic-7bxjj in workspace /home/jenkins/agent/workspace/tyrus-master-release
[WS-CLEANUP] Deleting project workspace...
[WS-CLEANUP] Deferred wipeout is used...
[ssh-agent] Looking for ssh-agent implementation...
[ssh-agent]   Exec ssh-agent (binary ssh-agent on a remote machine)
$ ssh-agent
SSH_AUTH_SOCK=/tmp/ssh-kBPlX4DpZCTr/agent.56
SSH_AGENT_PID=58
[ssh-agent] Started.
Running ssh-add (command line suppressed)
Identity added: /home/jenkins/agent/workspace/tyrus-master-release@tmp/private_key_6152694450179262909.key (/home/jenkins/agent/workspace/tyrus-master-release@tmp/private_key_6152694450179262909.key)
[ssh-agent] Using credentials tyrus-bot (GitHub bot SSH)
using credential github-bot-ssh
Cloning the remote Git repository
Cloning repository git@github.com:eclipse-ee4j/tyrus.git
 > git init /home/jenkins/agent/workspace/tyrus-master-release # timeout=10
Fetching upstream changes from git@github.com:eclipse-ee4j/tyrus.git
 > git --version # timeout=10
using GIT_SSH to set credentials GitHub bot SSH
 > git fetch --tags --force --progress -- git@github.com:eclipse-ee4j/tyrus.git +refs/heads/*:refs/remotes/origin/* # timeout=10
 > git config remote.origin.url git@github.com:eclipse-ee4j/tyrus.git # timeout=10
 > git config --add remote.origin.fetch +refs/heads/*:refs/remotes/origin/* # timeout=10
 > git config remote.origin.url git@github.com:eclipse-ee4j/tyrus.git # timeout=10
Fetching upstream changes from git@github.com:eclipse-ee4j/tyrus.git
using GIT_SSH to set credentials GitHub bot SSH
 > git fetch --tags --force --progress -- git@github.com:eclipse-ee4j/tyrus.git +refs/heads/*:refs/remotes/origin/* # timeout=10
 > git rev-parse refs/remotes/origin/2.x^{commit} # timeout=10
 > git rev-parse refs/remotes/origin/origin/2.x^{commit} # timeout=10
Checking out Revision 01d544915922908bccf28d50b0b3ee2fd9a59e0d (refs/remotes/origin/2.x)
 > git config core.sparsecheckout # timeout=10
 > git checkout -f 01d544915922908bccf28d50b0b3ee2fd9a59e0d # timeout=10
Commit message: "Merge pull request #712 from jansupol/1x-merge"
 > git rev-list --no-walk dcd393626af7db5dcb1502b634e5a3eda13e3010 # timeout=10
[tyrus-master-release] $ /bin/bash /tmp/jenkins2166541294052029489.sh
gpg: directory '/home/jenkins/.gnupg' created
gpg: keybox '/home/jenkins/.gnupg/pubring.kbx' created
gpg: /home/jenkins/.gnupg/trustdb.gpg: trustdb created
gpg: key 1630982555403F73: public key "Eclipse Tyrus Project <tyrus-dev@eclipse.org>" imported
gpg: To migrate 'secring.gpg', with each smartcard, run: gpg --card-status
gpg: key 1630982555403F73: secret key imported
gpg: Total number processed: 1
gpg:               imported: 1
gpg:       secret keys read: 1
gpg:   secret keys imported: 1
Secret subkeys are available.

pub  rsa4096/1630982555403F73
     created: 2018-04-04  expires: 2023-04-03  usage: SCEA
     trust: unknown       validity: unknown
ssb  rsa4096/9ED6B4274BFE31CC
     created: 2018-04-04  expires: 2023-04-03  usage: S   
[ unknown] (1). Eclipse Tyrus Project <tyrus-dev@eclipse.org>

pub  rsa4096/1630982555403F73
     created: 2018-04-04  expires: 2023-04-03  usage: SCEA
     trust: unknown       validity: unknown
ssb  rsa4096/9ED6B4274BFE31CC
     created: 2018-04-04  expires: 2023-04-03  usage: S   
[ unknown] (1). Eclipse Tyrus Project <tyrus-dev@eclipse.org>

Please decide how far you trust this user to correctly verify other users' keys
(by looking at passports, checking fingerprints from different sources, etc.)

  1 = I don't know or won't say
  2 = I do NOT trust
  3 = I trust marginally
  4 = I trust fully
  5 = I trust ultimately
  m = back to the main menu


pub  rsa4096/1630982555403F73
     created: 2018-04-04  expires: 2023-04-03  usage: SCEA
     trust: ultimate      validity: unknown
ssb  rsa4096/9ED6B4274BFE31CC
     created: 2018-04-04  expires: 2023-04-03  usage: S   
[ unknown] (1). Eclipse Tyrus Project <tyrus-dev@eclipse.org>
Please note that the shown key validity is not necessarily correct
unless you restart the program.

Secret subkeys are available.

gpg: checking the trustdb
gpg: marginals needed: 3  completes needed: 1  trust model: pgp
gpg: depth: 0  valid:   1  signed:   0  trust: 0-, 0q, 0n, 0m, 0f, 1u
gpg: next trustdb check due at 2023-04-03
pub  rsa4096/1630982555403F73
     created: 2018-04-04  expires: 2023-04-03  usage: SCEA
     trust: ultimate      validity: ultimate
ssb  rsa4096/9ED6B4274BFE31CC
     created: 2018-04-04  expires: 2023-04-03  usage: S   
[ultimate] (1). Eclipse Tyrus Project <tyrus-dev@eclipse.org>

pub  rsa4096/1630982555403F73
     created: 2018-04-04  expires: 2023-04-03  usage: SCEA
     trust: ultimate      validity: ultimate
ssb  rsa4096/9ED6B4274BFE31CC
     created: 2018-04-04  expires: 2023-04-03  usage: S   
[ultimate] (1). Eclipse Tyrus Project <tyrus-dev@eclipse.org>

Please decide how far you trust this user to correctly verify other users' keys
(by looking at passports, checking fingerprints from different sources, etc.)

  1 = I don't know or won't say
  2 = I do NOT trust
  3 = I trust marginally
  4 = I trust fully
  5 = I trust ultimately
  m = back to the main menu


pub  rsa4096/1630982555403F73
     created: 2018-04-04  expires: 2023-04-03  usage: SCEA
     trust: ultimate      validity: ultimate
ssb  rsa4096/9ED6B4274BFE31CC
     created: 2018-04-04  expires: 2023-04-03  usage: S   
[ultimate] (1). Eclipse Tyrus Project <tyrus-dev@eclipse.org>

[tyrus-master-release] $ /bin/bash -e /tmp/jenkins4154447904371206720.sh
    <version>2.0-SNAPSHOT</version>
                <version>4.0-SNAPSHOT</version>
Current version: 2.0-SNAPSHOT
Release version: 2.0.0-M3
Next version:    2.0.0-SNAPSHOT
Release tag:     2.0.0-M3
Release branch:  2.0.0-M3-BRANCH
-[ Prepare branch ]-------------------------------------------------------------
-[ Release tag cleanup ]--------------------------------------------------------
error: branch '2.0.0-M3' not found.
Switched to a new branch '2.0.0-M3-BRANCH'
error: tag '2.0.0-M3' not found.
-[ Set release version ]--------------------------------------------------------
Apache Maven 3.6.3 (cecedd343002696d0abb50b32b541b8a6ba2883f)
Maven home: /opt/tools/apache-maven/latest
Java version: 1.8.0_202, vendor: Oracle Corporation, runtime: /opt/tools/java/oracle/jdk-8/1.8.0_202/jre
Default locale: en_US, platform encoding: UTF-8
OS name: "linux", version: "3.10.0-1062.el7.x86_64", arch: "amd64", family: "unix"
-[ Commit modified pom.xml files ]----------------------------------------------
[2.0.0-M3-BRANCH 6bfa082] Prepare release Apache Maven 3.6.3 (cecedd343002696d0abb50b32b541b8a6ba2883f) Maven home: /opt/tools/apache-maven/latest Java version: 1.8.0_202, vendor: Oracle Corporation, runtime: /opt/tools/java/oracle/jdk-8/1.8.0_202/jre Default locale: en_US, platform encoding: UTF-8 OS name: "linux", version: "3.10.0-1062.el7.x86_64", arch: "amd64", family: "unix" org.glassfish.tyrus:Apache Maven 3.6.3 (cecedd343002696d0abb50b32b541b8a6ba2883f) Maven home: /opt/tools/apache-maven/latest Java version: 1.8.0_202, vendor: Oracle Corporation, runtime: /opt/tools/java/oracle/jdk-8/1.8.0_202/jre Default locale: en_US, platform encoding: UTF-8 OS name: "linux", version: "3.10.0-1062.el7.x86_64", arch: "amd64", family: "unix" tyrus-project:2.0.0-M3
 67 files changed, 67 insertions(+), 67 deletions(-)
-[ Deploy artifacts to staging repository ]-----------------------------
Apache Maven 3.6.3 (cecedd343002696d0abb50b32b541b8a6ba2883f)
Maven home: /opt/tools/apache-maven/latest
Java version: 1.8.0_202, vendor: Oracle Corporation, runtime: /opt/tools/java/oracle/jdk-8/1.8.0_202/jre
Default locale: en_US, platform encoding: UTF-8
OS name: "linux", version: "3.10.0-1062.el7.x86_64", arch: "amd64", family: "unix"
[INFO] Scanning for projects...
[WARNING] 
[WARNING] Some problems were encountered while building the effective model for org.glassfish.tyrus.archetypes:tyrus-archetype-echo:jar:2.0.0-M3
[WARNING] 'build.plugins.plugin.version' for org.apache.maven.plugins:maven-enforcer-plugin is missing. @ org.eclipse.ee4j:project:1.0.6, /home/jenkins/.m2/repository/org/eclipse/ee4j/project/1.0.6/project-1.0.6.pom, line 164, column 29
[WARNING] 
[WARNING] Some problems were encountered while building the effective model for org.glassfish.tyrus.archetypes:tyrus-archetypes-project:pom:2.0.0-M3
[WARNING] 'build.plugins.plugin.version' for org.apache.maven.plugins:maven-enforcer-plugin is missing. @ org.eclipse.ee4j:project:1.0.6, /home/jenkins/.m2/repository/org/eclipse/ee4j/project/1.0.6/project-1.0.6.pom, line 164, column 29
[WARNING] 
[WARNING] Some problems were encountered while building the effective model for org.glassfish.tyrus:tyrus-bom:pom:2.0-SNAPSHOT
[WARNING] 'parent.relativePath' of POM org.glassfish.tyrus:tyrus-bom:2.0-SNAPSHOT (/home/jenkins/agent/workspace/tyrus-master-release/bom/pom.xml) points at org.glassfish.tyrus:tyrus-project instead of org.eclipse.ee4j:project, please verify your project structure @ line 24, column 13
[WARNING] 'build.plugins.plugin.version' for org.apache.maven.plugins:maven-gpg-plugin is missing. @ org.eclipse.ee4j:project:1.0.1, /home/jenkins/.m2/repository/org/eclipse/ee4j/project/1.0.1/project-1.0.1.pom, line 190, column 29
[WARNING] 'build.plugins.plugin.version' for org.apache.maven.plugins:maven-source-plugin is missing. @ org.eclipse.ee4j:project:1.0.1, /home/jenkins/.m2/repository/org/eclipse/ee4j/project/1.0.1/project-1.0.1.pom, line 166, column 29
[WARNING] 'build.plugins.plugin.version' for org.apache.maven.plugins:maven-javadoc-plugin is missing. @ org.eclipse.ee4j:project:1.0.1, /home/jenkins/.m2/repository/org/eclipse/ee4j/project/1.0.1/project-1.0.1.pom, line 178, column 29
[WARNING] 'build.plugins.plugin.version' for org.apache.maven.plugins:maven-enforcer-plugin is missing. @ org.eclipse.ee4j:project:1.0.1, /home/jenkins/.m2/repository/org/eclipse/ee4j/project/1.0.1/project-1.0.1.pom, line 145, column 29
[WARNING] 
[WARNING] Some problems were encountered while building the effective model for org.glassfish.tyrus:tyrus-client:bundle:2.0.0-M3
[WARNING] 'build.plugins.plugin.version' for org.apache.maven.plugins:maven-enforcer-plugin is missing. @ org.eclipse.ee4j:project:1.0.6, /home/jenkins/.m2/repository/org/eclipse/ee4j/project/1.0.6/project-1.0.6.pom, line 164, column 29
[WARNING] 
[WARNING] Some problems were encountered while building the effective model for org.glassfish.tyrus:tyrus-container-glassfish-cdi:bundle:2.0.0-M3
[WARNING] 'build.plugins.plugin.version' for org.apache.maven.plugins:maven-enforcer-plugin is missing. @ org.eclipse.ee4j:project:1.0.6, /home/jenkins/.m2/repository/org/eclipse/ee4j/project/1.0.6/project-1.0.6.pom, line 164, column 29
[WARNING] 
[WARNING] Some problems were encountered while building the effective model for org.glassfish.tyrus:tyrus-container-glassfish-ejb:bundle:2.0.0-M3
[WARNING] 'build.plugins.plugin.version' for org.apache.maven.plugins:maven-enforcer-plugin is missing. @ org.eclipse.ee4j:project:1.0.6, /home/jenkins/.m2/repository/org/eclipse/ee4j/project/1.0.6/project-1.0.6.pom, line 164, column 29
[WARNING] 
[WARNING] Some problems were encountered while building the effective model for org.glassfish.tyrus:tyrus-containers-glassfish-project:pom:2.0.0-M3
[WARNING] 'build.plugins.plugin.version' for org.apache.maven.plugins:maven-enforcer-plugin is missing. @ org.eclipse.ee4j:project:1.0.6, /home/jenkins/.m2/repository/org/eclipse/ee4j/project/1.0.6/project-1.0.6.pom, line 164, column 29
[WARNING] 
[WARNING] Some problems were encountered while building the effective model for org.glassfish.tyrus:tyrus-container-grizzly-client:bundle:2.0.0-M3
[WARNING] 'build.plugins.plugin.version' for org.apache.maven.plugins:maven-enforcer-plugin is missing. @ org.eclipse.ee4j:project:1.0.6, /home/jenkins/.m2/repository/org/eclipse/ee4j/project/1.0.6/project-1.0.6.pom, line 164, column 29
[WARNING] 
[WARNING] Some problems were encountered while building the effective model for org.glassfish.tyrus:tyrus-container-grizzly-server:bundle:2.0.0-M3
[WARNING] 'build.plugins.plugin.version' for org.apache.maven.plugins:maven-enforcer-plugin is missing. @ org.eclipse.ee4j:project:1.0.6, /home/jenkins/.m2/repository/org/eclipse/ee4j/project/1.0.6/project-1.0.6.pom, line 164, column 29
[WARNING] 
[WARNING] Some problems were encountered while building the effective model for org.glassfish.tyrus:tyrus-container-inmemory:bundle:2.0.0-M3
[WARNING] 'build.plugins.plugin.version' for org.apache.maven.plugins:maven-enforcer-plugin is missing. @ org.eclipse.ee4j:project:1.0.6, /home/jenkins/.m2/repository/org/eclipse/ee4j/project/1.0.6/project-1.0.6.pom, line 164, column 29
[WARNING] 
[WARNING] Some problems were encountered while building the effective model for org.glassfish.tyrus:tyrus-container-servlet:bundle:2.0.0-M3
[WARNING] 'build.plugins.plugin.version' for org.apache.maven.plugins:maven-enforcer-plugin is missing. @ org.eclipse.ee4j:project:1.0.6, /home/jenkins/.m2/repository/org/eclipse/ee4j/project/1.0.6/project-1.0.6.pom, line 164, column 29
[WARNING] 
[WARNING] Some problems were encountered while building the effective model for org.glassfish.tyrus:tyrus-container-jdk-client:bundle:2.0.0-M3
[WARNING] 'build.plugins.plugin.version' for org.apache.maven.plugins:maven-enforcer-plugin is missing. @ org.eclipse.ee4j:project:1.0.6, /home/jenkins/.m2/repository/org/eclipse/ee4j/project/1.0.6/project-1.0.6.pom, line 164, column 29
[WARNING] 
[WARNING] Some problems were encountered while building the effective model for org.glassfish.tyrus:tyrus-containers-project:pom:2.0.0-M3
[WARNING] 'build.plugins.plugin.version' for org.apache.maven.plugins:maven-enforcer-plugin is missing. @ org.eclipse.ee4j:project:1.0.6, /home/jenkins/.m2/repository/org/eclipse/ee4j/project/1.0.6/project-1.0.6.pom, line 164, column 29
[WARNING] 
[WARNING] Some problems were encountered while building the effective model for org.glassfish.tyrus:tyrus-core:bundle:2.0.0-M3
[WARNING] 'build.plugins.plugin.version' for org.apache.maven.plugins:maven-enforcer-plugin is missing. @ org.eclipse.ee4j:project:1.0.6, /home/jenkins/.m2/repository/org/eclipse/ee4j/project/1.0.6/project-1.0.6.pom, line 164, column 29
[WARNING] 
[WARNING] Some problems were encountered while building the effective model for org.glassfish.tyrus:tyrus-documentation:pom:2.0.0-M3
[WARNING] 'build.plugins.plugin.version' for org.apache.maven.plugins:maven-enforcer-plugin is missing. @ org.eclipse.ee4j:project:1.0.6, /home/jenkins/.m2/repository/org/eclipse/ee4j/project/1.0.6/project-1.0.6.pom, line 164, column 29
[WARNING] 
[WARNING] Some problems were encountered while building the effective model for org.glassfish.tyrus.ext:tyrus-client-cli:bundle:2.0.0-M3
[WARNING] 'build.plugins.plugin.version' for org.apache.maven.plugins:maven-enforcer-plugin is missing. @ org.eclipse.ee4j:project:1.0.6, /home/jenkins/.m2/repository/org/eclipse/ee4j/project/1.0.6/project-1.0.6.pom, line 164, column 29
[WARNING] 
[WARNING] Some problems were encountered while building the effective model for org.glassfish.tyrus.ext:tyrus-monitoring-jmx:jar:2.0.0-M3
[WARNING] 'build.plugins.plugin.version' for org.apache.maven.plugins:maven-enforcer-plugin is missing. @ org.eclipse.ee4j:project:1.0.6, /home/jenkins/.m2/repository/org/eclipse/ee4j/project/1.0.6/project-1.0.6.pom, line 164, column 29
[WARNING] 
[WARNING] Some problems were encountered while building the effective model for org.glassfish.tyrus.ext:tyrus-extension-deflate:bundle:2.0.0-M3
[WARNING] 'build.plugins.plugin.version' for org.apache.maven.plugins:maven-enforcer-plugin is missing. @ org.eclipse.ee4j:project:1.0.6, /home/jenkins/.m2/repository/org/eclipse/ee4j/project/1.0.6/project-1.0.6.pom, line 164, column 29
[WARNING] 
[WARNING] Some problems were encountered while building the effective model for org.glassfish.tyrus.ext:tyrus-client-java8:bundle:2.0.0-M3
[WARNING] 'build.plugins.plugin.version' for org.apache.maven.plugins:maven-enforcer-plugin is missing. @ org.eclipse.ee4j:project:1.0.6, /home/jenkins/.m2/repository/org/eclipse/ee4j/project/1.0.6/project-1.0.6.pom, line 164, column 29
[WARNING] 
[WARNING] Some problems were encountered while building the effective model for org.glassfish.tyrus.ext:tyrus-extensions-project:pom:2.0.0-M3
[WARNING] 'build.plugins.plugin.version' for org.apache.maven.plugins:maven-enforcer-plugin is missing. @ org.eclipse.ee4j:project:1.0.6, /home/jenkins/.m2/repository/org/eclipse/ee4j/project/1.0.6/project-1.0.6.pom, line 164, column 29
[WARNING] 
[WARNING] Some problems were encountered while building the effective model for org.glassfish.tyrus.samples:tyrus-sample-auction:war:2.0.0-M3
[WARNING] 'build.plugins.plugin.version' for org.apache.maven.plugins:maven-enforcer-plugin is missing. @ org.eclipse.ee4j:project:1.0.6, /home/jenkins/.m2/repository/org/eclipse/ee4j/project/1.0.6/project-1.0.6.pom, line 164, column 29
[WARNING] 
[WARNING] Some problems were encountered while building the effective model for org.glassfish.tyrus.samples:tyrus-sample-cdi:war:2.0.0-M3
[WARNING] 'build.plugins.plugin.version' for org.apache.maven.plugins:maven-enforcer-plugin is missing. @ org.eclipse.ee4j:project:1.0.6, /home/jenkins/.m2/repository/org/eclipse/ee4j/project/1.0.6/project-1.0.6.pom, line 164, column 29
[WARNING] 
[WARNING] Some problems were encountered while building the effective model for org.glassfish.tyrus.samples:tyrus-sample-chat:war:2.0.0-M3
[WARNING] 'build.plugins.plugin.version' for org.apache.maven.plugins:maven-enforcer-plugin is missing. @ org.eclipse.ee4j:project:1.0.6, /home/jenkins/.m2/repository/org/eclipse/ee4j/project/1.0.6/project-1.0.6.pom, line 164, column 29
[WARNING] 
[WARNING] Some problems were encountered while building the effective model for org.glassfish.tyrus.samples:tyrus-sample-draw:war:2.0.0-M3
[WARNING] 'build.plugins.plugin.version' for org.apache.maven.plugins:maven-enforcer-plugin is missing. @ org.eclipse.ee4j:project:1.0.6, /home/jenkins/.m2/repository/org/eclipse/ee4j/project/1.0.6/project-1.0.6.pom, line 164, column 29
[WARNING] 
[WARNING] Some problems were encountered while building the effective model for org.glassfish.tyrus.samples:tyrus-sample-echo:war:2.0.0-M3
[WARNING] 'build.plugins.plugin.version' for org.apache.maven.plugins:maven-enforcer-plugin is missing. @ org.eclipse.ee4j:project:1.0.6, /home/jenkins/.m2/repository/org/eclipse/ee4j/project/1.0.6/project-1.0.6.pom, line 164, column 29
[WARNING] 
[WARNING] Some problems were encountered while building the effective model for org.glassfish.tyrus.samples:tyrus-sample-basic-auth:war:2.0.0-M3
[WARNING] 'build.plugins.plugin.version' for org.apache.maven.plugins:maven-enforcer-plugin is missing. @ org.eclipse.ee4j:project:1.0.6, /home/jenkins/.m2/repository/org/eclipse/ee4j/project/1.0.6/project-1.0.6.pom, line 164, column 29
[WARNING] 
[WARNING] Some problems were encountered while building the effective model for org.glassfish.tyrus.samples:tyrus-sample-echo-https:war:2.0.0-M3
[WARNING] 'build.plugins.plugin.version' for org.apache.maven.plugins:maven-enforcer-plugin is missing. @ org.eclipse.ee4j:project:1.0.6, /home/jenkins/.m2/repository/org/eclipse/ee4j/project/1.0.6/project-1.0.6.pom, line 164, column 29
[WARNING] 
[WARNING] Some problems were encountered while building the effective model for org.glassfish.tyrus.samples:tyrus-sample-programmatic-echo:war:2.0.0-M3
[WARNING] 'build.plugins.plugin.version' for org.apache.maven.plugins:maven-enforcer-plugin is missing. @ org.eclipse.ee4j:project:1.0.6, /home/jenkins/.m2/repository/org/eclipse/ee4j/project/1.0.6/project-1.0.6.pom, line 164, column 29
[WARNING] 
[WARNING] Some problems were encountered while building the effective model for org.glassfish.tyrus.samples:tyrus-sample-simplelife:war:2.0.0-M3
[WARNING] 'build.plugins.plugin.version' for org.apache.maven.plugins:maven-enforcer-plugin is missing. @ org.eclipse.ee4j:project:1.0.6, /home/jenkins/.m2/repository/org/eclipse/ee4j/project/1.0.6/project-1.0.6.pom, line 164, column 29
[WARNING] 
[WARNING] Some problems were encountered while building the effective model for org.glassfish.tyrus.samples:tyrus-sample-shared-collection:war:2.0.0-M3
[WARNING] 'build.plugins.plugin.version' for org.apache.maven.plugins:maven-enforcer-plugin is missing. @ org.eclipse.ee4j:project:1.0.6, /home/jenkins/.m2/repository/org/eclipse/ee4j/project/1.0.6/project-1.0.6.pom, line 164, column 29
[WARNING] 
[WARNING] Some problems were encountered while building the effective model for org.glassfish.tyrus.samples:tyrus-samples-project:pom:2.0.0-M3
[WARNING] 'build.plugins.plugin.version' for org.apache.maven.plugins:maven-enforcer-plugin is missing. @ org.eclipse.ee4j:project:1.0.6, /home/jenkins/.m2/repository/org/eclipse/ee4j/project/1.0.6/project-1.0.6.pom, line 164, column 29
[WARNING] 
[WARNING] Some problems were encountered while building the effective model for org.glassfish.tyrus:tyrus-server:bundle:2.0.0-M3
[WARNING] 'build.plugins.plugin.version' for org.apache.maven.plugins:maven-enforcer-plugin is missing. @ org.eclipse.ee4j:project:1.0.6, /home/jenkins/.m2/repository/org/eclipse/ee4j/project/1.0.6/project-1.0.6.pom, line 164, column 29
[WARNING] 
[WARNING] Some problems were encountered while building the effective model for org.glassfish.tyrus:tyrus-spi:bundle:2.0.0-M3
[WARNING] 'build.plugins.plugin.version' for org.apache.maven.plugins:maven-enforcer-plugin is missing. @ org.eclipse.ee4j:project:1.0.6, /home/jenkins/.m2/repository/org/eclipse/ee4j/project/1.0.6/project-1.0.6.pom, line 164, column 29
[WARNING] 
[WARNING] Some problems were encountered while building the effective model for org.glassfish.tyrus.tests:tyrus-tests-e2e-appconfig:war:2.0.0-M3
[WARNING] 'build.plugins.plugin.version' for org.apache.maven.plugins:maven-enforcer-plugin is missing. @ org.eclipse.ee4j:project:1.0.6, /home/jenkins/.m2/repository/org/eclipse/ee4j/project/1.0.6/project-1.0.6.pom, line 164, column 29
[WARNING] 
[WARNING] Some problems were encountered while building the effective model for org.glassfish.tyrus.tests:tyrus-tests-e2e-nondeployable:war:2.0.0-M3
[WARNING] 'build.plugins.plugin.version' for org.apache.maven.plugins:maven-enforcer-plugin is missing. @ org.eclipse.ee4j:project:1.0.6, /home/jenkins/.m2/repository/org/eclipse/ee4j/project/1.0.6/project-1.0.6.pom, line 164, column 29
[WARNING] 
[WARNING] Some problems were encountered while building the effective model for org.glassfish.tyrus.tests:tyrus-tests-e2e-stdconfig:war:2.0.0-M3
[WARNING] 'build.plugins.plugin.version' for org.apache.maven.plugins:maven-enforcer-plugin is missing. @ org.eclipse.ee4j:project:1.0.6, /home/jenkins/.m2/repository/org/eclipse/ee4j/project/1.0.6/project-1.0.6.pom, line 164, column 29
[WARNING] 
[WARNING] Some problems were encountered while building the effective model for org.glassfish.tyrus.tests:tyrus-tests-e2e-jdk8:war:2.0.0-M3
[WARNING] 'build.plugins.plugin.version' for org.apache.maven.plugins:maven-enforcer-plugin is missing. @ org.eclipse.ee4j:project:1.0.6, /home/jenkins/.m2/repository/org/eclipse/ee4j/project/1.0.6/project-1.0.6.pom, line 164, column 29
[WARNING] 
[WARNING] Some problems were encountered while building the effective model for org.glassfish.tyrus.tests:tyrus-tests-e2e-auth-basic:jar:2.0.0-M3
[WARNING] 'build.plugins.plugin.version' for org.apache.maven.plugins:maven-enforcer-plugin is missing. @ org.eclipse.ee4j:project:1.0.6, /home/jenkins/.m2/repository/org/eclipse/ee4j/project/1.0.6/project-1.0.6.pom, line 164, column 29
[WARNING] 
[WARNING] Some problems were encountered while building the effective model for org.glassfish.tyrus.tests:tyrus-tests-e2e-auth-digest:jar:2.0.0-M3
[WARNING] 'build.plugins.plugin.version' for org.apache.maven.plugins:maven-enforcer-plugin is missing. @ org.eclipse.ee4j:project:1.0.6, /home/jenkins/.m2/repository/org/eclipse/ee4j/project/1.0.6/project-1.0.6.pom, line 164, column 29
[WARNING] 
[WARNING] Some problems were encountered while building the effective model for org.glassfish.tyrus.tests:tyrus-tests-e2e-jetty:pom:2.0.0-M3
[WARNING] 'build.plugins.plugin.version' for org.apache.maven.plugins:maven-enforcer-plugin is missing. @ org.eclipse.ee4j:project:1.0.6, /home/jenkins/.m2/repository/org/eclipse/ee4j/project/1.0.6/project-1.0.6.pom, line 164, column 29
[WARNING] 
[WARNING] Some problems were encountered while building the effective model for org.glassfish.tyrus.tests:tyrus-tests-e2e:pom:2.0.0-M3
[WARNING] 'build.plugins.plugin.version' for org.apache.maven.plugins:maven-enforcer-plugin is missing. @ org.eclipse.ee4j:project:1.0.6, /home/jenkins/.m2/repository/org/eclipse/ee4j/project/1.0.6/project-1.0.6.pom, line 164, column 29
[WARNING] 
[WARNING] Some problems were encountered while building the effective model for org.glassfish.tyrus.tests.servlet:tyrus-tests-servlet-async:war:2.0.0-M3
[WARNING] 'build.plugins.plugin.version' for org.apache.maven.plugins:maven-enforcer-plugin is missing. @ org.eclipse.ee4j:project:1.0.6, /home/jenkins/.m2/repository/org/eclipse/ee4j/project/1.0.6/project-1.0.6.pom, line 164, column 29
[WARNING] 
[WARNING] Some problems were encountered while building the effective model for org.glassfish.tyrus.tests.servlet:tyrus-tests-servlet-autobahn-server:war:2.0.0-M3
[WARNING] 'build.plugins.plugin.version' for org.apache.maven.plugins:maven-enforcer-plugin is missing. @ org.eclipse.ee4j:project:1.0.6, /home/jenkins/.m2/repository/org/eclipse/ee4j/project/1.0.6/project-1.0.6.pom, line 164, column 29
[WARNING] 
[WARNING] Some problems were encountered while building the effective model for org.glassfish.tyrus.tests.servlet:tyrus-tests-servlet-basic:war:2.0.0-M3
[WARNING] 'build.plugins.plugin.version' for org.apache.maven.plugins:maven-enforcer-plugin is missing. @ org.eclipse.ee4j:project:1.0.6, /home/jenkins/.m2/repository/org/eclipse/ee4j/project/1.0.6/project-1.0.6.pom, line 164, column 29
[WARNING] 
[WARNING] Some problems were encountered while building the effective model for org.glassfish.tyrus.tests.servlet:tyrus-tests-servlet-dynamic-deploy:war:2.0.0-M3
[WARNING] 'build.plugins.plugin.version' for org.apache.maven.plugins:maven-enforcer-plugin is missing. @ org.eclipse.ee4j:project:1.0.6, /home/jenkins/.m2/repository/org/eclipse/ee4j/project/1.0.6/project-1.0.6.pom, line 164, column 29
[WARNING] 
[WARNING] Some problems were encountered while building the effective model for org.glassfish.tyrus.tests.servlet:tyrus-tests-servlet-noappconfig:war:2.0.0-M3
[WARNING] 'build.plugins.plugin.version' for org.apache.maven.plugins:maven-enforcer-plugin is missing. @ org.eclipse.ee4j:project:1.0.6, /home/jenkins/.m2/repository/org/eclipse/ee4j/project/1.0.6/project-1.0.6.pom, line 164, column 29
[WARNING] 
[WARNING] Some problems were encountered while building the effective model for org.glassfish.tyrus.tests.servlet:tyrus-tests-servlet-oneappconfig:war:2.0.0-M3
[WARNING] 'build.plugins.plugin.version' for org.apache.maven.plugins:maven-enforcer-plugin is missing. @ org.eclipse.ee4j:project:1.0.6, /home/jenkins/.m2/repository/org/eclipse/ee4j/project/1.0.6/project-1.0.6.pom, line 164, column 29
[WARNING] 
[WARNING] Some problems were encountered while building the effective model for org.glassfish.tyrus.tests.servlet:tyrus-tests-servlet-remote:war:2.0.0-M3
[WARNING] 'build.plugins.plugin.version' for org.apache.maven.plugins:maven-enforcer-plugin is missing. @ org.eclipse.ee4j:project:1.0.6, /home/jenkins/.m2/repository/org/eclipse/ee4j/project/1.0.6/project-1.0.6.pom, line 164, column 29
[WARNING] 
[WARNING] Some problems were encountered while building the effective model for org.glassfish.tyrus.tests.servlet:tyrus-tests-servlet-session:war:2.0.0-M3
[WARNING] 'build.plugins.plugin.version' for org.apache.maven.plugins:maven-enforcer-plugin is missing. @ org.eclipse.ee4j:project:1.0.6, /home/jenkins/.m2/repository/org/eclipse/ee4j/project/1.0.6/project-1.0.6.pom, line 164, column 29
[WARNING] 
[WARNING] Some problems were encountered while building the effective model for org.glassfish.tyrus.tests.servlet.twoappconfig:tyrus-tests-servlet-twoappconfig:war:2.0.0-M3
[WARNING] 'build.plugins.plugin.version' for org.apache.maven.plugins:maven-enforcer-plugin is missing. @ org.eclipse.ee4j:project:1.0.6, /home/jenkins/.m2/repository/org/eclipse/ee4j/project/1.0.6/project-1.0.6.pom, line 164, column 29
[WARNING] 
[WARNING] Some problems were encountered while building the effective model for org.glassfish.tyrus.tests.servlet:tyrus-tests-servlet-mbean-test:war:2.0.0-M3
[WARNING] 'build.plugins.plugin.version' for org.apache.maven.plugins:maven-enforcer-plugin is missing. @ org.eclipse.ee4j:project:1.0.6, /home/jenkins/.m2/repository/org/eclipse/ee4j/project/1.0.6/project-1.0.6.pom, line 164, column 29
[WARNING] 
[WARNING] Some problems were encountered while building the effective model for org.glassfish.tyrus.tests.servlet:tyrus-tests-servlet-inject:war:2.0.0-M3
[WARNING] 'build.plugins.plugin.version' for org.apache.maven.plugins:maven-enforcer-plugin is missing. @ org.eclipse.ee4j:project:1.0.6, /home/jenkins/.m2/repository/org/eclipse/ee4j/project/1.0.6/project-1.0.6.pom, line 164, column 29
[WARNING] 
[WARNING] Some problems were encountered while building the effective model for org.glassfish.tyrus.tests.servlet:tyrus-tests-servlet-maxsessions-per-app:war:2.0.0-M3
[WARNING] 'build.plugins.plugin.version' for org.apache.maven.plugins:maven-enforcer-plugin is missing. @ org.eclipse.ee4j:project:1.0.6, /home/jenkins/.m2/repository/org/eclipse/ee4j/project/1.0.6/project-1.0.6.pom, line 164, column 29
[WARNING] 
[WARNING] Some problems were encountered while building the effective model for org.glassfish.tyrus.tests.servlet:tyrus-tests-servlet-maxsessions-per-remoteaddr:war:2.0.0-M3
[WARNING] 'build.plugins.plugin.version' for org.apache.maven.plugins:maven-enforcer-plugin is missing. @ org.eclipse.ee4j:project:1.0.6, /home/jenkins/.m2/repository/org/eclipse/ee4j/project/1.0.6/project-1.0.6.pom, line 164, column 29
[WARNING] 
[WARNING] Some problems were encountered while building the effective model for org.glassfish.tyrus.tests.servlet:tyrus-tests-servlet-debug:war:2.0.0-M3
[WARNING] 'build.plugins.plugin.version' for org.apache.maven.plugins:maven-enforcer-plugin is missing. @ org.eclipse.ee4j:project:1.0.6, /home/jenkins/.m2/repository/org/eclipse/ee4j/project/1.0.6/project-1.0.6.pom, line 164, column 29
[WARNING] 
[WARNING] Some problems were encountered while building the effective model for org.glassfish.tyrus.tests.servlet:tyrus-tests-servlet-project:pom:2.0.0-M3
[WARNING] 'build.plugins.plugin.version' for org.apache.maven.plugins:maven-enforcer-plugin is missing. @ org.eclipse.ee4j:project:1.0.6, /home/jenkins/.m2/repository/org/eclipse/ee4j/project/1.0.6/project-1.0.6.pom, line 164, column 29
[WARNING] 
[WARNING] Some problems were encountered while building the effective model for org.glassfish.tyrus.tests:tyrus-test-tools:bundle:2.0.0-M3
[WARNING] 'build.plugins.plugin.version' for org.apache.maven.plugins:maven-enforcer-plugin is missing. @ org.eclipse.ee4j:project:1.0.6, /home/jenkins/.m2/repository/org/eclipse/ee4j/project/1.0.6/project-1.0.6.pom, line 164, column 29
[WARNING] 
[WARNING] Some problems were encountered while building the effective model for org.glassfish.tyrus.tests:tyrus-tests-project:pom:2.0.0-M3
[WARNING] 'build.plugins.plugin.version' for org.apache.maven.plugins:maven-enforcer-plugin is missing. @ org.eclipse.ee4j:project:1.0.6, /home/jenkins/.m2/repository/org/eclipse/ee4j/project/1.0.6/project-1.0.6.pom, line 164, column 29
[WARNING] 
[WARNING] Some problems were encountered while building the effective model for org.glassfish.tyrus.bundles:tyrus-samples:pom:2.0.0-M3
[WARNING] 'build.plugins.plugin.version' for org.apache.maven.plugins:maven-enforcer-plugin is missing. @ org.eclipse.ee4j:project:1.0.6, /home/jenkins/.m2/repository/org/eclipse/ee4j/project/1.0.6/project-1.0.6.pom, line 164, column 29
[WARNING] 
[WARNING] Some problems were encountered while building the effective model for org.glassfish.tyrus.bundles:tyrus-standalone-client:jar:2.0.0-M3
[WARNING] 'build.plugins.plugin.version' for org.apache.maven.plugins:maven-enforcer-plugin is missing. @ org.eclipse.ee4j:project:1.0.6, /home/jenkins/.m2/repository/org/eclipse/ee4j/project/1.0.6/project-1.0.6.pom, line 164, column 29
[WARNING] 
[WARNING] Some problems were encountered while building the effective model for org.glassfish.tyrus.bundles:tyrus-standalone-client-jdk:jar:2.0.0-M3
[WARNING] 'build.plugins.plugin.version' for org.apache.maven.plugins:maven-enforcer-plugin is missing. @ org.eclipse.ee4j:project:1.0.6, /home/jenkins/.m2/repository/org/eclipse/ee4j/project/1.0.6/project-1.0.6.pom, line 164, column 29
[WARNING] 
[WARNING] Some problems were encountered while building the effective model for org.glassfish.tyrus.bundles:websocket-ri-archive:pom:2.0.0-M3
[WARNING] 'build.plugins.plugin.version' for org.apache.maven.plugins:maven-enforcer-plugin is missing. @ org.eclipse.ee4j:project:1.0.6, /home/jenkins/.m2/repository/org/eclipse/ee4j/project/1.0.6/project-1.0.6.pom, line 164, column 29
[WARNING] 
[WARNING] Some problems were encountered while building the effective model for org.glassfish.tyrus.bundles:websocket-ri-bundle:bundle:2.0.0-M3
[WARNING] 'build.plugins.plugin.version' for org.apache.maven.plugins:maven-enforcer-plugin is missing. @ org.eclipse.ee4j:project:1.0.6, /home/jenkins/.m2/repository/org/eclipse/ee4j/project/1.0.6/project-1.0.6.pom, line 164, column 29
[WARNING] 
[WARNING] Some problems were encountered while building the effective model for org.glassfish.tyrus.bundles:tyrus-bundles:pom:2.0.0-M3
[WARNING] 'build.plugins.plugin.version' for org.apache.maven.plugins:maven-enforcer-plugin is missing. @ org.eclipse.ee4j:project:1.0.6, /home/jenkins/.m2/repository/org/eclipse/ee4j/project/1.0.6/project-1.0.6.pom, line 164, column 29
[WARNING] 
[WARNING] Some problems were encountered while building the effective model for org.glassfish.tyrus:tyrus-project:pom:2.0.0-M3
[WARNING] 'build.plugins.plugin.version' for org.apache.maven.plugins:maven-enforcer-plugin is missing. @ org.eclipse.ee4j:project:1.0.6, /home/jenkins/.m2/repository/org/eclipse/ee4j/project/1.0.6/project-1.0.6.pom, line 164, column 29
[WARNING] 
[WARNING] It is highly recommended to fix these problems because they threaten the stability of your build.
[WARNING] 
[WARNING] For this reason, future Maven versions might no longer support building such malformed projects.
[WARNING] 
[INFO] Inspecting build with total of 65 modules...
[INFO] Installing Nexus Staging features:
[INFO]   ... total of 64 executions of maven-deploy-plugin replaced with nexus-staging-maven-plugin
[INFO] ------------------------------------------------------------------------
[INFO] Reactor Build Order:
[INFO] 
[INFO] tyrus                                                              [pom]
[INFO] tyrus-archetypes                                                   [pom]
[INFO] Tyrus Echo Archetype                                               [jar]
[INFO] Tyrus BOM                                                          [pom]
[INFO] Tyrus Container SPI                                             [bundle]
[INFO] Tyrus Core                                                      [bundle]
[INFO] Tyrus Client                                                    [bundle]
[INFO] Tyrus Container Modules                                            [pom]
[INFO] Tyrus Containers For Glassfish                                     [pom]
[INFO] Tyrus CDI Component Provider                                    [bundle]
[INFO] Tyrus EJB Component Provider                                    [bundle]
[INFO] Tyrus Grizzly Client Container                                  [bundle]
[INFO] Tyrus Server                                                    [bundle]
[INFO] Tyrus Grizzly Server Container                                  [bundle]
[INFO] Tyrus InMemory Container                                        [bundle]
[INFO] Tyrus Servlet Bundle                                            [bundle]
[INFO] Tyrus Tests                                                        [pom]
[INFO] Tyrus Test Tools                                                [bundle]
[INFO] Tyrus JDK Client Container                                      [bundle]
[INFO] Tyrus Documentation                                                [pom]
[INFO] Tyrus Extension Modules                                            [pom]
[INFO] Tyrus CLI Client                                                [bundle]
[INFO] Tyrus Monitoring JMX                                               [jar]
[INFO] Tyrus Extension - Per Message Deflate                           [bundle]
[INFO] Tyrus Java8 Client Extension                                    [bundle]
[INFO] Tyrus Samples                                                      [pom]
[INFO] Tyrus Auction Sample                                               [war]
[INFO] Tyrus CDI Sample                                                   [war]
[INFO] Tyrus Chat Sample                                                  [war]
[INFO] Tyrus Draw Sample                                                  [war]
[INFO] Tyrus Echo Sample                                                  [war]
[INFO] Tyrus Basic Auth Sample                                            [war]
[INFO] Tyrus Secure Echo Sample                                           [war]
[INFO] Tyrus Programmatic Echo Sample                                     [war]
[INFO] Tyrus Simple Life Sample                                           [war]
[INFO] Tyrus Shared Collection Sample                                     [war]
[INFO] Tyrus End-to-End Tests                                             [pom]
[INFO] Tyrus End-to-End Application Config Tests                          [war]
[INFO] Tyrus End-to-End Non-deployable Tests                              [war]
[INFO] Tyrus End-to-End Standard Config Tests                             [war]
[INFO] Tyrus End-to-End Java 8 Tests                                      [war]
[INFO] Tyrus End-to-End Tests running on Jetty                            [pom]
[INFO] Tyrus End-to-End Basic Auth Tests                                  [jar]
[INFO] Tyrus End-to-End Digest Auth Tests                                 [jar]
[INFO] Tyrus Server Integration Tests                                     [pom]
[INFO] Tyrus Servlet Async Tests                                          [war]
[INFO] Tyrus Autobahn Echo Server                                         [war]
[INFO] Tyrus Servlet Basic Tests                                          [war]
[INFO] Tyrus Servlet Dynamic Deploy Test                                  [war]
[INFO] Tyrus Servlet No App Config                                        [war]
[INFO] Tyrus Servlet One App Config                                       [war]
[INFO] Tyrus Servlet RemoteEndpoint Timeout                               [war]
[INFO] Tyrus Servlet Session Closing                                      [war]
[INFO] Tyrus Servlet Two App Config                                       [war]
[INFO] Tyrus Servlet Monitoring Test                                      [war]
[INFO] Tyrus Servlet Inject Test                                          [war]
[INFO] Tyrus Servlet Max Sessions Per App Tests                           [war]
[INFO] Tyrus Servlet Max Sessions Per Remote Addr Tests                   [war]
[INFO] Tyrus Debug Debug Samples                                          [war]
[INFO] Tyrus Bundles                                                      [pom]
[INFO] Tyrus Samples Bundle                                               [pom]
[INFO] Tyrus Standalone Client                                            [jar]
[INFO] Tyrus Standalone Client - JDK                                      [jar]
[INFO] Tyrus Websocket RI Archive                                         [pom]
[INFO] Tyrus Websocket RI Bundle                                       [bundle]
[INFO] 
[INFO] -----------------< org.glassfish.tyrus:tyrus-project >------------------
[INFO] Building tyrus 2.0.0-M3                                           [1/65]
[INFO] --------------------------------[ pom ]---------------------------------
[INFO] 
[INFO] --- maven-clean-plugin:2.5:clean (default-clean) @ tyrus-project ---
[INFO] 
[INFO] --- maven-enforcer-plugin:3.0.0-M3:enforce (enforce-maven) @ tyrus-project ---
[INFO] 
[INFO] --- maven-checkstyle-plugin:3.0.0:check (default) @ tyrus-project ---
[INFO] Starting audit...
Audit done.
[INFO] 
[INFO] --- maven-javadoc-plugin:3.0.1:jar (attach-javadocs) @ tyrus-project ---
[INFO] Not executing Javadoc as the project is not a Java classpath-capable package
[INFO] 
[INFO] --- maven-source-plugin:2.2.1:jar-no-fork (attach-sources) @ tyrus-project ---
[INFO] 
[INFO] --- maven-gpg-plugin:1.6:sign (sign-artifacts) @ tyrus-project ---
[INFO] 
[INFO] --- maven-install-plugin:2.4:install (default-install) @ tyrus-project ---
[INFO] Installing /home/jenkins/agent/workspace/tyrus-master-release/pom.xml to /home/jenkins/.m2/repository/org/glassfish/tyrus/tyrus-project/2.0.0-M3/tyrus-project-2.0.0-M3.pom
[INFO] Installing /home/jenkins/agent/workspace/tyrus-master-release/target/tyrus-project-2.0.0-M3.pom.asc to /home/jenkins/.m2/repository/org/glassfish/tyrus/tyrus-project/2.0.0-M3/tyrus-project-2.0.0-M3.pom.asc
[INFO] 
[INFO] --- maven-javadoc-plugin:3.0.1:jar (default-cli) @ tyrus-project ---
[INFO] Not executing Javadoc as the project is not a Java classpath-capable package
[INFO] 
[INFO] --- maven-gpg-plugin:1.6:sign (default-cli) @ tyrus-project ---
[INFO] 
[INFO] --- maven-deploy-plugin:2.8.1:deploy (default-cli) @ tyrus-project ---
[INFO] 
[INFO] ------< org.glassfish.tyrus.archetypes:tyrus-archetypes-project >-------
[INFO] Building tyrus-archetypes 2.0.0-M3                                [2/65]
[INFO] --------------------------------[ pom ]---------------------------------
[INFO] 
[INFO] --- maven-clean-plugin:2.5:clean (default-clean) @ tyrus-archetypes-project ---
[INFO] 
[INFO] --- maven-enforcer-plugin:3.0.0-M3:enforce (enforce-maven) @ tyrus-archetypes-project ---
[INFO] 
[INFO] --- maven-checkstyle-plugin:3.0.0:check (default) @ tyrus-archetypes-project ---
[INFO] Starting audit...
Audit done.
[INFO] 
[INFO] --- maven-javadoc-plugin:3.0.1:jar (attach-javadocs) @ tyrus-archetypes-project ---
[INFO] Not executing Javadoc as the project is not a Java classpath-capable package
[INFO] 
[INFO] --- maven-source-plugin:2.2.1:jar-no-fork (attach-sources) @ tyrus-archetypes-project ---
[INFO] 
[INFO] --- maven-gpg-plugin:1.6:sign (sign-artifacts) @ tyrus-archetypes-project ---
[INFO] 
[INFO] --- maven-install-plugin:2.4:install (default-install) @ tyrus-archetypes-project ---
[INFO] Installing /home/jenkins/agent/workspace/tyrus-master-release/archetypes/pom.xml to /home/jenkins/.m2/repository/org/glassfish/tyrus/archetypes/tyrus-archetypes-project/2.0.0-M3/tyrus-archetypes-project-2.0.0-M3.pom
[INFO] Installing /home/jenkins/agent/workspace/tyrus-master-release/archetypes/target/tyrus-archetypes-project-2.0.0-M3.pom.asc to /home/jenkins/.m2/repository/org/glassfish/tyrus/archetypes/tyrus-archetypes-project/2.0.0-M3/tyrus-archetypes-project-2.0.0-M3.pom.asc
[INFO] 
[INFO] --- maven-javadoc-plugin:3.0.1:jar (default-cli) @ tyrus-archetypes-project ---
[INFO] Not executing Javadoc as the project is not a Java classpath-capable package
[INFO] 
[INFO] --- maven-gpg-plugin:1.6:sign (default-cli) @ tyrus-archetypes-project ---
[INFO] 
[INFO] --- maven-deploy-plugin:2.8.1:deploy (default-cli) @ tyrus-archetypes-project ---
[INFO] 
[INFO] --------< org.glassfish.tyrus.archetypes:tyrus-archetype-echo >---------
[INFO] Building Tyrus Echo Archetype 2.0.0-M3                            [3/65]
[INFO] --------------------------------[ jar ]---------------------------------
[INFO] 
[INFO] --- maven-clean-plugin:2.5:clean (default-clean) @ tyrus-archetype-echo ---
[INFO] 
[INFO] --- maven-enforcer-plugin:3.0.0-M3:enforce (enforce-maven) @ tyrus-archetype-echo ---
[INFO] 
[INFO] --- maven-checkstyle-plugin:3.0.0:check (default) @ tyrus-archetype-echo ---
[INFO] Starting audit...
Audit done.
[INFO] 
[INFO] --- maven-resources-plugin:2.6:resources (default-resources) @ tyrus-archetype-echo ---
[INFO] Using 'UTF-8' encoding to copy filtered resources.
[INFO] Copying 5 resources
[INFO] 
[INFO] --- maven-compiler-plugin:3.1:compile (default-compile) @ tyrus-archetype-echo ---
[INFO] No sources to compile
[INFO] 
[INFO] --- maven-resources-plugin:2.6:testResources (default-testResources) @ tyrus-archetype-echo ---
[INFO] Using 'UTF-8' encoding to copy filtered resources.
[INFO] skip non existing resourceDirectory /home/jenkins/agent/workspace/tyrus-master-release/archetypes/echo/src/test/resources
[INFO] 
[INFO] --- maven-compiler-plugin:3.1:testCompile (default-testCompile) @ tyrus-archetype-echo ---
[INFO] No sources to compile
[INFO] 
[INFO] --- maven-surefire-plugin:2.17:test (default-test) @ tyrus-archetype-echo ---
[INFO] Tests are skipped.
[INFO] 
[INFO] --- maven-jar-plugin:2.4:jar (default-jar) @ tyrus-archetype-echo ---
[INFO] Building jar: /home/jenkins/agent/workspace/tyrus-master-release/archetypes/echo/target/tyrus-archetype-echo-2.0.0-M3.jar
[INFO] 
[INFO] --- maven-javadoc-plugin:3.0.1:jar (attach-javadocs) @ tyrus-archetype-echo ---
[INFO] 
[INFO] --- maven-source-plugin:2.2.1:jar-no-fork (attach-sources) @ tyrus-archetype-echo ---
[INFO] Building jar: /home/jenkins/agent/workspace/tyrus-master-release/archetypes/echo/target/tyrus-archetype-echo-2.0.0-M3-sources.jar
[INFO] 
[INFO] --- maven-gpg-plugin:1.6:sign (sign-artifacts) @ tyrus-archetype-echo ---
[INFO] 
[INFO] --- maven-install-plugin:2.4:install (default-install) @ tyrus-archetype-echo ---
[INFO] Installing /home/jenkins/agent/workspace/tyrus-master-release/archetypes/echo/target/tyrus-archetype-echo-2.0.0-M3.jar to /home/jenkins/.m2/repository/org/glassfish/tyrus/archetypes/tyrus-archetype-echo/2.0.0-M3/tyrus-archetype-echo-2.0.0-M3.jar
[INFO] Installing /home/jenkins/agent/workspace/tyrus-master-release/archetypes/echo/pom.xml to /home/jenkins/.m2/repository/org/glassfish/tyrus/archetypes/tyrus-archetype-echo/2.0.0-M3/tyrus-archetype-echo-2.0.0-M3.pom
[INFO] Installing /home/jenkins/agent/workspace/tyrus-master-release/archetypes/echo/target/tyrus-archetype-echo-2.0.0-M3-sources.jar to /home/jenkins/.m2/repository/org/glassfish/tyrus/archetypes/tyrus-archetype-echo/2.0.0-M3/tyrus-archetype-echo-2.0.0-M3-sources.jar
[INFO] Installing /home/jenkins/agent/workspace/tyrus-master-release/archetypes/echo/target/tyrus-archetype-echo-2.0.0-M3.jar.asc to /home/jenkins/.m2/repository/org/glassfish/tyrus/archetypes/tyrus-archetype-echo/2.0.0-M3/tyrus-archetype-echo-2.0.0-M3.jar.asc
[INFO] Installing /home/jenkins/agent/workspace/tyrus-master-release/archetypes/echo/target/tyrus-archetype-echo-2.0.0-M3.pom.asc to /home/jenkins/.m2/repository/org/glassfish/tyrus/archetypes/tyrus-archetype-echo/2.0.0-M3/tyrus-archetype-echo-2.0.0-M3.pom.asc
[INFO] Installing /home/jenkins/agent/workspace/tyrus-master-release/archetypes/echo/target/tyrus-archetype-echo-2.0.0-M3-sources.jar.asc to /home/jenkins/.m2/repository/org/glassfish/tyrus/archetypes/tyrus-archetype-echo/2.0.0-M3/tyrus-archetype-echo-2.0.0-M3-sources.jar.asc
[INFO] 
[INFO] --- maven-archetype-plugin:2.2:update-local-catalog (update-local-catalog) @ tyrus-archetype-echo ---
[INFO] 
[INFO] --- maven-javadoc-plugin:3.0.1:jar (default-cli) @ tyrus-archetype-echo ---
[INFO] 
[INFO] --- maven-gpg-plugin:1.6:sign (default-cli) @ tyrus-archetype-echo ---
[INFO] 
[INFO] --- maven-deploy-plugin:2.8.1:deploy (default-cli) @ tyrus-archetype-echo ---
[INFO] 
[INFO] -------------------< org.glassfish.tyrus:tyrus-bom >--------------------
[INFO] Building Tyrus BOM 2.0-SNAPSHOT                                   [4/65]
[INFO] --------------------------------[ pom ]---------------------------------
[INFO] 
[INFO] --- maven-clean-plugin:2.5:clean (default-clean) @ tyrus-bom ---
[INFO] 
[INFO] --- maven-enforcer-plugin:3.0.0-M3:enforce (enforce-maven) @ tyrus-bom ---
[INFO] 
[INFO] --- maven-source-plugin:3.2.1:jar-no-fork (attach-sources) @ tyrus-bom ---
[INFO] 
[INFO] --- maven-javadoc-plugin:3.2.0:jar (attach-javadocs) @ tyrus-bom ---
[INFO] Not executing Javadoc as the project is not a Java classpath-capable package
[INFO] 
[INFO] --- maven-gpg-plugin:1.6:sign (sign-artifacts) @ tyrus-bom ---
[INFO] 
[INFO] --- maven-install-plugin:2.4:install (default-install) @ tyrus-bom ---
[INFO] Installing /home/jenkins/agent/workspace/tyrus-master-release/bom/pom.xml to /home/jenkins/.m2/repository/org/glassfish/tyrus/tyrus-bom/2.0-SNAPSHOT/tyrus-bom-2.0-SNAPSHOT.pom
[INFO] Installing /home/jenkins/agent/workspace/tyrus-master-release/bom/target/tyrus-bom-2.0-SNAPSHOT.pom.asc to /home/jenkins/.m2/repository/org/glassfish/tyrus/tyrus-bom/2.0-SNAPSHOT/tyrus-bom-2.0-SNAPSHOT.pom.asc
[INFO] 
[INFO] --- maven-javadoc-plugin:3.2.0:jar (default-cli) @ tyrus-bom ---
[INFO] Not executing Javadoc as the project is not a Java classpath-capable package
[INFO] 
[INFO] --- maven-gpg-plugin:1.6:sign (default-cli) @ tyrus-bom ---
[INFO] 
[INFO] --- maven-deploy-plugin:2.7:deploy (default-cli) @ tyrus-bom ---
[INFO] ------------------------------------------------------------------------
[INFO] Reactor Summary:
[INFO] 
[INFO] tyrus 2.0.0-M3 ..................................... SUCCESS [ 33.263 s]
[INFO] tyrus-archetypes 2.0.0-M3 .......................... SUCCESS [  1.240 s]
[INFO] Tyrus Echo Archetype 2.0.0-M3 ...................... SUCCESS [ 22.125 s]
[INFO] Tyrus BOM 2.0-SNAPSHOT ............................. FAILURE [  4.000 s]
[INFO] Tyrus Container SPI 2.0.0-M3 ....................... SKIPPED
[INFO] Tyrus Core 2.0.0-M3 ................................ SKIPPED
[INFO] Tyrus Client 2.0.0-M3 .............................. SKIPPED
[INFO] Tyrus Container Modules 2.0.0-M3 ................... SKIPPED
[INFO] Tyrus Containers For Glassfish 2.0.0-M3 ............ SKIPPED
[INFO] Tyrus CDI Component Provider 2.0.0-M3 .............. SKIPPED
[INFO] Tyrus EJB Component Provider 2.0.0-M3 .............. SKIPPED
[INFO] Tyrus Grizzly Client Container 2.0.0-M3 ............ SKIPPED
[INFO] Tyrus Server 2.0.0-M3 .............................. SKIPPED
[INFO] Tyrus Grizzly Server Container 2.0.0-M3 ............ SKIPPED
[INFO] Tyrus InMemory Container 2.0.0-M3 .................. SKIPPED
[INFO] Tyrus Servlet Bundle 2.0.0-M3 ...................... SKIPPED
[INFO] Tyrus Tests 2.0.0-M3 ............................... SKIPPED
[INFO] Tyrus Test Tools 2.0.0-M3 .......................... SKIPPED
[INFO] Tyrus JDK Client Container 2.0.0-M3 ................ SKIPPED
[INFO] Tyrus Documentation 2.0.0-M3 ....................... SKIPPED
[INFO] Tyrus Extension Modules 2.0.0-M3 ................... SKIPPED
[INFO] Tyrus CLI Client 2.0.0-M3 .......................... SKIPPED
[INFO] Tyrus Monitoring JMX 2.0.0-M3 ...................... SKIPPED
[INFO] Tyrus Extension - Per Message Deflate 2.0.0-M3 ..... SKIPPED
[INFO] Tyrus Java8 Client Extension 2.0.0-M3 .............. SKIPPED
[INFO] Tyrus Samples 2.0.0-M3 ............................. SKIPPED
[INFO] Tyrus Auction Sample 2.0.0-M3 ...................... SKIPPED
[INFO] Tyrus CDI Sample 2.0.0-M3 .......................... SKIPPED
[INFO] Tyrus Chat Sample 2.0.0-M3 ......................... SKIPPED
[INFO] Tyrus Draw Sample 2.0.0-M3 ......................... SKIPPED
[INFO] Tyrus Echo Sample 2.0.0-M3 ......................... SKIPPED
[INFO] Tyrus Basic Auth Sample 2.0.0-M3 ................... SKIPPED
[INFO] Tyrus Secure Echo Sample 2.0.0-M3 .................. SKIPPED
[INFO] Tyrus Programmatic Echo Sample 2.0.0-M3 ............ SKIPPED
[INFO] Tyrus Simple Life Sample 2.0.0-M3 .................. SKIPPED
[INFO] Tyrus Shared Collection Sample 2.0.0-M3 ............ SKIPPED
[INFO] Tyrus End-to-End Tests 2.0.0-M3 .................... SKIPPED
[INFO] Tyrus End-to-End Application Config Tests 2.0.0-M3 . SKIPPED
[INFO] Tyrus End-to-End Non-deployable Tests 2.0.0-M3 ..... SKIPPED
[INFO] Tyrus End-to-End Standard Config Tests 2.0.0-M3 .... SKIPPED
[INFO] Tyrus End-to-End Java 8 Tests 2.0.0-M3 ............. SKIPPED
[INFO] Tyrus End-to-End Tests running on Jetty 2.0.0-M3 ... SKIPPED
[INFO] Tyrus End-to-End Basic Auth Tests 2.0.0-M3 ......... SKIPPED
[INFO] Tyrus End-to-End Digest Auth Tests 2.0.0-M3 ........ SKIPPED
[INFO] Tyrus Server Integration Tests 2.0.0-M3 ............ SKIPPED
[INFO] Tyrus Servlet Async Tests 2.0.0-M3 ................. SKIPPED
[INFO] Tyrus Autobahn Echo Server 2.0.0-M3 ................ SKIPPED
[INFO] Tyrus Servlet Basic Tests 2.0.0-M3 ................. SKIPPED
[INFO] Tyrus Servlet Dynamic Deploy Test 2.0.0-M3 ......... SKIPPED
[INFO] Tyrus Servlet No App Config 2.0.0-M3 ............... SKIPPED
[INFO] Tyrus Servlet One App Config 2.0.0-M3 .............. SKIPPED
[INFO] Tyrus Servlet RemoteEndpoint Timeout 2.0.0-M3 ...... SKIPPED
[INFO] Tyrus Servlet Session Closing 2.0.0-M3 ............. SKIPPED
[INFO] Tyrus Servlet Two App Config 2.0.0-M3 .............. SKIPPED
[INFO] Tyrus Servlet Monitoring Test 2.0.0-M3 ............. SKIPPED
[INFO] Tyrus Servlet Inject Test 2.0.0-M3 ................. SKIPPED
[INFO] Tyrus Servlet Max Sessions Per App Tests 2.0.0-M3 .. SKIPPED
[INFO] Tyrus Servlet Max Sessions Per Remote Addr Tests 2.0.0-M3 SKIPPED
[INFO] Tyrus Debug Debug Samples 2.0.0-M3 ................. SKIPPED
[INFO] Tyrus Bundles 2.0.0-M3 ............................. SKIPPED
[INFO] Tyrus Samples Bundle 2.0.0-M3 ...................... SKIPPED
[INFO] Tyrus Standalone Client 2.0.0-M3 ................... SKIPPED
[INFO] Tyrus Standalone Client - JDK 2.0.0-M3 ............. SKIPPED
[INFO] Tyrus Websocket RI Archive 2.0.0-M3 ................ SKIPPED
[INFO] Tyrus Websocket RI Bundle 2.0.0-M3 ................. SKIPPED
[INFO] ------------------------------------------------------------------------
[INFO] BUILD FAILURE
[INFO] ------------------------------------------------------------------------
[INFO] Total time:  01:22 min
[INFO] Finished at: 2020-07-09T07:21:44Z
[INFO] ------------------------------------------------------------------------
[ERROR] Failed to execute goal org.apache.maven.plugins:maven-deploy-plugin:2.7:deploy (default-cli) on project tyrus-bom: Failed to deploy artifacts: Could not transfer artifact org.glassfish.tyrus:tyrus-bom:pom:2.0-20200709.072143-35 from/to ossrh (https://oss.sonatype.org/content/repositories/snapshots/): Transfer failed for https://oss.sonatype.org/content/repositories/snapshots/org/glassfish/tyrus/tyrus-bom/2.0-SNAPSHOT/tyrus-bom-2.0-20200709.072143-35.pom 401 Unauthorized -> [Help 1]
[ERROR] 
[ERROR] To see the full stack trace of the errors, re-run Maven with the -e switch.
[ERROR] Re-run Maven using the -X switch to enable full debug logging.
[ERROR] 
[ERROR] For more information about the errors and possible solutions, please read the following articles:
[ERROR] [Help 1] http://cwiki.apache.org/confluence/display/MAVEN/MojoExecutionException
[ERROR] 
[ERROR] After correcting the problems, you can resume the build with the command
[ERROR]   mvn <args> -rf :tyrus-bom
Build step 'Execute shell' marked build as failure
$ ssh-agent -k
unset SSH_AUTH_SOCK;
unset SSH_AGENT_PID;
echo Agent pid 58 killed;
[ssh-agent] Stopped.
Finished: FAILURE