FailedConsole Output

Retriggered by user tobias.oberlies@sap.com for Gerrit: https://git.eclipse.org/r/22783
Checkout:workspace / /home/hudson/genie.technology.tycho/.hudson/jobs/tycho.targeteditor-gerrit/workspace - hudson.remoting.LocalChannel@30f35eeb
Using strategy: Gerrit Trigger
Last Built Revision: Revision 92fc99e5beb0b8c14dc3c981b25d56dab69b6cb9 (master)
Checkout:workspace / /home/hudson/genie.technology.tycho/.hudson/jobs/tycho.targeteditor-gerrit/workspace - hudson.remoting.LocalChannel@30f35eeb
Fetching changes from the remote Git repository
Fetching upstream changes from https://git.eclipse.org/r/tycho/org.eclipse.tycho.targeteditor
Commencing build of Revision 92fc99e5beb0b8c14dc3c981b25d56dab69b6cb9 (master)
Checking out Revision 92fc99e5beb0b8c14dc3c981b25d56dab69b6cb9 (master)
[INFO] Using bundled Maven 3 installation
[INFO] Checking Maven 3 installation environment
[workspace] $ /home/hudson/genie.technology.tycho/.hudson/maven/slavebundle/bundled-maven/bin/mvn --help
[INFO] Checking Maven 3 installation version
[INFO] Detected Maven 3 installation version: 3.0.3
[workspace] $ /home/hudson/genie.technology.tycho/.hudson/maven/slavebundle/bundled-maven/bin/mvn clean verify -V -B "-DGERRIT_EVENT_ACCOUNT_NAME=Tobias Oberlies" '-DGERRIT_PATCHSET_UPLOADER=\"Tobias Oberlies\" <tobias.oberlies@sap.com>' -DGERRIT_CHANGE_URL=https://git.eclipse.org/r/22783 -DGERRIT_CHANGE_ID=Ic9f97ee6ef65ae84b0d8f2fba5c96c9a285816fb -DGERRIT_CHANGE_NUMBER=22783 "-DGERRIT_PATCHSET_UPLOADER_NAME=Tobias Oberlies" "-DGERRIT_CHANGE_SUBJECT=401719 Removed example copyright from test data" -DGERRIT_PATCHSET_UPLOADER_EMAIL=tobias.oberlies@sap.com -DGERRIT_EVENT_HASH=1094458252 -DGERRIT_BRANCH=master -DGERRIT_REFSPEC=refs/changes/83/22783/1 -DGERRIT_PATCHSET_NUMBER=1 "-DGERRIT_CHANGE_OWNER_NAME=Tobias Oberlies" '-DGERRIT_EVENT_ACCOUNT=\"Tobias Oberlies\" <tobias.oberlies@sap.com>' -DGERRIT_EVENT_ACCOUNT_EMAIL=tobias.oberlies@sap.com -DGERRIT_PATCHSET_REVISION=92fc99e5beb0b8c14dc3c981b25d56dab69b6cb9 -DGERRIT_PROJECT=tycho/org.eclipse.tycho.targeteditor '-DGERRIT_CHANGE_OWNER=\"Tobias Oberlies\" <tobias.oberlies@sap.com>' -DGERRIT_CHANGE_OWNER_EMAIL=tobias.oberlies@sap.com -Dmaven.ext.class.path=/home/hudson/genie.technology.tycho/.hudson/maven/slavebundle/resources:/home/hudson/genie.technology.tycho/.hudson/maven/slavebundle/lib/maven3-eventspy-3.0.jar:/home/hudson/genie.technology.tycho/.hudson/war/webapp/WEB-INF/lib/hudson-remoting-3.0.0.jar -Dhudson.eventspy.port=57811 -Dmaven.repo.local=/home/hudson/genie.technology.tycho/.hudson/jobs/tycho.targeteditor-gerrit/workspace/.maven/repo -f pom.xml
[DEBUG] Waiting for connection on port: 57811
Apache Maven 3.0.3 (r1075438; 2011-02-28 12:31:09-0500)
Maven home: /home/hudson/genie.technology.tycho/.hudson/maven/slavebundle/bundled-maven
Java version: 1.6.0_45, vendor: Sun Microsystems Inc.
Java home: /opt/public/common/jdk1.6.0_45/jre
Default locale: en_US, platform encoding: UTF-8
OS name: "linux", version: "3.0.76-0.11-default", arch: "amd64", family: "unix"
[DEBUG] Connected to remote
[INFO] Scanning for projects...
[WARNING] No explicit target runtime environment configuration. Build is platform dependent.
[WARNING] No explicit target runtime environment configuration. Build is platform dependent.
[WARNING] No explicit target runtime environment configuration. Build is platform dependent.
[WARNING] No explicit target runtime environment configuration. Build is platform dependent.
[WARNING] No explicit target runtime environment configuration. Build is platform dependent.
[INFO] Computing target platform for MavenProject: org.eclipse.tycho:org.eclipse.tycho.targeteditor:0.11.0-SNAPSHOT @ /jobs/genie.technology.tycho/tycho.targeteditor-gerrit/workspace/org.eclipse.tycho.targeteditor/pom.xml
[INFO] o.h.m.e.h.MavenExecutionResultHandler - Build failed with exception(s)
[INFO] o.h.m.e.h.MavenExecutionResultHandler - [1] org.apache.maven.InternalErrorException: Internal error: java.lang.RuntimeException: Failed to resolve target definition /jobs/genie.technology.tycho/tycho.targeteditor-gerrit/workspace/org.eclipse.tycho.targeteditor.target-definition/org.eclipse.tycho.targeteditor.target-definition.target
[DEBUG] Closing connection to remote
[ERROR] Internal error: java.lang.RuntimeException: Failed to resolve target definition /jobs/genie.technology.tycho/tycho.targeteditor-gerrit/workspace/org.eclipse.tycho.targeteditor.target-definition/org.eclipse.tycho.targeteditor.target-definition.target: Could not find "org.eclipse.swtbot.eclipse.feature.group/2.2.0.201401081015" in the repositories of the current location -> [Help 1]
org.apache.maven.InternalErrorException: Internal error: java.lang.RuntimeException: Failed to resolve target definition /jobs/genie.technology.tycho/tycho.targeteditor-gerrit/workspace/org.eclipse.tycho.targeteditor.target-definition/org.eclipse.tycho.targeteditor.target-definition.target
	at org.apache.maven.DefaultMaven.execute(DefaultMaven.java:168)
	at org.apache.maven.cli.MavenCli.execute(MavenCli.java:537)
	at org.apache.maven.cli.MavenCli.doMain(MavenCli.java:196)
	at org.apache.maven.cli.MavenCli.main(MavenCli.java:141)
	at sun.reflect.NativeMethodAccessorImpl.invoke0(Native Method)
	at sun.reflect.NativeMethodAccessorImpl.invoke(NativeMethodAccessorImpl.java:39)
	at sun.reflect.DelegatingMethodAccessorImpl.invoke(DelegatingMethodAccessorImpl.java:25)
	at java.lang.reflect.Method.invoke(Method.java:597)
	at org.codehaus.plexus.classworlds.launcher.Launcher.launchEnhanced(Launcher.java:290)
	at org.codehaus.plexus.classworlds.launcher.Launcher.launch(Launcher.java:230)
	at org.codehaus.plexus.classworlds.launcher.Launcher.mainWithExitCode(Launcher.java:409)
	at org.codehaus.plexus.classworlds.launcher.Launcher.main(Launcher.java:352)
Caused by: java.lang.RuntimeException: Failed to resolve target definition /jobs/genie.technology.tycho/tycho.targeteditor-gerrit/workspace/org.eclipse.tycho.targeteditor.target-definition/org.eclipse.tycho.targeteditor.target-definition.target
	at org.eclipse.tycho.p2.target.TargetDefinitionResolver.resolveContent(TargetDefinitionResolver.java:84)
	at org.eclipse.tycho.p2.target.TargetDefinitionResolverService.resolveFromArguments(TargetDefinitionResolverService.java:65)
	at org.eclipse.tycho.p2.target.TargetDefinitionResolverService.getTargetDefinitionContent(TargetDefinitionResolverService.java:55)
	at org.eclipse.tycho.p2.target.TargetPlatformFactoryImpl.resolveTargetDefinitions(TargetPlatformFactoryImpl.java:212)
	at org.eclipse.tycho.p2.target.TargetPlatformFactoryImpl.createTargetPlatform(TargetPlatformFactoryImpl.java:146)
	at org.eclipse.tycho.p2.target.TargetPlatformFactoryImpl.createTargetPlatform(TargetPlatformFactoryImpl.java:119)
	at org.eclipse.tycho.p2.target.TargetPlatformFactoryImpl.createTargetPlatform(TargetPlatformFactoryImpl.java:1)
	at org.eclipse.tycho.p2.resolver.P2TargetPlatformResolver.computeTargetPlatform(P2TargetPlatformResolver.java:215)
	at org.eclipse.tycho.core.resolver.DefaultTychoDependencyResolver.resolveProject(DefaultTychoDependencyResolver.java:100)
	at org.eclipse.tycho.core.maven.TychoMavenLifecycleParticipant.afterProjectsRead(TychoMavenLifecycleParticipant.java:75)
	at org.apache.maven.DefaultMaven.doExecute(DefaultMaven.java:273)
	at org.apache.maven.DefaultMaven.execute(DefaultMaven.java:156)
	... 11 more
Caused by: org.eclipse.tycho.p2.target.facade.TargetDefinitionResolutionException: Could not find "org.eclipse.swtbot.eclipse.feature.group/2.2.0.201401081015" in the repositories of the current location
	at org.eclipse.tycho.p2.target.TargetDefinitionResolver.getUnitInstance(TargetDefinitionResolver.java:213)
	at org.eclipse.tycho.p2.target.TargetDefinitionResolver.resolveContentWithExceptions(TargetDefinitionResolver.java:127)
	at org.eclipse.tycho.p2.target.TargetDefinitionResolver.resolveContent(TargetDefinitionResolver.java:79)
	... 22 more
[ERROR] 
[ERROR] To see the full stack trace of the errors, re-run Maven with the -e switch.
[ERROR] Re-run Maven using the -X switch to enable full debug logging.
[ERROR] 
[ERROR] For more information about the errors and possible solutions, please read the following articles:
[ERROR] [Help 1] http://cwiki.apache.org/confluence/display/MAVEN/InternalErrorException
[DEBUG] Waiting for process to finish
[DEBUG] Result: 1
Recording test results
Finished: FAILURE