FailedConsole Output

Triggered by Gerrit: https://git.eclipse.org/r/22783
Checkout:workspace / /home/hudson/genie.technology.tycho/.hudson/jobs/tycho.targeteditor-gerrit/workspace - hudson.remoting.LocalChannel@30f35eeb
Using strategy: Gerrit Trigger
Last Built Revision: Revision d79a9ae10e757ecf20f59b0b98b52ec9f604cdc4 (master)
Checkout:workspace / /home/hudson/genie.technology.tycho/.hudson/jobs/tycho.targeteditor-gerrit/workspace - hudson.remoting.LocalChannel@30f35eeb
Cloning the remote Git repository
Cloning repository origin
Fetching upstream changes from https://git.eclipse.org/r/tycho/org.eclipse.tycho.targeteditor
Commencing build of Revision 92fc99e5beb0b8c14dc3c981b25d56dab69b6cb9 (master)
Checking out Revision 92fc99e5beb0b8c14dc3c981b25d56dab69b6cb9 (master)
[INFO] Using bundled Maven 3 installation
[INFO] Checking Maven 3 installation environment
[workspace] $ /home/hudson/genie.technology.tycho/.hudson/maven/slavebundle/bundled-maven/bin/mvn --help
[INFO] Checking Maven 3 installation version
[INFO] Detected Maven 3 installation version: 3.0.3
[workspace] $ /home/hudson/genie.technology.tycho/.hudson/maven/slavebundle/bundled-maven/bin/mvn clean verify -V -B "-DGERRIT_EVENT_ACCOUNT_NAME=Tobias Oberlies" '-DGERRIT_PATCHSET_UPLOADER=\"Tobias Oberlies\" <tobias.oberlies@sap.com>' -DGERRIT_CHANGE_URL=https://git.eclipse.org/r/22783 -DGERRIT_CHANGE_ID=Ic9f97ee6ef65ae84b0d8f2fba5c96c9a285816fb -DGERRIT_CHANGE_NUMBER=22783 "-DGERRIT_PATCHSET_UPLOADER_NAME=Tobias Oberlies" "-DGERRIT_CHANGE_SUBJECT=401719 Removed example copyright from test data" -DGERRIT_PATCHSET_UPLOADER_EMAIL=tobias.oberlies@sap.com -DGERRIT_EVENT_HASH=1094458252 -DGERRIT_BRANCH=master -DGERRIT_REFSPEC=refs/changes/83/22783/1 -DGERRIT_PATCHSET_NUMBER=1 "-DGERRIT_CHANGE_OWNER_NAME=Tobias Oberlies" '-DGERRIT_EVENT_ACCOUNT=\"Tobias Oberlies\" <tobias.oberlies@sap.com>' -DGERRIT_EVENT_ACCOUNT_EMAIL=tobias.oberlies@sap.com -DGERRIT_PATCHSET_REVISION=92fc99e5beb0b8c14dc3c981b25d56dab69b6cb9 -DGERRIT_PROJECT=tycho/org.eclipse.tycho.targeteditor '-DGERRIT_CHANGE_OWNER=\"Tobias Oberlies\" <tobias.oberlies@sap.com>' -DGERRIT_CHANGE_OWNER_EMAIL=tobias.oberlies@sap.com -Dmaven.ext.class.path=/home/hudson/genie.technology.tycho/.hudson/maven/slavebundle/resources:/home/hudson/genie.technology.tycho/.hudson/maven/slavebundle/lib/maven3-eventspy-3.0.jar:/home/hudson/genie.technology.tycho/.hudson/war/webapp/WEB-INF/lib/hudson-remoting-3.0.0.jar -Dhudson.eventspy.port=54162 -Dmaven.repo.local=/home/hudson/genie.technology.tycho/.hudson/jobs/tycho.targeteditor-gerrit/workspace/.maven/repo -f pom.xml
[DEBUG] Waiting for connection on port: 54162
Apache Maven 3.0.3 (r1075438; 2011-02-28 12:31:09-0500)
Maven home: /home/hudson/genie.technology.tycho/.hudson/maven/slavebundle/bundled-maven
Java version: 1.6.0_45, vendor: Sun Microsystems Inc.
Java home: /opt/public/common/jdk1.6.0_45/jre
Default locale: en_US, platform encoding: UTF-8
OS name: "linux", version: "3.0.76-0.11-default", arch: "amd64", family: "unix"
[DEBUG] Connected to remote
[INFO] Scanning for projects...
Downloading: http://repo1.maven.org/maven2/org/eclipse/tycho/tycho-maven-plugin/0.19.0/tycho-maven-plugin-0.19.0.pom
Downloaded: http://repo1.maven.org/maven2/org/eclipse/tycho/tycho-maven-plugin/0.19.0/tycho-maven-plugin-0.19.0.pom (3 KB at 7.0 KB/sec)
Downloading: http://repo1.maven.org/maven2/org/eclipse/tycho/tycho/0.19.0/tycho-0.19.0.pom
Downloaded: http://repo1.maven.org/maven2/org/eclipse/tycho/tycho/0.19.0/tycho-0.19.0.pom (19 KB at 76.0 KB/sec)
Downloading: http://repo1.maven.org/maven2/org/eclipse/tycho/tycho-core/0.19.0/tycho-core-0.19.0.pom
Downloaded: http://repo1.maven.org/maven2/org/eclipse/tycho/tycho-core/0.19.0/tycho-core-0.19.0.pom (5 KB at 23.7 KB/sec)
Downloading: http://repo1.maven.org/maven2/org/apache/maven/maven-core/3.0/maven-core-3.0.pom
Downloaded: http://repo1.maven.org/maven2/org/apache/maven/maven-core/3.0/maven-core-3.0.pom (7 KB at 33.5 KB/sec)
Downloading: http://repo1.maven.org/maven2/org/apache/maven/maven/3.0/maven-3.0.pom
Downloaded: http://repo1.maven.org/maven2/org/apache/maven/maven/3.0/maven-3.0.pom (22 KB at 89.8 KB/sec)
Downloading: http://repo1.maven.org/maven2/org/apache/maven/maven-parent/15/maven-parent-15.pom
Downloaded: http://repo1.maven.org/maven2/org/apache/maven/maven-parent/15/maven-parent-15.pom (24 KB at 98.5 KB/sec)
Downloading: http://repo1.maven.org/maven2/org/apache/apache/6/apache-6.pom
Downloaded: http://repo1.maven.org/maven2/org/apache/apache/6/apache-6.pom (13 KB at 64.7 KB/sec)
Downloading: http://repo1.maven.org/maven2/org/apache/maven/maven-model/3.0/maven-model-3.0.pom
Downloaded: http://repo1.maven.org/maven2/org/apache/maven/maven-model/3.0/maven-model-3.0.pom (4 KB at 20.0 KB/sec)
Downloading: http://repo1.maven.org/maven2/org/codehaus/plexus/plexus-utils/3.0.7/plexus-utils-3.0.7.pom
Downloaded: http://repo1.maven.org/maven2/org/codehaus/plexus/plexus-utils/3.0.7/plexus-utils-3.0.7.pom (3 KB at 13.7 KB/sec)
Downloading: http://repo1.maven.org/maven2/org/codehaus/plexus/plexus/3.1/plexus-3.1.pom
Downloaded: http://repo1.maven.org/maven2/org/codehaus/plexus/plexus/3.1/plexus-3.1.pom (19 KB at 93.7 KB/sec)
Downloading: http://repo1.maven.org/maven2/org/sonatype/spice/spice-parent/17/spice-parent-17.pom
Downloaded: http://repo1.maven.org/maven2/org/sonatype/spice/spice-parent/17/spice-parent-17.pom (7 KB at 44.9 KB/sec)
Downloading: http://repo1.maven.org/maven2/org/sonatype/forge/forge-parent/10/forge-parent-10.pom
Downloaded: http://repo1.maven.org/maven2/org/sonatype/forge/forge-parent/10/forge-parent-10.pom (14 KB at 90.1 KB/sec)
Downloading: http://repo1.maven.org/maven2/org/apache/maven/maven-settings/3.0/maven-settings-3.0.pom
Downloaded: http://repo1.maven.org/maven2/org/apache/maven/maven-settings/3.0/maven-settings-3.0.pom (2 KB at 12.7 KB/sec)
Downloading: http://repo1.maven.org/maven2/org/apache/maven/maven-settings-builder/3.0/maven-settings-builder-3.0.pom
Downloaded: http://repo1.maven.org/maven2/org/apache/maven/maven-settings-builder/3.0/maven-settings-builder-3.0.pom (3 KB at 15.0 KB/sec)
Downloading: http://repo1.maven.org/maven2/org/codehaus/plexus/plexus-interpolation/1.14/plexus-interpolation-1.14.pom
Downloaded: http://repo1.maven.org/maven2/org/codehaus/plexus/plexus-interpolation/1.14/plexus-interpolation-1.14.pom (910 B at 6.2 KB/sec)
Downloading: http://repo1.maven.org/maven2/org/codehaus/plexus/plexus-components/1.1.18/plexus-components-1.1.18.pom
Downloaded: http://repo1.maven.org/maven2/org/codehaus/plexus/plexus-components/1.1.18/plexus-components-1.1.18.pom (6 KB at 36.1 KB/sec)
Downloading: http://repo1.maven.org/maven2/org/codehaus/plexus/plexus/2.0.7/plexus-2.0.7.pom
Downloaded: http://repo1.maven.org/maven2/org/codehaus/plexus/plexus/2.0.7/plexus-2.0.7.pom (17 KB at 88.4 KB/sec)
Downloading: http://repo1.maven.org/maven2/org/codehaus/plexus/plexus-component-annotations/1.5.5/plexus-component-annotations-1.5.5.pom
Downloaded: http://repo1.maven.org/maven2/org/codehaus/plexus/plexus-component-annotations/1.5.5/plexus-component-annotations-1.5.5.pom (815 B at 5.5 KB/sec)
Downloading: http://repo1.maven.org/maven2/org/codehaus/plexus/plexus-containers/1.5.5/plexus-containers-1.5.5.pom
Downloaded: http://repo1.maven.org/maven2/org/codehaus/plexus/plexus-containers/1.5.5/plexus-containers-1.5.5.pom (5 KB at 28.4 KB/sec)
Downloading: http://repo1.maven.org/maven2/org/sonatype/plexus/plexus-sec-dispatcher/1.3/plexus-sec-dispatcher-1.3.pom
Downloaded: http://repo1.maven.org/maven2/org/sonatype/plexus/plexus-sec-dispatcher/1.3/plexus-sec-dispatcher-1.3.pom (3 KB at 19.7 KB/sec)
Downloading: http://repo1.maven.org/maven2/org/sonatype/spice/spice-parent/12/spice-parent-12.pom
Downloaded: http://repo1.maven.org/maven2/org/sonatype/spice/spice-parent/12/spice-parent-12.pom (7 KB at 45.2 KB/sec)
Downloading: http://repo1.maven.org/maven2/org/sonatype/forge/forge-parent/4/forge-parent-4.pom
Downloaded: http://repo1.maven.org/maven2/org/sonatype/forge/forge-parent/4/forge-parent-4.pom (9 KB at 55.4 KB/sec)
Downloading: http://repo1.maven.org/maven2/org/sonatype/plexus/plexus-cipher/1.7/plexus-cipher-1.7.pom
Downloaded: http://repo1.maven.org/maven2/org/sonatype/plexus/plexus-cipher/1.7/plexus-cipher-1.7.pom (5 KB at 28.1 KB/sec)
Downloading: http://repo1.maven.org/maven2/org/sonatype/spice/spice-parent/15/spice-parent-15.pom
Downloaded: http://repo1.maven.org/maven2/org/sonatype/spice/spice-parent/15/spice-parent-15.pom (9 KB at 55.9 KB/sec)
Downloading: http://repo1.maven.org/maven2/org/sonatype/forge/forge-parent/5/forge-parent-5.pom
Downloaded: http://repo1.maven.org/maven2/org/sonatype/forge/forge-parent/5/forge-parent-5.pom (9 KB at 56.7 KB/sec)
Downloading: http://repo1.maven.org/maven2/org/apache/maven/maven-repository-metadata/3.0/maven-repository-metadata-3.0.pom
Downloaded: http://repo1.maven.org/maven2/org/apache/maven/maven-repository-metadata/3.0/maven-repository-metadata-3.0.pom (2 KB at 13.0 KB/sec)
Downloading: http://repo1.maven.org/maven2/org/apache/maven/maven-artifact/3.0/maven-artifact-3.0.pom
Downloaded: http://repo1.maven.org/maven2/org/apache/maven/maven-artifact/3.0/maven-artifact-3.0.pom (2 KB at 12.4 KB/sec)
Downloading: http://repo1.maven.org/maven2/org/apache/maven/maven-plugin-api/3.0/maven-plugin-api-3.0.pom
Downloaded: http://repo1.maven.org/maven2/org/apache/maven/maven-plugin-api/3.0/maven-plugin-api-3.0.pom (3 KB at 15.1 KB/sec)
Downloading: http://repo1.maven.org/maven2/org/sonatype/sisu/sisu-inject-plexus/1.4.2/sisu-inject-plexus-1.4.2.pom
Downloaded: http://repo1.maven.org/maven2/org/sonatype/sisu/sisu-inject-plexus/1.4.2/sisu-inject-plexus-1.4.2.pom (6 KB at 35.7 KB/sec)
Downloading: http://repo1.maven.org/maven2/org/sonatype/sisu/inject/guice-plexus/1.4.2/guice-plexus-1.4.2.pom
Downloaded: http://repo1.maven.org/maven2/org/sonatype/sisu/inject/guice-plexus/1.4.2/guice-plexus-1.4.2.pom (4 KB at 20.9 KB/sec)
Downloading: http://repo1.maven.org/maven2/org/sonatype/sisu/inject/guice-bean/1.4.2/guice-bean-1.4.2.pom
Downloaded: http://repo1.maven.org/maven2/org/sonatype/sisu/inject/guice-bean/1.4.2/guice-bean-1.4.2.pom (3 KB at 17.2 KB/sec)
Downloading: http://repo1.maven.org/maven2/org/sonatype/sisu/sisu-inject/1.4.2/sisu-inject-1.4.2.pom
Downloaded: http://repo1.maven.org/maven2/org/sonatype/sisu/sisu-inject/1.4.2/sisu-inject-1.4.2.pom (2 KB at 8.0 KB/sec)
Downloading: http://repo1.maven.org/maven2/org/sonatype/sisu/sisu-parent/1.4.2/sisu-parent-1.4.2.pom
Downloaded: http://repo1.maven.org/maven2/org/sonatype/sisu/sisu-parent/1.4.2/sisu-parent-1.4.2.pom (8 KB at 52.0 KB/sec)
Downloading: http://repo1.maven.org/maven2/org/sonatype/forge/forge-parent/6/forge-parent-6.pom
Downloaded: http://repo1.maven.org/maven2/org/sonatype/forge/forge-parent/6/forge-parent-6.pom (11 KB at 72.4 KB/sec)
Downloading: http://repo1.maven.org/maven2/org/codehaus/plexus/plexus-classworlds/2.2.3/plexus-classworlds-2.2.3.pom
Downloaded: http://repo1.maven.org/maven2/org/codehaus/plexus/plexus-classworlds/2.2.3/plexus-classworlds-2.2.3.pom (4 KB at 26.9 KB/sec)
Downloading: http://repo1.maven.org/maven2/org/codehaus/plexus/plexus/2.0.6/plexus-2.0.6.pom
Downloaded: http://repo1.maven.org/maven2/org/codehaus/plexus/plexus/2.0.6/plexus-2.0.6.pom (17 KB at 85.7 KB/sec)
Downloading: http://repo1.maven.org/maven2/org/sonatype/sisu/sisu-inject-bean/1.4.2/sisu-inject-bean-1.4.2.pom
Downloaded: http://repo1.maven.org/maven2/org/sonatype/sisu/sisu-inject-bean/1.4.2/sisu-inject-bean-1.4.2.pom (6 KB at 36.8 KB/sec)
Downloading: http://repo1.maven.org/maven2/org/sonatype/sisu/sisu-guice/2.1.7/sisu-guice-2.1.7.pom
Downloaded: http://repo1.maven.org/maven2/org/sonatype/sisu/sisu-guice/2.1.7/sisu-guice-2.1.7.pom (11 KB at 73.5 KB/sec)
Downloading: http://repo1.maven.org/maven2/org/apache/maven/maven-model-builder/3.0/maven-model-builder-3.0.pom
Downloaded: http://repo1.maven.org/maven2/org/apache/maven/maven-model-builder/3.0/maven-model-builder-3.0.pom (3 KB at 14.9 KB/sec)
Downloading: http://repo1.maven.org/maven2/org/apache/maven/maven-aether-provider/3.0/maven-aether-provider-3.0.pom
Downloaded: http://repo1.maven.org/maven2/org/apache/maven/maven-aether-provider/3.0/maven-aether-provider-3.0.pom (3 KB at 16.2 KB/sec)
Downloading: http://repo1.maven.org/maven2/org/sonatype/aether/aether-api/1.7/aether-api-1.7.pom
Downloaded: http://repo1.maven.org/maven2/org/sonatype/aether/aether-api/1.7/aether-api-1.7.pom (2 KB at 10.8 KB/sec)
Downloading: http://repo1.maven.org/maven2/org/sonatype/aether/aether-parent/1.7/aether-parent-1.7.pom
Downloaded: http://repo1.maven.org/maven2/org/sonatype/aether/aether-parent/1.7/aether-parent-1.7.pom (8 KB at 51.3 KB/sec)
Downloading: http://repo1.maven.org/maven2/org/sonatype/aether/aether-util/1.7/aether-util-1.7.pom
Downloaded: http://repo1.maven.org/maven2/org/sonatype/aether/aether-util/1.7/aether-util-1.7.pom (3 KB at 13.9 KB/sec)
Downloading: http://repo1.maven.org/maven2/org/sonatype/aether/aether-impl/1.7/aether-impl-1.7.pom
Downloaded: http://repo1.maven.org/maven2/org/sonatype/aether/aether-impl/1.7/aether-impl-1.7.pom (4 KB at 25.0 KB/sec)
Downloading: http://repo1.maven.org/maven2/org/sonatype/aether/aether-spi/1.7/aether-spi-1.7.pom
Downloaded: http://repo1.maven.org/maven2/org/sonatype/aether/aether-spi/1.7/aether-spi-1.7.pom (2 KB at 11.7 KB/sec)
Downloading: http://repo1.maven.org/maven2/org/codehaus/plexus/plexus-archiver/2.2/plexus-archiver-2.2.pom
Downloaded: http://repo1.maven.org/maven2/org/codehaus/plexus/plexus-archiver/2.2/plexus-archiver-2.2.pom (4 KB at 21.6 KB/sec)
Downloading: http://repo1.maven.org/maven2/org/codehaus/plexus/plexus-components/1.1.20/plexus-components-1.1.20.pom
Downloaded: http://repo1.maven.org/maven2/org/codehaus/plexus/plexus-components/1.1.20/plexus-components-1.1.20.pom (3 KB at 20.5 KB/sec)
Downloading: http://repo1.maven.org/maven2/org/codehaus/plexus/plexus-io/2.0.5/plexus-io-2.0.5.pom
Downloaded: http://repo1.maven.org/maven2/org/codehaus/plexus/plexus-io/2.0.5/plexus-io-2.0.5.pom (3 KB at 14.9 KB/sec)
Downloading: http://repo1.maven.org/maven2/org/codehaus/plexus/plexus-components/1.2/plexus-components-1.2.pom
Downloaded: http://repo1.maven.org/maven2/org/codehaus/plexus/plexus-components/1.2/plexus-components-1.2.pom (3 KB at 20.6 KB/sec)
Downloading: http://repo1.maven.org/maven2/org/codehaus/plexus/plexus/3.2/plexus-3.2.pom
Downloaded: http://repo1.maven.org/maven2/org/codehaus/plexus/plexus/3.2/plexus-3.2.pom (19 KB at 95.8 KB/sec)
Downloading: http://repo1.maven.org/maven2/org/eclipse/tycho/org.eclipse.osgi/3.9.1.v20130814-1242/org.eclipse.osgi-3.9.1.v20130814-1242.pom
Downloaded: http://repo1.maven.org/maven2/org/eclipse/tycho/org.eclipse.osgi/3.9.1.v20130814-1242/org.eclipse.osgi-3.9.1.v20130814-1242.pom (2 KB at 9.9 KB/sec)
Downloading: http://repo1.maven.org/maven2/org/eclipse/tycho/sisu-equinox-embedder/0.19.0/sisu-equinox-embedder-0.19.0.pom
Downloaded: http://repo1.maven.org/maven2/org/eclipse/tycho/sisu-equinox-embedder/0.19.0/sisu-equinox-embedder-0.19.0.pom (2 KB at 12.4 KB/sec)
Downloading: http://repo1.maven.org/maven2/org/eclipse/tycho/sisu-equinox/0.19.0/sisu-equinox-0.19.0.pom
Downloaded: http://repo1.maven.org/maven2/org/eclipse/tycho/sisu-equinox/0.19.0/sisu-equinox-0.19.0.pom (2 KB at 7.0 KB/sec)
Downloading: http://repo1.maven.org/maven2/org/eclipse/tycho/sisu-equinox-api/0.19.0/sisu-equinox-api-0.19.0.pom
Downloaded: http://repo1.maven.org/maven2/org/eclipse/tycho/sisu-equinox-api/0.19.0/sisu-equinox-api-0.19.0.pom (2 KB at 11.2 KB/sec)
Downloading: http://repo1.maven.org/maven2/org/eclipse/tycho/tycho-metadata-model/0.19.0/tycho-metadata-model-0.19.0.pom
Downloaded: http://repo1.maven.org/maven2/org/eclipse/tycho/tycho-metadata-model/0.19.0/tycho-metadata-model-0.19.0.pom (2 KB at 8.5 KB/sec)
Downloading: http://repo1.maven.org/maven2/de/pdark/decentxml/1.3/decentxml-1.3.pom
Downloaded: http://repo1.maven.org/maven2/de/pdark/decentxml/1.3/decentxml-1.3.pom (7 KB at 42.2 KB/sec)
Downloading: http://repo1.maven.org/maven2/org/eclipse/tycho/tycho-embedder-api/0.19.0/tycho-embedder-api-0.19.0.pom
Downloaded: http://repo1.maven.org/maven2/org/eclipse/tycho/tycho-embedder-api/0.19.0/tycho-embedder-api-0.19.0.pom (3 KB at 13.8 KB/sec)
Downloading: http://repo1.maven.org/maven2/org/eclipse/tycho/org.eclipse.tycho.embedder.shared/0.19.0/org.eclipse.tycho.embedder.shared-0.19.0.pom
Downloaded: http://repo1.maven.org/maven2/org/eclipse/tycho/org.eclipse.tycho.embedder.shared/0.19.0/org.eclipse.tycho.embedder.shared-0.19.0.pom (2 KB at 7.1 KB/sec)
Downloading: http://repo1.maven.org/maven2/org/eclipse/tycho/tycho-bundles/0.19.0/tycho-bundles-0.19.0.pom
Downloaded: http://repo1.maven.org/maven2/org/eclipse/tycho/tycho-bundles/0.19.0/tycho-bundles-0.19.0.pom (3 KB at 17.2 KB/sec)
Downloading: http://repo1.maven.org/maven2/org/eclipse/tycho/org.eclipse.tycho.core.shared/0.19.0/org.eclipse.tycho.core.shared-0.19.0.pom
Downloaded: http://repo1.maven.org/maven2/org/eclipse/tycho/org.eclipse.tycho.core.shared/0.19.0/org.eclipse.tycho.core.shared-0.19.0.pom (2 KB at 7.0 KB/sec)
Downloading: http://repo1.maven.org/maven2/org/eclipse/tycho/tycho-p2-facade/0.19.0/tycho-p2-facade-0.19.0.pom
Downloaded: http://repo1.maven.org/maven2/org/eclipse/tycho/tycho-p2-facade/0.19.0/tycho-p2-facade-0.19.0.pom (3 KB at 15.0 KB/sec)
Downloading: http://repo1.maven.org/maven2/org/eclipse/tycho/tycho-p2/0.19.0/tycho-p2-0.19.0.pom
Downloaded: http://repo1.maven.org/maven2/org/eclipse/tycho/tycho-p2/0.19.0/tycho-p2-0.19.0.pom (2 KB at 7.7 KB/sec)
Downloading: http://repo1.maven.org/maven2/org/eclipse/tycho/org.eclipse.tycho.p2.resolver.shared/0.19.0/org.eclipse.tycho.p2.resolver.shared-0.19.0.pom
Downloaded: http://repo1.maven.org/maven2/org/eclipse/tycho/org.eclipse.tycho.p2.resolver.shared/0.19.0/org.eclipse.tycho.p2.resolver.shared-0.19.0.pom (2 KB at 7.2 KB/sec)
Downloading: http://repo1.maven.org/maven2/org/eclipse/tycho/org.eclipse.tycho.p2.tools.shared/0.19.0/org.eclipse.tycho.p2.tools.shared-0.19.0.pom
Downloaded: http://repo1.maven.org/maven2/org/eclipse/tycho/org.eclipse.tycho.p2.tools.shared/0.19.0/org.eclipse.tycho.p2.tools.shared-0.19.0.pom (2 KB at 7.4 KB/sec)
Downloading: http://repo1.maven.org/maven2/org/eclipse/tycho/tycho-maven-plugin/0.19.0/tycho-maven-plugin-0.19.0.jar
Downloading: http://repo1.maven.org/maven2/org/eclipse/tycho/tycho-core/0.19.0/tycho-core-0.19.0.jar
Downloading: http://repo1.maven.org/maven2/org/sonatype/aether/aether-util/1.7/aether-util-1.7.jar
Downloading: http://repo1.maven.org/maven2/org/sonatype/sisu/sisu-inject-bean/1.4.2/sisu-inject-bean-1.4.2.jar
Downloading: http://repo1.maven.org/maven2/org/sonatype/sisu/sisu-guice/2.1.7/sisu-guice-2.1.7-noaop.jar
Downloaded: http://repo1.maven.org/maven2/org/eclipse/tycho/tycho-maven-plugin/0.19.0/tycho-maven-plugin-0.19.0.jar (5 KB at 31.7 KB/sec)
Downloading: http://repo1.maven.org/maven2/org/codehaus/plexus/plexus-interpolation/1.14/plexus-interpolation-1.14.jar
Downloaded: http://repo1.maven.org/maven2/org/sonatype/aether/aether-util/1.7/aether-util-1.7.jar (106 KB at 524.5 KB/sec)
Downloading: http://repo1.maven.org/maven2/org/sonatype/plexus/plexus-sec-dispatcher/1.3/plexus-sec-dispatcher-1.3.jar
Downloaded: http://repo1.maven.org/maven2/org/eclipse/tycho/tycho-core/0.19.0/tycho-core-0.19.0.jar (176 KB at 655.7 KB/sec)
Downloading: http://repo1.maven.org/maven2/org/sonatype/plexus/plexus-cipher/1.7/plexus-cipher-1.7.jar
Downloaded: http://repo1.maven.org/maven2/org/sonatype/plexus/plexus-sec-dispatcher/1.3/plexus-sec-dispatcher-1.3.jar (28 KB at 230.5 KB/sec)
Downloading: http://repo1.maven.org/maven2/org/codehaus/plexus/plexus-utils/3.0.7/plexus-utils-3.0.7.jar
Downloaded: http://repo1.maven.org/maven2/org/sonatype/sisu/sisu-inject-bean/1.4.2/sisu-inject-bean-1.4.2.jar (150 KB at 396.3 KB/sec)
Downloading: http://repo1.maven.org/maven2/org/codehaus/plexus/plexus-archiver/2.2/plexus-archiver-2.2.jar
Downloaded: http://repo1.maven.org/maven2/org/sonatype/plexus/plexus-cipher/1.7/plexus-cipher-1.7.jar (14 KB at 90.5 KB/sec)
Downloading: http://repo1.maven.org/maven2/org/codehaus/plexus/plexus-io/2.0.5/plexus-io-2.0.5.jar
Downloaded: http://repo1.maven.org/maven2/org/codehaus/plexus/plexus-interpolation/1.14/plexus-interpolation-1.14.jar (60 KB at 215.3 KB/sec)
Downloading: http://repo1.maven.org/maven2/org/eclipse/tycho/org.eclipse.osgi/3.9.1.v20130814-1242/org.eclipse.osgi-3.9.1.v20130814-1242.jar
Downloaded: http://repo1.maven.org/maven2/org/codehaus/plexus/plexus-io/2.0.5/plexus-io-2.0.5.jar (57 KB at 387.5 KB/sec)
Downloading: http://repo1.maven.org/maven2/org/eclipse/tycho/sisu-equinox-embedder/0.19.0/sisu-equinox-embedder-0.19.0.jar
Downloaded: http://repo1.maven.org/maven2/org/sonatype/sisu/sisu-guice/2.1.7/sisu-guice-2.1.7-noaop.jar (461 KB at 766.5 KB/sec)
Downloading: http://repo1.maven.org/maven2/org/eclipse/tycho/sisu-equinox-api/0.19.0/sisu-equinox-api-0.19.0.jar
Downloaded: http://repo1.maven.org/maven2/org/eclipse/tycho/sisu-equinox-embedder/0.19.0/sisu-equinox-embedder-0.19.0.jar (13 KB at 124.5 KB/sec)
Downloading: http://repo1.maven.org/maven2/org/eclipse/tycho/tycho-metadata-model/0.19.0/tycho-metadata-model-0.19.0.jar
Downloaded: http://repo1.maven.org/maven2/org/codehaus/plexus/plexus-utils/3.0.7/plexus-utils-3.0.7.jar (226 KB at 542.3 KB/sec)
Downloading: http://repo1.maven.org/maven2/de/pdark/decentxml/1.3/decentxml-1.3.jar
Downloaded: http://repo1.maven.org/maven2/org/codehaus/plexus/plexus-archiver/2.2/plexus-archiver-2.2.jar (181 KB at 486.9 KB/sec)
Downloading: http://repo1.maven.org/maven2/org/eclipse/tycho/tycho-embedder-api/0.19.0/tycho-embedder-api-0.19.0.jar
Downloaded: http://repo1.maven.org/maven2/org/eclipse/tycho/sisu-equinox-api/0.19.0/sisu-equinox-api-0.19.0.jar (4 KB at 16.0 KB/sec)
Downloading: http://repo1.maven.org/maven2/org/eclipse/tycho/org.eclipse.tycho.embedder.shared/0.19.0/org.eclipse.tycho.embedder.shared-0.19.0.jar
Downloaded: http://repo1.maven.org/maven2/org/eclipse/tycho/tycho-embedder-api/0.19.0/tycho-embedder-api-0.19.0.jar (7 KB at 66.7 KB/sec)
Downloading: http://repo1.maven.org/maven2/org/eclipse/tycho/org.eclipse.tycho.core.shared/0.19.0/org.eclipse.tycho.core.shared-0.19.0.jar
Downloaded: http://repo1.maven.org/maven2/org/eclipse/tycho/tycho-metadata-model/0.19.0/tycho-metadata-model-0.19.0.jar (29 KB at 118.6 KB/sec)
Downloading: http://repo1.maven.org/maven2/org/eclipse/tycho/tycho-p2-facade/0.19.0/tycho-p2-facade-0.19.0.jar
Downloaded: http://repo1.maven.org/maven2/org/eclipse/tycho/org.eclipse.tycho.embedder.shared/0.19.0/org.eclipse.tycho.embedder.shared-0.19.0.jar (7 KB at 34.1 KB/sec)
Downloading: http://repo1.maven.org/maven2/org/codehaus/plexus/plexus-component-annotations/1.5.5/plexus-component-annotations-1.5.5.jar
Downloaded: http://repo1.maven.org/maven2/org/eclipse/tycho/org.eclipse.tycho.core.shared/0.19.0/org.eclipse.tycho.core.shared-0.19.0.jar (31 KB at 181.4 KB/sec)
Downloading: http://repo1.maven.org/maven2/org/eclipse/tycho/org.eclipse.tycho.p2.resolver.shared/0.19.0/org.eclipse.tycho.p2.resolver.shared-0.19.0.jar
Downloaded: http://repo1.maven.org/maven2/org/eclipse/tycho/tycho-p2-facade/0.19.0/tycho-p2-facade-0.19.0.jar (33 KB at 258.4 KB/sec)
Downloading: http://repo1.maven.org/maven2/org/eclipse/tycho/org.eclipse.tycho.p2.tools.shared/0.19.0/org.eclipse.tycho.p2.tools.shared-0.19.0.jar
Downloaded: http://repo1.maven.org/maven2/de/pdark/decentxml/1.3/decentxml-1.3.jar (109 KB at 338.4 KB/sec)
Downloaded: http://repo1.maven.org/maven2/org/eclipse/tycho/org.eclipse.tycho.p2.tools.shared/0.19.0/org.eclipse.tycho.p2.tools.shared-0.19.0.jar (20 KB at 156.0 KB/sec)
Downloaded: http://repo1.maven.org/maven2/org/codehaus/plexus/plexus-component-annotations/1.5.5/plexus-component-annotations-1.5.5.jar (5 KB at 22.0 KB/sec)
Downloaded: http://repo1.maven.org/maven2/org/eclipse/tycho/org.eclipse.tycho.p2.resolver.shared/0.19.0/org.eclipse.tycho.p2.resolver.shared-0.19.0.jar (28 KB at 139.3 KB/sec)
Downloaded: http://repo1.maven.org/maven2/org/eclipse/tycho/org.eclipse.osgi/3.9.1.v20130814-1242/org.eclipse.osgi-3.9.1.v20130814-1242.jar (1360 KB at 1634.1 KB/sec)
[WARNING] No explicit target runtime environment configuration. Build is platform dependent.
Downloading: http://repo1.maven.org/maven2/org/eclipse/tycho/tycho-bundles-external/0.19.0/tycho-bundles-external-0.19.0.zip
Downloaded: http://repo1.maven.org/maven2/org/eclipse/tycho/tycho-bundles-external/0.19.0/tycho-bundles-external-0.19.0.zip (6136 KB at 4865.5 KB/sec)
Downloading: http://repo1.maven.org/maven2/org/eclipse/tycho/org.eclipse.tycho.p2.resolver.impl/0.19.0/org.eclipse.tycho.p2.resolver.impl-0.19.0.jar
Downloaded: http://repo1.maven.org/maven2/org/eclipse/tycho/org.eclipse.tycho.p2.resolver.impl/0.19.0/org.eclipse.tycho.p2.resolver.impl-0.19.0.jar (179 KB at 474.7 KB/sec)
Downloading: http://repo1.maven.org/maven2/org/eclipse/tycho/org.eclipse.tycho.p2.maven.repository/0.19.0/org.eclipse.tycho.p2.maven.repository-0.19.0.jar
Downloaded: http://repo1.maven.org/maven2/org/eclipse/tycho/org.eclipse.tycho.p2.maven.repository/0.19.0/org.eclipse.tycho.p2.maven.repository-0.19.0.jar (134 KB at 355.8 KB/sec)
Downloading: http://repo1.maven.org/maven2/org/eclipse/tycho/org.eclipse.tycho.p2.tools.impl/0.19.0/org.eclipse.tycho.p2.tools.impl-0.19.0.jar
Downloaded: http://repo1.maven.org/maven2/org/eclipse/tycho/org.eclipse.tycho.p2.tools.impl/0.19.0/org.eclipse.tycho.p2.tools.impl-0.19.0.jar (34 KB at 144.4 KB/sec)
Downloading: http://repo1.maven.org/maven2/org/eclipse/tycho/target-platform-configuration/0.19.0/target-platform-configuration-0.19.0.pom
Downloaded: http://repo1.maven.org/maven2/org/eclipse/tycho/target-platform-configuration/0.19.0/target-platform-configuration-0.19.0.pom (2 KB at 2.7 KB/sec)
Downloading: http://repo1.maven.org/maven2/org/eclipse/tycho/target-platform-configuration/0.19.0/target-platform-configuration-0.19.0.jar
Downloaded: http://repo1.maven.org/maven2/org/eclipse/tycho/target-platform-configuration/0.19.0/target-platform-configuration-0.19.0.jar (4 KB at 21.2 KB/sec)
Downloading: http://repo1.maven.org/maven2/org/apache/maven/plugins/maven-clean-plugin/2.4.1/maven-clean-plugin-2.4.1.pom
Downloaded: http://repo1.maven.org/maven2/org/apache/maven/plugins/maven-clean-plugin/2.4.1/maven-clean-plugin-2.4.1.pom (5 KB at 28.2 KB/sec)
Downloading: http://repo1.maven.org/maven2/org/apache/maven/plugins/maven-plugins/18/maven-plugins-18.pom
Downloaded: http://repo1.maven.org/maven2/org/apache/maven/plugins/maven-plugins/18/maven-plugins-18.pom (13 KB at 87.0 KB/sec)
Downloading: http://repo1.maven.org/maven2/org/apache/maven/maven-parent/16/maven-parent-16.pom
Downloaded: http://repo1.maven.org/maven2/org/apache/maven/maven-parent/16/maven-parent-16.pom (23 KB at 120.9 KB/sec)
Downloading: http://repo1.maven.org/maven2/org/apache/apache/7/apache-7.pom
Downloaded: http://repo1.maven.org/maven2/org/apache/apache/7/apache-7.pom (15 KB at 75.4 KB/sec)
Downloading: http://repo1.maven.org/maven2/org/apache/maven/plugins/maven-clean-plugin/2.4.1/maven-clean-plugin-2.4.1.jar
Downloaded: http://repo1.maven.org/maven2/org/apache/maven/plugins/maven-clean-plugin/2.4.1/maven-clean-plugin-2.4.1.jar (23 KB at 121.7 KB/sec)
Downloading: http://repo1.maven.org/maven2/org/apache/maven/plugins/maven-install-plugin/2.3.1/maven-install-plugin-2.3.1.pom
Downloaded: http://repo1.maven.org/maven2/org/apache/maven/plugins/maven-install-plugin/2.3.1/maven-install-plugin-2.3.1.pom (5 KB at 32.9 KB/sec)
Downloading: http://repo1.maven.org/maven2/org/apache/maven/plugins/maven-install-plugin/2.3.1/maven-install-plugin-2.3.1.jar
Downloaded: http://repo1.maven.org/maven2/org/apache/maven/plugins/maven-install-plugin/2.3.1/maven-install-plugin-2.3.1.jar (23 KB at 117.0 KB/sec)
Downloading: http://repo1.maven.org/maven2/org/eclipse/tycho/tycho-p2-plugin/0.19.0/tycho-p2-plugin-0.19.0.pom
Downloaded: http://repo1.maven.org/maven2/org/eclipse/tycho/tycho-p2-plugin/0.19.0/tycho-p2-plugin-0.19.0.pom (3 KB at 14.5 KB/sec)
Downloading: http://repo1.maven.org/maven2/org/eclipse/tycho/tycho-p2-plugin/0.19.0/tycho-p2-plugin-0.19.0.jar
Downloaded: http://repo1.maven.org/maven2/org/eclipse/tycho/tycho-p2-plugin/0.19.0/tycho-p2-plugin-0.19.0.jar (24 KB at 123.0 KB/sec)
Downloading: http://repo1.maven.org/maven2/org/eclipse/tycho/sisu-equinox-launching/0.19.0/sisu-equinox-launching-0.19.0.pom
Downloaded: http://repo1.maven.org/maven2/org/eclipse/tycho/sisu-equinox-launching/0.19.0/sisu-equinox-launching-0.19.0.pom (3 KB at 15.8 KB/sec)
Downloading: http://repo1.maven.org/maven2/org/eclipse/tycho/tycho-artifactcomparator/0.19.0/tycho-artifactcomparator-0.19.0.pom
Downloaded: http://repo1.maven.org/maven2/org/eclipse/tycho/tycho-artifactcomparator/0.19.0/tycho-artifactcomparator-0.19.0.pom (2 KB at 12.3 KB/sec)
Downloading: http://repo1.maven.org/maven2/org/ow2/asm/asm-debug-all/4.0/asm-debug-all-4.0.pom
Downloaded: http://repo1.maven.org/maven2/org/ow2/asm/asm-debug-all/4.0/asm-debug-all-4.0.pom (2 KB at 13.3 KB/sec)
Downloading: http://repo1.maven.org/maven2/org/ow2/asm/asm-parent/4.0/asm-parent-4.0.pom
Downloaded: http://repo1.maven.org/maven2/org/ow2/asm/asm-parent/4.0/asm-parent-4.0.pom (6 KB at 37.3 KB/sec)
Downloading: http://repo1.maven.org/maven2/org/ow2/ow2/1.3/ow2-1.3.pom
Downloaded: http://repo1.maven.org/maven2/org/ow2/ow2/1.3/ow2-1.3.pom (10 KB at 63.2 KB/sec)
Downloading: http://repo1.maven.org/maven2/org/eclipse/tycho/sisu-equinox-launching/0.19.0/sisu-equinox-launching-0.19.0.jar
Downloading: http://repo1.maven.org/maven2/org/eclipse/tycho/tycho-artifactcomparator/0.19.0/tycho-artifactcomparator-0.19.0.jar
Downloading: http://repo1.maven.org/maven2/org/ow2/asm/asm-debug-all/4.0/asm-debug-all-4.0.jar
Downloaded: http://repo1.maven.org/maven2/org/eclipse/tycho/tycho-artifactcomparator/0.19.0/tycho-artifactcomparator-0.19.0.jar (19 KB at 147.4 KB/sec)
Downloaded: http://repo1.maven.org/maven2/org/eclipse/tycho/sisu-equinox-launching/0.19.0/sisu-equinox-launching-0.19.0.jar (28 KB at 115.6 KB/sec)
Downloaded: http://repo1.maven.org/maven2/org/ow2/asm/asm-debug-all/4.0/asm-debug-all-4.0.jar (314 KB at 668.3 KB/sec)
Downloading: http://repo1.maven.org/maven2/org/apache/maven/plugins/maven-resources-plugin/2.4.3/maven-resources-plugin-2.4.3.pom
Downloaded: http://repo1.maven.org/maven2/org/apache/maven/plugins/maven-resources-plugin/2.4.3/maven-resources-plugin-2.4.3.pom (6 KB at 39.8 KB/sec)
Downloading: http://repo1.maven.org/maven2/org/apache/maven/plugins/maven-resources-plugin/2.4.3/maven-resources-plugin-2.4.3.jar
Downloaded: http://repo1.maven.org/maven2/org/apache/maven/plugins/maven-resources-plugin/2.4.3/maven-resources-plugin-2.4.3.jar (24 KB at 60.4 KB/sec)
Downloading: http://repo1.maven.org/maven2/org/eclipse/tycho/tycho-compiler-plugin/0.19.0/tycho-compiler-plugin-0.19.0.pom
Downloaded: http://repo1.maven.org/maven2/org/eclipse/tycho/tycho-compiler-plugin/0.19.0/tycho-compiler-plugin-0.19.0.pom (3 KB at 17.2 KB/sec)
Downloading: http://repo1.maven.org/maven2/org/eclipse/tycho/tycho-compiler-plugin/0.19.0/tycho-compiler-plugin-0.19.0.jar
Downloaded: http://repo1.maven.org/maven2/org/eclipse/tycho/tycho-compiler-plugin/0.19.0/tycho-compiler-plugin-0.19.0.jar (27 KB at 140.0 KB/sec)
Downloading: http://repo1.maven.org/maven2/org/eclipse/tycho/tycho-packaging-plugin/0.19.0/tycho-packaging-plugin-0.19.0.pom
Downloaded: http://repo1.maven.org/maven2/org/eclipse/tycho/tycho-packaging-plugin/0.19.0/tycho-packaging-plugin-0.19.0.pom (3 KB at 18.1 KB/sec)
Downloading: http://repo1.maven.org/maven2/org/eclipse/tycho/tycho-packaging-plugin/0.19.0/tycho-packaging-plugin-0.19.0.jar
Downloaded: http://repo1.maven.org/maven2/org/eclipse/tycho/tycho-packaging-plugin/0.19.0/tycho-packaging-plugin-0.19.0.jar (107 KB at 329.7 KB/sec)
Downloading: http://repo1.maven.org/maven2/org/apache/maven/plugins/maven-deploy-plugin/2.5/maven-deploy-plugin-2.5.pom
Downloaded: http://repo1.maven.org/maven2/org/apache/maven/plugins/maven-deploy-plugin/2.5/maven-deploy-plugin-2.5.pom (6 KB at 38.4 KB/sec)
Downloading: http://repo1.maven.org/maven2/org/apache/maven/plugins/maven-plugins/16/maven-plugins-16.pom
Downloaded: http://repo1.maven.org/maven2/org/apache/maven/plugins/maven-plugins/16/maven-plugins-16.pom (13 KB at 86.0 KB/sec)
Downloading: http://repo1.maven.org/maven2/org/apache/maven/plugins/maven-deploy-plugin/2.5/maven-deploy-plugin-2.5.jar
Downloaded: http://repo1.maven.org/maven2/org/apache/maven/plugins/maven-deploy-plugin/2.5/maven-deploy-plugin-2.5.jar (23 KB at 119.3 KB/sec)
Downloading: http://repo1.maven.org/maven2/org/apache/maven/plugins/maven-site-plugin/2.0.1/maven-site-plugin-2.0.1.pom
Downloaded: http://repo1.maven.org/maven2/org/apache/maven/plugins/maven-site-plugin/2.0.1/maven-site-plugin-2.0.1.pom (14 KB at 92.8 KB/sec)
Downloading: http://repo1.maven.org/maven2/org/apache/maven/plugins/maven-plugins/13/maven-plugins-13.pom
Downloaded: http://repo1.maven.org/maven2/org/apache/maven/plugins/maven-plugins/13/maven-plugins-13.pom (12 KB at 79.4 KB/sec)
Downloading: http://repo1.maven.org/maven2/org/apache/maven/maven-parent/11/maven-parent-11.pom
Downloaded: http://repo1.maven.org/maven2/org/apache/maven/maven-parent/11/maven-parent-11.pom (32 KB at 166.6 KB/sec)
Downloading: http://repo1.maven.org/maven2/org/apache/apache/5/apache-5.pom
Downloaded: http://repo1.maven.org/maven2/org/apache/apache/5/apache-5.pom (5 KB at 27.2 KB/sec)
Downloading: http://repo1.maven.org/maven2/org/apache/maven/plugins/maven-site-plugin/2.0.1/maven-site-plugin-2.0.1.jar
Downloaded: http://repo1.maven.org/maven2/org/apache/maven/plugins/maven-site-plugin/2.0.1/maven-site-plugin-2.0.1.jar (79 KB at 275.9 KB/sec)
[WARNING] No explicit target runtime environment configuration. Build is platform dependent.
Downloading: http://repo1.maven.org/maven2/org/eclipse/tycho/tycho-surefire-plugin/0.19.0/tycho-surefire-plugin-0.19.0.pom
Downloaded: http://repo1.maven.org/maven2/org/eclipse/tycho/tycho-surefire-plugin/0.19.0/tycho-surefire-plugin-0.19.0.pom (4 KB at 20.9 KB/sec)
Downloading: http://repo1.maven.org/maven2/org/eclipse/tycho/tycho-surefire/0.19.0/tycho-surefire-0.19.0.pom
Downloaded: http://repo1.maven.org/maven2/org/eclipse/tycho/tycho-surefire/0.19.0/tycho-surefire-0.19.0.pom (3 KB at 19.1 KB/sec)
Downloading: http://repo1.maven.org/maven2/org/eclipse/tycho/tycho-surefire-plugin/0.19.0/tycho-surefire-plugin-0.19.0.jar
Downloaded: http://repo1.maven.org/maven2/org/eclipse/tycho/tycho-surefire-plugin/0.19.0/tycho-surefire-plugin-0.19.0.jar (43 KB at 180.8 KB/sec)
Downloading: http://repo1.maven.org/maven2/org/eclipse/tycho/org.eclipse.tycho.surefire.osgibooter/0.19.0/org.eclipse.tycho.surefire.osgibooter-0.19.0.pom
Downloaded: http://repo1.maven.org/maven2/org/eclipse/tycho/org.eclipse.tycho.surefire.osgibooter/0.19.0/org.eclipse.tycho.surefire.osgibooter-0.19.0.pom (2 KB at 12.9 KB/sec)
Downloading: http://repo1.maven.org/maven2/org/eclipse/tycho/org.eclipse.tycho.surefire.junit/0.19.0/org.eclipse.tycho.surefire.junit-0.19.0.pom
Downloaded: http://repo1.maven.org/maven2/org/eclipse/tycho/org.eclipse.tycho.surefire.junit/0.19.0/org.eclipse.tycho.surefire.junit-0.19.0.pom (2 KB at 10.9 KB/sec)
Downloading: http://repo1.maven.org/maven2/org/eclipse/tycho/org.eclipse.tycho.surefire.junit4/0.19.0/org.eclipse.tycho.surefire.junit4-0.19.0.pom
Downloaded: http://repo1.maven.org/maven2/org/eclipse/tycho/org.eclipse.tycho.surefire.junit4/0.19.0/org.eclipse.tycho.surefire.junit4-0.19.0.pom (2 KB at 10.9 KB/sec)
Downloading: http://repo1.maven.org/maven2/org/eclipse/tycho/org.eclipse.tycho.surefire.junit47/0.19.0/org.eclipse.tycho.surefire.junit47-0.19.0.pom
Downloaded: http://repo1.maven.org/maven2/org/eclipse/tycho/org.eclipse.tycho.surefire.junit47/0.19.0/org.eclipse.tycho.surefire.junit47-0.19.0.pom (2 KB at 10.7 KB/sec)
Downloading: http://repo1.maven.org/maven2/org/apache/maven/surefire/surefire-api/2.10/surefire-api-2.10.pom
Downloaded: http://repo1.maven.org/maven2/org/apache/maven/surefire/surefire-api/2.10/surefire-api-2.10.pom (3 KB at 15.5 KB/sec)
Downloading: http://repo1.maven.org/maven2/org/apache/maven/surefire/surefire/2.10/surefire-2.10.pom
Downloaded: http://repo1.maven.org/maven2/org/apache/maven/surefire/surefire/2.10/surefire-2.10.pom (12 KB at 80.3 KB/sec)
Downloading: http://repo1.maven.org/maven2/org/apache/maven/maven-parent/20/maven-parent-20.pom
Downloaded: http://repo1.maven.org/maven2/org/apache/maven/maven-parent/20/maven-parent-20.pom (25 KB at 127.8 KB/sec)
Downloading: http://repo1.maven.org/maven2/org/apache/apache/9/apache-9.pom
Downloaded: http://repo1.maven.org/maven2/org/apache/apache/9/apache-9.pom (15 KB at 78.7 KB/sec)
Downloading: http://repo1.maven.org/maven2/org/eclipse/tycho/org.eclipse.tycho.surefire.osgibooter/0.19.0/org.eclipse.tycho.surefire.osgibooter-0.19.0.jar
Downloading: http://repo1.maven.org/maven2/org/eclipse/tycho/org.eclipse.tycho.surefire.junit/0.19.0/org.eclipse.tycho.surefire.junit-0.19.0.jar
Downloading: http://repo1.maven.org/maven2/org/eclipse/tycho/org.eclipse.tycho.surefire.junit4/0.19.0/org.eclipse.tycho.surefire.junit4-0.19.0.jar
Downloading: http://repo1.maven.org/maven2/org/eclipse/tycho/org.eclipse.tycho.surefire.junit47/0.19.0/org.eclipse.tycho.surefire.junit47-0.19.0.jar
Downloading: http://repo1.maven.org/maven2/org/apache/maven/surefire/surefire-api/2.10/surefire-api-2.10.jar
Downloaded: http://repo1.maven.org/maven2/org/eclipse/tycho/org.eclipse.tycho.surefire.junit/0.19.0/org.eclipse.tycho.surefire.junit-0.19.0.jar (25 KB at 190.2 KB/sec)
Downloaded: http://repo1.maven.org/maven2/org/apache/maven/surefire/surefire-api/2.10/surefire-api-2.10.jar (158 KB at 712.9 KB/sec)
Downloaded: http://repo1.maven.org/maven2/org/eclipse/tycho/org.eclipse.tycho.surefire.junit4/0.19.0/org.eclipse.tycho.surefire.junit4-0.19.0.jar (29 KB at 122.8 KB/sec)
Downloaded: http://repo1.maven.org/maven2/org/eclipse/tycho/org.eclipse.tycho.surefire.junit47/0.19.0/org.eclipse.tycho.surefire.junit47-0.19.0.jar (49 KB at 173.0 KB/sec)
Downloaded: http://repo1.maven.org/maven2/org/eclipse/tycho/org.eclipse.tycho.surefire.osgibooter/0.19.0/org.eclipse.tycho.surefire.osgibooter-0.19.0.jar (181 KB at 484.3 KB/sec)
[WARNING] No explicit target runtime environment configuration. Build is platform dependent.
[WARNING] No explicit target runtime environment configuration. Build is platform dependent.
Downloading: http://repo1.maven.org/maven2/org/eclipse/tycho/tycho-p2-publisher-plugin/0.19.0/tycho-p2-publisher-plugin-0.19.0.pom
Downloaded: http://repo1.maven.org/maven2/org/eclipse/tycho/tycho-p2-publisher-plugin/0.19.0/tycho-p2-publisher-plugin-0.19.0.pom (2 KB at 11.2 KB/sec)
Downloading: http://repo1.maven.org/maven2/org/eclipse/tycho/tycho-p2-publisher-plugin/0.19.0/tycho-p2-publisher-plugin-0.19.0.jar
Downloaded: http://repo1.maven.org/maven2/org/eclipse/tycho/tycho-p2-publisher-plugin/0.19.0/tycho-p2-publisher-plugin-0.19.0.jar (21 KB at 89.3 KB/sec)
Downloading: http://repo1.maven.org/maven2/org/apache/maven/maven-archiver/2.5/maven-archiver-2.5.pom
Downloaded: http://repo1.maven.org/maven2/org/apache/maven/maven-archiver/2.5/maven-archiver-2.5.pom (5 KB at 30.1 KB/sec)
Downloading: http://repo1.maven.org/maven2/org/apache/maven/shared/maven-shared-components/17/maven-shared-components-17.pom
Downloaded: http://repo1.maven.org/maven2/org/apache/maven/shared/maven-shared-components/17/maven-shared-components-17.pom (9 KB at 59.0 KB/sec)
Downloading: http://repo1.maven.org/maven2/org/apache/maven/maven-parent/21/maven-parent-21.pom
Downloaded: http://repo1.maven.org/maven2/org/apache/maven/maven-parent/21/maven-parent-21.pom (26 KB at 135.5 KB/sec)
Downloading: http://repo1.maven.org/maven2/org/apache/apache/10/apache-10.pom
Downloaded: http://repo1.maven.org/maven2/org/apache/apache/10/apache-10.pom (15 KB at 75.7 KB/sec)
Downloading: http://repo1.maven.org/maven2/org/codehaus/plexus/plexus-interpolation/1.15/plexus-interpolation-1.15.pom
Downloaded: http://repo1.maven.org/maven2/org/codehaus/plexus/plexus-interpolation/1.15/plexus-interpolation-1.15.pom (1018 B at 6.9 KB/sec)
Downloading: http://repo1.maven.org/maven2/org/codehaus/plexus/plexus/3.0.1/plexus-3.0.1.pom
Downloaded: http://repo1.maven.org/maven2/org/codehaus/plexus/plexus/3.0.1/plexus-3.0.1.pom (19 KB at 93.2 KB/sec)
Downloading: http://repo1.maven.org/maven2/org/apache/maven/maven-archiver/2.5/maven-archiver-2.5.jar
Downloaded: http://repo1.maven.org/maven2/org/apache/maven/maven-archiver/2.5/maven-archiver-2.5.jar (22 KB at 111.5 KB/sec)
Downloading: http://repo1.maven.org/maven2/org/eclipse/tycho/tycho-p2-repository-plugin/0.19.0/tycho-p2-repository-plugin-0.19.0.pom
Downloaded: http://repo1.maven.org/maven2/org/eclipse/tycho/tycho-p2-repository-plugin/0.19.0/tycho-p2-repository-plugin-0.19.0.pom (2 KB at 8.7 KB/sec)
Downloading: http://repo1.maven.org/maven2/org/eclipse/tycho/tycho-p2-repository-plugin/0.19.0/tycho-p2-repository-plugin-0.19.0.jar
Downloaded: http://repo1.maven.org/maven2/org/eclipse/tycho/tycho-p2-repository-plugin/0.19.0/tycho-p2-repository-plugin-0.19.0.jar (11 KB at 70.8 KB/sec)
[WARNING] No explicit target runtime environment configuration. Build is platform dependent.
[INFO] Computing target platform for MavenProject: org.eclipse.tycho:org.eclipse.tycho.targeteditor:0.11.0-SNAPSHOT @ /jobs/genie.technology.tycho/tycho.targeteditor-gerrit/workspace/org.eclipse.tycho.targeteditor/pom.xml
[INFO] o.h.m.e.h.MavenExecutionResultHandler - Build failed with exception(s)
[INFO] o.h.m.e.h.MavenExecutionResultHandler - [1] org.apache.maven.InternalErrorException: Internal error: java.lang.RuntimeException: Failed to resolve target definition /jobs/genie.technology.tycho/tycho.targeteditor-gerrit/workspace/org.eclipse.tycho.targeteditor.target-definition/org.eclipse.tycho.targeteditor.target-definition.target
[DEBUG] Closing connection to remote
[ERROR] Internal error: java.lang.RuntimeException: Failed to resolve target definition /jobs/genie.technology.tycho/tycho.targeteditor-gerrit/workspace/org.eclipse.tycho.targeteditor.target-definition/org.eclipse.tycho.targeteditor.target-definition.target: Could not find "org.eclipse.swtbot.eclipse.feature.group/2.2.0.201401081015" in the repositories of the current location -> [Help 1]
org.apache.maven.InternalErrorException: Internal error: java.lang.RuntimeException: Failed to resolve target definition /jobs/genie.technology.tycho/tycho.targeteditor-gerrit/workspace/org.eclipse.tycho.targeteditor.target-definition/org.eclipse.tycho.targeteditor.target-definition.target
	at org.apache.maven.DefaultMaven.execute(DefaultMaven.java:168)
	at org.apache.maven.cli.MavenCli.execute(MavenCli.java:537)
	at org.apache.maven.cli.MavenCli.doMain(MavenCli.java:196)
	at org.apache.maven.cli.MavenCli.main(MavenCli.java:141)
	at sun.reflect.NativeMethodAccessorImpl.invoke0(Native Method)
	at sun.reflect.NativeMethodAccessorImpl.invoke(NativeMethodAccessorImpl.java:39)
	at sun.reflect.DelegatingMethodAccessorImpl.invoke(DelegatingMethodAccessorImpl.java:25)
	at java.lang.reflect.Method.invoke(Method.java:597)
	at org.codehaus.plexus.classworlds.launcher.Launcher.launchEnhanced(Launcher.java:290)
	at org.codehaus.plexus.classworlds.launcher.Launcher.launch(Launcher.java:230)
	at org.codehaus.plexus.classworlds.launcher.Launcher.mainWithExitCode(Launcher.java:409)
	at org.codehaus.plexus.classworlds.launcher.Launcher.main(Launcher.java:352)
Caused by: java.lang.RuntimeException: Failed to resolve target definition /jobs/genie.technology.tycho/tycho.targeteditor-gerrit/workspace/org.eclipse.tycho.targeteditor.target-definition/org.eclipse.tycho.targeteditor.target-definition.target
	at org.eclipse.tycho.p2.target.TargetDefinitionResolver.resolveContent(TargetDefinitionResolver.java:84)
	at org.eclipse.tycho.p2.target.TargetDefinitionResolverService.resolveFromArguments(TargetDefinitionResolverService.java:65)
	at org.eclipse.tycho.p2.target.TargetDefinitionResolverService.getTargetDefinitionContent(TargetDefinitionResolverService.java:55)
	at org.eclipse.tycho.p2.target.TargetPlatformFactoryImpl.resolveTargetDefinitions(TargetPlatformFactoryImpl.java:212)
	at org.eclipse.tycho.p2.target.TargetPlatformFactoryImpl.createTargetPlatform(TargetPlatformFactoryImpl.java:146)
	at org.eclipse.tycho.p2.target.TargetPlatformFactoryImpl.createTargetPlatform(TargetPlatformFactoryImpl.java:119)
	at org.eclipse.tycho.p2.target.TargetPlatformFactoryImpl.createTargetPlatform(TargetPlatformFactoryImpl.java:1)
	at org.eclipse.tycho.p2.resolver.P2TargetPlatformResolver.computeTargetPlatform(P2TargetPlatformResolver.java:215)
	at org.eclipse.tycho.core.resolver.DefaultTychoDependencyResolver.resolveProject(DefaultTychoDependencyResolver.java:100)
	at org.eclipse.tycho.core.maven.TychoMavenLifecycleParticipant.afterProjectsRead(TychoMavenLifecycleParticipant.java:75)
	at org.apache.maven.DefaultMaven.doExecute(DefaultMaven.java:273)
	at org.apache.maven.DefaultMaven.execute(DefaultMaven.java:156)
	... 11 more
Caused by: org.eclipse.tycho.p2.target.facade.TargetDefinitionResolutionException: Could not find "org.eclipse.swtbot.eclipse.feature.group/2.2.0.201401081015" in the repositories of the current location
	at org.eclipse.tycho.p2.target.TargetDefinitionResolver.getUnitInstance(TargetDefinitionResolver.java:213)
	at org.eclipse.tycho.p2.target.TargetDefinitionResolver.resolveContentWithExceptions(TargetDefinitionResolver.java:127)
	at org.eclipse.tycho.p2.target.TargetDefinitionResolver.resolveContent(TargetDefinitionResolver.java:79)
	... 22 more
[ERROR] 
[ERROR] To see the full stack trace of the errors, re-run Maven with the -e switch.
[ERROR] Re-run Maven using the -X switch to enable full debug logging.
[ERROR] 
[ERROR] For more information about the errors and possible solutions, please read the following articles:
[ERROR] [Help 1] http://cwiki.apache.org/confluence/display/MAVEN/InternalErrorException
[DEBUG] Waiting for process to finish
[DEBUG] Result: 1
Recording test results
Finished: FAILURE