FailedConsole Output

Started by timer
Building in workspace /home/hudson/genie.tycho/.jenkins/jobs/tycho.nexus-sonar/workspace
No credentials specified
 > /usr/local/bin/git rev-parse --is-inside-work-tree # timeout=10
Fetching changes from the remote Git repository
 > /usr/local/bin/git config remote.origin.url git://git.eclipse.org/gitroot/tycho/org.eclipse.tycho.nexus.git # timeout=10
Fetching upstream changes from git://git.eclipse.org/gitroot/tycho/org.eclipse.tycho.nexus.git
 > /usr/local/bin/git --version # timeout=10
 > /usr/local/bin/git fetch --tags --progress git://git.eclipse.org/gitroot/tycho/org.eclipse.tycho.nexus.git +refs/heads/*:refs/remotes/origin/*
 > /usr/local/bin/git rev-parse origin/master^{commit} # timeout=10
Checking out Revision 612e96fe43ea795880fb88ba5bd55d5e40564edd (origin/master)
 > /usr/local/bin/git config core.sparsecheckout # timeout=10
 > /usr/local/bin/git checkout -f 612e96fe43ea795880fb88ba5bd55d5e40564edd
Commit message: "Let unzip plugin built for NX 2.8 run on NX 2.11, too"
 > /usr/local/bin/git rev-list --no-walk 612e96fe43ea795880fb88ba5bd55d5e40564edd # timeout=10
[workspace] $ /shared/common/apache-maven-3.0.5/bin/mvn -f pom.xml -Dmaven.repo.local=/home/hudson/genie.tycho/.jenkins/jobs/tycho.nexus-sonar/workspace/.repository clean install -B -e -V
Picked up JAVA_TOOL_OPTIONS: -Xmx2G -Djava.io.tmpdir=/tmp/genie.tycho
Apache Maven 3.0.5 (r01de14724cdef164cd33c7c8c2fe155faf9602da; 2013-02-19 08:51:28-0500)
Maven home: /shared/common/apache-maven-3.0.5
Java version: 1.7.0_80, vendor: Oracle Corporation
Java home: /opt/public/common/jdk1.7.0_80/jre
Default locale: en_US, platform encoding: UTF-8
OS name: "linux", version: "3.12.74-60.64.40-default", arch: "amd64", family: "unix"
[INFO] Error stacktraces are turned on.
[INFO] Scanning for projects...
[INFO] ------------------------------------------------------------------------
[INFO] Reactor Build Order:
[INFO] 
[INFO] Nexus Unzip Plugin - Parent (Incubation)
[INFO] Nexus Unzip Plugin (Incubation)
[INFO] Nexus Unzip Plugin - Integration Tests (Incubation)
[INFO]                                                                         
[INFO] ------------------------------------------------------------------------
[INFO] Building Nexus Unzip Plugin - Parent (Incubation) 0.15.0-SNAPSHOT
[INFO] ------------------------------------------------------------------------
[INFO] 
[INFO] --- maven-clean-plugin:2.4.1:clean (default-clean) @ unzip-repository-plugin-parent ---
[INFO] 
[INFO] --- maven-enforcer-plugin:1.3.1:enforce (enforce-environment) @ unzip-repository-plugin-parent ---
[INFO] 
[INFO] --- maven-install-plugin:2.3.1:install (default-install) @ unzip-repository-plugin-parent ---
[INFO] Installing /jobs/genie.tycho/tycho.nexus-sonar/workspace/pom.xml to /home/hudson/genie.tycho/.jenkins/jobs/tycho.nexus-sonar/workspace/.repository/org/eclipse/tycho/nexus/unzip-repository-plugin-parent/0.15.0-SNAPSHOT/unzip-repository-plugin-parent-0.15.0-SNAPSHOT.pom
[INFO]                                                                         
[INFO] ------------------------------------------------------------------------
[INFO] Building Nexus Unzip Plugin (Incubation) 0.15.0-SNAPSHOT
[INFO] ------------------------------------------------------------------------
[INFO] 
[INFO] --- maven-clean-plugin:2.4.1:clean (default-clean) @ unzip-repository-plugin ---
[INFO] Deleting /jobs/genie.tycho/tycho.nexus-sonar/workspace/unzip-repository-plugin/target
[INFO] 
[INFO] --- maven-enforcer-plugin:1.3.1:enforce (enforce-environment) @ unzip-repository-plugin ---
[INFO] 
[INFO] --- nexus-plugin-bundle-maven-plugin:1.2:check-dependencies (default-check-dependencies) @ unzip-repository-plugin ---
[INFO] No dependency problems detected
[INFO] 
[INFO] --- maven-resources-plugin:2.6:resources (default-resources) @ unzip-repository-plugin ---
[INFO] Using 'UTF-8' encoding to copy filtered resources.
[INFO] Copying 3 resources
[INFO] 
[INFO] --- maven-compiler-plugin:2.5.1:compile (default-compile) @ unzip-repository-plugin ---
[INFO] Compiling 25 source files to /jobs/genie.tycho/tycho.nexus-sonar/workspace/unzip-repository-plugin/target/classes
[INFO] 
[INFO] --- nexus-plugin-bundle-maven-plugin:1.2:generate-metadata (default-generate-metadata) @ unzip-repository-plugin ---
[INFO] Fetching SCM details
[INFO] Executing: /bin/sh -c cd /jobs/genie.tycho/tycho.nexus-sonar/workspace/unzip-repository-plugin && git rev-parse HEAD
[INFO] Working directory: /jobs/genie.tycho/tycho.nexus-sonar/workspace/unzip-repository-plugin
[INFO] Generating metadata descriptor: /jobs/genie.tycho/tycho.nexus-sonar/workspace/unzip-repository-plugin/target/classes/META-INF/nexus/plugin.xml
[INFO] 
[INFO] --- sisu-maven-plugin:1.1:main-index (default-main-index) @ unzip-repository-plugin ---
[INFO] 
[INFO] --- maven-resources-plugin:2.6:testResources (default-testResources) @ unzip-repository-plugin ---
[INFO] Using 'UTF-8' encoding to copy filtered resources.
[INFO] Copying 19 resources
[INFO] 
[INFO] --- maven-compiler-plugin:2.5.1:testCompile (default-testCompile) @ unzip-repository-plugin ---
[INFO] Compiling 16 source files to /jobs/genie.tycho/tycho.nexus-sonar/workspace/unzip-repository-plugin/target/test-classes
[INFO] 
[INFO] --- sisu-maven-plugin:1.1:test-index (default-test-index) @ unzip-repository-plugin ---
[INFO] 
[INFO] --- maven-surefire-plugin:2.12.4:test (default-test) @ unzip-repository-plugin ---
[INFO] Surefire report directory: /jobs/genie.tycho/tycho.nexus-sonar/workspace/unzip-repository-plugin/target/surefire-reports

-------------------------------------------------------
 T E S T S
-------------------------------------------------------
Picked up JAVA_TOOL_OPTIONS: -Xmx2G -Djava.io.tmpdir=/tmp/genie.tycho
Running org.eclipse.tycho.nexus.internal.plugin.storage.ZippedStorageCollectionItemTest
00:00:57.298 [main] WARN  o.e.t.n.internal.plugin.UnzipPlugin - Missing plugin project metadata: /META-INF/maven/org.eclipse.tycho.nexus/unzip-repository-plugin/pom.properties
00:00:57.326 [main] INFO  o.s.s.g.e.internal.DefaultEventBus - Using Reentrant Guava EventBus
00:00:57.406 [main] INFO  o.s.n.p.r.DefaultRepositoryTypeRegistry - Registered default repository types.
00:00:58.241 [main] WARN  o.e.t.n.internal.plugin.UnzipPlugin - Missing plugin project metadata: /META-INF/maven/org.eclipse.tycho.nexus/unzip-repository-plugin/pom.properties
00:00:58.244 [main] INFO  o.s.s.g.e.internal.DefaultEventBus - Using Reentrant Guava EventBus
00:00:58.244 [main] WARN  o.s.nexus.events.DebugEventInspector - MBean already registered; replacing: org.sonatype.nexus.events:name=DebugEventInspector
00:00:58.250 [main] INFO  o.s.n.p.r.DefaultRepositoryTypeRegistry - Registered default repository types.
00:00:58.508 [main] WARN  o.e.t.n.internal.plugin.UnzipPlugin - Missing plugin project metadata: /META-INF/maven/org.eclipse.tycho.nexus/unzip-repository-plugin/pom.properties
00:00:58.510 [main] INFO  o.s.s.g.e.internal.DefaultEventBus - Using Reentrant Guava EventBus
00:00:58.511 [main] WARN  o.s.nexus.events.DebugEventInspector - MBean already registered; replacing: org.sonatype.nexus.events:name=DebugEventInspector
00:00:58.515 [main] INFO  o.s.n.p.r.DefaultRepositoryTypeRegistry - Registered default repository types.
Tests run: 3, Failures: 0, Errors: 0, Skipped: 0, Time elapsed: 6.331 sec
Running org.eclipse.tycho.nexus.internal.plugin.storage.MimeTypeHelperTest
Tests run: 5, Failures: 0, Errors: 0, Skipped: 0, Time elapsed: 0.001 sec
Running org.eclipse.tycho.nexus.internal.plugin.storage.ZipAwareStorageCollectionItemTest
00:00:58.754 [main] WARN  o.e.t.n.internal.plugin.UnzipPlugin - Missing plugin project metadata: /META-INF/maven/org.eclipse.tycho.nexus/unzip-repository-plugin/pom.properties
00:00:58.756 [main] INFO  o.s.s.g.e.internal.DefaultEventBus - Using Reentrant Guava EventBus
00:00:58.756 [main] WARN  o.s.nexus.events.DebugEventInspector - MBean already registered; replacing: org.sonatype.nexus.events:name=DebugEventInspector
00:00:58.760 [main] INFO  o.s.n.p.r.DefaultRepositoryTypeRegistry - Registered default repository types.
00:00:58.980 [main] WARN  o.e.t.n.internal.plugin.UnzipPlugin - Missing plugin project metadata: /META-INF/maven/org.eclipse.tycho.nexus/unzip-repository-plugin/pom.properties
00:00:58.982 [main] INFO  o.s.s.g.e.internal.DefaultEventBus - Using Reentrant Guava EventBus
00:00:58.982 [main] WARN  o.s.nexus.events.DebugEventInspector - MBean already registered; replacing: org.sonatype.nexus.events:name=DebugEventInspector
00:00:58.986 [main] INFO  o.s.n.p.r.DefaultRepositoryTypeRegistry - Registered default repository types.
00:00:59.182 [main] WARN  o.e.t.n.internal.plugin.UnzipPlugin - Missing plugin project metadata: /META-INF/maven/org.eclipse.tycho.nexus/unzip-repository-plugin/pom.properties
00:00:59.183 [main] INFO  o.s.s.g.e.internal.DefaultEventBus - Using Reentrant Guava EventBus
00:00:59.184 [main] WARN  o.s.nexus.events.DebugEventInspector - MBean already registered; replacing: org.sonatype.nexus.events:name=DebugEventInspector
00:00:59.187 [main] INFO  o.s.n.p.r.DefaultRepositoryTypeRegistry - Registered default repository types.
00:00:59.356 [main] WARN  o.e.t.n.internal.plugin.UnzipPlugin - Missing plugin project metadata: /META-INF/maven/org.eclipse.tycho.nexus/unzip-repository-plugin/pom.properties
00:00:59.357 [main] INFO  o.s.s.g.e.internal.DefaultEventBus - Using Reentrant Guava EventBus
00:00:59.358 [main] WARN  o.s.nexus.events.DebugEventInspector - MBean already registered; replacing: org.sonatype.nexus.events:name=DebugEventInspector
00:00:59.360 [main] INFO  o.s.n.p.r.DefaultRepositoryTypeRegistry - Registered default repository types.
/dir/subdir/archive.zip-unzip
1481432424000
Tests run: 4, Failures: 0, Errors: 0, Skipped: 0, Time elapsed: 0.828 sec
Running org.eclipse.tycho.nexus.internal.plugin.storage.ZippedItemTest
00:00:59.509 [main] WARN  o.e.t.n.internal.plugin.UnzipPlugin - Missing plugin project metadata: /META-INF/maven/org.eclipse.tycho.nexus/unzip-repository-plugin/pom.properties
00:00:59.509 [main] INFO  o.s.s.g.e.internal.DefaultEventBus - Using Reentrant Guava EventBus
00:00:59.510 [main] WARN  o.s.nexus.events.DebugEventInspector - MBean already registered; replacing: org.sonatype.nexus.events:name=DebugEventInspector
00:00:59.512 [main] INFO  o.s.n.p.r.DefaultRepositoryTypeRegistry - Registered default repository types.
00:00:59.635 [main] WARN  o.e.t.n.internal.plugin.UnzipPlugin - Missing plugin project metadata: /META-INF/maven/org.eclipse.tycho.nexus/unzip-repository-plugin/pom.properties
00:00:59.636 [main] INFO  o.s.s.g.e.internal.DefaultEventBus - Using Reentrant Guava EventBus
00:00:59.636 [main] WARN  o.s.nexus.events.DebugEventInspector - MBean already registered; replacing: org.sonatype.nexus.events:name=DebugEventInspector
00:00:59.639 [main] INFO  o.s.n.p.r.DefaultRepositoryTypeRegistry - Registered default repository types.
00:00:59.753 [main] WARN  o.e.t.n.internal.plugin.UnzipPlugin - Missing plugin project metadata: /META-INF/maven/org.eclipse.tycho.nexus/unzip-repository-plugin/pom.properties
00:00:59.754 [main] INFO  o.s.s.g.e.internal.DefaultEventBus - Using Reentrant Guava EventBus
00:00:59.754 [main] WARN  o.s.nexus.events.DebugEventInspector - MBean already registered; replacing: org.sonatype.nexus.events:name=DebugEventInspector
00:00:59.756 [main] INFO  o.s.n.p.r.DefaultRepositoryTypeRegistry - Registered default repository types.
00:00:59.875 [main] WARN  o.e.t.n.internal.plugin.UnzipPlugin - Missing plugin project metadata: /META-INF/maven/org.eclipse.tycho.nexus/unzip-repository-plugin/pom.properties
00:00:59.876 [main] INFO  o.s.s.g.e.internal.DefaultEventBus - Using Reentrant Guava EventBus
00:00:59.876 [main] WARN  o.s.nexus.events.DebugEventInspector - MBean already registered; replacing: org.sonatype.nexus.events:name=DebugEventInspector
00:00:59.878 [main] INFO  o.s.n.p.r.DefaultRepositoryTypeRegistry - Registered default repository types.
00:00:59.995 [main] WARN  o.e.t.n.internal.plugin.UnzipPlugin - Missing plugin project metadata: /META-INF/maven/org.eclipse.tycho.nexus/unzip-repository-plugin/pom.properties
00:00:59.996 [main] INFO  o.s.s.g.e.internal.DefaultEventBus - Using Reentrant Guava EventBus
00:00:59.996 [main] WARN  o.s.nexus.events.DebugEventInspector - MBean already registered; replacing: org.sonatype.nexus.events:name=DebugEventInspector
00:00:59.999 [main] INFO  o.s.n.p.r.DefaultRepositoryTypeRegistry - Registered default repository types.
00:01:00.095 [main] WARN  o.e.t.n.internal.plugin.UnzipPlugin - Missing plugin project metadata: /META-INF/maven/org.eclipse.tycho.nexus/unzip-repository-plugin/pom.properties
00:01:00.096 [main] INFO  o.s.s.g.e.internal.DefaultEventBus - Using Reentrant Guava EventBus
00:01:00.096 [main] WARN  o.s.nexus.events.DebugEventInspector - MBean already registered; replacing: org.sonatype.nexus.events:name=DebugEventInspector
00:01:00.098 [main] INFO  o.s.n.p.r.DefaultRepositoryTypeRegistry - Registered default repository types.
00:01:00.194 [main] WARN  o.e.t.n.internal.plugin.UnzipPlugin - Missing plugin project metadata: /META-INF/maven/org.eclipse.tycho.nexus/unzip-repository-plugin/pom.properties
00:01:00.194 [main] INFO  o.s.s.g.e.internal.DefaultEventBus - Using Reentrant Guava EventBus
00:01:00.195 [main] WARN  o.s.nexus.events.DebugEventInspector - MBean already registered; replacing: org.sonatype.nexus.events:name=DebugEventInspector
00:01:00.197 [main] INFO  o.s.n.p.r.DefaultRepositoryTypeRegistry - Registered default repository types.
00:01:00.299 [main] WARN  o.e.t.n.internal.plugin.UnzipPlugin - Missing plugin project metadata: /META-INF/maven/org.eclipse.tycho.nexus/unzip-repository-plugin/pom.properties
00:01:00.300 [main] INFO  o.s.s.g.e.internal.DefaultEventBus - Using Reentrant Guava EventBus
00:01:00.301 [main] WARN  o.s.nexus.events.DebugEventInspector - MBean already registered; replacing: org.sonatype.nexus.events:name=DebugEventInspector
00:01:00.304 [main] INFO  o.s.n.p.r.DefaultRepositoryTypeRegistry - Registered default repository types.
00:01:00.453 [main] WARN  o.e.t.n.internal.plugin.UnzipPlugin - Missing plugin project metadata: /META-INF/maven/org.eclipse.tycho.nexus/unzip-repository-plugin/pom.properties
00:01:00.454 [main] INFO  o.s.s.g.e.internal.DefaultEventBus - Using Reentrant Guava EventBus
00:01:00.454 [main] WARN  o.s.nexus.events.DebugEventInspector - MBean already registered; replacing: org.sonatype.nexus.events:name=DebugEventInspector
00:01:00.456 [main] INFO  o.s.n.p.r.DefaultRepositoryTypeRegistry - Registered default repository types.
00:01:00.537 [main] WARN  o.e.t.n.internal.plugin.UnzipPlugin - Missing plugin project metadata: /META-INF/maven/org.eclipse.tycho.nexus/unzip-repository-plugin/pom.properties
00:01:00.537 [main] INFO  o.s.s.g.e.internal.DefaultEventBus - Using Reentrant Guava EventBus
00:01:00.538 [main] WARN  o.s.nexus.events.DebugEventInspector - MBean already registered; replacing: org.sonatype.nexus.events:name=DebugEventInspector
00:01:00.540 [main] INFO  o.s.n.p.r.DefaultRepositoryTypeRegistry - Registered default repository types.
00:01:00.617 [main] WARN  o.e.t.n.internal.plugin.UnzipPlugin - Missing plugin project metadata: /META-INF/maven/org.eclipse.tycho.nexus/unzip-repository-plugin/pom.properties
00:01:00.618 [main] INFO  o.s.s.g.e.internal.DefaultEventBus - Using Reentrant Guava EventBus
00:01:00.618 [main] WARN  o.s.nexus.events.DebugEventInspector - MBean already registered; replacing: org.sonatype.nexus.events:name=DebugEventInspector
00:01:00.620 [main] INFO  o.s.n.p.r.DefaultRepositoryTypeRegistry - Registered default repository types.
00:01:00.693 [main] WARN  o.e.t.n.internal.plugin.UnzipPlugin - Missing plugin project metadata: /META-INF/maven/org.eclipse.tycho.nexus/unzip-repository-plugin/pom.properties
00:01:00.694 [main] INFO  o.s.s.g.e.internal.DefaultEventBus - Using Reentrant Guava EventBus
00:01:00.694 [main] WARN  o.s.nexus.events.DebugEventInspector - MBean already registered; replacing: org.sonatype.nexus.events:name=DebugEventInspector
00:01:00.696 [main] INFO  o.s.n.p.r.DefaultRepositoryTypeRegistry - Registered default repository types.
Tests run: 12, Failures: 0, Errors: 0, Skipped: 0, Time elapsed: 1.34 sec
Running org.eclipse.tycho.nexus.internal.plugin.cache.LatestVersionConverterTest
Tests run: 8, Failures: 0, Errors: 0, Skipped: 4, Time elapsed: 0.04 sec
Running org.eclipse.tycho.nexus.internal.plugin.cache.PathLockTest
Tests run: 1, Failures: 0, Errors: 0, Skipped: 0, Time elapsed: 0.14 sec
Running org.eclipse.tycho.nexus.internal.plugin.cache.UnzipCacheTest
00:01:00.978 [main] WARN  o.e.t.n.internal.plugin.UnzipPlugin - Missing plugin project metadata: /META-INF/maven/org.eclipse.tycho.nexus/unzip-repository-plugin/pom.properties
00:01:00.979 [main] INFO  o.s.s.g.e.internal.DefaultEventBus - Using Reentrant Guava EventBus
00:01:00.979 [main] WARN  o.s.nexus.events.DebugEventInspector - MBean already registered; replacing: org.sonatype.nexus.events:name=DebugEventInspector
00:01:00.981 [main] INFO  o.s.n.p.r.DefaultRepositoryTypeRegistry - Registered default repository types.
00:01:01.062 [main] WARN  o.e.t.n.internal.plugin.UnzipPlugin - Missing plugin project metadata: /META-INF/maven/org.eclipse.tycho.nexus/unzip-repository-plugin/pom.properties
00:01:01.063 [main] INFO  o.s.s.g.e.internal.DefaultEventBus - Using Reentrant Guava EventBus
00:01:01.063 [main] WARN  o.s.nexus.events.DebugEventInspector - MBean already registered; replacing: org.sonatype.nexus.events:name=DebugEventInspector
00:01:01.065 [main] INFO  o.s.n.p.r.DefaultRepositoryTypeRegistry - Registered default repository types.
00:01:01.155 [main] WARN  o.e.t.n.internal.plugin.UnzipPlugin - Missing plugin project metadata: /META-INF/maven/org.eclipse.tycho.nexus/unzip-repository-plugin/pom.properties
00:01:01.156 [main] INFO  o.s.s.g.e.internal.DefaultEventBus - Using Reentrant Guava EventBus
00:01:01.156 [main] WARN  o.s.nexus.events.DebugEventInspector - MBean already registered; replacing: org.sonatype.nexus.events:name=DebugEventInspector
00:01:01.158 [main] INFO  o.s.n.p.r.DefaultRepositoryTypeRegistry - Registered default repository types.
00:01:01.400 [main] WARN  o.e.t.n.internal.plugin.UnzipPlugin - Missing plugin project metadata: /META-INF/maven/org.eclipse.tycho.nexus/unzip-repository-plugin/pom.properties
00:01:01.400 [main] INFO  o.s.s.g.e.internal.DefaultEventBus - Using Reentrant Guava EventBus
00:01:01.401 [main] WARN  o.s.nexus.events.DebugEventInspector - MBean already registered; replacing: org.sonatype.nexus.events:name=DebugEventInspector
00:01:01.402 [main] INFO  o.s.n.p.r.DefaultRepositoryTypeRegistry - Registered default repository types.
00:01:01.503 [main] WARN  o.e.t.n.internal.plugin.UnzipPlugin - Missing plugin project metadata: /META-INF/maven/org.eclipse.tycho.nexus/unzip-repository-plugin/pom.properties
00:01:01.503 [main] INFO  o.s.s.g.e.internal.DefaultEventBus - Using Reentrant Guava EventBus
00:01:01.504 [main] WARN  o.s.nexus.events.DebugEventInspector - MBean already registered; replacing: org.sonatype.nexus.events:name=DebugEventInspector
00:01:01.505 [main] INFO  o.s.n.p.r.DefaultRepositoryTypeRegistry - Registered default repository types.
00:01:01.595 [main] WARN  o.e.t.n.internal.plugin.UnzipPlugin - Missing plugin project metadata: /META-INF/maven/org.eclipse.tycho.nexus/unzip-repository-plugin/pom.properties
00:01:01.596 [main] INFO  o.s.s.g.e.internal.DefaultEventBus - Using Reentrant Guava EventBus
00:01:01.596 [main] WARN  o.s.nexus.events.DebugEventInspector - MBean already registered; replacing: org.sonatype.nexus.events:name=DebugEventInspector
00:01:01.598 [main] INFO  o.s.n.p.r.DefaultRepositoryTypeRegistry - Registered default repository types.
00:01:01.682 [main] WARN  o.e.t.n.internal.plugin.UnzipPlugin - Missing plugin project metadata: /META-INF/maven/org.eclipse.tycho.nexus/unzip-repository-plugin/pom.properties
00:01:01.682 [main] INFO  o.s.s.g.e.internal.DefaultEventBus - Using Reentrant Guava EventBus
00:01:01.683 [main] WARN  o.s.nexus.events.DebugEventInspector - MBean already registered; replacing: org.sonatype.nexus.events:name=DebugEventInspector
00:01:01.684 [main] INFO  o.s.n.p.r.DefaultRepositoryTypeRegistry - Registered default repository types.
Tests run: 7, Failures: 0, Errors: 0, Skipped: 0, Time elapsed: 0.801 sec
Running org.eclipse.tycho.nexus.internal.plugin.cache.RequestPathConverterTest
Tests run: 26, Failures: 0, Errors: 0, Skipped: 0, Time elapsed: 0.025 sec
Running org.eclipse.tycho.nexus.internal.plugin.DefaultUnzipRepositoryAgainstProxyRepositoryTest
00:01:01.803 [main] WARN  o.e.t.n.internal.plugin.UnzipPlugin - Missing plugin project metadata: /META-INF/maven/org.eclipse.tycho.nexus/unzip-repository-plugin/pom.properties
00:01:01.804 [main] INFO  o.s.s.g.e.internal.DefaultEventBus - Using Reentrant Guava EventBus
00:01:01.804 [main] WARN  o.s.nexus.events.DebugEventInspector - MBean already registered; replacing: org.sonatype.nexus.events:name=DebugEventInspector
00:01:01.806 [main] INFO  o.s.n.p.r.DefaultRepositoryTypeRegistry - Registered default repository types.
00:01:01.881 [main] WARN  o.e.t.n.internal.plugin.UnzipPlugin - Missing plugin project metadata: /META-INF/maven/org.eclipse.tycho.nexus/unzip-repository-plugin/pom.properties
00:01:01.882 [main] INFO  o.s.s.g.e.internal.DefaultEventBus - Using Reentrant Guava EventBus
00:01:01.882 [main] WARN  o.s.nexus.events.DebugEventInspector - MBean already registered; replacing: org.sonatype.nexus.events:name=DebugEventInspector
00:01:01.884 [main] INFO  o.s.n.p.r.DefaultRepositoryTypeRegistry - Registered default repository types.
00:01:01.959 [main] WARN  o.e.t.n.internal.plugin.UnzipPlugin - Missing plugin project metadata: /META-INF/maven/org.eclipse.tycho.nexus/unzip-repository-plugin/pom.properties
00:01:01.960 [main] INFO  o.s.s.g.e.internal.DefaultEventBus - Using Reentrant Guava EventBus
00:01:01.960 [main] WARN  o.s.nexus.events.DebugEventInspector - MBean already registered; replacing: org.sonatype.nexus.events:name=DebugEventInspector
00:01:01.962 [main] INFO  o.s.n.p.r.DefaultRepositoryTypeRegistry - Registered default repository types.
00:01:02.029 [main] WARN  o.e.t.n.internal.plugin.UnzipPlugin - Missing plugin project metadata: /META-INF/maven/org.eclipse.tycho.nexus/unzip-repository-plugin/pom.properties
00:01:02.030 [main] INFO  o.s.s.g.e.internal.DefaultEventBus - Using Reentrant Guava EventBus
00:01:02.030 [main] WARN  o.s.nexus.events.DebugEventInspector - MBean already registered; replacing: org.sonatype.nexus.events:name=DebugEventInspector
00:01:02.031 [main] INFO  o.s.n.p.r.DefaultRepositoryTypeRegistry - Registered default repository types.
00:01:02.095 [main] WARN  o.e.t.n.internal.plugin.UnzipPlugin - Missing plugin project metadata: /META-INF/maven/org.eclipse.tycho.nexus/unzip-repository-plugin/pom.properties
00:01:02.095 [main] INFO  o.s.s.g.e.internal.DefaultEventBus - Using Reentrant Guava EventBus
00:01:02.096 [main] WARN  o.s.nexus.events.DebugEventInspector - MBean already registered; replacing: org.sonatype.nexus.events:name=DebugEventInspector
00:01:02.097 [main] INFO  o.s.n.p.r.DefaultRepositoryTypeRegistry - Registered default repository types.
00:01:02.160 [main] WARN  o.e.t.n.internal.plugin.UnzipPlugin - Missing plugin project metadata: /META-INF/maven/org.eclipse.tycho.nexus/unzip-repository-plugin/pom.properties
00:01:02.160 [main] INFO  o.s.s.g.e.internal.DefaultEventBus - Using Reentrant Guava EventBus
00:01:02.160 [main] WARN  o.s.nexus.events.DebugEventInspector - MBean already registered; replacing: org.sonatype.nexus.events:name=DebugEventInspector
00:01:02.162 [main] INFO  o.s.n.p.r.DefaultRepositoryTypeRegistry - Registered default repository types.
00:01:02.226 [main] WARN  o.e.t.n.internal.plugin.UnzipPlugin - Missing plugin project metadata: /META-INF/maven/org.eclipse.tycho.nexus/unzip-repository-plugin/pom.properties
00:01:02.227 [main] INFO  o.s.s.g.e.internal.DefaultEventBus - Using Reentrant Guava EventBus
00:01:02.227 [main] WARN  o.s.nexus.events.DebugEventInspector - MBean already registered; replacing: org.sonatype.nexus.events:name=DebugEventInspector
00:01:02.229 [main] INFO  o.s.n.p.r.DefaultRepositoryTypeRegistry - Registered default repository types.
00:01:02.291 [main] WARN  o.e.t.n.internal.plugin.UnzipPlugin - Missing plugin project metadata: /META-INF/maven/org.eclipse.tycho.nexus/unzip-repository-plugin/pom.properties
00:01:02.291 [main] INFO  o.s.s.g.e.internal.DefaultEventBus - Using Reentrant Guava EventBus
00:01:02.292 [main] WARN  o.s.nexus.events.DebugEventInspector - MBean already registered; replacing: org.sonatype.nexus.events:name=DebugEventInspector
00:01:02.293 [main] INFO  o.s.n.p.r.DefaultRepositoryTypeRegistry - Registered default repository types.
00:01:02.351 [main] WARN  o.e.t.n.internal.plugin.UnzipPlugin - Missing plugin project metadata: /META-INF/maven/org.eclipse.tycho.nexus/unzip-repository-plugin/pom.properties
00:01:02.351 [main] INFO  o.s.s.g.e.internal.DefaultEventBus - Using Reentrant Guava EventBus
00:01:02.352 [main] WARN  o.s.nexus.events.DebugEventInspector - MBean already registered; replacing: org.sonatype.nexus.events:name=DebugEventInspector
00:01:02.353 [main] INFO  o.s.n.p.r.DefaultRepositoryTypeRegistry - Registered default repository types.
00:01:02.411 [main] WARN  o.e.t.n.internal.plugin.UnzipPlugin - Missing plugin project metadata: /META-INF/maven/org.eclipse.tycho.nexus/unzip-repository-plugin/pom.properties
00:01:02.411 [main] INFO  o.s.s.g.e.internal.DefaultEventBus - Using Reentrant Guava EventBus
00:01:02.412 [main] WARN  o.s.nexus.events.DebugEventInspector - MBean already registered; replacing: org.sonatype.nexus.events:name=DebugEventInspector
00:01:02.413 [main] INFO  o.s.n.p.r.DefaultRepositoryTypeRegistry - Registered default repository types.
00:01:02.471 [main] WARN  o.e.t.n.internal.plugin.UnzipPlugin - Missing plugin project metadata: /META-INF/maven/org.eclipse.tycho.nexus/unzip-repository-plugin/pom.properties
00:01:02.471 [main] INFO  o.s.s.g.e.internal.DefaultEventBus - Using Reentrant Guava EventBus
00:01:02.472 [main] WARN  o.s.nexus.events.DebugEventInspector - MBean already registered; replacing: org.sonatype.nexus.events:name=DebugEventInspector
00:01:02.473 [main] INFO  o.s.n.p.r.DefaultRepositoryTypeRegistry - Registered default repository types.
00:01:02.533 [main] WARN  o.e.t.n.internal.plugin.UnzipPlugin - Missing plugin project metadata: /META-INF/maven/org.eclipse.tycho.nexus/unzip-repository-plugin/pom.properties
00:01:02.533 [main] INFO  o.s.s.g.e.internal.DefaultEventBus - Using Reentrant Guava EventBus
00:01:02.534 [main] WARN  o.s.nexus.events.DebugEventInspector - MBean already registered; replacing: org.sonatype.nexus.events:name=DebugEventInspector
00:01:02.535 [main] INFO  o.s.n.p.r.DefaultRepositoryTypeRegistry - Registered default repository types.
00:01:02.593 [main] WARN  o.e.t.n.internal.plugin.UnzipPlugin - Missing plugin project metadata: /META-INF/maven/org.eclipse.tycho.nexus/unzip-repository-plugin/pom.properties
00:01:02.593 [main] INFO  o.s.s.g.e.internal.DefaultEventBus - Using Reentrant Guava EventBus
00:01:02.594 [main] WARN  o.s.nexus.events.DebugEventInspector - MBean already registered; replacing: org.sonatype.nexus.events:name=DebugEventInspector
00:01:02.595 [main] INFO  o.s.n.p.r.DefaultRepositoryTypeRegistry - Registered default repository types.
00:01:02.649 [main] WARN  o.e.t.n.internal.plugin.UnzipPlugin - Missing plugin project metadata: /META-INF/maven/org.eclipse.tycho.nexus/unzip-repository-plugin/pom.properties
00:01:02.650 [main] INFO  o.s.s.g.e.internal.DefaultEventBus - Using Reentrant Guava EventBus
00:01:02.650 [main] WARN  o.s.nexus.events.DebugEventInspector - MBean already registered; replacing: org.sonatype.nexus.events:name=DebugEventInspector
00:01:02.652 [main] INFO  o.s.n.p.r.DefaultRepositoryTypeRegistry - Registered default repository types.
Tests run: 14, Failures: 0, Errors: 0, Skipped: 0, Time elapsed: 0.927 sec
Running org.eclipse.tycho.nexus.internal.plugin.DefaultUnzipRepositoryAgainstHostedRepositoryTest
00:01:02.708 [main] WARN  o.e.t.n.internal.plugin.UnzipPlugin - Missing plugin project metadata: /META-INF/maven/org.eclipse.tycho.nexus/unzip-repository-plugin/pom.properties
00:01:02.709 [main] INFO  o.s.s.g.e.internal.DefaultEventBus - Using Reentrant Guava EventBus
00:01:02.709 [main] WARN  o.s.nexus.events.DebugEventInspector - MBean already registered; replacing: org.sonatype.nexus.events:name=DebugEventInspector
00:01:02.711 [main] INFO  o.s.n.p.r.DefaultRepositoryTypeRegistry - Registered default repository types.
00:01:02.763 [main] WARN  o.e.t.n.internal.plugin.UnzipPlugin - Missing plugin project metadata: /META-INF/maven/org.eclipse.tycho.nexus/unzip-repository-plugin/pom.properties
00:01:02.764 [main] INFO  o.s.s.g.e.internal.DefaultEventBus - Using Reentrant Guava EventBus
00:01:02.764 [main] WARN  o.s.nexus.events.DebugEventInspector - MBean already registered; replacing: org.sonatype.nexus.events:name=DebugEventInspector
00:01:02.766 [main] INFO  o.s.n.p.r.DefaultRepositoryTypeRegistry - Registered default repository types.
00:01:02.817 [main] WARN  o.e.t.n.internal.plugin.UnzipPlugin - Missing plugin project metadata: /META-INF/maven/org.eclipse.tycho.nexus/unzip-repository-plugin/pom.properties
00:01:02.818 [main] INFO  o.s.s.g.e.internal.DefaultEventBus - Using Reentrant Guava EventBus
00:01:02.818 [main] WARN  o.s.nexus.events.DebugEventInspector - MBean already registered; replacing: org.sonatype.nexus.events:name=DebugEventInspector
00:01:02.820 [main] INFO  o.s.n.p.r.DefaultRepositoryTypeRegistry - Registered default repository types.
00:01:02.871 [main] WARN  o.e.t.n.internal.plugin.UnzipPlugin - Missing plugin project metadata: /META-INF/maven/org.eclipse.tycho.nexus/unzip-repository-plugin/pom.properties
00:01:02.871 [main] INFO  o.s.s.g.e.internal.DefaultEventBus - Using Reentrant Guava EventBus
00:01:02.872 [main] WARN  o.s.nexus.events.DebugEventInspector - MBean already registered; replacing: org.sonatype.nexus.events:name=DebugEventInspector
00:01:02.873 [main] INFO  o.s.n.p.r.DefaultRepositoryTypeRegistry - Registered default repository types.
00:01:02.924 [main] WARN  o.e.t.n.internal.plugin.UnzipPlugin - Missing plugin project metadata: /META-INF/maven/org.eclipse.tycho.nexus/unzip-repository-plugin/pom.properties
00:01:02.924 [main] INFO  o.s.s.g.e.internal.DefaultEventBus - Using Reentrant Guava EventBus
00:01:02.925 [main] WARN  o.s.nexus.events.DebugEventInspector - MBean already registered; replacing: org.sonatype.nexus.events:name=DebugEventInspector
00:01:02.926 [main] INFO  o.s.n.p.r.DefaultRepositoryTypeRegistry - Registered default repository types.
00:01:02.975 [main] WARN  o.e.t.n.internal.plugin.UnzipPlugin - Missing plugin project metadata: /META-INF/maven/org.eclipse.tycho.nexus/unzip-repository-plugin/pom.properties
00:01:02.976 [main] INFO  o.s.s.g.e.internal.DefaultEventBus - Using Reentrant Guava EventBus
00:01:02.976 [main] WARN  o.s.nexus.events.DebugEventInspector - MBean already registered; replacing: org.sonatype.nexus.events:name=DebugEventInspector
00:01:02.978 [main] INFO  o.s.n.p.r.DefaultRepositoryTypeRegistry - Registered default repository types.
00:01:03.026 [main] WARN  o.e.t.n.internal.plugin.UnzipPlugin - Missing plugin project metadata: /META-INF/maven/org.eclipse.tycho.nexus/unzip-repository-plugin/pom.properties
00:01:03.027 [main] INFO  o.s.s.g.e.internal.DefaultEventBus - Using Reentrant Guava EventBus
00:01:03.027 [main] WARN  o.s.nexus.events.DebugEventInspector - MBean already registered; replacing: org.sonatype.nexus.events:name=DebugEventInspector
00:01:03.029 [main] INFO  o.s.n.p.r.DefaultRepositoryTypeRegistry - Registered default repository types.
00:01:03.089 [main] WARN  o.e.t.n.internal.plugin.UnzipPlugin - Missing plugin project metadata: /META-INF/maven/org.eclipse.tycho.nexus/unzip-repository-plugin/pom.properties
00:01:03.089 [main] INFO  o.s.s.g.e.internal.DefaultEventBus - Using Reentrant Guava EventBus
00:01:03.090 [main] WARN  o.s.nexus.events.DebugEventInspector - MBean already registered; replacing: org.sonatype.nexus.events:name=DebugEventInspector
00:01:03.091 [main] INFO  o.s.n.p.r.DefaultRepositoryTypeRegistry - Registered default repository types.
00:01:03.145 [main] WARN  o.e.t.n.internal.plugin.UnzipPlugin - Missing plugin project metadata: /META-INF/maven/org.eclipse.tycho.nexus/unzip-repository-plugin/pom.properties
00:01:03.145 [main] INFO  o.s.s.g.e.internal.DefaultEventBus - Using Reentrant Guava EventBus
00:01:03.145 [main] WARN  o.s.nexus.events.DebugEventInspector - MBean already registered; replacing: org.sonatype.nexus.events:name=DebugEventInspector
00:01:03.147 [main] INFO  o.s.n.p.r.DefaultRepositoryTypeRegistry - Registered default repository types.
00:01:03.203 [main] WARN  o.e.t.n.internal.plugin.UnzipPlugin - Missing plugin project metadata: /META-INF/maven/org.eclipse.tycho.nexus/unzip-repository-plugin/pom.properties
00:01:03.203 [main] INFO  o.s.s.g.e.internal.DefaultEventBus - Using Reentrant Guava EventBus
00:01:03.203 [main] WARN  o.s.nexus.events.DebugEventInspector - MBean already registered; replacing: org.sonatype.nexus.events:name=DebugEventInspector
00:01:03.205 [main] INFO  o.s.n.p.r.DefaultRepositoryTypeRegistry - Registered default repository types.
00:01:03.252 [main] WARN  o.e.t.n.internal.plugin.UnzipPlugin - Missing plugin project metadata: /META-INF/maven/org.eclipse.tycho.nexus/unzip-repository-plugin/pom.properties
00:01:03.252 [main] INFO  o.s.s.g.e.internal.DefaultEventBus - Using Reentrant Guava EventBus
00:01:03.253 [main] WARN  o.s.nexus.events.DebugEventInspector - MBean already registered; replacing: org.sonatype.nexus.events:name=DebugEventInspector
00:01:03.254 [main] INFO  o.s.n.p.r.DefaultRepositoryTypeRegistry - Registered default repository types.
00:01:03.300 [main] WARN  o.e.t.n.internal.plugin.UnzipPlugin - Missing plugin project metadata: /META-INF/maven/org.eclipse.tycho.nexus/unzip-repository-plugin/pom.properties
00:01:03.301 [main] INFO  o.s.s.g.e.internal.DefaultEventBus - Using Reentrant Guava EventBus
00:01:03.301 [main] WARN  o.s.nexus.events.DebugEventInspector - MBean already registered; replacing: org.sonatype.nexus.events:name=DebugEventInspector
00:01:03.303 [main] INFO  o.s.n.p.r.DefaultRepositoryTypeRegistry - Registered default repository types.
00:01:03.345 [main] WARN  o.e.t.n.internal.plugin.UnzipPlugin - Missing plugin project metadata: /META-INF/maven/org.eclipse.tycho.nexus/unzip-repository-plugin/pom.properties
00:01:03.345 [main] INFO  o.s.s.g.e.internal.DefaultEventBus - Using Reentrant Guava EventBus
00:01:03.346 [main] WARN  o.s.nexus.events.DebugEventInspector - MBean already registered; replacing: org.sonatype.nexus.events:name=DebugEventInspector
00:01:03.347 [main] INFO  o.s.n.p.r.DefaultRepositoryTypeRegistry - Registered default repository types.
00:01:03.389 [main] WARN  o.e.t.n.internal.plugin.UnzipPlugin - Missing plugin project metadata: /META-INF/maven/org.eclipse.tycho.nexus/unzip-repository-plugin/pom.properties
00:01:03.390 [main] INFO  o.s.s.g.e.internal.DefaultEventBus - Using Reentrant Guava EventBus
00:01:03.390 [main] WARN  o.s.nexus.events.DebugEventInspector - MBean already registered; replacing: org.sonatype.nexus.events:name=DebugEventInspector
00:01:03.392 [main] INFO  o.s.n.p.r.DefaultRepositoryTypeRegistry - Registered default repository types.
00:01:03.434 [main] WARN  o.e.t.n.internal.plugin.UnzipPlugin - Missing plugin project metadata: /META-INF/maven/org.eclipse.tycho.nexus/unzip-repository-plugin/pom.properties
00:01:03.434 [main] INFO  o.s.s.g.e.internal.DefaultEventBus - Using Reentrant Guava EventBus
00:01:03.435 [main] WARN  o.s.nexus.events.DebugEventInspector - MBean already registered; replacing: org.sonatype.nexus.events:name=DebugEventInspector
00:01:03.436 [main] INFO  o.s.n.p.r.DefaultRepositoryTypeRegistry - Registered default repository types.
00:01:03.481 [main] WARN  o.e.t.n.internal.plugin.UnzipPlugin - Missing plugin project metadata: /META-INF/maven/org.eclipse.tycho.nexus/unzip-repository-plugin/pom.properties
00:01:03.482 [main] INFO  o.s.s.g.e.internal.DefaultEventBus - Using Reentrant Guava EventBus
00:01:03.482 [main] WARN  o.s.nexus.events.DebugEventInspector - MBean already registered; replacing: org.sonatype.nexus.events:name=DebugEventInspector
00:01:03.484 [main] INFO  o.s.n.p.r.DefaultRepositoryTypeRegistry - Registered default repository types.
00:01:03.524 [main] WARN  o.e.t.n.internal.plugin.UnzipPlugin - Missing plugin project metadata: /META-INF/maven/org.eclipse.tycho.nexus/unzip-repository-plugin/pom.properties
00:01:03.525 [main] INFO  o.s.s.g.e.internal.DefaultEventBus - Using Reentrant Guava EventBus
00:01:03.525 [main] WARN  o.s.nexus.events.DebugEventInspector - MBean already registered; replacing: org.sonatype.nexus.events:name=DebugEventInspector
00:01:03.527 [main] INFO  o.s.n.p.r.DefaultRepositoryTypeRegistry - Registered default repository types.
00:01:03.568 [main] WARN  o.e.t.n.internal.plugin.UnzipPlugin - Missing plugin project metadata: /META-INF/maven/org.eclipse.tycho.nexus/unzip-repository-plugin/pom.properties
00:01:03.568 [main] INFO  o.s.s.g.e.internal.DefaultEventBus - Using Reentrant Guava EventBus
00:01:03.569 [main] WARN  o.s.nexus.events.DebugEventInspector - MBean already registered; replacing: org.sonatype.nexus.events:name=DebugEventInspector
00:01:03.570 [main] INFO  o.s.n.p.r.DefaultRepositoryTypeRegistry - Registered default repository types.
Tests run: 18, Failures: 0, Errors: 0, Skipped: 0, Time elapsed: 0.92 sec

Results :

Tests run: 98, Failures: 0, Errors: 0, Skipped: 4

[INFO] 
[INFO] --- maven-jar-plugin:2.4:jar (default-jar) @ unzip-repository-plugin ---
[INFO] Building jar: /jobs/genie.tycho/tycho.nexus-sonar/workspace/unzip-repository-plugin/target/unzip-repository-plugin-0.15.0-SNAPSHOT.jar
[INFO] 
[INFO] --- nexus-plugin-bundle-maven-plugin:1.2:create-bundle (default-create-bundle) @ unzip-repository-plugin ---
[INFO] Including 1 dependencies:
[INFO]  + org.apache.maven:maven-artifact:jar:3.0.5
[INFO] Building zip: /jobs/genie.tycho/tycho.nexus-sonar/workspace/unzip-repository-plugin/target/unzip-repository-plugin-0.15.0-SNAPSHOT-bundle.zip
[INFO] 
[INFO] --- maven-install-plugin:2.4:install (default-install) @ unzip-repository-plugin ---
[INFO] Installing /jobs/genie.tycho/tycho.nexus-sonar/workspace/unzip-repository-plugin/target/unzip-repository-plugin-0.15.0-SNAPSHOT.jar to /home/hudson/genie.tycho/.jenkins/jobs/tycho.nexus-sonar/workspace/.repository/org/eclipse/tycho/nexus/unzip-repository-plugin/0.15.0-SNAPSHOT/unzip-repository-plugin-0.15.0-SNAPSHOT.jar
[INFO] Installing /jobs/genie.tycho/tycho.nexus-sonar/workspace/unzip-repository-plugin/pom.xml to /home/hudson/genie.tycho/.jenkins/jobs/tycho.nexus-sonar/workspace/.repository/org/eclipse/tycho/nexus/unzip-repository-plugin/0.15.0-SNAPSHOT/unzip-repository-plugin-0.15.0-SNAPSHOT.pom
[INFO] Installing /jobs/genie.tycho/tycho.nexus-sonar/workspace/unzip-repository-plugin/target/unzip-repository-plugin-0.15.0-SNAPSHOT-bundle.zip to /home/hudson/genie.tycho/.jenkins/jobs/tycho.nexus-sonar/workspace/.repository/org/eclipse/tycho/nexus/unzip-repository-plugin/0.15.0-SNAPSHOT/unzip-repository-plugin-0.15.0-SNAPSHOT-bundle.zip
[INFO]                                                                         
[INFO] ------------------------------------------------------------------------
[INFO] Building Nexus Unzip Plugin - Integration Tests (Incubation) 0.15.0-SNAPSHOT
[INFO] ------------------------------------------------------------------------
[INFO] 
[INFO] --- maven-clean-plugin:2.4.1:clean (default-clean) @ unzip-repository-plugin-its ---
[INFO] Deleting /jobs/genie.tycho/tycho.nexus-sonar/workspace/unzip-repository-plugin-its/target
[INFO] 
[INFO] --- maven-enforcer-plugin:1.3.1:enforce (enforce-environment) @ unzip-repository-plugin-its ---
[INFO] 
[INFO] --- maven-resources-plugin:2.5:resources (default-resources) @ unzip-repository-plugin-its ---
[debug] execute contextualize
[INFO] Using 'UTF-8' encoding to copy filtered resources.
[INFO] Copying 1 resource
[INFO] Copying 0 resource
[INFO] 
[INFO] --- maven-compiler-plugin:2.5.1:compile (default-compile) @ unzip-repository-plugin-its ---
[INFO] No sources to compile
[INFO] 
[INFO] --- maven-resources-plugin:2.5:testResources (default-testResources) @ unzip-repository-plugin-its ---
[debug] execute contextualize
[INFO] Using 'UTF-8' encoding to copy filtered resources.
[INFO] Copying 1 resource
[INFO] 
[INFO] --- maven-compiler-plugin:2.5.1:testCompile (default-testCompile) @ unzip-repository-plugin-its ---
[INFO] Compiling 5 source files to /jobs/genie.tycho/tycho.nexus-sonar/workspace/unzip-repository-plugin-its/target/test-classes
[INFO] 
[INFO] --- maven-surefire-plugin:2.10:test (default-test) @ unzip-repository-plugin-its ---
[INFO] Surefire report directory: /jobs/genie.tycho/tycho.nexus-sonar/workspace/unzip-repository-plugin-its/target/surefire-reports

-------------------------------------------------------
 T E S T S
-------------------------------------------------------
Picked up JAVA_TOOL_OPTIONS: -Xmx2G -Djava.io.tmpdir=/tmp/genie.tycho

Results :

Tests run: 0, Failures: 0, Errors: 0, Skipped: 0

[INFO] 
[INFO] --- maven-failsafe-plugin:2.12.4:integration-test (default) @ unzip-repository-plugin-its ---
[INFO] Failsafe report directory: /jobs/genie.tycho/tycho.nexus-sonar/workspace/unzip-repository-plugin-its/target/failsafe-reports

-------------------------------------------------------
 T E S T S
-------------------------------------------------------
Picked up JAVA_TOOL_OPTIONS: -Xmx2G -Djava.io.tmpdir=/tmp/genie.tycho
Running org.eclipse.tycho.nexus.internal.plugin.UnzipRepositoryPluginITCase
00:01:09.310 INFO [main] org.eclipse.tycho.nexus.internal.plugin.UnzipRepositoryPluginITCase - TEST testListOnGroupIdFolderInUnzipRepository[0] STARTING
00:01:13.292 INFO [main] org.eclipse.tycho.nexus.internal.plugin.UnzipRepositoryPluginITCase - TEST testListOnGroupIdFolderInUnzipRepository[0] is running against Nexus bundle org.sonatype.nexus.assemblies:nexus-bundle-template:zip:bundle:2.8.0-05
00:01:13.734 INFO [main] org.sonatype.nexus.testsuite.support.NexusRunningITSupport - Starting Nexus (nexus bundle [id: nx] [not running])
00:01:16.321 INFO [main] org.sonatype.nexus.bundle.launcher.support.DefaultNexusBundle - nexus (nx) spawned env [org.sonatype.nexus.bootstrap.monitor.CommandMonitorThread.port=55603,org.sonatype.nexus.bootstrap.monitor.KeepAliveThread.port=41246]
00:01:16.327 INFO [main] org.sonatype.nexus.bundle.launcher.support.DefaultNexusBundle - nexus (nx) pinging command monitor at 127.0.0.1:55603
00:01:18.332 INFO [main] org.sonatype.nexus.bundle.launcher.support.DefaultNexusBundle - nexus (nx) waiting to boot for 60 seconds
00:01:42.443 INFO [main] org.sonatype.nexus.bundle.launcher.support.DefaultNexusBundle - nexus (nx) is running at http://127.0.0.1:41015/nexus/
00:01:43.775 INFO [main] org.eclipse.tycho.nexus.internal.plugin.UnzipRepositoryPluginITCase - TEST testListOnGroupIdFolderInUnzipRepository[0] SUCCEEDED
00:01:43.775 INFO [main] org.eclipse.tycho.nexus.internal.plugin.UnzipRepositoryPluginITCase - TEST testListOnGroupIdFolderInUnzipRepository[0] FINISHED
00:01:43.777 INFO [main] org.eclipse.tycho.nexus.internal.plugin.UnzipRepositoryPluginITCase - TEST testCreateChangeStatusAndRemoveUnzipRepositoryAfterNexusStarted[0] STARTING
00:01:43.949 INFO [main] org.eclipse.tycho.nexus.internal.plugin.UnzipRepositoryPluginITCase - TEST testCreateChangeStatusAndRemoveUnzipRepositoryAfterNexusStarted[0] is running against Nexus bundle org.sonatype.nexus.assemblies:nexus-bundle-template:zip:bundle:2.8.0-05
00:01:45.967 INFO [main] org.eclipse.tycho.nexus.internal.plugin.UnzipRepositoryPluginITCase - TEST testCreateChangeStatusAndRemoveUnzipRepositoryAfterNexusStarted[0] SUCCEEDED
00:01:45.967 INFO [main] org.eclipse.tycho.nexus.internal.plugin.UnzipRepositoryPluginITCase - TEST testCreateChangeStatusAndRemoveUnzipRepositoryAfterNexusStarted[0] FINISHED
00:01:45.969 INFO [main] org.eclipse.tycho.nexus.internal.plugin.UnzipRepositoryPluginITCase - TEST testListArchiveContentInUnzipRepository[0] STARTING
00:01:46.102 INFO [main] org.eclipse.tycho.nexus.internal.plugin.UnzipRepositoryPluginITCase - TEST testListArchiveContentInUnzipRepository[0] is running against Nexus bundle org.sonatype.nexus.assemblies:nexus-bundle-template:zip:bundle:2.8.0-05
00:01:46.435 INFO [main] org.eclipse.tycho.nexus.internal.plugin.UnzipRepositoryPluginITCase - TEST testListArchiveContentInUnzipRepository[0] SUCCEEDED
00:01:46.435 INFO [main] org.eclipse.tycho.nexus.internal.plugin.UnzipRepositoryPluginITCase - TEST testListArchiveContentInUnzipRepository[0] FINISHED
00:01:46.436 INFO [main] org.eclipse.tycho.nexus.internal.plugin.UnzipRepositoryPluginITCase - TEST testGetArtifactFromUnzipRepoWithVirtualSnapshotVersion[0] STARTING
00:01:46.566 INFO [main] org.eclipse.tycho.nexus.internal.plugin.UnzipRepositoryPluginITCase - TEST testGetArtifactFromUnzipRepoWithVirtualSnapshotVersion[0] is running against Nexus bundle org.sonatype.nexus.assemblies:nexus-bundle-template:zip:bundle:2.8.0-05
00:01:54.436 INFO [main] org.eclipse.tycho.nexus.internal.plugin.UnzipRepositoryPluginITCase - TEST testGetArtifactFromUnzipRepoWithVirtualSnapshotVersion[0] SUCCEEDED
00:01:54.436 INFO [main] org.eclipse.tycho.nexus.internal.plugin.UnzipRepositoryPluginITCase - TEST testGetArtifactFromUnzipRepoWithVirtualSnapshotVersion[0] FINISHED
00:01:54.437 INFO [main] org.eclipse.tycho.nexus.internal.plugin.UnzipRepositoryPluginITCase - TEST testListArchiveContentWithNestedFoldersInUnzipRepository[0] STARTING
00:01:54.560 INFO [main] org.eclipse.tycho.nexus.internal.plugin.UnzipRepositoryPluginITCase - TEST testListArchiveContentWithNestedFoldersInUnzipRepository[0] is running against Nexus bundle org.sonatype.nexus.assemblies:nexus-bundle-template:zip:bundle:2.8.0-05
00:01:57.914 INFO [main] org.eclipse.tycho.nexus.internal.plugin.UnzipRepositoryPluginITCase - TEST testListArchiveContentWithNestedFoldersInUnzipRepository[0] SUCCEEDED
00:01:57.914 INFO [main] org.eclipse.tycho.nexus.internal.plugin.UnzipRepositoryPluginITCase - TEST testListArchiveContentWithNestedFoldersInUnzipRepository[0] FINISHED
00:01:57.914 INFO [main] org.eclipse.tycho.nexus.internal.plugin.UnzipRepositoryPluginITCase - TEST testGetArtifactFromUnzipRepoWithGroupRepoAsMaster[0] STARTING
00:01:58.019 INFO [main] org.eclipse.tycho.nexus.internal.plugin.UnzipRepositoryPluginITCase - TEST testGetArtifactFromUnzipRepoWithGroupRepoAsMaster[0] is running against Nexus bundle org.sonatype.nexus.assemblies:nexus-bundle-template:zip:bundle:2.8.0-05
00:01:58.410 INFO [main] org.eclipse.tycho.nexus.internal.plugin.UnzipRepositoryPluginITCase - TEST testGetArtifactFromUnzipRepoWithGroupRepoAsMaster[0] SUCCEEDED
00:01:58.410 INFO [main] org.eclipse.tycho.nexus.internal.plugin.UnzipRepositoryPluginITCase - TEST testGetArtifactFromUnzipRepoWithGroupRepoAsMaster[0] FINISHED
00:01:58.411 INFO [main] org.eclipse.tycho.nexus.internal.plugin.UnzipRepositoryPluginITCase - TEST testGetArtifactFromUnzipRepoWithHostedRepoAsMaster[0] STARTING
00:01:58.526 INFO [main] org.eclipse.tycho.nexus.internal.plugin.UnzipRepositoryPluginITCase - TEST testGetArtifactFromUnzipRepoWithHostedRepoAsMaster[0] is running against Nexus bundle org.sonatype.nexus.assemblies:nexus-bundle-template:zip:bundle:2.8.0-05
00:02:00.249 INFO [main] org.eclipse.tycho.nexus.internal.plugin.UnzipRepositoryPluginITCase - TEST testGetArtifactFromUnzipRepoWithHostedRepoAsMaster[0] SUCCEEDED
00:02:00.249 INFO [main] org.eclipse.tycho.nexus.internal.plugin.UnzipRepositoryPluginITCase - TEST testGetArtifactFromUnzipRepoWithHostedRepoAsMaster[0] FINISHED
00:02:00.250 INFO [main] org.eclipse.tycho.nexus.internal.plugin.UnzipRepositoryPluginITCase - TEST testListOnFolderContainingArchiveInUnzipRepository[0] STARTING
00:02:00.351 INFO [main] org.eclipse.tycho.nexus.internal.plugin.UnzipRepositoryPluginITCase - TEST testListOnFolderContainingArchiveInUnzipRepository[0] is running against Nexus bundle org.sonatype.nexus.assemblies:nexus-bundle-template:zip:bundle:2.8.0-05
00:02:03.472 INFO [main] org.eclipse.tycho.nexus.internal.plugin.UnzipRepositoryPluginITCase - TEST testListOnFolderContainingArchiveInUnzipRepository[0] SUCCEEDED
00:02:03.472 INFO [main] org.eclipse.tycho.nexus.internal.plugin.UnzipRepositoryPluginITCase - TEST testListOnFolderContainingArchiveInUnzipRepository[0] FINISHED
00:02:03.473 INFO [main] org.eclipse.tycho.nexus.internal.plugin.UnzipRepositoryPluginITCase - TEST testListOnGroupIdFolderInUnzipRepository[1] STARTING
00:02:03.556 INFO [main] org.eclipse.tycho.nexus.internal.plugin.UnzipRepositoryPluginITCase - TEST testListOnGroupIdFolderInUnzipRepository[1] is running against Nexus bundle org.sonatype.nexus.assemblies:nexus-bundle-template:zip:bundle:2.11.1-01
00:02:03.585 INFO [main] org.sonatype.nexus.testsuite.support.NexusRunningITSupport - Stopping Nexus (nexus bundle [id: nx] [running] [http://127.0.0.1:41015/nexus/])
00:02:14.617 INFO [main] org.sonatype.nexus.testsuite.support.NexusRunningITSupport - Starting Nexus (nexus bundle [id: nx] [not running])
00:02:16.660 INFO [main] org.sonatype.nexus.bundle.launcher.support.DefaultNexusBundle - nexus (nx) spawned env [org.sonatype.nexus.bundle.launcher.internal.NexusITLauncher.monitor.port=59318,org.sonatype.nexus.bootstrap.monitor.KeepAliveThread.port=49844]
00:02:16.663 INFO [main] org.sonatype.nexus.bundle.launcher.support.DefaultNexusBundle - nexus (nx) pinging command monitor at 127.0.0.1:59318
00:02:18.665 INFO [main] org.sonatype.nexus.bundle.launcher.support.DefaultNexusBundle - nexus (nx) waiting to boot for 60 seconds
00:02:37.038 INFO [main] org.sonatype.nexus.bundle.launcher.support.DefaultNexusBundle - nexus (nx) is running at http://127.0.0.1:40959/nexus/
00:02:37.687 INFO [main] org.eclipse.tycho.nexus.internal.plugin.UnzipRepositoryPluginITCase - TEST testListOnGroupIdFolderInUnzipRepository[1] SUCCEEDED
00:02:37.687 INFO [main] org.eclipse.tycho.nexus.internal.plugin.UnzipRepositoryPluginITCase - TEST testListOnGroupIdFolderInUnzipRepository[1] FINISHED
00:02:37.688 INFO [main] org.eclipse.tycho.nexus.internal.plugin.UnzipRepositoryPluginITCase - TEST testCreateChangeStatusAndRemoveUnzipRepositoryAfterNexusStarted[1] STARTING
00:02:37.773 INFO [main] org.eclipse.tycho.nexus.internal.plugin.UnzipRepositoryPluginITCase - TEST testCreateChangeStatusAndRemoveUnzipRepositoryAfterNexusStarted[1] is running against Nexus bundle org.sonatype.nexus.assemblies:nexus-bundle-template:zip:bundle:2.11.1-01
00:02:39.335 INFO [main] org.eclipse.tycho.nexus.internal.plugin.UnzipRepositoryPluginITCase - TEST testCreateChangeStatusAndRemoveUnzipRepositoryAfterNexusStarted[1] SUCCEEDED
00:02:39.335 INFO [main] org.eclipse.tycho.nexus.internal.plugin.UnzipRepositoryPluginITCase - TEST testCreateChangeStatusAndRemoveUnzipRepositoryAfterNexusStarted[1] FINISHED
00:02:39.335 INFO [main] org.eclipse.tycho.nexus.internal.plugin.UnzipRepositoryPluginITCase - TEST testListArchiveContentInUnzipRepository[1] STARTING
00:02:39.425 INFO [main] org.eclipse.tycho.nexus.internal.plugin.UnzipRepositoryPluginITCase - TEST testListArchiveContentInUnzipRepository[1] is running against Nexus bundle org.sonatype.nexus.assemblies:nexus-bundle-template:zip:bundle:2.11.1-01
00:02:39.737 INFO [main] org.eclipse.tycho.nexus.internal.plugin.UnzipRepositoryPluginITCase - TEST testListArchiveContentInUnzipRepository[1] SUCCEEDED
00:02:39.737 INFO [main] org.eclipse.tycho.nexus.internal.plugin.UnzipRepositoryPluginITCase - TEST testListArchiveContentInUnzipRepository[1] FINISHED
00:02:39.738 INFO [main] org.eclipse.tycho.nexus.internal.plugin.UnzipRepositoryPluginITCase - TEST testGetArtifactFromUnzipRepoWithVirtualSnapshotVersion[1] STARTING
00:02:39.814 INFO [main] org.eclipse.tycho.nexus.internal.plugin.UnzipRepositoryPluginITCase - TEST testGetArtifactFromUnzipRepoWithVirtualSnapshotVersion[1] is running against Nexus bundle org.sonatype.nexus.assemblies:nexus-bundle-template:zip:bundle:2.11.1-01
00:02:40.206 INFO [main] org.eclipse.tycho.nexus.internal.plugin.UnzipRepositoryPluginITCase - TEST testGetArtifactFromUnzipRepoWithVirtualSnapshotVersion[1] SUCCEEDED
00:02:40.206 INFO [main] org.eclipse.tycho.nexus.internal.plugin.UnzipRepositoryPluginITCase - TEST testGetArtifactFromUnzipRepoWithVirtualSnapshotVersion[1] FINISHED
00:02:40.207 INFO [main] org.eclipse.tycho.nexus.internal.plugin.UnzipRepositoryPluginITCase - TEST testListArchiveContentWithNestedFoldersInUnzipRepository[1] STARTING
00:02:40.284 INFO [main] org.eclipse.tycho.nexus.internal.plugin.UnzipRepositoryPluginITCase - TEST testListArchiveContentWithNestedFoldersInUnzipRepository[1] is running against Nexus bundle org.sonatype.nexus.assemblies:nexus-bundle-template:zip:bundle:2.11.1-01
00:02:40.667 INFO [main] org.eclipse.tycho.nexus.internal.plugin.UnzipRepositoryPluginITCase - TEST testListArchiveContentWithNestedFoldersInUnzipRepository[1] SUCCEEDED
00:02:40.667 INFO [main] org.eclipse.tycho.nexus.internal.plugin.UnzipRepositoryPluginITCase - TEST testListArchiveContentWithNestedFoldersInUnzipRepository[1] FINISHED
00:02:40.667 INFO [main] org.eclipse.tycho.nexus.internal.plugin.UnzipRepositoryPluginITCase - TEST testGetArtifactFromUnzipRepoWithGroupRepoAsMaster[1] STARTING
00:02:40.747 INFO [main] org.eclipse.tycho.nexus.internal.plugin.UnzipRepositoryPluginITCase - TEST testGetArtifactFromUnzipRepoWithGroupRepoAsMaster[1] is running against Nexus bundle org.sonatype.nexus.assemblies:nexus-bundle-template:zip:bundle:2.11.1-01
00:02:41.141 INFO [main] org.eclipse.tycho.nexus.internal.plugin.UnzipRepositoryPluginITCase - TEST testGetArtifactFromUnzipRepoWithGroupRepoAsMaster[1] SUCCEEDED
00:02:41.141 INFO [main] org.eclipse.tycho.nexus.internal.plugin.UnzipRepositoryPluginITCase - TEST testGetArtifactFromUnzipRepoWithGroupRepoAsMaster[1] FINISHED
00:02:41.141 INFO [main] org.eclipse.tycho.nexus.internal.plugin.UnzipRepositoryPluginITCase - TEST testGetArtifactFromUnzipRepoWithHostedRepoAsMaster[1] STARTING
00:02:41.211 INFO [main] org.eclipse.tycho.nexus.internal.plugin.UnzipRepositoryPluginITCase - TEST testGetArtifactFromUnzipRepoWithHostedRepoAsMaster[1] is running against Nexus bundle org.sonatype.nexus.assemblies:nexus-bundle-template:zip:bundle:2.11.1-01
00:02:41.634 INFO [main] org.eclipse.tycho.nexus.internal.plugin.UnzipRepositoryPluginITCase - TEST testGetArtifactFromUnzipRepoWithHostedRepoAsMaster[1] SUCCEEDED
00:02:41.635 INFO [main] org.eclipse.tycho.nexus.internal.plugin.UnzipRepositoryPluginITCase - TEST testGetArtifactFromUnzipRepoWithHostedRepoAsMaster[1] FINISHED
00:02:41.637 INFO [main] org.eclipse.tycho.nexus.internal.plugin.UnzipRepositoryPluginITCase - TEST testListOnFolderContainingArchiveInUnzipRepository[1] STARTING
00:02:41.726 INFO [main] org.eclipse.tycho.nexus.internal.plugin.UnzipRepositoryPluginITCase - TEST testListOnFolderContainingArchiveInUnzipRepository[1] is running against Nexus bundle org.sonatype.nexus.assemblies:nexus-bundle-template:zip:bundle:2.11.1-01
00:02:41.983 INFO [main] org.eclipse.tycho.nexus.internal.plugin.UnzipRepositoryPluginITCase - TEST testListOnFolderContainingArchiveInUnzipRepository[1] SUCCEEDED
00:02:41.983 INFO [main] org.eclipse.tycho.nexus.internal.plugin.UnzipRepositoryPluginITCase - TEST testListOnFolderContainingArchiveInUnzipRepository[1] FINISHED
00:02:41.984 INFO [main] org.sonatype.nexus.testsuite.support.NexusRunningITSupport - Stopping Nexus (nexus bundle [id: nx] [running] [http://127.0.0.1:40959/nexus/])
Tests run: 16, Failures: 0, Errors: 0, Skipped: 0, Time elapsed: 99.156 sec

Results :

Tests run: 16, Failures: 0, Errors: 0, Skipped: 0

[INFO] 
[INFO] --- maven-failsafe-plugin:2.12.4:verify (default) @ unzip-repository-plugin-its ---
[INFO] Failsafe report directory: /jobs/genie.tycho/tycho.nexus-sonar/workspace/unzip-repository-plugin-its/target/failsafe-reports
[INFO] ------------------------------------------------------------------------
[INFO] Reactor Summary:
[INFO] 
[INFO] Nexus Unzip Plugin - Parent (Incubation) .......... SUCCESS [6.193s]
[INFO] Nexus Unzip Plugin (Incubation) ................... SUCCESS [44.754s]
[INFO] Nexus Unzip Plugin - Integration Tests (Incubation)  SUCCESS [1:43.385s]
[INFO] ------------------------------------------------------------------------
[INFO] BUILD SUCCESS
[INFO] ------------------------------------------------------------------------
[INFO] Total time: 2:41.732s
[INFO] Finished at: Sun Jul 07 00:02:48 EDT 2019
[INFO] Final Memory: 44M/1931M
[INFO] ------------------------------------------------------------------------
[workspace] $ mvn -f /home/hudson/genie.tycho/.jenkins/jobs/tycho.nexus-sonar/workspace/pom.xml -e -B sonar:sonar -Dmaven.repo.local=/home/hudson/genie.tycho/.jenkins/jobs/tycho.nexus-sonar/workspace/.maven/repo -Dsonar.jdbc.url=jdbc:mysql://dbmaster:3306/sonar?autoReconnect=true&useUnicode=true&characterEncoding=utf8 ******** ******** -Dsonar.host.url=https://sonar.eclipse.org
FATAL: command execution failed
java.io.IOException: error=2, No such file or directory
	at java.lang.UNIXProcess.forkAndExec(Native Method)
	at java.lang.UNIXProcess.<init>(UNIXProcess.java:247)
	at java.lang.ProcessImpl.start(ProcessImpl.java:134)
	at java.lang.ProcessBuilder.start(ProcessBuilder.java:1029)
Caused: java.io.IOException: Cannot run program "mvn" (in directory "/home/hudson/genie.tycho/.jenkins/jobs/tycho.nexus-sonar/workspace"): error=2, No such file or directory
	at java.lang.ProcessBuilder.start(ProcessBuilder.java:1048)
	at hudson.Proc$LocalProc.<init>(Proc.java:249)
	at hudson.Proc$LocalProc.<init>(Proc.java:218)
	at hudson.Launcher$LocalLauncher.launch(Launcher.java:936)
	at hudson.Launcher$ProcStarter.start(Launcher.java:455)
	at hudson.Launcher$ProcStarter.join(Launcher.java:466)
	at hudson.tasks.Maven.perform(Maven.java:368)
	at hudson.plugins.sonar.utils.SonarMaven.executeMaven(SonarMaven.java:185)
	at hudson.plugins.sonar.SonarPublisher.executeSonar(SonarPublisher.java:370)
	at hudson.plugins.sonar.SonarPublisher.perform(SonarPublisher.java:328)
	at hudson.tasks.BuildStepMonitor$3.perform(BuildStepMonitor.java:45)
	at hudson.model.AbstractBuild$AbstractBuildExecution.perform(AbstractBuild.java:744)
	at hudson.model.AbstractBuild$AbstractBuildExecution.performAllBuildSteps(AbstractBuild.java:690)
	at hudson.model.Build$BuildExecution.post2(Build.java:186)
	at hudson.model.AbstractBuild$AbstractBuildExecution.post(AbstractBuild.java:635)
	at hudson.model.Run.execute(Run.java:1835)
	at hudson.model.FreeStyleBuild.run(FreeStyleBuild.java:43)
	at hudson.model.ResourceController.execute(ResourceController.java:97)
	at hudson.model.Executor.run(Executor.java:429)
SonarQube analysis completed: FAILURE
Build step 'SonarQube analysis with Maven' changed build result to FAILURE
Build step 'SonarQube analysis with Maven' marked build as failure
Started calculate disk usage of build
Finished Calculation of disk usage of build in 0 seconds
Started calculate disk usage of workspace
Finished Calculation of disk usage of workspace in 0 seconds
Finished: FAILURE