FailedConsole Output

Skipping 131 KB.. Full Log
 kB | 20/32 kB
Progress (3): 225 kB | 46/177 kB | 24/32 kB
Progress (3): 225 kB | 50/177 kB | 24/32 kB
Progress (3): 225 kB | 50/177 kB | 29/32 kB
Progress (3): 225 kB | 54/177 kB | 29/32 kB
Progress (3): 225 kB | 56/177 kB | 29/32 kB
Progress (3): 225 kB | 60/177 kB | 29/32 kB
Progress (3): 225 kB | 64/177 kB | 29/32 kB
Progress (3): 225 kB | 68/177 kB | 29/32 kB
Progress (3): 225 kB | 71/177 kB | 29/32 kB
                                           
Downloaded from repository.sonatype.org: https://repository.sonatype.org/content/groups/forge/org/codehaus/plexus/plexus-utils/2.1/plexus-utils-2.1.jar (225 kB at 123 kB/s)
Downloading from repository.sonatype.org: https://repository.sonatype.org/content/groups/forge/org/apache/maven/maven-artifact-manager/2.0.2/maven-artifact-manager-2.0.2.jar
Progress (3): 71/177 kB | 29/32 kB | 1.1/31 kB
Progress (3): 71/177 kB | 29/32 kB | 4.0/31 kB
Progress (3): 71/177 kB | 29/32 kB | 8.1/31 kB
Progress (3): 71/177 kB | 31/32 kB | 8.1/31 kB
Progress (3): 71/177 kB | 32 kB | 8.1/31 kB   
Progress (3): 75/177 kB | 32 kB | 8.1/31 kB
Progress (3): 80/177 kB | 32 kB | 8.1/31 kB
Progress (3): 84/177 kB | 32 kB | 8.1/31 kB
Progress (3): 88/177 kB | 32 kB | 8.1/31 kB
Progress (3): 92/177 kB | 32 kB | 8.1/31 kB
Progress (3): 96/177 kB | 32 kB | 8.1/31 kB
Progress (3): 100/177 kB | 32 kB | 8.1/31 kB
Progress (3): 104/177 kB | 32 kB | 8.1/31 kB
Progress (3): 108/177 kB | 32 kB | 8.1/31 kB
Progress (3): 112/177 kB | 32 kB | 8.1/31 kB
Progress (3): 112/177 kB | 32 kB | 11/31 kB 
Progress (3): 112/177 kB | 32 kB | 13/31 kB
Progress (3): 112/177 kB | 32 kB | 17/31 kB
Progress (3): 116/177 kB | 32 kB | 17/31 kB
Progress (3): 120/177 kB | 32 kB | 17/31 kB
Progress (3): 125/177 kB | 32 kB | 17/31 kB
Progress (3): 129/177 kB | 32 kB | 17/31 kB
Progress (3): 133/177 kB | 32 kB | 17/31 kB
Progress (3): 137/177 kB | 32 kB | 17/31 kB
Progress (3): 141/177 kB | 32 kB | 17/31 kB
Progress (3): 145/177 kB | 32 kB | 17/31 kB
Progress (3): 149/177 kB | 32 kB | 17/31 kB
Progress (3): 151/177 kB | 32 kB | 17/31 kB
Progress (3): 155/177 kB | 32 kB | 17/31 kB
Progress (3): 159/177 kB | 32 kB | 17/31 kB
Progress (3): 163/177 kB | 32 kB | 17/31 kB
Progress (3): 167/177 kB | 32 kB | 17/31 kB
Progress (3): 172/177 kB | 32 kB | 17/31 kB
Progress (3): 176/177 kB | 32 kB | 17/31 kB
Progress (3): 177 kB | 32 kB | 17/31 kB    
Progress (3): 177 kB | 32 kB | 21/31 kB
Progress (3): 177 kB | 32 kB | 25/31 kB
Progress (3): 177 kB | 32 kB | 29/31 kB
Progress (3): 177 kB | 32 kB | 31 kB   
                                    
Downloaded from repository.sonatype.org: https://repository.sonatype.org/content/groups/forge/org/codehaus/plexus/plexus-archiver/1.0-alpha-12/plexus-archiver-1.0-alpha-12.jar (177 kB at 92 kB/s)
Downloading from repository.sonatype.org: https://repository.sonatype.org/content/groups/forge/org/apache/maven/wagon/wagon-provider-api/1.0-alpha-6/wagon-provider-api-1.0-alpha-6.jar
Downloading from repository.sonatype.org: https://repository.sonatype.org/content/groups/forge/org/apache/maven/shared/maven-filtering/1.0-beta-2/maven-filtering-1.0-beta-2.jar
Downloading from repository.sonatype.org: https://repository.sonatype.org/content/groups/forge/org/apache/maven/maven-monitor/2.0.6/maven-monitor-2.0.6.jar
Downloading from repository.sonatype.org: https://repository.sonatype.org/content/groups/forge/org/codehaus/plexus/plexus-active-collections/1.0-beta-2/plexus-active-collections-1.0-beta-2.jar
Downloading from repository.sonatype.org: https://repository.sonatype.org/content/groups/forge/org/codehaus/plexus/plexus-io/1.0-alpha-4/plexus-io-1.0-alpha-4.jar
[WARNING] Could not validate integrity of download from https://repository.sonatype.org/content/groups/forge/org/apache/maven/shared/maven-plugin-testing-harness/1.1/maven-plugin-testing-harness-1.1.jar: Checksum validation failed, no checksums available
[WARNING] Checksum validation failed, no checksums available from repository.sonatype.org for https://repository.sonatype.org/content/groups/forge/org/apache/maven/shared/maven-plugin-testing-harness/1.1/maven-plugin-testing-harness-1.1.jar
Downloading from repository.sonatype.org: https://repository.sonatype.org/content/groups/forge/org/apache/maven/maven-project/2.0.4/maven-project-2.0.4.jar
Downloaded from repository.sonatype.org: https://repository.sonatype.org/content/groups/forge/org/apache/maven/shared/maven-plugin-testing-harness/1.1/maven-plugin-testing-harness-1.1.jar (32 kB at 15 kB/s)
Downloading from repository.sonatype.org: https://repository.sonatype.org/content/groups/forge/org/apache/maven/maven-profile/2.0.4/maven-profile-2.0.4.jar
Progress (2): 31 kB | 3.8/21 kB
Progress (2): 31 kB | 4.0/21 kB
Progress (2): 31 kB | 8.1/21 kB
Progress (2): 31 kB | 9.8/21 kB
[WARNING] Could not validate integrity of download from https://repository.sonatype.org/content/groups/forge/org/apache/maven/shared/file-management/1.1/file-management-1.1.jar: Checksum validation failed, no checksums available
                               
[WARNING] Checksum validation failed, no checksums available from repository.sonatype.org for https://repository.sonatype.org/content/groups/forge/org/apache/maven/shared/file-management/1.1/file-management-1.1.jar
Downloaded from repository.sonatype.org: https://repository.sonatype.org/content/groups/forge/org/apache/maven/shared/file-management/1.1/file-management-1.1.jar (31 kB at 14 kB/s)
Downloading from repository.sonatype.org: https://repository.sonatype.org/content/groups/forge/org/apache/maven/maven-archiver/2.4/maven-archiver-2.4.jar
Progress (1): 14/21 kB
Progress (1): 17/21 kB
Progress (1): 21 kB   
                   
Downloaded from repository.sonatype.org: https://repository.sonatype.org/content/groups/forge/org/codehaus/plexus/plexus-active-collections/1.0-beta-2/plexus-active-collections-1.0-beta-2.jar (21 kB at 9.0 kB/s)
Downloading from repository.sonatype.org: https://repository.sonatype.org/content/groups/forge/org/codehaus/plexus/plexus-container-default/1.0-alpha-9-stable-1/plexus-container-default-1.0-alpha-9-stable-1.jar
Downloading from repository.sonatype.org: https://repository.sonatype.org/content/groups/forge/junit/junit/3.8.1/junit-3.8.1.jar
Progress (1): 3.8/194 kB
Progress (1): 4.0/194 kB
Progress (1): 8.1/194 kB
Progress (1): 11/194 kB 
Progress (1): 15/194 kB
Progress (1): 18/194 kB
Progress (1): 23/194 kB
Progress (1): 27/194 kB
Progress (1): 27/194 kB
Progress (1): 31/194 kB
Progress (2): 31/194 kB | 1.1/48 kB
Progress (2): 31/194 kB | 5.2/48 kB
Progress (2): 31/194 kB | 5.5/48 kB
Progress (2): 31/194 kB | 9.6/48 kB
                                   
Downloading from repository.sonatype.org: https://repository.sonatype.org/content/groups/forge/classworlds/classworlds/1.1-alpha-2/classworlds-1.1-alpha-2.jar
Progress (2): 35/194 kB | 9.6/48 kB
Progress (2): 37/194 kB | 9.6/48 kB
Progress (2): 41/194 kB | 9.6/48 kB
Progress (2): 46/194 kB | 9.6/48 kB
Progress (2): 50/194 kB | 9.6/48 kB
Progress (2): 54/194 kB | 9.6/48 kB
Progress (2): 54/194 kB | 11/48 kB 
Progress (2): 54/194 kB | 14/48 kB
Progress (2): 54/194 kB | 18/48 kB
Progress (3): 54/194 kB | 18/48 kB | 1.1/20 kB
Progress (3): 54/194 kB | 18/48 kB | 4.0/20 kB
Progress (3): 54/194 kB | 18/48 kB | 8.1/20 kB
Progress (3): 54/194 kB | 18/48 kB | 8.4/20 kB
Progress (3): 58/194 kB | 18/48 kB | 8.4/20 kB
Progress (3): 62/194 kB | 18/48 kB | 8.4/20 kB
Progress (3): 66/194 kB | 18/48 kB | 8.4/20 kB
Progress (3): 70/194 kB | 18/48 kB | 8.4/20 kB
Progress (3): 74/194 kB | 18/48 kB | 8.4/20 kB
Progress (3): 78/194 kB | 18/48 kB | 8.4/20 kB
Progress (3): 82/194 kB | 18/48 kB | 8.4/20 kB
Progress (3): 82/194 kB | 22/48 kB | 8.4/20 kB
Progress (3): 82/194 kB | 26/48 kB | 8.4/20 kB
Progress (3): 82/194 kB | 31/48 kB | 8.4/20 kB
Progress (3): 82/194 kB | 31/48 kB | 8.4/20 kB
Progress (3): 82/194 kB | 35/48 kB | 8.4/20 kB
Progress (3): 82/194 kB | 39/48 kB | 8.4/20 kB
Progress (3): 82/194 kB | 44/48 kB | 8.4/20 kB
Progress (3): 82/194 kB | 48/48 kB | 8.4/20 kB
Progress (3): 82/194 kB | 48 kB | 8.4/20 kB   
Progress (3): 82/194 kB | 48 kB | 12/20 kB 
Progress (3): 82/194 kB | 48 kB | 13/20 kB
Progress (3): 82/194 kB | 48 kB | 17/20 kB
Progress (3): 82/194 kB | 48 kB | 20 kB   
Progress (3): 86/194 kB | 48 kB | 20 kB
Progress (3): 91/194 kB | 48 kB | 20 kB
Progress (3): 95/194 kB | 48 kB | 20 kB
Progress (3): 99/194 kB | 48 kB | 20 kB
Progress (3): 103/194 kB | 48 kB | 20 kB
Progress (3): 107/194 kB | 48 kB | 20 kB
Progress (3): 111/194 kB | 48 kB | 20 kB
Progress (4): 111/194 kB | 48 kB | 20 kB | 1.1/121 kB
Progress (4): 111/194 kB | 48 kB | 20 kB | 5.2/121 kB
Progress (4): 111/194 kB | 48 kB | 20 kB | 6.9/121 kB
Progress (4): 111/194 kB | 48 kB | 20 kB | 11/121 kB 
                                                    
Downloaded from repository.sonatype.org: https://repository.sonatype.org/content/groups/forge/org/codehaus/plexus/plexus-io/1.0-alpha-4/plexus-io-1.0-alpha-4.jar (48 kB at 19 kB/s)
Downloading from repository.sonatype.org: https://repository.sonatype.org/content/groups/forge/org/apache/maven/shared/maven-repository-builder/1.0-alpha-2/maven-repository-builder-1.0-alpha-2.jar
Progress (3): 115/194 kB | 20 kB | 11/121 kB
Progress (3): 119/194 kB | 20 kB | 11/121 kB
Progress (3): 123/194 kB | 20 kB | 11/121 kB
Progress (3): 127/194 kB | 20 kB | 11/121 kB
Progress (3): 132/194 kB | 20 kB | 11/121 kB
Progress (3): 136/194 kB | 20 kB | 11/121 kB
Progress (3): 140/194 kB | 20 kB | 11/121 kB
Progress (3): 144/194 kB | 20 kB | 11/121 kB
Progress (3): 148/194 kB | 20 kB | 11/121 kB
Progress (3): 148/194 kB | 20 kB | 15/121 kB
Progress (3): 148/194 kB | 20 kB | 16/121 kB
Progress (3): 148/194 kB | 20 kB | 18/121 kB
Progress (3): 152/194 kB | 20 kB | 18/121 kB
Progress (3): 156/194 kB | 20 kB | 18/121 kB
Progress (3): 160/194 kB | 20 kB | 18/121 kB
Progress (3): 164/194 kB | 20 kB | 18/121 kB
Progress (3): 168/194 kB | 20 kB | 18/121 kB
Progress (3): 172/194 kB | 20 kB | 18/121 kB
Progress (3): 177/194 kB | 20 kB | 18/121 kB
Progress (3): 181/194 kB | 20 kB | 18/121 kB
Progress (3): 185/194 kB | 20 kB | 18/121 kB
Progress (3): 189/194 kB | 20 kB | 18/121 kB
Progress (4): 189/194 kB | 20 kB | 18/121 kB | 1.1/38 kB
Progress (4): 189/194 kB | 20 kB | 18/121 kB | 4.0/38 kB
Progress (4): 189/194 kB | 20 kB | 18/121 kB | 8.1/38 kB
Progress (4): 189/194 kB | 20 kB | 23/121 kB | 8.1/38 kB
Progress (4): 189/194 kB | 20 kB | 27/121 kB | 8.1/38 kB
Progress (4): 189/194 kB | 20 kB | 31/121 kB | 8.1/38 kB
Progress (4): 189/194 kB | 20 kB | 32/121 kB | 8.1/38 kB
Progress (4): 189/194 kB | 20 kB | 36/121 kB | 8.1/38 kB
Progress (4): 189/194 kB | 20 kB | 40/121 kB | 8.1/38 kB
Progress (4): 193/194 kB | 20 kB | 40/121 kB | 8.1/38 kB
Progress (4): 194 kB | 20 kB | 40/121 kB | 8.1/38 kB    
Progress (4): 194 kB | 20 kB | 40/121 kB | 11/38 kB 
Progress (4): 194 kB | 20 kB | 40/121 kB | 15/38 kB
Progress (4): 194 kB | 20 kB | 40/121 kB | 16/38 kB
Progress (4): 194 kB | 20 kB | 40/121 kB | 20/38 kB
Progress (4): 194 kB | 20 kB | 44/121 kB | 20/38 kB
Progress (4): 194 kB | 20 kB | 48/121 kB | 20/38 kB
Progress (4): 194 kB | 20 kB | 52/121 kB | 20/38 kB
Progress (4): 194 kB | 20 kB | 56/121 kB | 20/38 kB
Progress (4): 194 kB | 20 kB | 60/121 kB | 20/38 kB
                                                   
Downloading from repository.sonatype.org: https://repository.sonatype.org/content/groups/forge/org/apache/maven/scm/maven-scm-api/1.4/maven-scm-api-1.4.jar
Progress (4): 194 kB | 20 kB | 60/121 kB | 24/38 kB
                                                   
Downloaded from repository.sonatype.org: https://repository.sonatype.org/content/groups/forge/org/codehaus/plexus/plexus-container-default/1.0-alpha-9-stable-1/plexus-container-default-1.0-alpha-9-stable-1.jar (194 kB at 71 kB/s)
Progress (3): 20 kB | 60/121 kB | 28/38 kB
                                          
Downloading from repository.sonatype.org: https://repository.sonatype.org/content/groups/forge/org/apache/maven/scm/maven-scm-manager-plexus/1.4/maven-scm-manager-plexus-1.4.jar
Progress (3): 20 kB | 60/121 kB | 32/38 kB
Progress (3): 20 kB | 60/121 kB | 35/38 kB
Progress (3): 20 kB | 60/121 kB | 38 kB   
Progress (3): 20 kB | 64/121 kB | 38 kB
Progress (3): 20 kB | 68/121 kB | 38 kB
Progress (3): 20 kB | 72/121 kB | 38 kB
Progress (3): 20 kB | 77/121 kB | 38 kB
Progress (3): 20 kB | 81/121 kB | 38 kB
Progress (3): 20 kB | 85/121 kB | 38 kB
Progress (3): 20 kB | 89/121 kB | 38 kB
Progress (3): 20 kB | 93/121 kB | 38 kB
Progress (3): 20 kB | 97/121 kB | 38 kB
Progress (3): 20 kB | 101/121 kB | 38 kB
Progress (3): 20 kB | 105/121 kB | 38 kB
Progress (3): 20 kB | 109/121 kB | 38 kB
Progress (3): 20 kB | 113/121 kB | 38 kB
Progress (3): 20 kB | 118/121 kB | 38 kB
Progress (3): 20 kB | 121 kB | 38 kB    
                                    
Downloading from repository.sonatype.org: https://repository.sonatype.org/content/groups/forge/org/apache/maven/scm/maven-scm-provider-svnexe/1.4/maven-scm-provider-svnexe-1.4.jar
[WARNING] Could not validate integrity of download from https://repository.sonatype.org/content/groups/forge/org/apache/maven/maven-archiver/2.4/maven-archiver-2.4.jar: Checksum validation failed, no checksums available
[WARNING] Checksum validation failed, no checksums available from repository.sonatype.org for https://repository.sonatype.org/content/groups/forge/org/apache/maven/maven-archiver/2.4/maven-archiver-2.4.jar
Downloaded from repository.sonatype.org: https://repository.sonatype.org/content/groups/forge/org/apache/maven/maven-archiver/2.4/maven-archiver-2.4.jar (20 kB at 6.7 kB/s)
Downloading from repository.sonatype.org: https://repository.sonatype.org/content/groups/forge/regexp/regexp/1.3/regexp-1.3.jar
Downloading from repository.sonatype.org: https://repository.sonatype.org/content/groups/forge/org/apache/maven/scm/maven-scm-provider-svn-commons/1.4/maven-scm-provider-svn-commons-1.4.jar
Downloading from repository.sonatype.org: https://repository.sonatype.org/content/groups/forge/org/apache/maven/scm/maven-scm-provider-gitexe/1.4/maven-scm-provider-gitexe-1.4.jar
[WARNING] Could not validate integrity of download from https://repository.sonatype.org/content/groups/forge/junit/junit/3.8.1/junit-3.8.1.jar: Checksum validation failed, no checksums available
[WARNING] Checksum validation failed, no checksums available from repository.sonatype.org for https://repository.sonatype.org/content/groups/forge/junit/junit/3.8.1/junit-3.8.1.jar
Downloaded from repository.sonatype.org: https://repository.sonatype.org/content/groups/forge/junit/junit/3.8.1/junit-3.8.1.jar (121 kB at 39 kB/s)
[WARNING] Could not validate integrity of download from https://repository.sonatype.org/content/groups/forge/classworlds/classworlds/1.1-alpha-2/classworlds-1.1-alpha-2.jar: Checksum validation failed, no checksums available
Downloading from repository.sonatype.org: https://repository.sonatype.org/content/groups/forge/org/apache/maven/scm/maven-scm-provider-git-commons/1.4/maven-scm-provider-git-commons-1.4.jar
[WARNING] Checksum validation failed, no checksums available from repository.sonatype.org for https://repository.sonatype.org/content/groups/forge/classworlds/classworlds/1.1-alpha-2/classworlds-1.1-alpha-2.jar
Downloaded from repository.sonatype.org: https://repository.sonatype.org/content/groups/forge/classworlds/classworlds/1.1-alpha-2/classworlds-1.1-alpha-2.jar (38 kB at 12 kB/s)
Downloading from repository.sonatype.org: https://repository.sonatype.org/content/groups/forge/org/apache/maven/scm/maven-scm-provider-hg/1.4/maven-scm-provider-hg-1.4.jar
Downloading from repository.sonatype.org: https://repository.sonatype.org/content/groups/forge/org/sonatype/plexus/plexus-build-api/0.0.7/plexus-build-api-0.0.7.jar
Progress (1): 1.1/8.5 kB
Progress (1): 5.2/8.5 kB
Progress (1): 6.9/8.5 kB
Progress (1): 8.5 kB    
                    
Downloaded from repository.sonatype.org: https://repository.sonatype.org/content/groups/forge/org/sonatype/plexus/plexus-build-api/0.0.7/plexus-build-api-0.0.7.jar (8.5 kB at 2.5 kB/s)
Downloading from eclipse.maven.central.mirror: https://repo.eclipse.org/content/repositories/maven_central/com/google/code/findbugs/jsr305/2.0.1/jsr305-2.0.1.jar
Downloading from eclipse.maven.central.mirror: https://repo.eclipse.org/content/repositories/maven_central/org/apache/maven/maven-core/3.0.4/maven-core-3.0.4.jar
Downloading from eclipse.maven.central.mirror: https://repo.eclipse.org/content/repositories/maven_central/org/osgi/org.osgi.core/4.3.1/org.osgi.core-4.3.1.jar
Downloading from eclipse.maven.central.mirror: https://repo.eclipse.org/content/repositories/maven_central/biz/aQute/bnd/bndlib/2.2.0/bndlib-2.2.0.jar
Downloading from eclipse.maven.central.mirror: https://repo.eclipse.org/content/repositories/maven_central/org/apache/maven/maven-plugin-api/3.0.4/maven-plugin-api-3.0.4.jar
Progress (1): 4.1/32 kB
Progress (1): 7.7/32 kB
Progress (1): 12/32 kB 
Progress (1): 16/32 kB
Progress (1): 20/32 kB
Progress (1): 24/32 kB
Progress (1): 28/32 kB
Progress (1): 32/32 kB
Progress (1): 32 kB   
Progress (2): 32 kB | 4.1/350 kB
Progress (2): 32 kB | 7.7/350 kB
Progress (2): 32 kB | 12/350 kB 
Progress (2): 32 kB | 16/350 kB
Progress (2): 32 kB | 20/350 kB
Progress (2): 32 kB | 24/350 kB
Progress (2): 32 kB | 28/350 kB
Progress (2): 32 kB | 32/350 kB
Progress (2): 32 kB | 33/350 kB
Progress (2): 32 kB | 37/350 kB
Progress (2): 32 kB | 41/350 kB
Progress (2): 32 kB | 45/350 kB
Progress (2): 32 kB | 49/350 kB
Progress (2): 32 kB | 53/350 kB
Progress (2): 32 kB | 57/350 kB
Progress (2): 32 kB | 61/350 kB
                               
Downloaded from eclipse.maven.central.mirror: https://repo.eclipse.org/content/repositories/maven_central/com/google/code/findbugs/jsr305/2.0.1/jsr305-2.0.1.jar (32 kB at 1.1 MB/s)
Progress (1): 65/350 kB
                       
Downloading from eclipse.maven.central.mirror: https://repo.eclipse.org/content/repositories/maven_central/org/apache/maven/maven-settings/3.0.4/maven-settings-3.0.4.jar
Progress (1): 66/350 kB
Progress (1): 70/350 kB
Progress (1): 74/350 kB
Progress (1): 78/350 kB
Progress (1): 82/350 kB
Progress (1): 86/350 kB
Progress (1): 90/350 kB
Progress (1): 94/350 kB
Progress (1): 98/350 kB
Progress (1): 98/350 kB
Progress (1): 102/350 kB
Progress (1): 106/350 kB
Progress (1): 110/350 kB
Progress (1): 114/350 kB
Progress (1): 118/350 kB
Progress (1): 122/350 kB
Progress (1): 126/350 kB
Progress (1): 130/350 kB
Progress (1): 131/350 kB
Progress (1): 135/350 kB
Progress (1): 139/350 kB
Progress (1): 143/350 kB
Progress (1): 147/350 kB
Progress (1): 151/350 kB
Progress (1): 155/350 kB
Progress (1): 159/350 kB
Progress (1): 163/350 kB
Progress (1): 167/350 kB
Progress (1): 171/350 kB
Progress (1): 175/350 kB
Progress (1): 179/350 kB
Progress (1): 183/350 kB
Progress (1): 187/350 kB
Progress (1): 191/350 kB
Progress (1): 195/350 kB
Progress (1): 197/350 kB
Progress (1): 201/350 kB
Progress (1): 205/350 kB
Progress (1): 209/350 kB
Progress (1): 213/350 kB
Progress (1): 217/350 kB
Progress (1): 221/350 kB
Progress (1): 225/350 kB
Progress (1): 229/350 kB
Progress (1): 233/350 kB
Progress (1): 237/350 kB
Progress (1): 241/350 kB
Progress (1): 245/350 kB
Progress (1): 249/350 kB
Progress (1): 253/350 kB
Progress (1): 257/350 kB
Progress (1): 261/350 kB
Progress (1): 265/350 kB
Progress (1): 269/350 kB
Progress (1): 273/350 kB
Progress (1): 277/350 kB
Progress (1): 281/350 kB
Progress (1): 285/350 kB
Progress (1): 289/350 kB
Progress (1): 293/350 kB
Progress (1): 297/350 kB
Progress (1): 301/350 kB
Progress (1): 305/350 kB
Progress (1): 309/350 kB
Progress (1): 313/350 kB
Progress (1): 317/350 kB
Progress (1): 321/350 kB
Progress (1): 325/350 kB
Progress (1): 329/350 kB
Progress (1): 333/350 kB
Progress (1): 337/350 kB
Progress (1): 341/350 kB
Progress (1): 345/350 kB
Progress (1): 349/350 kB
Progress (1): 350 kB    
Progress (2): 350 kB | 4.1/49 kB
Progress (2): 350 kB | 7.7/49 kB
Progress (3): 350 kB | 7.7/49 kB | 4.1/47 kB
Progress (3): 350 kB | 12/49 kB | 4.1/47 kB 
Progress (3): 350 kB | 12/49 kB | 7.7/47 kB
Progress (3): 350 kB | 16/49 kB | 7.7/47 kB
Progress (3): 350 kB | 16/49 kB | 12/47 kB 
Progress (3): 350 kB | 20/49 kB | 12/47 kB
Progress (3): 350 kB | 20/49 kB | 16/47 kB
Progress (3): 350 kB | 24/49 kB | 16/47 kB
Progress (3): 350 kB | 24/49 kB | 20/47 kB
Progress (3): 350 kB | 28/49 kB | 20/47 kB
Progress (3): 350 kB | 28/49 kB | 24/47 kB
Progress (3): 350 kB | 32/49 kB | 24/47 kB
Progress (3): 350 kB | 32/49 kB | 28/47 kB
Progress (3): 350 kB | 33/49 kB | 28/47 kB
Progress (3): 350 kB | 33/49 kB | 32/47 kB
Progress (3): 350 kB | 37/49 kB | 32/47 kB
Progress (3): 350 kB | 37/49 kB | 33/47 kB
Progress (3): 350 kB | 41/49 kB | 33/47 kB
Progress (3): 350 kB | 41/49 kB | 37/47 kB
Progress (3): 350 kB | 45/49 kB | 37/47 kB
Progress (3): 350 kB | 45/49 kB | 41/47 kB
Progress (4): 350 kB | 45/49 kB | 41/47 kB | 4.1/559 kB
Progress (4): 350 kB | 49/49 kB | 41/47 kB | 4.1/559 kB
Progress (4): 350 kB | 49/49 kB | 41/47 kB | 7.7/559 kB
Progress (4): 350 kB | 49/49 kB | 45/47 kB | 7.7/559 kB
Progress (4): 350 kB | 49/49 kB | 45/47 kB | 12/559 kB 
                                                      
Downloaded from eclipse.maven.central.mirror: https://repo.eclipse.org/content/repositories/maven_central/org/osgi/org.osgi.core/4.3.1/org.osgi.core-4.3.1.jar (350 kB at 6.4 MB/s)
Progress (3): 49 kB | 45/47 kB | 12/559 kB
                                          
Downloading from eclipse.maven.central.mirror: https://repo.eclipse.org/content/repositories/maven_central/org/apache/maven/maven-settings-builder/3.0.4/maven-settings-builder-3.0.4.jar
Progress (3): 49 kB | 45/47 kB | 16/559 kB
Progress (3): 49 kB | 47 kB | 16/559 kB   
Progress (3): 49 kB | 47 kB | 20/559 kB
Progress (3): 49 kB | 47 kB | 24/559 kB
Progress (3): 49 kB | 47 kB | 28/559 kB
Progress (3): 49 kB | 47 kB | 32/559 kB
Progress (3): 49 kB | 47 kB | 36/559 kB
Progress (3): 49 kB | 47 kB | 40/559 kB
Progress (3): 49 kB | 47 kB | 44/559 kB
Progress (3): 49 kB | 47 kB | 48/559 kB
Progress (3): 49 kB | 47 kB | 52/559 kB
Progress (3): 49 kB | 47 kB | 56/559 kB
Progress (3): 49 kB | 47 kB | 60/559 kB
Progress (3): 49 kB | 47 kB | 64/559 kB
Progress (3): 49 kB | 47 kB | 68/559 kB
Progress (3): 49 kB | 47 kB | 72/559 kB
Progress (3): 49 kB | 47 kB | 76/559 kB
Progress (3): 49 kB | 47 kB | 80/559 kB
Progress (3): 49 kB | 47 kB | 84/559 kB
Progress (3): 49 kB | 47 kB | 88/559 kB
Progress (3): 49 kB | 47 kB | 92/559 kB
Progress (3): 49 kB | 47 kB | 96/559 kB
Progress (3): 49 kB | 47 kB | 100/559 kB
Progress (3): 49 kB | 47 kB | 104/559 kB
Progress (3): 49 kB | 47 kB | 108/559 kB
Progress (3): 49 kB | 47 kB | 112/559 kB
Progress (3): 49 kB | 47 kB | 116/559 kB
Progress (3): 49 kB | 47 kB | 120/559 kB
Progress (3): 49 kB | 47 kB | 124/559 kB
Progress (3): 49 kB | 47 kB | 128/559 kB
Progress (3): 49 kB | 47 kB | 132/559 kB
Progress (3): 49 kB | 47 kB | 136/559 kB
Progress (3): 49 kB | 47 kB | 140/559 kB
Progress (3): 49 kB | 47 kB | 144/559 kB
Progress (3): 49 kB | 47 kB | 148/559 kB
Progress (4): 49 kB | 47 kB | 148/559 kB | 4.1/41 kB
                                                    
Downloaded from eclipse.maven.central.mirror: https://repo.eclipse.org/content/repositories/maven_central/org/apache/maven/maven-plugin-api/3.0.4/maven-plugin-api-3.0.4.jar (49 kB at 404 kB/s)
Downloaded from eclipse.maven.central.mirror: https://repo.eclipse.org/content/repositories/maven_central/org/apache/maven/maven-settings/3.0.4/maven-settings-3.0.4.jar (47 kB at 386 kB/s)
Downloading from eclipse.maven.central.mirror: https://repo.eclipse.org/content/repositories/maven_central/org/apache/maven/maven-repository-metadata/3.0.4/maven-repository-metadata-3.0.4.jar
Progress (2): 148/559 kB | 7.7/41 kB
Progress (2): 152/559 kB | 7.7/41 kB
                                    
Downloading from eclipse.maven.central.mirror: https://repo.eclipse.org/content/repositories/maven_central/org/apache/maven/maven-model-builder/3.0.4/maven-model-builder-3.0.4.jar
Progress (2): 152/559 kB | 12/41 kB
Progress (2): 156/559 kB | 12/41 kB
Progress (2): 156/559 kB | 16/41 kB
Progress (2): 160/559 kB | 16/41 kB
Progress (2): 160/559 kB | 20/41 kB
Progress (2): 164/559 kB | 20/41 kB
Progress (2): 164/559 kB | 24/41 kB
Progress (2): 168/559 kB | 24/41 kB
Progress (2): 168/559 kB | 28/41 kB
Progress (2): 172/559 kB | 28/41 kB
Progress (2): 172/559 kB | 32/41 kB
Progress (2): 176/559 kB | 32/41 kB
Progress (2): 176/559 kB | 33/41 kB
Progress (2): 180/559 kB | 33/41 kB
Progress (2): 180/559 kB | 37/41 kB
Progress (2): 184/559 kB | 37/41 kB
Progress (2): 184/559 kB | 41/41 kB
Progress (2): 184/559 kB | 41 kB   
Progress (2): 188/559 kB | 41 kB
Progress (2): 192/559 kB | 41 kB
Progress (2): 196/559 kB | 41 kB
Progress (2): 200/559 kB | 41 kB
Progress (2): 204/559 kB | 41 kB
Progress (2): 208/559 kB | 41 kB
Progress (2): 212/559 kB | 41 kB
Progress (2): 216/559 kB | 41 kB
Progress (2): 220/559 kB | 41 kB
Progress (2): 224/559 kB | 41 kB
Progress (2): 228/559 kB | 41 kB
Progress (2): 229/559 kB | 41 kB
Progress (2): 233/559 kB | 41 kB
Progress (2): 237/559 kB | 41 kB
Progress (2): 241/559 kB | 41 kB
Progress (2): 245/559 kB | 41 kB
Progress (2): 249/559 kB | 41 kB
Progress (2): 253/559 kB | 41 kB
Progress (2): 257/559 kB | 41 kB
Progress (2): 261/559 kB | 41 kB
Progress (2): 262/559 kB | 41 kB
Progress (2): 266/559 kB | 41 kB
Progress (2): 270/559 kB | 41 kB
Progress (2): 274/559 kB | 41 kB
Progress (2): 278/559 kB | 41 kB
Progress (2): 282/559 kB | 41 kB
Progress (2): 286/559 kB | 41 kB
Progress (2): 290/559 kB | 41 kB
Progress (2): 294/559 kB | 41 kB
Progress (2): 295/559 kB | 41 kB
Progress (2): 299/559 kB | 41 kB
Progress (2): 303/559 kB | 41 kB
Progress (2): 307/559 kB | 41 kB
Progress (2): 311/559 kB | 41 kB
Progress (2): 315/559 kB | 41 kB
Progress (2): 319/559 kB | 41 kB
Progress (2): 323/559 kB | 41 kB
Progress (2): 327/559 kB | 41 kB
Progress (2): 331/559 kB | 41 kB
Progress (2): 335/559 kB | 41 kB
Progress (2): 339/559 kB | 41 kB
Progress (2): 343/559 kB | 41 kB
Progress (2): 347/559 kB | 41 kB
Progress (2): 351/559 kB | 41 kB
Progress (2): 355/559 kB | 41 kB
Progress (2): 359/559 kB | 41 kB
Progress (2): 363/559 kB | 41 kB
Progress (2): 367/559 kB | 41 kB
Progress (2): 371/559 kB | 41 kB
Progress (2): 375/559 kB | 41 kB
Progress (2): 379/559 kB | 41 kB
Progress (2): 383/559 kB | 41 kB
Progress (2): 387/559 kB | 41 kB
Progress (2): 391/559 kB | 41 kB
Progress (2): 395/559 kB | 41 kB
Progress (2): 399/559 kB | 41 kB
Progress (2): 403/559 kB | 41 kB
                                
Downloaded from eclipse.maven.central.mirror: https://repo.eclipse.org/content/repositories/maven_central/org/apache/maven/maven-settings-builder/3.0.4/maven-settings-builder-3.0.4.jar (41 kB at 300 kB/s)
Progress (1): 407/559 kB
                        
Downloading from eclipse.maven.central.mirror: https://repo.eclipse.org/content/repositories/maven_central/org/apache/maven/maven-aether-provider/3.0.4/maven-aether-provider-3.0.4.jar
Progress (1): 411/559 kB
Progress (1): 415/559 kB
Progress (1): 419/559 kB
Progress (1): 423/559 kB
Progress (1): 427/559 kB
Progress (1): 431/559 kB
Progress (1): 435/559 kB
Progress (1): 439/559 kB
Progress (1): 443/559 kB
Progress (1): 447/559 kB
Progress (1): 451/559 kB
Progress (1): 455/559 kB
Progress (1): 459/559 kB
Progress (1): 463/559 kB
Progress (1): 467/559 kB
Progress (1): 471/559 kB
Progress (1): 475/559 kB
Progress (1): 479/559 kB
Progress (1): 483/559 kB
Progress (1): 487/559 kB
Progress (1): 491/559 kB
Progress (1): 495/559 kB
Progress (1): 499/559 kB
Progress (1): 503/559 kB
Progress (1): 507/559 kB
Progress (1): 511/559 kB
Progress (1): 515/559 kB
Progress (1): 519/559 kB
Progress (1): 523/559 kB
Progress (1): 527/559 kB
Progress (1): 531/559 kB
Progress (1): 535/559 kB
Progress (1): 539/559 kB
Progress (1): 543/559 kB
Progress (1): 547/559 kB
Progress (1): 551/559 kB
Progress (1): 555/559 kB
Progress (1): 559/559 kB
Progress (1): 559 kB    
                    
Downloaded from eclipse.maven.central.mirror: https://repo.eclipse.org/content/repositories/maven_central/org/apache/maven/maven-core/3.0.4/maven-core-3.0.4.jar (559 kB at 3.6 MB/s)
Downloading from eclipse.maven.central.mirror: https://repo.eclipse.org/content/repositories/maven_central/org/apache/maven/maven-model/3.0.4/maven-model-3.0.4.jar
Progress (1): 4.1/164 kB
Progress (1): 7.7/164 kB
Progress (1): 12/164 kB 
Progress (1): 16/164 kB
Progress (1): 20/164 kB
Progress (1): 24/164 kB
Progress (1): 28/164 kB
Progress (1): 32/164 kB
Progress (1): 33/164 kB
Progress (1): 37/164 kB
Progress (1): 41/164 kB
Progress (1): 45/164 kB
Progress (1): 49/164 kB
Progress (1): 53/164 kB
Progress (1): 57/164 kB
Progress (1): 61/164 kB
Progress (1): 65/164 kB
Progress (1): 66/164 kB
Progress (1): 70/164 kB
Progress (1): 74/164 kB
Progress (2): 74/164 kB | 4.1/30 kB
Progress (2): 78/164 kB | 4.1/30 kB
Progress (2): 78/164 kB | 7.7/30 kB
Progress (2): 82/164 kB | 7.7/30 kB
Progress (2): 82/164 kB | 12/30 kB 
Progress (2): 86/164 kB | 12/30 kB
Progress (2): 86/164 kB | 16/30 kB
Progress (2): 90/164 kB | 16/30 kB
Progress (2): 90/164 kB | 20/30 kB
Progress (2): 94/164 kB | 20/30 kB
Progress (2): 94/164 kB | 24/30 kB
Progress (2): 98/164 kB | 24/30 kB
Progress (2): 98/164 kB | 28/30 kB
Progress (2): 98/164 kB | 28/30 kB
Progress (2): 98/164 kB | 30 kB   
Progress (2): 102/164 kB | 30 kB
Progress (2): 106/164 kB | 30 kB
Progress (2): 110/164 kB | 30 kB
Progress (2): 114/164 kB | 30 kB
Progress (2): 118/164 kB | 30 kB
Progress (2): 122/164 kB | 30 kB
Progress (2): 126/164 kB | 30 kB
Progress (2): 130/164 kB | 30 kB
Progress (2): 134/164 kB | 30 kB
Progress (2): 138/164 kB | 30 kB
Progress (2): 142/164 kB | 30 kB
Progress (2): 146/164 kB | 30 kB
Progress (2): 150/164 kB | 30 kB
Progress (2): 154/164 kB | 30 kB
Progress (2): 158/164 kB | 30 kB
Progress (2): 162/164 kB | 30 kB
Progress (2): 164 kB | 30 kB    
Progress (3): 164 kB | 30 kB | 4.1/151 kB
Progress (3): 164 kB | 30 kB | 7.7/151 kB
Progress (3): 164 kB | 30 kB | 12/151 kB 
Progress (3): 164 kB | 30 kB | 16/151 kB
Progress (3): 164 kB | 30 kB | 20/151 kB
Progress (3): 164 kB | 30 kB | 24/151 kB
Progress (3): 164 kB | 30 kB | 28/151 kB
Progress (3): 164 kB | 30 kB | 32/151 kB
Progress (3): 164 kB | 30 kB | 33/151 kB
                                        
Downloaded from eclipse.maven.central.mirror: https://repo.eclipse.org/content/repositories/maven_central/org/apache/maven/maven-repository-metadata/3.0.4/maven-repository-metadata-3.0.4.jar (30 kB at 165 kB/s)
Progress (2): 164 kB | 37/151 kB
                                
Downloading from eclipse.maven.central.mirror: https://repo.eclipse.org/content/repositories/maven_central/org/apache/maven/maven-artifact/3.0.4/maven-artifact-3.0.4.jar
Progress (2): 164 kB | 41/151 kB
Progress (2): 164 kB | 45/151 kB
Progress (2): 164 kB | 49/151 kB
Progress (2): 164 kB | 53/151 kB
Progress (2): 164 kB | 57/151 kB
Progress (2): 164 kB | 61/151 kB
Progress (2): 164 kB | 65/151 kB
Progress (2): 164 kB | 66/151 kB
Progress (2): 164 kB | 70/151 kB
Progress (2): 164 kB | 74/151 kB
Progress (2): 164 kB | 78/151 kB
Progress (2): 164 kB | 82/151 kB
Progress (2): 164 kB | 86/151 kB
Progress (2): 164 kB | 90/151 kB
Progress (2): 164 kB | 94/151 kB
Progress (2): 164 kB | 98/151 kB
Progress (2): 164 kB | 98/151 kB
Progress (2): 164 kB | 102/151 kB
Progress (2): 164 kB | 106/151 kB
                                 
Downloaded from eclipse.maven.central.mirror: https://repo.eclipse.org/content/repositories/maven_central/org/apache/maven/maven-model/3.0.4/maven-model-3.0.4.jar (164 kB at 875 kB/s)
Downloading from eclipse.maven.central.mirror: https://repo.eclipse.org/content/repositories/maven_central/org/apache/maven/plugins/maven-assembly-plugin/2.2-beta-5/maven-assembly-plugin-2.2-beta-5.jar
Progress (1): 110/151 kB
Progress (1): 114/151 kB
Progress (1): 118/151 kB
Progress (1): 122/151 kB
Progress (1): 126/151 kB
Progress (1): 130/151 kB
Progress (1): 134/151 kB
Progress (1): 138/151 kB
Progress (1): 142/151 kB
Progress (1): 146/151 kB
Progress (1): 150/151 kB
Progress (1): 151 kB    
Progress (2): 151 kB | 4.1/209 kB
Progress (2): 151 kB | 7.7/209 kB
Progress (3): 151 kB | 7.7/209 kB | 4.1/56 kB
Progress (3): 151 kB | 12/209 kB | 4.1/56 kB 
Progress (3): 151 kB | 12/209 kB | 7.7/56 kB
Progress (3): 151 kB | 16/209 kB | 7.7/56 kB
Progress (3): 151 kB | 16/209 kB | 12/56 kB 
Progress (3): 151 kB | 20/209 kB | 12/56 kB
Progress (3): 151 kB | 20/209 kB | 16/56 kB
Progress (3): 151 kB | 24/209 kB | 16/56 kB
Progress (3): 151 kB | 24/209 kB | 20/56 kB
Progress (3): 151 kB | 24/209 kB | 24/56 kB
Progress (3): 151 kB | 28/209 kB | 24/56 kB
Progress (3): 151 kB | 28/209 kB | 28/56 kB
Progress (3): 151 kB | 32/209 kB | 28/56 kB
Progress (3): 151 kB | 32/209 kB | 32/56 kB
Progress (3): 151 kB | 33/209 kB | 32/56 kB
                                           
Downloaded from eclipse.maven.central.mirror: https://repo.eclipse.org/content/repositories/maven_central/org/apache/maven/maven-model-builder/3.0.4/maven-model-builder-3.0.4.jar (151 kB at 757 kB/s)
Progress (2): 33/209 kB | 36/56 kB
Progress (2): 37/209 kB | 36/56 kB
                                  
Downloading from eclipse.maven.central.mirror: https://repo.eclipse.org/content/repositories/maven_central/org/apache/maven/shared/maven-common-artifact-filters/1.1/maven-common-artifact-filters-1.1.jar
Progress (2): 41/209 kB | 36/56 kB
Progress (2): 41/209 kB | 40/56 kB
Progress (2): 45/209 kB | 40/56 kB
Progress (2): 45/209 kB | 44/56 kB
Progress (2): 49/209 kB | 44/56 kB
Progress (2): 49/209 kB | 48/56 kB
Progress (2): 53/209 kB | 48/56 kB
Progress (2): 53/209 kB | 52/56 kB
Progress (2): 57/209 kB | 52/56 kB
Progress (2): 57/209 kB | 56/56 kB
Progress (2): 57/209 kB | 56 kB   
Progress (2): 61/209 kB | 56 kB
Progress (2): 65/209 kB | 56 kB
Progress (2): 66/209 kB | 56 kB
Progress (2): 70/209 kB | 56 kB
Progress (2): 74/209 kB | 56 kB
Progress (2): 78/209 kB | 56 kB
Progress (2): 82/209 kB | 56 kB
Progress (2): 86/209 kB | 56 kB
Progress (2): 90/209 kB | 56 kB
Progress (2): 94/209 kB | 56 kB
Progress (2): 98/209 kB | 56 kB
Progress (2): 98/209 kB | 56 kB
Progress (2): 102/209 kB | 56 kB
Progress (2): 106/209 kB | 56 kB
Progress (2): 110/209 kB | 56 kB
Progress (2): 114/209 kB | 56 kB
Progress (2): 118/209 kB | 56 kB
Progress (2): 122/209 kB | 56 kB
Progress (2): 126/209 kB | 56 kB
Progress (2): 130/209 kB | 56 kB
Progress (2): 134/209 kB | 56 kB
Progress (2): 138/209 kB | 56 kB
Progress (2): 142/209 kB | 56 kB
Progress (2): 146/209 kB | 56 kB
Progress (2): 150/209 kB | 56 kB
Progress (2): 154/209 kB | 56 kB
Progress (2): 158/209 kB | 56 kB
Progress (2): 162/209 kB | 56 kB
Progress (2): 166/209 kB | 56 kB
Progress (2): 170/209 kB | 56 kB
Progress (2): 174/209 kB | 56 kB
Progress (2): 178/209 kB | 56 kB
Progress (2): 182/209 kB | 56 kB
Progress (2): 186/209 kB | 56 kB
                                
Downloaded from eclipse.maven.central.mirror: https://repo.eclipse.org/content/repositories/maven_central/org/apache/maven/maven-aether-provider/3.0.4/maven-aether-provider-3.0.4.jar (56 kB at 270 kB/s)
Progress (1): 190/209 kB
                        
Downloading from eclipse.maven.central.mirror: https://repo.eclipse.org/content/repositories/maven_central/org/apache/maven/shared/maven-shared-io/1.1/maven-shared-io-1.1.jar
Progress (1): 194/209 kB
Progress (1): 198/209 kB
Progress (1): 202/209 kB
Progress (1): 206/209 kB
Progress (1): 209 kB    
Progress (2): 209 kB | 4.1/39 kB
Progress (2): 209 kB | 7.7/39 kB
Progress (2): 209 kB | 12/39 kB 
Progress (2): 209 kB | 16/39 kB
Progress (2): 209 kB | 20/39 kB
Progress (2): 209 kB | 24/39 kB
                               
Downloaded from eclipse.maven.central.mirror: https://repo.eclipse.org/content/repositories/maven_central/org/apache/maven/plugins/maven-assembly-plugin/2.2-beta-5/maven-assembly-plugin-2.2-beta-5.jar (209 kB at 958 kB/s)
Downloading from eclipse.maven.central.mirror: https://repo.eclipse.org/content/repositories/maven_central/org/apache/maven/maven-artifact-manager/2.0.2/maven-artifact-manager-2.0.2.jar
Progress (1): 28/39 kB
Progress (1): 32/39 kB
Progress (1): 33/39 kB
Progress (1): 37/39 kB
Progress (1): 39 kB   
Progress (2): 39 kB | 4.1/49 kB
Progress (2): 39 kB | 7.7/49 kB
Progress (2): 39 kB | 12/49 kB 
Progress (2): 39 kB | 16/49 kB
Progress (2): 39 kB | 20/49 kB
Progress (2): 39 kB | 24/49 kB
Progress (2): 39 kB | 28/49 kB
Progress (2): 39 kB | 32/49 kB
Progress (2): 39 kB | 33/49 kB
                              
Downloaded from eclipse.maven.central.mirror: https://repo.eclipse.org/content/repositories/maven_central/org/apache/maven/shared/maven-shared-io/1.1/maven-shared-io-1.1.jar (39 kB at 172 kB/s)
Downloading from eclipse.maven.central.mirror: https://repo.eclipse.org/content/repositories/maven_central/org/apache/maven/wagon/wagon-provider-api/1.0-alpha-6/wagon-provider-api-1.0-alpha-6.jar
Progress (1): 37/49 kB
Progress (1): 41/49 kB
Progress (1): 45/49 kB
Progress (1): 49/49 kB
Progress (1): 49 kB   
Progress (2): 49 kB | 4.1/52 kB
Progress (2): 49 kB | 7.7/52 kB
Progress (2): 49 kB | 12/52 kB 
Progress (2): 49 kB | 16/52 kB
Progress (2): 49 kB | 20/52 kB
Progress (2): 49 kB | 24/52 kB
Progress (2): 49 kB | 28/52 kB
Progress (2): 49 kB | 32/52 kB
Progress (2): 49 kB | 36/52 kB
Progress (2): 49 kB | 40/52 kB
Progress (2): 49 kB | 44/52 kB
Progress (2): 49 kB | 48/52 kB
Progress (2): 49 kB | 52/52 kB
Progress (2): 49 kB | 52 kB   
Progress (3): 49 kB | 52 kB | 4.1/30 kB
Progress (3): 49 kB | 52 kB | 7.7/30 kB
Progress (3): 49 kB | 52 kB | 12/30 kB 
Progress (4): 49 kB | 52 kB | 12/30 kB | 4.1/43 kB
Progress (4): 49 kB | 52 kB | 16/30 kB | 4.1/43 kB
Progress (4): 49 kB | 52 kB | 16/30 kB | 7.7/43 kB
Progress (4): 49 kB | 52 kB | 20/30 kB | 7.7/43 kB
Progress (4): 49 kB | 52 kB | 20/30 kB | 12/43 kB 
Progress (4): 49 kB | 52 kB | 24/30 kB | 12/43 kB
Progress (4): 49 kB | 52 kB | 24/30 kB | 16/43 kB
Progress (4): 49 kB | 52 kB | 28/30 kB | 16/43 kB
Progress (4): 49 kB | 52 kB | 28/30 kB | 20/43 kB
Progress (4): 49 kB | 52 kB | 30 kB | 20/43 kB   
Progress (4): 49 kB | 52 kB | 30 kB | 24/43 kB
Progress (4): 49 kB | 52 kB | 30 kB | 28/43 kB
Progress (4): 49 kB | 52 kB | 30 kB | 32/43 kB
Progress (4): 49 kB | 52 kB | 30 kB | 33/43 kB
Progress (4): 49 kB | 52 kB | 30 kB | 37/43 kB
Progress (4): 49 kB | 52 kB | 30 kB | 41/43 kB
Progress (4): 49 kB | 52 kB | 30 kB | 43 kB   
                                           
Downloaded from eclipse.maven.central.mirror: https://repo.eclipse.org/content/repositories/maven_central/org/apache/maven/maven-artifact-manager/2.0.2/maven-artifact-manager-2.0.2.jar (49 kB at 200 kB/s)
Downloading from eclipse.maven.central.mirror: https://repo.eclipse.org/content/repositories/maven_central/org/apache/maven/shared/maven-filtering/1.0-beta-2/maven-filtering-1.0-beta-2.jar
Downloaded from eclipse.maven.central.mirror: https://repo.eclipse.org/content/repositories/maven_central/org/apache/maven/wagon/wagon-provider-api/1.0-alpha-6/wagon-provider-api-1.0-alpha-6.jar (43 kB at 171 kB/s)
Downloading from eclipse.maven.central.mirror: https://repo.eclipse.org/content/repositories/maven_central/org/apache/maven/maven-monitor/2.0.6/maven-monitor-2.0.6.jar
Downloaded from eclipse.maven.central.mirror: https://repo.eclipse.org/content/repositories/maven_central/org/apache/maven/maven-artifact/3.0.4/maven-artifact-3.0.4.jar (52 kB at 208 kB/s)
Downloading from eclipse.maven.central.mirror: https://repo.eclipse.org/content/repositories/maven_central/org/apache/maven/maven-project/2.0.4/maven-project-2.0.4.jar
Downloaded from eclipse.maven.central.mirror: https://repo.eclipse.org/content/repositories/maven_central/org/apache/maven/shared/maven-common-artifact-filters/1.1/maven-common-artifact-filters-1.1.jar (30 kB at 119 kB/s)
Downloading from eclipse.maven.central.mirror: https://repo.eclipse.org/content/repositories/maven_central/org/apache/maven/maven-profile/2.0.4/maven-profile-2.0.4.jar
Progress (1): 4.1/10 kB
Progress (1): 7.7/10 kB
Progress (2): 7.7/10 kB | 4.1/33 kB
Progress (2): 10 kB | 4.1/33 kB    
Progress (2): 10 kB | 7.7/33 kB
Progress (2): 10 kB | 12/33 kB 
Progress (2): 10 kB | 16/33 kB
Progress (2): 10 kB | 20/33 kB
Progress (2): 10 kB | 24/33 kB
Progress (3): 10 kB | 24/33 kB | 4.1/109 kB
Progress (3): 10 kB | 28/33 kB | 4.1/109 kB
Progress (3): 10 kB | 28/33 kB | 7.7/109 kB
Progress (3): 10 kB | 32/33 kB | 7.7/109 kB
Progress (3): 10 kB | 32/33 kB | 12/109 kB 
Progress (3): 10 kB | 33/33 kB | 12/109 kB
Progress (3): 10 kB | 33/33 kB | 16/109 kB
Progress (3): 10 kB | 33 kB | 16/109 kB   
Progress (3): 10 kB | 33 kB | 20/109 kB
Progress (3): 10 kB | 33 kB | 24/109 kB
Progress (3): 10 kB | 33 kB | 28/109 kB
Progress (4): 10 kB | 33 kB | 28/109 kB | 4.1/30 kB
Progress (4): 10 kB | 33 kB | 32/109 kB | 4.1/30 kB
Progress (4): 10 kB | 33 kB | 32/109 kB | 7.7/30 kB
Progress (4): 10 kB | 33 kB | 33/109 kB | 7.7/30 kB
Progress (4): 10 kB | 33 kB | 33/109 kB | 12/30 kB 
Progress (4): 10 kB | 33 kB | 37/109 kB | 12/30 kB
Progress (4): 10 kB | 33 kB | 37/109 kB | 16/30 kB
Progress (4): 10 kB | 33 kB | 41/109 kB | 16/30 kB
Progress (4): 10 kB | 33 kB | 41/109 kB | 20/30 kB
Progress (4): 10 kB | 33 kB | 45/109 kB | 20/30 kB
Progress (4): 10 kB | 33 kB | 45/109 kB | 24/30 kB
Progress (4): 10 kB | 33 kB | 49/109 kB | 24/30 kB
                                                  
Downloaded from eclipse.maven.central.mirror: https://repo.eclipse.org/content/repositories/maven_central/org/apache/maven/maven-monitor/2.0.6/maven-monitor-2.0.6.jar (10 kB at 39 kB/s)
Progress (3): 33 kB | 49/109 kB | 28/30 kB
Progress (3): 33 kB | 53/109 kB | 28/30 kB
                                          
Downloading from eclipse.maven.central.mirror: https://repo.eclipse.org/content/repositories/maven_central/org/apache/maven/shared/maven-repository-builder/1.0-alpha-2/maven-repository-builder-1.0-alpha-2.jar
Progress (3): 33 kB | 53/109 kB | 30 kB
Progress (3): 33 kB | 57/109 kB | 30 kB
Progress (3): 33 kB | 61/109 kB | 30 kB
Progress (3): 33 kB | 65/109 kB | 30 kB
Progress (3): 33 kB | 66/109 kB | 30 kB
Progress (3): 33 kB | 70/109 kB | 30 kB
                                       
Downloaded from eclipse.maven.central.mirror: https://repo.eclipse.org/content/repositories/maven_central/org/apache/maven/shared/maven-filtering/1.0-beta-2/maven-filtering-1.0-beta-2.jar (33 kB at 126 kB/s)
Progress (2): 74/109 kB | 30 kB
                               
Downloading from eclipse.maven.central.mirror: https://repo.eclipse.org/content/repositories/maven_central/org/apache/maven/scm/maven-scm-api/1.4/maven-scm-api-1.4.jar
Progress (2): 78/109 kB | 30 kB
Progress (2): 82/109 kB | 30 kB
Progress (2): 86/109 kB | 30 kB
Progress (2): 90/109 kB | 30 kB
Progress (2): 94/109 kB | 30 kB
Progress (2): 98/109 kB | 30 kB
Progress (2): 102/109 kB | 30 kB
Progress (2): 106/109 kB | 30 kB
Progress (2): 109 kB | 30 kB    
                            
Downloaded from eclipse.maven.central.mirror: https://repo.eclipse.org/content/repositories/maven_central/org/apache/maven/maven-project/2.0.4/maven-project-2.0.4.jar (109 kB at 402 kB/s)
Downloading from eclipse.maven.central.mirror: https://repo.eclipse.org/content/repositories/maven_central/org/apache/maven/scm/maven-scm-manager-plexus/1.4/maven-scm-manager-plexus-1.4.jar
Progress (2): 30 kB | 4.1/94 kB
Progress (2): 30 kB | 7.7/94 kB
Progress (2): 30 kB | 12/94 kB 
Progress (2): 30 kB | 16/94 kB
Progress (2): 30 kB | 20/94 kB
                              
Downloaded from eclipse.maven.central.mirror: https://repo.eclipse.org/content/repositories/maven_central/org/apache/maven/maven-profile/2.0.4/maven-profile-2.0.4.jar (30 kB at 111 kB/s)
Progress (1): 24/94 kB
                      
Downloading from eclipse.maven.central.mirror: https://repo.eclipse.org/content/repositories/maven_central/org/apache/maven/scm/maven-scm-provider-svnexe/1.4/maven-scm-provider-svnexe-1.4.jar
Progress (1): 28/94 kB
Progress (1): 32/94 kB
Progress (1): 33/94 kB
Progress (1): 37/94 kB
Progress (1): 41/94 kB
Progress (1): 45/94 kB
Progress (1): 49/94 kB
Progress (1): 53/94 kB
Progress (1): 57/94 kB
Progress (1): 61/94 kB
Progress (1): 65/94 kB
Progress (1): 69/94 kB
Progress (1): 73/94 kB
Progress (1): 77/94 kB
Progress (1): 81/94 kB
Progress (1): 85/94 kB
Progress (1): 89/94 kB
Progress (1): 93/94 kB
Progress (1): 94 kB   
Progress (2): 94 kB | 4.1/23 kB
Progress (2): 94 kB | 7.7/23 kB
Progress (2): 94 kB | 12/23 kB 
Progress (2): 94 kB | 16/23 kB
Progress (2): 94 kB | 20/23 kB
Progress (2): 94 kB | 23 kB   
Progress (3): 94 kB | 23 kB | 4.1/70 kB
Progress (3): 94 kB | 23 kB | 7.7/70 kB
                                       
Downloaded from eclipse.maven.central.mirror: https://repo.eclipse.org/content/repositories/maven_central/org/apache/maven/scm/maven-scm-api/1.4/maven-scm-api-1.4.jar (94 kB at 334 kB/s)
Downloading from eclipse.maven.central.mirror: https://repo.eclipse.org/content/repositories/maven_central/regexp/regexp/1.3/regexp-1.3.jar
Progress (2): 23 kB | 12/70 kB
Progress (2): 23 kB | 16/70 kB
                              
Downloaded from eclipse.maven.central.mirror: https://repo.eclipse.org/content/repositories/maven_central/org/apache/maven/shared/maven-repository-builder/1.0-alpha-2/maven-repository-builder-1.0-alpha-2.jar (23 kB at 82 kB/s)
Downloading from eclipse.maven.central.mirror: https://repo.eclipse.org/content/repositories/maven_central/org/apache/maven/scm/maven-scm-provider-svn-commons/1.4/maven-scm-provider-svn-commons-1.4.jar
Progress (1): 20/70 kB
Progress (1): 24/70 kB
Progress (1): 28/70 kB
Progress (1): 32/70 kB
Progress (1): 36/70 kB
Progress (1): 40/70 kB
Progress (1): 44/70 kB
Progress (1): 48/70 kB
Progress (1): 52/70 kB
Progress (1): 56/70 kB
Progress (1): 60/70 kB
Progress (1): 64/70 kB
Progress (1): 68/70 kB
Progress (1): 70 kB   
Progress (2): 70 kB | 4.1/40 kB
Progress (3): 70 kB | 4.1/40 kB | 4.1/25 kB
Progress (3): 70 kB | 7.7/40 kB | 4.1/25 kB
                                           
Downloaded from eclipse.maven.central.mirror: https://repo.eclipse.org/content/repositories/maven_central/org/apache/maven/scm/maven-scm-provider-svnexe/1.4/maven-scm-provider-svnexe-1.4.jar (70 kB at 239 kB/s)
Progress (2): 7.7/40 kB | 7.7/25 kB
                                   
Downloading from eclipse.maven.central.mirror: https://repo.eclipse.org/content/repositories/maven_central/org/apache/maven/scm/maven-scm-provider-gitexe/1.4/maven-scm-provider-gitexe-1.4.jar
Progress (2): 12/40 kB | 7.7/25 kB
Progress (2): 12/40 kB | 12/25 kB 
Progress (2): 16/40 kB | 12/25 kB
Progress (2): 16/40 kB | 16/25 kB
Progress (2): 20/40 kB | 16/25 kB
Progress (2): 20/40 kB | 20/25 kB
Progress (2): 24/40 kB | 20/25 kB
Progress (2): 24/40 kB | 24/25 kB
Progress (2): 28/40 kB | 24/25 kB
Progress (2): 28/40 kB | 25 kB   
Progress (2): 32/40 kB | 25 kB
Progress (2): 33/40 kB | 25 kB
Progress (2): 37/40 kB | 25 kB
Progress (2): 40 kB | 25 kB   
Progress (3): 40 kB | 25 kB | 4.1/11 kB
Progress (3): 40 kB | 25 kB | 7.7/11 kB
Progress (3): 40 kB | 25 kB | 11 kB    
                                   
Downloaded from eclipse.maven.central.mirror: https://repo.eclipse.org/content/repositories/maven_central/org/apache/maven/scm/maven-scm-provider-svn-commons/1.4/maven-scm-provider-svn-commons-1.4.jar (40 kB at 134 kB/s)
Downloading from eclipse.maven.central.mirror: https://repo.eclipse.org/content/repositories/maven_central/org/apache/maven/scm/maven-scm-provider-git-commons/1.4/maven-scm-provider-git-commons-1.4.jar
Downloaded from eclipse.maven.central.mirror: https://repo.eclipse.org/content/repositories/maven_central/org/apache/maven/scm/maven-scm-manager-plexus/1.4/maven-scm-manager-plexus-1.4.jar (11 kB at 34 kB/s)
Downloaded from eclipse.maven.central.mirror: https://repo.eclipse.org/content/repositories/maven_central/regexp/regexp/1.3/regexp-1.3.jar (25 kB at 83 kB/s)
Downloading from eclipse.maven.central.mirror: https://repo.eclipse.org/content/repositories/maven_central/org/apache/maven/scm/maven-scm-provider-hg/1.4/maven-scm-provider-hg-1.4.jar
Progress (1): 4.1/52 kB
Progress (1): 7.7/52 kB
Progress (1): 12/52 kB 
Progress (1): 16/52 kB
Progress (1): 20/52 kB
Progress (1): 24/52 kB
Progress (1): 28/52 kB
Progress (1): 32/52 kB
Progress (1): 36/52 kB
Progress (1): 40/52 kB
Progress (1): 44/52 kB
Progress (1): 48/52 kB
Progress (1): 52/52 kB
Progress (1): 52 kB   
Progress (2): 52 kB | 4.1/55 kB
Progress (2): 52 kB | 7.7/55 kB
Progress (2): 52 kB | 12/55 kB 
Progress (2): 52 kB | 16/55 kB
Progress (2): 52 kB | 20/55 kB
Progress (2): 52 kB | 24/55 kB
Progress (2): 52 kB | 28/55 kB
Progress (2): 52 kB | 32/55 kB
Progress (2): 52 kB | 33/55 kB
Progress (2): 52 kB | 37/55 kB
Progress (2): 52 kB | 41/55 kB
Progress (2): 52 kB | 45/55 kB
Progress (2): 52 kB | 49/55 kB
Progress (2): 52 kB | 53/55 kB
Progress (2): 52 kB | 55 kB   
                           
Downloaded from eclipse.maven.central.mirror: https://repo.eclipse.org/content/repositories/maven_central/org/apache/maven/scm/maven-scm-provider-gitexe/1.4/maven-scm-provider-gitexe-1.4.jar (52 kB at 158 kB/s)
Downloaded from eclipse.maven.central.mirror: https://repo.eclipse.org/content/repositories/maven_central/org/apache/maven/scm/maven-scm-provider-hg/1.4/maven-scm-provider-hg-1.4.jar (55 kB at 164 kB/s)
Progress (1): 4.1/38 kB
Progress (1): 7.7/38 kB
Progress (1): 12/38 kB 
Progress (1): 16/38 kB
Progress (1): 20/38 kB
Progress (1): 24/38 kB
Progress (1): 28/38 kB
Progress (1): 32/38 kB
Progress (1): 36/38 kB
Progress (1): 38 kB   
                   
Downloaded from eclipse.maven.central.mirror: https://repo.eclipse.org/content/repositories/maven_central/org/apache/maven/scm/maven-scm-provider-git-commons/1.4/maven-scm-provider-git-commons-1.4.jar (38 kB at 108 kB/s)
Progress (1): 0/1.4 MB
Progress (1): 0/1.4 MB
Progress (1): 0/1.4 MB
Progress (1): 0/1.4 MB
Progress (1): 0/1.4 MB
Progress (1): 0/1.4 MB
Progress (1): 0/1.4 MB
Progress (1): 0/1.4 MB
Progress (1): 0/1.4 MB
Progress (1): 0/1.4 MB
Progress (1): 0/1.4 MB
Progress (1): 0/1.4 MB
Progress (1): 0/1.4 MB
Progress (1): 0.1/1.4 MB
Progress (1): 0.1/1.4 MB
Progress (1): 0.1/1.4 MB
Progress (1): 0.1/1.4 MB
Progress (1): 0.1/1.4 MB
Progress (1): 0.1/1.4 MB
Progress (1): 0.1/1.4 MB
Progress (1): 0.1/1.4 MB
Progress (1): 0.1/1.4 MB
Progress (1): 0.1/1.4 MB
Progress (1): 0.1/1.4 MB
Progress (1): 0.1/1.4 MB
Progress (1): 0.1/1.4 MB
Progress (1): 0.1/1.4 MB
Progress (1): 0.1/1.4 MB
Progress (1): 0.1/1.4 MB
Progress (1): 0.1/1.4 MB
Progress (1): 0.1/1.4 MB
Progress (1): 0.1/1.4 MB
Progress (1): 0.1/1.4 MB
Progress (1): 0.1/1.4 MB
Progress (1): 0.1/1.4 MB
Progress (1): 0.1/1.4 MB
Progress (1): 0.1/1.4 MB
Progress (1): 0.1/1.4 MB
Progress (1): 0.1/1.4 MB
Progress (1): 0.1/1.4 MB
Progress (1): 0.2/1.4 MB
Progress (1): 0.2/1.4 MB
Progress (1): 0.2/1.4 MB
Progress (1): 0.2/1.4 MB
Progress (1): 0.2/1.4 MB
Progress (1): 0.2/1.4 MB
Progress (1): 0.2/1.4 MB
Progress (1): 0.2/1.4 MB
Progress (1): 0.2/1.4 MB
Progress (1): 0.2/1.4 MB
Progress (1): 0.2/1.4 MB
Progress (1): 0.2/1.4 MB
Progress (1): 0.2/1.4 MB
Progress (1): 0.2/1.4 MB
Progress (1): 0.2/1.4 MB
Progress (1): 0.2/1.4 MB
Progress (1): 0.2/1.4 MB
Progress (1): 0.2/1.4 MB
Progress (1): 0.2/1.4 MB
Progress (1): 0.2/1.4 MB
Progress (1): 0.2/1.4 MB
Progress (1): 0.2/1.4 MB
Progress (1): 0.2/1.4 MB
Progress (1): 0.2/1.4 MB
Progress (1): 0.2/1.4 MB
Progress (1): 0.3/1.4 MB
Progress (1): 0.3/1.4 MB
Progress (1): 0.3/1.4 MB
Progress (1): 0.3/1.4 MB
Progress (1): 0.3/1.4 MB
Progress (1): 0.3/1.4 MB
Progress (1): 0.3/1.4 MB
Progress (1): 0.3/1.4 MB
Progress (1): 0.3/1.4 MB
Progress (1): 0.3/1.4 MB
Progress (1): 0.3/1.4 MB
Progress (1): 0.3/1.4 MB
Progress (1): 0.3/1.4 MB
Progress (1): 0.3/1.4 MB
Progress (1): 0.3/1.4 MB
Progress (1): 0.3/1.4 MB
Progress (1): 0.3/1.4 MB
Progress (1): 0.3/1.4 MB
Progress (1): 0.3/1.4 MB
Progress (1): 0.3/1.4 MB
Progress (1): 0.3/1.4 MB
Progress (1): 0.3/1.4 MB
Progress (1): 0.3/1.4 MB
Progress (1): 0.3/1.4 MB
Progress (1): 0.3/1.4 MB
Progress (1): 0.4/1.4 MB
Progress (1): 0.4/1.4 MB
Progress (1): 0.4/1.4 MB
Progress (1): 0.4/1.4 MB
Progress (1): 0.4/1.4 MB
Progress (1): 0.4/1.4 MB
Progress (1): 0.4/1.4 MB
Progress (1): 0.4/1.4 MB
Progress (1): 0.4/1.4 MB
Progress (1): 0.4/1.4 MB
Progress (1): 0.4/1.4 MB
Progress (1): 0.4/1.4 MB
Progress (1): 0.4/1.4 MB
Progress (1): 0.4/1.4 MB
Progress (1): 0.4/1.4 MB
Progress (1): 0.4/1.4 MB
Progress (1): 0.4/1.4 MB
Progress (1): 0.4/1.4 MB
Progress (1): 0.4/1.4 MB
Progress (1): 0.4/1.4 MB
Progress (1): 0.4/1.4 MB
Progress (1): 0.4/1.4 MB
Progress (1): 0.4/1.4 MB
Progress (1): 0.4/1.4 MB
Progress (1): 0.4/1.4 MB
Progress (1): 0.5/1.4 MB
Progress (1): 0.5/1.4 MB
Progress (1): 0.5/1.4 MB
Progress (1): 0.5/1.4 MB
Progress (1): 0.5/1.4 MB
Progress (1): 0.5/1.4 MB
Progress (1): 0.5/1.4 MB
Progress (1): 0.5/1.4 MB
Progress (1): 0.5/1.4 MB
Progress (1): 0.5/1.4 MB
Progress (1): 0.5/1.4 MB
Progress (1): 0.5/1.4 MB
Progress (1): 0.5/1.4 MB
Progress (1): 0.5/1.4 MB
Progress (1): 0.5/1.4 MB
Progress (1): 0.5/1.4 MB
Progress (1): 0.5/1.4 MB
Progress (1): 0.5/1.4 MB
Progress (1): 0.5/1.4 MB
Progress (1): 0.5/1.4 MB
Progress (1): 0.5/1.4 MB
Progress (1): 0.5/1.4 MB
Progress (1): 0.5/1.4 MB
Progress (1): 0.5/1.4 MB
Progress (1): 0.5/1.4 MB
Progress (1): 0.6/1.4 MB
Progress (1): 0.6/1.4 MB
Progress (1): 0.6/1.4 MB
Progress (1): 0.6/1.4 MB
Progress (1): 0.6/1.4 MB
Progress (1): 0.6/1.4 MB
Progress (1): 0.6/1.4 MB
Progress (1): 0.6/1.4 MB
Progress (1): 0.6/1.4 MB
Progress (1): 0.6/1.4 MB
Progress (1): 0.6/1.4 MB
Progress (1): 0.6/1.4 MB
Progress (1): 0.6/1.4 MB
Progress (1): 0.6/1.4 MB
Progress (1): 0.6/1.4 MB
Progress (1): 0.6/1.4 MB
Progress (1): 0.6/1.4 MB
Progress (1): 0.6/1.4 MB
Progress (1): 0.6/1.4 MB
Progress (1): 0.6/1.4 MB
Progress (1): 0.6/1.4 MB
Progress (1): 0.6/1.4 MB
Progress (1): 0.6/1.4 MB
Progress (1): 0.6/1.4 MB
Progress (1): 0.6/1.4 MB
Progress (1): 0.7/1.4 MB
Progress (1): 0.7/1.4 MB
Progress (1): 0.7/1.4 MB
Progress (1): 0.7/1.4 MB
Progress (1): 0.7/1.4 MB
Progress (1): 0.7/1.4 MB
Progress (1): 0.7/1.4 MB
Progress (1): 0.7/1.4 MB
Progress (1): 0.7/1.4 MB
Progress (1): 0.7/1.4 MB
Progress (1): 0.7/1.4 MB
Progress (1): 0.7/1.4 MB
Progress (1): 0.7/1.4 MB
Progress (1): 0.7/1.4 MB
Progress (1): 0.7/1.4 MB
Progress (1): 0.7/1.4 MB
Progress (1): 0.7/1.4 MB
Progress (1): 0.7/1.4 MB
Progress (1): 0.7/1.4 MB
Progress (1): 0.7/1.4 MB
Progress (1): 0.7/1.4 MB
Progress (1): 0.7/1.4 MB
Progress (1): 0.7/1.4 MB
Progress (1): 0.7/1.4 MB
Progress (1): 0.7/1.4 MB
Progress (1): 0.8/1.4 MB
Progress (1): 0.8/1.4 MB
Progress (1): 0.8/1.4 MB
Progress (1): 0.8/1.4 MB
Progress (1): 0.8/1.4 MB
Progress (1): 0.8/1.4 MB
Progress (1): 0.8/1.4 MB
Progress (1): 0.8/1.4 MB
Progress (1): 0.8/1.4 MB
Progress (1): 0.8/1.4 MB
Progress (1): 0.8/1.4 MB
Progress (1): 0.8/1.4 MB
Progress (1): 0.8/1.4 MB
Progress (1): 0.8/1.4 MB
Progress (1): 0.8/1.4 MB
Progress (1): 0.8/1.4 MB
Progress (1): 0.8/1.4 MB
Progress (1): 0.8/1.4 MB
Progress (1): 0.8/1.4 MB
Progress (1): 0.8/1.4 MB
Progress (1): 0.8/1.4 MB
Progress (1): 0.8/1.4 MB
Progress (1): 0.8/1.4 MB
Progress (1): 0.8/1.4 MB
Progress (1): 0.8/1.4 MB
Progress (1): 0.9/1.4 MB
Progress (1): 0.9/1.4 MB
Progress (1): 0.9/1.4 MB
Progress (1): 0.9/1.4 MB
Progress (1): 0.9/1.4 MB
Progress (1): 0.9/1.4 MB
Progress (1): 0.9/1.4 MB
Progress (1): 0.9/1.4 MB
Progress (1): 0.9/1.4 MB
Progress (1): 0.9/1.4 MB
Progress (1): 0.9/1.4 MB
Progress (1): 0.9/1.4 MB
Progress (1): 0.9/1.4 MB
Progress (1): 0.9/1.4 MB
Progress (1): 0.9/1.4 MB
Progress (1): 0.9/1.4 MB
Progress (1): 0.9/1.4 MB
Progress (1): 0.9/1.4 MB
Progress (1): 0.9/1.4 MB
Progress (1): 0.9/1.4 MB
Progress (1): 0.9/1.4 MB
Progress (1): 0.9/1.4 MB
Progress (1): 0.9/1.4 MB
Progress (1): 0.9/1.4 MB
Progress (1): 0.9/1.4 MB
Progress (1): 1.0/1.4 MB
Progress (1): 1.0/1.4 MB
Progress (1): 1.0/1.4 MB
Progress (1): 1.0/1.4 MB
Progress (1): 1.0/1.4 MB
Progress (1): 1.0/1.4 MB
Progress (1): 1.0/1.4 MB
Progress (1): 1.0/1.4 MB
Progress (1): 1.0/1.4 MB
Progress (1): 1.0/1.4 MB
Progress (1): 1.0/1.4 MB
Progress (1): 1.0/1.4 MB
Progress (1): 1.0/1.4 MB
Progress (1): 1.0/1.4 MB
Progress (1): 1.0/1.4 MB
Progress (1): 1.0/1.4 MB
Progress (1): 1.0/1.4 MB
Progress (1): 1.0/1.4 MB
Progress (1): 1.0/1.4 MB
Progress (1): 1.0/1.4 MB
Progress (1): 1.0/1.4 MB
Progress (1): 1.0/1.4 MB
Progress (1): 1.0/1.4 MB
Progress (1): 1.0/1.4 MB
Progress (1): 1.0/1.4 MB
Progress (1): 1.1/1.4 MB
Progress (1): 1.1/1.4 MB
Progress (1): 1.1/1.4 MB
Progress (1): 1.1/1.4 MB
Progress (1): 1.1/1.4 MB
Progress (1): 1.1/1.4 MB
Progress (1): 1.1/1.4 MB
Progress (1): 1.1/1.4 MB
Progress (1): 1.1/1.4 MB
Progress (1): 1.1/1.4 MB
Progress (1): 1.1/1.4 MB
Progress (1): 1.1/1.4 MB
Progress (1): 1.1/1.4 MB
Progress (1): 1.1/1.4 MB
Progress (1): 1.1/1.4 MB
Progress (1): 1.1/1.4 MB
Progress (1): 1.1/1.4 MB
Progress (1): 1.1/1.4 MB
Progress (1): 1.1/1.4 MB
Progress (1): 1.1/1.4 MB
Progress (1): 1.1/1.4 MB
Progress (1): 1.1/1.4 MB
Progress (1): 1.1/1.4 MB
Progress (1): 1.1/1.4 MB
Progress (1): 1.1/1.4 MB
Progress (1): 1.2/1.4 MB
Progress (1): 1.2/1.4 MB
Progress (1): 1.2/1.4 MB
Progress (1): 1.2/1.4 MB
Progress (1): 1.2/1.4 MB
Progress (1): 1.2/1.4 MB
Progress (1): 1.2/1.4 MB
Progress (1): 1.2/1.4 MB
Progress (1): 1.2/1.4 MB
Progress (1): 1.2/1.4 MB
Progress (1): 1.2/1.4 MB
Progress (1): 1.2/1.4 MB
Progress (1): 1.2/1.4 MB
Progress (1): 1.2/1.4 MB
Progress (1): 1.2/1.4 MB
Progress (1): 1.2/1.4 MB
Progress (1): 1.2/1.4 MB
Progress (1): 1.2/1.4 MB
Progress (1): 1.2/1.4 MB
Progress (1): 1.2/1.4 MB
Progress (1): 1.2/1.4 MB
Progress (1): 1.2/1.4 MB
Progress (1): 1.2/1.4 MB
Progress (1): 1.2/1.4 MB
Progress (1): 1.2/1.4 MB
Progress (1): 1.3/1.4 MB
Progress (1): 1.3/1.4 MB
Progress (1): 1.3/1.4 MB
Progress (1): 1.3/1.4 MB
Progress (1): 1.3/1.4 MB
Progress (1): 1.3/1.4 MB
Progress (1): 1.3/1.4 MB
Progress (1): 1.3/1.4 MB
Progress (1): 1.3/1.4 MB
Progress (1): 1.3/1.4 MB
Progress (1): 1.3/1.4 MB
Progress (1): 1.3/1.4 MB
Progress (1): 1.3/1.4 MB
Progress (1): 1.3/1.4 MB
Progress (1): 1.3/1.4 MB
Progress (1): 1.3/1.4 MB
Progress (1): 1.3/1.4 MB
Progress (1): 1.3/1.4 MB
Progress (1): 1.3/1.4 MB
Progress (1): 1.3/1.4 MB
Progress (1): 1.3/1.4 MB
Progress (1): 1.3/1.4 MB
Progress (1): 1.3/1.4 MB
Progress (1): 1.3/1.4 MB
Progress (1): 1.3/1.4 MB
Progress (1): 1.4/1.4 MB
Progress (1): 1.4/1.4 MB
Progress (1): 1.4/1.4 MB
Progress (1): 1.4/1.4 MB
Progress (1): 1.4/1.4 MB
Progress (1): 1.4/1.4 MB
Progress (1): 1.4/1.4 MB
Progress (1): 1.4/1.4 MB
Progress (1): 1.4/1.4 MB
Progress (1): 1.4/1.4 MB
Progress (1): 1.4/1.4 MB
Progress (1): 1.4/1.4 MB
Progress (1): 1.4/1.4 MB
Progress (1): 1.4/1.4 MB
Progress (1): 1.4/1.4 MB
Progress (1): 1.4/1.4 MB
Progress (1): 1.4/1.4 MB
Progress (1): 1.4/1.4 MB
Progress (1): 1.4/1.4 MB
Progress (1): 1.4/1.4 MB
Progress (1): 1.4/1.4 MB
Progress (1): 1.4/1.4 MB
Progress (1): 1.4/1.4 MB
Progress (1): 1.4/1.4 MB
Progress (1): 1.4/1.4 MB
Progress (1): 1.4 MB    
                    
Downloaded from eclipse.maven.central.mirror: https://repo.eclipse.org/content/repositories/maven_central/biz/aQute/bnd/bndlib/2.2.0/bndlib-2.2.0.jar (1.4 MB at 1.3 MB/s)
[INFO] ------------------------------------------------------------------------
[INFO] Reactor Build Order:
[INFO] 
[INFO] Nexus Unzip Plugin - Parent (Incubation)
[INFO] Nexus Unzip Plugin (Incubation)
[INFO] Nexus Unzip Plugin - Integration Tests (Incubation)
[INFO] 
[INFO] ------------------------------------------------------------------------
[INFO] Building Nexus Unzip Plugin - Parent (Incubation) 0.15.0-SNAPSHOT
[INFO] ------------------------------------------------------------------------
Downloading from repository.sonatype.org: https://repository.sonatype.org/content/groups/forge/org/apache/maven/plugins/maven-enforcer-plugin/1.3.1/maven-enforcer-plugin-1.3.1.pom
Downloading from eclipse.maven.central.mirror: https://repo.eclipse.org/content/repositories/maven_central/org/apache/maven/plugins/maven-enforcer-plugin/1.3.1/maven-enforcer-plugin-1.3.1.pom
Progress (1): 4.1/6.5 kB
Progress (1): 6.5 kB    
                    
Downloaded from eclipse.maven.central.mirror: https://repo.eclipse.org/content/repositories/maven_central/org/apache/maven/plugins/maven-enforcer-plugin/1.3.1/maven-enforcer-plugin-1.3.1.pom (6.5 kB at 151 kB/s)
Downloading from repository.sonatype.org: https://repository.sonatype.org/content/groups/forge/org/apache/maven/enforcer/enforcer/1.3.1/enforcer-1.3.1.pom
Downloading from eclipse.maven.central.mirror: https://repo.eclipse.org/content/repositories/maven_central/org/apache/maven/enforcer/enforcer/1.3.1/enforcer-1.3.1.pom
Progress (1): 4.1/12 kB
Progress (1): 7.7/12 kB
Progress (1): 12 kB    
                   
Downloaded from eclipse.maven.central.mirror: https://repo.eclipse.org/content/repositories/maven_central/org/apache/maven/enforcer/enforcer/1.3.1/enforcer-1.3.1.pom (12 kB at 356 kB/s)
Downloading from repository.sonatype.org: https://repository.sonatype.org/content/groups/forge/org/apache/maven/maven-parent/23/maven-parent-23.pom
Downloading from eclipse.maven.central.mirror: https://repo.eclipse.org/content/repositories/maven_central/org/apache/maven/maven-parent/23/maven-parent-23.pom
Progress (1): 4.1/33 kB
Progress (1): 7.7/33 kB
Progress (1): 12/33 kB 
Progress (1): 16/33 kB
Progress (1): 20/33 kB
Progress (1): 24/33 kB
Progress (1): 28/33 kB
Progress (1): 32/33 kB
Progress (1): 33 kB   
                   
Downloaded from eclipse.maven.central.mirror: https://repo.eclipse.org/content/repositories/maven_central/org/apache/maven/maven-parent/23/maven-parent-23.pom (33 kB at 1.3 MB/s)
Downloading from repository.sonatype.org: https://repository.sonatype.org/content/groups/forge/org/apache/apache/13/apache-13.pom
Downloading from eclipse.maven.central.mirror: https://repo.eclipse.org/content/repositories/maven_central/org/apache/apache/13/apache-13.pom
Progress (1): 4.1/14 kB
Progress (1): 7.7/14 kB
Progress (1): 12/14 kB 
Progress (1): 14 kB   
                   
Downloaded from eclipse.maven.central.mirror: https://repo.eclipse.org/content/repositories/maven_central/org/apache/apache/13/apache-13.pom (14 kB at 932 kB/s)
Downloading from repository.sonatype.org: https://repository.sonatype.org/content/groups/forge/org/apache/maven/plugins/maven-enforcer-plugin/1.3.1/maven-enforcer-plugin-1.3.1.jar
Downloading from eclipse.maven.central.mirror: https://repo.eclipse.org/content/repositories/maven_central/org/apache/maven/plugins/maven-enforcer-plugin/1.3.1/maven-enforcer-plugin-1.3.1.jar
Progress (1): 4.1/26 kB
Progress (1): 7.7/26 kB
Progress (1): 12/26 kB 
Progress (1): 16/26 kB
Progress (1): 20/26 kB
Progress (1): 24/26 kB
Progress (1): 26 kB   
                   
Downloaded from eclipse.maven.central.mirror: https://repo.eclipse.org/content/repositories/maven_central/org/apache/maven/plugins/maven-enforcer-plugin/1.3.1/maven-enforcer-plugin-1.3.1.jar (26 kB at 428 kB/s)
Downloading from repository.sonatype.org: https://repository.sonatype.org/content/groups/forge/org/apache/maven/plugins/maven-clean-plugin/2.5/maven-clean-plugin-2.5.pom
Downloading from eclipse.maven.central.mirror: https://repo.eclipse.org/content/repositories/maven_central/org/apache/maven/plugins/maven-clean-plugin/2.5/maven-clean-plugin-2.5.pom
Progress (1): 3.9 kB
                    
Downloaded from eclipse.maven.central.mirror: https://repo.eclipse.org/content/repositories/maven_central/org/apache/maven/plugins/maven-clean-plugin/2.5/maven-clean-plugin-2.5.pom (3.9 kB at 261 kB/s)
Downloading from repository.sonatype.org: https://repository.sonatype.org/content/groups/forge/org/apache/maven/plugins/maven-plugins/22/maven-plugins-22.pom
Progress (1): 809 B
Progress (1): 2.8 kB
Progress (1): 3.8 kB
Progress (1): 4.0 kB
Progress (1): 6.6 kB
Progress (1): 6.9 kB
Progress (1): 9.0 kB
Progress (1): 11 kB 
Progress (1): 13 kB
[WARNING] Could not validate integrity of download from https://repository.sonatype.org/content/groups/forge/org/apache/maven/plugins/maven-plugins/22/maven-plugins-22.pom: Checksum validation failed, no checksums available
                   
[WARNING] Checksum validation failed, no checksums available from repository.sonatype.org for https://repository.sonatype.org/content/groups/forge/org/apache/maven/plugins/maven-plugins/22/maven-plugins-22.pom
Downloaded from repository.sonatype.org: https://repository.sonatype.org/content/groups/forge/org/apache/maven/plugins/maven-plugins/22/maven-plugins-22.pom (13 kB at 23 kB/s)
Downloading from repository.sonatype.org: https://repository.sonatype.org/content/groups/forge/org/apache/maven/plugins/maven-clean-plugin/2.5/maven-clean-plugin-2.5.jar
Downloading from eclipse.maven.central.mirror: https://repo.eclipse.org/content/repositories/maven_central/org/apache/maven/plugins/maven-clean-plugin/2.5/maven-clean-plugin-2.5.jar
Progress (1): 4.1/25 kB
Progress (1): 7.7/25 kB
Progress (1): 12/25 kB 
Progress (1): 16/25 kB
Progress (1): 20/25 kB
Progress (1): 24/25 kB
Progress (1): 25 kB   
                   
Downloaded from eclipse.maven.central.mirror: https://repo.eclipse.org/content/repositories/maven_central/org/apache/maven/plugins/maven-clean-plugin/2.5/maven-clean-plugin-2.5.jar (25 kB at 1.2 MB/s)
Downloading from repository.sonatype.org: https://repository.sonatype.org/content/groups/forge/org/apache/maven/plugins/maven-install-plugin/2.4/maven-install-plugin-2.4.pom
Progress (1): 809 B
Progress (1): 2.4 kB
Progress (1): 3.8 kB
Progress (1): 6.0 kB
Progress (1): 6.4 kB
[WARNING] Could not validate integrity of download from https://repository.sonatype.org/content/groups/forge/org/apache/maven/plugins/maven-install-plugin/2.4/maven-install-plugin-2.4.pom: Checksum validation failed, no checksums available
                    
[WARNING] Checksum validation failed, no checksums available from repository.sonatype.org for https://repository.sonatype.org/content/groups/forge/org/apache/maven/plugins/maven-install-plugin/2.4/maven-install-plugin-2.4.pom
Downloaded from repository.sonatype.org: https://repository.sonatype.org/content/groups/forge/org/apache/maven/plugins/maven-install-plugin/2.4/maven-install-plugin-2.4.pom (6.4 kB at 13 kB/s)
Downloading from repository.sonatype.org: https://repository.sonatype.org/content/groups/forge/org/apache/maven/plugins/maven-plugins/23/maven-plugins-23.pom
Progress (1): 801 B
Progress (1): 2.4 kB
Progress (1): 3.8 kB
Progress (1): 6.2 kB
Progress (1): 7.9 kB
Progress (1): 9.2 kB
[WARNING] Could not validate integrity of download from https://repository.sonatype.org/content/groups/forge/org/apache/maven/plugins/maven-plugins/23/maven-plugins-23.pom: Checksum validation failed, no checksums available
                    
[WARNING] Checksum validation failed, no checksums available from repository.sonatype.org for https://repository.sonatype.org/content/groups/forge/org/apache/maven/plugins/maven-plugins/23/maven-plugins-23.pom
Downloaded from repository.sonatype.org: https://repository.sonatype.org/content/groups/forge/org/apache/maven/plugins/maven-plugins/23/maven-plugins-23.pom (9.2 kB at 19 kB/s)
Downloading from repository.sonatype.org: https://repository.sonatype.org/content/groups/forge/org/apache/maven/maven-parent/22/maven-parent-22.pom
Progress (1): 807 B
Progress (1): 2.1 kB
Progress (1): 3.8 kB
Progress (1): 7.9 kB
Progress (1): 12 kB 
Progress (1): 12 kB
Progress (1): 16 kB
Progress (1): 16 kB
Progress (1): 20 kB
Progress (1): 20 kB
Progress (1): 22 kB
Progress (1): 24 kB
Progress (1): 28 kB
Progress (1): 28 kB
Progress (1): 30 kB
[WARNING] Could not validate integrity of download from https://repository.sonatype.org/content/groups/forge/org/apache/maven/maven-parent/22/maven-parent-22.pom: Checksum validation failed, no checksums available
                   
[WARNING] Checksum validation failed, no checksums available from repository.sonatype.org for https://repository.sonatype.org/content/groups/forge/org/apache/maven/maven-parent/22/maven-parent-22.pom
Downloaded from repository.sonatype.org: https://repository.sonatype.org/content/groups/forge/org/apache/maven/maven-parent/22/maven-parent-22.pom (30 kB at 51 kB/s)
Downloading from repository.sonatype.org: https://repository.sonatype.org/content/groups/forge/org/apache/apache/11/apache-11.pom
Progress (1): 850 B
Progress (1): 1.1 kB
Progress (1): 2.5 kB
Progress (1): 4.0 kB
Progress (1): 7.9 kB
Progress (1): 8.1 kB
Progress (1): 11 kB 
Progress (1): 12 kB
Progress (1): 15 kB
[WARNING] Could not validate integrity of download from https://repository.sonatype.org/content/groups/forge/org/apache/apache/11/apache-11.pom: Checksum validation failed, no checksums available
                   
[WARNING] Checksum validation failed, no checksums available from repository.sonatype.org for https://repository.sonatype.org/content/groups/forge/org/apache/apache/11/apache-11.pom
Downloaded from repository.sonatype.org: https://repository.sonatype.org/content/groups/forge/org/apache/apache/11/apache-11.pom (15 kB at 31 kB/s)
Downloading from repository.sonatype.org: https://repository.sonatype.org/content/groups/forge/org/apache/maven/plugins/maven-install-plugin/2.4/maven-install-plugin-2.4.jar
Progress (1): 1.1/27 kB
Progress (1): 4.0/27 kB
Progress (1): 8.1/27 kB
Progress (1): 11/27 kB 
Progress (1): 13/27 kB
Progress (1): 17/27 kB
Progress (1): 21/27 kB
Progress (1): 25/27 kB
Progress (1): 27 kB   
[WARNING] Could not validate integrity of download from https://repository.sonatype.org/content/groups/forge/org/apache/maven/plugins/maven-install-plugin/2.4/maven-install-plugin-2.4.jar: Checksum validation failed, no checksums available
                   
[WARNING] Checksum validation failed, no checksums available from repository.sonatype.org for https://repository.sonatype.org/content/groups/forge/org/apache/maven/plugins/maven-install-plugin/2.4/maven-install-plugin-2.4.jar
Downloaded from repository.sonatype.org: https://repository.sonatype.org/content/groups/forge/org/apache/maven/plugins/maven-install-plugin/2.4/maven-install-plugin-2.4.jar (27 kB at 52 kB/s)
Downloading from repository.sonatype.org: https://repository.sonatype.org/content/groups/forge/org/apache/maven/plugins/maven-deploy-plugin/2.7/maven-deploy-plugin-2.7.pom
Progress (1): 849 B
Progress (1): 1.1 kB
Progress (1): 3.2 kB
Progress (1): 4.0 kB
Progress (1): 5.6 kB
[WARNING] Could not validate integrity of download from https://repository.sonatype.org/content/groups/forge/org/apache/maven/plugins/maven-deploy-plugin/2.7/maven-deploy-plugin-2.7.pom: Checksum validation failed, no checksums available
                    
[WARNING] Checksum validation failed, no checksums available from repository.sonatype.org for https://repository.sonatype.org/content/groups/forge/org/apache/maven/plugins/maven-deploy-plugin/2.7/maven-deploy-plugin-2.7.pom
Downloaded from repository.sonatype.org: https://repository.sonatype.org/content/groups/forge/org/apache/maven/plugins/maven-deploy-plugin/2.7/maven-deploy-plugin-2.7.pom (5.6 kB at 9.9 kB/s)
Downloading from repository.sonatype.org: https://repository.sonatype.org/content/groups/forge/org/apache/maven/plugins/maven-deploy-plugin/2.7/maven-deploy-plugin-2.7.jar
Progress (1): 3.8/27 kB
Progress (1): 4.0/27 kB
Progress (1): 8.1/27 kB
Progress (1): 9.8/27 kB
Progress (1): 14/27 kB 
Progress (1): 18/27 kB
Progress (1): 22/27 kB
Progress (1): 26/27 kB
Progress (1): 27 kB   
[WARNING] Could not validate integrity of download from https://repository.sonatype.org/content/groups/forge/org/apache/maven/plugins/maven-deploy-plugin/2.7/maven-deploy-plugin-2.7.jar: Checksum validation failed, no checksums available
                   
[WARNING] Checksum validation failed, no checksums available from repository.sonatype.org for https://repository.sonatype.org/content/groups/forge/org/apache/maven/plugins/maven-deploy-plugin/2.7/maven-deploy-plugin-2.7.jar
Downloaded from repository.sonatype.org: https://repository.sonatype.org/content/groups/forge/org/apache/maven/plugins/maven-deploy-plugin/2.7/maven-deploy-plugin-2.7.jar (27 kB at 51 kB/s)
[INFO] 
[INFO] --- maven-clean-plugin:2.5:clean (default-clean) @ unzip-repository-plugin-parent ---
Downloading from repository.sonatype.org: https://repository.sonatype.org/content/groups/forge/org/apache/maven/maven-plugin-api/2.0.6/maven-plugin-api-2.0.6.pom
Progress (1): 847 B
Progress (1): 1.5 kB
[WARNING] Could not validate integrity of download from https://repository.sonatype.org/content/groups/forge/org/apache/maven/maven-plugin-api/2.0.6/maven-plugin-api-2.0.6.pom: Checksum validation failed, no checksums available
                    
[WARNING] Checksum validation failed, no checksums available from repository.sonatype.org for https://repository.sonatype.org/content/groups/forge/org/apache/maven/maven-plugin-api/2.0.6/maven-plugin-api-2.0.6.pom
Downloaded from repository.sonatype.org: https://repository.sonatype.org/content/groups/forge/org/apache/maven/maven-plugin-api/2.0.6/maven-plugin-api-2.0.6.pom (1.5 kB at 2.8 kB/s)
Downloading from repository.sonatype.org: https://repository.sonatype.org/content/groups/forge/org/codehaus/plexus/plexus-utils/3.0/plexus-utils-3.0.pom
Progress (1): 870 B
Progress (1): 1.1 kB
Progress (1): 2.5 kB
Progress (1): 4.1 kB
                    
Downloaded from repository.sonatype.org: https://repository.sonatype.org/content/groups/forge/org/codehaus/plexus/plexus-utils/3.0/plexus-utils-3.0.pom (4.1 kB at 16 kB/s)
Downloading from repository.sonatype.org: https://repository.sonatype.org/content/groups/forge/org/codehaus/plexus/plexus-utils/3.0/plexus-utils-3.0.jar
Downloading from repository.sonatype.org: https://repository.sonatype.org/content/groups/forge/org/apache/maven/maven-plugin-api/2.0.6/maven-plugin-api-2.0.6.jar
Progress (1): 1.1/226 kB
Progress (1): 4.0/226 kB
Progress (1): 8.1/226 kB
Progress (1): 8.4/226 kB
Progress (1): 12/226 kB 
Progress (1): 17/226 kB
Progress (1): 21/226 kB
Progress (1): 25/226 kB
Progress (1): 29/226 kB
Progress (1): 33/226 kB
Progress (1): 37/226 kB
Progress (1): 41/226 kB
Progress (1): 45/226 kB
Progress (1): 49/226 kB
Progress (1): 53/226 kB
Progress (1): 57/226 kB
Progress (1): 61/226 kB
Progress (1): 65/226 kB
Progress (1): 70/226 kB
                       
Progress (1): 74/226 kB
Progress (1): 78/226 kB
Progress (1): 82/226 kB
Progress (1): 86/226 kB
Progress (1): 90/226 kB
Progress (1): 94/226 kB
Progress (1): 98/226 kB
Progress (1): 102/226 kB
Progress (1): 106/226 kB
Progress (1): 111/226 kB
Progress (1): 115/226 kB
Progress (1): 119/226 kB
Progress (1): 123/226 kB
Progress (1): 127/226 kB
Progress (1): 131/226 kB
Progress (1): 135/226 kB
Progress (1): 139/226 kB
Progress (1): 143/226 kB
Progress (1): 147/226 kB
Progress (1): 152/226 kB
Progress (1): 156/226 kB
Progress (1): 160/226 kB
Progress (1): 164/226 kB
Progress (1): 168/226 kB
Progress (1): 172/226 kB
Progress (1): 176/226 kB
Progress (1): 180/226 kB
Progress (1): 184/226 kB
Progress (1): 188/226 kB
Progress (1): 192/226 kB
Progress (1): 197/226 kB
Progress (1): 201/226 kB
Progress (1): 205/226 kB
Progress (1): 209/226 kB
Progress (1): 213/226 kB
Progress (1): 217/226 kB
Progress (1): 221/226 kB
Progress (1): 225/226 kB
Progress (1): 226 kB    
                    
Downloaded from repository.sonatype.org: https://repository.sonatype.org/content/groups/forge/org/codehaus/plexus/plexus-utils/3.0/plexus-utils-3.0.jar (226 kB at 611 kB/s)
Downloading from eclipse.maven.central.mirror: https://repo.eclipse.org/content/repositories/maven_central/org/apache/maven/maven-plugin-api/2.0.6/maven-plugin-api-2.0.6.jar
Progress (1): 4.1/13 kB
Progress (1): 7.7/13 kB
Progress (1): 12/13 kB 
Progress (1): 13 kB   
                   
Downloaded from eclipse.maven.central.mirror: https://repo.eclipse.org/content/repositories/maven_central/org/apache/maven/maven-plugin-api/2.0.6/maven-plugin-api-2.0.6.jar (13 kB at 804 kB/s)
[INFO] 
[INFO] --- maven-enforcer-plugin:1.3.1:enforce (enforce-environment) @ unzip-repository-plugin-parent ---
Downloading from repository.sonatype.org: https://repository.sonatype.org/content/groups/forge/org/apache/maven/maven-artifact/2.0.9/maven-artifact-2.0.9.pom
Progress (1): 834 B
Progress (1): 1.6 kB
[WARNING] Could not validate integrity of download from https://repository.sonatype.org/content/groups/forge/org/apache/maven/maven-artifact/2.0.9/maven-artifact-2.0.9.pom: Checksum validation failed, no checksums available
                    
[WARNING] Checksum validation failed, no checksums available from repository.sonatype.org for https://repository.sonatype.org/content/groups/forge/org/apache/maven/maven-artifact/2.0.9/maven-artifact-2.0.9.pom
Downloaded from repository.sonatype.org: https://repository.sonatype.org/content/groups/forge/org/apache/maven/maven-artifact/2.0.9/maven-artifact-2.0.9.pom (1.6 kB at 3.8 kB/s)
Downloading from repository.sonatype.org: https://repository.sonatype.org/content/groups/forge/org/apache/maven/maven/2.0.9/maven-2.0.9.pom
Progress (1): 797 B
Progress (1): 2.0 kB
Progress (1): 3.8 kB
Progress (1): 4.0 kB
Progress (1): 8.1 kB
Progress (1): 10 kB 
Progress (1): 11 kB
Progress (1): 15 kB
Progress (1): 18 kB
Progress (1): 19 kB
[WARNING] Could not validate integrity of download from https://repository.sonatype.org/content/groups/forge/org/apache/maven/maven/2.0.9/maven-2.0.9.pom: Checksum validation failed, no checksums available
                   
[WARNING] Checksum validation failed, no checksums available from repository.sonatype.org for https://repository.sonatype.org/content/groups/forge/org/apache/maven/maven/2.0.9/maven-2.0.9.pom
Downloaded from repository.sonatype.org: https://repository.sonatype.org/content/groups/forge/org/apache/maven/maven/2.0.9/maven-2.0.9.pom (19 kB at 33 kB/s)
Downloading from repository.sonatype.org: https://repository.sonatype.org/content/groups/forge/org/apache/maven/maven-parent/8/maven-parent-8.pom
Progress (1): 836 B
Progress (1): 1.1 kB
Progress (1): 2.6 kB
Progress (1): 4.0 kB
Progress (1): 6.6 kB
Progress (1): 8.1 kB
Progress (1): 11 kB 
Progress (1): 14 kB
Progress (1): 15 kB
Progress (1): 19 kB
Progress (1): 20 kB
Progress (1): 24 kB
Progress (1): 24 kB
Progress (1): 24 kB
[WARNING] Could not validate integrity of download from https://repository.sonatype.org/content/groups/forge/org/apache/maven/maven-parent/8/maven-parent-8.pom: Checksum validation failed, no checksums available
                   
[WARNING] Checksum validation failed, no checksums available from repository.sonatype.org for https://repository.sonatype.org/content/groups/forge/org/apache/maven/maven-parent/8/maven-parent-8.pom
Downloaded from repository.sonatype.org: https://repository.sonatype.org/content/groups/forge/org/apache/maven/maven-parent/8/maven-parent-8.pom (24 kB at 50 kB/s)
Downloading from repository.sonatype.org: https://repository.sonatype.org/content/groups/forge/org/codehaus/plexus/plexus-utils/1.5.8/plexus-utils-1.5.8.pom
Progress (1): 1.1 kB
Progress (1): 3.8 kB
Progress (1): 4.0 kB
Progress (1): 6.7 kB
Progress (1): 8.1 kB
                    
Downloaded from repository.sonatype.org: https://repository.sonatype.org/content/groups/forge/org/codehaus/plexus/plexus-utils/1.5.8/plexus-utils-1.5.8.pom (8.1 kB at 32 kB/s)
Downloading from repository.sonatype.org: https://repository.sonatype.org/content/groups/forge/org/apache/maven/maven-plugin-api/2.0.9/maven-plugin-api-2.0.9.pom
Progress (1): 837 B
Progress (1): 1.5 kB
[WARNING] Could not validate integrity of download from https://repository.sonatype.org/content/groups/forge/org/apache/maven/maven-plugin-api/2.0.9/maven-plugin-api-2.0.9.pom: Checksum validation failed, no checksums available
                    
[WARNING] Checksum validation failed, no checksums available from repository.sonatype.org for https://repository.sonatype.org/content/groups/forge/org/apache/maven/maven-plugin-api/2.0.9/maven-plugin-api-2.0.9.pom
Downloaded from repository.sonatype.org: https://repository.sonatype.org/content/groups/forge/org/apache/maven/maven-plugin-api/2.0.9/maven-plugin-api-2.0.9.pom (1.5 kB at 4.1 kB/s)
Downloading from repository.sonatype.org: https://repository.sonatype.org/content/groups/forge/org/apache/maven/maven-project/2.0.9/maven-project-2.0.9.pom
Progress (1): 822 B
Progress (1): 2.7 kB
[WARNING] Could not validate integrity of download from https://repository.sonatype.org/content/groups/forge/org/apache/maven/maven-project/2.0.9/maven-project-2.0.9.pom: Checksum validation failed, no checksums available
                    
[WARNING] Checksum validation failed, no checksums available from repository.sonatype.org for https://repository.sonatype.org/content/groups/forge/org/apache/maven/maven-project/2.0.9/maven-project-2.0.9.pom
Downloaded from repository.sonatype.org: https://repository.sonatype.org/content/groups/forge/org/apache/maven/maven-project/2.0.9/maven-project-2.0.9.pom (2.7 kB at 5.5 kB/s)
Downloading from repository.sonatype.org: https://repository.sonatype.org/content/groups/forge/org/apache/maven/maven-settings/2.0.9/maven-settings-2.0.9.pom
Progress (1): 841 B
Progress (1): 1.1 kB
Progress (1): 2.1 kB
[WARNING] Could not validate integrity of download from https://repository.sonatype.org/content/groups/forge/org/apache/maven/maven-settings/2.0.9/maven-settings-2.0.9.pom: Checksum validation failed, no checksums available
                    
[WARNING] Checksum validation failed, no checksums available from repository.sonatype.org for https://repository.sonatype.org/content/groups/forge/org/apache/maven/maven-settings/2.0.9/maven-settings-2.0.9.pom
Downloaded from repository.sonatype.org: https://repository.sonatype.org/content/groups/forge/org/apache/maven/maven-settings/2.0.9/maven-settings-2.0.9.pom (2.1 kB at 4.4 kB/s)
Downloading from repository.sonatype.org: https://repository.sonatype.org/content/groups/forge/org/apache/maven/maven-model/2.0.9/maven-model-2.0.9.pom
Progress (1): 841 B
Progress (1): 1.1 kB
Progress (1): 3.1 kB
[WARNING] Could not validate integrity of download from https://repository.sonatype.org/content/groups/forge/org/apache/maven/maven-model/2.0.9/maven-model-2.0.9.pom: Checksum validation failed, no checksums available
                    
[WARNING] Checksum validation failed, no checksums available from repository.sonatype.org for https://repository.sonatype.org/content/groups/forge/org/apache/maven/maven-model/2.0.9/maven-model-2.0.9.pom
Downloaded from repository.sonatype.org: https://repository.sonatype.org/content/groups/forge/org/apache/maven/maven-model/2.0.9/maven-model-2.0.9.pom (3.1 kB at 5.7 kB/s)
Downloading from repository.sonatype.org: https://repository.sonatype.org/content/groups/forge/junit/junit/4.11/junit-4.11.pom
Downloading from eclipse.maven.central.mirror: https://repo.eclipse.org/content/repositories/maven_central/junit/junit/4.11/junit-4.11.pom
Progress (1): 2.3 kB
                    
Downloaded from eclipse.maven.central.mirror: https://repo.eclipse.org/content/repositories/maven_central/junit/junit/4.11/junit-4.11.pom (2.3 kB at 112 kB/s)
Downloading from repository.sonatype.org: https://repository.sonatype.org/content/groups/forge/org/hamcrest/hamcrest-core/1.3/hamcrest-core-1.3.pom
Downloading from eclipse.maven.central.mirror: https://repo.eclipse.org/content/repositories/maven_central/org/hamcrest/hamcrest-core/1.3/hamcrest-core-1.3.pom
Progress (1): 766 B
                   
Downloaded from eclipse.maven.central.mirror: https://repo.eclipse.org/content/repositories/maven_central/org/hamcrest/hamcrest-core/1.3/hamcrest-core-1.3.pom (766 B at 45 kB/s)
Downloading from repository.sonatype.org: https://repository.sonatype.org/content/groups/forge/org/hamcrest/hamcrest-parent/1.3/hamcrest-parent-1.3.pom
Downloading from eclipse.maven.central.mirror: https://repo.eclipse.org/content/repositories/maven_central/org/hamcrest/hamcrest-parent/1.3/hamcrest-parent-1.3.pom
Progress (1): 2.0 kB
                    
Downloaded from eclipse.maven.central.mirror: https://repo.eclipse.org/content/repositories/maven_central/org/hamcrest/hamcrest-parent/1.3/hamcrest-parent-1.3.pom (2.0 kB at 99 kB/s)
Downloading from repository.sonatype.org: https://repository.sonatype.org/content/groups/forge/org/apache/maven/maven-profile/2.0.9/maven-profile-2.0.9.pom
Progress (1): 829 B
Progress (1): 2.0 kB
[WARNING] Could not validate integrity of download from https://repository.sonatype.org/content/groups/forge/org/apache/maven/maven-profile/2.0.9/maven-profile-2.0.9.pom: Checksum validation failed, no checksums available
                    
[WARNING] Checksum validation failed, no checksums available from repository.sonatype.org for https://repository.sonatype.org/content/groups/forge/org/apache/maven/maven-profile/2.0.9/maven-profile-2.0.9.pom
Downloaded from repository.sonatype.org: https://repository.sonatype.org/content/groups/forge/org/apache/maven/maven-profile/2.0.9/maven-profile-2.0.9.pom (2.0 kB at 5.0 kB/s)
Downloading from repository.sonatype.org: https://repository.sonatype.org/content/groups/forge/org/apache/maven/maven-artifact-manager/2.0.9/maven-artifact-manager-2.0.9.pom
Progress (1): 841 B
Progress (1): 1.1 kB
Progress (1): 2.7 kB
[WARNING] Could not validate integrity of download from https://repository.sonatype.org/content/groups/forge/org/apache/maven/maven-artifact-manager/2.0.9/maven-artifact-manager-2.0.9.pom: Checksum validation failed, no checksums available
                    
[WARNING] Checksum validation failed, no checksums available from repository.sonatype.org for https://repository.sonatype.org/content/groups/forge/org/apache/maven/maven-artifact-manager/2.0.9/maven-artifact-manager-2.0.9.pom
Downloaded from repository.sonatype.org: https://repository.sonatype.org/content/groups/forge/org/apache/maven/maven-artifact-manager/2.0.9/maven-artifact-manager-2.0.9.pom (2.7 kB at 4.9 kB/s)
Downloading from repository.sonatype.org: https://repository.sonatype.org/content/groups/forge/org/apache/maven/maven-repository-metadata/2.0.9/maven-repository-metadata-2.0.9.pom
Progress (1): 831 B
Progress (1): 1.9 kB
[WARNING] Could not validate integrity of download from https://repository.sonatype.org/content/groups/forge/org/apache/maven/maven-repository-metadata/2.0.9/maven-repository-metadata-2.0.9.pom: Checksum validation failed, no checksums available
                    
[WARNING] Checksum validation failed, no checksums available from repository.sonatype.org for https://repository.sonatype.org/content/groups/forge/org/apache/maven/maven-repository-metadata/2.0.9/maven-repository-metadata-2.0.9.pom
Downloaded from repository.sonatype.org: https://repository.sonatype.org/content/groups/forge/org/apache/maven/maven-repository-metadata/2.0.9/maven-repository-metadata-2.0.9.pom (1.9 kB at 3.4 kB/s)
Downloading from repository.sonatype.org: https://repository.sonatype.org/content/groups/forge/org/apache/maven/maven-plugin-registry/2.0.9/maven-plugin-registry-2.0.9.pom
Progress (1): 826 B
Progress (1): 2.0 kB
[WARNING] Could not validate integrity of download from https://repository.sonatype.org/content/groups/forge/org/apache/maven/maven-plugin-registry/2.0.9/maven-plugin-registry-2.0.9.pom: Checksum validation failed, no checksums available
                    
[WARNING] Checksum validation failed, no checksums available from repository.sonatype.org for https://repository.sonatype.org/content/groups/forge/org/apache/maven/maven-plugin-registry/2.0.9/maven-plugin-registry-2.0.9.pom
Downloaded from repository.sonatype.org: https://repository.sonatype.org/content/groups/forge/org/apache/maven/maven-plugin-registry/2.0.9/maven-plugin-registry-2.0.9.pom (2.0 kB at 3.7 kB/s)
Downloading from repository.sonatype.org: https://repository.sonatype.org/content/groups/forge/org/apache/maven/maven-core/2.0.9/maven-core-2.0.9.pom
Progress (1): 859 B
Progress (1): 1.1 kB
Progress (1): 4.6 kB
Progress (1): 5.2 kB
Progress (1): 7.8 kB
[WARNING] Could not validate integrity of download from https://repository.sonatype.org/content/groups/forge/org/apache/maven/maven-core/2.0.9/maven-core-2.0.9.pom: Checksum validation failed, no checksums available
                    
[WARNING] Checksum validation failed, no checksums available from repository.sonatype.org for https://repository.sonatype.org/content/groups/forge/org/apache/maven/maven-core/2.0.9/maven-core-2.0.9.pom
Downloaded from repository.sonatype.org: https://repository.sonatype.org/content/groups/forge/org/apache/maven/maven-core/2.0.9/maven-core-2.0.9.pom (7.8 kB at 16 kB/s)
Downloading from repository.sonatype.org: https://repository.sonatype.org/content/groups/forge/org/apache/maven/maven-plugin-parameter-documenter/2.0.9/maven-plugin-parameter-documenter-2.0.9.pom
Progress (1): 823 B
Progress (1): 2.0 kB
[WARNING] Could not validate integrity of download from https://repository.sonatype.org/content/groups/forge/org/apache/maven/maven-plugin-parameter-documenter/2.0.9/maven-plugin-parameter-documenter-2.0.9.pom: Checksum validation failed, no checksums available
                    
[WARNING] Checksum validation failed, no checksums available from repository.sonatype.org for https://repository.sonatype.org/content/groups/forge/org/apache/maven/maven-plugin-parameter-documenter/2.0.9/maven-plugin-parameter-documenter-2.0.9.pom
Downloaded from repository.sonatype.org: https://repository.sonatype.org/content/groups/forge/org/apache/maven/maven-plugin-parameter-documenter/2.0.9/maven-plugin-parameter-documenter-2.0.9.pom (2.0 kB at 3.6 kB/s)
Downloading from repository.sonatype.org: https://repository.sonatype.org/content/groups/forge/org/apache/maven/reporting/maven-reporting-api/2.0.9/maven-reporting-api-2.0.9.pom
Progress (1): 829 B
Progress (1): 1.8 kB
[WARNING] Could not validate integrity of download from https://repository.sonatype.org/content/groups/forge/org/apache/maven/reporting/maven-reporting-api/2.0.9/maven-reporting-api-2.0.9.pom: Checksum validation failed, no checksums available
                    
[WARNING] Checksum validation failed, no checksums available from repository.sonatype.org for https://repository.sonatype.org/content/groups/forge/org/apache/maven/reporting/maven-reporting-api/2.0.9/maven-reporting-api-2.0.9.pom
Downloaded from repository.sonatype.org: https://repository.sonatype.org/content/groups/forge/org/apache/maven/reporting/maven-reporting-api/2.0.9/maven-reporting-api-2.0.9.pom (1.8 kB at 3.2 kB/s)
Downloading from repository.sonatype.org: https://repository.sonatype.org/content/groups/forge/org/apache/maven/reporting/maven-reporting/2.0.9/maven-reporting-2.0.9.pom
Progress (1): 835 B
Progress (1): 1.5 kB
[WARNING] Could not validate integrity of download from https://repository.sonatype.org/content/groups/forge/org/apache/maven/reporting/maven-reporting/2.0.9/maven-reporting-2.0.9.pom: Checksum validation failed, no checksums available
                    
[WARNING] Checksum validation failed, no checksums available from repository.sonatype.org for https://repository.sonatype.org/content/groups/forge/org/apache/maven/reporting/maven-reporting/2.0.9/maven-reporting-2.0.9.pom
Downloaded from repository.sonatype.org: https://repository.sonatype.org/content/groups/forge/org/apache/maven/reporting/maven-reporting/2.0.9/maven-reporting-2.0.9.pom (1.5 kB at 3.2 kB/s)
Downloading from repository.sonatype.org: https://repository.sonatype.org/content/groups/forge/org/apache/maven/doxia/doxia-sink-api/1.0-alpha-10/doxia-sink-api-1.0-alpha-10.pom
Progress (1): 835 B
Progress (1): 1.3 kB
[WARNING] Could not validate integrity of download from https://repository.sonatype.org/content/groups/forge/org/apache/maven/doxia/doxia-sink-api/1.0-alpha-10/doxia-sink-api-1.0-alpha-10.pom: Checksum validation failed, no checksums available
                    
[WARNING] Checksum validation failed, no checksums available from repository.sonatype.org for https://repository.sonatype.org/content/groups/forge/org/apache/maven/doxia/doxia-sink-api/1.0-alpha-10/doxia-sink-api-1.0-alpha-10.pom
Downloaded from repository.sonatype.org: https://repository.sonatype.org/content/groups/forge/org/apache/maven/doxia/doxia-sink-api/1.0-alpha-10/doxia-sink-api-1.0-alpha-10.pom (1.3 kB at 2.4 kB/s)
Downloading from repository.sonatype.org: https://repository.sonatype.org/content/groups/forge/org/apache/maven/doxia/doxia/1.0-alpha-10/doxia-1.0-alpha-10.pom
Progress (1): 840 B
Progress (1): 1.1 kB
Progress (1): 2.9 kB
Progress (1): 5.2 kB
Progress (1): 9.0 kB
Progress (1): 9.2 kB
[WARNING] Could not validate integrity of download from https://repository.sonatype.org/content/groups/forge/org/apache/maven/doxia/doxia/1.0-alpha-10/doxia-1.0-alpha-10.pom: Checksum validation failed, no checksums available
                    
[WARNING] Checksum validation failed, no checksums available from repository.sonatype.org for https://repository.sonatype.org/content/groups/forge/org/apache/maven/doxia/doxia/1.0-alpha-10/doxia-1.0-alpha-10.pom
Downloaded from repository.sonatype.org: https://repository.sonatype.org/content/groups/forge/org/apache/maven/doxia/doxia/1.0-alpha-10/doxia-1.0-alpha-10.pom (9.2 kB at 17 kB/s)
Downloading from repository.sonatype.org: https://repository.sonatype.org/content/groups/forge/org/apache/maven/maven-parent/6/maven-parent-6.pom
Downloading from eclipse.maven.central.mirror: https://repo.eclipse.org/content/repositories/maven_central/org/apache/maven/maven-parent/6/maven-parent-6.pom
Progress (1): 4.1/20 kB
Progress (1): 7.7/20 kB
Progress (1): 12/20 kB 
Progress (1): 16/20 kB
Progress (1): 20/20 kB
Progress (1): 20 kB   
                   
Downloaded from eclipse.maven.central.mirror: https://repo.eclipse.org/content/repositories/maven_central/org/apache/maven/maven-parent/6/maven-parent-6.pom (20 kB at 1.0 MB/s)
Downloading from repository.sonatype.org: https://repository.sonatype.org/content/groups/forge/org/apache/maven/maven-error-diagnostics/2.0.9/maven-error-diagnostics-2.0.9.pom
Progress (1): 832 B
Progress (1): 1.7 kB
[WARNING] Could not validate integrity of download from https://repository.sonatype.org/content/groups/forge/org/apache/maven/maven-error-diagnostics/2.0.9/maven-error-diagnostics-2.0.9.pom: Checksum validation failed, no checksums available
                    
[WARNING] Checksum validation failed, no checksums available from repository.sonatype.org for https://repository.sonatype.org/content/groups/forge/org/apache/maven/maven-error-diagnostics/2.0.9/maven-error-diagnostics-2.0.9.pom
Downloaded from repository.sonatype.org: https://repository.sonatype.org/content/groups/forge/org/apache/maven/maven-error-diagnostics/2.0.9/maven-error-diagnostics-2.0.9.pom (1.7 kB at 3.2 kB/s)
Downloading from repository.sonatype.org: https://repository.sonatype.org/content/groups/forge/commons-cli/commons-cli/1.0/commons-cli-1.0.pom
Progress (1): 1.1 kB
Progress (1): 2.1 kB
[WARNING] Could not validate integrity of download from https://repository.sonatype.org/content/groups/forge/commons-cli/commons-cli/1.0/commons-cli-1.0.pom: Checksum validation failed, no checksums available
                    
[WARNING] Checksum validation failed, no checksums available from repository.sonatype.org for https://repository.sonatype.org/content/groups/forge/commons-cli/commons-cli/1.0/commons-cli-1.0.pom
Downloaded from repository.sonatype.org: https://repository.sonatype.org/content/groups/forge/commons-cli/commons-cli/1.0/commons-cli-1.0.pom (2.1 kB at 4.4 kB/s)
Downloading from repository.sonatype.org: https://repository.sonatype.org/content/groups/forge/org/apache/maven/maven-plugin-descriptor/2.0.9/maven-plugin-descriptor-2.0.9.pom
Progress (1): 829 B
Progress (1): 2.1 kB
[WARNING] Could not validate integrity of download from https://repository.sonatype.org/content/groups/forge/org/apache/maven/maven-plugin-descriptor/2.0.9/maven-plugin-descriptor-2.0.9.pom: Checksum validation failed, no checksums available
                    
[WARNING] Checksum validation failed, no checksums available from repository.sonatype.org for https://repository.sonatype.org/content/groups/forge/org/apache/maven/maven-plugin-descriptor/2.0.9/maven-plugin-descriptor-2.0.9.pom
Downloaded from repository.sonatype.org: https://repository.sonatype.org/content/groups/forge/org/apache/maven/maven-plugin-descriptor/2.0.9/maven-plugin-descriptor-2.0.9.pom (2.1 kB at 4.4 kB/s)
Downloading from repository.sonatype.org: https://repository.sonatype.org/content/groups/forge/org/codehaus/plexus/plexus-interactivity-api/1.0-alpha-4/plexus-interactivity-api-1.0-alpha-4.pom
Progress (1): 1.1 kB
Progress (1): 3.9 kB
Progress (1): 5.2 kB
Progress (1): 7.1 kB
                    
Downloaded from repository.sonatype.org: https://repository.sonatype.org/content/groups/forge/org/codehaus/plexus/plexus-interactivity-api/1.0-alpha-4/plexus-interactivity-api-1.0-alpha-4.pom (7.1 kB at 30 kB/s)
Downloading from repository.sonatype.org: https://repository.sonatype.org/content/groups/forge/org/apache/maven/maven-monitor/2.0.9/maven-monitor-2.0.9.pom
Progress (1): 837 B
Progress (1): 1.3 kB
[WARNING] Could not validate integrity of download from https://repository.sonatype.org/content/groups/forge/org/apache/maven/maven-monitor/2.0.9/maven-monitor-2.0.9.pom: Checksum validation failed, no checksums available
                    
[WARNING] Checksum validation failed, no checksums available from repository.sonatype.org for https://repository.sonatype.org/content/groups/forge/org/apache/maven/maven-monitor/2.0.9/maven-monitor-2.0.9.pom
Downloaded from repository.sonatype.org: https://repository.sonatype.org/content/groups/forge/org/apache/maven/maven-monitor/2.0.9/maven-monitor-2.0.9.pom (1.3 kB at 3.1 kB/s)
Downloading from repository.sonatype.org: https://repository.sonatype.org/content/groups/forge/classworlds/classworlds/1.1/classworlds-1.1.pom
Progress (1): 2.1 kB
Progress (1): 3.3 kB
[WARNING] Could not validate integrity of download from https://repository.sonatype.org/content/groups/forge/classworlds/classworlds/1.1/classworlds-1.1.pom: Checksum validation failed, no checksums available
                    
[WARNING] Checksum validation failed, no checksums available from repository.sonatype.org for https://repository.sonatype.org/content/groups/forge/classworlds/classworlds/1.1/classworlds-1.1.pom
Downloaded from repository.sonatype.org: https://repository.sonatype.org/content/groups/forge/classworlds/classworlds/1.1/classworlds-1.1.pom (3.3 kB at 5.9 kB/s)
Downloading from repository.sonatype.org: https://repository.sonatype.org/content/groups/forge/commons-lang/commons-lang/2.3/commons-lang-2.3.pom
Downloading from eclipse.maven.central.mirror: https://repo.eclipse.org/content/repositories/maven_central/commons-lang/commons-lang/2.3/commons-lang-2.3.pom
Progress (1): 4.1/11 kB
Progress (1): 7.7/11 kB
Progress (1): 11 kB    
                   
Downloaded from eclipse.maven.central.mirror: https://repo.eclipse.org/content/repositories/maven_central/commons-lang/commons-lang/2.3/commons-lang-2.3.pom (11 kB at 134 kB/s)
Downloading from repository.sonatype.org: https://repository.sonatype.org/content/groups/forge/org/apache/maven/enforcer/enforcer-api/1.3.1/enforcer-api-1.3.1.pom
Downloading from eclipse.maven.central.mirror: https://repo.eclipse.org/content/repositories/maven_central/org/apache/maven/enforcer/enforcer-api/1.3.1/enforcer-api-1.3.1.pom
Progress (1): 2.7 kB
                    
Downloaded from eclipse.maven.central.mirror: https://repo.eclipse.org/content/repositories/maven_central/org/apache/maven/enforcer/enforcer-api/1.3.1/enforcer-api-1.3.1.pom (2.7 kB at 60 kB/s)
Downloading from repository.sonatype.org: https://repository.sonatype.org/content/groups/forge/org/apache/maven/enforcer/enforcer-rules/1.3.1/enforcer-rules-1.3.1.pom
Downloading from eclipse.maven.central.mirror: https://repo.eclipse.org/content/repositories/maven_central/org/apache/maven/enforcer/enforcer-rules/1.3.1/enforcer-rules-1.3.1.pom
Progress (1): 3.8 kB
                    
Downloaded from eclipse.maven.central.mirror: https://repo.eclipse.org/content/repositories/maven_central/org/apache/maven/enforcer/enforcer-rules/1.3.1/enforcer-rules-1.3.1.pom (3.8 kB at 101 kB/s)
Downloading from repository.sonatype.org: https://repository.sonatype.org/content/groups/forge/org/apache/maven/shared/maven-common-artifact-filters/1.4/maven-common-artifact-filters-1.4.pom
Downloading from eclipse.maven.central.mirror: https://repo.eclipse.org/content/repositories/maven_central/org/apache/maven/shared/maven-common-artifact-filters/1.4/maven-common-artifact-filters-1.4.pom
Progress (1): 3.8 kB
                    
Downloaded from eclipse.maven.central.mirror: https://repo.eclipse.org/content/repositories/maven_central/org/apache/maven/shared/maven-common-artifact-filters/1.4/maven-common-artifact-filters-1.4.pom (3.8 kB at 235 kB/s)
Downloading from repository.sonatype.org: https://repository.sonatype.org/content/groups/forge/org/apache/maven/shared/maven-shared-components/17/maven-shared-components-17.pom
Progress (1): 852 B
Progress (1): 1.1 kB
Progress (1): 4.0 kB
Progress (1): 4.0 kB
Progress (1): 6.6 kB
Progress (1): 8.1 kB
Progress (1): 8.7 kB
[WARNING] Could not validate integrity of download from https://repository.sonatype.org/content/groups/forge/org/apache/maven/shared/maven-shared-components/17/maven-shared-components-17.pom: Checksum validation failed, no checksums available
                    
[WARNING] Checksum validation failed, no checksums available from repository.sonatype.org for https://repository.sonatype.org/content/groups/forge/org/apache/maven/shared/maven-shared-components/17/maven-shared-components-17.pom
Downloaded from repository.sonatype.org: https://repository.sonatype.org/content/groups/forge/org/apache/maven/shared/maven-shared-components/17/maven-shared-components-17.pom (8.7 kB at 19 kB/s)
Downloading from repository.sonatype.org: https://repository.sonatype.org/content/groups/forge/org/apache/maven/maven-model/2.0.8/maven-model-2.0.8.pom
Downloading from eclipse.maven.central.mirror: https://repo.eclipse.org/content/repositories/maven_central/org/apache/maven/maven-model/2.0.8/maven-model-2.0.8.pom
Progress (1): 3.1 kB
                    
Downloaded from eclipse.maven.central.mirror: https://repo.eclipse.org/content/repositories/maven_central/org/apache/maven/maven-model/2.0.8/maven-model-2.0.8.pom (3.1 kB at 196 kB/s)
Downloading from repository.sonatype.org: https://repository.sonatype.org/content/groups/forge/org/apache/maven/maven/2.0.8/maven-2.0.8.pom
Downloading from eclipse.maven.central.mirror: https://repo.eclipse.org/content/repositories/maven_central/org/apache/maven/maven/2.0.8/maven-2.0.8.pom
Progress (1): 4.1/12 kB
Progress (1): 7.7/12 kB
Progress (1): 12/12 kB 
Progress (1): 12 kB   
                   
Downloaded from eclipse.maven.central.mirror: https://repo.eclipse.org/content/repositories/maven_central/org/apache/maven/maven/2.0.8/maven-2.0.8.pom (12 kB at 806 kB/s)
Downloading from repository.sonatype.org: https://repository.sonatype.org/content/groups/forge/org/codehaus/plexus/plexus-container-default/1.5.5/plexus-container-default-1.5.5.pom
Progress (1): 1.7 kB
Progress (1): 2.8 kB
                    
Downloaded from repository.sonatype.org: https://repository.sonatype.org/content/groups/forge/org/codehaus/plexus/plexus-container-default/1.5.5/plexus-container-default-1.5.5.pom (2.8 kB at 12 kB/s)
Downloading from repository.sonatype.org: https://repository.sonatype.org/content/groups/forge/org/codehaus/plexus/plexus-classworlds/2.2.2/plexus-classworlds-2.2.2.pom
Progress (1): 953 B
Progress (1): 3.0 kB
Progress (1): 3.8 kB
Progress (1): 4.0 kB
                    
Downloaded from repository.sonatype.org: https://repository.sonatype.org/content/groups/forge/org/codehaus/plexus/plexus-classworlds/2.2.2/plexus-classworlds-2.2.2.pom (4.0 kB at 39 kB/s)
Downloading from repository.sonatype.org: https://repository.sonatype.org/content/groups/forge/org/codehaus/plexus/plexus/2.0.3/plexus-2.0.3.pom
Progress (1): 816 B
Progress (1): 2.9 kB
Progress (1): 3.8 kB
Progress (1): 4.0 kB
Progress (1): 6.9 kB
Progress (1): 8.9 kB
Progress (1): 11 kB 
Progress (1): 15 kB
Progress (1): 15 kB
Progress (1): 15 kB
                   
Downloaded from repository.sonatype.org: https://repository.sonatype.org/content/groups/forge/org/codehaus/plexus/plexus/2.0.3/plexus-2.0.3.pom (15 kB at 163 kB/s)
Downloading from repository.sonatype.org: https://repository.sonatype.org/content/groups/forge/org/apache/xbean/xbean-reflect/3.4/xbean-reflect-3.4.pom
Downloading from eclipse.maven.central.mirror: https://repo.eclipse.org/content/repositories/maven_central/org/apache/xbean/xbean-reflect/3.4/xbean-reflect-3.4.pom
Progress (1): 2.8 kB
                    
Downloaded from eclipse.maven.central.mirror: https://repo.eclipse.org/content/repositories/maven_central/org/apache/xbean/xbean-reflect/3.4/xbean-reflect-3.4.pom (2.8 kB at 176 kB/s)
Downloading from repository.sonatype.org: https://repository.sonatype.org/content/groups/forge/org/apache/xbean/xbean/3.4/xbean-3.4.pom
Downloading from eclipse.maven.central.mirror: https://repo.eclipse.org/content/repositories/maven_central/org/apache/xbean/xbean/3.4/xbean-3.4.pom
Progress (1): 4.1/19 kB
Progress (1): 7.7/19 kB
Progress (1): 12/19 kB 
Progress (1): 16/19 kB
Progress (1): 19 kB   
                   
Downloaded from eclipse.maven.central.mirror: https://repo.eclipse.org/content/repositories/maven_central/org/apache/xbean/xbean/3.4/xbean-3.4.pom (19 kB at 713 kB/s)
Downloading from repository.sonatype.org: https://repository.sonatype.org/content/groups/forge/log4j/log4j/1.2.12/log4j-1.2.12.pom
Downloading from eclipse.maven.central.mirror: https://repo.eclipse.org/content/repositories/maven_central/log4j/log4j/1.2.12/log4j-1.2.12.pom
Progress (1): 145 B
                   
Downloaded from eclipse.maven.central.mirror: https://repo.eclipse.org/content/repositories/maven_central/log4j/log4j/1.2.12/log4j-1.2.12.pom (145 B at 10 kB/s)
Downloading from repository.sonatype.org: https://repository.sonatype.org/content/groups/forge/commons-logging/commons-logging-api/1.1/commons-logging-api-1.1.pom
Downloading from eclipse.maven.central.mirror: https://repo.eclipse.org/content/repositories/maven_central/commons-logging/commons-logging-api/1.1/commons-logging-api-1.1.pom
Progress (1): 4.1/5.3 kB
Progress (1): 5.3 kB    
                    
Downloaded from eclipse.maven.central.mirror: https://repo.eclipse.org/content/repositories/maven_central/commons-logging/commons-logging-api/1.1/commons-logging-api-1.1.pom (5.3 kB at 214 kB/s)
Downloading from repository.sonatype.org: https://repository.sonatype.org/content/groups/forge/com/google/collections/google-collections/1.0/google-collections-1.0.pom
Downloading from eclipse.maven.central.mirror: https://repo.eclipse.org/content/repositories/maven_central/com/google/collections/google-collections/1.0/google-collections-1.0.pom
Progress (1): 2.5 kB
                    
Downloaded from eclipse.maven.central.mirror: https://repo.eclipse.org/content/repositories/maven_central/com/google/collections/google-collections/1.0/google-collections-1.0.pom (2.5 kB at 138 kB/s)
Downloading from repository.sonatype.org: https://repository.sonatype.org/content/groups/forge/com/google/google/1/google-1.pom
Downloading from eclipse.maven.central.mirror: https://repo.eclipse.org/content/repositories/maven_central/com/google/google/1/google-1.pom
Progress (1): 1.6 kB
                    
Downloaded from eclipse.maven.central.mirror: https://repo.eclipse.org/content/repositories/maven_central/com/google/google/1/google-1.pom (1.6 kB at 120 kB/s)
Downloading from repository.sonatype.org: https://repository.sonatype.org/content/groups/forge/org/beanshell/bsh/2.0b4/bsh-2.0b4.pom
Downloading from eclipse.maven.central.mirror: https://repo.eclipse.org/content/repositories/maven_central/org/beanshell/bsh/2.0b4/bsh-2.0b4.pom
Progress (1): 1.2 kB
                    
Downloaded from eclipse.maven.central.mirror: https://repo.eclipse.org/content/repositories/maven_central/org/beanshell/bsh/2.0b4/bsh-2.0b4.pom (1.2 kB at 3.3 kB/s)
Downloading from repository.sonatype.org: https://repository.sonatype.org/content/groups/forge/org/beanshell/beanshell/2.0b4/beanshell-2.0b4.pom
Downloading from eclipse.maven.central.mirror: https://repo.eclipse.org/content/repositories/maven_central/org/beanshell/beanshell/2.0b4/beanshell-2.0b4.pom
Progress (1): 1.4 kB
                    
Downloaded from eclipse.maven.central.mirror: https://repo.eclipse.org/content/repositories/maven_central/org/beanshell/beanshell/2.0b4/beanshell-2.0b4.pom (1.4 kB at 54 kB/s)
Downloading from repository.sonatype.org: https://repository.sonatype.org/content/groups/forge/org/apache/maven/shared/maven-dependency-tree/2.1/maven-dependency-tree-2.1.pom
Downloading from eclipse.maven.central.mirror: https://repo.eclipse.org/content/repositories/maven_central/org/apache/maven/shared/maven-dependency-tree/2.1/maven-dependency-tree-2.1.pom
Progress (1): 4.1/6.8 kB
Progress (1): 6.8 kB    
                    
Downloaded from eclipse.maven.central.mirror: https://repo.eclipse.org/content/repositories/maven_central/org/apache/maven/shared/maven-dependency-tree/2.1/maven-dependency-tree-2.1.pom (6.8 kB at 377 kB/s)
Downloading from repository.sonatype.org: https://repository.sonatype.org/content/groups/forge/org/apache/maven/shared/maven-shared-components/19/maven-shared-components-19.pom
Downloading from eclipse.maven.central.mirror: https://repo.eclipse.org/content/repositories/maven_central/org/apache/maven/shared/maven-shared-components/19/maven-shared-components-19.pom
Progress (1): 4.1/6.4 kB
Progress (1): 6.4 kB    
                    
Downloaded from eclipse.maven.central.mirror: https://repo.eclipse.org/content/repositories/maven_central/org/apache/maven/shared/maven-shared-components/19/maven-shared-components-19.pom (6.4 kB at 397 kB/s)
Downloading from repository.sonatype.org: https://repository.sonatype.org/content/groups/forge/org/eclipse/aether/aether-util/0.9.0.M2/aether-util-0.9.0.M2.pom
Downloading from eclipse.maven.central.mirror: https://repo.eclipse.org/content/repositories/maven_central/org/eclipse/aether/aether-util/0.9.0.M2/aether-util-0.9.0.M2.pom
Progress (1): 2.0 kB
                    
Downloaded from eclipse.maven.central.mirror: https://repo.eclipse.org/content/repositories/maven_central/org/eclipse/aether/aether-util/0.9.0.M2/aether-util-0.9.0.M2.pom (2.0 kB at 102 kB/s)
Downloading from repository.sonatype.org: https://repository.sonatype.org/content/groups/forge/org/eclipse/aether/aether/0.9.0.M2/aether-0.9.0.M2.pom
Downloading from eclipse.maven.central.mirror: https://repo.eclipse.org/content/repositories/maven_central/org/eclipse/aether/aether/0.9.0.M2/aether-0.9.0.M2.pom
Progress (1): 4.1/28 kB
Progress (1): 7.7/28 kB
Progress (1): 12/28 kB 
Progress (1): 16/28 kB
Progress (1): 20/28 kB
Progress (1): 24/28 kB
Progress (1): 28/28 kB
Progress (1): 28 kB   
                   
Downloaded from eclipse.maven.central.mirror: https://repo.eclipse.org/content/repositories/maven_central/org/eclipse/aether/aether/0.9.0.M2/aether-0.9.0.M2.pom (28 kB at 1.3 MB/s)
Downloading from repository.sonatype.org: https://repository.sonatype.org/content/groups/forge/org/codehaus/plexus/plexus-i18n/1.0-beta-6/plexus-i18n-1.0-beta-6.pom
Progress (1): 771 B
                   
Downloaded from repository.sonatype.org: https://repository.sonatype.org/content/groups/forge/org/codehaus/plexus/plexus-i18n/1.0-beta-6/plexus-i18n-1.0-beta-6.pom (771 B at 3.3 kB/s)
Downloading from repository.sonatype.org: https://repository.sonatype.org/content/groups/forge/org/codehaus/plexus/plexus-components/1.1.4/plexus-components-1.1.4.pom
Progress (1): 1.2 kB
Progress (1): 2.1 kB
                    
Downloaded from repository.sonatype.org: https://repository.sonatype.org/content/groups/forge/org/codehaus/plexus/plexus-components/1.1.4/plexus-components-1.1.4.pom (2.1 kB at 21 kB/s)
Downloading from repository.sonatype.org: https://repository.sonatype.org/content/groups/forge/org/apache/maven/maven-artifact/2.0.9/maven-artifact-2.0.9.jar
Downloading from repository.sonatype.org: https://repository.sonatype.org/content/groups/forge/org/apache/maven/maven-plugin-api/2.0.9/maven-plugin-api-2.0.9.jar
Downloading from repository.sonatype.org: https://repository.sonatype.org/content/groups/forge/org/apache/maven/maven-project/2.0.9/maven-project-2.0.9.jar
Downloading from repository.sonatype.org: https://repository.sonatype.org/content/groups/forge/org/apache/maven/maven-settings/2.0.9/maven-settings-2.0.9.jar
Downloading from repository.sonatype.org: https://repository.sonatype.org/content/groups/forge/org/apache/maven/maven-profile/2.0.9/maven-profile-2.0.9.jar
Downloading from repository.sonatype.org: https://repository.sonatype.org/content/groups/forge/org/apache/maven/maven-model/2.0.9/maven-model-2.0.9.jar
Downloading from repository.sonatype.org: https://repository.sonatype.org/content/groups/forge/org/apache/maven/maven-artifact-manager/2.0.9/maven-artifact-manager-2.0.9.jar
Downloading from repository.sonatype.org: https://repository.sonatype.org/content/groups/forge/org/apache/maven/maven-plugin-registry/2.0.9/maven-plugin-registry-2.0.9.jar
Downloading from repository.sonatype.org: https://repository.sonatype.org/content/groups/forge/org/apache/maven/maven-core/2.0.9/maven-core-2.0.9.jar
Downloading from repository.sonatype.org: https://repository.sonatype.org/content/groups/forge/org/apache/maven/maven-plugin-parameter-documenter/2.0.9/maven-plugin-parameter-documenter-2.0.9.jar
Downloading from repository.sonatype.org: https://repository.sonatype.org/content/groups/forge/org/apache/maven/reporting/maven-reporting-api/2.0.9/maven-reporting-api-2.0.9.jar
Progress (1): 3.8/10 kB
Progress (1): 7.9/10 kB
                       
Downloading from repository.sonatype.org: https://repository.sonatype.org/content/groups/forge/org/apache/maven/doxia/doxia-sink-api/1.0-alpha-10/doxia-sink-api-1.0-alpha-10.jar
Progress (1): 10 kB
                   
Downloading from repository.sonatype.org: https://repository.sonatype.org/content/groups/forge/org/apache/maven/maven-repository-metadata/2.0.9/maven-repository-metadata-2.0.9.jar
Downloading from repository.sonatype.org: https://repository.sonatype.org/content/groups/forge/org/apache/maven/maven-error-diagnostics/2.0.9/maven-error-diagnostics-2.0.9.jar
Downloading from repository.sonatype.org: https://repository.sonatype.org/content/groups/forge/commons-cli/commons-cli/1.0/commons-cli-1.0.jar
Downloading from repository.sonatype.org: https://repository.sonatype.org/content/groups/forge/org/apache/maven/maven-plugin-descriptor/2.0.9/maven-plugin-descriptor-2.0.9.jar
Downloading from repository.sonatype.org: https://repository.sonatype.org/content/groups/forge/org/codehaus/plexus/plexus-interactivity-api/1.0-alpha-4/plexus-interactivity-api-1.0-alpha-4.jar
Downloading from repository.sonatype.org: https://repository.sonatype.org/content/groups/forge/org/apache/maven/maven-monitor/2.0.9/maven-monitor-2.0.9.jar
Downloading from repository.sonatype.org: https://repository.sonatype.org/content/groups/forge/classworlds/classworlds/1.1/classworlds-1.1.jar
Progress (2): 10 kB | 1.1/13 kB
Progress (2): 10 kB | 4.0/13 kB
Progress (2): 10 kB | 8.1/13 kB
                               
Downloading from repository.sonatype.org: https://repository.sonatype.org/content/groups/forge/org/codehaus/plexus/plexus-utils/1.5.8/plexus-utils-1.5.8.jar
Downloading from repository.sonatype.org: https://repository.sonatype.org/content/groups/forge/commons-lang/commons-lang/2.3/commons-lang-2.3.jar
Progress (2): 10 kB | 12/13 kB
Progress (2): 10 kB | 13 kB   
[WARNING] Could not validate integrity of download from https://repository.sonatype.org/content/groups/forge/org/apache/maven/reporting/maven-reporting-api/2.0.9/maven-reporting-api-2.0.9.jar: Checksum validation failed, no checksums available
                           
[WARNING] Checksum validation failed, no checksums available from repository.sonatype.org for https://repository.sonatype.org/content/groups/forge/org/apache/maven/reporting/maven-reporting-api/2.0.9/maven-reporting-api-2.0.9.jar
Downloaded from repository.sonatype.org: https://repository.sonatype.org/content/groups/forge/org/apache/maven/reporting/maven-reporting-api/2.0.9/maven-reporting-api-2.0.9.jar (10 kB at 11 kB/s)
Downloading from repository.sonatype.org: https://repository.sonatype.org/content/groups/forge/org/apache/maven/enforcer/enforcer-api/1.3.1/enforcer-api-1.3.1.jar
Downloaded from repository.sonatype.org: https://repository.sonatype.org/content/groups/forge/org/codehaus/plexus/plexus-interactivity-api/1.0-alpha-4/plexus-interactivity-api-1.0-alpha-4.jar (13 kB at 14 kB/s)
Downloading from repository.sonatype.org: https://repository.sonatype.org/content/groups/forge/org/apache/maven/enforcer/enforcer-rules/1.3.1/enforcer-rules-1.3.1.jar
Downloading from repository.sonatype.org: https://repository.sonatype.org/content/groups/forge/org/apache/maven/shared/maven-common-artifact-filters/1.4/maven-common-artifact-filters-1.4.jar
Downloading from repository.sonatype.org: https://repository.sonatype.org/content/groups/forge/org/beanshell/bsh/2.0b4/bsh-2.0b4.jar
Progress (1): 3.8/268 kB
Progress (1): 7.9/268 kB
Progress (1): 11/268 kB 
Progress (1): 15/268 kB
Progress (1): 19/268 kB
                       
Downloading from repository.sonatype.org: https://repository.sonatype.org/content/groups/forge/org/apache/maven/shared/maven-dependency-tree/2.1/maven-dependency-tree-2.1.jar
Downloading from repository.sonatype.org: https://repository.sonatype.org/content/groups/forge/org/eclipse/aether/aether-util/0.9.0.M2/aether-util-0.9.0.M2.jar
Progress (1): 24/268 kB
Progress (1): 28/268 kB
Progress (1): 32/268 kB
Progress (1): 33/268 kB
Progress (1): 37/268 kB
Progress (1): 41/268 kB
Progress (1): 45/268 kB
Progress (1): 49/268 kB
Progress (1): 53/268 kB
Progress (1): 57/268 kB
Progress (1): 61/268 kB
Progress (1): 65/268 kB
                       
Downloading from repository.sonatype.org: https://repository.sonatype.org/content/groups/forge/org/codehaus/plexus/plexus-i18n/1.0-beta-6/plexus-i18n-1.0-beta-6.jar
Progress (1): 70/268 kB
Progress (1): 74/268 kB
Progress (1): 78/268 kB
Progress (1): 82/268 kB
Progress (1): 86/268 kB
Progress (1): 90/268 kB
Progress (1): 94/268 kB
Progress (1): 98/268 kB
Progress (1): 102/268 kB
Progress (1): 106/268 kB
                        
Progress (1): 111/268 kB
Progress (1): 115/268 kB
Progress (1): 119/268 kB
Progress (1): 123/268 kB
Progress (1): 127/268 kB
Progress (1): 131/268 kB
Progress (1): 135/268 kB
Progress (1): 139/268 kB
Progress (1): 143/268 kB
                        
Progress (1): 147/268 kB
Progress (1): 152/268 kB
Progress (1): 156/268 kB
Progress (1): 160/268 kB
Progress (1): 164/268 kB
Progress (1): 168/268 kB
Progress (1): 172/268 kB
Progress (1): 176/268 kB
Progress (1): 180/268 kB
Progress (1): 184/268 kB
Progress (1): 188/268 kB
Progress (1): 192/268 kB
Progress (1): 197/268 kB
Progress (1): 201/268 kB
Progress (1): 205/268 kB
Progress (1): 209/268 kB
Progress (1): 213/268 kB
Progress (1): 217/268 kB
Progress (1): 221/268 kB
Progress (1): 225/268 kB
Progress (1): 229/268 kB
Progress (1): 233/268 kB
Progress (1): 238/268 kB
Progress (1): 242/268 kB
Progress (1): 246/268 kB
Progress (1): 250/268 kB
Progress (1): 254/268 kB
Progress (1): 258/268 kB
Progress (1): 262/268 kB
Progress (1): 266/268 kB
Progress (1): 268 kB    
                    
Progress (2): 268 kB | 1.1/12 kB
Progress (2): 268 kB | 4.0/12 kB
Progress (2): 268 kB | 6.9/12 kB
                                
Downloaded from repository.sonatype.org: https://repository.sonatype.org/content/groups/forge/org/codehaus/plexus/plexus-utils/1.5.8/plexus-utils-1.5.8.jar (268 kB at 188 kB/s)
Progress (1): 11/12 kB
Progress (1): 12 kB   
                   
Downloaded from repository.sonatype.org: https://repository.sonatype.org/content/groups/forge/org/codehaus/plexus/plexus-i18n/1.0-beta-6/plexus-i18n-1.0-beta-6.jar (12 kB at 8.0 kB/s)
Downloading from eclipse.maven.central.mirror: https://repo.eclipse.org/content/repositories/maven_central/org/apache/maven/maven-artifact/2.0.9/maven-artifact-2.0.9.jar
Downloading from eclipse.maven.central.mirror: https://repo.eclipse.org/content/repositories/maven_central/org/apache/maven/maven-plugin-api/2.0.9/maven-plugin-api-2.0.9.jar
Downloading from eclipse.maven.central.mirror: https://repo.eclipse.org/content/repositories/maven_central/org/apache/maven/maven-project/2.0.9/maven-project-2.0.9.jar
Downloading from eclipse.maven.central.mirror: https://repo.eclipse.org/content/repositories/maven_central/org/apache/maven/maven-settings/2.0.9/maven-settings-2.0.9.jar
Downloading from eclipse.maven.central.mirror: https://repo.eclipse.org/content/repositories/maven_central/org/apache/maven/maven-profile/2.0.9/maven-profile-2.0.9.jar
Progress (1): 4.1/89 kB
Progress (1): 7.7/89 kB
Progress (1): 12/89 kB 
Progress (1): 16/89 kB
Progress (1): 20/89 kB
Progress (1): 24/89 kB
Progress (1): 28/89 kB
Progress (1): 32/89 kB
Progress (1): 33/89 kB
Progress (1): 37/89 kB
Progress (1): 41/89 kB
Progress (1): 45/89 kB
Progress (1): 49/89 kB
Progress (1): 53/89 kB
Progress (1): 57/89 kB
Progress (1): 61/89 kB
Progress (1): 65/89 kB
Progress (1): 66/89 kB
Progress (1): 70/89 kB
Progress (1): 74/89 kB
Progress (1): 78/89 kB
Progress (1): 82/89 kB
Progress (1): 86/89 kB
Progress (1): 89 kB   
Progress (2): 89 kB | 4.1/13 kB
Progress (2): 89 kB | 7.7/13 kB
Progress (2): 89 kB | 12/13 kB 
Progress (3): 89 kB | 12/13 kB | 4.1/122 kB
Progress (3): 89 kB | 13 kB | 4.1/122 kB   
Progress (3): 89 kB | 13 kB | 7.7/122 kB
Progress (3): 89 kB | 13 kB | 12/122 kB 
Progress (3): 89 kB | 13 kB | 16/122 kB
Progress (3): 89 kB | 13 kB | 20/122 kB
Progress (3): 89 kB | 13 kB | 24/122 kB
Progress (3): 89 kB | 13 kB | 28/122 kB
Progress (3): 89 kB | 13 kB | 32/122 kB
Progress (3): 89 kB | 13 kB | 36/122 kB
Progress (3): 89 kB | 13 kB | 40/122 kB
Progress (3): 89 kB | 13 kB | 44/122 kB
Progress (3): 89 kB | 13 kB | 48/122 kB
Progress (3): 89 kB | 13 kB | 52/122 kB
Progress (3): 89 kB | 13 kB | 56/122 kB
Progress (4): 89 kB | 13 kB | 56/122 kB | 4.1/49 kB
Progress (4): 89 kB | 13 kB | 60/122 kB | 4.1/49 kB
Progress (4): 89 kB | 13 kB | 60/122 kB | 7.7/49 kB
Progress (4): 89 kB | 13 kB | 64/122 kB | 7.7/49 kB
Progress (4): 89 kB | 13 kB | 64/122 kB | 12/49 kB 
Progress (4): 89 kB | 13 kB | 64/122 kB | 16/49 kB
                                                  
Downloaded from eclipse.maven.central.mirror: https://repo.eclipse.org/content/repositories/maven_central/org/apache/maven/maven-artifact/2.0.9/maven-artifact-2.0.9.jar (89 kB at 3.4 MB/s)
Progress (3): 13 kB | 68/122 kB | 16/49 kB
                                          
Downloaded from eclipse.maven.central.mirror: https://repo.eclipse.org/content/repositories/maven_central/org/apache/maven/maven-plugin-api/2.0.9/maven-plugin-api-2.0.9.jar (13 kB at 477 kB/s)
Progress (2): 72/122 kB | 16/49 kB
Progress (3): 72/122 kB | 16/49 kB | 4.1/35 kB
Progress (3): 72/122 kB | 20/49 kB | 4.1/35 kB
Progress (3): 72/122 kB | 20/49 kB | 7.7/35 kB
                                              
Downloading from eclipse.maven.central.mirror: https://repo.eclipse.org/content/repositories/maven_central/org/apache/maven/maven-model/2.0.9/maven-model-2.0.9.jar
Progress (3): 72/122 kB | 24/49 kB | 7.7/35 kB
Progress (3): 76/122 kB | 24/49 kB | 7.7/35 kB
                                              
Downloading from eclipse.maven.central.mirror: https://repo.eclipse.org/content/repositories/maven_central/org/apache/maven/maven-artifact-manager/2.0.9/maven-artifact-manager-2.0.9.jar
Progress (3): 80/122 kB | 24/49 kB | 7.7/35 kB
Progress (3): 80/122 kB | 28/49 kB | 7.7/35 kB
Progress (3): 84/122 kB | 28/49 kB | 7.7/35 kB
Progress (3): 84/122 kB | 28/49 kB | 12/35 kB 
Progress (3): 88/122 kB | 28/49 kB | 12/35 kB
Progress (3): 88/122 kB | 32/49 kB | 12/35 kB
Progress (3): 88/122 kB | 32/49 kB | 16/35 kB
Progress (3): 92/122 kB | 32/49 kB | 16/35 kB
Progress (3): 92/122 kB | 36/49 kB | 16/35 kB
Progress (3): 96/122 kB | 36/49 kB | 16/35 kB
Progress (3): 96/122 kB | 36/49 kB | 20/35 kB
Progress (3): 96/122 kB | 40/49 kB | 20/35 kB
Progress (3): 96/122 kB | 40/49 kB | 24/35 kB
Progress (3): 100/122 kB | 40/49 kB | 24/35 kB
Progress (3): 100/122 kB | 44/49 kB | 24/35 kB
Progress (3): 104/122 kB | 44/49 kB | 24/35 kB
Progress (3): 104/122 kB | 44/49 kB | 28/35 kB
Progress (3): 104/122 kB | 48/49 kB | 28/35 kB
Progress (3): 104/122 kB | 48/49 kB | 32/35 kB
Progress (3): 108/122 kB | 48/49 kB | 32/35 kB
Progress (3): 108/122 kB | 48/49 kB | 35 kB   
Progress (3): 108/122 kB | 49 kB | 35 kB   
Progress (4): 108/122 kB | 49 kB | 35 kB | 4.1/87 kB
Progress (4): 112/122 kB | 49 kB | 35 kB | 4.1/87 kB
Progress (4): 112/122 kB | 49 kB | 35 kB | 7.7/87 kB
Progress (4): 116/122 kB | 49 kB | 35 kB | 7.7/87 kB
Progress (4): 116/122 kB | 49 kB | 35 kB | 12/87 kB 
Progress (4): 120/122 kB | 49 kB | 35 kB | 12/87 kB
Progress (5): 120/122 kB | 49 kB | 35 kB | 12/87 kB | 4.1/58 kB
Progress (5): 120/122 kB | 49 kB | 35 kB | 16/87 kB | 4.1/58 kB
Progress (5): 120/122 kB | 49 kB | 35 kB | 16/87 kB | 7.7/58 kB
Progress (5): 122 kB | 49 kB | 35 kB | 16/87 kB | 7.7/58 kB    
Progress (5): 122 kB | 49 kB | 35 kB | 16/87 kB | 12/58 kB 
Progress (5): 122 kB | 49 kB | 35 kB | 20/87 kB | 12/58 kB
Progress (5): 122 kB | 49 kB | 35 kB | 20/87 kB | 16/58 kB
Progress (5): 122 kB | 49 kB | 35 kB | 24/87 kB | 16/58 kB
Progress (5): 122 kB | 49 kB | 35 kB | 24/87 kB | 20/58 kB
Progress (5): 122 kB | 49 kB | 35 kB | 28/87 kB | 20/58 kB
Progress (5): 122 kB | 49 kB | 35 kB | 28/87 kB | 24/58 kB
Progress (5): 122 kB | 49 kB | 35 kB | 32/87 kB | 24/58 kB
                                                          
Downloaded from eclipse.maven.central.mirror: https://repo.eclipse.org/content/repositories/maven_central/org/apache/maven/maven-profile/2.0.9/maven-profile-2.0.9.jar (35 kB at 982 kB/s)
Progress (4): 122 kB | 49 kB | 33/87 kB | 24/58 kB
Progress (4): 122 kB | 49 kB | 33/87 kB | 28/58 kB
                                                  
Downloading from eclipse.maven.central.mirror: https://repo.eclipse.org/content/repositories/maven_central/org/apache/maven/maven-plugin-registry/2.0.9/maven-plugin-registry-2.0.9.jar
Progress (4): 122 kB | 49 kB | 37/87 kB | 28/58 kB
Progress (4): 122 kB | 49 kB | 37/87 kB | 32/58 kB
Progress (4): 122 kB | 49 kB | 41/87 kB | 32/58 kB
Progress (4): 122 kB | 49 kB | 41/87 kB | 36/58 kB
Progress (4): 122 kB | 49 kB | 45/87 kB | 36/58 kB
Progress (4): 122 kB | 49 kB | 45/87 kB | 40/58 kB
Progress (4): 122 kB | 49 kB | 49/87 kB | 40/58 kB
Progress (4): 122 kB | 49 kB | 49/87 kB | 44/58 kB
Progress (4): 122 kB | 49 kB | 53/87 kB | 44/58 kB
                                                  
Downloaded from eclipse.maven.central.mirror: https://repo.eclipse.org/content/repositories/maven_central/org/apache/maven/maven-settings/2.0.9/maven-settings-2.0.9.jar (49 kB at 1.3 MB/s)
Progress (3): 122 kB | 57/87 kB | 44/58 kB
Progress (3): 122 kB | 57/87 kB | 48/58 kB
                                          
Downloading from eclipse.maven.central.mirror: https://repo.eclipse.org/content/repositories/maven_central/org/apache/maven/maven-core/2.0.9/maven-core-2.0.9.jar
Progress (3): 122 kB | 61/87 kB | 48/58 kB
Progress (3): 122 kB | 61/87 kB | 49/58 kB
                                          
Downloaded from eclipse.maven.central.mirror: https://repo.eclipse.org/content/repositories/maven_central/org/apache/maven/maven-project/2.0.9/maven-project-2.0.9.jar (122 kB at 3.0 MB/s)
Progress (2): 65/87 kB | 49/58 kB
Progress (2): 65/87 kB | 53/58 kB
                                 
Downloading from eclipse.maven.central.mirror: https://repo.eclipse.org/content/repositories/maven_central/org/apache/maven/maven-plugin-parameter-documenter/2.0.9/maven-plugin-parameter-documenter-2.0.9.jar
Progress (2): 65/87 kB | 57/58 kB
Progress (2): 69/87 kB | 57/58 kB
Progress (2): 69/87 kB | 58 kB   
Progress (2): 73/87 kB | 58 kB
Progress (2): 77/87 kB | 58 kB
Progress (2): 81/87 kB | 58 kB
Progress (2): 85/87 kB | 58 kB
Progress (2): 87 kB | 58 kB   
Progress (3): 87 kB | 58 kB | 4.1/29 kB
Progress (3): 87 kB | 58 kB | 7.7/29 kB
Progress (3): 87 kB | 58 kB | 12/29 kB 
Progress (3): 87 kB | 58 kB | 16/29 kB
Progress (3): 87 kB | 58 kB | 20/29 kB
Progress (3): 87 kB | 58 kB | 24/29 kB
Progress (3): 87 kB | 58 kB | 28/29 kB
Progress (3): 87 kB | 58 kB | 29 kB   
                                   
Downloaded from eclipse.maven.central.mirror: https://repo.eclipse.org/content/repositories/maven_central/org/apache/maven/maven-artifact-manager/2.0.9/maven-artifact-manager-2.0.9.jar (58 kB at 1.3 MB/s)
Downloading from eclipse.maven.central.mirror: https://repo.eclipse.org/content/repositories/maven_central/org/apache/maven/doxia/doxia-sink-api/1.0-alpha-10/doxia-sink-api-1.0-alpha-10.jar
Progress (3): 87 kB | 29 kB | 4.1/21 kB
Progress (3): 87 kB | 29 kB | 7.7/21 kB
Progress (3): 87 kB | 29 kB | 12/21 kB 
Progress (3): 87 kB | 29 kB | 16/21 kB
                                      
Downloaded from eclipse.maven.central.mirror: https://repo.eclipse.org/content/repositories/maven_central/org/apache/maven/maven-plugin-registry/2.0.9/maven-plugin-registry-2.0.9.jar (29 kB at 581 kB/s)
Downloaded from eclipse.maven.central.mirror: https://repo.eclipse.org/content/repositories/maven_central/org/apache/maven/maven-model/2.0.9/maven-model-2.0.9.jar (87 kB at 1.7 MB/s)
Progress (1): 20/21 kB
                      
Downloading from eclipse.maven.central.mirror: https://repo.eclipse.org/content/repositories/maven_central/org/apache/maven/maven-repository-metadata/2.0.9/maven-repository-metadata-2.0.9.jar
Progress (1): 21 kB
                   
Downloading from eclipse.maven.central.mirror: https://repo.eclipse.org/content/repositories/maven_central/org/apache/maven/maven-error-diagnostics/2.0.9/maven-error-diagnostics-2.0.9.jar
Progress (2): 21 kB | 4.1/160 kB
Progress (2): 21 kB | 7.7/160 kB
Progress (2): 21 kB | 12/160 kB 
Progress (2): 21 kB | 16/160 kB
Progress (2): 21 kB | 20/160 kB
Progress (2): 21 kB | 24/160 kB
Progress (2): 21 kB | 28/160 kB
Progress (2): 21 kB | 32/160 kB
Progress (2): 21 kB | 33/160 kB
Progress (2): 21 kB | 37/160 kB
Progress (2): 21 kB | 41/160 kB
Progress (2): 21 kB | 45/160 kB
Progress (2): 21 kB | 49/160 kB
Progress (2): 21 kB | 53/160 kB
Progress (2): 21 kB | 57/160 kB
Progress (2): 21 kB | 61/160 kB
Progress (2): 21 kB | 65/160 kB
Progress (2): 21 kB | 66/160 kB
Progress (2): 21 kB | 70/160 kB
Progress (2): 21 kB | 74/160 kB
Progress (2): 21 kB | 78/160 kB
Progress (3): 21 kB | 78/160 kB | 4.1/14 kB
Progress (3): 21 kB | 82/160 kB | 4.1/14 kB
Progress (3): 21 kB | 82/160 kB | 7.7/14 kB
Progress (3): 21 kB | 86/160 kB | 7.7/14 kB
Progress (3): 21 kB | 86/160 kB | 12/14 kB 
Progress (3): 21 kB | 90/160 kB | 12/14 kB
Progress (3): 21 kB | 90/160 kB | 14 kB   
Progress (3): 21 kB | 94/160 kB | 14 kB
Progress (3): 21 kB | 98/160 kB | 14 kB
Progress (3): 21 kB | 102/160 kB | 14 kB
Progress (3): 21 kB | 106/160 kB | 14 kB
                                        
Downloaded from eclipse.maven.central.mirror: https://repo.eclipse.org/content/repositories/maven_central/org/apache/maven/maven-plugin-parameter-documenter/2.0.9/maven-plugin-parameter-documenter-2.0.9.jar (21 kB at 360 kB/s)
Progress (2): 110/160 kB | 14 kB
                                
Downloading from eclipse.maven.central.mirror: https://repo.eclipse.org/content/repositories/maven_central/commons-cli/commons-cli/1.0/commons-cli-1.0.jar
Progress (2): 114/160 kB | 14 kB
Progress (3): 114/160 kB | 14 kB | 4.1/25 kB
Progress (3): 118/160 kB | 14 kB | 4.1/25 kB
Progress (3): 118/160 kB | 14 kB | 7.7/25 kB
Progress (3): 122/160 kB | 14 kB | 7.7/25 kB
Progress (3): 122/160 kB | 14 kB | 12/25 kB 
Progress (3): 126/160 kB | 14 kB | 12/25 kB
Progress (3): 126/160 kB | 14 kB | 16/25 kB
Progress (3): 130/160 kB | 14 kB | 16/25 kB
Progress (3): 130/160 kB | 14 kB | 20/25 kB
Progress (3): 134/160 kB | 14 kB | 20/25 kB
Progress (3): 134/160 kB | 14 kB | 24/25 kB
Progress (3): 138/160 kB | 14 kB | 24/25 kB
Progress (3): 138/160 kB | 14 kB | 25 kB   
Progress (3): 142/160 kB | 14 kB | 25 kB
Progress (3): 146/160 kB | 14 kB | 25 kB
Progress (3): 150/160 kB | 14 kB | 25 kB
                                        
Downloaded from eclipse.maven.central.mirror: https://repo.eclipse.org/content/repositories/maven_central/org/apache/maven/maven-error-diagnostics/2.0.9/maven-error-diagnostics-2.0.9.jar (14 kB at 230 kB/s)
Progress (2): 154/160 kB | 25 kB
                                
Downloading from eclipse.maven.central.mirror: https://repo.eclipse.org/content/repositories/maven_central/org/apache/maven/maven-plugin-descriptor/2.0.9/maven-plugin-descriptor-2.0.9.jar
Progress (2): 158/160 kB | 25 kB
Progress (2): 160 kB | 25 kB    
Progress (3): 160 kB | 25 kB | 4.1/9.9 kB
Progress (3): 160 kB | 25 kB | 7.7/9.9 kB
Progress (3): 160 kB | 25 kB | 9.9 kB    
Progress (4): 160 kB | 25 kB | 9.9 kB | 4.1/30 kB
Progress (4): 160 kB | 25 kB | 9.9 kB | 7.7/30 kB
Progress (4): 160 kB | 25 kB | 9.9 kB | 12/30 kB 
Progress (4): 160 kB | 25 kB | 9.9 kB | 16/30 kB
Progress (4): 160 kB | 25 kB | 9.9 kB | 20/30 kB
Progress (4): 160 kB | 25 kB | 9.9 kB | 24/30 kB
Progress (4): 160 kB | 25 kB | 9.9 kB | 28/30 kB
Progress (4): 160 kB | 25 kB | 9.9 kB | 30 kB   
                                             
Downloaded from eclipse.maven.central.mirror: https://repo.eclipse.org/content/repositories/maven_central/org/apache/maven/maven-core/2.0.9/maven-core-2.0.9.jar (160 kB at 2.3 MB/s)
Downloading from eclipse.maven.central.mirror: https://repo.eclipse.org/content/repositories/maven_central/org/apache/maven/maven-monitor/2.0.9/maven-monitor-2.0.9.jar
Downloaded from eclipse.maven.central.mirror: https://repo.eclipse.org/content/repositories/maven_central/org/apache/maven/maven-repository-metadata/2.0.9/maven-repository-metadata-2.0.9.jar (25 kB at 341 kB/s)
Downloading from eclipse.maven.central.mirror: https://repo.eclipse.org/content/repositories/maven_central/classworlds/classworlds/1.1/classworlds-1.1.jar
Downloaded from eclipse.maven.central.mirror: https://repo.eclipse.org/content/repositories/maven_central/commons-cli/commons-cli/1.0/commons-cli-1.0.jar (30 kB at 413 kB/s)
Downloading from eclipse.maven.central.mirror: https://repo.eclipse.org/content/repositories/maven_central/commons-lang/commons-lang/2.3/commons-lang-2.3.jar
Downloaded from eclipse.maven.central.mirror: https://repo.eclipse.org/content/repositories/maven_central/org/apache/maven/doxia/doxia-sink-api/1.0-alpha-10/doxia-sink-api-1.0-alpha-10.jar (9.9 kB at 134 kB/s)
Downloading from eclipse.maven.central.mirror: https://repo.eclipse.org/content/repositories/maven_central/org/apache/maven/enforcer/enforcer-api/1.3.1/enforcer-api-1.3.1.jar
Progress (1): 4.1/37 kB
Progress (1): 7.7/37 kB
Progress (1): 12/37 kB 
Progress (1): 16/37 kB
Progress (1): 20/37 kB
Progress (1): 24/37 kB
Progress (1): 28/37 kB
Progress (1): 32/37 kB
Progress (1): 33/37 kB
Progress (1): 37/37 kB
Progress (1): 37 kB   
Progress (2): 37 kB | 4.1/10 kB
Progress (2): 37 kB | 7.7/10 kB
Progress (2): 37 kB | 10 kB    
                           
Downloaded from eclipse.maven.central.mirror: https://repo.eclipse.org/content/repositories/maven_central/org/apache/maven/maven-plugin-descriptor/2.0.9/maven-plugin-descriptor-2.0.9.jar (37 kB at 457 kB/s)
Downloading from eclipse.maven.central.mirror: https://repo.eclipse.org/content/repositories/maven_central/org/apache/maven/enforcer/enforcer-rules/1.3.1/enforcer-rules-1.3.1.jar
Progress (2): 10 kB | 4.1/38 kB
Progress (2): 10 kB | 7.7/38 kB
Progress (2): 10 kB | 12/38 kB 
Progress (2): 10 kB | 16/38 kB
Progress (2): 10 kB | 20/38 kB
Progress (2): 10 kB | 24/38 kB
Progress (2): 10 kB | 28/38 kB
Progress (2): 10 kB | 32/38 kB
Progress (2): 10 kB | 33/38 kB
                              
Downloaded from eclipse.maven.central.mirror: https://repo.eclipse.org/content/repositories/maven_central/org/apache/maven/maven-monitor/2.0.9/maven-monitor-2.0.9.jar (10 kB at 121 kB/s)
Downloading from eclipse.maven.central.mirror: https://repo.eclipse.org/content/repositories/maven_central/org/apache/maven/shared/maven-common-artifact-filters/1.4/maven-common-artifact-filters-1.4.jar
Progress (1): 37/38 kB
Progress (1): 38 kB   
                   
Downloaded from eclipse.maven.central.mirror: https://repo.eclipse.org/content/repositories/maven_central/classworlds/classworlds/1.1/classworlds-1.1.jar (38 kB at 416 kB/s)
Downloading from eclipse.maven.central.mirror: https://repo.eclipse.org/content/repositories/maven_central/org/beanshell/bsh/2.0b4/bsh-2.0b4.jar
Progress (1): 4.1/32 kB
Progress (1): 7.7/32 kB
Progress (1): 12/32 kB 
Progress (1): 16/32 kB
Progress (1): 20/32 kB
Progress (1): 24/32 kB
Progress (1): 28/32 kB
Progress (1): 32 kB   
Progress (2): 32 kB | 4.1/245 kB
Progress (2): 32 kB | 7.7/245 kB
Progress (2): 32 kB | 12/245 kB 
Progress (2): 32 kB | 16/245 kB
Progress (2): 32 kB | 20/245 kB
Progress (2): 32 kB | 24/245 kB
Progress (2): 32 kB | 28/245 kB
Progress (2): 32 kB | 32/245 kB
Progress (2): 32 kB | 33/245 kB
Progress (2): 32 kB | 37/245 kB
Progress (2): 32 kB | 41/245 kB
Progress (2): 32 kB | 45/245 kB
Progress (2): 32 kB | 49/245 kB
Progress (2): 32 kB | 53/245 kB
Progress (2): 32 kB | 57/245 kB
Progress (2): 32 kB | 61/245 kB
Progress (2): 32 kB | 65/245 kB
Progress (2): 32 kB | 66/245 kB
Progress (2): 32 kB | 70/245 kB
Progress (2): 32 kB | 74/245 kB
Progress (2): 32 kB | 78/245 kB
Progress (2): 32 kB | 82/245 kB
Progress (2): 32 kB | 86/245 kB
                               
Downloaded from eclipse.maven.central.mirror: https://repo.eclipse.org/content/repositories/maven_central/org/apache/maven/shared/maven-common-artifact-filters/1.4/maven-common-artifact-filters-1.4.jar (32 kB at 298 kB/s)
Progress (1): 90/245 kB
                       
Downloading from eclipse.maven.central.mirror: https://repo.eclipse.org/content/repositories/maven_central/org/apache/maven/shared/maven-dependency-tree/2.1/maven-dependency-tree-2.1.jar
Progress (1): 94/245 kB
Progress (1): 98/245 kB
Progress (1): 102/245 kB
Progress (1): 106/245 kB
Progress (1): 110/245 kB
Progress (1): 114/245 kB
Progress (1): 118/245 kB
Progress (1): 122/245 kB
Progress (1): 126/245 kB
Progress (1): 130/245 kB
Progress (1): 134/245 kB
Progress (1): 138/245 kB
Progress (1): 142/245 kB
Progress (1): 146/245 kB
Progress (1): 150/245 kB
Progress (1): 154/245 kB
Progress (1): 158/245 kB
Progress (1): 162/245 kB
Progress (1): 166/245 kB
Progress (1): 170/245 kB
Progress (1): 174/245 kB
Progress (1): 178/245 kB
Progress (1): 182/245 kB
Progress (1): 186/245 kB
Progress (1): 190/245 kB
Progress (1): 194/245 kB
Progress (1): 198/245 kB
Progress (2): 198/245 kB | 4.1/60 kB
Progress (2): 202/245 kB | 4.1/60 kB
Progress (2): 202/245 kB | 7.7/60 kB
Progress (2): 206/245 kB | 7.7/60 kB
Progress (2): 206/245 kB | 12/60 kB 
Progress (2): 210/245 kB | 12/60 kB
Progress (2): 210/245 kB | 16/60 kB
Progress (2): 214/245 kB | 16/60 kB
Progress (2): 214/245 kB | 20/60 kB
Progress (2): 218/245 kB | 20/60 kB
Progress (2): 218/245 kB | 24/60 kB
Progress (2): 222/245 kB | 24/60 kB
Progress (2): 222/245 kB | 28/60 kB
Progress (2): 226/245 kB | 28/60 kB
Progress (2): 226/245 kB | 32/60 kB
Progress (2): 226/245 kB | 33/60 kB
Progress (2): 230/245 kB | 33/60 kB
Progress (2): 230/245 kB | 37/60 kB
Progress (2): 234/245 kB | 37/60 kB
Progress (2): 234/245 kB | 41/60 kB
Progress (2): 238/245 kB | 41/60 kB
Progress (2): 238/245 kB | 45/60 kB
Progress (2): 242/245 kB | 45/60 kB
Progress (2): 242/245 kB | 49/60 kB
Progress (2): 245 kB | 49/60 kB    
Progress (2): 245 kB | 53/60 kB
Progress (2): 245 kB | 57/60 kB
Progress (2): 245 kB | 60 kB   
                            
Downloaded from eclipse.maven.central.mirror: https://repo.eclipse.org/content/repositories/maven_central/commons-lang/commons-lang/2.3/commons-lang-2.3.jar (245 kB at 2.0 MB/s)
Downloading from eclipse.maven.central.mirror: https://repo.eclipse.org/content/repositories/maven_central/org/eclipse/aether/aether-util/0.9.0.M2/aether-util-0.9.0.M2.jar
Downloaded from eclipse.maven.central.mirror: https://repo.eclipse.org/content/repositories/maven_central/org/apache/maven/shared/maven-dependency-tree/2.1/maven-dependency-tree-2.1.jar (60 kB at 487 kB/s)
Progress (1): 4.1/9.8 kB
Progress (1): 7.7/9.8 kB
Progress (1): 9.8 kB    
Progress (2): 9.8 kB | 4.1/282 kB
Progress (2): 9.8 kB | 7.7/282 kB
Progress (2): 9.8 kB | 12/282 kB 
Progress (2): 9.8 kB | 16/282 kB
Progress (2): 9.8 kB | 20/282 kB
Progress (2): 9.8 kB | 24/282 kB
Progress (2): 9.8 kB | 28/282 kB
Progress (2): 9.8 kB | 32/282 kB
Progress (2): 9.8 kB | 33/282 kB
Progress (2): 9.8 kB | 37/282 kB
Progress (2): 9.8 kB | 41/282 kB
Progress (2): 9.8 kB | 45/282 kB
Progress (2): 9.8 kB | 49/282 kB
Progress (2): 9.8 kB | 53/282 kB
Progress (2): 9.8 kB | 57/282 kB
Progress (3): 9.8 kB | 57/282 kB | 4.1/87 kB
Progress (3): 9.8 kB | 61/282 kB | 4.1/87 kB
Progress (3): 9.8 kB | 61/282 kB | 7.7/87 kB
Progress (3): 9.8 kB | 65/282 kB | 7.7/87 kB
Progress (3): 9.8 kB | 66/282 kB | 7.7/87 kB
Progress (3): 9.8 kB | 66/282 kB | 12/87 kB 
Progress (3): 9.8 kB | 70/282 kB | 12/87 kB
Progress (3): 9.8 kB | 70/282 kB | 16/87 kB
Progress (3): 9.8 kB | 74/282 kB | 16/87 kB
Progress (3): 9.8 kB | 74/282 kB | 20/87 kB
Progress (3): 9.8 kB | 78/282 kB | 20/87 kB
Progress (3): 9.8 kB | 78/282 kB | 24/87 kB
Progress (3): 9.8 kB | 82/282 kB | 24/87 kB
Progress (3): 9.8 kB | 82/282 kB | 28/87 kB
Progress (3): 9.8 kB | 86/282 kB | 28/87 kB
Progress (3): 9.8 kB | 86/282 kB | 32/87 kB
Progress (3): 9.8 kB | 90/282 kB | 32/87 kB
Progress (3): 9.8 kB | 90/282 kB | 36/87 kB
Progress (3): 9.8 kB | 94/282 kB | 36/87 kB
Progress (3): 9.8 kB | 94/282 kB | 40/87 kB
Progress (3): 9.8 kB | 98/282 kB | 40/87 kB
Progress (4): 9.8 kB | 98/282 kB | 40/87 kB | 4.1/134 kB
Progress (4): 9.8 kB | 102/282 kB | 40/87 kB | 4.1/134 kB
Progress (4): 9.8 kB | 102/282 kB | 44/87 kB | 4.1/134 kB
Progress (4): 9.8 kB | 106/282 kB | 44/87 kB | 4.1/134 kB
Progress (4): 9.8 kB | 106/282 kB | 44/87 kB | 7.7/134 kB
Progress (4): 9.8 kB | 106/282 kB | 48/87 kB | 7.7/134 kB
Progress (4): 9.8 kB | 106/282 kB | 48/87 kB | 12/134 kB 
Progress (4): 9.8 kB | 110/282 kB | 48/87 kB | 12/134 kB
Progress (4): 9.8 kB | 110/282 kB | 52/87 kB | 12/134 kB
Progress (4): 9.8 kB | 110/282 kB | 52/87 kB | 16/134 kB
Progress (4): 9.8 kB | 110/282 kB | 56/87 kB | 16/134 kB
Progress (4): 9.8 kB | 114/282 kB | 56/87 kB | 16/134 kB
Progress (4): 9.8 kB | 114/282 kB | 56/87 kB | 20/134 kB
                                                        
Downloaded from eclipse.maven.central.mirror: https://repo.eclipse.org/content/repositories/maven_central/org/apache/maven/enforcer/enforcer-api/1.3.1/enforcer-api-1.3.1.jar (9.8 kB at 71 kB/s)
Progress (3): 114/282 kB | 56/87 kB | 24/134 kB
Progress (3): 118/282 kB | 56/87 kB | 24/134 kB
Progress (3): 118/282 kB | 60/87 kB | 24/134 kB
Progress (3): 122/282 kB | 60/87 kB | 24/134 kB
Progress (3): 122/282 kB | 60/87 kB | 28/134 kB
Progress (3): 122/282 kB | 64/87 kB | 28/134 kB
Progress (3): 126/282 kB | 64/87 kB | 28/134 kB
Progress (3): 126/282 kB | 64/87 kB | 32/134 kB
Progress (3): 130/282 kB | 64/87 kB | 32/134 kB
Progress (3): 130/282 kB | 68/87 kB | 32/134 kB
Progress (3): 130/282 kB | 68/87 kB | 33/134 kB
Progress (3): 130/282 kB | 72/87 kB | 33/134 kB
Progress (3): 134/282 kB | 72/87 kB | 33/134 kB
Progress (3): 134/282 kB | 72/87 kB | 37/134 kB
Progress (3): 134/282 kB | 76/87 kB | 37/134 kB
Progress (3): 138/282 kB | 76/87 kB | 37/134 kB
Progress (3): 138/282 kB | 80/87 kB | 37/134 kB
Progress (3): 138/282 kB | 80/87 kB | 41/134 kB
Progress (3): 142/282 kB | 80/87 kB | 41/134 kB
Progress (3): 142/282 kB | 84/87 kB | 41/134 kB
Progress (3): 146/282 kB | 84/87 kB | 41/134 kB
Progress (3): 146/282 kB | 84/87 kB | 45/134 kB
Progress (3): 146/282 kB | 87 kB | 45/134 kB   
Progress (3): 146/282 kB | 87 kB | 49/134 kB
Progress (3): 150/282 kB | 87 kB | 49/134 kB
Progress (3): 154/282 kB | 87 kB | 49/134 kB
Progress (3): 154/282 kB | 87 kB | 53/134 kB
Progress (3): 158/282 kB | 87 kB | 53/134 kB
Progress (3): 158/282 kB | 87 kB | 57/134 kB
Progress (3): 162/282 kB | 87 kB | 57/134 kB
Progress (3): 162/282 kB | 87 kB | 61/134 kB
Progress (3): 166/282 kB | 87 kB | 61/134 kB
Progress (3): 166/282 kB | 87 kB | 65/134 kB
Progress (3): 170/282 kB | 87 kB | 65/134 kB
Progress (3): 170/282 kB | 87 kB | 66/134 kB
Progress (3): 174/282 kB | 87 kB | 66/134 kB
Progress (3): 174/282 kB | 87 kB | 70/134 kB
Progress (3): 178/282 kB | 87 kB | 70/134 kB
Progress (3): 178/282 kB | 87 kB | 74/134 kB
Progress (3): 182/282 kB | 87 kB | 74/134 kB
Progress (3): 182/282 kB | 87 kB | 78/134 kB
Progress (3): 186/282 kB | 87 kB | 78/134 kB
Progress (3): 186/282 kB | 87 kB | 82/134 kB
Progress (3): 190/282 kB | 87 kB | 82/134 kB
Progress (3): 190/282 kB | 87 kB | 86/134 kB
Progress (3): 194/282 kB | 87 kB | 86/134 kB
Progress (3): 194/282 kB | 87 kB | 90/134 kB
Progress (3): 198/282 kB | 87 kB | 90/134 kB
Progress (3): 198/282 kB | 87 kB | 94/134 kB
Progress (3): 202/282 kB | 87 kB | 94/134 kB
Progress (3): 202/282 kB | 87 kB | 98/134 kB
Progress (3): 206/282 kB | 87 kB | 98/134 kB
Progress (3): 206/282 kB | 87 kB | 98/134 kB
Progress (3): 210/282 kB | 87 kB | 98/134 kB
Progress (3): 210/282 kB | 87 kB | 102/134 kB
Progress (3): 214/282 kB | 87 kB | 102/134 kB
Progress (3): 214/282 kB | 87 kB | 106/134 kB
Progress (3): 218/282 kB | 87 kB | 106/134 kB
Progress (3): 218/282 kB | 87 kB | 110/134 kB
Progress (3): 222/282 kB | 87 kB | 110/134 kB
Progress (3): 222/282 kB | 87 kB | 114/134 kB
Progress (3): 226/282 kB | 87 kB | 114/134 kB
Progress (3): 226/282 kB | 87 kB | 118/134 kB
Progress (3): 230/282 kB | 87 kB | 118/134 kB
Progress (3): 230/282 kB | 87 kB | 122/134 kB
Progress (3): 234/282 kB | 87 kB | 122/134 kB
Progress (3): 234/282 kB | 87 kB | 126/134 kB
Progress (3): 238/282 kB | 87 kB | 126/134 kB
Progress (3): 238/282 kB | 87 kB | 130/134 kB
Progress (3): 242/282 kB | 87 kB | 130/134 kB
Progress (3): 242/282 kB | 87 kB | 131/134 kB
Progress (3): 246/282 kB | 87 kB | 131/134 kB
Progress (3): 246/282 kB | 87 kB | 134 kB    
Progress (3): 250/282 kB | 87 kB | 134 kB
Progress (3): 254/282 kB | 87 kB | 134 kB
Progress (3): 258/282 kB | 87 kB | 134 kB
Progress (3): 262/282 kB | 87 kB | 134 kB
Progress (3): 266/282 kB | 87 kB | 134 kB
Progress (3): 270/282 kB | 87 kB | 134 kB
Progress (3): 274/282 kB | 87 kB | 134 kB
Progress (3): 278/282 kB | 87 kB | 134 kB
Progress (3): 282/282 kB | 87 kB | 134 kB
Progress (3): 282 kB | 87 kB | 134 kB    
                                     
Downloaded from eclipse.maven.central.mirror: https://repo.eclipse.org/content/repositories/maven_central/org/apache/maven/enforcer/enforcer-rules/1.3.1/enforcer-rules-1.3.1.jar (87 kB at 558 kB/s)
Downloaded from eclipse.maven.central.mirror: https://repo.eclipse.org/content/repositories/maven_central/org/eclipse/aether/aether-util/0.9.0.M2/aether-util-0.9.0.M2.jar (134 kB at 845 kB/s)
Downloaded from eclipse.maven.central.mirror: https://repo.eclipse.org/content/repositories/maven_central/org/beanshell/bsh/2.0b4/bsh-2.0b4.jar (282 kB at 1.8 MB/s)
[WARNING] Rule 0: org.apache.maven.plugins.enforcer.RequireMavenVersion failed with message:
Detected Maven Version: 3.5.2 is not in the allowed range [3.0.4,3.1).
[INFO] ------------------------------------------------------------------------
[INFO] Reactor Summary:
[INFO] 
[INFO] Nexus Unzip Plugin - Parent (Incubation) ........... FAILURE [ 32.151 s]
[INFO] Nexus Unzip Plugin (Incubation) .................... SKIPPED
[INFO] Nexus Unzip Plugin - Integration Tests (Incubation)  SKIPPED
[INFO] ------------------------------------------------------------------------
[INFO] BUILD FAILURE
[INFO] ------------------------------------------------------------------------
[INFO] Total time: 01:20 min
[INFO] Finished at: 2018-01-18T09:16:32-05:00
[INFO] Final Memory: 23M/1931M
[INFO] ------------------------------------------------------------------------
[ERROR] Failed to execute goal org.apache.maven.plugins:maven-enforcer-plugin:1.3.1:enforce (enforce-environment) on project unzip-repository-plugin-parent: Some Enforcer rules have failed. Look above for specific messages explaining why the rule failed. -> [Help 1]
[ERROR] 
[ERROR] To see the full stack trace of the errors, re-run Maven with the -e switch.
[ERROR] Re-run Maven using the -X switch to enable full debug logging.
[ERROR] 
[ERROR] For more information about the errors and possible solutions, please read the following articles:
[ERROR] [Help 1] http://cwiki.apache.org/confluence/display/MAVEN/MojoExecutionException
Build step 'Invoke top-level Maven targets' marked build as failure
Sending e-mails to: jan.sievers@sap.com
Recording test results
ERROR: Step ‘Publish JUnit test result report’ failed: Test reports were found but none of them are new. Did tests run? 
For example, /home/hudson/genie.tycho/.jenkins/jobs/tycho.nexus-nightly/workspace/unzip-repository-plugin-its/target/failsafe-reports/TEST-org.eclipse.tycho.nexus.internal.plugin.UnzipRepositoryPluginITCase.xml is 12 days old

Started calculate disk usage of build
Finished Calculation of disk usage of build in 0 seconds
Started calculate disk usage of workspace
Finished Calculation of disk usage of workspace in 0 seconds
Finished: FAILURE