FailedConsole Output

Started by user jan.sievers@sap.com
Checkout:workspace / /home/hudson/genie.technology.tycho/.hudson/jobs/tycho.nexus-nightly/workspace - hudson.remoting.LocalChannel@71ad9edb
Using strategy: Default
Last Built Revision: Revision 8e5e9f83e31b9e61a22b890bd688e38dd0c493f6 (origin/master)
Checkout:workspace / /home/hudson/genie.technology.tycho/.hudson/jobs/tycho.nexus-nightly/workspace - hudson.remoting.LocalChannel@71ad9edb
Fetching changes from the remote Git repository
Fetching upstream changes from git://git.eclipse.org/gitroot/tycho/org.eclipse.tycho.nexus.git
Commencing build of Revision 612e96fe43ea795880fb88ba5bd55d5e40564edd (origin/master)
Checking out Revision 612e96fe43ea795880fb88ba5bd55d5e40564edd (origin/master)
[INFO] Using bundled Maven 3 installation
[INFO] Checking Maven 3 installation environment
[workspace] $ /home/hudson/genie.technology.tycho/.hudson/maven/slavebundle/bundled-maven/bin/mvn --help
[INFO] Checking Maven 3 installation version
[INFO] Detected Maven 3 installation version: 3.1.1
[WARN] Detected superfluous option: -B
[WARN] Detected superfluous option: -V
[workspace] $ /home/hudson/genie.technology.tycho/.hudson/maven/slavebundle/bundled-maven/bin/mvn clean install -B -e -V -V -B -Dmaven.ext.class.path=/home/hudson/genie.technology.tycho/.hudson/maven/slavebundle/resources:/home/hudson/genie.technology.tycho/.hudson/maven/slavebundle/lib/maven3-eventspy-3.1.jar:/home/hudson/genie.technology.tycho/.hudson/war/webapp/WEB-INF/lib/hudson-remoting-3.0.0.jar -Dhudson.eventspy.port=50957 -Dmaven.repo.local=/home/hudson/genie.technology.tycho/.hudson/jobs/tycho.nexus-nightly/workspace/.maven/repo -f pom.xml
[DEBUG] Waiting for connection on port: 50957
Apache Maven 3.1.1 (0728685237757ffbf44136acec0402957f723d9a; 2013-09-17 11:22:22-0400)
Maven home: /home/hudson/genie.technology.tycho/.hudson/maven/slavebundle/bundled-maven
Java version: 1.7.0_51, vendor: Oracle Corporation
Java home: /opt/public/common/jdk1.7.0_51/jre
Default locale: en_US, platform encoding: UTF-8
OS name: "linux", version: "3.0.101-0.35-default", arch: "amd64", family: "unix"
SLF4J: Class path contains multiple SLF4J bindings.
SLF4J: Found binding in [jar:file:/home/hudson/genie.technology.tycho/.hudson/maven/slavebundle/lib/maven3-eventspy-runtime.jar!/org/slf4j/impl/StaticLoggerBinder.class]
SLF4J: Found binding in [jar:file:/home/hudson/genie.technology.tycho/.hudson/maven/slavebundle/bundled-maven/lib/slf4j-simple-1.7.5.jar!/org/slf4j/impl/StaticLoggerBinder.class]
SLF4J: See http://www.slf4j.org/codes.html#multiple_bindings for an explanation.
[DEBUG] Connected to remote
[INFO] Error stacktraces are turned on.
[INFO] o.h.m.e.h.SettingsBuildingRequestHandler - Using global settings document ID: e23a0b6a-ab36-4ea3-8d97-c6ce7ba3db90
[INFO] Scanning for projects...
Downloading: https://repository.sonatype.org/content/groups/forge/org/sonatype/nexus/nexus-plugin-bundle-maven-plugin/1.2/nexus-plugin-bundle-maven-plugin-1.2.pom
Downloaded: https://repository.sonatype.org/content/groups/forge/org/sonatype/nexus/nexus-plugin-bundle-maven-plugin/1.2/nexus-plugin-bundle-maven-plugin-1.2.pom (6 KB at 6.8 KB/sec)
Downloading: https://repository.sonatype.org/content/groups/forge/org/sonatype/nexus/nexus-plugin-bundle/1.2/nexus-plugin-bundle-1.2.pom
Downloaded: https://repository.sonatype.org/content/groups/forge/org/sonatype/nexus/nexus-plugin-bundle/1.2/nexus-plugin-bundle-1.2.pom (13 KB at 35.7 KB/sec)
Downloading: https://repository.sonatype.org/content/groups/forge/org/sonatype/nexus/nexus-plugin-bundle-model/1.2/nexus-plugin-bundle-model-1.2.pom
Downloaded: https://repository.sonatype.org/content/groups/forge/org/sonatype/nexus/nexus-plugin-bundle-model/1.2/nexus-plugin-bundle-model-1.2.pom (3 KB at 8.1 KB/sec)
Downloading: https://repository.sonatype.org/content/groups/forge/org/codehaus/plexus/plexus-utils/2.1/plexus-utils-2.1.pom
Downloaded: https://repository.sonatype.org/content/groups/forge/org/codehaus/plexus/plexus-utils/2.1/plexus-utils-2.1.pom (4 KB at 18.5 KB/sec)
Downloading: https://repository.sonatype.org/content/groups/forge/org/osgi/org.osgi.core/4.3.1/org.osgi.core-4.3.1.pom
Downloading: http://repo.maven.apache.org/maven2/org/osgi/org.osgi.core/4.3.1/org.osgi.core-4.3.1.pom
Downloaded: http://repo.maven.apache.org/maven2/org/osgi/org.osgi.core/4.3.1/org.osgi.core-4.3.1.pom (2 KB at 7.0 KB/sec)
Downloading: https://repository.sonatype.org/content/groups/forge/biz/aQute/bnd/bndlib/2.2.0/bndlib-2.2.0.pom
Downloading: http://repo.maven.apache.org/maven2/biz/aQute/bnd/bndlib/2.2.0/bndlib-2.2.0.pom
Downloaded: http://repo.maven.apache.org/maven2/biz/aQute/bnd/bndlib/2.2.0/bndlib-2.2.0.pom (2 KB at 6.0 KB/sec)
Downloading: https://repository.sonatype.org/content/groups/forge/biz/aQute/bnd/parent/2.2.0/parent-2.2.0.pom
Downloading: http://repo.maven.apache.org/maven2/biz/aQute/bnd/parent/2.2.0/parent-2.2.0.pom
Downloaded: http://repo.maven.apache.org/maven2/biz/aQute/bnd/parent/2.2.0/parent-2.2.0.pom (3 KB at 13.6 KB/sec)
Downloading: https://repository.sonatype.org/content/groups/forge/org/apache/maven/maven-plugin-api/3.0.4/maven-plugin-api-3.0.4.pom
Downloading: http://repo.maven.apache.org/maven2/org/apache/maven/maven-plugin-api/3.0.4/maven-plugin-api-3.0.4.pom
Downloaded: http://repo.maven.apache.org/maven2/org/apache/maven/maven-plugin-api/3.0.4/maven-plugin-api-3.0.4.pom (3 KB at 13.4 KB/sec)
Downloading: https://repository.sonatype.org/content/groups/forge/org/sonatype/sisu/sisu-inject-plexus/2.3.0/sisu-inject-plexus-2.3.0.pom
Downloaded: https://repository.sonatype.org/content/groups/forge/org/sonatype/sisu/sisu-inject-plexus/2.3.0/sisu-inject-plexus-2.3.0.pom (6 KB at 24.6 KB/sec)
Downloading: https://repository.sonatype.org/content/groups/forge/org/sonatype/sisu/inject/guice-plexus/2.3.0/guice-plexus-2.3.0.pom
Downloaded: https://repository.sonatype.org/content/groups/forge/org/sonatype/sisu/inject/guice-plexus/2.3.0/guice-plexus-2.3.0.pom (4 KB at 43.7 KB/sec)
Downloading: https://repository.sonatype.org/content/groups/forge/org/codehaus/plexus/plexus-classworlds/2.4/plexus-classworlds-2.4.pom
Downloaded: https://repository.sonatype.org/content/groups/forge/org/codehaus/plexus/plexus-classworlds/2.4/plexus-classworlds-2.4.pom (4 KB at 18.4 KB/sec)
Downloading: https://repository.sonatype.org/content/groups/forge/org/apache/maven/maven-core/3.0.4/maven-core-3.0.4.pom
Downloading: http://repo.maven.apache.org/maven2/org/apache/maven/maven-core/3.0.4/maven-core-3.0.4.pom
Downloaded: http://repo.maven.apache.org/maven2/org/apache/maven/maven-core/3.0.4/maven-core-3.0.4.pom (7 KB at 31.9 KB/sec)
Downloading: https://repository.sonatype.org/content/groups/forge/org/codehaus/plexus/plexus-container-default/1.0-alpha-22/plexus-container-default-1.0-alpha-22.pom
Downloaded: https://repository.sonatype.org/content/groups/forge/org/codehaus/plexus/plexus-container-default/1.0-alpha-22/plexus-container-default-1.0-alpha-22.pom (3 KB at 9.9 KB/sec)
Downloading: https://repository.sonatype.org/content/groups/forge/org/codehaus/plexus/plexus-containers/1.0-alpha-22/plexus-containers-1.0-alpha-22.pom
Downloaded: https://repository.sonatype.org/content/groups/forge/org/codehaus/plexus/plexus-containers/1.0-alpha-22/plexus-containers-1.0-alpha-22.pom (2 KB at 12.7 KB/sec)
Downloading: https://repository.sonatype.org/content/groups/forge/org/sonatype/plexus/plexus-build-api/0.0.7/plexus-build-api-0.0.7.pom
Downloaded: https://repository.sonatype.org/content/groups/forge/org/sonatype/plexus/plexus-build-api/0.0.7/plexus-build-api-0.0.7.pom (4 KB at 32.6 KB/sec)
Downloading: https://repository.sonatype.org/content/groups/forge/org/sonatype/nexus/nexus-plugin-bundle-maven-plugin/1.2/nexus-plugin-bundle-maven-plugin-1.2.jar
Downloading: https://repository.sonatype.org/content/groups/forge/org/sonatype/nexus/nexus-plugin-bundle-model/1.2/nexus-plugin-bundle-model-1.2.jar
Downloading: https://repository.sonatype.org/content/groups/forge/org/osgi/org.osgi.core/4.3.1/org.osgi.core-4.3.1.jar
Downloading: https://repository.sonatype.org/content/groups/forge/biz/aQute/bnd/bndlib/2.2.0/bndlib-2.2.0.jar
Downloading: https://repository.sonatype.org/content/groups/forge/org/sonatype/sisu/sisu-inject-bean/2.3.0/sisu-inject-bean-2.3.0.jar
Downloading: https://repository.sonatype.org/content/groups/forge/org/sonatype/sisu/sisu-guice/3.1.0/sisu-guice-3.1.0-no_aop.jar
Downloading: https://repository.sonatype.org/content/groups/forge/org/sonatype/sisu/sisu-guava/0.9.9/sisu-guava-0.9.9.jar
Downloaded: https://repository.sonatype.org/content/groups/forge/org/sonatype/nexus/nexus-plugin-bundle-model/1.2/nexus-plugin-bundle-model-1.2.jar (38 KB at 151.1 KB/sec)
Downloading: https://repository.sonatype.org/content/groups/forge/org/codehaus/plexus/plexus-utils/2.1/plexus-utils-2.1.jar
Downloaded: https://repository.sonatype.org/content/groups/forge/org/sonatype/nexus/nexus-plugin-bundle-maven-plugin/1.2/nexus-plugin-bundle-maven-plugin-1.2.jar (49 KB at 112.5 KB/sec)
Downloading: https://repository.sonatype.org/content/groups/forge/org/sonatype/plexus/plexus-build-api/0.0.7/plexus-build-api-0.0.7.jar
Downloaded: https://repository.sonatype.org/content/groups/forge/org/sonatype/plexus/plexus-build-api/0.0.7/plexus-build-api-0.0.7.jar (9 KB at 111.9 KB/sec)
Downloaded: https://repository.sonatype.org/content/groups/forge/org/sonatype/sisu/sisu-inject-bean/2.3.0/sisu-inject-bean-2.3.0.jar (283 KB at 545.0 KB/sec)
Downloaded: https://repository.sonatype.org/content/groups/forge/org/codehaus/plexus/plexus-utils/2.1/plexus-utils-2.1.jar (220 KB at 683.0 KB/sec)
Downloaded: https://repository.sonatype.org/content/groups/forge/org/sonatype/sisu/sisu-guice/3.1.0/sisu-guice-3.1.0-no_aop.jar (350 KB at 656.1 KB/sec)
Downloaded: https://repository.sonatype.org/content/groups/forge/org/sonatype/sisu/sisu-guava/0.9.9/sisu-guava-0.9.9.jar (1473 KB at 1332.4 KB/sec)
Downloading: http://repo.maven.apache.org/maven2/org/osgi/org.osgi.core/4.3.1/org.osgi.core-4.3.1.jar
Downloading: http://repo.maven.apache.org/maven2/biz/aQute/bnd/bndlib/2.2.0/bndlib-2.2.0.jar
Downloaded: http://repo.maven.apache.org/maven2/org/osgi/org.osgi.core/4.3.1/org.osgi.core-4.3.1.jar (342 KB at 561.2 KB/sec)
Downloaded: http://repo.maven.apache.org/maven2/biz/aQute/bnd/bndlib/2.2.0/bndlib-2.2.0.jar (1415 KB at 1425.9 KB/sec)
[INFO] ------------------------------------------------------------------------
[INFO] Reactor Build Order:
[INFO] 
[INFO] Nexus Unzip Plugin - Parent (Incubation)
[INFO] Nexus Unzip Plugin (Incubation)
[INFO] Nexus Unzip Plugin - Integration Tests (Incubation)
[INFO]                                                                         
[INFO] ------------------------------------------------------------------------
[INFO] Building Nexus Unzip Plugin - Parent (Incubation) 0.15.0-SNAPSHOT
[INFO] ------------------------------------------------------------------------
Downloading: https://repository.sonatype.org/content/groups/forge/org/apache/maven/plugins/maven-enforcer-plugin/1.3.1/maven-enforcer-plugin-1.3.1.pom
Downloading: http://repo.maven.apache.org/maven2/org/apache/maven/plugins/maven-enforcer-plugin/1.3.1/maven-enforcer-plugin-1.3.1.pom
Downloaded: http://repo.maven.apache.org/maven2/org/apache/maven/plugins/maven-enforcer-plugin/1.3.1/maven-enforcer-plugin-1.3.1.pom (7 KB at 32.6 KB/sec)
Downloading: https://repository.sonatype.org/content/groups/forge/org/apache/maven/enforcer/enforcer/1.3.1/enforcer-1.3.1.pom
Downloading: http://repo.maven.apache.org/maven2/org/apache/maven/enforcer/enforcer/1.3.1/enforcer-1.3.1.pom
Downloaded: http://repo.maven.apache.org/maven2/org/apache/maven/enforcer/enforcer/1.3.1/enforcer-1.3.1.pom (12 KB at 59.7 KB/sec)
Downloading: https://repository.sonatype.org/content/groups/forge/org/apache/maven/plugins/maven-enforcer-plugin/1.3.1/maven-enforcer-plugin-1.3.1.jar
Downloading: http://repo.maven.apache.org/maven2/org/apache/maven/plugins/maven-enforcer-plugin/1.3.1/maven-enforcer-plugin-1.3.1.jar
Downloaded: http://repo.maven.apache.org/maven2/org/apache/maven/plugins/maven-enforcer-plugin/1.3.1/maven-enforcer-plugin-1.3.1.jar (26 KB at 106.7 KB/sec)
Downloading: https://repository.sonatype.org/content/groups/forge/org/apache/maven/plugins/maven-clean-plugin/2.5/maven-clean-plugin-2.5.pom
Downloading: http://repo.maven.apache.org/maven2/org/apache/maven/plugins/maven-clean-plugin/2.5/maven-clean-plugin-2.5.pom
Downloaded: http://repo.maven.apache.org/maven2/org/apache/maven/plugins/maven-clean-plugin/2.5/maven-clean-plugin-2.5.pom (4 KB at 20.0 KB/sec)
Downloading: https://repository.sonatype.org/content/groups/forge/org/apache/maven/plugins/maven-clean-plugin/2.5/maven-clean-plugin-2.5.jar
Downloading: http://repo.maven.apache.org/maven2/org/apache/maven/plugins/maven-clean-plugin/2.5/maven-clean-plugin-2.5.jar
Downloaded: http://repo.maven.apache.org/maven2/org/apache/maven/plugins/maven-clean-plugin/2.5/maven-clean-plugin-2.5.jar (25 KB at 99.8 KB/sec)
Downloading: https://repository.sonatype.org/content/groups/forge/org/apache/maven/plugins/maven-install-plugin/2.4/maven-install-plugin-2.4.pom
[WARNING] Checksum validation failed, no checksums available from the repository for https://repository.sonatype.org/content/groups/forge/org/apache/maven/plugins/maven-install-plugin/2.4/maven-install-plugin-2.4.pom
Downloaded: https://repository.sonatype.org/content/groups/forge/org/apache/maven/plugins/maven-install-plugin/2.4/maven-install-plugin-2.4.pom (7 KB at 13.4 KB/sec)
Downloading: https://repository.sonatype.org/content/groups/forge/org/apache/maven/plugins/maven-install-plugin/2.4/maven-install-plugin-2.4.jar
[WARNING] Checksum validation failed, no checksums available from the repository for https://repository.sonatype.org/content/groups/forge/org/apache/maven/plugins/maven-install-plugin/2.4/maven-install-plugin-2.4.jar
Downloaded: https://repository.sonatype.org/content/groups/forge/org/apache/maven/plugins/maven-install-plugin/2.4/maven-install-plugin-2.4.jar (27 KB at 49.9 KB/sec)
[INFO] 
[INFO] --- maven-clean-plugin:2.5:clean (default-clean) @ unzip-repository-plugin-parent ---
[INFO] 
[INFO] --- maven-enforcer-plugin:1.3.1:enforce (enforce-environment) @ unzip-repository-plugin-parent ---
Downloading: https://repository.sonatype.org/content/groups/forge/commons-lang/commons-lang/2.3/commons-lang-2.3.pom
Downloading: http://repo.maven.apache.org/maven2/commons-lang/commons-lang/2.3/commons-lang-2.3.pom
Downloaded: http://repo.maven.apache.org/maven2/commons-lang/commons-lang/2.3/commons-lang-2.3.pom (11 KB at 56.8 KB/sec)
Downloading: https://repository.sonatype.org/content/groups/forge/org/apache/maven/enforcer/enforcer-api/1.3.1/enforcer-api-1.3.1.pom
Downloading: http://repo.maven.apache.org/maven2/org/apache/maven/enforcer/enforcer-api/1.3.1/enforcer-api-1.3.1.pom
Downloaded: http://repo.maven.apache.org/maven2/org/apache/maven/enforcer/enforcer-api/1.3.1/enforcer-api-1.3.1.pom (3 KB at 13.7 KB/sec)
Downloading: https://repository.sonatype.org/content/groups/forge/org/apache/maven/enforcer/enforcer-rules/1.3.1/enforcer-rules-1.3.1.pom
Downloading: http://repo.maven.apache.org/maven2/org/apache/maven/enforcer/enforcer-rules/1.3.1/enforcer-rules-1.3.1.pom
Downloaded: http://repo.maven.apache.org/maven2/org/apache/maven/enforcer/enforcer-rules/1.3.1/enforcer-rules-1.3.1.pom (4 KB at 19.1 KB/sec)
Downloading: https://repository.sonatype.org/content/groups/forge/org/apache/maven/shared/maven-common-artifact-filters/1.4/maven-common-artifact-filters-1.4.pom
Downloading: http://repo.maven.apache.org/maven2/org/apache/maven/shared/maven-common-artifact-filters/1.4/maven-common-artifact-filters-1.4.pom
Downloaded: http://repo.maven.apache.org/maven2/org/apache/maven/shared/maven-common-artifact-filters/1.4/maven-common-artifact-filters-1.4.pom (4 KB at 19.3 KB/sec)
Downloading: https://repository.sonatype.org/content/groups/forge/org/apache/maven/maven-model/2.0.8/maven-model-2.0.8.pom
Downloading: http://repo.maven.apache.org/maven2/org/apache/maven/maven-model/2.0.8/maven-model-2.0.8.pom
Downloaded: http://repo.maven.apache.org/maven2/org/apache/maven/maven-model/2.0.8/maven-model-2.0.8.pom (4 KB at 16.1 KB/sec)
Downloading: https://repository.sonatype.org/content/groups/forge/org/beanshell/bsh/2.0b4/bsh-2.0b4.pom
Downloading: http://repo.maven.apache.org/maven2/org/beanshell/bsh/2.0b4/bsh-2.0b4.pom
Downloaded: http://repo.maven.apache.org/maven2/org/beanshell/bsh/2.0b4/bsh-2.0b4.pom (2 KB at 6.1 KB/sec)
Downloading: https://repository.sonatype.org/content/groups/forge/org/beanshell/beanshell/2.0b4/beanshell-2.0b4.pom
Downloading: http://repo.maven.apache.org/maven2/org/beanshell/beanshell/2.0b4/beanshell-2.0b4.pom
Downloaded: http://repo.maven.apache.org/maven2/org/beanshell/beanshell/2.0b4/beanshell-2.0b4.pom (2 KB at 7.2 KB/sec)
Downloading: https://repository.sonatype.org/content/groups/forge/org/apache/maven/shared/maven-dependency-tree/2.1/maven-dependency-tree-2.1.pom
Downloading: http://repo.maven.apache.org/maven2/org/apache/maven/shared/maven-dependency-tree/2.1/maven-dependency-tree-2.1.pom
Downloaded: http://repo.maven.apache.org/maven2/org/apache/maven/shared/maven-dependency-tree/2.1/maven-dependency-tree-2.1.pom (7 KB at 34.0 KB/sec)
Downloading: https://repository.sonatype.org/content/groups/forge/org/apache/maven/shared/maven-shared-components/19/maven-shared-components-19.pom
Downloading: http://repo.maven.apache.org/maven2/org/apache/maven/shared/maven-shared-components/19/maven-shared-components-19.pom
Downloaded: http://repo.maven.apache.org/maven2/org/apache/maven/shared/maven-shared-components/19/maven-shared-components-19.pom (7 KB at 32.7 KB/sec)
Downloading: https://repository.sonatype.org/content/groups/forge/org/eclipse/aether/aether-util/0.9.0.M2/aether-util-0.9.0.M2.pom
Downloading: http://repo.maven.apache.org/maven2/org/eclipse/aether/aether-util/0.9.0.M2/aether-util-0.9.0.M2.pom
Downloaded: http://repo.maven.apache.org/maven2/org/eclipse/aether/aether-util/0.9.0.M2/aether-util-0.9.0.M2.pom (2 KB at 10.5 KB/sec)
Downloading: https://repository.sonatype.org/content/groups/forge/org/eclipse/aether/aether/0.9.0.M2/aether-0.9.0.M2.pom
Downloading: http://repo.maven.apache.org/maven2/org/eclipse/aether/aether/0.9.0.M2/aether-0.9.0.M2.pom
Downloaded: http://repo.maven.apache.org/maven2/org/eclipse/aether/aether/0.9.0.M2/aether-0.9.0.M2.pom (28 KB at 114.8 KB/sec)
Downloading: https://repository.sonatype.org/content/groups/forge/org/codehaus/plexus/plexus-i18n/1.0-beta-6/plexus-i18n-1.0-beta-6.pom
Downloaded: https://repository.sonatype.org/content/groups/forge/org/codehaus/plexus/plexus-i18n/1.0-beta-6/plexus-i18n-1.0-beta-6.pom (771 B at 2.6 KB/sec)
Downloading: https://repository.sonatype.org/content/groups/forge/org/codehaus/plexus/plexus-components/1.1.4/plexus-components-1.1.4.pom
Downloaded: https://repository.sonatype.org/content/groups/forge/org/codehaus/plexus/plexus-components/1.1.4/plexus-components-1.1.4.pom (3 KB at 11.8 KB/sec)
Downloading: https://repository.sonatype.org/content/groups/forge/org/codehaus/plexus/plexus-utils/1.5.8/plexus-utils-1.5.8.jar
Downloading: https://repository.sonatype.org/content/groups/forge/org/apache/maven/enforcer/enforcer-api/1.3.1/enforcer-api-1.3.1.jar
Downloading: https://repository.sonatype.org/content/groups/forge/org/apache/maven/enforcer/enforcer-rules/1.3.1/enforcer-rules-1.3.1.jar
Downloading: https://repository.sonatype.org/content/groups/forge/org/apache/maven/shared/maven-common-artifact-filters/1.4/maven-common-artifact-filters-1.4.jar
Downloading: https://repository.sonatype.org/content/groups/forge/commons-lang/commons-lang/2.3/commons-lang-2.3.jar
Downloading: https://repository.sonatype.org/content/groups/forge/org/beanshell/bsh/2.0b4/bsh-2.0b4.jar
Downloading: https://repository.sonatype.org/content/groups/forge/org/apache/maven/shared/maven-dependency-tree/2.1/maven-dependency-tree-2.1.jar
Downloading: https://repository.sonatype.org/content/groups/forge/org/eclipse/aether/aether-util/0.9.0.M2/aether-util-0.9.0.M2.jar
Downloading: https://repository.sonatype.org/content/groups/forge/org/codehaus/plexus/plexus-i18n/1.0-beta-6/plexus-i18n-1.0-beta-6.jar
Downloaded: https://repository.sonatype.org/content/groups/forge/org/codehaus/plexus/plexus-utils/1.5.8/plexus-utils-1.5.8.jar (262 KB at 556.5 KB/sec)
Downloaded: https://repository.sonatype.org/content/groups/forge/org/codehaus/plexus/plexus-i18n/1.0-beta-6/plexus-i18n-1.0-beta-6.jar (12 KB at 40.7 KB/sec)
Downloading: http://repo.maven.apache.org/maven2/commons-lang/commons-lang/2.3/commons-lang-2.3.jar
Downloading: http://repo.maven.apache.org/maven2/org/apache/maven/enforcer/enforcer-rules/1.3.1/enforcer-rules-1.3.1.jar
Downloading: http://repo.maven.apache.org/maven2/org/apache/maven/enforcer/enforcer-api/1.3.1/enforcer-api-1.3.1.jar
Downloading: http://repo.maven.apache.org/maven2/org/apache/maven/shared/maven-common-artifact-filters/1.4/maven-common-artifact-filters-1.4.jar
Downloading: http://repo.maven.apache.org/maven2/org/beanshell/bsh/2.0b4/bsh-2.0b4.jar
Downloaded: http://repo.maven.apache.org/maven2/org/apache/maven/enforcer/enforcer-api/1.3.1/enforcer-api-1.3.1.jar (10 KB at 48.9 KB/sec)
Downloading: http://repo.maven.apache.org/maven2/org/apache/maven/shared/maven-dependency-tree/2.1/maven-dependency-tree-2.1.jar
Downloaded: http://repo.maven.apache.org/maven2/org/apache/maven/shared/maven-common-artifact-filters/1.4/maven-common-artifact-filters-1.4.jar (31 KB at 130.8 KB/sec)
Downloading: http://repo.maven.apache.org/maven2/org/eclipse/aether/aether-util/0.9.0.M2/aether-util-0.9.0.M2.jar
Downloaded: http://repo.maven.apache.org/maven2/org/apache/maven/enforcer/enforcer-rules/1.3.1/enforcer-rules-1.3.1.jar (86 KB at 257.8 KB/sec)
Downloaded: http://repo.maven.apache.org/maven2/commons-lang/commons-lang/2.3/commons-lang-2.3.jar (240 KB at 508.5 KB/sec)
Downloaded: http://repo.maven.apache.org/maven2/org/beanshell/bsh/2.0b4/bsh-2.0b4.jar (276 KB at 529.0 KB/sec)
Downloaded: http://repo.maven.apache.org/maven2/org/apache/maven/shared/maven-dependency-tree/2.1/maven-dependency-tree-2.1.jar (59 KB at 180.7 KB/sec)
Downloaded: http://repo.maven.apache.org/maven2/org/eclipse/aether/aether-util/0.9.0.M2/aether-util-0.9.0.M2.jar (131 KB at 351.6 KB/sec)
[WARNING] Rule 0: org.apache.maven.plugins.enforcer.RequireMavenVersion failed with message:
Detected Maven Version: 3.1.1 is not in the allowed range [3.0.4,3.1).
[INFO] ------------------------------------------------------------------------
[INFO] Reactor Summary:
[INFO] 
[INFO] Nexus Unzip Plugin - Parent (Incubation) .......... FAILURE [10.011s]
[INFO] Nexus Unzip Plugin (Incubation) ................... SKIPPED
[INFO] Nexus Unzip Plugin - Integration Tests (Incubation)  SKIPPED
[INFO] ------------------------------------------------------------------------
[INFO] BUILD FAILURE
[INFO] ------------------------------------------------------------------------
[INFO] Total time: 19.065s
[INFO] Finished at: Mon Jan 19 04:51:50 EST 2015
[INFO] Final Memory: 19M/1932M
[INFO] ------------------------------------------------------------------------
[INFO] o.h.m.e.h.MavenExecutionResultHandler - Build failed with exception(s)
[INFO] o.h.m.e.h.MavenExecutionResultHandler - [1] org.apache.maven.lifecycle.LifecycleExecutionException: Failed to execute goal org.apache.maven.plugins:maven-enforcer-plugin:1.3.1:enforce (enforce-environment) on project unzip-repository-plugin-parent: Some Enforcer rules have failed. Look above for specific messages explaining why the rule failed.
[DEBUG] Closing connection to remote
[ERROR] Failed to execute goal org.apache.maven.plugins:maven-enforcer-plugin:1.3.1:enforce (enforce-environment) on project unzip-repository-plugin-parent: Some Enforcer rules have failed. Look above for specific messages explaining why the rule failed. -> [Help 1]
org.apache.maven.lifecycle.LifecycleExecutionException: Failed to execute goal org.apache.maven.plugins:maven-enforcer-plugin:1.3.1:enforce (enforce-environment) on project unzip-repository-plugin-parent: Some Enforcer rules have failed. Look above for specific messages explaining why the rule failed.
	at org.apache.maven.lifecycle.internal.MojoExecutor.execute(MojoExecutor.java:216)
	at org.apache.maven.lifecycle.internal.MojoExecutor.execute(MojoExecutor.java:153)
	at org.apache.maven.lifecycle.internal.MojoExecutor.execute(MojoExecutor.java:145)
	at org.apache.maven.lifecycle.internal.LifecycleModuleBuilder.buildProject(LifecycleModuleBuilder.java:84)
	at org.apache.maven.lifecycle.internal.LifecycleModuleBuilder.buildProject(LifecycleModuleBuilder.java:59)
	at org.apache.maven.lifecycle.internal.LifecycleStarter.singleThreadedBuild(LifecycleStarter.java:183)
	at org.apache.maven.lifecycle.internal.LifecycleStarter.execute(LifecycleStarter.java:161)
	at org.apache.maven.DefaultMaven.doExecute(DefaultMaven.java:317)
	at org.apache.maven.DefaultMaven.execute(DefaultMaven.java:152)
	at org.apache.maven.cli.MavenCli.execute(MavenCli.java:555)
	at org.apache.maven.cli.MavenCli.doMain(MavenCli.java:214)
	at org.apache.maven.cli.MavenCli.main(MavenCli.java:158)
	at sun.reflect.NativeMethodAccessorImpl.invoke0(Native Method)
	at sun.reflect.NativeMethodAccessorImpl.invoke(NativeMethodAccessorImpl.java:57)
	at sun.reflect.DelegatingMethodAccessorImpl.invoke(DelegatingMethodAccessorImpl.java:43)
	at java.lang.reflect.Method.invoke(Method.java:606)
	at org.codehaus.plexus.classworlds.launcher.Launcher.launchEnhanced(Launcher.java:289)
	at org.codehaus.plexus.classworlds.launcher.Launcher.launch(Launcher.java:229)
	at org.codehaus.plexus.classworlds.launcher.Launcher.mainWithExitCode(Launcher.java:415)
	at org.codehaus.plexus.classworlds.launcher.Launcher.main(Launcher.java:356)
Caused by: org.apache.maven.plugin.MojoExecutionException: Some Enforcer rules have failed. Look above for specific messages explaining why the rule failed.
	at org.apache.maven.plugins.enforcer.EnforceMojo.execute(EnforceMojo.java:209)
	at org.apache.maven.plugin.DefaultBuildPluginManager.executeMojo(DefaultBuildPluginManager.java:106)
	at org.apache.maven.lifecycle.internal.MojoExecutor.execute(MojoExecutor.java:208)
	... 19 more
[ERROR] 
[ERROR] Re-run Maven using the -X switch to enable full debug logging.
[ERROR] 
[ERROR] For more information about the errors and possible solutions, please read the following articles:
[ERROR] [Help 1] http://cwiki.apache.org/confluence/display/MAVEN/MojoExecutionException
[DEBUG] Waiting for process to finish
[DEBUG] Result: 1
Recording test results
Sending e-mails to: jan.sievers@sap.com tobias.oberlies@sap.com
Finished: FAILURE