FailedConsole Output

Skipping 382 KB.. Full Log
Downloaded: https://repository.sonatype.org/content/groups/forge/org/sonatype/sisu/sisu-parent/2.3.2/sisu-parent-2.3.2.pom (11 KB at 33.0 KB/sec)
Downloading: https://repository.sonatype.org/content/groups/forge/org/sonatype/sisu/sisu-guice/3.1.2/sisu-guice-3.1.2.pom
Downloaded: https://repository.sonatype.org/content/groups/forge/org/sonatype/sisu/sisu-guice/3.1.2/sisu-guice-3.1.2.pom (10 KB at 35.1 KB/sec)
Downloading: https://repository.sonatype.org/content/groups/forge/org/sonatype/sisu/inject/guice-parent/3.1.2/guice-parent-3.1.2.pom
Downloaded: https://repository.sonatype.org/content/groups/forge/org/sonatype/sisu/inject/guice-parent/3.1.2/guice-parent-3.1.2.pom (12 KB at 33.1 KB/sec)
Downloading: https://repository.sonatype.org/content/groups/forge/com/google/guava/guava/12.0.1/guava-12.0.1.pom
Downloading: http://repo1.maven.org/maven2/com/google/guava/guava/12.0.1/guava-12.0.1.pom
Downloaded: http://repo1.maven.org/maven2/com/google/guava/guava/12.0.1/guava-12.0.1.pom (6 KB at 53.5 KB/sec)
Downloading: https://repository.sonatype.org/content/groups/forge/com/google/guava/guava-parent/12.0.1/guava-parent-12.0.1.pom
Downloading: http://repo1.maven.org/maven2/com/google/guava/guava-parent/12.0.1/guava-parent-12.0.1.pom
Downloaded: http://repo1.maven.org/maven2/com/google/guava/guava-parent/12.0.1/guava-parent-12.0.1.pom (3 KB at 23.9 KB/sec)
Downloading: https://repository.sonatype.org/content/groups/forge/org/sonatype/sisu/sisu-file-tasks/1.5.2/sisu-file-tasks-1.5.2.pom
Downloaded: https://repository.sonatype.org/content/groups/forge/org/sonatype/sisu/sisu-file-tasks/1.5.2/sisu-file-tasks-1.5.2.pom (2 KB at 5.5 KB/sec)
Downloading: https://repository.sonatype.org/content/groups/forge/org/apache/ant/ant/1.8.4/ant-1.8.4.pom
Downloading: http://repo1.maven.org/maven2/org/apache/ant/ant/1.8.4/ant-1.8.4.pom
Downloaded: http://repo1.maven.org/maven2/org/apache/ant/ant/1.8.4/ant-1.8.4.pom (10 KB at 96.2 KB/sec)
Downloading: https://repository.sonatype.org/content/groups/forge/org/apache/ant/ant-parent/1.8.4/ant-parent-1.8.4.pom
Downloading: http://repo1.maven.org/maven2/org/apache/ant/ant-parent/1.8.4/ant-parent-1.8.4.pom
Downloaded: http://repo1.maven.org/maven2/org/apache/ant/ant-parent/1.8.4/ant-parent-1.8.4.pom (5 KB at 45.0 KB/sec)
Downloading: https://repository.sonatype.org/content/groups/forge/org/apache/ant/ant-launcher/1.8.4/ant-launcher-1.8.4.pom
Downloading: http://repo1.maven.org/maven2/org/apache/ant/ant-launcher/1.8.4/ant-launcher-1.8.4.pom
Downloaded: http://repo1.maven.org/maven2/org/apache/ant/ant-launcher/1.8.4/ant-launcher-1.8.4.pom (3 KB at 23.8 KB/sec)
Downloading: https://repository.sonatype.org/content/groups/forge/net/sf/smc/statemap/6.0.1/statemap-6.0.1.pom
Downloaded: https://repository.sonatype.org/content/groups/forge/net/sf/smc/statemap/6.0.1/statemap-6.0.1.pom (454 B at 1.7 KB/sec)
Downloading: https://repository.sonatype.org/content/groups/forge/org/sonatype/sisu/sisu-maven-bridge/3.0/sisu-maven-bridge-3.0.pom
Downloaded: https://repository.sonatype.org/content/groups/forge/org/sonatype/sisu/sisu-maven-bridge/3.0/sisu-maven-bridge-3.0.pom (5 KB at 13.6 KB/sec)
Downloading: https://repository.sonatype.org/content/groups/forge/org/sonatype/sisu/sisu-maven-bridge-parent/3.0/sisu-maven-bridge-parent-3.0.pom
Downloaded: https://repository.sonatype.org/content/groups/forge/org/sonatype/sisu/sisu-maven-bridge-parent/3.0/sisu-maven-bridge-parent-3.0.pom (12 KB at 39.0 KB/sec)
Downloading: https://repository.sonatype.org/content/groups/forge/org/sonatype/forge/forge-parent/21/forge-parent-21.pom
Downloaded: https://repository.sonatype.org/content/groups/forge/org/sonatype/forge/forge-parent/21/forge-parent-21.pom (19 KB at 60.6 KB/sec)
Downloading: https://repository.sonatype.org/content/groups/forge/org/sonatype/sisu/sisu-inject-bean/2.3.0/sisu-inject-bean-2.3.0.pom
Downloaded: https://repository.sonatype.org/content/groups/forge/org/sonatype/sisu/sisu-inject-bean/2.3.0/sisu-inject-bean-2.3.0.pom (7 KB at 20.8 KB/sec)
Downloading: https://repository.sonatype.org/content/groups/forge/org/sonatype/sisu/inject/guice-bean/2.3.0/guice-bean-2.3.0.pom
Downloaded: https://repository.sonatype.org/content/groups/forge/org/sonatype/sisu/inject/guice-bean/2.3.0/guice-bean-2.3.0.pom (3 KB at 8.6 KB/sec)
Downloading: https://repository.sonatype.org/content/groups/forge/org/sonatype/sisu/inject/containers/2.3.0/containers-2.3.0.pom
Downloaded: https://repository.sonatype.org/content/groups/forge/org/sonatype/sisu/inject/containers/2.3.0/containers-2.3.0.pom (2 KB at 3.7 KB/sec)
Downloading: https://repository.sonatype.org/content/groups/forge/org/sonatype/sisu/sisu-inject/2.3.0/sisu-inject-2.3.0.pom
Downloaded: https://repository.sonatype.org/content/groups/forge/org/sonatype/sisu/sisu-inject/2.3.0/sisu-inject-2.3.0.pom (4 KB at 10.4 KB/sec)
Downloading: https://repository.sonatype.org/content/groups/forge/org/sonatype/sisu/sisu-parent/2.3.0/sisu-parent-2.3.0.pom
Downloaded: https://repository.sonatype.org/content/groups/forge/org/sonatype/sisu/sisu-parent/2.3.0/sisu-parent-2.3.0.pom (11 KB at 33.6 KB/sec)
Downloading: https://repository.sonatype.org/content/groups/forge/org/sonatype/sisu/sisu-guice/3.1.0/sisu-guice-3.1.0.pom
Downloaded: https://repository.sonatype.org/content/groups/forge/org/sonatype/sisu/sisu-guice/3.1.0/sisu-guice-3.1.0.pom (10 KB at 29.2 KB/sec)
Downloading: https://repository.sonatype.org/content/groups/forge/org/sonatype/sisu/inject/guice-parent/3.1.0/guice-parent-3.1.0.pom
Downloaded: https://repository.sonatype.org/content/groups/forge/org/sonatype/sisu/inject/guice-parent/3.1.0/guice-parent-3.1.0.pom (11 KB at 26.5 KB/sec)
Downloading: https://repository.sonatype.org/content/groups/forge/org/sonatype/sisu/sisu-guava/0.9.9/sisu-guava-0.9.9.pom
Downloaded: https://repository.sonatype.org/content/groups/forge/org/sonatype/sisu/sisu-guava/0.9.9/sisu-guava-0.9.9.pom (2 KB at 3.0 KB/sec)
Downloading: https://repository.sonatype.org/content/groups/forge/org/sonatype/sisu/inject/guava-parent/0.9.9/guava-parent-0.9.9.pom
Downloaded: https://repository.sonatype.org/content/groups/forge/org/sonatype/sisu/inject/guava-parent/0.9.9/guava-parent-0.9.9.pom (11 KB at 32.6 KB/sec)
Downloading: https://repository.sonatype.org/content/groups/forge/org/apache/maven/maven-model/3.0.4/maven-model-3.0.4.pom
Downloading: http://repo1.maven.org/maven2/org/apache/maven/maven-model/3.0.4/maven-model-3.0.4.pom
Downloaded: http://repo1.maven.org/maven2/org/apache/maven/maven-model/3.0.4/maven-model-3.0.4.pom (4 KB at 24.8 KB/sec)
Downloading: https://repository.sonatype.org/content/groups/forge/org/apache/maven/maven-model-builder/3.0.4/maven-model-builder-3.0.4.pom
Downloading: http://repo1.maven.org/maven2/org/apache/maven/maven-model-builder/3.0.4/maven-model-builder-3.0.4.pom
Downloaded: http://repo1.maven.org/maven2/org/apache/maven/maven-model-builder/3.0.4/maven-model-builder-3.0.4.pom (3 KB at 24.3 KB/sec)
Downloading: https://repository.sonatype.org/content/groups/forge/org/apache/maven/maven-settings-builder/3.0.4/maven-settings-builder-3.0.4.pom
Downloading: http://repo1.maven.org/maven2/org/apache/maven/maven-settings-builder/3.0.4/maven-settings-builder-3.0.4.pom
Downloaded: http://repo1.maven.org/maven2/org/apache/maven/maven-settings-builder/3.0.4/maven-settings-builder-3.0.4.pom (3 KB at 22.3 KB/sec)
Downloading: https://repository.sonatype.org/content/groups/forge/org/apache/maven/maven-settings/3.0.4/maven-settings-3.0.4.pom
Downloading: http://repo1.maven.org/maven2/org/apache/maven/maven-settings/3.0.4/maven-settings-3.0.4.pom
Downloaded: http://repo1.maven.org/maven2/org/apache/maven/maven-settings/3.0.4/maven-settings-3.0.4.pom (2 KB at 18.1 KB/sec)
Downloading: https://repository.sonatype.org/content/groups/forge/org/apache/maven/maven-aether-provider/3.0.4/maven-aether-provider-3.0.4.pom
Downloading: http://repo1.maven.org/maven2/org/apache/maven/maven-aether-provider/3.0.4/maven-aether-provider-3.0.4.pom
Downloaded: http://repo1.maven.org/maven2/org/apache/maven/maven-aether-provider/3.0.4/maven-aether-provider-3.0.4.pom (3 KB at 27.5 KB/sec)
Downloading: https://repository.sonatype.org/content/groups/forge/org/apache/maven/maven-repository-metadata/3.0.4/maven-repository-metadata-3.0.4.pom
Downloading: http://repo1.maven.org/maven2/org/apache/maven/maven-repository-metadata/3.0.4/maven-repository-metadata-3.0.4.pom
Downloaded: http://repo1.maven.org/maven2/org/apache/maven/maven-repository-metadata/3.0.4/maven-repository-metadata-3.0.4.pom (2 KB at 18.8 KB/sec)
Downloading: https://repository.sonatype.org/content/groups/forge/org/sonatype/aether/aether-connector-wagon/1.13.1/aether-connector-wagon-1.13.1.pom
Downloaded: https://repository.sonatype.org/content/groups/forge/org/sonatype/aether/aether-connector-wagon/1.13.1/aether-connector-wagon-1.13.1.pom (4 KB at 9.9 KB/sec)
Downloading: https://repository.sonatype.org/content/groups/forge/org/apache/maven/wagon/wagon-provider-api/1.0-beta-6/wagon-provider-api-1.0-beta-6.pom
Downloading: http://repo1.maven.org/maven2/org/apache/maven/wagon/wagon-provider-api/1.0-beta-6/wagon-provider-api-1.0-beta-6.pom
Downloaded: http://repo1.maven.org/maven2/org/apache/maven/wagon/wagon-provider-api/1.0-beta-6/wagon-provider-api-1.0-beta-6.pom (2 KB at 17.2 KB/sec)
Downloading: https://repository.sonatype.org/content/groups/forge/org/apache/maven/wagon/wagon/1.0-beta-6/wagon-1.0-beta-6.pom
Downloading: http://repo1.maven.org/maven2/org/apache/maven/wagon/wagon/1.0-beta-6/wagon-1.0-beta-6.pom
Downloaded: http://repo1.maven.org/maven2/org/apache/maven/wagon/wagon/1.0-beta-6/wagon-1.0-beta-6.pom (13 KB at 119.8 KB/sec)
Downloading: https://repository.sonatype.org/content/groups/forge/org/apache/maven/wagon/wagon-http/2.1/wagon-http-2.1.pom
Downloading: http://repo1.maven.org/maven2/org/apache/maven/wagon/wagon-http/2.1/wagon-http-2.1.pom
Downloaded: http://repo1.maven.org/maven2/org/apache/maven/wagon/wagon-http/2.1/wagon-http-2.1.pom (4 KB at 29.3 KB/sec)
Downloading: https://repository.sonatype.org/content/groups/forge/org/apache/maven/wagon/wagon-providers/2.1/wagon-providers-2.1.pom
Downloading: http://repo1.maven.org/maven2/org/apache/maven/wagon/wagon-providers/2.1/wagon-providers-2.1.pom
Downloaded: http://repo1.maven.org/maven2/org/apache/maven/wagon/wagon-providers/2.1/wagon-providers-2.1.pom (3 KB at 27.3 KB/sec)
Downloading: https://repository.sonatype.org/content/groups/forge/org/apache/maven/wagon/wagon/2.1/wagon-2.1.pom
Downloading: http://repo1.maven.org/maven2/org/apache/maven/wagon/wagon/2.1/wagon-2.1.pom
Downloaded: http://repo1.maven.org/maven2/org/apache/maven/wagon/wagon/2.1/wagon-2.1.pom (16 KB at 127.4 KB/sec)
Downloading: https://repository.sonatype.org/content/groups/forge/org/apache/maven/wagon/wagon-http-shared4/2.1/wagon-http-shared4-2.1.pom
Downloading: http://repo1.maven.org/maven2/org/apache/maven/wagon/wagon-http-shared4/2.1/wagon-http-shared4-2.1.pom
Downloaded: http://repo1.maven.org/maven2/org/apache/maven/wagon/wagon-http-shared4/2.1/wagon-http-shared4-2.1.pom (3 KB at 18.3 KB/sec)
Downloading: https://repository.sonatype.org/content/groups/forge/org/jsoup/jsoup/1.6.1/jsoup-1.6.1.pom
Downloading: http://repo1.maven.org/maven2/org/jsoup/jsoup/1.6.1/jsoup-1.6.1.pom
Downloaded: http://repo1.maven.org/maven2/org/jsoup/jsoup/1.6.1/jsoup-1.6.1.pom (5 KB at 48.2 KB/sec)
Downloading: https://repository.sonatype.org/content/groups/forge/org/apache/httpcomponents/httpclient/4.1.2/httpclient-4.1.2.pom
Downloading: http://repo1.maven.org/maven2/org/apache/httpcomponents/httpclient/4.1.2/httpclient-4.1.2.pom
Downloaded: http://repo1.maven.org/maven2/org/apache/httpcomponents/httpclient/4.1.2/httpclient-4.1.2.pom (6 KB at 58.5 KB/sec)
Downloading: https://repository.sonatype.org/content/groups/forge/org/apache/httpcomponents/httpcomponents-client/4.1.2/httpcomponents-client-4.1.2.pom
Downloading: http://repo1.maven.org/maven2/org/apache/httpcomponents/httpcomponents-client/4.1.2/httpcomponents-client-4.1.2.pom
Downloaded: http://repo1.maven.org/maven2/org/apache/httpcomponents/httpcomponents-client/4.1.2/httpcomponents-client-4.1.2.pom (12 KB at 111.2 KB/sec)
Downloading: https://repository.sonatype.org/content/groups/forge/org/apache/httpcomponents/project/4.1.1/project-4.1.1.pom
Downloading: http://repo1.maven.org/maven2/org/apache/httpcomponents/project/4.1.1/project-4.1.1.pom
Downloaded: http://repo1.maven.org/maven2/org/apache/httpcomponents/project/4.1.1/project-4.1.1.pom (17 KB at 136.5 KB/sec)
Downloading: https://repository.sonatype.org/content/groups/forge/org/apache/httpcomponents/httpcore/4.1.2/httpcore-4.1.2.pom
Downloading: http://repo1.maven.org/maven2/org/apache/httpcomponents/httpcore/4.1.2/httpcore-4.1.2.pom
Downloaded: http://repo1.maven.org/maven2/org/apache/httpcomponents/httpcore/4.1.2/httpcore-4.1.2.pom (8 KB at 72.9 KB/sec)
Downloading: https://repository.sonatype.org/content/groups/forge/org/apache/httpcomponents/httpcomponents-core/4.1.2/httpcomponents-core-4.1.2.pom
Downloading: http://repo1.maven.org/maven2/org/apache/httpcomponents/httpcomponents-core/4.1.2/httpcomponents-core-4.1.2.pom
Downloaded: http://repo1.maven.org/maven2/org/apache/httpcomponents/httpcomponents-core/4.1.2/httpcomponents-core-4.1.2.pom (10 KB at 96.7 KB/sec)
Downloading: https://repository.sonatype.org/content/groups/forge/commons-io/commons-io/2.0.1/commons-io-2.0.1.pom
Downloading: http://repo1.maven.org/maven2/commons-io/commons-io/2.0.1/commons-io-2.0.1.pom
Downloaded: http://repo1.maven.org/maven2/commons-io/commons-io/2.0.1/commons-io-2.0.1.pom (9 KB at 89.8 KB/sec)
Downloading: https://repository.sonatype.org/content/groups/forge/org/apache/commons/commons-parent/15/commons-parent-15.pom
Downloading: http://repo1.maven.org/maven2/org/apache/commons/commons-parent/15/commons-parent-15.pom
Downloaded: http://repo1.maven.org/maven2/org/apache/commons/commons-parent/15/commons-parent-15.pom (31 KB at 249.6 KB/sec)
Downloading: https://repository.sonatype.org/content/groups/forge/org/apache/maven/wagon/wagon-provider-api/2.1/wagon-provider-api-2.1.pom
Downloading: http://repo1.maven.org/maven2/org/apache/maven/wagon/wagon-provider-api/2.1/wagon-provider-api-2.1.pom
Downloaded: http://repo1.maven.org/maven2/org/apache/maven/wagon/wagon-provider-api/2.1/wagon-provider-api-2.1.pom (2 KB at 16.9 KB/sec)
Downloading: https://repository.sonatype.org/content/groups/forge/org/sonatype/sisu/goodies/goodies-common/1.5.1/goodies-common-1.5.1.pom
Downloaded: https://repository.sonatype.org/content/groups/forge/org/sonatype/sisu/goodies/goodies-common/1.5.1/goodies-common-1.5.1.pom (3 KB at 5.9 KB/sec)
Downloading: https://repository.sonatype.org/content/groups/forge/org/sonatype/sisu/goodies/goodies/1.5.1/goodies-1.5.1.pom
Downloaded: https://repository.sonatype.org/content/groups/forge/org/sonatype/sisu/goodies/goodies/1.5.1/goodies-1.5.1.pom (17 KB at 48.7 KB/sec)
Downloading: https://repository.sonatype.org/content/groups/forge/org/sonatype/forge/forge-parent/27/forge-parent-27.pom
Downloaded: https://repository.sonatype.org/content/groups/forge/org/sonatype/forge/forge-parent/27/forge-parent-27.pom (19 KB at 54.4 KB/sec)
Downloading: https://repository.sonatype.org/content/groups/forge/org/sonatype/nexus/nexus-bootstrap/2.6.0-01/nexus-bootstrap-2.6.0-01.pom
Downloaded: https://repository.sonatype.org/content/groups/forge/org/sonatype/nexus/nexus-bootstrap/2.6.0-01/nexus-bootstrap-2.6.0-01.pom (3 KB at 6.0 KB/sec)
Downloading: https://repository.sonatype.org/content/groups/forge/org/sonatype/nexus/nexus-jetty8/2.6.0-01/nexus-jetty8-2.6.0-01.pom
Downloaded: https://repository.sonatype.org/content/groups/forge/org/sonatype/nexus/nexus-jetty8/2.6.0-01/nexus-jetty8-2.6.0-01.pom (5 KB at 11.4 KB/sec)
Downloading: https://repository.sonatype.org/content/groups/forge/org/eclipse/jetty/jetty-server/8.1.11.v20130520/jetty-server-8.1.11.v20130520.pom
Downloading: http://repo1.maven.org/maven2/org/eclipse/jetty/jetty-server/8.1.11.v20130520/jetty-server-8.1.11.v20130520.pom
Downloaded: http://repo1.maven.org/maven2/org/eclipse/jetty/jetty-server/8.1.11.v20130520/jetty-server-8.1.11.v20130520.pom (4 KB at 36.9 KB/sec)
Downloading: https://repository.sonatype.org/content/groups/forge/org/eclipse/jetty/jetty-project/8.1.11.v20130520/jetty-project-8.1.11.v20130520.pom
Downloading: http://repo1.maven.org/maven2/org/eclipse/jetty/jetty-project/8.1.11.v20130520/jetty-project-8.1.11.v20130520.pom
Downloaded: http://repo1.maven.org/maven2/org/eclipse/jetty/jetty-project/8.1.11.v20130520/jetty-project-8.1.11.v20130520.pom (28 KB at 214.7 KB/sec)
Downloading: https://repository.sonatype.org/content/groups/forge/org/eclipse/jetty/jetty-parent/20/jetty-parent-20.pom
Downloading: http://repo1.maven.org/maven2/org/eclipse/jetty/jetty-parent/20/jetty-parent-20.pom
Downloaded: http://repo1.maven.org/maven2/org/eclipse/jetty/jetty-parent/20/jetty-parent-20.pom (21 KB at 171.1 KB/sec)
Downloading: https://repository.sonatype.org/content/groups/forge/org/eclipse/jetty/jetty-continuation/8.1.11.v20130520/jetty-continuation-8.1.11.v20130520.pom
Downloading: http://repo1.maven.org/maven2/org/eclipse/jetty/jetty-continuation/8.1.11.v20130520/jetty-continuation-8.1.11.v20130520.pom
Downloaded: http://repo1.maven.org/maven2/org/eclipse/jetty/jetty-continuation/8.1.11.v20130520/jetty-continuation-8.1.11.v20130520.pom (3 KB at 25.8 KB/sec)
Downloading: https://repository.sonatype.org/content/groups/forge/org/eclipse/jetty/jetty-http/8.1.11.v20130520/jetty-http-8.1.11.v20130520.pom
Downloading: http://repo1.maven.org/maven2/org/eclipse/jetty/jetty-http/8.1.11.v20130520/jetty-http-8.1.11.v20130520.pom
Downloaded: http://repo1.maven.org/maven2/org/eclipse/jetty/jetty-http/8.1.11.v20130520/jetty-http-8.1.11.v20130520.pom (3 KB at 25.6 KB/sec)
Downloading: https://repository.sonatype.org/content/groups/forge/org/eclipse/jetty/jetty-io/8.1.11.v20130520/jetty-io-8.1.11.v20130520.pom
Downloading: http://repo1.maven.org/maven2/org/eclipse/jetty/jetty-io/8.1.11.v20130520/jetty-io-8.1.11.v20130520.pom
Downloaded: http://repo1.maven.org/maven2/org/eclipse/jetty/jetty-io/8.1.11.v20130520/jetty-io-8.1.11.v20130520.pom (3 KB at 17.3 KB/sec)
Downloading: https://repository.sonatype.org/content/groups/forge/org/eclipse/jetty/jetty-util/8.1.11.v20130520/jetty-util-8.1.11.v20130520.pom
Downloading: http://repo1.maven.org/maven2/org/eclipse/jetty/jetty-util/8.1.11.v20130520/jetty-util-8.1.11.v20130520.pom
Downloaded: http://repo1.maven.org/maven2/org/eclipse/jetty/jetty-util/8.1.11.v20130520/jetty-util-8.1.11.v20130520.pom (4 KB at 33.5 KB/sec)
Downloading: https://repository.sonatype.org/content/groups/forge/com/yammer/metrics/metrics-jetty/2.2.0/metrics-jetty-2.2.0.pom
Downloading: http://repo1.maven.org/maven2/com/yammer/metrics/metrics-jetty/2.2.0/metrics-jetty-2.2.0.pom
Downloaded: http://repo1.maven.org/maven2/com/yammer/metrics/metrics-jetty/2.2.0/metrics-jetty-2.2.0.pom (955 B at 9.3 KB/sec)
Downloading: https://repository.sonatype.org/content/groups/forge/org/eclipse/jetty/jetty-server/8.1.8.v20121106/jetty-server-8.1.8.v20121106.pom
Downloading: http://repo1.maven.org/maven2/org/eclipse/jetty/jetty-server/8.1.8.v20121106/jetty-server-8.1.8.v20121106.pom
Downloaded: http://repo1.maven.org/maven2/org/eclipse/jetty/jetty-server/8.1.8.v20121106/jetty-server-8.1.8.v20121106.pom (4 KB at 36.1 KB/sec)
Downloading: https://repository.sonatype.org/content/groups/forge/org/eclipse/jetty/jetty-project/8.1.8.v20121106/jetty-project-8.1.8.v20121106.pom
Downloading: http://repo1.maven.org/maven2/org/eclipse/jetty/jetty-project/8.1.8.v20121106/jetty-project-8.1.8.v20121106.pom
Downloaded: http://repo1.maven.org/maven2/org/eclipse/jetty/jetty-project/8.1.8.v20121106/jetty-project-8.1.8.v20121106.pom (27 KB at 212.1 KB/sec)
Downloading: https://repository.sonatype.org/content/groups/forge/org/eclipse/jetty/jetty-continuation/8.1.8.v20121106/jetty-continuation-8.1.8.v20121106.pom
Downloading: http://repo1.maven.org/maven2/org/eclipse/jetty/jetty-continuation/8.1.8.v20121106/jetty-continuation-8.1.8.v20121106.pom
Downloaded: http://repo1.maven.org/maven2/org/eclipse/jetty/jetty-continuation/8.1.8.v20121106/jetty-continuation-8.1.8.v20121106.pom (3 KB at 26.3 KB/sec)
Downloading: https://repository.sonatype.org/content/groups/forge/org/eclipse/jetty/jetty-http/8.1.8.v20121106/jetty-http-8.1.8.v20121106.pom
Downloading: http://repo1.maven.org/maven2/org/eclipse/jetty/jetty-http/8.1.8.v20121106/jetty-http-8.1.8.v20121106.pom
Downloaded: http://repo1.maven.org/maven2/org/eclipse/jetty/jetty-http/8.1.8.v20121106/jetty-http-8.1.8.v20121106.pom (3 KB at 25.6 KB/sec)
Downloading: https://repository.sonatype.org/content/groups/forge/org/eclipse/jetty/jetty-io/8.1.8.v20121106/jetty-io-8.1.8.v20121106.pom
Downloading: http://repo1.maven.org/maven2/org/eclipse/jetty/jetty-io/8.1.8.v20121106/jetty-io-8.1.8.v20121106.pom
Downloaded: http://repo1.maven.org/maven2/org/eclipse/jetty/jetty-io/8.1.8.v20121106/jetty-io-8.1.8.v20121106.pom (3 KB at 20.5 KB/sec)
Downloading: https://repository.sonatype.org/content/groups/forge/org/eclipse/jetty/jetty-util/8.1.8.v20121106/jetty-util-8.1.8.v20121106.pom
Downloading: http://repo1.maven.org/maven2/org/eclipse/jetty/jetty-util/8.1.8.v20121106/jetty-util-8.1.8.v20121106.pom
Downloaded: http://repo1.maven.org/maven2/org/eclipse/jetty/jetty-util/8.1.8.v20121106/jetty-util-8.1.8.v20121106.pom (4 KB at 33.4 KB/sec)
Downloading: https://repository.sonatype.org/content/groups/forge/org/sonatype/nexus/nexus-client-core/2.6.0-01/nexus-client-core-2.6.0-01.pom
Downloaded: https://repository.sonatype.org/content/groups/forge/org/sonatype/nexus/nexus-client-core/2.6.0-01/nexus-client-core-2.6.0-01.pom (5 KB at 15.6 KB/sec)
Downloading: https://repository.sonatype.org/content/groups/forge/org/sonatype/nexus/plugins/nexus-restlet1x-model/2.6.0-01/nexus-restlet1x-model-2.6.0-01.pom
Downloaded: https://repository.sonatype.org/content/groups/forge/org/sonatype/nexus/plugins/nexus-restlet1x-model/2.6.0-01/nexus-restlet1x-model-2.6.0-01.pom (4 KB at 9.2 KB/sec)
Downloading: https://repository.sonatype.org/content/groups/forge/org/sonatype/nexus/plugins/nexus-plugins-restlet1x/2.6.0-01/nexus-plugins-restlet1x-2.6.0-01.pom
Downloaded: https://repository.sonatype.org/content/groups/forge/org/sonatype/nexus/plugins/nexus-plugins-restlet1x/2.6.0-01/nexus-plugins-restlet1x-2.6.0-01.pom (6 KB at 15.6 KB/sec)
Downloading: https://repository.sonatype.org/content/groups/forge/org/sonatype/nexus/plugins/nexus-plugins/2.6.0-01/nexus-plugins-2.6.0-01.pom
Downloaded: https://repository.sonatype.org/content/groups/forge/org/sonatype/nexus/plugins/nexus-plugins/2.6.0-01/nexus-plugins-2.6.0-01.pom (22 KB at 59.9 KB/sec)
Downloading: https://repository.sonatype.org/content/groups/forge/org/sonatype/sisu/siesta/siesta-client/1.5/siesta-client-1.5.pom
Downloaded: https://repository.sonatype.org/content/groups/forge/org/sonatype/sisu/siesta/siesta-client/1.5/siesta-client-1.5.pom (2 KB at 6.4 KB/sec)
Downloading: https://repository.sonatype.org/content/groups/forge/org/sonatype/sisu/siesta/siesta/1.5/siesta-1.5.pom
Downloaded: https://repository.sonatype.org/content/groups/forge/org/sonatype/sisu/siesta/siesta/1.5/siesta-1.5.pom (13 KB at 43.2 KB/sec)
Downloading: https://repository.sonatype.org/content/groups/forge/org/sonatype/sisu/siesta/siesta-common/1.5/siesta-common-1.5.pom
Downloaded: https://repository.sonatype.org/content/groups/forge/org/sonatype/sisu/siesta/siesta-common/1.5/siesta-common-1.5.pom (3 KB at 7.7 KB/sec)
Downloading: https://repository.sonatype.org/content/groups/forge/javax/ws/rs/jsr311-api/1.1.1/jsr311-api-1.1.1.pom
Downloading: http://repo1.maven.org/maven2/javax/ws/rs/jsr311-api/1.1.1/jsr311-api-1.1.1.pom
Downloaded: http://repo1.maven.org/maven2/javax/ws/rs/jsr311-api/1.1.1/jsr311-api-1.1.1.pom (6 KB at 38.1 KB/sec)
Downloading: https://repository.sonatype.org/content/groups/forge/com/sun/jersey/jersey-core/1.17.1/jersey-core-1.17.1.pom
Downloading: http://repo1.maven.org/maven2/com/sun/jersey/jersey-core/1.17.1/jersey-core-1.17.1.pom
Downloaded: http://repo1.maven.org/maven2/com/sun/jersey/jersey-core/1.17.1/jersey-core-1.17.1.pom (11 KB at 99.5 KB/sec)
Downloading: https://repository.sonatype.org/content/groups/forge/com/sun/jersey/jersey-project/1.17.1/jersey-project-1.17.1.pom
Downloading: http://repo1.maven.org/maven2/com/sun/jersey/jersey-project/1.17.1/jersey-project-1.17.1.pom
Downloaded: http://repo1.maven.org/maven2/com/sun/jersey/jersey-project/1.17.1/jersey-project-1.17.1.pom (21 KB at 170.1 KB/sec)
Downloading: https://repository.sonatype.org/content/groups/forge/javax/validation/validation-api/1.1.0.Final/validation-api-1.1.0.Final.pom
Downloading: http://repo1.maven.org/maven2/javax/validation/validation-api/1.1.0.Final/validation-api-1.1.0.Final.pom
Downloaded: http://repo1.maven.org/maven2/javax/validation/validation-api/1.1.0.Final/validation-api-1.1.0.Final.pom (8 KB at 76.0 KB/sec)
Downloading: https://repository.sonatype.org/content/groups/forge/com/sun/jersey/jersey-client/1.17.1/jersey-client-1.17.1.pom
Downloading: http://repo1.maven.org/maven2/com/sun/jersey/jersey-client/1.17.1/jersey-client-1.17.1.pom
Downloaded: http://repo1.maven.org/maven2/com/sun/jersey/jersey-client/1.17.1/jersey-client-1.17.1.pom (7 KB at 64.0 KB/sec)
Downloading: https://repository.sonatype.org/content/groups/forge/com/sun/jersey/jersey-json/1.17.1/jersey-json-1.17.1.pom
Downloading: http://repo1.maven.org/maven2/com/sun/jersey/jersey-json/1.17.1/jersey-json-1.17.1.pom
Downloaded: http://repo1.maven.org/maven2/com/sun/jersey/jersey-json/1.17.1/jersey-json-1.17.1.pom (11 KB at 99.4 KB/sec)
Downloading: https://repository.sonatype.org/content/groups/forge/com/sun/xml/bind/jaxb-impl/2.2.3-1/jaxb-impl-2.2.3-1.pom
Downloading: http://repo1.maven.org/maven2/com/sun/xml/bind/jaxb-impl/2.2.3-1/jaxb-impl-2.2.3-1.pom
Downloaded: http://repo1.maven.org/maven2/com/sun/xml/bind/jaxb-impl/2.2.3-1/jaxb-impl-2.2.3-1.pom (6 KB at 50.4 KB/sec)
Downloading: https://repository.sonatype.org/content/groups/forge/org/codehaus/jackson/jackson-core-asl/1.9.2/jackson-core-asl-1.9.2.pom
Downloading: http://repo1.maven.org/maven2/org/codehaus/jackson/jackson-core-asl/1.9.2/jackson-core-asl-1.9.2.pom
Downloaded: http://repo1.maven.org/maven2/org/codehaus/jackson/jackson-core-asl/1.9.2/jackson-core-asl-1.9.2.pom (1016 B at 10.0 KB/sec)
Downloading: https://repository.sonatype.org/content/groups/forge/org/codehaus/jackson/jackson-mapper-asl/1.9.2/jackson-mapper-asl-1.9.2.pom
Downloading: http://repo1.maven.org/maven2/org/codehaus/jackson/jackson-mapper-asl/1.9.2/jackson-mapper-asl-1.9.2.pom
Downloaded: http://repo1.maven.org/maven2/org/codehaus/jackson/jackson-mapper-asl/1.9.2/jackson-mapper-asl-1.9.2.pom (2 KB at 12.1 KB/sec)
Downloading: https://repository.sonatype.org/content/groups/forge/org/codehaus/jackson/jackson-jaxrs/1.9.2/jackson-jaxrs-1.9.2.pom
Downloading: http://repo1.maven.org/maven2/org/codehaus/jackson/jackson-jaxrs/1.9.2/jackson-jaxrs-1.9.2.pom
Downloaded: http://repo1.maven.org/maven2/org/codehaus/jackson/jackson-jaxrs/1.9.2/jackson-jaxrs-1.9.2.pom (2 KB at 15.8 KB/sec)
Downloading: https://repository.sonatype.org/content/groups/forge/org/codehaus/jackson/jackson-xc/1.9.2/jackson-xc-1.9.2.pom
Downloading: http://repo1.maven.org/maven2/org/codehaus/jackson/jackson-xc/1.9.2/jackson-xc-1.9.2.pom
Downloaded: http://repo1.maven.org/maven2/org/codehaus/jackson/jackson-xc/1.9.2/jackson-xc-1.9.2.pom (2 KB at 16.0 KB/sec)
Downloading: https://repository.sonatype.org/content/groups/forge/com/sun/jersey/contribs/jersey-apache-client4/1.17.1/jersey-apache-client4-1.17.1.pom
Downloading: http://repo1.maven.org/maven2/com/sun/jersey/contribs/jersey-apache-client4/1.17.1/jersey-apache-client4-1.17.1.pom
Downloaded: http://repo1.maven.org/maven2/com/sun/jersey/contribs/jersey-apache-client4/1.17.1/jersey-apache-client4-1.17.1.pom (7 KB at 44.3 KB/sec)
Downloading: https://repository.sonatype.org/content/groups/forge/com/sun/jersey/contribs/jersey-contribs/1.17.1/jersey-contribs-1.17.1.pom
Downloading: http://repo1.maven.org/maven2/com/sun/jersey/contribs/jersey-contribs/1.17.1/jersey-contribs-1.17.1.pom
Downloaded: http://repo1.maven.org/maven2/com/sun/jersey/contribs/jersey-contribs/1.17.1/jersey-contribs-1.17.1.pom (4 KB at 32.6 KB/sec)
Downloading: https://repository.sonatype.org/content/groups/forge/org/apache/httpcomponents/httpclient/4.1.1/httpclient-4.1.1.pom
Downloading: http://repo1.maven.org/maven2/org/apache/httpcomponents/httpclient/4.1.1/httpclient-4.1.1.pom
Downloaded: http://repo1.maven.org/maven2/org/apache/httpcomponents/httpclient/4.1.1/httpclient-4.1.1.pom (6 KB at 57.9 KB/sec)
Downloading: https://repository.sonatype.org/content/groups/forge/org/apache/httpcomponents/httpcomponents-client/4.1.1/httpcomponents-client-4.1.1.pom
Downloading: http://repo1.maven.org/maven2/org/apache/httpcomponents/httpcomponents-client/4.1.1/httpcomponents-client-4.1.1.pom
Downloaded: http://repo1.maven.org/maven2/org/apache/httpcomponents/httpcomponents-client/4.1.1/httpcomponents-client-4.1.1.pom (12 KB at 111.8 KB/sec)
Downloading: https://repository.sonatype.org/content/groups/forge/org/apache/httpcomponents/httpcore/4.1/httpcore-4.1.pom
Downloading: http://repo1.maven.org/maven2/org/apache/httpcomponents/httpcore/4.1/httpcore-4.1.pom
Downloaded: http://repo1.maven.org/maven2/org/apache/httpcomponents/httpcore/4.1/httpcore-4.1.pom (9 KB at 33.0 KB/sec)
Downloading: https://repository.sonatype.org/content/groups/forge/org/apache/httpcomponents/httpcomponents-core/4.1/httpcomponents-core-4.1.pom
Downloading: http://repo1.maven.org/maven2/org/apache/httpcomponents/httpcomponents-core/4.1/httpcomponents-core-4.1.pom
Downloaded: http://repo1.maven.org/maven2/org/apache/httpcomponents/httpcomponents-core/4.1/httpcomponents-core-4.1.pom (9 KB at 87.4 KB/sec)
Downloading: https://repository.sonatype.org/content/groups/forge/org/sonatype/nexus/nexus-testsuite-client/2.6.0-01/nexus-testsuite-client-2.6.0-01.pom
Downloaded: https://repository.sonatype.org/content/groups/forge/org/sonatype/nexus/nexus-testsuite-client/2.6.0-01/nexus-testsuite-client-2.6.0-01.pom (2 KB at 4.5 KB/sec)
Downloading: https://repository.sonatype.org/content/groups/forge/org/sonatype/sisu/goodies/goodies-marshal/1.6.1/goodies-marshal-1.6.1.pom
Downloaded: https://repository.sonatype.org/content/groups/forge/org/sonatype/sisu/goodies/goodies-marshal/1.6.1/goodies-marshal-1.6.1.pom (4 KB at 12.8 KB/sec)
Downloading: https://repository.sonatype.org/content/groups/forge/org/sonatype/sisu/litmus/litmus-testsupport/1.7/litmus-testsupport-1.7.pom
Downloaded: https://repository.sonatype.org/content/groups/forge/org/sonatype/sisu/litmus/litmus-testsupport/1.7/litmus-testsupport-1.7.pom (6 KB at 17.4 KB/sec)
Downloading: https://repository.sonatype.org/content/groups/forge/org/sonatype/sisu/litmus/litmus/1.7/litmus-1.7.pom
Downloaded: https://repository.sonatype.org/content/groups/forge/org/sonatype/sisu/litmus/litmus/1.7/litmus-1.7.pom (11 KB at 30.2 KB/sec)
Downloading: https://repository.sonatype.org/content/groups/forge/info/cukes/cucumber-junit/1.1.1/cucumber-junit-1.1.1.pom
Downloading: http://repo1.maven.org/maven2/info/cukes/cucumber-junit/1.1.1/cucumber-junit-1.1.1.pom
Downloaded: http://repo1.maven.org/maven2/info/cukes/cucumber-junit/1.1.1/cucumber-junit-1.1.1.pom (2 KB at 13.3 KB/sec)
Downloading: https://repository.sonatype.org/content/groups/forge/info/cukes/cucumber-jvm/1.1.1/cucumber-jvm-1.1.1.pom
Downloading: http://repo1.maven.org/maven2/info/cukes/cucumber-jvm/1.1.1/cucumber-jvm-1.1.1.pom
Downloaded: http://repo1.maven.org/maven2/info/cukes/cucumber-jvm/1.1.1/cucumber-jvm-1.1.1.pom (19 KB at 151.4 KB/sec)
Downloading: https://repository.sonatype.org/content/groups/forge/info/cukes/cucumber-core/1.1.1/cucumber-core-1.1.1.pom
Downloading: http://repo1.maven.org/maven2/info/cukes/cucumber-core/1.1.1/cucumber-core-1.1.1.pom
Downloaded: http://repo1.maven.org/maven2/info/cukes/cucumber-core/1.1.1/cucumber-core-1.1.1.pom (4 KB at 25.7 KB/sec)
Downloading: https://repository.sonatype.org/content/groups/forge/info/cukes/cucumber-guice/1.1.1/cucumber-guice-1.1.1.pom
Downloading: http://repo1.maven.org/maven2/info/cukes/cucumber-guice/1.1.1/cucumber-guice-1.1.1.pom
Downloaded: http://repo1.maven.org/maven2/info/cukes/cucumber-guice/1.1.1/cucumber-guice-1.1.1.pom (2 KB at 13.6 KB/sec)
Downloading: https://repository.sonatype.org/content/groups/forge/info/cukes/cucumber-java/1.1.1/cucumber-java-1.1.1.pom
Downloading: http://repo1.maven.org/maven2/info/cukes/cucumber-java/1.1.1/cucumber-java-1.1.1.pom
Downloaded: http://repo1.maven.org/maven2/info/cukes/cucumber-java/1.1.1/cucumber-java-1.1.1.pom (5 KB at 27.0 KB/sec)
Downloading: https://repository.sonatype.org/content/groups/forge/org/databene/contiperf/2.2.0/contiperf-2.2.0.pom
Downloading: http://repo1.maven.org/maven2/org/databene/contiperf/2.2.0/contiperf-2.2.0.pom
Downloaded: http://repo1.maven.org/maven2/org/databene/contiperf/2.2.0/contiperf-2.2.0.pom (8 KB at 70.4 KB/sec)
Downloading: https://repository.sonatype.org/content/groups/forge/org/hamcrest/hamcrest-library/1.3/hamcrest-library-1.3.pom
Downloading: http://repo1.maven.org/maven2/org/hamcrest/hamcrest-library/1.3/hamcrest-library-1.3.pom
Downloaded: http://repo1.maven.org/maven2/org/hamcrest/hamcrest-library/1.3/hamcrest-library-1.3.pom (820 B at 8.0 KB/sec)
Downloading: https://repository.sonatype.org/content/groups/forge/org/easytesting/fest-assert-core/2.0M10/fest-assert-core-2.0M10.pom
Downloading: http://repo1.maven.org/maven2/org/easytesting/fest-assert-core/2.0M10/fest-assert-core-2.0M10.pom
Downloaded: http://repo1.maven.org/maven2/org/easytesting/fest-assert-core/2.0M10/fest-assert-core-2.0M10.pom (3 KB at 20.5 KB/sec)
Downloading: https://repository.sonatype.org/content/groups/forge/org/easytesting/fest/1.0.15/fest-1.0.15.pom
Downloading: http://repo1.maven.org/maven2/org/easytesting/fest/1.0.15/fest-1.0.15.pom
Downloaded: http://repo1.maven.org/maven2/org/easytesting/fest/1.0.15/fest-1.0.15.pom (8 KB at 69.6 KB/sec)
Downloading: https://repository.sonatype.org/content/groups/forge/org/easytesting/fest-util/1.2.5/fest-util-1.2.5.pom
Downloading: http://repo1.maven.org/maven2/org/easytesting/fest-util/1.2.5/fest-util-1.2.5.pom
Downloaded: http://repo1.maven.org/maven2/org/easytesting/fest-util/1.2.5/fest-util-1.2.5.pom (2 KB at 16.8 KB/sec)
Downloading: https://repository.sonatype.org/content/groups/forge/org/incava/java-diff/1.1/java-diff-1.1.pom
Downloading: http://repo1.maven.org/maven2/org/incava/java-diff/1.1/java-diff-1.1.pom
Downloaded: http://repo1.maven.org/maven2/org/incava/java-diff/1.1/java-diff-1.1.pom (5 KB at 31.7 KB/sec)
Downloading: https://repository.sonatype.org/content/groups/forge/org/objenesis/objenesis/1.3/objenesis-1.3.pom
Downloading: http://repo1.maven.org/maven2/org/objenesis/objenesis/1.3/objenesis-1.3.pom
Downloaded: http://repo1.maven.org/maven2/org/objenesis/objenesis/1.3/objenesis-1.3.pom (3 KB at 25.1 KB/sec)
Downloading: https://repository.sonatype.org/content/groups/forge/org/objenesis/objenesis-parent/1.3/objenesis-parent-1.3.pom
Downloading: http://repo1.maven.org/maven2/org/objenesis/objenesis-parent/1.3/objenesis-parent-1.3.pom
Downloaded: http://repo1.maven.org/maven2/org/objenesis/objenesis-parent/1.3/objenesis-parent-1.3.pom (14 KB at 135.0 KB/sec)
Downloading: https://repository.sonatype.org/content/groups/forge/org/mockito/mockito-core/1.9.5/mockito-core-1.9.5.pom
Downloading: http://repo1.maven.org/maven2/org/mockito/mockito-core/1.9.5/mockito-core-1.9.5.pom
Downloaded: http://repo1.maven.org/maven2/org/mockito/mockito-core/1.9.5/mockito-core-1.9.5.pom (2 KB at 12.0 KB/sec)
Downloading: https://repository.sonatype.org/content/groups/forge/org/hamcrest/hamcrest-core/1.1/hamcrest-core-1.1.pom
[WARNING] Checksum validation failed, no checksums available from the repository for https://repository.sonatype.org/content/groups/forge/org/hamcrest/hamcrest-core/1.1/hamcrest-core-1.1.pom
Downloaded: https://repository.sonatype.org/content/groups/forge/org/hamcrest/hamcrest-core/1.1/hamcrest-core-1.1.pom (481 B at 0.9 KB/sec)
Downloading: https://repository.sonatype.org/content/groups/forge/org/hamcrest/hamcrest-parent/1.1/hamcrest-parent-1.1.pom
[WARNING] Checksum validation failed, no checksums available from the repository for https://repository.sonatype.org/content/groups/forge/org/hamcrest/hamcrest-parent/1.1/hamcrest-parent-1.1.pom
Downloaded: https://repository.sonatype.org/content/groups/forge/org/hamcrest/hamcrest-parent/1.1/hamcrest-parent-1.1.pom (6 KB at 12.2 KB/sec)
Downloading: https://repository.sonatype.org/content/groups/forge/org/objenesis/objenesis/1.0/objenesis-1.0.pom
[WARNING] Checksum validation failed, no checksums available from the repository for https://repository.sonatype.org/content/groups/forge/org/objenesis/objenesis/1.0/objenesis-1.0.pom
Downloaded: https://repository.sonatype.org/content/groups/forge/org/objenesis/objenesis/1.0/objenesis-1.0.pom (853 B at 1.8 KB/sec)
Downloading: https://repository.sonatype.org/content/groups/forge/org/powermock/powermock-module-junit4/1.5/powermock-module-junit4-1.5.pom
Downloading: http://repo1.maven.org/maven2/org/powermock/powermock-module-junit4/1.5/powermock-module-junit4-1.5.pom
Downloaded: http://repo1.maven.org/maven2/org/powermock/powermock-module-junit4/1.5/powermock-module-junit4-1.5.pom (2 KB at 8.5 KB/sec)
Downloading: https://repository.sonatype.org/content/groups/forge/org/powermock/powermock-modules/1.5/powermock-modules-1.5.pom
Downloading: http://repo1.maven.org/maven2/org/powermock/powermock-modules/1.5/powermock-modules-1.5.pom
Downloaded: http://repo1.maven.org/maven2/org/powermock/powermock-modules/1.5/powermock-modules-1.5.pom (796 B at 7.7 KB/sec)
Downloading: https://repository.sonatype.org/content/groups/forge/org/powermock/powermock/1.5/powermock-1.5.pom
Downloading: http://repo1.maven.org/maven2/org/powermock/powermock/1.5/powermock-1.5.pom
Downloaded: http://repo1.maven.org/maven2/org/powermock/powermock/1.5/powermock-1.5.pom (10 KB at 97.5 KB/sec)
Downloading: https://repository.sonatype.org/content/groups/forge/org/powermock/powermock-module-junit4-common/1.5/powermock-module-junit4-common-1.5.pom
Downloading: http://repo1.maven.org/maven2/org/powermock/powermock-module-junit4-common/1.5/powermock-module-junit4-common-1.5.pom
Downloaded: http://repo1.maven.org/maven2/org/powermock/powermock-module-junit4-common/1.5/powermock-module-junit4-common-1.5.pom (2 KB at 10.9 KB/sec)
Downloading: https://repository.sonatype.org/content/groups/forge/org/powermock/powermock-core/1.5/powermock-core-1.5.pom
Downloading: http://repo1.maven.org/maven2/org/powermock/powermock-core/1.5/powermock-core-1.5.pom
Downloaded: http://repo1.maven.org/maven2/org/powermock/powermock-core/1.5/powermock-core-1.5.pom (3 KB at 23.7 KB/sec)
Downloading: https://repository.sonatype.org/content/groups/forge/org/powermock/powermock-reflect/1.5/powermock-reflect-1.5.pom
Downloading: http://repo1.maven.org/maven2/org/powermock/powermock-reflect/1.5/powermock-reflect-1.5.pom
Downloaded: http://repo1.maven.org/maven2/org/powermock/powermock-reflect/1.5/powermock-reflect-1.5.pom (2 KB at 10.1 KB/sec)
Downloading: https://repository.sonatype.org/content/groups/forge/org/javassist/javassist/3.17.1-GA/javassist-3.17.1-GA.pom
Downloading: http://repo1.maven.org/maven2/org/javassist/javassist/3.17.1-GA/javassist-3.17.1-GA.pom
Downloaded: http://repo1.maven.org/maven2/org/javassist/javassist/3.17.1-GA/javassist-3.17.1-GA.pom (9 KB at 90.4 KB/sec)
Downloading: https://repository.sonatype.org/content/groups/forge/org/powermock/powermock-api-mockito/1.5/powermock-api-mockito-1.5.pom
Downloading: http://repo1.maven.org/maven2/org/powermock/powermock-api-mockito/1.5/powermock-api-mockito-1.5.pom
Downloaded: http://repo1.maven.org/maven2/org/powermock/powermock-api-mockito/1.5/powermock-api-mockito-1.5.pom (2 KB at 12.2 KB/sec)
Downloading: https://repository.sonatype.org/content/groups/forge/org/powermock/powermock-api/1.5/powermock-api-1.5.pom
Downloading: http://repo1.maven.org/maven2/org/powermock/powermock-api/1.5/powermock-api-1.5.pom
Downloaded: http://repo1.maven.org/maven2/org/powermock/powermock-api/1.5/powermock-api-1.5.pom (803 B at 7.9 KB/sec)
Downloading: https://repository.sonatype.org/content/groups/forge/org/powermock/powermock-api-support/1.5/powermock-api-support-1.5.pom
Downloading: http://repo1.maven.org/maven2/org/powermock/powermock-api-support/1.5/powermock-api-support-1.5.pom
Downloaded: http://repo1.maven.org/maven2/org/powermock/powermock-api-support/1.5/powermock-api-support-1.5.pom (2 KB at 12.1 KB/sec)
Downloading: https://repository.sonatype.org/content/groups/forge/org/powermock/powermock-module-junit4-rule/1.5/powermock-module-junit4-rule-1.5.pom
Downloading: http://repo1.maven.org/maven2/org/powermock/powermock-module-junit4-rule/1.5/powermock-module-junit4-rule-1.5.pom
Downloaded: http://repo1.maven.org/maven2/org/powermock/powermock-module-junit4-rule/1.5/powermock-module-junit4-rule-1.5.pom (2 KB at 17.8 KB/sec)
Downloading: https://repository.sonatype.org/content/groups/forge/org/powermock/powermock-classloading-base/1.5/powermock-classloading-base-1.5.pom
Downloading: http://repo1.maven.org/maven2/org/powermock/powermock-classloading-base/1.5/powermock-classloading-base-1.5.pom
Downloaded: http://repo1.maven.org/maven2/org/powermock/powermock-classloading-base/1.5/powermock-classloading-base-1.5.pom (2 KB at 15.3 KB/sec)
Downloading: https://repository.sonatype.org/content/groups/forge/org/powermock/powermock-classloading-xstream/1.5/powermock-classloading-xstream-1.5.pom
Downloading: http://repo1.maven.org/maven2/org/powermock/powermock-classloading-xstream/1.5/powermock-classloading-xstream-1.5.pom
Downloaded: http://repo1.maven.org/maven2/org/powermock/powermock-classloading-xstream/1.5/powermock-classloading-xstream-1.5.pom (2 KB at 13.2 KB/sec)
Downloading: https://repository.sonatype.org/content/groups/forge/org/powermock/powermock-classloading-module/1.5/powermock-classloading-module-1.5.pom
Downloading: http://repo1.maven.org/maven2/org/powermock/powermock-classloading-module/1.5/powermock-classloading-module-1.5.pom
Downloaded: http://repo1.maven.org/maven2/org/powermock/powermock-classloading-module/1.5/powermock-classloading-module-1.5.pom (850 B at 8.1 KB/sec)
Downloading: https://repository.sonatype.org/content/groups/forge/com/thoughtworks/xstream/xstream/1.4.2/xstream-1.4.2.pom
Downloading: http://repo1.maven.org/maven2/com/thoughtworks/xstream/xstream/1.4.2/xstream-1.4.2.pom
Downloaded: http://repo1.maven.org/maven2/com/thoughtworks/xstream/xstream/1.4.2/xstream-1.4.2.pom (9 KB at 86.0 KB/sec)
Downloading: https://repository.sonatype.org/content/groups/forge/com/thoughtworks/xstream/xstream-parent/1.4.2/xstream-parent-1.4.2.pom
Downloading: http://repo1.maven.org/maven2/com/thoughtworks/xstream/xstream-parent/1.4.2/xstream-parent-1.4.2.pom
Downloaded: http://repo1.maven.org/maven2/com/thoughtworks/xstream/xstream-parent/1.4.2/xstream-parent-1.4.2.pom (19 KB at 151.5 KB/sec)
Downloading: https://repository.sonatype.org/content/groups/forge/com/googlecode/junit-ext/junit-ext/1.0-RC3/junit-ext-1.0-RC3.pom
Downloaded: https://repository.sonatype.org/content/groups/forge/com/googlecode/junit-ext/junit-ext/1.0-RC3/junit-ext-1.0-RC3.pom (471 B at 1.8 KB/sec)
Downloading: https://repository.sonatype.org/content/groups/forge/org/sonatype/nexus/plugins/nexus-groovyremote-client/2.6.0-01/nexus-groovyremote-client-2.6.0-01.pom
Downloaded: https://repository.sonatype.org/content/groups/forge/org/sonatype/nexus/plugins/nexus-groovyremote-client/2.6.0-01/nexus-groovyremote-client-2.6.0-01.pom (3 KB at 7.2 KB/sec)
Downloading: https://repository.sonatype.org/content/groups/forge/org/sonatype/nexus/plugins/nexus-plugins-internal/2.6.0-01/nexus-plugins-internal-2.6.0-01.pom
Downloaded: https://repository.sonatype.org/content/groups/forge/org/sonatype/nexus/plugins/nexus-plugins-internal/2.6.0-01/nexus-plugins-internal-2.6.0-01.pom (2 KB at 4.0 KB/sec)
Downloading: https://repository.sonatype.org/content/groups/forge/org/codehaus/groovy/groovy-all/2.0.6/groovy-all-2.0.6.pom
Downloading: http://repo1.maven.org/maven2/org/codehaus/groovy/groovy-all/2.0.6/groovy-all-2.0.6.pom
Downloaded: http://repo1.maven.org/maven2/org/codehaus/groovy/groovy-all/2.0.6/groovy-all-2.0.6.pom (18 KB at 121.5 KB/sec)
Downloading: https://repository.sonatype.org/content/groups/forge/org/codehaus/groovy/modules/remote/remote-core/0.5/remote-core-0.5.pom
Downloading: http://repo1.maven.org/maven2/org/codehaus/groovy/modules/remote/remote-core/0.5/remote-core-0.5.pom
Downloaded: http://repo1.maven.org/maven2/org/codehaus/groovy/modules/remote/remote-core/0.5/remote-core-0.5.pom (2 KB at 12.1 KB/sec)
Downloading: https://repository.sonatype.org/content/groups/forge/org/codehaus/groovy/modules/remote/remote-transport-http/0.5/remote-transport-http-0.5.pom
Downloading: http://repo1.maven.org/maven2/org/codehaus/groovy/modules/remote/remote-transport-http/0.5/remote-transport-http-0.5.pom
Downloaded: http://repo1.maven.org/maven2/org/codehaus/groovy/modules/remote/remote-transport-http/0.5/remote-transport-http-0.5.pom (2 KB at 13.4 KB/sec)
Downloading: https://repository.sonatype.org/content/groups/forge/org/sonatype/nexus/nexus-testsuite-support/2.6.0-01/nexus-testsuite-support-2.6.0-01.jar
Downloading: https://repository.sonatype.org/content/groups/forge/org/sonatype/nexus/nexus-launcher/2.6.0-01/nexus-launcher-2.6.0-01.jar
Downloading: https://repository.sonatype.org/content/groups/forge/org/sonatype/sisu/sisu-bundle-launcher/1.5.2/sisu-bundle-launcher-1.5.2.jar
Downloading: https://repository.sonatype.org/content/groups/forge/org/sonatype/sisu/sisu-inject-bean/2.3.2/sisu-inject-bean-2.3.2.jar
Downloading: https://repository.sonatype.org/content/groups/forge/org/sonatype/sisu/sisu-guice/3.1.2/sisu-guice-3.1.2-no_aop.jar
Downloaded: https://repository.sonatype.org/content/groups/forge/org/sonatype/nexus/nexus-launcher/2.6.0-01/nexus-launcher-2.6.0-01.jar (34 KB at 106.3 KB/sec)
Downloading: https://repository.sonatype.org/content/groups/forge/org/sonatype/sisu/sisu-file-tasks/1.5.2/sisu-file-tasks-1.5.2.jar
Downloaded: https://repository.sonatype.org/content/groups/forge/org/sonatype/nexus/nexus-testsuite-support/2.6.0-01/nexus-testsuite-support-2.6.0-01.jar (45 KB at 130.4 KB/sec)
Downloading: https://repository.sonatype.org/content/groups/forge/org/apache/ant/ant/1.8.4/ant-1.8.4.jar
Downloaded: https://repository.sonatype.org/content/groups/forge/org/sonatype/sisu/sisu-bundle-launcher/1.5.2/sisu-bundle-launcher-1.5.2.jar (56 KB at 143.0 KB/sec)
Downloading: https://repository.sonatype.org/content/groups/forge/org/apache/ant/ant-launcher/1.8.4/ant-launcher-1.8.4.jar
Downloaded: https://repository.sonatype.org/content/groups/forge/org/sonatype/sisu/sisu-inject-bean/2.3.2/sisu-inject-bean-2.3.2.jar (296 KB at 587.5 KB/sec)
Downloading: https://repository.sonatype.org/content/groups/forge/net/sf/smc/statemap/6.0.1/statemap-6.0.1-java.jar
Downloading: https://repository.sonatype.org/content/groups/forge/org/sonatype/sisu/sisu-maven-bridge/3.0/sisu-maven-bridge-3.0.jar
Downloaded: https://repository.sonatype.org/content/groups/forge/org/sonatype/sisu/sisu-guice/3.1.2/sisu-guice-3.1.2-no_aop.jar (352 KB at 617.4 KB/sec)
Downloading: https://repository.sonatype.org/content/groups/forge/org/apache/maven/maven-model-builder/3.0.4/maven-model-builder-3.0.4.jar
Downloading: https://repository.sonatype.org/content/groups/forge/org/apache/maven/maven-settings-builder/3.0.4/maven-settings-builder-3.0.4.jar
Downloaded: https://repository.sonatype.org/content/groups/forge/net/sf/smc/statemap/6.0.1/statemap-6.0.1-java.jar (5 KB at 25.9 KB/sec)
Downloading: https://repository.sonatype.org/content/groups/forge/org/apache/maven/maven-settings/3.0.4/maven-settings-3.0.4.jar
Downloaded: https://repository.sonatype.org/content/groups/forge/org/sonatype/sisu/sisu-file-tasks/1.5.2/sisu-file-tasks-1.5.2.jar (113 KB at 278.2 KB/sec)
Downloading: https://repository.sonatype.org/content/groups/forge/org/apache/maven/maven-aether-provider/3.0.4/maven-aether-provider-3.0.4.jar
Downloading: https://repository.sonatype.org/content/groups/forge/org/apache/maven/maven-repository-metadata/3.0.4/maven-repository-metadata-3.0.4.jar
Downloading: https://repository.sonatype.org/content/groups/forge/org/sonatype/aether/aether-connector-wagon/1.13.1/aether-connector-wagon-1.13.1.jar
Downloading: https://repository.sonatype.org/content/groups/forge/org/apache/maven/wagon/wagon-provider-api/1.0-beta-6/wagon-provider-api-1.0-beta-6.jar
Downloading: https://repository.sonatype.org/content/groups/forge/org/apache/maven/wagon/wagon-http/2.1/wagon-http-2.1.jar
Downloaded: https://repository.sonatype.org/content/groups/forge/org/sonatype/sisu/sisu-maven-bridge/3.0/sisu-maven-bridge-3.0.jar (59 KB at 145.5 KB/sec)
Downloading: https://repository.sonatype.org/content/groups/forge/org/apache/maven/wagon/wagon-http-shared4/2.1/wagon-http-shared4-2.1.jar
Downloading: https://repository.sonatype.org/content/groups/forge/org/jsoup/jsoup/1.6.1/jsoup-1.6.1.jar
Downloaded: https://repository.sonatype.org/content/groups/forge/org/sonatype/aether/aether-connector-wagon/1.13.1/aether-connector-wagon-1.13.1.jar (30 KB at 100.1 KB/sec)
Downloading: https://repository.sonatype.org/content/groups/forge/commons-io/commons-io/2.0.1/commons-io-2.0.1.jar
Downloading: https://repository.sonatype.org/content/groups/forge/org/sonatype/nexus/nexus-bootstrap/2.6.0-01/nexus-bootstrap-2.6.0-01.jar
Downloading: https://repository.sonatype.org/content/groups/forge/org/sonatype/nexus/nexus-jetty8/2.6.0-01/nexus-jetty8-2.6.0-01.jar
Downloading: https://repository.sonatype.org/content/groups/forge/org/eclipse/jetty/jetty-server/8.1.11.v20130520/jetty-server-8.1.11.v20130520.jar
Downloading: https://repository.sonatype.org/content/groups/forge/org/eclipse/jetty/jetty-continuation/8.1.11.v20130520/jetty-continuation-8.1.11.v20130520.jar
Downloading: https://repository.sonatype.org/content/groups/forge/org/eclipse/jetty/jetty-http/8.1.11.v20130520/jetty-http-8.1.11.v20130520.jar
Downloading: https://repository.sonatype.org/content/groups/forge/org/eclipse/jetty/jetty-io/8.1.11.v20130520/jetty-io-8.1.11.v20130520.jar
Downloading: https://repository.sonatype.org/content/groups/forge/org/eclipse/jetty/jetty-util/8.1.11.v20130520/jetty-util-8.1.11.v20130520.jar
Downloaded: https://repository.sonatype.org/content/groups/forge/org/sonatype/nexus/nexus-bootstrap/2.6.0-01/nexus-bootstrap-2.6.0-01.jar (31 KB at 98.9 KB/sec)
Downloading: https://repository.sonatype.org/content/groups/forge/com/yammer/metrics/metrics-jetty/2.2.0/metrics-jetty-2.2.0.jar
Downloaded: https://repository.sonatype.org/content/groups/forge/org/sonatype/nexus/nexus-jetty8/2.6.0-01/nexus-jetty8-2.6.0-01.jar (27 KB at 85.7 KB/sec)
Downloading: https://repository.sonatype.org/content/groups/forge/commons-codec/commons-codec/1.6/commons-codec-1.6.jar
Downloading: https://repository.sonatype.org/content/groups/forge/org/sonatype/nexus/nexus-client-core/2.6.0-01/nexus-client-core-2.6.0-01.jar
Downloading: https://repository.sonatype.org/content/groups/forge/org/sonatype/nexus/plugins/nexus-restlet1x-model/2.6.0-01/nexus-restlet1x-model-2.6.0-01.jar
Downloading: https://repository.sonatype.org/content/groups/forge/org/sonatype/sisu/siesta/siesta-client/1.5/siesta-client-1.5.jar
Downloading: https://repository.sonatype.org/content/groups/forge/org/sonatype/sisu/siesta/siesta-common/1.5/siesta-common-1.5.jar
Downloading: https://repository.sonatype.org/content/groups/forge/javax/ws/rs/jsr311-api/1.1.1/jsr311-api-1.1.1.jar
Downloaded: https://repository.sonatype.org/content/groups/forge/org/sonatype/sisu/siesta/siesta-common/1.5/siesta-common-1.5.jar (11 KB at 54.2 KB/sec)
Downloading: https://repository.sonatype.org/content/groups/forge/com/sun/jersey/jersey-core/1.17.1/jersey-core-1.17.1.jar
Downloaded: https://repository.sonatype.org/content/groups/forge/org/sonatype/sisu/siesta/siesta-client/1.5/siesta-client-1.5.jar (16 KB at 71.7 KB/sec)
Downloading: https://repository.sonatype.org/content/groups/forge/javax/validation/validation-api/1.1.0.Final/validation-api-1.1.0.Final.jar
Downloading: https://repository.sonatype.org/content/groups/forge/com/sun/jersey/jersey-client/1.17.1/jersey-client-1.17.1.jar
Downloaded: https://repository.sonatype.org/content/groups/forge/org/sonatype/nexus/nexus-client-core/2.6.0-01/nexus-client-core-2.6.0-01.jar (170 KB at 372.9 KB/sec)
Downloading: https://repository.sonatype.org/content/groups/forge/com/sun/jersey/jersey-json/1.17.1/jersey-json-1.17.1.jar
Downloading: https://repository.sonatype.org/content/groups/forge/com/sun/xml/bind/jaxb-impl/2.2.3-1/jaxb-impl-2.2.3-1.jar
Downloaded: https://repository.sonatype.org/content/groups/forge/org/sonatype/nexus/plugins/nexus-restlet1x-model/2.6.0-01/nexus-restlet1x-model-2.6.0-01.jar (164 KB at 371.5 KB/sec)
Downloading: https://repository.sonatype.org/content/groups/forge/org/codehaus/jackson/jackson-jaxrs/1.9.2/jackson-jaxrs-1.9.2.jar
Downloading: https://repository.sonatype.org/content/groups/forge/org/codehaus/jackson/jackson-xc/1.9.2/jackson-xc-1.9.2.jar
Downloading: https://repository.sonatype.org/content/groups/forge/com/sun/jersey/contribs/jersey-apache-client4/1.17.1/jersey-apache-client4-1.17.1.jar
Downloading: https://repository.sonatype.org/content/groups/forge/org/sonatype/nexus/nexus-testsuite-client/2.6.0-01/nexus-testsuite-client-2.6.0-01.jar
Downloading: https://repository.sonatype.org/content/groups/forge/org/sonatype/sisu/goodies/goodies-marshal/1.6.1/goodies-marshal-1.6.1.jar
Downloading: https://repository.sonatype.org/content/groups/forge/org/sonatype/sisu/sisu-guice/3.1.2/sisu-guice-3.1.2.jar
Downloading: https://repository.sonatype.org/content/groups/forge/org/sonatype/sisu/litmus/litmus-testsupport/1.7/litmus-testsupport-1.7.jar
Downloading: https://repository.sonatype.org/content/groups/forge/info/cukes/cucumber-junit/1.1.1/cucumber-junit-1.1.1.jar
Downloaded: https://repository.sonatype.org/content/groups/forge/org/sonatype/nexus/nexus-testsuite-client/2.6.0-01/nexus-testsuite-client-2.6.0-01.jar (27 KB at 92.8 KB/sec)
Downloading: https://repository.sonatype.org/content/groups/forge/info/cukes/cucumber-core/1.1.1/cucumber-core-1.1.1.jar
Downloading: https://repository.sonatype.org/content/groups/forge/info/cukes/cucumber-guice/1.1.1/cucumber-guice-1.1.1.jar
Downloaded: https://repository.sonatype.org/content/groups/forge/org/sonatype/sisu/goodies/goodies-marshal/1.6.1/goodies-marshal-1.6.1.jar (18 KB at 65.9 KB/sec)
Downloading: https://repository.sonatype.org/content/groups/forge/info/cukes/cucumber-java/1.1.1/cucumber-java-1.1.1.jar
Downloading: https://repository.sonatype.org/content/groups/forge/org/databene/contiperf/2.2.0/contiperf-2.2.0.jar
Downloading: https://repository.sonatype.org/content/groups/forge/org/hamcrest/hamcrest-library/1.3/hamcrest-library-1.3.jar
Downloading: https://repository.sonatype.org/content/groups/forge/org/easytesting/fest-assert-core/2.0M10/fest-assert-core-2.0M10.jar
Downloaded: https://repository.sonatype.org/content/groups/forge/org/sonatype/sisu/litmus/litmus-testsupport/1.7/litmus-testsupport-1.7.jar (83 KB at 199.1 KB/sec)
Downloading: https://repository.sonatype.org/content/groups/forge/org/easytesting/fest-util/1.2.5/fest-util-1.2.5.jar
Downloading: https://repository.sonatype.org/content/groups/forge/org/incava/java-diff/1.1/java-diff-1.1.jar
Downloading: https://repository.sonatype.org/content/groups/forge/org/objenesis/objenesis/1.3/objenesis-1.3.jar
Downloaded: https://repository.sonatype.org/content/groups/forge/org/sonatype/sisu/sisu-guice/3.1.2/sisu-guice-3.1.2.jar (575 KB at 963.2 KB/sec)
Downloading: https://repository.sonatype.org/content/groups/forge/org/mockito/mockito-core/1.9.5/mockito-core-1.9.5.jar
Downloading: https://repository.sonatype.org/content/groups/forge/org/powermock/powermock-module-junit4/1.5/powermock-module-junit4-1.5.jar
Downloading: https://repository.sonatype.org/content/groups/forge/org/powermock/powermock-module-junit4-common/1.5/powermock-module-junit4-common-1.5.jar
Downloading: https://repository.sonatype.org/content/groups/forge/org/powermock/powermock-reflect/1.5/powermock-reflect-1.5.jar
Downloading: https://repository.sonatype.org/content/groups/forge/org/powermock/powermock-api-mockito/1.5/powermock-api-mockito-1.5.jar
Downloading: https://repository.sonatype.org/content/groups/forge/org/powermock/powermock-api-support/1.5/powermock-api-support-1.5.jar
Downloading: https://repository.sonatype.org/content/groups/forge/org/powermock/powermock-module-junit4-rule/1.5/powermock-module-junit4-rule-1.5.jar
Downloading: https://repository.sonatype.org/content/groups/forge/org/powermock/powermock-classloading-base/1.5/powermock-classloading-base-1.5.jar
Downloading: https://repository.sonatype.org/content/groups/forge/org/powermock/powermock-core/1.5/powermock-core-1.5.jar
Downloading: https://repository.sonatype.org/content/groups/forge/org/javassist/javassist/3.17.1-GA/javassist-3.17.1-GA.jar
Downloading: https://repository.sonatype.org/content/groups/forge/org/powermock/powermock-classloading-xstream/1.5/powermock-classloading-xstream-1.5.jar
Downloading: https://repository.sonatype.org/content/groups/forge/com/googlecode/junit-ext/junit-ext/1.0-RC3/junit-ext-1.0-RC3-junit45.jar
Downloading: https://repository.sonatype.org/content/groups/forge/org/sonatype/nexus/plugins/nexus-groovyremote-client/2.6.0-01/nexus-groovyremote-client-2.6.0-01.jar
Downloading: https://repository.sonatype.org/content/groups/forge/org/codehaus/groovy/groovy-all/2.0.6/groovy-all-2.0.6.jar
Downloaded: https://repository.sonatype.org/content/groups/forge/com/googlecode/junit-ext/junit-ext/1.0-RC3/junit-ext-1.0-RC3-junit45.jar (15 KB at 16.9 KB/sec)
Downloading: https://repository.sonatype.org/content/groups/forge/org/codehaus/groovy/modules/remote/remote-core/0.5/remote-core-0.5.jar
Downloaded: https://repository.sonatype.org/content/groups/forge/org/sonatype/nexus/plugins/nexus-groovyremote-client/2.6.0-01/nexus-groovyremote-client-2.6.0-01.jar (8 KB at 8.0 KB/sec)
Downloading: https://repository.sonatype.org/content/groups/forge/org/codehaus/groovy/modules/remote/remote-transport-http/0.5/remote-transport-http-0.5.jar
Downloading: http://repo1.maven.org/maven2/org/apache/ant/ant/1.8.4/ant-1.8.4.jar
Downloading: http://repo1.maven.org/maven2/org/apache/ant/ant-launcher/1.8.4/ant-launcher-1.8.4.jar
Downloading: http://repo1.maven.org/maven2/org/apache/maven/maven-model-builder/3.0.4/maven-model-builder-3.0.4.jar
Downloading: http://repo1.maven.org/maven2/org/apache/maven/maven-settings-builder/3.0.4/maven-settings-builder-3.0.4.jar
Downloading: http://repo1.maven.org/maven2/org/apache/maven/maven-settings/3.0.4/maven-settings-3.0.4.jar
Downloaded: http://repo1.maven.org/maven2/org/apache/maven/maven-settings-builder/3.0.4/maven-settings-builder-3.0.4.jar (41 KB at 236.3 KB/sec)
Downloading: http://repo1.maven.org/maven2/org/apache/maven/maven-aether-provider/3.0.4/maven-aether-provider-3.0.4.jar
Downloaded: http://repo1.maven.org/maven2/org/apache/maven/maven-settings/3.0.4/maven-settings-3.0.4.jar (46 KB at 186.0 KB/sec)
Downloading: http://repo1.maven.org/maven2/org/apache/maven/maven-repository-metadata/3.0.4/maven-repository-metadata-3.0.4.jar
Downloaded: http://repo1.maven.org/maven2/org/apache/ant/ant-launcher/1.8.4/ant-launcher-1.8.4.jar (18 KB at 56.2 KB/sec)
Downloading: http://repo1.maven.org/maven2/org/apache/maven/wagon/wagon-provider-api/1.0-beta-6/wagon-provider-api-1.0-beta-6.jar
Downloaded: http://repo1.maven.org/maven2/org/apache/maven/maven-aether-provider/3.0.4/maven-aether-provider-3.0.4.jar (56 KB at 365.4 KB/sec)
Downloading: http://repo1.maven.org/maven2/org/apache/maven/wagon/wagon-http/2.1/wagon-http-2.1.jar
Downloaded: http://repo1.maven.org/maven2/org/apache/maven/maven-repository-metadata/3.0.4/maven-repository-metadata-3.0.4.jar (30 KB at 240.8 KB/sec)
Downloading: http://repo1.maven.org/maven2/org/apache/maven/wagon/wagon-http-shared4/2.1/wagon-http-shared4-2.1.jar
Downloaded: http://repo1.maven.org/maven2/org/apache/maven/maven-model-builder/3.0.4/maven-model-builder-3.0.4.jar (148 KB at 381.0 KB/sec)
Downloading: http://repo1.maven.org/maven2/org/jsoup/jsoup/1.6.1/jsoup-1.6.1.jar
Downloaded: http://repo1.maven.org/maven2/org/apache/maven/wagon/wagon-http/2.1/wagon-http-2.1.jar (11 KB at 87.1 KB/sec)
Downloading: http://repo1.maven.org/maven2/commons-io/commons-io/2.0.1/commons-io-2.0.1.jar
Downloaded: http://repo1.maven.org/maven2/org/apache/ant/ant/1.8.4/ant-1.8.4.jar (1897 KB at 4149.3 KB/sec)
Downloading: http://repo1.maven.org/maven2/org/eclipse/jetty/jetty-server/8.1.11.v20130520/jetty-server-8.1.11.v20130520.jar
Downloaded: http://repo1.maven.org/maven2/org/apache/maven/wagon/wagon-provider-api/1.0-beta-6/wagon-provider-api-1.0-beta-6.jar (52 KB at 363.2 KB/sec)
Downloading: http://repo1.maven.org/maven2/org/eclipse/jetty/jetty-continuation/8.1.11.v20130520/jetty-continuation-8.1.11.v20130520.jar
Downloaded: http://repo1.maven.org/maven2/org/apache/maven/wagon/wagon-http-shared4/2.1/wagon-http-shared4-2.1.jar (30 KB at 206.3 KB/sec)
Downloading: http://repo1.maven.org/maven2/org/eclipse/jetty/jetty-http/8.1.11.v20130520/jetty-http-8.1.11.v20130520.jar
Downloaded: http://repo1.maven.org/maven2/org/eclipse/jetty/jetty-continuation/8.1.11.v20130520/jetty-continuation-8.1.11.v20130520.jar (21 KB at 166.5 KB/sec)
Downloading: http://repo1.maven.org/maven2/org/eclipse/jetty/jetty-io/8.1.11.v20130520/jetty-io-8.1.11.v20130520.jar
Downloaded: http://repo1.maven.org/maven2/org/jsoup/jsoup/1.6.1/jsoup-1.6.1.jar (275 KB at 1049.5 KB/sec)
Downloading: http://repo1.maven.org/maven2/org/eclipse/jetty/jetty-util/8.1.11.v20130520/jetty-util-8.1.11.v20130520.jar
Downloaded: http://repo1.maven.org/maven2/commons-io/commons-io/2.0.1/commons-io-2.0.1.jar (156 KB at 734.8 KB/sec)
Downloading: http://repo1.maven.org/maven2/com/yammer/metrics/metrics-jetty/2.2.0/metrics-jetty-2.2.0.jar
Downloaded: http://repo1.maven.org/maven2/org/eclipse/jetty/jetty-http/8.1.11.v20130520/jetty-http-8.1.11.v20130520.jar (94 KB at 553.3 KB/sec)
Downloading: http://repo1.maven.org/maven2/commons-codec/commons-codec/1.6/commons-codec-1.6.jar
Downloaded: http://repo1.maven.org/maven2/org/eclipse/jetty/jetty-server/8.1.11.v20130520/jetty-server-8.1.11.v20130520.jar (345 KB at 1293.4 KB/sec)
Downloading: http://repo1.maven.org/maven2/javax/ws/rs/jsr311-api/1.1.1/jsr311-api-1.1.1.jar
Downloaded: http://repo1.maven.org/maven2/org/eclipse/jetty/jetty-io/8.1.11.v20130520/jetty-io-8.1.11.v20130520.jar (102 KB at 520.4 KB/sec)
Downloading: http://repo1.maven.org/maven2/com/sun/jersey/jersey-core/1.17.1/jersey-core-1.17.1.jar
Downloaded: http://repo1.maven.org/maven2/com/yammer/metrics/metrics-jetty/2.2.0/metrics-jetty-2.2.0.jar (21 KB at 143.9 KB/sec)
Downloading: http://repo1.maven.org/maven2/javax/validation/validation-api/1.1.0.Final/validation-api-1.1.0.Final.jar
Downloaded: http://repo1.maven.org/maven2/javax/ws/rs/jsr311-api/1.1.1/jsr311-api-1.1.1.jar (46 KB at 316.6 KB/sec)
Downloading: http://repo1.maven.org/maven2/com/sun/jersey/jersey-client/1.17.1/jersey-client-1.17.1.jar
Downloaded: http://repo1.maven.org/maven2/commons-codec/commons-codec/1.6/commons-codec-1.6.jar (228 KB at 959.1 KB/sec)
Downloading: http://repo1.maven.org/maven2/com/sun/jersey/jersey-json/1.17.1/jersey-json-1.17.1.jar
Downloaded: http://repo1.maven.org/maven2/javax/validation/validation-api/1.1.0.Final/validation-api-1.1.0.Final.jar (63 KB at 372.9 KB/sec)
Downloading: http://repo1.maven.org/maven2/com/sun/xml/bind/jaxb-impl/2.2.3-1/jaxb-impl-2.2.3-1.jar
Downloaded: http://repo1.maven.org/maven2/org/eclipse/jetty/jetty-util/8.1.11.v20130520/jetty-util-8.1.11.v20130520.jar (280 KB at 787.4 KB/sec)
Downloading: http://repo1.maven.org/maven2/org/codehaus/jackson/jackson-jaxrs/1.9.2/jackson-jaxrs-1.9.2.jar
Downloaded: http://repo1.maven.org/maven2/com/sun/jersey/jersey-client/1.17.1/jersey-client-1.17.1.jar (128 KB at 669.3 KB/sec)
Downloading: http://repo1.maven.org/maven2/org/codehaus/jackson/jackson-xc/1.9.2/jackson-xc-1.9.2.jar
Downloaded: http://repo1.maven.org/maven2/com/sun/jersey/jersey-core/1.17.1/jersey-core-1.17.1.jar (457 KB at 1495.5 KB/sec)
Downloading: http://repo1.maven.org/maven2/com/sun/jersey/contribs/jersey-apache-client4/1.17.1/jersey-apache-client4-1.17.1.jar
Downloaded: http://repo1.maven.org/maven2/org/codehaus/jackson/jackson-jaxrs/1.9.2/jackson-jaxrs-1.9.2.jar (18 KB at 147.9 KB/sec)
Downloading: http://repo1.maven.org/maven2/info/cukes/cucumber-junit/1.1.1/cucumber-junit-1.1.1.jar
Downloaded: http://repo1.maven.org/maven2/com/sun/jersey/jersey-json/1.17.1/jersey-json-1.17.1.jar (160 KB at 726.1 KB/sec)
Downloading: http://repo1.maven.org/maven2/info/cukes/cucumber-core/1.1.1/cucumber-core-1.1.1.jar
Downloaded: http://repo1.maven.org/maven2/org/codehaus/jackson/jackson-xc/1.9.2/jackson-xc-1.9.2.jar (27 KB at 213.2 KB/sec)
Downloading: http://repo1.maven.org/maven2/info/cukes/cucumber-guice/1.1.1/cucumber-guice-1.1.1.jar
Downloaded: http://repo1.maven.org/maven2/com/sun/jersey/contribs/jersey-apache-client4/1.17.1/jersey-apache-client4-1.17.1.jar (16 KB at 126.1 KB/sec)
Downloading: http://repo1.maven.org/maven2/info/cukes/cucumber-java/1.1.1/cucumber-java-1.1.1.jar
Downloaded: http://repo1.maven.org/maven2/info/cukes/cucumber-junit/1.1.1/cucumber-junit-1.1.1.jar (21 KB at 144.4 KB/sec)
Downloading: http://repo1.maven.org/maven2/org/databene/contiperf/2.2.0/contiperf-2.2.0.jar
Downloaded: http://repo1.maven.org/maven2/info/cukes/cucumber-guice/1.1.1/cucumber-guice-1.1.1.jar (8 KB at 53.2 KB/sec)
Downloading: http://repo1.maven.org/maven2/org/hamcrest/hamcrest-library/1.3/hamcrest-library-1.3.jar
Downloaded: http://repo1.maven.org/maven2/com/sun/xml/bind/jaxb-impl/2.2.3-1/jaxb-impl-2.2.3-1.jar (870 KB at 2055.1 KB/sec)
Downloading: http://repo1.maven.org/maven2/org/easytesting/fest-assert-core/2.0M10/fest-assert-core-2.0M10.jar
Downloaded: http://repo1.maven.org/maven2/info/cukes/cucumber-java/1.1.1/cucumber-java-1.1.1.jar (167 KB at 753.2 KB/sec)
Downloading: http://repo1.maven.org/maven2/org/easytesting/fest-util/1.2.5/fest-util-1.2.5.jar
Downloaded: http://repo1.maven.org/maven2/org/databene/contiperf/2.2.0/contiperf-2.2.0.jar (104 KB at 546.9 KB/sec)
Downloading: http://repo1.maven.org/maven2/org/incava/java-diff/1.1/java-diff-1.1.jar
Downloaded: http://repo1.maven.org/maven2/org/hamcrest/hamcrest-library/1.3/hamcrest-library-1.3.jar (52 KB at 319.9 KB/sec)
Downloading: http://repo1.maven.org/maven2/org/objenesis/objenesis/1.3/objenesis-1.3.jar
Downloaded: http://repo1.maven.org/maven2/org/easytesting/fest-util/1.2.5/fest-util-1.2.5.jar (32 KB at 258.1 KB/sec)
Downloading: http://repo1.maven.org/maven2/org/mockito/mockito-core/1.9.5/mockito-core-1.9.5.jar
Downloaded: http://repo1.maven.org/maven2/org/incava/java-diff/1.1/java-diff-1.1.jar (10 KB at 69.1 KB/sec)
Downloading: http://repo1.maven.org/maven2/org/powermock/powermock-module-junit4/1.5/powermock-module-junit4-1.5.jar
Downloaded: http://repo1.maven.org/maven2/info/cukes/cucumber-core/1.1.1/cucumber-core-1.1.1.jar (2107 KB at 4407.0 KB/sec)
Downloading: http://repo1.maven.org/maven2/org/powermock/powermock-module-junit4-common/1.5/powermock-module-junit4-common-1.5.jar
Downloaded: http://repo1.maven.org/maven2/org/objenesis/objenesis/1.3/objenesis-1.3.jar (40 KB at 269.5 KB/sec)
Downloading: http://repo1.maven.org/maven2/org/powermock/powermock-reflect/1.5/powermock-reflect-1.5.jar
Downloaded: http://repo1.maven.org/maven2/org/easytesting/fest-assert-core/2.0M10/fest-assert-core-2.0M10.jar (262 KB at 993.6 KB/sec)
Downloading: http://repo1.maven.org/maven2/org/powermock/powermock-api-mockito/1.5/powermock-api-mockito-1.5.jar
Downloaded: http://repo1.maven.org/maven2/org/powermock/powermock-module-junit4-common/1.5/powermock-module-junit4-common-1.5.jar (14 KB at 133.0 KB/sec)
Downloading: http://repo1.maven.org/maven2/org/powermock/powermock-api-support/1.5/powermock-api-support-1.5.jar
Downloaded: http://repo1.maven.org/maven2/org/powermock/powermock-module-junit4/1.5/powermock-module-junit4-1.5.jar (26 KB at 207.9 KB/sec)
Downloading: http://repo1.maven.org/maven2/org/powermock/powermock-module-junit4-rule/1.5/powermock-module-junit4-rule-1.5.jar
Downloaded: http://repo1.maven.org/maven2/org/powermock/powermock-reflect/1.5/powermock-reflect-1.5.jar (43 KB at 287.4 KB/sec)
Downloading: http://repo1.maven.org/maven2/org/powermock/powermock-classloading-base/1.5/powermock-classloading-base-1.5.jar
Downloaded: http://repo1.maven.org/maven2/org/powermock/powermock-module-junit4-rule/1.5/powermock-module-junit4-rule-1.5.jar (7 KB at 64.3 KB/sec)
Downloading: http://repo1.maven.org/maven2/org/powermock/powermock-core/1.5/powermock-core-1.5.jar
Downloaded: http://repo1.maven.org/maven2/org/powermock/powermock-api-mockito/1.5/powermock-api-mockito-1.5.jar (67 KB at 397.3 KB/sec)
Downloading: http://repo1.maven.org/maven2/org/javassist/javassist/3.17.1-GA/javassist-3.17.1-GA.jar
Downloaded: http://repo1.maven.org/maven2/org/powermock/powermock-api-support/1.5/powermock-api-support-1.5.jar (19 KB at 152.1 KB/sec)
Downloading: http://repo1.maven.org/maven2/org/powermock/powermock-classloading-xstream/1.5/powermock-classloading-xstream-1.5.jar
Downloaded: http://repo1.maven.org/maven2/org/powermock/powermock-classloading-base/1.5/powermock-classloading-base-1.5.jar (5 KB at 48.8 KB/sec)
Downloading: http://repo1.maven.org/maven2/org/codehaus/groovy/groovy-all/2.0.6/groovy-all-2.0.6.jar
Downloaded: http://repo1.maven.org/maven2/org/powermock/powermock-classloading-xstream/1.5/powermock-classloading-xstream-1.5.jar (3 KB at 27.9 KB/sec)
Downloading: http://repo1.maven.org/maven2/org/codehaus/groovy/modules/remote/remote-core/0.5/remote-core-0.5.jar
Downloaded: http://repo1.maven.org/maven2/org/mockito/mockito-core/1.9.5/mockito-core-1.9.5.jar (1465 KB at 3608.0 KB/sec)
Downloading: http://repo1.maven.org/maven2/org/codehaus/groovy/modules/remote/remote-transport-http/0.5/remote-transport-http-0.5.jar
Downloaded: http://repo1.maven.org/maven2/org/powermock/powermock-core/1.5/powermock-core-1.5.jar (83 KB at 490.3 KB/sec)
Downloaded: http://repo1.maven.org/maven2/org/codehaus/groovy/modules/remote/remote-transport-http/0.5/remote-transport-http-0.5.jar (25 KB at 191.9 KB/sec)
Downloaded: http://repo1.maven.org/maven2/org/codehaus/groovy/modules/remote/remote-core/0.5/remote-core-0.5.jar (77 KB at 461.8 KB/sec)
Downloaded: http://repo1.maven.org/maven2/org/javassist/javassist/3.17.1-GA/javassist-3.17.1-GA.jar (696 KB at 1947.6 KB/sec)
Downloaded: http://repo1.maven.org/maven2/org/codehaus/groovy/groovy-all/2.0.6/groovy-all-2.0.6.jar (6080 KB at 7874.9 KB/sec)
[INFO] 
[INFO] --- maven-clean-plugin:2.4.1:clean (default-clean) @ unzip-repository-plugin-its ---
[INFO] 
[INFO] --- maven-resources-plugin:2.4.3:resources (default-resources) @ unzip-repository-plugin-its ---
Downloading: https://repository.sonatype.org/content/groups/forge/org/apache/maven/shared/maven-filtering/1.0-beta-4/maven-filtering-1.0-beta-4.pom
Downloading: http://repo1.maven.org/maven2/org/apache/maven/shared/maven-filtering/1.0-beta-4/maven-filtering-1.0-beta-4.pom
Downloaded: http://repo1.maven.org/maven2/org/apache/maven/shared/maven-filtering/1.0-beta-4/maven-filtering-1.0-beta-4.pom (5 KB at 45.0 KB/sec)
Downloading: https://repository.sonatype.org/content/groups/forge/org/apache/maven/shared/maven-shared-components/15/maven-shared-components-15.pom
[WARNING] Checksum validation failed, no checksums available from the repository for https://repository.sonatype.org/content/groups/forge/org/apache/maven/shared/maven-shared-components/15/maven-shared-components-15.pom
Downloaded: https://repository.sonatype.org/content/groups/forge/org/apache/maven/shared/maven-shared-components/15/maven-shared-components-15.pom (10 KB at 19.4 KB/sec)
Downloading: https://repository.sonatype.org/content/groups/forge/org/codehaus/plexus/plexus-interpolation/1.13/plexus-interpolation-1.13.pom
Downloaded: https://repository.sonatype.org/content/groups/forge/org/codehaus/plexus/plexus-interpolation/1.13/plexus-interpolation-1.13.pom (890 B at 3.4 KB/sec)
Downloading: https://repository.sonatype.org/content/groups/forge/org/codehaus/plexus/plexus-components/1.1.15/plexus-components-1.1.15.pom
Downloaded: https://repository.sonatype.org/content/groups/forge/org/codehaus/plexus/plexus-components/1.1.15/plexus-components-1.1.15.pom (3 KB at 10.8 KB/sec)
Downloading: https://repository.sonatype.org/content/groups/forge/org/apache/maven/shared/maven-filtering/1.0-beta-4/maven-filtering-1.0-beta-4.jar
Downloading: https://repository.sonatype.org/content/groups/forge/org/codehaus/plexus/plexus-interpolation/1.13/plexus-interpolation-1.13.jar
Downloaded: https://repository.sonatype.org/content/groups/forge/org/codehaus/plexus/plexus-interpolation/1.13/plexus-interpolation-1.13.jar (60 KB at 182.3 KB/sec)
Downloading: http://repo1.maven.org/maven2/org/apache/maven/shared/maven-filtering/1.0-beta-4/maven-filtering-1.0-beta-4.jar
Downloaded: http://repo1.maven.org/maven2/org/apache/maven/shared/maven-filtering/1.0-beta-4/maven-filtering-1.0-beta-4.jar (34 KB at 229.3 KB/sec)
[INFO] Using 'UTF-8' encoding to copy filtered resources.
[INFO] Copying 1 resource
[INFO] Copying 0 resource
[INFO] 
[INFO] --- maven-compiler-plugin:2.5.1:compile (default-compile) @ unzip-repository-plugin-its ---
[INFO] No sources to compile
[INFO] 
[INFO] --- maven-resources-plugin:2.4.3:testResources (default-testResources) @ unzip-repository-plugin-its ---
[INFO] Using 'UTF-8' encoding to copy filtered resources.
[INFO] Copying 1 resource
[INFO] 
[INFO] --- maven-compiler-plugin:2.5.1:testCompile (default-testCompile) @ unzip-repository-plugin-its ---
[INFO] Compiling 2 source files to /jobs/genie.technology.tycho/tycho.nexus-nightly/workspace/unzip-repository-plugin-its/target/test-classes
[INFO] 
[INFO] --- maven-surefire-plugin:2.7.2:test (default-test) @ unzip-repository-plugin-its ---
Downloading: https://repository.sonatype.org/content/groups/forge/org/apache/maven/surefire/surefire-booter/2.7.2/surefire-booter-2.7.2.pom
Downloading: http://repo1.maven.org/maven2/org/apache/maven/surefire/surefire-booter/2.7.2/surefire-booter-2.7.2.pom
Downloaded: http://repo1.maven.org/maven2/org/apache/maven/surefire/surefire-booter/2.7.2/surefire-booter-2.7.2.pom (2 KB at 17.5 KB/sec)
Downloading: https://repository.sonatype.org/content/groups/forge/org/apache/maven/surefire/surefire-api/2.7.2/surefire-api-2.7.2.pom
Downloading: http://repo1.maven.org/maven2/org/apache/maven/surefire/surefire-api/2.7.2/surefire-api-2.7.2.pom
Downloaded: http://repo1.maven.org/maven2/org/apache/maven/surefire/surefire-api/2.7.2/surefire-api-2.7.2.pom (2 KB at 19.2 KB/sec)
Downloading: https://repository.sonatype.org/content/groups/forge/org/apache/maven/surefire/maven-surefire-common/2.7.2/maven-surefire-common-2.7.2.pom
Downloading: http://repo1.maven.org/maven2/org/apache/maven/surefire/maven-surefire-common/2.7.2/maven-surefire-common-2.7.2.pom
Downloaded: http://repo1.maven.org/maven2/org/apache/maven/surefire/maven-surefire-common/2.7.2/maven-surefire-common-2.7.2.pom (4 KB at 36.2 KB/sec)
Downloading: https://repository.sonatype.org/content/groups/forge/org/apache/maven/shared/maven-common-artifact-filters/1.3/maven-common-artifact-filters-1.3.pom
[WARNING] Checksum validation failed, no checksums available from the repository for https://repository.sonatype.org/content/groups/forge/org/apache/maven/shared/maven-common-artifact-filters/1.3/maven-common-artifact-filters-1.3.pom
Downloaded: https://repository.sonatype.org/content/groups/forge/org/apache/maven/shared/maven-common-artifact-filters/1.3/maven-common-artifact-filters-1.3.pom (4 KB at 7.4 KB/sec)
Downloading: https://repository.sonatype.org/content/groups/forge/org/apache/maven/shared/maven-shared-components/12/maven-shared-components-12.pom
[WARNING] Checksum validation failed, no checksums available from the repository for https://repository.sonatype.org/content/groups/forge/org/apache/maven/shared/maven-shared-components/12/maven-shared-components-12.pom
Downloaded: https://repository.sonatype.org/content/groups/forge/org/apache/maven/shared/maven-shared-components/12/maven-shared-components-12.pom (10 KB at 19.6 KB/sec)
Downloading: https://repository.sonatype.org/content/groups/forge/org/apache/maven/maven-parent/13/maven-parent-13.pom
[WARNING] Checksum validation failed, no checksums available from the repository for https://repository.sonatype.org/content/groups/forge/org/apache/maven/maven-parent/13/maven-parent-13.pom
Downloaded: https://repository.sonatype.org/content/groups/forge/org/apache/maven/maven-parent/13/maven-parent-13.pom (23 KB at 46.5 KB/sec)
Downloading: https://repository.sonatype.org/content/groups/forge/org/apache/maven/surefire/surefire-booter/2.7.2/surefire-booter-2.7.2.jar
Downloading: https://repository.sonatype.org/content/groups/forge/org/apache/maven/surefire/surefire-api/2.7.2/surefire-api-2.7.2.jar
Downloading: https://repository.sonatype.org/content/groups/forge/org/apache/maven/surefire/maven-surefire-common/2.7.2/maven-surefire-common-2.7.2.jar
Downloading: https://repository.sonatype.org/content/groups/forge/org/apache/maven/shared/maven-common-artifact-filters/1.3/maven-common-artifact-filters-1.3.jar
[WARNING] Checksum validation failed, no checksums available from the repository for https://repository.sonatype.org/content/groups/forge/org/apache/maven/shared/maven-common-artifact-filters/1.3/maven-common-artifact-filters-1.3.jar
Downloaded: https://repository.sonatype.org/content/groups/forge/org/apache/maven/shared/maven-common-artifact-filters/1.3/maven-common-artifact-filters-1.3.jar (31 KB at 66.4 KB/sec)
Downloading: http://repo1.maven.org/maven2/org/apache/maven/surefire/surefire-booter/2.7.2/surefire-booter-2.7.2.jar
Downloading: http://repo1.maven.org/maven2/org/apache/maven/surefire/surefire-api/2.7.2/surefire-api-2.7.2.jar
Downloading: http://repo1.maven.org/maven2/org/apache/maven/surefire/maven-surefire-common/2.7.2/maven-surefire-common-2.7.2.jar
Downloaded: http://repo1.maven.org/maven2/org/apache/maven/surefire/surefire-booter/2.7.2/surefire-booter-2.7.2.jar (32 KB at 257.8 KB/sec)
Downloaded: http://repo1.maven.org/maven2/org/apache/maven/surefire/maven-surefire-common/2.7.2/maven-surefire-common-2.7.2.jar (60 KB at 404.7 KB/sec)
Downloaded: http://repo1.maven.org/maven2/org/apache/maven/surefire/surefire-api/2.7.2/surefire-api-2.7.2.jar (119 KB at 599.4 KB/sec)
[INFO] Surefire report directory: /jobs/genie.technology.tycho/tycho.nexus-nightly/workspace/unzip-repository-plugin-its/target/surefire-reports
Downloading: https://repository.sonatype.org/content/groups/forge/org/apache/maven/surefire/surefire-junit4/2.7.2/surefire-junit4-2.7.2.pom
Downloading: http://repo1.maven.org/maven2/org/apache/maven/surefire/surefire-junit4/2.7.2/surefire-junit4-2.7.2.pom
Downloaded: http://repo1.maven.org/maven2/org/apache/maven/surefire/surefire-junit4/2.7.2/surefire-junit4-2.7.2.pom (3 KB at 21.7 KB/sec)
Downloading: https://repository.sonatype.org/content/groups/forge/org/apache/maven/surefire/surefire-providers/2.7.2/surefire-providers-2.7.2.pom
Downloading: http://repo1.maven.org/maven2/org/apache/maven/surefire/surefire-providers/2.7.2/surefire-providers-2.7.2.pom
Downloaded: http://repo1.maven.org/maven2/org/apache/maven/surefire/surefire-providers/2.7.2/surefire-providers-2.7.2.pom (2 KB at 17.7 KB/sec)
Downloading: https://repository.sonatype.org/content/groups/forge/org/apache/maven/surefire/surefire-junit4/2.7.2/surefire-junit4-2.7.2.jar
Downloading: http://repo1.maven.org/maven2/org/apache/maven/surefire/surefire-junit4/2.7.2/surefire-junit4-2.7.2.jar
Downloaded: http://repo1.maven.org/maven2/org/apache/maven/surefire/surefire-junit4/2.7.2/surefire-junit4-2.7.2.jar (25 KB at 197.1 KB/sec)

-------------------------------------------------------
 T E S T S
-------------------------------------------------------
There are no tests to run.

Results :

Tests run: 0, Failures: 0, Errors: 0, Skipped: 0

[INFO] 
[INFO] --- maven-failsafe-plugin:2.12.4:integration-test (default) @ unzip-repository-plugin-its ---
Downloading: https://repository.sonatype.org/content/groups/forge/org/apache/maven/surefire/surefire-booter/2.12.4/surefire-booter-2.12.4.pom
Downloading: http://repo1.maven.org/maven2/org/apache/maven/surefire/surefire-booter/2.12.4/surefire-booter-2.12.4.pom
Downloaded: http://repo1.maven.org/maven2/org/apache/maven/surefire/surefire-booter/2.12.4/surefire-booter-2.12.4.pom (3 KB at 29.9 KB/sec)
Downloading: https://repository.sonatype.org/content/groups/forge/org/apache/maven/surefire/surefire-api/2.12.4/surefire-api-2.12.4.pom
Downloading: http://repo1.maven.org/maven2/org/apache/maven/surefire/surefire-api/2.12.4/surefire-api-2.12.4.pom
Downloaded: http://repo1.maven.org/maven2/org/apache/maven/surefire/surefire-api/2.12.4/surefire-api-2.12.4.pom (3 KB at 24.1 KB/sec)
Downloading: https://repository.sonatype.org/content/groups/forge/org/apache/maven/surefire/maven-surefire-common/2.12.4/maven-surefire-common-2.12.4.pom
Downloading: http://repo1.maven.org/maven2/org/apache/maven/surefire/maven-surefire-common/2.12.4/maven-surefire-common-2.12.4.pom
Downloaded: http://repo1.maven.org/maven2/org/apache/maven/surefire/maven-surefire-common/2.12.4/maven-surefire-common-2.12.4.pom (6 KB at 52.9 KB/sec)
Downloading: https://repository.sonatype.org/content/groups/forge/org/apache/maven/plugin-tools/maven-plugin-annotations/3.1/maven-plugin-annotations-3.1.pom
Downloading: http://repo1.maven.org/maven2/org/apache/maven/plugin-tools/maven-plugin-annotations/3.1/maven-plugin-annotations-3.1.pom
Downloaded: http://repo1.maven.org/maven2/org/apache/maven/plugin-tools/maven-plugin-annotations/3.1/maven-plugin-annotations-3.1.pom (2 KB at 16.3 KB/sec)
Downloading: https://repository.sonatype.org/content/groups/forge/org/apache/maven/plugin-tools/maven-plugin-tools/3.1/maven-plugin-tools-3.1.pom
Downloading: http://repo1.maven.org/maven2/org/apache/maven/plugin-tools/maven-plugin-tools/3.1/maven-plugin-tools-3.1.pom
Downloaded: http://repo1.maven.org/maven2/org/apache/maven/plugin-tools/maven-plugin-tools/3.1/maven-plugin-tools-3.1.pom (16 KB at 127.5 KB/sec)
Downloading: https://repository.sonatype.org/content/groups/forge/org/apache/commons/commons-lang3/3.1/commons-lang3-3.1.pom
Downloading: http://repo1.maven.org/maven2/org/apache/commons/commons-lang3/3.1/commons-lang3-3.1.pom
Downloaded: http://repo1.maven.org/maven2/org/apache/commons/commons-lang3/3.1/commons-lang3-3.1.pom (17 KB at 131.6 KB/sec)
Downloading: https://repository.sonatype.org/content/groups/forge/org/apache/maven/surefire/surefire-booter/2.12.4/surefire-booter-2.12.4.jar
Downloading: https://repository.sonatype.org/content/groups/forge/org/apache/maven/surefire/surefire-api/2.12.4/surefire-api-2.12.4.jar
Downloading: https://repository.sonatype.org/content/groups/forge/org/apache/maven/surefire/maven-surefire-common/2.12.4/maven-surefire-common-2.12.4.jar
Downloading: https://repository.sonatype.org/content/groups/forge/org/apache/commons/commons-lang3/3.1/commons-lang3-3.1.jar
Downloading: https://repository.sonatype.org/content/groups/forge/org/apache/maven/plugin-tools/maven-plugin-annotations/3.1/maven-plugin-annotations-3.1.jar
Downloading: http://repo1.maven.org/maven2/org/apache/maven/surefire/surefire-booter/2.12.4/surefire-booter-2.12.4.jar
Downloading: http://repo1.maven.org/maven2/org/apache/maven/surefire/surefire-api/2.12.4/surefire-api-2.12.4.jar
Downloading: http://repo1.maven.org/maven2/org/apache/maven/surefire/maven-surefire-common/2.12.4/maven-surefire-common-2.12.4.jar
Downloading: http://repo1.maven.org/maven2/org/apache/commons/commons-lang3/3.1/commons-lang3-3.1.jar
Downloading: http://repo1.maven.org/maven2/org/apache/maven/plugin-tools/maven-plugin-annotations/3.1/maven-plugin-annotations-3.1.jar
Downloaded: http://repo1.maven.org/maven2/org/apache/maven/plugin-tools/maven-plugin-annotations/3.1/maven-plugin-annotations-3.1.jar (14 KB at 135.6 KB/sec)
Downloaded: http://repo1.maven.org/maven2/org/apache/maven/surefire/surefire-booter/2.12.4/surefire-booter-2.12.4.jar (34 KB at 233.6 KB/sec)
Downloaded: http://repo1.maven.org/maven2/org/apache/maven/surefire/surefire-api/2.12.4/surefire-api-2.12.4.jar (115 KB at 601.2 KB/sec)
Downloaded: http://repo1.maven.org/maven2/org/apache/maven/surefire/maven-surefire-common/2.12.4/maven-surefire-common-2.12.4.jar (257 KB at 1046.8 KB/sec)
Downloaded: http://repo1.maven.org/maven2/org/apache/commons/commons-lang3/3.1/commons-lang3-3.1.jar (309 KB at 1146.5 KB/sec)
[INFO] Failsafe report directory: /jobs/genie.technology.tycho/tycho.nexus-nightly/workspace/unzip-repository-plugin-its/target/failsafe-reports
Downloading: https://repository.sonatype.org/content/groups/forge/org/apache/maven/surefire/surefire-junit4/2.12.4/surefire-junit4-2.12.4.pom
Downloading: http://repo1.maven.org/maven2/org/apache/maven/surefire/surefire-junit4/2.12.4/surefire-junit4-2.12.4.pom
Downloaded: http://repo1.maven.org/maven2/org/apache/maven/surefire/surefire-junit4/2.12.4/surefire-junit4-2.12.4.pom (3 KB at 23.8 KB/sec)
Downloading: https://repository.sonatype.org/content/groups/forge/org/apache/maven/surefire/surefire-providers/2.12.4/surefire-providers-2.12.4.pom
Downloading: http://repo1.maven.org/maven2/org/apache/maven/surefire/surefire-providers/2.12.4/surefire-providers-2.12.4.pom
Downloaded: http://repo1.maven.org/maven2/org/apache/maven/surefire/surefire-providers/2.12.4/surefire-providers-2.12.4.pom (3 KB at 22.9 KB/sec)
Downloading: https://repository.sonatype.org/content/groups/forge/org/apache/maven/surefire/surefire-junit4/2.12.4/surefire-junit4-2.12.4.jar
Downloading: http://repo1.maven.org/maven2/org/apache/maven/surefire/surefire-junit4/2.12.4/surefire-junit4-2.12.4.jar
Downloaded: http://repo1.maven.org/maven2/org/apache/maven/surefire/surefire-junit4/2.12.4/surefire-junit4-2.12.4.jar (37 KB at 243.6 KB/sec)

-------------------------------------------------------
 T E S T S
-------------------------------------------------------
Running org.eclipse.tycho.nexus.internal.plugin.UnzipRepositoryPluginITCase
15:35:58.266 INFO [main] org.eclipse.tycho.nexus.internal.plugin.UnzipRepositoryPluginITCase - TEST testUnzipRepoWithHostedRepoAsMaster[0] STARTING
15:36:00.997 INFO [main] org.eclipse.tycho.nexus.internal.plugin.UnzipRepositoryPluginITCase - TEST testUnzipRepoWithHostedRepoAsMaster[0] is running against Nexus bundle org.sonatype.nexus.assemblies:nexus-bundle-template:zip:bundle:2.6.0-01
 wagon http use multi threaded http connection manager maxPerRoute 20, max total 40
15:36:01.410 INFO [pool-1-thread-1] org.sonatype.sisu.maven.bridge.support.session.MavenBridgeRepositorySystemSession - Downloading http://repo.maven.apache.org/maven2/org/sonatype/nexus/nexus-it-helper-plugin/2.6.0-01/nexus-it-helper-plugin-2.6.0-01-bundle.zip...
15:36:01.862 INFO [pool-1-thread-1] org.sonatype.sisu.maven.bridge.support.session.MavenBridgeRepositorySystemSession - Downloaded [42525 bytes] http://repo.maven.apache.org/maven2/org/sonatype/nexus/nexus-it-helper-plugin/2.6.0-01/nexus-it-helper-plugin-2.6.0-01-bundle.zip
15:36:01.955 INFO [main] org.sonatype.nexus.testsuite.support.NexusRunningITSupport - Starting Nexus (nexus bundle [id: nx] [not running])
15:36:01.972 INFO [pool-2-thread-1] org.sonatype.sisu.maven.bridge.support.session.MavenBridgeRepositorySystemSession - Downloading http://repo.maven.apache.org/maven2/org/sonatype/nexus/assemblies/nexus-bundle-template/2.6.0-01/nexus-bundle-template-2.6.0-01-bundle.zip...
15:36:07.408 INFO [pool-2-thread-1] org.sonatype.sisu.maven.bridge.support.session.MavenBridgeRepositorySystemSession - Downloaded [41094034 bytes] http://repo.maven.apache.org/maven2/org/sonatype/nexus/assemblies/nexus-bundle-template/2.6.0-01/nexus-bundle-template-2.6.0-01-bundle.zip
15:36:08.789 INFO [main] org.sonatype.nexus.bundle.launcher.support.DefaultNexusBundle - nexus (nx) spawned env [org.sonatype.nexus.bootstrap.monitor.CommandMonitorThread.port=54741,org.sonatype.nexus.bootstrap.monitor.KeepAliveThread.port=58089]
15:36:08.799 INFO [main] org.sonatype.nexus.bundle.launcher.support.DefaultNexusBundle - nexus (nx) pinging command monitor at 127.0.0.1:54741
15:36:19.836 INFO [main] org.eclipse.tycho.nexus.internal.plugin.UnzipRepositoryPluginITCase - TEST testUnzipRepoWithHostedRepoAsMaster[0] FAILED
java.lang.RuntimeException: nexus (nx) no command monitor detected at 127.0.0.1:54741 within 10 seconds
	at org.sonatype.nexus.bundle.launcher.support.DefaultNexusBundle.startApplication(DefaultNexusBundle.java:379) ~[nexus-launcher-2.6.0-01.jar:2.6.0-01]
	at org.sonatype.sisu.bl.support.DefaultBundle.doStart(DefaultBundle.java:151) ~[sisu-bundle-launcher-1.5.2.jar:1.5.2]
	at org.sonatype.sisu.bl.internal.support.BundleLifecycle$Handler.doStart(BundleLifecycle.java:166) ~[sisu-bundle-launcher-1.5.2.jar:1.5.2]
	at org.sonatype.sisu.bl.internal.support.LifecycleHandlerContext$MainMap_Starting.perform(LifecycleHandlerContext.java:545) ~[sisu-bundle-launcher-1.5.2.jar:1.5.2]
	at org.sonatype.sisu.bl.internal.support.LifecycleHandlerContext.perform(LifecycleHandlerContext.java:57) ~[sisu-bundle-launcher-1.5.2.jar:1.5.2]
	at org.sonatype.sisu.bl.internal.support.BundleLifecycle.start(BundleLifecycle.java:88) ~[sisu-bundle-launcher-1.5.2.jar:1.5.2]
	at org.sonatype.nexus.testsuite.support.NexusRunningITSupport.startNexus(NexusRunningITSupport.java:249) ~[nexus-testsuite-support-2.6.0-01.jar:2.6.0-01]
	at org.sonatype.nexus.testsuite.support.NexusRunningITSupport.beforeTestIsRunning(NexusRunningITSupport.java:99) ~[nexus-testsuite-support-2.6.0-01.jar:2.6.0-01]
	at sun.reflect.NativeMethodAccessorImpl.invoke0(Native Method) ~[na:1.7.0_25]
	at sun.reflect.NativeMethodAccessorImpl.invoke(NativeMethodAccessorImpl.java:57) ~[na:1.7.0_25]
	at sun.reflect.DelegatingMethodAccessorImpl.invoke(DelegatingMethodAccessorImpl.java:43) ~[na:1.7.0_25]
	at java.lang.reflect.Method.invoke(Method.java:606) ~[na:1.7.0_25]
	at org.junit.runners.model.FrameworkMethod$1.runReflectiveCall(FrameworkMethod.java:47) ~[junit-4.11.jar:na]
	at org.junit.internal.runners.model.ReflectiveCallable.run(ReflectiveCallable.java:12) ~[junit-4.11.jar:na]
	at org.junit.runners.model.FrameworkMethod.invokeExplosively(FrameworkMethod.java:44) ~[junit-4.11.jar:na]
	at org.junit.internal.runners.statements.RunBefores.evaluate(RunBefores.java:24) ~[junit-4.11.jar:na]
	at org.junit.internal.runners.statements.RunAfters.evaluate(RunAfters.java:27) ~[junit-4.11.jar:na]
	at org.junit.rules.TestWatcher$1.evaluate(TestWatcher.java:55) [junit-4.11.jar:na]
	at org.junit.rules.TestWatcher$1.evaluate(TestWatcher.java:55) [junit-4.11.jar:na]
	at org.junit.rules.TestWatcher$1.evaluate(TestWatcher.java:55) [junit-4.11.jar:na]
	at org.junit.rules.TestWatcher$1.evaluate(TestWatcher.java:55) [junit-4.11.jar:na]
	at org.junit.rules.RunRules.evaluate(RunRules.java:20) ~[junit-4.11.jar:na]
	at org.junit.runners.ParentRunner.runLeaf(ParentRunner.java:271) ~[junit-4.11.jar:na]
	at org.junit.runners.BlockJUnit4ClassRunner.runChild(BlockJUnit4ClassRunner.java:70) ~[junit-4.11.jar:na]
	at org.junit.runners.BlockJUnit4ClassRunner.runChild(BlockJUnit4ClassRunner.java:50) ~[junit-4.11.jar:na]
	at org.junit.runners.ParentRunner$3.run(ParentRunner.java:238) ~[junit-4.11.jar:na]
	at org.junit.runners.ParentRunner$1.schedule(ParentRunner.java:63) ~[junit-4.11.jar:na]
	at org.junit.runners.ParentRunner.runChildren(ParentRunner.java:236) ~[junit-4.11.jar:na]
	at org.junit.runners.ParentRunner.access$000(ParentRunner.java:53) ~[junit-4.11.jar:na]
	at org.junit.runners.ParentRunner$2.evaluate(ParentRunner.java:229) ~[junit-4.11.jar:na]
	at org.junit.runners.ParentRunner.run(ParentRunner.java:309) ~[junit-4.11.jar:na]
	at org.junit.runners.Suite.runChild(Suite.java:127) ~[junit-4.11.jar:na]
	at org.junit.runners.Suite.runChild(Suite.java:26) ~[junit-4.11.jar:na]
	at org.junit.runners.ParentRunner$3.run(ParentRunner.java:238) ~[junit-4.11.jar:na]
	at org.junit.runners.ParentRunner$1.schedule(ParentRunner.java:63) ~[junit-4.11.jar:na]
	at org.junit.runners.ParentRunner.runChildren(ParentRunner.java:236) ~[junit-4.11.jar:na]
	at org.junit.runners.ParentRunner.access$000(ParentRunner.java:53) ~[junit-4.11.jar:na]
	at org.junit.runners.ParentRunner$2.evaluate(ParentRunner.java:229) ~[junit-4.11.jar:na]
	at org.junit.internal.runners.statements.RunBefores.evaluate(RunBefores.java:26) ~[junit-4.11.jar:na]
	at org.junit.internal.runners.statements.RunAfters.evaluate(RunAfters.java:27) ~[junit-4.11.jar:na]
	at org.junit.runners.ParentRunner.run(ParentRunner.java:309) ~[junit-4.11.jar:na]
	at org.apache.maven.surefire.junit4.JUnit4Provider.execute(JUnit4Provider.java:252) ~[na:na]
	at org.apache.maven.surefire.junit4.JUnit4Provider.executeTestSet(JUnit4Provider.java:141) ~[na:na]
	at org.apache.maven.surefire.junit4.JUnit4Provider.invoke(JUnit4Provider.java:112) ~[na:na]
	at sun.reflect.NativeMethodAccessorImpl.invoke0(Native Method) ~[na:1.7.0_25]
	at sun.reflect.NativeMethodAccessorImpl.invoke(NativeMethodAccessorImpl.java:57) ~[na:1.7.0_25]
	at sun.reflect.DelegatingMethodAccessorImpl.invoke(DelegatingMethodAccessorImpl.java:43) ~[na:1.7.0_25]
	at java.lang.reflect.Method.invoke(Method.java:606) ~[na:1.7.0_25]
	at org.apache.maven.surefire.util.ReflectionUtils.invokeMethodWithArray(ReflectionUtils.java:189) ~[surefire-api-2.12.4.jar:2.12.4]
	at org.apache.maven.surefire.booter.ProviderFactory$ProviderProxy.invoke(ProviderFactory.java:165) ~[surefire-booter-2.12.4.jar:2.12.4]
	at org.apache.maven.surefire.booter.ProviderFactory.invokeProvider(ProviderFactory.java:85) ~[surefire-booter-2.12.4.jar:2.12.4]
	at org.apache.maven.surefire.booter.ForkedBooter.runSuitesInProcess(ForkedBooter.java:115) ~[surefire-booter-2.12.4.jar:2.12.4]
	at org.apache.maven.surefire.booter.ForkedBooter.main(ForkedBooter.java:75) ~[surefire-booter-2.12.4.jar:2.12.4]
15:36:19.837 INFO [main] org.eclipse.tycho.nexus.internal.plugin.UnzipRepositoryPluginITCase - TEST testUnzipRepoWithHostedRepoAsMaster[0] FINISHED
15:36:19.841 INFO [main] org.eclipse.tycho.nexus.internal.plugin.UnzipRepositoryPluginITCase - TEST testUnzipRepoWithGroupRepoAsMaster[0] STARTING
15:36:19.985 INFO [main] org.eclipse.tycho.nexus.internal.plugin.UnzipRepositoryPluginITCase - TEST testUnzipRepoWithGroupRepoAsMaster[0] is running against Nexus bundle org.sonatype.nexus.assemblies:nexus-bundle-template:zip:bundle:2.6.0-01
15:36:20.026 INFO [main] org.sonatype.nexus.testsuite.support.NexusRunningITSupport - Starting Nexus (nexus bundle [id: nx] [not running])
15:36:20.042 INFO [main] org.eclipse.tycho.nexus.internal.plugin.UnzipRepositoryPluginITCase - TEST testUnzipRepoWithGroupRepoAsMaster[0] FAILED
java.lang.AssertionError: Nexus was not in running state
	at org.hamcrest.MatcherAssert.assertThat(MatcherAssert.java:26) ~[hamcrest-core-1.3.jar:1.3]
	at org.sonatype.nexus.testsuite.support.NexusRunningITSupport.beforeTestIsRunning(NexusRunningITSupport.java:114) ~[nexus-testsuite-support-2.6.0-01.jar:2.6.0-01]
	at sun.reflect.NativeMethodAccessorImpl.invoke0(Native Method) ~[na:1.7.0_25]
	at sun.reflect.NativeMethodAccessorImpl.invoke(NativeMethodAccessorImpl.java:57) ~[na:1.7.0_25]
	at sun.reflect.DelegatingMethodAccessorImpl.invoke(DelegatingMethodAccessorImpl.java:43) ~[na:1.7.0_25]
	at java.lang.reflect.Method.invoke(Method.java:606) ~[na:1.7.0_25]
	at org.junit.runners.model.FrameworkMethod$1.runReflectiveCall(FrameworkMethod.java:47) ~[junit-4.11.jar:na]
	at org.junit.internal.runners.model.ReflectiveCallable.run(ReflectiveCallable.java:12) ~[junit-4.11.jar:na]
	at org.junit.runners.model.FrameworkMethod.invokeExplosively(FrameworkMethod.java:44) ~[junit-4.11.jar:na]
	at org.junit.internal.runners.statements.RunBefores.evaluate(RunBefores.java:24) ~[junit-4.11.jar:na]
	at org.junit.internal.runners.statements.RunAfters.evaluate(RunAfters.java:27) ~[junit-4.11.jar:na]
	at org.junit.rules.TestWatcher$1.evaluate(TestWatcher.java:55) [junit-4.11.jar:na]
	at org.junit.rules.TestWatcher$1.evaluate(TestWatcher.java:55) [junit-4.11.jar:na]
	at org.junit.rules.TestWatcher$1.evaluate(TestWatcher.java:55) [junit-4.11.jar:na]
	at org.junit.rules.TestWatcher$1.evaluate(TestWatcher.java:55) [junit-4.11.jar:na]
	at org.junit.rules.RunRules.evaluate(RunRules.java:20) ~[junit-4.11.jar:na]
	at org.junit.runners.ParentRunner.runLeaf(ParentRunner.java:271) ~[junit-4.11.jar:na]
	at org.junit.runners.BlockJUnit4ClassRunner.runChild(BlockJUnit4ClassRunner.java:70) ~[junit-4.11.jar:na]
	at org.junit.runners.BlockJUnit4ClassRunner.runChild(BlockJUnit4ClassRunner.java:50) ~[junit-4.11.jar:na]
	at org.junit.runners.ParentRunner$3.run(ParentRunner.java:238) ~[junit-4.11.jar:na]
	at org.junit.runners.ParentRunner$1.schedule(ParentRunner.java:63) ~[junit-4.11.jar:na]
	at org.junit.runners.ParentRunner.runChildren(ParentRunner.java:236) ~[junit-4.11.jar:na]
	at org.junit.runners.ParentRunner.access$000(ParentRunner.java:53) ~[junit-4.11.jar:na]
	at org.junit.runners.ParentRunner$2.evaluate(ParentRunner.java:229) ~[junit-4.11.jar:na]
	at org.junit.runners.ParentRunner.run(ParentRunner.java:309) ~[junit-4.11.jar:na]
	at org.junit.runners.Suite.runChild(Suite.java:127) ~[junit-4.11.jar:na]
	at org.junit.runners.Suite.runChild(Suite.java:26) ~[junit-4.11.jar:na]
	at org.junit.runners.ParentRunner$3.run(ParentRunner.java:238) ~[junit-4.11.jar:na]
	at org.junit.runners.ParentRunner$1.schedule(ParentRunner.java:63) ~[junit-4.11.jar:na]
	at org.junit.runners.ParentRunner.runChildren(ParentRunner.java:236) ~[junit-4.11.jar:na]
	at org.junit.runners.ParentRunner.access$000(ParentRunner.java:53) ~[junit-4.11.jar:na]
	at org.junit.runners.ParentRunner$2.evaluate(ParentRunner.java:229) ~[junit-4.11.jar:na]
	at org.junit.internal.runners.statements.RunBefores.evaluate(RunBefores.java:26) ~[junit-4.11.jar:na]
	at org.junit.internal.runners.statements.RunAfters.evaluate(RunAfters.java:27) ~[junit-4.11.jar:na]
	at org.junit.runners.ParentRunner.run(ParentRunner.java:309) ~[junit-4.11.jar:na]
	at org.apache.maven.surefire.junit4.JUnit4Provider.execute(JUnit4Provider.java:252) ~[na:na]
	at org.apache.maven.surefire.junit4.JUnit4Provider.executeTestSet(JUnit4Provider.java:141) ~[na:na]
	at org.apache.maven.surefire.junit4.JUnit4Provider.invoke(JUnit4Provider.java:112) ~[na:na]
	at sun.reflect.NativeMethodAccessorImpl.invoke0(Native Method) ~[na:1.7.0_25]
	at sun.reflect.NativeMethodAccessorImpl.invoke(NativeMethodAccessorImpl.java:57) ~[na:1.7.0_25]
	at sun.reflect.DelegatingMethodAccessorImpl.invoke(DelegatingMethodAccessorImpl.java:43) ~[na:1.7.0_25]
	at java.lang.reflect.Method.invoke(Method.java:606) ~[na:1.7.0_25]
	at org.apache.maven.surefire.util.ReflectionUtils.invokeMethodWithArray(ReflectionUtils.java:189) ~[surefire-api-2.12.4.jar:2.12.4]
	at org.apache.maven.surefire.booter.ProviderFactory$ProviderProxy.invoke(ProviderFactory.java:165) ~[surefire-booter-2.12.4.jar:2.12.4]
	at org.apache.maven.surefire.booter.ProviderFactory.invokeProvider(ProviderFactory.java:85) ~[surefire-booter-2.12.4.jar:2.12.4]
	at org.apache.maven.surefire.booter.ForkedBooter.runSuitesInProcess(ForkedBooter.java:115) ~[surefire-booter-2.12.4.jar:2.12.4]
	at org.apache.maven.surefire.booter.ForkedBooter.main(ForkedBooter.java:75) ~[surefire-booter-2.12.4.jar:2.12.4]
15:36:20.043 INFO [main] org.eclipse.tycho.nexus.internal.plugin.UnzipRepositoryPluginITCase - TEST testUnzipRepoWithGroupRepoAsMaster[0] FINISHED
15:36:20.044 INFO [main] org.eclipse.tycho.nexus.internal.plugin.UnzipRepositoryPluginITCase - TEST testUnzipRepoWithVirtualSnapshotVersion[0] STARTING
15:36:20.165 INFO [main] org.eclipse.tycho.nexus.internal.plugin.UnzipRepositoryPluginITCase - TEST testUnzipRepoWithVirtualSnapshotVersion[0] is running against Nexus bundle org.sonatype.nexus.assemblies:nexus-bundle-template:zip:bundle:2.6.0-01
15:36:20.195 INFO [main] org.sonatype.nexus.testsuite.support.NexusRunningITSupport - Starting Nexus (nexus bundle [id: nx] [not running])
15:36:20.213 INFO [main] org.eclipse.tycho.nexus.internal.plugin.UnzipRepositoryPluginITCase - TEST testUnzipRepoWithVirtualSnapshotVersion[0] FAILED
java.lang.AssertionError: Nexus was not in running state
	at org.hamcrest.MatcherAssert.assertThat(MatcherAssert.java:26) ~[hamcrest-core-1.3.jar:1.3]
	at org.sonatype.nexus.testsuite.support.NexusRunningITSupport.beforeTestIsRunning(NexusRunningITSupport.java:114) ~[nexus-testsuite-support-2.6.0-01.jar:2.6.0-01]
	at sun.reflect.NativeMethodAccessorImpl.invoke0(Native Method) ~[na:1.7.0_25]
	at sun.reflect.NativeMethodAccessorImpl.invoke(NativeMethodAccessorImpl.java:57) ~[na:1.7.0_25]
	at sun.reflect.DelegatingMethodAccessorImpl.invoke(DelegatingMethodAccessorImpl.java:43) ~[na:1.7.0_25]
	at java.lang.reflect.Method.invoke(Method.java:606) ~[na:1.7.0_25]
	at org.junit.runners.model.FrameworkMethod$1.runReflectiveCall(FrameworkMethod.java:47) ~[junit-4.11.jar:na]
	at org.junit.internal.runners.model.ReflectiveCallable.run(ReflectiveCallable.java:12) ~[junit-4.11.jar:na]
	at org.junit.runners.model.FrameworkMethod.invokeExplosively(FrameworkMethod.java:44) ~[junit-4.11.jar:na]
	at org.junit.internal.runners.statements.RunBefores.evaluate(RunBefores.java:24) ~[junit-4.11.jar:na]
	at org.junit.internal.runners.statements.RunAfters.evaluate(RunAfters.java:27) ~[junit-4.11.jar:na]
	at org.junit.rules.TestWatcher$1.evaluate(TestWatcher.java:55) [junit-4.11.jar:na]
	at org.junit.rules.TestWatcher$1.evaluate(TestWatcher.java:55) [junit-4.11.jar:na]
	at org.junit.rules.TestWatcher$1.evaluate(TestWatcher.java:55) [junit-4.11.jar:na]
	at org.junit.rules.TestWatcher$1.evaluate(TestWatcher.java:55) [junit-4.11.jar:na]
	at org.junit.rules.RunRules.evaluate(RunRules.java:20) ~[junit-4.11.jar:na]
	at org.junit.runners.ParentRunner.runLeaf(ParentRunner.java:271) ~[junit-4.11.jar:na]
	at org.junit.runners.BlockJUnit4ClassRunner.runChild(BlockJUnit4ClassRunner.java:70) ~[junit-4.11.jar:na]
	at org.junit.runners.BlockJUnit4ClassRunner.runChild(BlockJUnit4ClassRunner.java:50) ~[junit-4.11.jar:na]
	at org.junit.runners.ParentRunner$3.run(ParentRunner.java:238) ~[junit-4.11.jar:na]
	at org.junit.runners.ParentRunner$1.schedule(ParentRunner.java:63) ~[junit-4.11.jar:na]
	at org.junit.runners.ParentRunner.runChildren(ParentRunner.java:236) ~[junit-4.11.jar:na]
	at org.junit.runners.ParentRunner.access$000(ParentRunner.java:53) ~[junit-4.11.jar:na]
	at org.junit.runners.ParentRunner$2.evaluate(ParentRunner.java:229) ~[junit-4.11.jar:na]
	at org.junit.runners.ParentRunner.run(ParentRunner.java:309) ~[junit-4.11.jar:na]
	at org.junit.runners.Suite.runChild(Suite.java:127) ~[junit-4.11.jar:na]
	at org.junit.runners.Suite.runChild(Suite.java:26) ~[junit-4.11.jar:na]
	at org.junit.runners.ParentRunner$3.run(ParentRunner.java:238) ~[junit-4.11.jar:na]
	at org.junit.runners.ParentRunner$1.schedule(ParentRunner.java:63) ~[junit-4.11.jar:na]
	at org.junit.runners.ParentRunner.runChildren(ParentRunner.java:236) ~[junit-4.11.jar:na]
	at org.junit.runners.ParentRunner.access$000(ParentRunner.java:53) ~[junit-4.11.jar:na]
	at org.junit.runners.ParentRunner$2.evaluate(ParentRunner.java:229) ~[junit-4.11.jar:na]
	at org.junit.internal.runners.statements.RunBefores.evaluate(RunBefores.java:26) ~[junit-4.11.jar:na]
	at org.junit.internal.runners.statements.RunAfters.evaluate(RunAfters.java:27) ~[junit-4.11.jar:na]
	at org.junit.runners.ParentRunner.run(ParentRunner.java:309) ~[junit-4.11.jar:na]
	at org.apache.maven.surefire.junit4.JUnit4Provider.execute(JUnit4Provider.java:252) ~[na:na]
	at org.apache.maven.surefire.junit4.JUnit4Provider.executeTestSet(JUnit4Provider.java:141) ~[na:na]
	at org.apache.maven.surefire.junit4.JUnit4Provider.invoke(JUnit4Provider.java:112) ~[na:na]
	at sun.reflect.NativeMethodAccessorImpl.invoke0(Native Method) ~[na:1.7.0_25]
	at sun.reflect.NativeMethodAccessorImpl.invoke(NativeMethodAccessorImpl.java:57) ~[na:1.7.0_25]
	at sun.reflect.DelegatingMethodAccessorImpl.invoke(DelegatingMethodAccessorImpl.java:43) ~[na:1.7.0_25]
	at java.lang.reflect.Method.invoke(Method.java:606) ~[na:1.7.0_25]
	at org.apache.maven.surefire.util.ReflectionUtils.invokeMethodWithArray(ReflectionUtils.java:189) ~[surefire-api-2.12.4.jar:2.12.4]
	at org.apache.maven.surefire.booter.ProviderFactory$ProviderProxy.invoke(ProviderFactory.java:165) ~[surefire-booter-2.12.4.jar:2.12.4]
	at org.apache.maven.surefire.booter.ProviderFactory.invokeProvider(ProviderFactory.java:85) ~[surefire-booter-2.12.4.jar:2.12.4]
	at org.apache.maven.surefire.booter.ForkedBooter.runSuitesInProcess(ForkedBooter.java:115) ~[surefire-booter-2.12.4.jar:2.12.4]
	at org.apache.maven.surefire.booter.ForkedBooter.main(ForkedBooter.java:75) ~[surefire-booter-2.12.4.jar:2.12.4]
15:36:20.213 INFO [main] org.eclipse.tycho.nexus.internal.plugin.UnzipRepositoryPluginITCase - TEST testUnzipRepoWithVirtualSnapshotVersion[0] FINISHED
15:36:20.215 INFO [main] org.eclipse.tycho.nexus.internal.plugin.UnzipRepositoryPluginITCase - TEST testUnzipRepoWithHostedRepoAsMaster[1] STARTING
15:36:20.330 INFO [main] org.eclipse.tycho.nexus.internal.plugin.UnzipRepositoryPluginITCase - TEST testUnzipRepoWithHostedRepoAsMaster[1] is running against Nexus bundle org.sonatype.nexus.assemblies:nexus-bundle-template:zip:bundle:2.6.2-01
15:36:20.379 INFO [main] org.sonatype.nexus.testsuite.support.NexusRunningITSupport - Starting Nexus (nexus bundle [id: nx] [not running])
15:36:20.386 INFO [pool-3-thread-1] org.sonatype.sisu.maven.bridge.support.session.MavenBridgeRepositorySystemSession - Downloading http://repo.maven.apache.org/maven2/org/sonatype/nexus/assemblies/nexus-bundle-template/2.6.2-01/nexus-bundle-template-2.6.2-01-bundle.zip...
15:36:23.864 INFO [pool-3-thread-1] org.sonatype.sisu.maven.bridge.support.session.MavenBridgeRepositorySystemSession - Downloaded [41100444 bytes] http://repo.maven.apache.org/maven2/org/sonatype/nexus/assemblies/nexus-bundle-template/2.6.2-01/nexus-bundle-template-2.6.2-01-bundle.zip
15:36:25.056 INFO [main] org.sonatype.nexus.bundle.launcher.support.DefaultNexusBundle - nexus (nx) spawned env [org.sonatype.nexus.bootstrap.monitor.CommandMonitorThread.port=36159,org.sonatype.nexus.bootstrap.monitor.KeepAliveThread.port=41414]
15:36:25.062 INFO [main] org.sonatype.nexus.bundle.launcher.support.DefaultNexusBundle - nexus (nx) pinging command monitor at 127.0.0.1:36159
15:36:36.093 INFO [main] org.eclipse.tycho.nexus.internal.plugin.UnzipRepositoryPluginITCase - TEST testUnzipRepoWithHostedRepoAsMaster[1] FAILED
java.lang.RuntimeException: nexus (nx) no command monitor detected at 127.0.0.1:36159 within 10 seconds
	at org.sonatype.nexus.bundle.launcher.support.DefaultNexusBundle.startApplication(DefaultNexusBundle.java:379) ~[nexus-launcher-2.6.0-01.jar:2.6.0-01]
	at org.sonatype.sisu.bl.support.DefaultBundle.doStart(DefaultBundle.java:151) ~[sisu-bundle-launcher-1.5.2.jar:1.5.2]
	at org.sonatype.sisu.bl.internal.support.BundleLifecycle$Handler.doStart(BundleLifecycle.java:166) ~[sisu-bundle-launcher-1.5.2.jar:1.5.2]
	at org.sonatype.sisu.bl.internal.support.LifecycleHandlerContext$MainMap_Starting.perform(LifecycleHandlerContext.java:545) ~[sisu-bundle-launcher-1.5.2.jar:1.5.2]
	at org.sonatype.sisu.bl.internal.support.LifecycleHandlerContext.perform(LifecycleHandlerContext.java:57) ~[sisu-bundle-launcher-1.5.2.jar:1.5.2]
	at org.sonatype.sisu.bl.internal.support.BundleLifecycle.start(BundleLifecycle.java:88) ~[sisu-bundle-launcher-1.5.2.jar:1.5.2]
	at org.sonatype.nexus.testsuite.support.NexusRunningITSupport.startNexus(NexusRunningITSupport.java:249) ~[nexus-testsuite-support-2.6.0-01.jar:2.6.0-01]
	at org.sonatype.nexus.testsuite.support.NexusRunningITSupport.beforeTestIsRunning(NexusRunningITSupport.java:99) ~[nexus-testsuite-support-2.6.0-01.jar:2.6.0-01]
	at sun.reflect.NativeMethodAccessorImpl.invoke0(Native Method) ~[na:1.7.0_25]
	at sun.reflect.NativeMethodAccessorImpl.invoke(NativeMethodAccessorImpl.java:57) ~[na:1.7.0_25]
	at sun.reflect.DelegatingMethodAccessorImpl.invoke(DelegatingMethodAccessorImpl.java:43) ~[na:1.7.0_25]
	at java.lang.reflect.Method.invoke(Method.java:606) ~[na:1.7.0_25]
	at org.junit.runners.model.FrameworkMethod$1.runReflectiveCall(FrameworkMethod.java:47) ~[junit-4.11.jar:na]
	at org.junit.internal.runners.model.ReflectiveCallable.run(ReflectiveCallable.java:12) ~[junit-4.11.jar:na]
	at org.junit.runners.model.FrameworkMethod.invokeExplosively(FrameworkMethod.java:44) ~[junit-4.11.jar:na]
	at org.junit.internal.runners.statements.RunBefores.evaluate(RunBefores.java:24) ~[junit-4.11.jar:na]
	at org.junit.internal.runners.statements.RunAfters.evaluate(RunAfters.java:27) ~[junit-4.11.jar:na]
	at org.junit.rules.TestWatcher$1.evaluate(TestWatcher.java:55) [junit-4.11.jar:na]
	at org.junit.rules.TestWatcher$1.evaluate(TestWatcher.java:55) [junit-4.11.jar:na]
	at org.junit.rules.TestWatcher$1.evaluate(TestWatcher.java:55) [junit-4.11.jar:na]
	at org.junit.rules.TestWatcher$1.evaluate(TestWatcher.java:55) [junit-4.11.jar:na]
	at org.junit.rules.RunRules.evaluate(RunRules.java:20) ~[junit-4.11.jar:na]
	at org.junit.runners.ParentRunner.runLeaf(ParentRunner.java:271) ~[junit-4.11.jar:na]
	at org.junit.runners.BlockJUnit4ClassRunner.runChild(BlockJUnit4ClassRunner.java:70) ~[junit-4.11.jar:na]
	at org.junit.runners.BlockJUnit4ClassRunner.runChild(BlockJUnit4ClassRunner.java:50) ~[junit-4.11.jar:na]
	at org.junit.runners.ParentRunner$3.run(ParentRunner.java:238) ~[junit-4.11.jar:na]
	at org.junit.runners.ParentRunner$1.schedule(ParentRunner.java:63) ~[junit-4.11.jar:na]
	at org.junit.runners.ParentRunner.runChildren(ParentRunner.java:236) ~[junit-4.11.jar:na]
	at org.junit.runners.ParentRunner.access$000(ParentRunner.java:53) ~[junit-4.11.jar:na]
	at org.junit.runners.ParentRunner$2.evaluate(ParentRunner.java:229) ~[junit-4.11.jar:na]
	at org.junit.runners.ParentRunner.run(ParentRunner.java:309) ~[junit-4.11.jar:na]
	at org.junit.runners.Suite.runChild(Suite.java:127) ~[junit-4.11.jar:na]
	at org.junit.runners.Suite.runChild(Suite.java:26) ~[junit-4.11.jar:na]
	at org.junit.runners.ParentRunner$3.run(ParentRunner.java:238) ~[junit-4.11.jar:na]
	at org.junit.runners.ParentRunner$1.schedule(ParentRunner.java:63) ~[junit-4.11.jar:na]
	at org.junit.runners.ParentRunner.runChildren(ParentRunner.java:236) ~[junit-4.11.jar:na]
	at org.junit.runners.ParentRunner.access$000(ParentRunner.java:53) ~[junit-4.11.jar:na]
	at org.junit.runners.ParentRunner$2.evaluate(ParentRunner.java:229) ~[junit-4.11.jar:na]
	at org.junit.internal.runners.statements.RunBefores.evaluate(RunBefores.java:26) ~[junit-4.11.jar:na]
	at org.junit.internal.runners.statements.RunAfters.evaluate(RunAfters.java:27) ~[junit-4.11.jar:na]
	at org.junit.runners.ParentRunner.run(ParentRunner.java:309) ~[junit-4.11.jar:na]
	at org.apache.maven.surefire.junit4.JUnit4Provider.execute(JUnit4Provider.java:252) ~[na:na]
	at org.apache.maven.surefire.junit4.JUnit4Provider.executeTestSet(JUnit4Provider.java:141) ~[na:na]
	at org.apache.maven.surefire.junit4.JUnit4Provider.invoke(JUnit4Provider.java:112) ~[na:na]
	at sun.reflect.NativeMethodAccessorImpl.invoke0(Native Method) ~[na:1.7.0_25]
	at sun.reflect.NativeMethodAccessorImpl.invoke(NativeMethodAccessorImpl.java:57) ~[na:1.7.0_25]
	at sun.reflect.DelegatingMethodAccessorImpl.invoke(DelegatingMethodAccessorImpl.java:43) ~[na:1.7.0_25]
	at java.lang.reflect.Method.invoke(Method.java:606) ~[na:1.7.0_25]
	at org.apache.maven.surefire.util.ReflectionUtils.invokeMethodWithArray(ReflectionUtils.java:189) ~[surefire-api-2.12.4.jar:2.12.4]
	at org.apache.maven.surefire.booter.ProviderFactory$ProviderProxy.invoke(ProviderFactory.java:165) ~[surefire-booter-2.12.4.jar:2.12.4]
	at org.apache.maven.surefire.booter.ProviderFactory.invokeProvider(ProviderFactory.java:85) ~[surefire-booter-2.12.4.jar:2.12.4]
	at org.apache.maven.surefire.booter.ForkedBooter.runSuitesInProcess(ForkedBooter.java:115) ~[surefire-booter-2.12.4.jar:2.12.4]
	at org.apache.maven.surefire.booter.ForkedBooter.main(ForkedBooter.java:75) ~[surefire-booter-2.12.4.jar:2.12.4]
15:36:36.094 INFO [main] org.eclipse.tycho.nexus.internal.plugin.UnzipRepositoryPluginITCase - TEST testUnzipRepoWithHostedRepoAsMaster[1] FINISHED
15:36:36.095 INFO [main] org.eclipse.tycho.nexus.internal.plugin.UnzipRepositoryPluginITCase - TEST testUnzipRepoWithGroupRepoAsMaster[1] STARTING
15:36:36.221 INFO [main] org.eclipse.tycho.nexus.internal.plugin.UnzipRepositoryPluginITCase - TEST testUnzipRepoWithGroupRepoAsMaster[1] is running against Nexus bundle org.sonatype.nexus.assemblies:nexus-bundle-template:zip:bundle:2.6.2-01
15:36:36.254 INFO [main] org.sonatype.nexus.testsuite.support.NexusRunningITSupport - Starting Nexus (nexus bundle [id: nx] [not running])
15:36:36.272 INFO [main] org.eclipse.tycho.nexus.internal.plugin.UnzipRepositoryPluginITCase - TEST testUnzipRepoWithGroupRepoAsMaster[1] FAILED
java.lang.AssertionError: Nexus was not in running state
	at org.hamcrest.MatcherAssert.assertThat(MatcherAssert.java:26) ~[hamcrest-core-1.3.jar:1.3]
	at org.sonatype.nexus.testsuite.support.NexusRunningITSupport.beforeTestIsRunning(NexusRunningITSupport.java:114) ~[nexus-testsuite-support-2.6.0-01.jar:2.6.0-01]
	at sun.reflect.NativeMethodAccessorImpl.invoke0(Native Method) ~[na:1.7.0_25]
	at sun.reflect.NativeMethodAccessorImpl.invoke(NativeMethodAccessorImpl.java:57) ~[na:1.7.0_25]
	at sun.reflect.DelegatingMethodAccessorImpl.invoke(DelegatingMethodAccessorImpl.java:43) ~[na:1.7.0_25]
	at java.lang.reflect.Method.invoke(Method.java:606) ~[na:1.7.0_25]
	at org.junit.runners.model.FrameworkMethod$1.runReflectiveCall(FrameworkMethod.java:47) ~[junit-4.11.jar:na]
	at org.junit.internal.runners.model.ReflectiveCallable.run(ReflectiveCallable.java:12) ~[junit-4.11.jar:na]
	at org.junit.runners.model.FrameworkMethod.invokeExplosively(FrameworkMethod.java:44) ~[junit-4.11.jar:na]
	at org.junit.internal.runners.statements.RunBefores.evaluate(RunBefores.java:24) ~[junit-4.11.jar:na]
	at org.junit.internal.runners.statements.RunAfters.evaluate(RunAfters.java:27) ~[junit-4.11.jar:na]
	at org.junit.rules.TestWatcher$1.evaluate(TestWatcher.java:55) [junit-4.11.jar:na]
	at org.junit.rules.TestWatcher$1.evaluate(TestWatcher.java:55) [junit-4.11.jar:na]
	at org.junit.rules.TestWatcher$1.evaluate(TestWatcher.java:55) [junit-4.11.jar:na]
	at org.junit.rules.TestWatcher$1.evaluate(TestWatcher.java:55) [junit-4.11.jar:na]
	at org.junit.rules.RunRules.evaluate(RunRules.java:20) ~[junit-4.11.jar:na]
	at org.junit.runners.ParentRunner.runLeaf(ParentRunner.java:271) ~[junit-4.11.jar:na]
	at org.junit.runners.BlockJUnit4ClassRunner.runChild(BlockJUnit4ClassRunner.java:70) ~[junit-4.11.jar:na]
	at org.junit.runners.BlockJUnit4ClassRunner.runChild(BlockJUnit4ClassRunner.java:50) ~[junit-4.11.jar:na]
	at org.junit.runners.ParentRunner$3.run(ParentRunner.java:238) ~[junit-4.11.jar:na]
	at org.junit.runners.ParentRunner$1.schedule(ParentRunner.java:63) ~[junit-4.11.jar:na]
	at org.junit.runners.ParentRunner.runChildren(ParentRunner.java:236) ~[junit-4.11.jar:na]
	at org.junit.runners.ParentRunner.access$000(ParentRunner.java:53) ~[junit-4.11.jar:na]
	at org.junit.runners.ParentRunner$2.evaluate(ParentRunner.java:229) ~[junit-4.11.jar:na]
	at org.junit.runners.ParentRunner.run(ParentRunner.java:309) ~[junit-4.11.jar:na]
	at org.junit.runners.Suite.runChild(Suite.java:127) ~[junit-4.11.jar:na]
	at org.junit.runners.Suite.runChild(Suite.java:26) ~[junit-4.11.jar:na]
	at org.junit.runners.ParentRunner$3.run(ParentRunner.java:238) ~[junit-4.11.jar:na]
	at org.junit.runners.ParentRunner$1.schedule(ParentRunner.java:63) ~[junit-4.11.jar:na]
	at org.junit.runners.ParentRunner.runChildren(ParentRunner.java:236) ~[junit-4.11.jar:na]
	at org.junit.runners.ParentRunner.access$000(ParentRunner.java:53) ~[junit-4.11.jar:na]
	at org.junit.runners.ParentRunner$2.evaluate(ParentRunner.java:229) ~[junit-4.11.jar:na]
	at org.junit.internal.runners.statements.RunBefores.evaluate(RunBefores.java:26) ~[junit-4.11.jar:na]
	at org.junit.internal.runners.statements.RunAfters.evaluate(RunAfters.java:27) ~[junit-4.11.jar:na]
	at org.junit.runners.ParentRunner.run(ParentRunner.java:309) ~[junit-4.11.jar:na]
	at org.apache.maven.surefire.junit4.JUnit4Provider.execute(JUnit4Provider.java:252) ~[na:na]
	at org.apache.maven.surefire.junit4.JUnit4Provider.executeTestSet(JUnit4Provider.java:141) ~[na:na]
	at org.apache.maven.surefire.junit4.JUnit4Provider.invoke(JUnit4Provider.java:112) ~[na:na]
	at sun.reflect.NativeMethodAccessorImpl.invoke0(Native Method) ~[na:1.7.0_25]
	at sun.reflect.NativeMethodAccessorImpl.invoke(NativeMethodAccessorImpl.java:57) ~[na:1.7.0_25]
	at sun.reflect.DelegatingMethodAccessorImpl.invoke(DelegatingMethodAccessorImpl.java:43) ~[na:1.7.0_25]
	at java.lang.reflect.Method.invoke(Method.java:606) ~[na:1.7.0_25]
	at org.apache.maven.surefire.util.ReflectionUtils.invokeMethodWithArray(ReflectionUtils.java:189) ~[surefire-api-2.12.4.jar:2.12.4]
	at org.apache.maven.surefire.booter.ProviderFactory$ProviderProxy.invoke(ProviderFactory.java:165) ~[surefire-booter-2.12.4.jar:2.12.4]
	at org.apache.maven.surefire.booter.ProviderFactory.invokeProvider(ProviderFactory.java:85) ~[surefire-booter-2.12.4.jar:2.12.4]
	at org.apache.maven.surefire.booter.ForkedBooter.runSuitesInProcess(ForkedBooter.java:115) ~[surefire-booter-2.12.4.jar:2.12.4]
	at org.apache.maven.surefire.booter.ForkedBooter.main(ForkedBooter.java:75) ~[surefire-booter-2.12.4.jar:2.12.4]
15:36:36.272 INFO [main] org.eclipse.tycho.nexus.internal.plugin.UnzipRepositoryPluginITCase - TEST testUnzipRepoWithGroupRepoAsMaster[1] FINISHED
15:36:36.274 INFO [main] org.eclipse.tycho.nexus.internal.plugin.UnzipRepositoryPluginITCase - TEST testUnzipRepoWithVirtualSnapshotVersion[1] STARTING
15:36:36.390 INFO [main] org.eclipse.tycho.nexus.internal.plugin.UnzipRepositoryPluginITCase - TEST testUnzipRepoWithVirtualSnapshotVersion[1] is running against Nexus bundle org.sonatype.nexus.assemblies:nexus-bundle-template:zip:bundle:2.6.2-01
15:36:36.428 INFO [main] org.sonatype.nexus.testsuite.support.NexusRunningITSupport - Starting Nexus (nexus bundle [id: nx] [not running])
15:36:36.446 INFO [main] org.eclipse.tycho.nexus.internal.plugin.UnzipRepositoryPluginITCase - TEST testUnzipRepoWithVirtualSnapshotVersion[1] FAILED
java.lang.AssertionError: Nexus was not in running state
	at org.hamcrest.MatcherAssert.assertThat(MatcherAssert.java:26) ~[hamcrest-core-1.3.jar:1.3]
	at org.sonatype.nexus.testsuite.support.NexusRunningITSupport.beforeTestIsRunning(NexusRunningITSupport.java:114) ~[nexus-testsuite-support-2.6.0-01.jar:2.6.0-01]
	at sun.reflect.NativeMethodAccessorImpl.invoke0(Native Method) ~[na:1.7.0_25]
	at sun.reflect.NativeMethodAccessorImpl.invoke(NativeMethodAccessorImpl.java:57) ~[na:1.7.0_25]
	at sun.reflect.DelegatingMethodAccessorImpl.invoke(DelegatingMethodAccessorImpl.java:43) ~[na:1.7.0_25]
	at java.lang.reflect.Method.invoke(Method.java:606) ~[na:1.7.0_25]
	at org.junit.runners.model.FrameworkMethod$1.runReflectiveCall(FrameworkMethod.java:47) ~[junit-4.11.jar:na]
	at org.junit.internal.runners.model.ReflectiveCallable.run(ReflectiveCallable.java:12) ~[junit-4.11.jar:na]
	at org.junit.runners.model.FrameworkMethod.invokeExplosively(FrameworkMethod.java:44) ~[junit-4.11.jar:na]
	at org.junit.internal.runners.statements.RunBefores.evaluate(RunBefores.java:24) ~[junit-4.11.jar:na]
	at org.junit.internal.runners.statements.RunAfters.evaluate(RunAfters.java:27) ~[junit-4.11.jar:na]
	at org.junit.rules.TestWatcher$1.evaluate(TestWatcher.java:55) [junit-4.11.jar:na]
	at org.junit.rules.TestWatcher$1.evaluate(TestWatcher.java:55) [junit-4.11.jar:na]
	at org.junit.rules.TestWatcher$1.evaluate(TestWatcher.java:55) [junit-4.11.jar:na]
	at org.junit.rules.TestWatcher$1.evaluate(TestWatcher.java:55) [junit-4.11.jar:na]
	at org.junit.rules.RunRules.evaluate(RunRules.java:20) ~[junit-4.11.jar:na]
	at org.junit.runners.ParentRunner.runLeaf(ParentRunner.java:271) ~[junit-4.11.jar:na]
	at org.junit.runners.BlockJUnit4ClassRunner.runChild(BlockJUnit4ClassRunner.java:70) ~[junit-4.11.jar:na]
	at org.junit.runners.BlockJUnit4ClassRunner.runChild(BlockJUnit4ClassRunner.java:50) ~[junit-4.11.jar:na]
	at org.junit.runners.ParentRunner$3.run(ParentRunner.java:238) ~[junit-4.11.jar:na]
	at org.junit.runners.ParentRunner$1.schedule(ParentRunner.java:63) ~[junit-4.11.jar:na]
	at org.junit.runners.ParentRunner.runChildren(ParentRunner.java:236) ~[junit-4.11.jar:na]
	at org.junit.runners.ParentRunner.access$000(ParentRunner.java:53) ~[junit-4.11.jar:na]
	at org.junit.runners.ParentRunner$2.evaluate(ParentRunner.java:229) ~[junit-4.11.jar:na]
	at org.junit.runners.ParentRunner.run(ParentRunner.java:309) ~[junit-4.11.jar:na]
	at org.junit.runners.Suite.runChild(Suite.java:127) ~[junit-4.11.jar:na]
	at org.junit.runners.Suite.runChild(Suite.java:26) ~[junit-4.11.jar:na]
	at org.junit.runners.ParentRunner$3.run(ParentRunner.java:238) ~[junit-4.11.jar:na]
	at org.junit.runners.ParentRunner$1.schedule(ParentRunner.java:63) ~[junit-4.11.jar:na]
	at org.junit.runners.ParentRunner.runChildren(ParentRunner.java:236) ~[junit-4.11.jar:na]
	at org.junit.runners.ParentRunner.access$000(ParentRunner.java:53) ~[junit-4.11.jar:na]
	at org.junit.runners.ParentRunner$2.evaluate(ParentRunner.java:229) ~[junit-4.11.jar:na]
	at org.junit.internal.runners.statements.RunBefores.evaluate(RunBefores.java:26) ~[junit-4.11.jar:na]
	at org.junit.internal.runners.statements.RunAfters.evaluate(RunAfters.java:27) ~[junit-4.11.jar:na]
	at org.junit.runners.ParentRunner.run(ParentRunner.java:309) ~[junit-4.11.jar:na]
	at org.apache.maven.surefire.junit4.JUnit4Provider.execute(JUnit4Provider.java:252) ~[na:na]
	at org.apache.maven.surefire.junit4.JUnit4Provider.executeTestSet(JUnit4Provider.java:141) ~[na:na]
	at org.apache.maven.surefire.junit4.JUnit4Provider.invoke(JUnit4Provider.java:112) ~[na:na]
	at sun.reflect.NativeMethodAccessorImpl.invoke0(Native Method) ~[na:1.7.0_25]
	at sun.reflect.NativeMethodAccessorImpl.invoke(NativeMethodAccessorImpl.java:57) ~[na:1.7.0_25]
	at sun.reflect.DelegatingMethodAccessorImpl.invoke(DelegatingMethodAccessorImpl.java:43) ~[na:1.7.0_25]
	at java.lang.reflect.Method.invoke(Method.java:606) ~[na:1.7.0_25]
	at org.apache.maven.surefire.util.ReflectionUtils.invokeMethodWithArray(ReflectionUtils.java:189) ~[surefire-api-2.12.4.jar:2.12.4]
	at org.apache.maven.surefire.booter.ProviderFactory$ProviderProxy.invoke(ProviderFactory.java:165) ~[surefire-booter-2.12.4.jar:2.12.4]
	at org.apache.maven.surefire.booter.ProviderFactory.invokeProvider(ProviderFactory.java:85) ~[surefire-booter-2.12.4.jar:2.12.4]
	at org.apache.maven.surefire.booter.ForkedBooter.runSuitesInProcess(ForkedBooter.java:115) ~[surefire-booter-2.12.4.jar:2.12.4]
	at org.apache.maven.surefire.booter.ForkedBooter.main(ForkedBooter.java:75) ~[surefire-booter-2.12.4.jar:2.12.4]
15:36:36.447 INFO [main] org.eclipse.tycho.nexus.internal.plugin.UnzipRepositoryPluginITCase - TEST testUnzipRepoWithVirtualSnapshotVersion[1] FINISHED
Tests run: 6, Failures: 4, Errors: 2, Skipped: 0, Time elapsed: 38.623 sec <<< FAILURE!
testUnzipRepoWithHostedRepoAsMaster[0](org.eclipse.tycho.nexus.internal.plugin.UnzipRepositoryPluginITCase)  Time elapsed: 21.583 sec  <<< ERROR!
java.lang.RuntimeException: nexus (nx) no command monitor detected at 127.0.0.1:54741 within 10 seconds
	at org.sonatype.nexus.bundle.launcher.support.DefaultNexusBundle.startApplication(DefaultNexusBundle.java:379)
	at org.sonatype.sisu.bl.support.DefaultBundle.doStart(DefaultBundle.java:151)
	at org.sonatype.sisu.bl.internal.support.BundleLifecycle$Handler.doStart(BundleLifecycle.java:166)
	at org.sonatype.sisu.bl.internal.support.LifecycleHandlerContext$MainMap_Starting.perform(LifecycleHandlerContext.java:545)
	at org.sonatype.sisu.bl.internal.support.LifecycleHandlerContext.perform(LifecycleHandlerContext.java:57)
	at org.sonatype.sisu.bl.internal.support.BundleLifecycle.start(BundleLifecycle.java:88)
	at org.sonatype.nexus.testsuite.support.NexusRunningITSupport.startNexus(NexusRunningITSupport.java:249)
	at org.sonatype.nexus.testsuite.support.NexusRunningITSupport.beforeTestIsRunning(NexusRunningITSupport.java:99)
	at sun.reflect.NativeMethodAccessorImpl.invoke0(Native Method)
	at sun.reflect.NativeMethodAccessorImpl.invoke(NativeMethodAccessorImpl.java:57)
	at sun.reflect.DelegatingMethodAccessorImpl.invoke(DelegatingMethodAccessorImpl.java:43)
	at java.lang.reflect.Method.invoke(Method.java:606)
	at org.junit.runners.model.FrameworkMethod$1.runReflectiveCall(FrameworkMethod.java:47)
	at org.junit.internal.runners.model.ReflectiveCallable.run(ReflectiveCallable.java:12)
	at org.junit.runners.model.FrameworkMethod.invokeExplosively(FrameworkMethod.java:44)
	at org.junit.internal.runners.statements.RunBefores.evaluate(RunBefores.java:24)
	at org.junit.internal.runners.statements.RunAfters.evaluate(RunAfters.java:27)
	at org.junit.rules.TestWatcher$1.evaluate(TestWatcher.java:55)
	at org.junit.rules.TestWatcher$1.evaluate(TestWatcher.java:55)
	at org.junit.rules.TestWatcher$1.evaluate(TestWatcher.java:55)
	at org.junit.rules.TestWatcher$1.evaluate(TestWatcher.java:55)
	at org.junit.rules.RunRules.evaluate(RunRules.java:20)
	at org.junit.runners.ParentRunner.runLeaf(ParentRunner.java:271)
	at org.junit.runners.BlockJUnit4ClassRunner.runChild(BlockJUnit4ClassRunner.java:70)
	at org.junit.runners.BlockJUnit4ClassRunner.runChild(BlockJUnit4ClassRunner.java:50)
	at org.junit.runners.ParentRunner$3.run(ParentRunner.java:238)
	at org.junit.runners.ParentRunner$1.schedule(ParentRunner.java:63)
	at org.junit.runners.ParentRunner.runChildren(ParentRunner.java:236)
	at org.junit.runners.ParentRunner.access$000(ParentRunner.java:53)
	at org.junit.runners.ParentRunner$2.evaluate(ParentRunner.java:229)
	at org.junit.runners.ParentRunner.run(ParentRunner.java:309)
	at org.junit.runners.Suite.runChild(Suite.java:127)
	at org.junit.runners.Suite.runChild(Suite.java:26)
	at org.junit.runners.ParentRunner$3.run(ParentRunner.java:238)
	at org.junit.runners.ParentRunner$1.schedule(ParentRunner.java:63)
	at org.junit.runners.ParentRunner.runChildren(ParentRunner.java:236)
	at org.junit.runners.ParentRunner.access$000(ParentRunner.java:53)
	at org.junit.runners.ParentRunner$2.evaluate(ParentRunner.java:229)
	at org.junit.internal.runners.statements.RunBefores.evaluate(RunBefores.java:26)
	at org.junit.internal.runners.statements.RunAfters.evaluate(RunAfters.java:27)
	at org.junit.runners.ParentRunner.run(ParentRunner.java:309)
	at org.apache.maven.surefire.junit4.JUnit4Provider.execute(JUnit4Provider.java:252)
	at org.apache.maven.surefire.junit4.JUnit4Provider.executeTestSet(JUnit4Provider.java:141)
	at org.apache.maven.surefire.junit4.JUnit4Provider.invoke(JUnit4Provider.java:112)
	at sun.reflect.NativeMethodAccessorImpl.invoke0(Native Method)
	at sun.reflect.NativeMethodAccessorImpl.invoke(NativeMethodAccessorImpl.java:57)
	at sun.reflect.DelegatingMethodAccessorImpl.invoke(DelegatingMethodAccessorImpl.java:43)
	at java.lang.reflect.Method.invoke(Method.java:606)
	at org.apache.maven.surefire.util.ReflectionUtils.invokeMethodWithArray(ReflectionUtils.java:189)
	at org.apache.maven.surefire.booter.ProviderFactory$ProviderProxy.invoke(ProviderFactory.java:165)
	at org.apache.maven.surefire.booter.ProviderFactory.invokeProvider(ProviderFactory.java:85)
	at org.apache.maven.surefire.booter.ForkedBooter.runSuitesInProcess(ForkedBooter.java:115)
	at org.apache.maven.surefire.booter.ForkedBooter.main(ForkedBooter.java:75)

testUnzipRepoWithGroupRepoAsMaster[0](org.eclipse.tycho.nexus.internal.plugin.UnzipRepositoryPluginITCase)  Time elapsed: 0.199 sec  <<< FAILURE!
java.lang.AssertionError: Nexus was not in running state
	at org.hamcrest.MatcherAssert.assertThat(MatcherAssert.java:26)
	at org.sonatype.nexus.testsuite.support.NexusRunningITSupport.beforeTestIsRunning(NexusRunningITSupport.java:114)
	at sun.reflect.NativeMethodAccessorImpl.invoke0(Native Method)
	at sun.reflect.NativeMethodAccessorImpl.invoke(NativeMethodAccessorImpl.java:57)
	at sun.reflect.DelegatingMethodAccessorImpl.invoke(DelegatingMethodAccessorImpl.java:43)
	at java.lang.reflect.Method.invoke(Method.java:606)
	at org.junit.runners.model.FrameworkMethod$1.runReflectiveCall(FrameworkMethod.java:47)
	at org.junit.internal.runners.model.ReflectiveCallable.run(ReflectiveCallable.java:12)
	at org.junit.runners.model.FrameworkMethod.invokeExplosively(FrameworkMethod.java:44)
	at org.junit.internal.runners.statements.RunBefores.evaluate(RunBefores.java:24)
	at org.junit.internal.runners.statements.RunAfters.evaluate(RunAfters.java:27)
	at org.junit.rules.TestWatcher$1.evaluate(TestWatcher.java:55)
	at org.junit.rules.TestWatcher$1.evaluate(TestWatcher.java:55)
	at org.junit.rules.TestWatcher$1.evaluate(TestWatcher.java:55)
	at org.junit.rules.TestWatcher$1.evaluate(TestWatcher.java:55)
	at org.junit.rules.RunRules.evaluate(RunRules.java:20)
	at org.junit.runners.ParentRunner.runLeaf(ParentRunner.java:271)
	at org.junit.runners.BlockJUnit4ClassRunner.runChild(BlockJUnit4ClassRunner.java:70)
	at org.junit.runners.BlockJUnit4ClassRunner.runChild(BlockJUnit4ClassRunner.java:50)
	at org.junit.runners.ParentRunner$3.run(ParentRunner.java:238)
	at org.junit.runners.ParentRunner$1.schedule(ParentRunner.java:63)
	at org.junit.runners.ParentRunner.runChildren(ParentRunner.java:236)
	at org.junit.runners.ParentRunner.access$000(ParentRunner.java:53)
	at org.junit.runners.ParentRunner$2.evaluate(ParentRunner.java:229)
	at org.junit.runners.ParentRunner.run(ParentRunner.java:309)
	at org.junit.runners.Suite.runChild(Suite.java:127)
	at org.junit.runners.Suite.runChild(Suite.java:26)
	at org.junit.runners.ParentRunner$3.run(ParentRunner.java:238)
	at org.junit.runners.ParentRunner$1.schedule(ParentRunner.java:63)
	at org.junit.runners.ParentRunner.runChildren(ParentRunner.java:236)
	at org.junit.runners.ParentRunner.access$000(ParentRunner.java:53)
	at org.junit.runners.ParentRunner$2.evaluate(ParentRunner.java:229)
	at org.junit.internal.runners.statements.RunBefores.evaluate(RunBefores.java:26)
	at org.junit.internal.runners.statements.RunAfters.evaluate(RunAfters.java:27)
	at org.junit.runners.ParentRunner.run(ParentRunner.java:309)
	at org.apache.maven.surefire.junit4.JUnit4Provider.execute(JUnit4Provider.java:252)
	at org.apache.maven.surefire.junit4.JUnit4Provider.executeTestSet(JUnit4Provider.java:141)
	at org.apache.maven.surefire.junit4.JUnit4Provider.invoke(JUnit4Provider.java:112)
	at sun.reflect.NativeMethodAccessorImpl.invoke0(Native Method)
	at sun.reflect.NativeMethodAccessorImpl.invoke(NativeMethodAccessorImpl.java:57)
	at sun.reflect.DelegatingMethodAccessorImpl.invoke(DelegatingMethodAccessorImpl.java:43)
	at java.lang.reflect.Method.invoke(Method.java:606)
	at org.apache.maven.surefire.util.ReflectionUtils.invokeMethodWithArray(ReflectionUtils.java:189)
	at org.apache.maven.surefire.booter.ProviderFactory$ProviderProxy.invoke(ProviderFactory.java:165)
	at org.apache.maven.surefire.booter.ProviderFactory.invokeProvider(ProviderFactory.java:85)
	at org.apache.maven.surefire.booter.ForkedBooter.runSuitesInProcess(ForkedBooter.java:115)
	at org.apache.maven.surefire.booter.ForkedBooter.main(ForkedBooter.java:75)

testUnzipRepoWithVirtualSnapshotVersion[0](org.eclipse.tycho.nexus.internal.plugin.UnzipRepositoryPluginITCase)  Time elapsed: 0.17 sec  <<< FAILURE!
java.lang.AssertionError: Nexus was not in running state
	at org.hamcrest.MatcherAssert.assertThat(MatcherAssert.java:26)
	at org.sonatype.nexus.testsuite.support.NexusRunningITSupport.beforeTestIsRunning(NexusRunningITSupport.java:114)
	at sun.reflect.NativeMethodAccessorImpl.invoke0(Native Method)
	at sun.reflect.NativeMethodAccessorImpl.invoke(NativeMethodAccessorImpl.java:57)
	at sun.reflect.DelegatingMethodAccessorImpl.invoke(DelegatingMethodAccessorImpl.java:43)
	at java.lang.reflect.Method.invoke(Method.java:606)
	at org.junit.runners.model.FrameworkMethod$1.runReflectiveCall(FrameworkMethod.java:47)
	at org.junit.internal.runners.model.ReflectiveCallable.run(ReflectiveCallable.java:12)
	at org.junit.runners.model.FrameworkMethod.invokeExplosively(FrameworkMethod.java:44)
	at org.junit.internal.runners.statements.RunBefores.evaluate(RunBefores.java:24)
	at org.junit.internal.runners.statements.RunAfters.evaluate(RunAfters.java:27)
	at org.junit.rules.TestWatcher$1.evaluate(TestWatcher.java:55)
	at org.junit.rules.TestWatcher$1.evaluate(TestWatcher.java:55)
	at org.junit.rules.TestWatcher$1.evaluate(TestWatcher.java:55)
	at org.junit.rules.TestWatcher$1.evaluate(TestWatcher.java:55)
	at org.junit.rules.RunRules.evaluate(RunRules.java:20)
	at org.junit.runners.ParentRunner.runLeaf(ParentRunner.java:271)
	at org.junit.runners.BlockJUnit4ClassRunner.runChild(BlockJUnit4ClassRunner.java:70)
	at org.junit.runners.BlockJUnit4ClassRunner.runChild(BlockJUnit4ClassRunner.java:50)
	at org.junit.runners.ParentRunner$3.run(ParentRunner.java:238)
	at org.junit.runners.ParentRunner$1.schedule(ParentRunner.java:63)
	at org.junit.runners.ParentRunner.runChildren(ParentRunner.java:236)
	at org.junit.runners.ParentRunner.access$000(ParentRunner.java:53)
	at org.junit.runners.ParentRunner$2.evaluate(ParentRunner.java:229)
	at org.junit.runners.ParentRunner.run(ParentRunner.java:309)
	at org.junit.runners.Suite.runChild(Suite.java:127)
	at org.junit.runners.Suite.runChild(Suite.java:26)
	at org.junit.runners.ParentRunner$3.run(ParentRunner.java:238)
	at org.junit.runners.ParentRunner$1.schedule(ParentRunner.java:63)
	at org.junit.runners.ParentRunner.runChildren(ParentRunner.java:236)
	at org.junit.runners.ParentRunner.access$000(ParentRunner.java:53)
	at org.junit.runners.ParentRunner$2.evaluate(ParentRunner.java:229)
	at org.junit.internal.runners.statements.RunBefores.evaluate(RunBefores.java:26)
	at org.junit.internal.runners.statements.RunAfters.evaluate(RunAfters.java:27)
	at org.junit.runners.ParentRunner.run(ParentRunner.java:309)
	at org.apache.maven.surefire.junit4.JUnit4Provider.execute(JUnit4Provider.java:252)
	at org.apache.maven.surefire.junit4.JUnit4Provider.executeTestSet(JUnit4Provider.java:141)
	at org.apache.maven.surefire.junit4.JUnit4Provider.invoke(JUnit4Provider.java:112)
	at sun.reflect.NativeMethodAccessorImpl.invoke0(Native Method)
	at sun.reflect.NativeMethodAccessorImpl.invoke(NativeMethodAccessorImpl.java:57)
	at sun.reflect.DelegatingMethodAccessorImpl.invoke(DelegatingMethodAccessorImpl.java:43)
	at java.lang.reflect.Method.invoke(Method.java:606)
	at org.apache.maven.surefire.util.ReflectionUtils.invokeMethodWithArray(ReflectionUtils.java:189)
	at org.apache.maven.surefire.booter.ProviderFactory$ProviderProxy.invoke(ProviderFactory.java:165)
	at org.apache.maven.surefire.booter.ProviderFactory.invokeProvider(ProviderFactory.java:85)
	at org.apache.maven.surefire.booter.ForkedBooter.runSuitesInProcess(ForkedBooter.java:115)
	at org.apache.maven.surefire.booter.ForkedBooter.main(ForkedBooter.java:75)

testUnzipRepoWithHostedRepoAsMaster[1](org.eclipse.tycho.nexus.internal.plugin.UnzipRepositoryPluginITCase)  Time elapsed: 15.88 sec  <<< ERROR!
java.lang.RuntimeException: nexus (nx) no command monitor detected at 127.0.0.1:36159 within 10 seconds
	at org.sonatype.nexus.bundle.launcher.support.DefaultNexusBundle.startApplication(DefaultNexusBundle.java:379)
	at org.sonatype.sisu.bl.support.DefaultBundle.doStart(DefaultBundle.java:151)
	at org.sonatype.sisu.bl.internal.support.BundleLifecycle$Handler.doStart(BundleLifecycle.java:166)
	at org.sonatype.sisu.bl.internal.support.LifecycleHandlerContext$MainMap_Starting.perform(LifecycleHandlerContext.java:545)
	at org.sonatype.sisu.bl.internal.support.LifecycleHandlerContext.perform(LifecycleHandlerContext.java:57)
	at org.sonatype.sisu.bl.internal.support.BundleLifecycle.start(BundleLifecycle.java:88)
	at org.sonatype.nexus.testsuite.support.NexusRunningITSupport.startNexus(NexusRunningITSupport.java:249)
	at org.sonatype.nexus.testsuite.support.NexusRunningITSupport.beforeTestIsRunning(NexusRunningITSupport.java:99)
	at sun.reflect.NativeMethodAccessorImpl.invoke0(Native Method)
	at sun.reflect.NativeMethodAccessorImpl.invoke(NativeMethodAccessorImpl.java:57)
	at sun.reflect.DelegatingMethodAccessorImpl.invoke(DelegatingMethodAccessorImpl.java:43)
	at java.lang.reflect.Method.invoke(Method.java:606)
	at org.junit.runners.model.FrameworkMethod$1.runReflectiveCall(FrameworkMethod.java:47)
	at org.junit.internal.runners.model.ReflectiveCallable.run(ReflectiveCallable.java:12)
	at org.junit.runners.model.FrameworkMethod.invokeExplosively(FrameworkMethod.java:44)
	at org.junit.internal.runners.statements.RunBefores.evaluate(RunBefores.java:24)
	at org.junit.internal.runners.statements.RunAfters.evaluate(RunAfters.java:27)
	at org.junit.rules.TestWatcher$1.evaluate(TestWatcher.java:55)
	at org.junit.rules.TestWatcher$1.evaluate(TestWatcher.java:55)
	at org.junit.rules.TestWatcher$1.evaluate(TestWatcher.java:55)
	at org.junit.rules.TestWatcher$1.evaluate(TestWatcher.java:55)
	at org.junit.rules.RunRules.evaluate(RunRules.java:20)
	at org.junit.runners.ParentRunner.runLeaf(ParentRunner.java:271)
	at org.junit.runners.BlockJUnit4ClassRunner.runChild(BlockJUnit4ClassRunner.java:70)
	at org.junit.runners.BlockJUnit4ClassRunner.runChild(BlockJUnit4ClassRunner.java:50)
	at org.junit.runners.ParentRunner$3.run(ParentRunner.java:238)
	at org.junit.runners.ParentRunner$1.schedule(ParentRunner.java:63)
	at org.junit.runners.ParentRunner.runChildren(ParentRunner.java:236)
	at org.junit.runners.ParentRunner.access$000(ParentRunner.java:53)
	at org.junit.runners.ParentRunner$2.evaluate(ParentRunner.java:229)
	at org.junit.runners.ParentRunner.run(ParentRunner.java:309)
	at org.junit.runners.Suite.runChild(Suite.java:127)
	at org.junit.runners.Suite.runChild(Suite.java:26)
	at org.junit.runners.ParentRunner$3.run(ParentRunner.java:238)
	at org.junit.runners.ParentRunner$1.schedule(ParentRunner.java:63)
	at org.junit.runners.ParentRunner.runChildren(ParentRunner.java:236)
	at org.junit.runners.ParentRunner.access$000(ParentRunner.java:53)
	at org.junit.runners.ParentRunner$2.evaluate(ParentRunner.java:229)
	at org.junit.internal.runners.statements.RunBefores.evaluate(RunBefores.java:26)
	at org.junit.internal.runners.statements.RunAfters.evaluate(RunAfters.java:27)
	at org.junit.runners.ParentRunner.run(ParentRunner.java:309)
	at org.apache.maven.surefire.junit4.JUnit4Provider.execute(JUnit4Provider.java:252)
	at org.apache.maven.surefire.junit4.JUnit4Provider.executeTestSet(JUnit4Provider.java:141)
	at org.apache.maven.surefire.junit4.JUnit4Provider.invoke(JUnit4Provider.java:112)
	at sun.reflect.NativeMethodAccessorImpl.invoke0(Native Method)
	at sun.reflect.NativeMethodAccessorImpl.invoke(NativeMethodAccessorImpl.java:57)
	at sun.reflect.DelegatingMethodAccessorImpl.invoke(DelegatingMethodAccessorImpl.java:43)
	at java.lang.reflect.Method.invoke(Method.java:606)
	at org.apache.maven.surefire.util.ReflectionUtils.invokeMethodWithArray(ReflectionUtils.java:189)
	at org.apache.maven.surefire.booter.ProviderFactory$ProviderProxy.invoke(ProviderFactory.java:165)
	at org.apache.maven.surefire.booter.ProviderFactory.invokeProvider(ProviderFactory.java:85)
	at org.apache.maven.surefire.booter.ForkedBooter.runSuitesInProcess(ForkedBooter.java:115)
	at org.apache.maven.surefire.booter.ForkedBooter.main(ForkedBooter.java:75)

testUnzipRepoWithGroupRepoAsMaster[1](org.eclipse.tycho.nexus.internal.plugin.UnzipRepositoryPluginITCase)  Time elapsed: 0.178 sec  <<< FAILURE!
java.lang.AssertionError: Nexus was not in running state
	at org.hamcrest.MatcherAssert.assertThat(MatcherAssert.java:26)
	at org.sonatype.nexus.testsuite.support.NexusRunningITSupport.beforeTestIsRunning(NexusRunningITSupport.java:114)
	at sun.reflect.NativeMethodAccessorImpl.invoke0(Native Method)
	at sun.reflect.NativeMethodAccessorImpl.invoke(NativeMethodAccessorImpl.java:57)
	at sun.reflect.DelegatingMethodAccessorImpl.invoke(DelegatingMethodAccessorImpl.java:43)
	at java.lang.reflect.Method.invoke(Method.java:606)
	at org.junit.runners.model.FrameworkMethod$1.runReflectiveCall(FrameworkMethod.java:47)
	at org.junit.internal.runners.model.ReflectiveCallable.run(ReflectiveCallable.java:12)
	at org.junit.runners.model.FrameworkMethod.invokeExplosively(FrameworkMethod.java:44)
	at org.junit.internal.runners.statements.RunBefores.evaluate(RunBefores.java:24)
	at org.junit.internal.runners.statements.RunAfters.evaluate(RunAfters.java:27)
	at org.junit.rules.TestWatcher$1.evaluate(TestWatcher.java:55)
	at org.junit.rules.TestWatcher$1.evaluate(TestWatcher.java:55)
	at org.junit.rules.TestWatcher$1.evaluate(TestWatcher.java:55)
	at org.junit.rules.TestWatcher$1.evaluate(TestWatcher.java:55)
	at org.junit.rules.RunRules.evaluate(RunRules.java:20)
	at org.junit.runners.ParentRunner.runLeaf(ParentRunner.java:271)
	at org.junit.runners.BlockJUnit4ClassRunner.runChild(BlockJUnit4ClassRunner.java:70)
	at org.junit.runners.BlockJUnit4ClassRunner.runChild(BlockJUnit4ClassRunner.java:50)
	at org.junit.runners.ParentRunner$3.run(ParentRunner.java:238)
	at org.junit.runners.ParentRunner$1.schedule(ParentRunner.java:63)
	at org.junit.runners.ParentRunner.runChildren(ParentRunner.java:236)
	at org.junit.runners.ParentRunner.access$000(ParentRunner.java:53)
	at org.junit.runners.ParentRunner$2.evaluate(ParentRunner.java:229)
	at org.junit.runners.ParentRunner.run(ParentRunner.java:309)
	at org.junit.runners.Suite.runChild(Suite.java:127)
	at org.junit.runners.Suite.runChild(Suite.java:26)
	at org.junit.runners.ParentRunner$3.run(ParentRunner.java:238)
	at org.junit.runners.ParentRunner$1.schedule(ParentRunner.java:63)
	at org.junit.runners.ParentRunner.runChildren(ParentRunner.java:236)
	at org.junit.runners.ParentRunner.access$000(ParentRunner.java:53)
	at org.junit.runners.ParentRunner$2.evaluate(ParentRunner.java:229)
	at org.junit.internal.runners.statements.RunBefores.evaluate(RunBefores.java:26)
	at org.junit.internal.runners.statements.RunAfters.evaluate(RunAfters.java:27)
	at org.junit.runners.ParentRunner.run(ParentRunner.java:309)
	at org.apache.maven.surefire.junit4.JUnit4Provider.execute(JUnit4Provider.java:252)
	at org.apache.maven.surefire.junit4.JUnit4Provider.executeTestSet(JUnit4Provider.java:141)
	at org.apache.maven.surefire.junit4.JUnit4Provider.invoke(JUnit4Provider.java:112)
	at sun.reflect.NativeMethodAccessorImpl.invoke0(Native Method)
	at sun.reflect.NativeMethodAccessorImpl.invoke(NativeMethodAccessorImpl.java:57)
	at sun.reflect.DelegatingMethodAccessorImpl.invoke(DelegatingMethodAccessorImpl.java:43)
	at java.lang.reflect.Method.invoke(Method.java:606)
	at org.apache.maven.surefire.util.ReflectionUtils.invokeMethodWithArray(ReflectionUtils.java:189)
	at org.apache.maven.surefire.booter.ProviderFactory$ProviderProxy.invoke(ProviderFactory.java:165)
	at org.apache.maven.surefire.booter.ProviderFactory.invokeProvider(ProviderFactory.java:85)
	at org.apache.maven.surefire.booter.ForkedBooter.runSuitesInProcess(ForkedBooter.java:115)
	at org.apache.maven.surefire.booter.ForkedBooter.main(ForkedBooter.java:75)

testUnzipRepoWithVirtualSnapshotVersion[1](org.eclipse.tycho.nexus.internal.plugin.UnzipRepositoryPluginITCase)  Time elapsed: 0.174 sec  <<< FAILURE!
java.lang.AssertionError: Nexus was not in running state
	at org.hamcrest.MatcherAssert.assertThat(MatcherAssert.java:26)
	at org.sonatype.nexus.testsuite.support.NexusRunningITSupport.beforeTestIsRunning(NexusRunningITSupport.java:114)
	at sun.reflect.NativeMethodAccessorImpl.invoke0(Native Method)
	at sun.reflect.NativeMethodAccessorImpl.invoke(NativeMethodAccessorImpl.java:57)
	at sun.reflect.DelegatingMethodAccessorImpl.invoke(DelegatingMethodAccessorImpl.java:43)
	at java.lang.reflect.Method.invoke(Method.java:606)
	at org.junit.runners.model.FrameworkMethod$1.runReflectiveCall(FrameworkMethod.java:47)
	at org.junit.internal.runners.model.ReflectiveCallable.run(ReflectiveCallable.java:12)
	at org.junit.runners.model.FrameworkMethod.invokeExplosively(FrameworkMethod.java:44)
	at org.junit.internal.runners.statements.RunBefores.evaluate(RunBefores.java:24)
	at org.junit.internal.runners.statements.RunAfters.evaluate(RunAfters.java:27)
	at org.junit.rules.TestWatcher$1.evaluate(TestWatcher.java:55)
	at org.junit.rules.TestWatcher$1.evaluate(TestWatcher.java:55)
	at org.junit.rules.TestWatcher$1.evaluate(TestWatcher.java:55)
	at org.junit.rules.TestWatcher$1.evaluate(TestWatcher.java:55)
	at org.junit.rules.RunRules.evaluate(RunRules.java:20)
	at org.junit.runners.ParentRunner.runLeaf(ParentRunner.java:271)
	at org.junit.runners.BlockJUnit4ClassRunner.runChild(BlockJUnit4ClassRunner.java:70)
	at org.junit.runners.BlockJUnit4ClassRunner.runChild(BlockJUnit4ClassRunner.java:50)
	at org.junit.runners.ParentRunner$3.run(ParentRunner.java:238)
	at org.junit.runners.ParentRunner$1.schedule(ParentRunner.java:63)
	at org.junit.runners.ParentRunner.runChildren(ParentRunner.java:236)
	at org.junit.runners.ParentRunner.access$000(ParentRunner.java:53)
	at org.junit.runners.ParentRunner$2.evaluate(ParentRunner.java:229)
	at org.junit.runners.ParentRunner.run(ParentRunner.java:309)
	at org.junit.runners.Suite.runChild(Suite.java:127)
	at org.junit.runners.Suite.runChild(Suite.java:26)
	at org.junit.runners.ParentRunner$3.run(ParentRunner.java:238)
	at org.junit.runners.ParentRunner$1.schedule(ParentRunner.java:63)
	at org.junit.runners.ParentRunner.runChildren(ParentRunner.java:236)
	at org.junit.runners.ParentRunner.access$000(ParentRunner.java:53)
	at org.junit.runners.ParentRunner$2.evaluate(ParentRunner.java:229)
	at org.junit.internal.runners.statements.RunBefores.evaluate(RunBefores.java:26)
	at org.junit.internal.runners.statements.RunAfters.evaluate(RunAfters.java:27)
	at org.junit.runners.ParentRunner.run(ParentRunner.java:309)
	at org.apache.maven.surefire.junit4.JUnit4Provider.execute(JUnit4Provider.java:252)
	at org.apache.maven.surefire.junit4.JUnit4Provider.executeTestSet(JUnit4Provider.java:141)
	at org.apache.maven.surefire.junit4.JUnit4Provider.invoke(JUnit4Provider.java:112)
	at sun.reflect.NativeMethodAccessorImpl.invoke0(Native Method)
	at sun.reflect.NativeMethodAccessorImpl.invoke(NativeMethodAccessorImpl.java:57)
	at sun.reflect.DelegatingMethodAccessorImpl.invoke(DelegatingMethodAccessorImpl.java:43)
	at java.lang.reflect.Method.invoke(Method.java:606)
	at org.apache.maven.surefire.util.ReflectionUtils.invokeMethodWithArray(ReflectionUtils.java:189)
	at org.apache.maven.surefire.booter.ProviderFactory$ProviderProxy.invoke(ProviderFactory.java:165)
	at org.apache.maven.surefire.booter.ProviderFactory.invokeProvider(ProviderFactory.java:85)
	at org.apache.maven.surefire.booter.ForkedBooter.runSuitesInProcess(ForkedBooter.java:115)
	at org.apache.maven.surefire.booter.ForkedBooter.main(ForkedBooter.java:75)


Results :

Failed tests:   testUnzipRepoWithGroupRepoAsMaster[0](org.eclipse.tycho.nexus.internal.plugin.UnzipRepositoryPluginITCase): Nexus was not in running state
  testUnzipRepoWithVirtualSnapshotVersion[0](org.eclipse.tycho.nexus.internal.plugin.UnzipRepositoryPluginITCase): Nexus was not in running state
  testUnzipRepoWithGroupRepoAsMaster[1](org.eclipse.tycho.nexus.internal.plugin.UnzipRepositoryPluginITCase): Nexus was not in running state
  testUnzipRepoWithVirtualSnapshotVersion[1](org.eclipse.tycho.nexus.internal.plugin.UnzipRepositoryPluginITCase): Nexus was not in running state

Tests in error: 
  testUnzipRepoWithHostedRepoAsMaster[0](org.eclipse.tycho.nexus.internal.plugin.UnzipRepositoryPluginITCase): nexus (nx) no command monitor detected at 127.0.0.1:54741 within 10 seconds
  testUnzipRepoWithHostedRepoAsMaster[1](org.eclipse.tycho.nexus.internal.plugin.UnzipRepositoryPluginITCase): nexus (nx) no command monitor detected at 127.0.0.1:36159 within 10 seconds

Tests run: 6, Failures: 4, Errors: 2, Skipped: 0

[INFO] 
[INFO] --- maven-failsafe-plugin:2.12.4:verify (default) @ unzip-repository-plugin-its ---
[INFO] Failsafe report directory: /jobs/genie.technology.tycho/tycho.nexus-nightly/workspace/unzip-repository-plugin-its/target/failsafe-reports
[INFO] ------------------------------------------------------------------------
[INFO] Reactor Summary:
[INFO] 
[INFO] Nexus Unzip Plugin - Parent (Incubation) .......... SUCCESS [5.247s]
[INFO] Nexus Unzip Plugin (Incubation) ................... SUCCESS [2:20.542s]
[INFO] Nexus Unzip Plugin - Integration Tests (Incubation)  FAILURE [1:51.239s]
[INFO] ------------------------------------------------------------------------
[INFO] BUILD FAILURE
[INFO] ------------------------------------------------------------------------
[INFO] Total time: 5:31.122s
[INFO] Finished at: Tue Sep 24 15:36:36 EDT 2013
[INFO] Final Memory: 41M/884M
[INFO] ------------------------------------------------------------------------
[INFO] o.h.m.e.h.MavenExecutionResultHandler - Build failed with exception(s)
[INFO] o.h.m.e.h.MavenExecutionResultHandler - [1] org.apache.maven.lifecycle.LifecycleExecutionException: Failed to execute goal org.apache.maven.plugins:maven-failsafe-plugin:2.12.4:verify (default) on project unzip-repository-plugin-its: There are test failures.

Please refer to /jobs/genie.technology.tycho/tycho.nexus-nightly/workspace/unzip-repository-plugin-its/target/failsafe-reports for the individual test results.
[DEBUG] Closing connection to remote
[ERROR] Failed to execute goal org.apache.maven.plugins:maven-failsafe-plugin:2.12.4:verify (default) on project unzip-repository-plugin-its: There are test failures.
[ERROR] 
[ERROR] Please refer to /jobs/genie.technology.tycho/tycho.nexus-nightly/workspace/unzip-repository-plugin-its/target/failsafe-reports for the individual test results.
[ERROR] -> [Help 1]
org.apache.maven.lifecycle.LifecycleExecutionException: Failed to execute goal org.apache.maven.plugins:maven-failsafe-plugin:2.12.4:verify (default) on project unzip-repository-plugin-its: There are test failures.

Please refer to /jobs/genie.technology.tycho/tycho.nexus-nightly/workspace/unzip-repository-plugin-its/target/failsafe-reports for the individual test results.
	at org.apache.maven.lifecycle.internal.MojoExecutor.execute(MojoExecutor.java:213)
	at org.apache.maven.lifecycle.internal.MojoExecutor.execute(MojoExecutor.java:153)
	at org.apache.maven.lifecycle.internal.MojoExecutor.execute(MojoExecutor.java:145)
	at org.apache.maven.lifecycle.internal.LifecycleModuleBuilder.buildProject(LifecycleModuleBuilder.java:84)
	at org.apache.maven.lifecycle.internal.LifecycleModuleBuilder.buildProject(LifecycleModuleBuilder.java:59)
	at org.apache.maven.lifecycle.internal.LifecycleStarter.singleThreadedBuild(LifecycleStarter.java:183)
	at org.apache.maven.lifecycle.internal.LifecycleStarter.execute(LifecycleStarter.java:161)
	at org.apache.maven.DefaultMaven.doExecute(DefaultMaven.java:319)
	at org.apache.maven.DefaultMaven.execute(DefaultMaven.java:156)
	at org.apache.maven.cli.MavenCli.execute(MavenCli.java:537)
	at org.apache.maven.cli.MavenCli.doMain(MavenCli.java:196)
	at org.apache.maven.cli.MavenCli.main(MavenCli.java:141)
	at sun.reflect.NativeMethodAccessorImpl.invoke0(Native Method)
	at sun.reflect.NativeMethodAccessorImpl.invoke(NativeMethodAccessorImpl.java:57)
	at sun.reflect.DelegatingMethodAccessorImpl.invoke(DelegatingMethodAccessorImpl.java:43)
	at java.lang.reflect.Method.invoke(Method.java:606)
	at org.codehaus.plexus.classworlds.launcher.Launcher.launchEnhanced(Launcher.java:290)
	at org.codehaus.plexus.classworlds.launcher.Launcher.launch(Launcher.java:230)
	at org.codehaus.plexus.classworlds.launcher.Launcher.mainWithExitCode(Launcher.java:409)
	at org.codehaus.plexus.classworlds.launcher.Launcher.main(Launcher.java:352)
Caused by: org.apache.maven.plugin.MojoFailureException: There are test failures.

Please refer to /jobs/genie.technology.tycho/tycho.nexus-nightly/workspace/unzip-repository-plugin-its/target/failsafe-reports for the individual test results.
	at org.apache.maven.plugin.surefire.SurefireHelper.reportExecution(SurefireHelper.java:121)
	at org.apache.maven.plugin.failsafe.VerifyMojo.execute(VerifyMojo.java:202)
	at org.apache.maven.plugin.DefaultBuildPluginManager.executeMojo(DefaultBuildPluginManager.java:101)
	at org.apache.maven.lifecycle.internal.MojoExecutor.execute(MojoExecutor.java:209)
	... 19 more
[ERROR] 
[ERROR] Re-run Maven using the -X switch to enable full debug logging.
[ERROR] 
[ERROR] For more information about the errors and possible solutions, please read the following articles:
[ERROR] [Help 1] http://cwiki.apache.org/confluence/display/MAVEN/MojoFailureException
[ERROR] 
[ERROR] After correcting the problems, you can resume the build with the command
[ERROR]   mvn <goals> -rf :unzip-repository-plugin-its
[DEBUG] Waiting for process to finish
[DEBUG] Result: 1
Recording test results
Sending e-mails to: jan.sievers@sap.com tobias.oberlies@sap.com
Finished: FAILURE