FailedConsole Output

Started by an SCM change
Building remotely on hudson-slave1
Checkout:tycho.nexus-nightly / /opt/users/hudsonbuild/workspace/tycho.nexus-nightly - hudson.remoting.Channel@181d4997:hudson-slave1
Using strategy: Default
Last Built Revision: Revision c532878647d1910a5b4816ee2892dab15bf2723e (origin/master)
Checkout:tycho.nexus-nightly / /opt/users/hudsonbuild/workspace/tycho.nexus-nightly - hudson.remoting.LocalChannel@6501d24d
Fetching changes from the remote Git repository
Fetching upstream changes from git://git.eclipse.org/gitroot/tycho/org.eclipse.tycho.nexus.git
Commencing build of Revision 2e5c55e705f670ff7b589f1c4f1f63c1e63286c4 (origin/master)
Checking out Revision 2e5c55e705f670ff7b589f1c4f1f63c1e63286c4 (origin/master)
[INFO] Using bundled Maven 3 installation
[INFO] Checking Maven 3 installation environment
[tycho.nexus-nightly] $ /opt/users/hudsonbuild/maven/slavebundle/bundled-maven/bin/mvn --help
[INFO] Checking Maven 3 installation version
[tycho.nexus-nightly] $ /opt/users/hudsonbuild/maven/slavebundle/bundled-maven/bin/mvn --version
[INFO] Detected Maven 3 installation version: 3.0.3
[WARN] Detected superfluous option: -B
[WARN] Detected superfluous option: -V
[DEBUG] Waiting for connection on port: 57347
[tycho.nexus-nightly] $ /opt/users/hudsonbuild/maven/slavebundle/bundled-maven/bin/mvn clean install -B -e -V -V -B -Dmaven.ext.class.path=/opt/users/hudsonbuild/maven/slavebundle/resources:/opt/users/hudsonbuild/maven/slavebundle/lib/maven3-eventspy-3.0.jar:/opt/users/hudsonbuild/slave.jar -Dhudson.eventspy.port=57347 -Dmaven.repo.local=/opt/users/hudsonbuild/workspace/tycho.nexus-nightly/.maven/repo -f pom.xml
Apache Maven 3.0.3 (r1075438; 2011-02-28 12:31:09-0500)
Maven home: /opt/users/hudsonbuild/maven/slavebundle/bundled-maven
Java version: 1.6.0_21, vendor: Sun Microsystems Inc.
Java home: /opt/public/common/sun-jdk1.6.0_21_x64/jre
Default locale: en_US, platform encoding: UTF-8
OS name: "linux", version: "2.6.32.59-0.7-xen", arch: "amd64", family: "unix"
[DEBUG] Connected to remote
[INFO] Error stacktraces are turned on.
[INFO] Scanning for projects...
[INFO]                                                                         
[INFO] ------------------------------------------------------------------------
[INFO] Building Unzip Repository Nexus Plugin (Incubation) 0.12.0-SNAPSHOT
[INFO] ------------------------------------------------------------------------
Downloading: https://repository.sonatype.org/content/groups/forge/org/sonatype/nexus/nexus-plugin-api/2.6.0-05/nexus-plugin-api-2.6.0-05.pom
Downloaded: https://repository.sonatype.org/content/groups/forge/org/sonatype/nexus/nexus-plugin-api/2.6.0-05/nexus-plugin-api-2.6.0-05.pom (4 KB at 3.7 KB/sec)
Downloading: https://repository.sonatype.org/content/groups/forge/org/sonatype/nexus/nexus-components/2.6.0-05/nexus-components-2.6.0-05.pom
Downloaded: https://repository.sonatype.org/content/groups/forge/org/sonatype/nexus/nexus-components/2.6.0-05/nexus-components-2.6.0-05.pom (3 KB at 7.0 KB/sec)
Downloading: https://repository.sonatype.org/content/groups/forge/org/sonatype/nexus/nexus-oss/2.6.0-05/nexus-oss-2.6.0-05.pom
Downloaded: https://repository.sonatype.org/content/groups/forge/org/sonatype/nexus/nexus-oss/2.6.0-05/nexus-oss-2.6.0-05.pom (36 KB at 95.4 KB/sec)
Downloading: https://repository.sonatype.org/content/groups/forge/org/sonatype/forge/forge-parent/38/forge-parent-38.pom
Downloaded: https://repository.sonatype.org/content/groups/forge/org/sonatype/forge/forge-parent/38/forge-parent-38.pom (19 KB at 64.0 KB/sec)
Downloading: https://repository.sonatype.org/content/groups/forge/org/sonatype/nexus/buildsupport/nexus-buildsupport-all/2.6.0-05/nexus-buildsupport-all-2.6.0-05.pom
Downloaded: https://repository.sonatype.org/content/groups/forge/org/sonatype/nexus/buildsupport/nexus-buildsupport-all/2.6.0-05/nexus-buildsupport-all-2.6.0-05.pom (6 KB at 13.6 KB/sec)
Downloading: https://repository.sonatype.org/content/groups/forge/org/sonatype/nexus/buildsupport/nexus-buildsupport/2.6.0-05/nexus-buildsupport-2.6.0-05.pom
Downloaded: https://repository.sonatype.org/content/groups/forge/org/sonatype/nexus/buildsupport/nexus-buildsupport/2.6.0-05/nexus-buildsupport-2.6.0-05.pom (2 KB at 6.0 KB/sec)
Downloading: https://repository.sonatype.org/content/groups/forge/org/sonatype/nexus/buildsupport/nexus-buildsupport-commons/2.6.0-05/nexus-buildsupport-commons-2.6.0-05.pom
Downloaded: https://repository.sonatype.org/content/groups/forge/org/sonatype/nexus/buildsupport/nexus-buildsupport-commons/2.6.0-05/nexus-buildsupport-commons-2.6.0-05.pom (3 KB at 7.2 KB/sec)
Downloading: https://repository.sonatype.org/content/groups/forge/org/sonatype/nexus/buildsupport/nexus-buildsupport-httpclient/2.6.0-05/nexus-buildsupport-httpclient-2.6.0-05.pom
Downloaded: https://repository.sonatype.org/content/groups/forge/org/sonatype/nexus/buildsupport/nexus-buildsupport-httpclient/2.6.0-05/nexus-buildsupport-httpclient-2.6.0-05.pom (3 KB at 6.2 KB/sec)
Downloading: https://repository.sonatype.org/content/groups/forge/org/sonatype/nexus/buildsupport/nexus-buildsupport-maven/2.6.0-05/nexus-buildsupport-maven-2.6.0-05.pom
Downloaded: https://repository.sonatype.org/content/groups/forge/org/sonatype/nexus/buildsupport/nexus-buildsupport-maven/2.6.0-05/nexus-buildsupport-maven-2.6.0-05.pom (7 KB at 16.4 KB/sec)
Downloading: https://repository.sonatype.org/content/groups/forge/org/sonatype/nexus/buildsupport/nexus-buildsupport-shiro/2.6.0-05/nexus-buildsupport-shiro-2.6.0-05.pom
Downloaded: https://repository.sonatype.org/content/groups/forge/org/sonatype/nexus/buildsupport/nexus-buildsupport-shiro/2.6.0-05/nexus-buildsupport-shiro-2.6.0-05.pom (4 KB at 9.3 KB/sec)
Downloading: https://repository.sonatype.org/content/groups/forge/org/sonatype/nexus/buildsupport/nexus-buildsupport-bouncycastle/2.6.0-05/nexus-buildsupport-bouncycastle-2.6.0-05.pom
Downloaded: https://repository.sonatype.org/content/groups/forge/org/sonatype/nexus/buildsupport/nexus-buildsupport-bouncycastle/2.6.0-05/nexus-buildsupport-bouncycastle-2.6.0-05.pom (3 KB at 6.5 KB/sec)
Downloading: https://repository.sonatype.org/content/groups/forge/org/sonatype/nexus/buildsupport/nexus-buildsupport-jetty/2.6.0-05/nexus-buildsupport-jetty-2.6.0-05.pom
Downloaded: https://repository.sonatype.org/content/groups/forge/org/sonatype/nexus/buildsupport/nexus-buildsupport-jetty/2.6.0-05/nexus-buildsupport-jetty-2.6.0-05.pom (5 KB at 12.3 KB/sec)
Downloading: https://repository.sonatype.org/content/groups/forge/org/sonatype/nexus/buildsupport/nexus-buildsupport-goodies/2.6.0-05/nexus-buildsupport-goodies-2.6.0-05.pom
Downloaded: https://repository.sonatype.org/content/groups/forge/org/sonatype/nexus/buildsupport/nexus-buildsupport-goodies/2.6.0-05/nexus-buildsupport-goodies-2.6.0-05.pom (4 KB at 11.6 KB/sec)
Downloading: https://repository.sonatype.org/content/groups/forge/org/sonatype/nexus/buildsupport/nexus-buildsupport-groovy/2.6.0-05/nexus-buildsupport-groovy-2.6.0-05.pom
Downloaded: https://repository.sonatype.org/content/groups/forge/org/sonatype/nexus/buildsupport/nexus-buildsupport-groovy/2.6.0-05/nexus-buildsupport-groovy-2.6.0-05.pom (3 KB at 8.1 KB/sec)
Downloading: https://repository.sonatype.org/content/groups/forge/org/sonatype/nexus/buildsupport/nexus-buildsupport-guice/2.6.0-05/nexus-buildsupport-guice-2.6.0-05.pom
Downloaded: https://repository.sonatype.org/content/groups/forge/org/sonatype/nexus/buildsupport/nexus-buildsupport-guice/2.6.0-05/nexus-buildsupport-guice-2.6.0-05.pom (4 KB at 10.0 KB/sec)
Downloading: https://repository.sonatype.org/content/groups/forge/org/sonatype/nexus/buildsupport/nexus-buildsupport-logging/2.6.0-05/nexus-buildsupport-logging-2.6.0-05.pom
Downloaded: https://repository.sonatype.org/content/groups/forge/org/sonatype/nexus/buildsupport/nexus-buildsupport-logging/2.6.0-05/nexus-buildsupport-logging-2.6.0-05.pom (4 KB at 9.8 KB/sec)
Downloading: https://repository.sonatype.org/content/groups/forge/org/sonatype/nexus/buildsupport/nexus-buildsupport-other/2.6.0-05/nexus-buildsupport-other-2.6.0-05.pom
Downloaded: https://repository.sonatype.org/content/groups/forge/org/sonatype/nexus/buildsupport/nexus-buildsupport-other/2.6.0-05/nexus-buildsupport-other-2.6.0-05.pom (7 KB at 17.1 KB/sec)
Downloading: https://repository.sonatype.org/content/groups/forge/org/sonatype/nexus/buildsupport/nexus-buildsupport-plexus/2.6.0-05/nexus-buildsupport-plexus-2.6.0-05.pom
Downloaded: https://repository.sonatype.org/content/groups/forge/org/sonatype/nexus/buildsupport/nexus-buildsupport-plexus/2.6.0-05/nexus-buildsupport-plexus-2.6.0-05.pom (5 KB at 10.8 KB/sec)
Downloading: https://repository.sonatype.org/content/groups/forge/org/sonatype/nexus/buildsupport/nexus-buildsupport-rest/2.6.0-05/nexus-buildsupport-rest-2.6.0-05.pom
Downloaded: https://repository.sonatype.org/content/groups/forge/org/sonatype/nexus/buildsupport/nexus-buildsupport-rest/2.6.0-05/nexus-buildsupport-rest-2.6.0-05.pom (5 KB at 11.9 KB/sec)
Downloading: https://repository.sonatype.org/content/groups/forge/org/sonatype/nexus/buildsupport/nexus-buildsupport-testing/2.6.0-05/nexus-buildsupport-testing-2.6.0-05.pom
Downloaded: https://repository.sonatype.org/content/groups/forge/org/sonatype/nexus/buildsupport/nexus-buildsupport-testing/2.6.0-05/nexus-buildsupport-testing-2.6.0-05.pom (5 KB at 13.2 KB/sec)
Downloading: https://repository.sonatype.org/content/groups/forge/org/sonatype/nexus/buildsupport/nexus-buildsupport-metrics/2.6.0-05/nexus-buildsupport-metrics-2.6.0-05.pom
Downloaded: https://repository.sonatype.org/content/groups/forge/org/sonatype/nexus/buildsupport/nexus-buildsupport-metrics/2.6.0-05/nexus-buildsupport-metrics-2.6.0-05.pom (3 KB at 9.6 KB/sec)
Downloading: https://repository.sonatype.org/content/groups/forge/org/sonatype/nexus/nexus-core/2.6.0-05/nexus-core-2.6.0-05.pom
Downloaded: https://repository.sonatype.org/content/groups/forge/org/sonatype/nexus/nexus-core/2.6.0-05/nexus-core-2.6.0-05.pom (10 KB at 26.8 KB/sec)
Downloading: https://repository.sonatype.org/content/groups/forge/org/sonatype/nexus/nexus-compat/2.6.0-05/nexus-compat-2.6.0-05.pom
Downloaded: https://repository.sonatype.org/content/groups/forge/org/sonatype/nexus/nexus-compat/2.6.0-05/nexus-compat-2.6.0-05.pom (2 KB at 5.2 KB/sec)
Downloading: https://repository.sonatype.org/content/groups/forge/org/sonatype/nexus/nexus-configuration-model/2.6.0-05/nexus-configuration-model-2.6.0-05.pom
Downloaded: https://repository.sonatype.org/content/groups/forge/org/sonatype/nexus/nexus-configuration-model/2.6.0-05/nexus-configuration-model-2.6.0-05.pom (6 KB at 16.7 KB/sec)
Downloading: https://repository.sonatype.org/content/groups/forge/org/sonatype/nexus/base-configuration/2.6.0-05/base-configuration-2.6.0-05.pom
Downloaded: https://repository.sonatype.org/content/groups/forge/org/sonatype/nexus/base-configuration/2.6.0-05/base-configuration-2.6.0-05.pom (2 KB at 4.6 KB/sec)
Downloading: https://repository.sonatype.org/content/groups/forge/org/slf4j/slf4j-api/1.7.5/slf4j-api-1.7.5.pom
Downloading: http://repo1.maven.org/maven2/org/slf4j/slf4j-api/1.7.5/slf4j-api-1.7.5.pom
Downloaded: http://repo1.maven.org/maven2/org/slf4j/slf4j-api/1.7.5/slf4j-api-1.7.5.pom (3 KB at 10.8 KB/sec)
Downloading: https://repository.sonatype.org/content/groups/forge/org/slf4j/slf4j-parent/1.7.5/slf4j-parent-1.7.5.pom
Downloading: http://repo1.maven.org/maven2/org/slf4j/slf4j-parent/1.7.5/slf4j-parent-1.7.5.pom
Downloaded: http://repo1.maven.org/maven2/org/slf4j/slf4j-parent/1.7.5/slf4j-parent-1.7.5.pom (12 KB at 93.7 KB/sec)
Downloading: https://repository.sonatype.org/content/groups/forge/org/sonatype/nexus/nexus-repository-metadata-api/2.6.0-05/nexus-repository-metadata-api-2.6.0-05.pom
Downloaded: https://repository.sonatype.org/content/groups/forge/org/sonatype/nexus/nexus-repository-metadata-api/2.6.0-05/nexus-repository-metadata-api-2.6.0-05.pom (2 KB at 5.6 KB/sec)
Downloading: https://repository.sonatype.org/content/groups/forge/org/sonatype/nexus/nexus-repository-metadata-model/2.6.0-05/nexus-repository-metadata-model-2.6.0-05.pom
Downloaded: https://repository.sonatype.org/content/groups/forge/org/sonatype/nexus/nexus-repository-metadata-model/2.6.0-05/nexus-repository-metadata-model-2.6.0-05.pom (3 KB at 6.8 KB/sec)
Downloading: https://repository.sonatype.org/content/groups/forge/org/sonatype/sisu/sisu-inject-plexus/2.3.4/sisu-inject-plexus-2.3.4.pom
Downloaded: https://repository.sonatype.org/content/groups/forge/org/sonatype/sisu/sisu-inject-plexus/2.3.4/sisu-inject-plexus-2.3.4.pom (8 KB at 21.4 KB/sec)
Downloading: https://repository.sonatype.org/content/groups/forge/org/sonatype/sisu/inject/containers/2.3.4/containers-2.3.4.pom
Downloaded: https://repository.sonatype.org/content/groups/forge/org/sonatype/sisu/inject/containers/2.3.4/containers-2.3.4.pom (989 B at 2.6 KB/sec)
Downloading: https://repository.sonatype.org/content/groups/forge/org/sonatype/sisu/sisu-inject/2.3.4/sisu-inject-2.3.4.pom
Downloaded: https://repository.sonatype.org/content/groups/forge/org/sonatype/sisu/sisu-inject/2.3.4/sisu-inject-2.3.4.pom (4 KB at 11.0 KB/sec)
Downloading: https://repository.sonatype.org/content/groups/forge/org/sonatype/sisu/sisu-parent/2.3.4/sisu-parent-2.3.4.pom
Downloaded: https://repository.sonatype.org/content/groups/forge/org/sonatype/sisu/sisu-parent/2.3.4/sisu-parent-2.3.4.pom (11 KB at 29.7 KB/sec)
Downloading: https://repository.sonatype.org/content/groups/forge/org/sonatype/forge/forge-parent/31/forge-parent-31.pom
Downloaded: https://repository.sonatype.org/content/groups/forge/org/sonatype/forge/forge-parent/31/forge-parent-31.pom (19 KB at 61.0 KB/sec)
Downloading: https://repository.sonatype.org/content/groups/forge/org/codehaus/plexus/plexus-classworlds/2.4.2/plexus-classworlds-2.4.2.pom
Downloaded: https://repository.sonatype.org/content/groups/forge/org/codehaus/plexus/plexus-classworlds/2.4.2/plexus-classworlds-2.4.2.pom (4 KB at 10.6 KB/sec)
Downloading: https://repository.sonatype.org/content/groups/forge/org/sonatype/sisu/sisu-inject-bean/2.3.4/sisu-inject-bean-2.3.4.pom
Downloaded: https://repository.sonatype.org/content/groups/forge/org/sonatype/sisu/sisu-inject-bean/2.3.4/sisu-inject-bean-2.3.4.pom (11 KB at 33.5 KB/sec)
Downloading: https://repository.sonatype.org/content/groups/forge/org/sonatype/sisu/sisu-guice/3.1.3/sisu-guice-3.1.3.pom
Downloaded: https://repository.sonatype.org/content/groups/forge/org/sonatype/sisu/sisu-guice/3.1.3/sisu-guice-3.1.3.pom (10 KB at 33.8 KB/sec)
Downloading: https://repository.sonatype.org/content/groups/forge/org/sonatype/sisu/inject/guice-parent/3.1.3/guice-parent-3.1.3.pom
Downloaded: https://repository.sonatype.org/content/groups/forge/org/sonatype/sisu/inject/guice-parent/3.1.3/guice-parent-3.1.3.pom (12 KB at 38.8 KB/sec)
Downloading: https://repository.sonatype.org/content/groups/forge/com/google/guava/guava/14.0.1/guava-14.0.1.pom
Downloading: http://repo1.maven.org/maven2/com/google/guava/guava/14.0.1/guava-14.0.1.pom
Downloaded: http://repo1.maven.org/maven2/com/google/guava/guava/14.0.1/guava-14.0.1.pom (6 KB at 31.2 KB/sec)
Downloading: https://repository.sonatype.org/content/groups/forge/com/google/guava/guava-parent/14.0.1/guava-parent-14.0.1.pom
Downloading: http://repo1.maven.org/maven2/com/google/guava/guava-parent/14.0.1/guava-parent-14.0.1.pom
Downloaded: http://repo1.maven.org/maven2/com/google/guava/guava-parent/14.0.1/guava-parent-14.0.1.pom (3 KB at 25.0 KB/sec)
Downloading: https://repository.sonatype.org/content/groups/forge/org/sonatype/sisu/goodies/goodies-common/1.6.1/goodies-common-1.6.1.pom
Downloaded: https://repository.sonatype.org/content/groups/forge/org/sonatype/sisu/goodies/goodies-common/1.6.1/goodies-common-1.6.1.pom (3 KB at 5.6 KB/sec)
Downloading: https://repository.sonatype.org/content/groups/forge/org/sonatype/sisu/goodies/goodies/1.6.1/goodies-1.6.1.pom
Downloaded: https://repository.sonatype.org/content/groups/forge/org/sonatype/sisu/goodies/goodies/1.6.1/goodies-1.6.1.pom (18 KB at 51.5 KB/sec)
Downloading: https://repository.sonatype.org/content/groups/forge/org/sonatype/forge/forge-parent/32/forge-parent-32.pom
Downloaded: https://repository.sonatype.org/content/groups/forge/org/sonatype/forge/forge-parent/32/forge-parent-32.pom (19 KB at 53.4 KB/sec)
Downloading: https://repository.sonatype.org/content/groups/forge/org/sonatype/sisu/goodies/goodies-eventbus/1.6.1/goodies-eventbus-1.6.1.pom
Downloaded: https://repository.sonatype.org/content/groups/forge/org/sonatype/sisu/goodies/goodies-eventbus/1.6.1/goodies-eventbus-1.6.1.pom (2 KB at 5.3 KB/sec)
Downloading: https://repository.sonatype.org/content/groups/forge/commons-beanutils/commons-beanutils-core/1.8.3-SONATYPE/commons-beanutils-core-1.8.3-SONATYPE.pom
Downloaded: https://repository.sonatype.org/content/groups/forge/commons-beanutils/commons-beanutils-core/1.8.3-SONATYPE/commons-beanutils-core-1.8.3-SONATYPE.pom (2 KB at 6.7 KB/sec)
Downloading: https://repository.sonatype.org/content/groups/forge/commons-codec/commons-codec/1.8/commons-codec-1.8.pom
Downloading: http://repo1.maven.org/maven2/commons-codec/commons-codec/1.8/commons-codec-1.8.pom
Downloaded: http://repo1.maven.org/maven2/commons-codec/commons-codec/1.8/commons-codec-1.8.pom (12 KB at 90.6 KB/sec)
Downloading: https://repository.sonatype.org/content/groups/forge/org/apache/commons/commons-parent/28/commons-parent-28.pom
Downloading: http://repo1.maven.org/maven2/org/apache/commons/commons-parent/28/commons-parent-28.pom
Downloaded: http://repo1.maven.org/maven2/org/apache/commons/commons-parent/28/commons-parent-28.pom (49 KB at 289.8 KB/sec)
Downloading: https://repository.sonatype.org/content/groups/forge/org/apache/apache/13/apache-13.pom
Downloading: http://repo1.maven.org/maven2/org/apache/apache/13/apache-13.pom
Downloaded: http://repo1.maven.org/maven2/org/apache/apache/13/apache-13.pom (14 KB at 110.9 KB/sec)
Downloading: https://repository.sonatype.org/content/groups/forge/org/codehaus/plexus/plexus-interpolation/1.16/plexus-interpolation-1.16.pom
Downloaded: https://repository.sonatype.org/content/groups/forge/org/codehaus/plexus/plexus-interpolation/1.16/plexus-interpolation-1.16.pom (2 KB at 3.2 KB/sec)
Downloading: https://repository.sonatype.org/content/groups/forge/org/codehaus/plexus/plexus-components/1.3/plexus-components-1.3.pom
Downloaded: https://repository.sonatype.org/content/groups/forge/org/codehaus/plexus/plexus-components/1.3/plexus-components-1.3.pom (3 KB at 9.2 KB/sec)
Downloading: https://repository.sonatype.org/content/groups/forge/org/codehaus/plexus/plexus/3.3/plexus-3.3.pom
Downloaded: https://repository.sonatype.org/content/groups/forge/org/codehaus/plexus/plexus/3.3/plexus-3.3.pom (20 KB at 54.7 KB/sec)
Downloading: https://repository.sonatype.org/content/groups/forge/com/thoughtworks/xstream/xstream/1.4.4/xstream-1.4.4.pom
Downloading: http://repo1.maven.org/maven2/com/thoughtworks/xstream/xstream/1.4.4/xstream-1.4.4.pom
Downloaded: http://repo1.maven.org/maven2/com/thoughtworks/xstream/xstream/1.4.4/xstream-1.4.4.pom (9 KB at 67.1 KB/sec)
Downloading: https://repository.sonatype.org/content/groups/forge/com/thoughtworks/xstream/xstream-parent/1.4.4/xstream-parent-1.4.4.pom
Downloading: http://repo1.maven.org/maven2/com/thoughtworks/xstream/xstream-parent/1.4.4/xstream-parent-1.4.4.pom
Downloaded: http://repo1.maven.org/maven2/com/thoughtworks/xstream/xstream-parent/1.4.4/xstream-parent-1.4.4.pom (19 KB at 153.4 KB/sec)
Downloading: https://repository.sonatype.org/content/groups/forge/org/codehaus/jackson/jackson-mapper-asl/1.9.12/jackson-mapper-asl-1.9.12.pom
Downloading: http://repo1.maven.org/maven2/org/codehaus/jackson/jackson-mapper-asl/1.9.12/jackson-mapper-asl-1.9.12.pom
Downloaded: http://repo1.maven.org/maven2/org/codehaus/jackson/jackson-mapper-asl/1.9.12/jackson-mapper-asl-1.9.12.pom (2 KB at 10.9 KB/sec)
Downloading: https://repository.sonatype.org/content/groups/forge/org/codehaus/jackson/jackson-core-asl/1.9.12/jackson-core-asl-1.9.12.pom
Downloading: http://repo1.maven.org/maven2/org/codehaus/jackson/jackson-core-asl/1.9.12/jackson-core-asl-1.9.12.pom
Downloaded: http://repo1.maven.org/maven2/org/codehaus/jackson/jackson-core-asl/1.9.12/jackson-core-asl-1.9.12.pom (2 KB at 11.2 KB/sec)
Downloading: https://repository.sonatype.org/content/groups/forge/org/apache/httpcomponents/httpclient/4.2.5/httpclient-4.2.5.pom
Downloading: http://repo1.maven.org/maven2/org/apache/httpcomponents/httpclient/4.2.5/httpclient-4.2.5.pom
Downloaded: http://repo1.maven.org/maven2/org/apache/httpcomponents/httpclient/4.2.5/httpclient-4.2.5.pom (6 KB at 47.7 KB/sec)
Downloading: https://repository.sonatype.org/content/groups/forge/org/apache/httpcomponents/httpcomponents-client/4.2.5/httpcomponents-client-4.2.5.pom
Downloading: http://repo1.maven.org/maven2/org/apache/httpcomponents/httpcomponents-client/4.2.5/httpcomponents-client-4.2.5.pom
Downloaded: http://repo1.maven.org/maven2/org/apache/httpcomponents/httpcomponents-client/4.2.5/httpcomponents-client-4.2.5.pom (15 KB at 116.3 KB/sec)
Downloading: https://repository.sonatype.org/content/groups/forge/org/apache/httpcomponents/httpcore/4.2.4/httpcore-4.2.4.pom
Downloading: http://repo1.maven.org/maven2/org/apache/httpcomponents/httpcore/4.2.4/httpcore-4.2.4.pom
Downloaded: http://repo1.maven.org/maven2/org/apache/httpcomponents/httpcore/4.2.4/httpcore-4.2.4.pom (6 KB at 44.8 KB/sec)
Downloading: https://repository.sonatype.org/content/groups/forge/org/apache/httpcomponents/httpcomponents-core/4.2.4/httpcomponents-core-4.2.4.pom
Downloading: http://repo1.maven.org/maven2/org/apache/httpcomponents/httpcomponents-core/4.2.4/httpcomponents-core-4.2.4.pom
Downloaded: http://repo1.maven.org/maven2/org/apache/httpcomponents/httpcomponents-core/4.2.4/httpcomponents-core-4.2.4.pom (12 KB at 93.8 KB/sec)
Downloading: https://repository.sonatype.org/content/groups/forge/org/apache/maven/maven-model/3.0.5/maven-model-3.0.5.pom
Downloading: http://repo1.maven.org/maven2/org/apache/maven/maven-model/3.0.5/maven-model-3.0.5.pom
Downloaded: http://repo1.maven.org/maven2/org/apache/maven/maven-model/3.0.5/maven-model-3.0.5.pom (4 KB at 37.5 KB/sec)
Downloading: https://repository.sonatype.org/content/groups/forge/org/apache/maven/maven/3.0.5/maven-3.0.5.pom
Downloading: http://repo1.maven.org/maven2/org/apache/maven/maven/3.0.5/maven-3.0.5.pom
Downloaded: http://repo1.maven.org/maven2/org/apache/maven/maven/3.0.5/maven-3.0.5.pom (22 KB at 180.9 KB/sec)
Downloading: https://repository.sonatype.org/content/groups/forge/org/apache/maven/maven-parent/23/maven-parent-23.pom
Downloading: http://repo1.maven.org/maven2/org/apache/maven/maven-parent/23/maven-parent-23.pom
Downloaded: http://repo1.maven.org/maven2/org/apache/maven/maven-parent/23/maven-parent-23.pom (32 KB at 219.5 KB/sec)
Downloading: https://repository.sonatype.org/content/groups/forge/org/apache/maven/maven-repository-metadata/3.0.5/maven-repository-metadata-3.0.5.pom
Downloading: http://repo1.maven.org/maven2/org/apache/maven/maven-repository-metadata/3.0.5/maven-repository-metadata-3.0.5.pom
Downloaded: http://repo1.maven.org/maven2/org/apache/maven/maven-repository-metadata/3.0.5/maven-repository-metadata-3.0.5.pom (2 KB at 0.9 KB/sec)
Downloading: https://repository.sonatype.org/content/groups/forge/org/sonatype/aether/aether-api/1.13.1/aether-api-1.13.1.pom
Downloaded: https://repository.sonatype.org/content/groups/forge/org/sonatype/aether/aether-api/1.13.1/aether-api-1.13.1.pom (2 KB at 0.9 KB/sec)
Downloading: https://repository.sonatype.org/content/groups/forge/org/sonatype/aether/aether/1.13.1/aether-1.13.1.pom
Downloaded: https://repository.sonatype.org/content/groups/forge/org/sonatype/aether/aether/1.13.1/aether-1.13.1.pom (10 KB at 29.2 KB/sec)
Downloading: https://repository.sonatype.org/content/groups/forge/org/sonatype/aether/aether-util/1.13.1/aether-util-1.13.1.pom
Downloaded: https://repository.sonatype.org/content/groups/forge/org/sonatype/aether/aether-util/1.13.1/aether-util-1.13.1.pom (2 KB at 5.5 KB/sec)
Downloading: https://repository.sonatype.org/content/groups/forge/org/sonatype/aether/aether-spi/1.13.1/aether-spi-1.13.1.pom
Downloaded: https://repository.sonatype.org/content/groups/forge/org/sonatype/aether/aether-spi/1.13.1/aether-spi-1.13.1.pom (2 KB at 4.7 KB/sec)
Downloading: https://repository.sonatype.org/content/groups/forge/org/sonatype/aether/aether-impl/1.13.1/aether-impl-1.13.1.pom
Downloaded: https://repository.sonatype.org/content/groups/forge/org/sonatype/aether/aether-impl/1.13.1/aether-impl-1.13.1.pom (3 KB at 7.9 KB/sec)
Downloading: https://repository.sonatype.org/content/groups/forge/org/sonatype/nexus/nexus-security/2.6.0-05/nexus-security-2.6.0-05.pom
Downloaded: https://repository.sonatype.org/content/groups/forge/org/sonatype/nexus/nexus-security/2.6.0-05/nexus-security-2.6.0-05.pom (6 KB at 14.6 KB/sec)
Downloading: https://repository.sonatype.org/content/groups/forge/org/sonatype/sisu/sisu-guice/3.1.4/sisu-guice-3.1.4.pom
Downloaded: https://repository.sonatype.org/content/groups/forge/org/sonatype/sisu/sisu-guice/3.1.4/sisu-guice-3.1.4.pom (11 KB at 30.3 KB/sec)
Downloading: https://repository.sonatype.org/content/groups/forge/org/sonatype/sisu/inject/guice-parent/3.1.4/guice-parent-3.1.4.pom
Downloaded: https://repository.sonatype.org/content/groups/forge/org/sonatype/sisu/inject/guice-parent/3.1.4/guice-parent-3.1.4.pom (11 KB at 28.9 KB/sec)
Downloading: https://repository.sonatype.org/content/groups/forge/org/sonatype/forge/forge-parent/35/forge-parent-35.pom
Downloaded: https://repository.sonatype.org/content/groups/forge/org/sonatype/forge/forge-parent/35/forge-parent-35.pom (18 KB at 53.5 KB/sec)
Downloading: https://repository.sonatype.org/content/groups/forge/aopalliance/aopalliance/1.0/aopalliance-1.0.pom
[WARNING] Checksum validation failed, no checksums available from the repository for https://repository.sonatype.org/content/groups/forge/aopalliance/aopalliance/1.0/aopalliance-1.0.pom
Downloaded: https://repository.sonatype.org/content/groups/forge/aopalliance/aopalliance/1.0/aopalliance-1.0.pom (363 B at 0.8 KB/sec)
Downloading: https://repository.sonatype.org/content/groups/forge/com/google/guava/guava/11.0.2/guava-11.0.2.pom
Downloading: http://repo1.maven.org/maven2/com/google/guava/guava/11.0.2/guava-11.0.2.pom
Downloaded: http://repo1.maven.org/maven2/com/google/guava/guava/11.0.2/guava-11.0.2.pom (6 KB at 52.9 KB/sec)
Downloading: https://repository.sonatype.org/content/groups/forge/com/google/guava/guava-parent/11.0.2/guava-parent-11.0.2.pom
Downloading: http://repo1.maven.org/maven2/com/google/guava/guava-parent/11.0.2/guava-parent-11.0.2.pom
Downloaded: http://repo1.maven.org/maven2/com/google/guava/guava-parent/11.0.2/guava-parent-11.0.2.pom (2 KB at 19.5 KB/sec)
Downloading: https://repository.sonatype.org/content/groups/forge/org/apache/shiro/shiro-core/1.2.2/shiro-core-1.2.2.pom
Downloading: http://repo1.maven.org/maven2/org/apache/shiro/shiro-core/1.2.2/shiro-core-1.2.2.pom
Downloaded: http://repo1.maven.org/maven2/org/apache/shiro/shiro-core/1.2.2/shiro-core-1.2.2.pom (5 KB at 40.9 KB/sec)
Downloading: https://repository.sonatype.org/content/groups/forge/org/apache/shiro/shiro-root/1.2.2/shiro-root-1.2.2.pom
Downloading: http://repo1.maven.org/maven2/org/apache/shiro/shiro-root/1.2.2/shiro-root-1.2.2.pom
Downloaded: http://repo1.maven.org/maven2/org/apache/shiro/shiro-root/1.2.2/shiro-root-1.2.2.pom (43 KB at 237.6 KB/sec)
Downloading: https://repository.sonatype.org/content/groups/forge/org/apache/shiro/shiro-ehcache/1.2.2/shiro-ehcache-1.2.2.pom
Downloading: http://repo1.maven.org/maven2/org/apache/shiro/shiro-ehcache/1.2.2/shiro-ehcache-1.2.2.pom
Downloaded: http://repo1.maven.org/maven2/org/apache/shiro/shiro-ehcache/1.2.2/shiro-ehcache-1.2.2.pom (3 KB at 29.1 KB/sec)
Downloading: https://repository.sonatype.org/content/groups/forge/org/apache/shiro/shiro-guice/1.2.2/shiro-guice-1.2.2.pom
Downloading: http://repo1.maven.org/maven2/org/apache/shiro/shiro-guice/1.2.2/shiro-guice-1.2.2.pom
Downloaded: http://repo1.maven.org/maven2/org/apache/shiro/shiro-guice/1.2.2/shiro-guice-1.2.2.pom (4 KB at 36.2 KB/sec)
Downloading: https://repository.sonatype.org/content/groups/forge/org/sonatype/sisu/inject/guice-multibindings/3.1.4/guice-multibindings-3.1.4.pom
Downloaded: https://repository.sonatype.org/content/groups/forge/org/sonatype/sisu/inject/guice-multibindings/3.1.4/guice-multibindings-3.1.4.pom (543 B at 1.4 KB/sec)
Downloading: https://repository.sonatype.org/content/groups/forge/org/sonatype/sisu/inject/extensions-parent/3.1.4/extensions-parent-3.1.4.pom
Downloaded: https://repository.sonatype.org/content/groups/forge/org/sonatype/sisu/inject/extensions-parent/3.1.4/extensions-parent-3.1.4.pom (3 KB at 8.8 KB/sec)
Downloading: https://repository.sonatype.org/content/groups/forge/org/sonatype/nexus/nexus-ehcache/2.6.0-05/nexus-ehcache-2.6.0-05.pom
Downloaded: https://repository.sonatype.org/content/groups/forge/org/sonatype/nexus/nexus-ehcache/2.6.0-05/nexus-ehcache-2.6.0-05.pom (3 KB at 7.1 KB/sec)
Downloading: https://repository.sonatype.org/content/groups/forge/org/sonatype/nexus/nexus-appcontext/2.6.0-05/nexus-appcontext-2.6.0-05.pom
Downloaded: https://repository.sonatype.org/content/groups/forge/org/sonatype/nexus/nexus-appcontext/2.6.0-05/nexus-appcontext-2.6.0-05.pom (2 KB at 5.5 KB/sec)
Downloading: https://repository.sonatype.org/content/groups/forge/org/slf4j/jcl-over-slf4j/1.7.5/jcl-over-slf4j-1.7.5.pom
Downloading: http://repo1.maven.org/maven2/org/slf4j/jcl-over-slf4j/1.7.5/jcl-over-slf4j-1.7.5.pom
Downloaded: http://repo1.maven.org/maven2/org/slf4j/jcl-over-slf4j/1.7.5/jcl-over-slf4j-1.7.5.pom (2 KB at 17.6 KB/sec)
Downloading: https://repository.sonatype.org/content/groups/forge/org/apache/shiro/shiro-web/1.2.2/shiro-web-1.2.2.pom
Downloading: http://repo1.maven.org/maven2/org/apache/shiro/shiro-web/1.2.2/shiro-web-1.2.2.pom
Downloaded: http://repo1.maven.org/maven2/org/apache/shiro/shiro-web/1.2.2/shiro-web-1.2.2.pom (4 KB at 32.2 KB/sec)
Downloading: https://repository.sonatype.org/content/groups/forge/org/sonatype/sisu/inject/guice-servlet/3.1.4/guice-servlet-3.1.4.pom
Downloaded: https://repository.sonatype.org/content/groups/forge/org/sonatype/sisu/inject/guice-servlet/3.1.4/guice-servlet-3.1.4.pom (911 B at 2.8 KB/sec)
Downloading: https://repository.sonatype.org/content/groups/forge/org/sonatype/nexus/nexus-security-realms/2.6.0-05/nexus-security-realms-2.6.0-05.pom
Downloaded: https://repository.sonatype.org/content/groups/forge/org/sonatype/nexus/nexus-security-realms/2.6.0-05/nexus-security-realms-2.6.0-05.pom (5 KB at 11.8 KB/sec)
Downloading: https://repository.sonatype.org/content/groups/forge/org/sonatype/sisu/inject/guice-assistedinject/3.1.4/guice-assistedinject-3.1.4.pom
Downloaded: https://repository.sonatype.org/content/groups/forge/org/sonatype/sisu/inject/guice-assistedinject/3.1.4/guice-assistedinject-3.1.4.pom (545 B at 1.6 KB/sec)
Downloading: https://repository.sonatype.org/content/groups/forge/org/sonatype/nexus/nexus-scheduler/2.6.0-05/nexus-scheduler-2.6.0-05.pom
Downloaded: https://repository.sonatype.org/content/groups/forge/org/sonatype/nexus/nexus-scheduler/2.6.0-05/nexus-scheduler-2.6.0-05.pom (2 KB at 5.1 KB/sec)
Downloading: https://repository.sonatype.org/content/groups/forge/org/sonatype/sisu/sisu-mailer/1.7.1/sisu-mailer-1.7.1.pom
Downloaded: https://repository.sonatype.org/content/groups/forge/org/sonatype/sisu/sisu-mailer/1.7.1/sisu-mailer-1.7.1.pom (4 KB at 9.4 KB/sec)
Downloading: https://repository.sonatype.org/content/groups/forge/javax/mail/mail/1.4.7/mail-1.4.7.pom
Downloading: http://repo1.maven.org/maven2/javax/mail/mail/1.4.7/mail-1.4.7.pom
Downloaded: http://repo1.maven.org/maven2/javax/mail/mail/1.4.7/mail-1.4.7.pom (6 KB at 51.9 KB/sec)
Downloading: https://repository.sonatype.org/content/groups/forge/com/sun/mail/all/1.4.7/all-1.4.7.pom
Downloading: http://repo1.maven.org/maven2/com/sun/mail/all/1.4.7/all-1.4.7.pom
Downloaded: http://repo1.maven.org/maven2/com/sun/mail/all/1.4.7/all-1.4.7.pom (20 KB at 167.7 KB/sec)
Downloading: https://repository.sonatype.org/content/groups/forge/org/sonatype/sisu/pr/sisu-problem-reporter/1.5.4/sisu-problem-reporter-1.5.4.pom
Downloaded: https://repository.sonatype.org/content/groups/forge/org/sonatype/sisu/pr/sisu-problem-reporter/1.5.4/sisu-problem-reporter-1.5.4.pom (3 KB at 8.5 KB/sec)
Downloading: https://repository.sonatype.org/content/groups/forge/org/sonatype/sisu/pr/sisu-pr-parent/1.5.4/sisu-pr-parent-1.5.4.pom
Downloaded: https://repository.sonatype.org/content/groups/forge/org/sonatype/sisu/pr/sisu-pr-parent/1.5.4/sisu-pr-parent-1.5.4.pom (7 KB at 18.7 KB/sec)
Downloading: https://repository.sonatype.org/content/groups/forge/org/sonatype/sisu/jira/mediator/sisu-jira-mediator-attachments/1.4.1/sisu-jira-mediator-attachments-1.4.1.pom
Downloaded: https://repository.sonatype.org/content/groups/forge/org/sonatype/sisu/jira/mediator/sisu-jira-mediator-attachments/1.4.1/sisu-jira-mediator-attachments-1.4.1.pom (3 KB at 7.2 KB/sec)
Downloading: https://repository.sonatype.org/content/groups/forge/org/sonatype/sisu/jira/mediator/sisu-jira-mediator-parent/1.4.1/sisu-jira-mediator-parent-1.4.1.pom
Downloaded: https://repository.sonatype.org/content/groups/forge/org/sonatype/sisu/jira/mediator/sisu-jira-mediator-parent/1.4.1/sisu-jira-mediator-parent-1.4.1.pom (7 KB at 21.5 KB/sec)
Downloading: https://repository.sonatype.org/content/groups/forge/org/apache/httpcomponents/httpmime/4.2.5/httpmime-4.2.5.pom
Downloading: http://repo1.maven.org/maven2/org/apache/httpcomponents/httpmime/4.2.5/httpmime-4.2.5.pom
Downloaded: http://repo1.maven.org/maven2/org/apache/httpcomponents/httpmime/4.2.5/httpmime-4.2.5.pom (6 KB at 54.6 KB/sec)
Downloading: https://repository.sonatype.org/content/groups/forge/org/sonatype/nexus/nexus-plugin-bundle-model/1.0.1/nexus-plugin-bundle-model-1.0.1.pom
Downloaded: https://repository.sonatype.org/content/groups/forge/org/sonatype/nexus/nexus-plugin-bundle-model/1.0.1/nexus-plugin-bundle-model-1.0.1.pom (3 KB at 6.6 KB/sec)
Downloading: https://repository.sonatype.org/content/groups/forge/org/sonatype/nexus/nexus-plugin-bundle/1.0.1/nexus-plugin-bundle-1.0.1.pom
Downloaded: https://repository.sonatype.org/content/groups/forge/org/sonatype/nexus/nexus-plugin-bundle/1.0.1/nexus-plugin-bundle-1.0.1.pom (13 KB at 40.0 KB/sec)
Downloading: https://repository.sonatype.org/content/groups/forge/org/jsoup/jsoup/1.7.2/jsoup-1.7.2.pom
Downloading: http://repo1.maven.org/maven2/org/jsoup/jsoup/1.7.2/jsoup-1.7.2.pom
Downloaded: http://repo1.maven.org/maven2/org/jsoup/jsoup/1.7.2/jsoup-1.7.2.pom (6 KB at 54.1 KB/sec)
Downloading: https://repository.sonatype.org/content/groups/forge/joda-time/joda-time/2.2/joda-time-2.2.pom
Downloading: http://repo1.maven.org/maven2/joda-time/joda-time/2.2/joda-time-2.2.pom
Downloaded: http://repo1.maven.org/maven2/joda-time/joda-time/2.2/joda-time-2.2.pom (16 KB at 131.6 KB/sec)
Downloading: https://repository.sonatype.org/content/groups/forge/com/yammer/metrics/metrics-core/2.2.0/metrics-core-2.2.0.pom
Downloading: http://repo1.maven.org/maven2/com/yammer/metrics/metrics-core/2.2.0/metrics-core-2.2.0.pom
Downloaded: http://repo1.maven.org/maven2/com/yammer/metrics/metrics-core/2.2.0/metrics-core-2.2.0.pom (2 KB at 11.9 KB/sec)
Downloading: https://repository.sonatype.org/content/groups/forge/com/yammer/metrics/metrics-parent/2.2.0/metrics-parent-2.2.0.pom
Downloading: http://repo1.maven.org/maven2/com/yammer/metrics/metrics-parent/2.2.0/metrics-parent-2.2.0.pom
Downloaded: http://repo1.maven.org/maven2/com/yammer/metrics/metrics-parent/2.2.0/metrics-parent-2.2.0.pom (10 KB at 78.4 KB/sec)
Downloading: https://repository.sonatype.org/content/groups/forge/com/yammer/metrics/metrics-guice/2.2.0/metrics-guice-2.2.0.pom
Downloading: http://repo1.maven.org/maven2/com/yammer/metrics/metrics-guice/2.2.0/metrics-guice-2.2.0.pom
Downloaded: http://repo1.maven.org/maven2/com/yammer/metrics/metrics-guice/2.2.0/metrics-guice-2.2.0.pom (3 KB at 25.8 KB/sec)
Downloading: https://repository.sonatype.org/content/groups/forge/com/yammer/metrics/metrics-annotation/2.2.0/metrics-annotation-2.2.0.pom
Downloading: http://repo1.maven.org/maven2/com/yammer/metrics/metrics-annotation/2.2.0/metrics-annotation-2.2.0.pom
Downloaded: http://repo1.maven.org/maven2/com/yammer/metrics/metrics-annotation/2.2.0/metrics-annotation-2.2.0.pom (661 B at 6.7 KB/sec)
Downloading: https://repository.sonatype.org/content/groups/forge/com/yammer/metrics/metrics-httpclient/2.2.0/metrics-httpclient-2.2.0.pom
Downloading: http://repo1.maven.org/maven2/com/yammer/metrics/metrics-httpclient/2.2.0/metrics-httpclient-2.2.0.pom
Downloaded: http://repo1.maven.org/maven2/com/yammer/metrics/metrics-httpclient/2.2.0/metrics-httpclient-2.2.0.pom (960 B at 9.5 KB/sec)
Downloading: https://repository.sonatype.org/content/groups/forge/commons-logging/commons-logging/1.1.1/commons-logging-1.1.1.pom
[WARNING] Checksum validation failed, no checksums available from the repository for https://repository.sonatype.org/content/groups/forge/commons-logging/commons-logging/1.1.1/commons-logging-1.1.1.pom
Downloaded: https://repository.sonatype.org/content/groups/forge/commons-logging/commons-logging/1.1.1/commons-logging-1.1.1.pom (18 KB at 33.0 KB/sec)
Downloading: https://repository.sonatype.org/content/groups/forge/org/apache/commons/commons-parent/5/commons-parent-5.pom
[WARNING] Checksum validation failed, no checksums available from the repository for https://repository.sonatype.org/content/groups/forge/org/apache/commons/commons-parent/5/commons-parent-5.pom
Downloaded: https://repository.sonatype.org/content/groups/forge/org/apache/commons/commons-parent/5/commons-parent-5.pom (16 KB at 33.2 KB/sec)
Downloading: https://repository.sonatype.org/content/groups/forge/org/sonatype/nexus/nexus-web-utils/2.6.0-05/nexus-web-utils-2.6.0-05.pom
Downloaded: https://repository.sonatype.org/content/groups/forge/org/sonatype/nexus/nexus-web-utils/2.6.0-05/nexus-web-utils-2.6.0-05.pom (3 KB at 7.6 KB/sec)
Downloading: https://repository.sonatype.org/content/groups/forge/org/sonatype/nexus/nexus-logging-extras/2.6.0-05/nexus-logging-extras-2.6.0-05.pom
Downloaded: https://repository.sonatype.org/content/groups/forge/org/sonatype/nexus/nexus-logging-extras/2.6.0-05/nexus-logging-extras-2.6.0-05.pom (3 KB at 8.6 KB/sec)
Downloading: https://repository.sonatype.org/content/groups/forge/org/slf4j/jul-to-slf4j/1.7.5/jul-to-slf4j-1.7.5.pom
Downloading: http://repo1.maven.org/maven2/org/slf4j/jul-to-slf4j/1.7.5/jul-to-slf4j-1.7.5.pom
Downloaded: http://repo1.maven.org/maven2/org/slf4j/jul-to-slf4j/1.7.5/jul-to-slf4j-1.7.5.pom (2 KB at 14.1 KB/sec)
Downloading: https://repository.sonatype.org/content/groups/forge/ch/qos/logback/logback-core/1.0.13/logback-core-1.0.13.pom
Downloading: http://repo1.maven.org/maven2/ch/qos/logback/logback-core/1.0.13/logback-core-1.0.13.pom
Downloaded: http://repo1.maven.org/maven2/ch/qos/logback/logback-core/1.0.13/logback-core-1.0.13.pom (5 KB at 50.0 KB/sec)
Downloading: https://repository.sonatype.org/content/groups/forge/ch/qos/logback/logback-parent/1.0.13/logback-parent-1.0.13.pom
Downloading: http://repo1.maven.org/maven2/ch/qos/logback/logback-parent/1.0.13/logback-parent-1.0.13.pom
Downloaded: http://repo1.maven.org/maven2/ch/qos/logback/logback-parent/1.0.13/logback-parent-1.0.13.pom (15 KB at 79.4 KB/sec)
Downloading: https://repository.sonatype.org/content/groups/forge/ch/qos/logback/logback-classic/1.0.13/logback-classic-1.0.13.pom
Downloading: http://repo1.maven.org/maven2/ch/qos/logback/logback-classic/1.0.13/logback-classic-1.0.13.pom
Downloaded: http://repo1.maven.org/maven2/ch/qos/logback/logback-classic/1.0.13/logback-classic-1.0.13.pom (12 KB at 96.6 KB/sec)
Downloading: https://repository.sonatype.org/content/groups/forge/com/intellij/annotations/12.0/annotations-12.0.pom
Downloading: http://repo1.maven.org/maven2/com/intellij/annotations/12.0/annotations-12.0.pom
Downloaded: http://repo1.maven.org/maven2/com/intellij/annotations/12.0/annotations-12.0.pom (2 KB at 15.2 KB/sec)
Downloading: https://repository.sonatype.org/content/groups/forge/org/sonatype/nexus/plugins/nexus-restlet1x-plugin/2.6.0-05/nexus-restlet1x-plugin-2.6.0-05.pom
Downloaded: https://repository.sonatype.org/content/groups/forge/org/sonatype/nexus/plugins/nexus-restlet1x-plugin/2.6.0-05/nexus-restlet1x-plugin-2.6.0-05.pom (5 KB at 13.7 KB/sec)
Downloading: https://repository.sonatype.org/content/groups/forge/org/sonatype/nexus/plugins/nexus-plugins-restlet1x/2.6.0-05/nexus-plugins-restlet1x-2.6.0-05.pom
Downloaded: https://repository.sonatype.org/content/groups/forge/org/sonatype/nexus/plugins/nexus-plugins-restlet1x/2.6.0-05/nexus-plugins-restlet1x-2.6.0-05.pom (6 KB at 16.1 KB/sec)
Downloading: https://repository.sonatype.org/content/groups/forge/org/sonatype/nexus/plugins/nexus-plugins/2.6.0-05/nexus-plugins-2.6.0-05.pom
Downloaded: https://repository.sonatype.org/content/groups/forge/org/sonatype/nexus/plugins/nexus-plugins/2.6.0-05/nexus-plugins-2.6.0-05.pom (22 KB at 68.3 KB/sec)
Downloading: https://repository.sonatype.org/content/groups/forge/org/sonatype/nexus/plugins/nexus-restlet1x-model/2.6.0-05/nexus-restlet1x-model-2.6.0-05.pom
Downloaded: https://repository.sonatype.org/content/groups/forge/org/sonatype/nexus/plugins/nexus-restlet1x-model/2.6.0-05/nexus-restlet1x-model-2.6.0-05.pom (4 KB at 10.4 KB/sec)
Downloading: https://repository.sonatype.org/content/groups/forge/org/sonatype/nexus/plugins/nexus-restlet-bridge/2.6.0-05/nexus-restlet-bridge-2.6.0-05.pom
Downloaded: https://repository.sonatype.org/content/groups/forge/org/sonatype/nexus/plugins/nexus-restlet-bridge/2.6.0-05/nexus-restlet-bridge-2.6.0-05.pom (4 KB at 9.3 KB/sec)
Downloading: https://repository.sonatype.org/content/groups/forge/org/restlet/org.restlet/1.1.6-SONATYPE-5348-V8/org.restlet-1.1.6-SONATYPE-5348-V8.pom
Downloaded: https://repository.sonatype.org/content/groups/forge/org/restlet/org.restlet/1.1.6-SONATYPE-5348-V8/org.restlet-1.1.6-SONATYPE-5348-V8.pom (664 B at 1.9 KB/sec)
Downloading: https://repository.sonatype.org/content/groups/forge/org/restlet/org.restlet.ext.fileupload/1.1.6-SONATYPE-5348-V8/org.restlet.ext.fileupload-1.1.6-SONATYPE-5348-V8.pom
Downloaded: https://repository.sonatype.org/content/groups/forge/org/restlet/org.restlet.ext.fileupload/1.1.6-SONATYPE-5348-V8/org.restlet.ext.fileupload-1.1.6-SONATYPE-5348-V8.pom (1007 B at 2.6 KB/sec)
Downloading: https://repository.sonatype.org/content/groups/forge/org/restlet/org.restlet.ext.velocity/1.1.6-SONATYPE-5348-V8/org.restlet.ext.velocity-1.1.6-SONATYPE-5348-V8.pom
Downloaded: https://repository.sonatype.org/content/groups/forge/org/restlet/org.restlet.ext.velocity/1.1.6-SONATYPE-5348-V8/org.restlet.ext.velocity-1.1.6-SONATYPE-5348-V8.pom (987 B at 2.3 KB/sec)
Downloading: https://repository.sonatype.org/content/groups/forge/org/apache/velocity/velocity/1.5/velocity-1.5.pom
Downloading: http://repo1.maven.org/maven2/org/apache/velocity/velocity/1.5/velocity-1.5.pom
Downloaded: http://repo1.maven.org/maven2/org/apache/velocity/velocity/1.5/velocity-1.5.pom (8 KB at 60.2 KB/sec)
Downloading: https://repository.sonatype.org/content/groups/forge/commons-collections/commons-collections/3.1/commons-collections-3.1.pom
Downloading: http://repo1.maven.org/maven2/commons-collections/commons-collections/3.1/commons-collections-3.1.pom
Downloaded: http://repo1.maven.org/maven2/commons-collections/commons-collections/3.1/commons-collections-3.1.pom (6 KB at 41.8 KB/sec)
Downloading: https://repository.sonatype.org/content/groups/forge/oro/oro/2.0.8/oro-2.0.8.pom
[WARNING] Checksum validation failed, no checksums available from the repository for https://repository.sonatype.org/content/groups/forge/oro/oro/2.0.8/oro-2.0.8.pom
Downloaded: https://repository.sonatype.org/content/groups/forge/oro/oro/2.0.8/oro-2.0.8.pom (140 B at 0.3 KB/sec)
Downloading: https://repository.sonatype.org/content/groups/forge/org/restlet/org.restlet.ext.jaxrs/1.1.6-SONATYPE-5348-V8/org.restlet.ext.jaxrs-1.1.6-SONATYPE-5348-V8.pom
Downloaded: https://repository.sonatype.org/content/groups/forge/org/restlet/org.restlet.ext.jaxrs/1.1.6-SONATYPE-5348-V8/org.restlet.ext.jaxrs-1.1.6-SONATYPE-5348-V8.pom (2 KB at 4.7 KB/sec)
Downloading: https://repository.sonatype.org/content/groups/forge/com/noelios/restlet/com.noelios.restlet/1.1.6-SONATYPE-5348-V8/com.noelios.restlet-1.1.6-SONATYPE-5348-V8.pom
Downloaded: https://repository.sonatype.org/content/groups/forge/com/noelios/restlet/com.noelios.restlet/1.1.6-SONATYPE-5348-V8/com.noelios.restlet-1.1.6-SONATYPE-5348-V8.pom (971 B at 2.5 KB/sec)
Downloading: https://repository.sonatype.org/content/groups/forge/com/noelios/restlet/com.noelios.restlet.ext.servlet/1.1.6-SONATYPE-5348-V8/com.noelios.restlet.ext.servlet-1.1.6-SONATYPE-5348-V8.pom
Downloaded: https://repository.sonatype.org/content/groups/forge/com/noelios/restlet/com.noelios.restlet.ext.servlet/1.1.6-SONATYPE-5348-V8/com.noelios.restlet.ext.servlet-1.1.6-SONATYPE-5348-V8.pom (2 KB at 2.9 KB/sec)
Downloading: https://repository.sonatype.org/content/groups/forge/org/codehaus/enunciate/enunciate-core/1.26.2/enunciate-core-1.26.2.pom
Downloading: http://repo1.maven.org/maven2/org/codehaus/enunciate/enunciate-core/1.26.2/enunciate-core-1.26.2.pom
Downloaded: http://repo1.maven.org/maven2/org/codehaus/enunciate/enunciate-core/1.26.2/enunciate-core-1.26.2.pom (4 KB at 29.0 KB/sec)
Downloading: https://repository.sonatype.org/content/groups/forge/org/codehaus/enunciate/enunciate-parent/1.26.2/enunciate-parent-1.26.2.pom
Downloading: http://repo1.maven.org/maven2/org/codehaus/enunciate/enunciate-parent/1.26.2/enunciate-parent-1.26.2.pom
Downloaded: http://repo1.maven.org/maven2/org/codehaus/enunciate/enunciate-parent/1.26.2/enunciate-parent-1.26.2.pom (11 KB at 85.3 KB/sec)
Downloading: https://repository.sonatype.org/content/groups/forge/org/sonatype/nexus/nexus-plugin-api/2.6.0-05/nexus-plugin-api-2.6.0-05.jar
Downloading: https://repository.sonatype.org/content/groups/forge/org/sonatype/nexus/nexus-compat/2.6.0-05/nexus-compat-2.6.0-05.jar
Downloading: https://repository.sonatype.org/content/groups/forge/org/sonatype/nexus/nexus-core/2.6.0-05/nexus-core-2.6.0-05.jar
Downloading: https://repository.sonatype.org/content/groups/forge/org/sonatype/nexus/base-configuration/2.6.0-05/base-configuration-2.6.0-05.jar
Downloading: https://repository.sonatype.org/content/groups/forge/org/sonatype/nexus/nexus-configuration-model/2.6.0-05/nexus-configuration-model-2.6.0-05.jar
Downloaded: https://repository.sonatype.org/content/groups/forge/org/sonatype/nexus/nexus-compat/2.6.0-05/nexus-compat-2.6.0-05.jar (12 KB at 43.0 KB/sec)
Downloading: https://repository.sonatype.org/content/groups/forge/org/sonatype/nexus/nexus-repository-metadata-api/2.6.0-05/nexus-repository-metadata-api-2.6.0-05.jar
Downloaded: https://repository.sonatype.org/content/groups/forge/org/sonatype/nexus/nexus-plugin-api/2.6.0-05/nexus-plugin-api-2.6.0-05.jar (11 KB at 37.1 KB/sec)
Downloading: https://repository.sonatype.org/content/groups/forge/org/sonatype/nexus/nexus-repository-metadata-model/2.6.0-05/nexus-repository-metadata-model-2.6.0-05.jar
Downloaded: https://repository.sonatype.org/content/groups/forge/org/sonatype/nexus/base-configuration/2.6.0-05/base-configuration-2.6.0-05.jar (14 KB at 41.8 KB/sec)
Downloading: https://repository.sonatype.org/content/groups/forge/org/sonatype/sisu/goodies/goodies-eventbus/1.6.1/goodies-eventbus-1.6.1.jar
Downloaded: https://repository.sonatype.org/content/groups/forge/org/sonatype/nexus/nexus-repository-metadata-api/2.6.0-05/nexus-repository-metadata-api-2.6.0-05.jar (10 KB at 41.2 KB/sec)
Downloading: https://repository.sonatype.org/content/groups/forge/commons-beanutils/commons-beanutils-core/1.8.3-SONATYPE/commons-beanutils-core-1.8.3-SONATYPE.jar
Downloaded: https://repository.sonatype.org/content/groups/forge/org/sonatype/nexus/nexus-repository-metadata-model/2.6.0-05/nexus-repository-metadata-model-2.6.0-05.jar (34 KB at 102.9 KB/sec)
Downloading: https://repository.sonatype.org/content/groups/forge/commons-collections/commons-collections/3.2.1/commons-collections-3.2.1.jar
Downloaded: https://repository.sonatype.org/content/groups/forge/org/sonatype/sisu/goodies/goodies-eventbus/1.6.1/goodies-eventbus-1.6.1.jar (24 KB at 70.2 KB/sec)
Downloading: https://repository.sonatype.org/content/groups/forge/commons-codec/commons-codec/1.8/commons-codec-1.8.jar
Downloaded: https://repository.sonatype.org/content/groups/forge/org/sonatype/nexus/nexus-configuration-model/2.6.0-05/nexus-configuration-model-2.6.0-05.jar (1077 KB at 1332.9 KB/sec)
Downloading: https://repository.sonatype.org/content/groups/forge/org/sonatype/sisu/sisu-inject-plexus/2.3.4/sisu-inject-plexus-2.3.4.jar
Downloaded: https://repository.sonatype.org/content/groups/forge/org/sonatype/nexus/nexus-core/2.6.0-05/nexus-core-2.6.0-05.jar (1426 KB at 1759.4 KB/sec)
Downloading: https://repository.sonatype.org/content/groups/forge/org/codehaus/plexus/plexus-classworlds/2.4.2/plexus-classworlds-2.4.2.jar
Downloading: https://repository.sonatype.org/content/groups/forge/org/codehaus/plexus/plexus-interpolation/1.16/plexus-interpolation-1.16.jar
Downloading: https://repository.sonatype.org/content/groups/forge/com/thoughtworks/xstream/xstream/1.4.4/xstream-1.4.4.jar
Downloaded: https://repository.sonatype.org/content/groups/forge/commons-beanutils/commons-beanutils-core/1.8.3-SONATYPE/commons-beanutils-core-1.8.3-SONATYPE.jar (194 KB at 453.7 KB/sec)
Downloading: https://repository.sonatype.org/content/groups/forge/org/codehaus/jackson/jackson-mapper-asl/1.9.12/jackson-mapper-asl-1.9.12.jar
Downloading: https://repository.sonatype.org/content/groups/forge/org/codehaus/jackson/jackson-core-asl/1.9.12/jackson-core-asl-1.9.12.jar
Downloading: https://repository.sonatype.org/content/groups/forge/org/apache/httpcomponents/httpclient/4.2.5/httpclient-4.2.5.jar
Downloaded: https://repository.sonatype.org/content/groups/forge/org/codehaus/plexus/plexus-classworlds/2.4.2/plexus-classworlds-2.4.2.jar (46 KB at 129.2 KB/sec)
Downloading: https://repository.sonatype.org/content/groups/forge/org/apache/httpcomponents/httpcore/4.2.4/httpcore-4.2.4.jar
Downloaded: https://repository.sonatype.org/content/groups/forge/org/codehaus/plexus/plexus-interpolation/1.16/plexus-interpolation-1.16.jar (60 KB at 165.4 KB/sec)
Downloading: https://repository.sonatype.org/content/groups/forge/org/apache/maven/maven-model/3.0.5/maven-model-3.0.5.jar
Downloaded: https://repository.sonatype.org/content/groups/forge/org/sonatype/sisu/sisu-inject-plexus/2.3.4/sisu-inject-plexus-2.3.4.jar (207 KB at 390.3 KB/sec)
Downloading: https://repository.sonatype.org/content/groups/forge/org/apache/maven/maven-repository-metadata/3.0.5/maven-repository-metadata-3.0.5.jar
Downloading: https://repository.sonatype.org/content/groups/forge/org/sonatype/aether/aether-api/1.13.1/aether-api-1.13.1.jar
Downloading: https://repository.sonatype.org/content/groups/forge/org/sonatype/aether/aether-util/1.13.1/aether-util-1.13.1.jar
Downloading: https://repository.sonatype.org/content/groups/forge/org/sonatype/aether/aether-spi/1.13.1/aether-spi-1.13.1.jar
Downloading: https://repository.sonatype.org/content/groups/forge/org/sonatype/aether/aether-impl/1.13.1/aether-impl-1.13.1.jar
Downloading: https://repository.sonatype.org/content/groups/forge/org/sonatype/nexus/nexus-security/2.6.0-05/nexus-security-2.6.0-05.jar
Downloaded: https://repository.sonatype.org/content/groups/forge/org/sonatype/aether/aether-spi/1.13.1/aether-spi-1.13.1.jar (16 KB at 54.0 KB/sec)
Downloading: https://repository.sonatype.org/content/groups/forge/org/apache/shiro/shiro-ehcache/1.2.2/shiro-ehcache-1.2.2.jar
Downloaded: https://repository.sonatype.org/content/groups/forge/org/sonatype/aether/aether-api/1.13.1/aether-api-1.13.1.jar (88 KB at 216.2 KB/sec)
Downloading: https://repository.sonatype.org/content/groups/forge/org/slf4j/jcl-over-slf4j/1.7.5/jcl-over-slf4j-1.7.5.jar
Downloaded: https://repository.sonatype.org/content/groups/forge/org/sonatype/aether/aether-util/1.13.1/aether-util-1.13.1.jar (127 KB at 273.7 KB/sec)
Downloading: https://repository.sonatype.org/content/groups/forge/org/apache/shiro/shiro-web/1.2.2/shiro-web-1.2.2.jar
Downloaded: https://repository.sonatype.org/content/groups/forge/org/sonatype/aether/aether-impl/1.13.1/aether-impl-1.13.1.jar (128 KB at 295.6 KB/sec)
Downloading: https://repository.sonatype.org/content/groups/forge/org/sonatype/sisu/inject/guice-servlet/3.1.4/guice-servlet-3.1.4.jar
Downloading: https://repository.sonatype.org/content/groups/forge/org/sonatype/nexus/nexus-security-realms/2.6.0-05/nexus-security-realms-2.6.0-05.jar
Downloading: https://repository.sonatype.org/content/groups/forge/org/apache/shiro/shiro-core/1.2.2/shiro-core-1.2.2.jar
Downloaded: https://repository.sonatype.org/content/groups/forge/org/sonatype/nexus/nexus-security/2.6.0-05/nexus-security-2.6.0-05.jar (112 KB at 240.1 KB/sec)
Downloading: https://repository.sonatype.org/content/groups/forge/org/apache/shiro/shiro-guice/1.2.2/shiro-guice-1.2.2.jar
Downloading: https://repository.sonatype.org/content/groups/forge/org/sonatype/sisu/sisu-inject-bean/2.3.4/sisu-inject-bean-2.3.4.jar
Downloading: https://repository.sonatype.org/content/groups/forge/org/sonatype/sisu/sisu-guice/3.1.4/sisu-guice-3.1.4.jar
Downloaded: https://repository.sonatype.org/content/groups/forge/org/sonatype/sisu/inject/guice-servlet/3.1.4/guice-servlet-3.1.4.jar (70 KB at 173.6 KB/sec)
Downloading: https://repository.sonatype.org/content/groups/forge/aopalliance/aopalliance/1.0/aopalliance-1.0.jar
Downloading: https://repository.sonatype.org/content/groups/forge/org/sonatype/sisu/inject/guice-multibindings/3.1.4/guice-multibindings-3.1.4.jar
Downloaded: https://repository.sonatype.org/content/groups/forge/org/sonatype/nexus/nexus-security-realms/2.6.0-05/nexus-security-realms-2.6.0-05.jar (290 KB at 492.0 KB/sec)
Downloading: https://repository.sonatype.org/content/groups/forge/org/sonatype/sisu/inject/guice-assistedinject/3.1.4/guice-assistedinject-3.1.4.jar
Downloaded: https://repository.sonatype.org/content/groups/forge/org/sonatype/sisu/inject/guice-multibindings/3.1.4/guice-multibindings-3.1.4.jar (35 KB at 118.6 KB/sec)
Downloading: https://repository.sonatype.org/content/groups/forge/org/sonatype/nexus/nexus-ehcache/2.6.0-05/nexus-ehcache-2.6.0-05.jar
[WARNING] Checksum validation failed, no checksums available from the repository for https://repository.sonatype.org/content/groups/forge/aopalliance/aopalliance/1.0/aopalliance-1.0.jar
Downloaded: https://repository.sonatype.org/content/groups/forge/aopalliance/aopalliance/1.0/aopalliance-1.0.jar (5 KB at 11.0 KB/sec)
Downloading: https://repository.sonatype.org/content/groups/forge/org/sonatype/sisu/pr/sisu-problem-reporter/1.5.4/sisu-problem-reporter-1.5.4.jar
Downloaded: https://repository.sonatype.org/content/groups/forge/org/sonatype/sisu/sisu-inject-bean/2.3.4/sisu-inject-bean-2.3.4.jar (297 KB at 524.4 KB/sec)
Downloading: https://repository.sonatype.org/content/groups/forge/org/sonatype/sisu/jira/mediator/sisu-jira-mediator-attachments/1.4.1/sisu-jira-mediator-attachments-1.4.1.jar
Downloaded: https://repository.sonatype.org/content/groups/forge/org/sonatype/nexus/nexus-ehcache/2.6.0-05/nexus-ehcache-2.6.0-05.jar (8 KB at 31.5 KB/sec)
Downloading: https://repository.sonatype.org/content/groups/forge/org/apache/httpcomponents/httpmime/4.2.5/httpmime-4.2.5.jar
Downloaded: https://repository.sonatype.org/content/groups/forge/org/sonatype/sisu/inject/guice-assistedinject/3.1.4/guice-assistedinject-3.1.4.jar (37 KB at 106.7 KB/sec)
Downloading: https://repository.sonatype.org/content/groups/forge/org/sonatype/nexus/nexus-plugin-bundle-model/1.0.1/nexus-plugin-bundle-model-1.0.1.jar
Downloaded: https://repository.sonatype.org/content/groups/forge/org/sonatype/sisu/sisu-guice/3.1.4/sisu-guice-3.1.4.jar (577 KB at 847.1 KB/sec)
Downloading: https://repository.sonatype.org/content/groups/forge/org/jsoup/jsoup/1.7.2/jsoup-1.7.2.jar
Downloaded: https://repository.sonatype.org/content/groups/forge/org/sonatype/sisu/jira/mediator/sisu-jira-mediator-attachments/1.4.1/sisu-jira-mediator-attachments-1.4.1.jar (15 KB at 56.2 KB/sec)
Downloading: https://repository.sonatype.org/content/groups/forge/joda-time/joda-time/2.2/joda-time-2.2.jar
Downloaded: https://repository.sonatype.org/content/groups/forge/org/sonatype/sisu/pr/sisu-problem-reporter/1.5.4/sisu-problem-reporter-1.5.4.jar (65 KB at 170.2 KB/sec)
Downloading: https://repository.sonatype.org/content/groups/forge/com/yammer/metrics/metrics-core/2.2.0/metrics-core-2.2.0.jar
Downloading: https://repository.sonatype.org/content/groups/forge/com/yammer/metrics/metrics-guice/2.2.0/metrics-guice-2.2.0.jar
Downloading: https://repository.sonatype.org/content/groups/forge/com/yammer/metrics/metrics-annotation/2.2.0/metrics-annotation-2.2.0.jar
Downloading: https://repository.sonatype.org/content/groups/forge/com/yammer/metrics/metrics-httpclient/2.2.0/metrics-httpclient-2.2.0.jar
Downloaded: https://repository.sonatype.org/content/groups/forge/org/sonatype/nexus/nexus-plugin-bundle-model/1.0.1/nexus-plugin-bundle-model-1.0.1.jar (38 KB at 105.5 KB/sec)
Downloading: https://repository.sonatype.org/content/groups/forge/org/sonatype/nexus/nexus-web-utils/2.6.0-05/nexus-web-utils-2.6.0-05.jar
Downloading: https://repository.sonatype.org/content/groups/forge/org/sonatype/nexus/nexus-appcontext/2.6.0-05/nexus-appcontext-2.6.0-05.jar
Downloading: https://repository.sonatype.org/content/groups/forge/org/slf4j/slf4j-api/1.7.5/slf4j-api-1.7.5.jar
Downloading: https://repository.sonatype.org/content/groups/forge/org/sonatype/nexus/nexus-logging-extras/2.6.0-05/nexus-logging-extras-2.6.0-05.jar
Downloading: https://repository.sonatype.org/content/groups/forge/org/slf4j/jul-to-slf4j/1.7.5/jul-to-slf4j-1.7.5.jar
Downloaded: https://repository.sonatype.org/content/groups/forge/org/sonatype/nexus/nexus-web-utils/2.6.0-05/nexus-web-utils-2.6.0-05.jar (15 KB at 52.1 KB/sec)
Downloading: https://repository.sonatype.org/content/groups/forge/ch/qos/logback/logback-core/1.0.13/logback-core-1.0.13.jar
Downloading: https://repository.sonatype.org/content/groups/forge/ch/qos/logback/logback-classic/1.0.13/logback-classic-1.0.13.jar
Downloaded: https://repository.sonatype.org/content/groups/forge/org/sonatype/nexus/nexus-appcontext/2.6.0-05/nexus-appcontext-2.6.0-05.jar (56 KB at 164.7 KB/sec)
Downloading: https://repository.sonatype.org/content/groups/forge/com/google/guava/guava/14.0.1/guava-14.0.1.jar
Downloaded: https://repository.sonatype.org/content/groups/forge/org/sonatype/nexus/nexus-logging-extras/2.6.0-05/nexus-logging-extras-2.6.0-05.jar (20 KB at 62.4 KB/sec)
Downloading: https://repository.sonatype.org/content/groups/forge/com/intellij/annotations/12.0/annotations-12.0.jar
Downloading: https://repository.sonatype.org/content/groups/forge/org/sonatype/nexus/nexus-scheduler/2.6.0-05/nexus-scheduler-2.6.0-05.jar
Downloading: https://repository.sonatype.org/content/groups/forge/org/sonatype/sisu/sisu-mailer/1.7.1/sisu-mailer-1.7.1.jar
Downloading: https://repository.sonatype.org/content/groups/forge/javax/mail/mail/1.4.7/mail-1.4.7.jar
Downloading: https://repository.sonatype.org/content/groups/forge/org/sonatype/sisu/goodies/goodies-common/1.6.1/goodies-common-1.6.1.jar
Downloading: https://repository.sonatype.org/content/groups/forge/org/sonatype/nexus/plugins/nexus-restlet1x-plugin/2.6.0-05/nexus-restlet1x-plugin-2.6.0-05.jar
Downloading: https://repository.sonatype.org/content/groups/forge/org/sonatype/nexus/plugins/nexus-restlet1x-model/2.6.0-05/nexus-restlet1x-model-2.6.0-05.jar
Downloaded: https://repository.sonatype.org/content/groups/forge/org/sonatype/nexus/nexus-scheduler/2.6.0-05/nexus-scheduler-2.6.0-05.jar (59 KB at 161.0 KB/sec)
Downloading: https://repository.sonatype.org/content/groups/forge/org/sonatype/nexus/plugins/nexus-restlet-bridge/2.6.0-05/nexus-restlet-bridge-2.6.0-05.jar
Downloaded: https://repository.sonatype.org/content/groups/forge/org/sonatype/sisu/sisu-mailer/1.7.1/sisu-mailer-1.7.1.jar (34 KB at 109.4 KB/sec)
Downloading: https://repository.sonatype.org/content/groups/forge/org/restlet/org.restlet/1.1.6-SONATYPE-5348-V8/org.restlet-1.1.6-SONATYPE-5348-V8.jar
Downloaded: https://repository.sonatype.org/content/groups/forge/org/sonatype/sisu/goodies/goodies-common/1.6.1/goodies-common-1.6.1.jar (37 KB at 116.6 KB/sec)
Downloading: https://repository.sonatype.org/content/groups/forge/org/restlet/org.restlet.ext.fileupload/1.1.6-SONATYPE-5348-V8/org.restlet.ext.fileupload-1.1.6-SONATYPE-5348-V8.jar
Downloaded: https://repository.sonatype.org/content/groups/forge/org/sonatype/nexus/plugins/nexus-restlet-bridge/2.6.0-05/nexus-restlet-bridge-2.6.0-05.jar (63 KB at 161.2 KB/sec)
Downloading: https://repository.sonatype.org/content/groups/forge/org/restlet/org.restlet.ext.velocity/1.1.6-SONATYPE-5348-V8/org.restlet.ext.velocity-1.1.6-SONATYPE-5348-V8.jar
Downloaded: https://repository.sonatype.org/content/groups/forge/org/restlet/org.restlet.ext.fileupload/1.1.6-SONATYPE-5348-V8/org.restlet.ext.fileupload-1.1.6-SONATYPE-5348-V8.jar (3 KB at 9.9 KB/sec)
Downloading: https://repository.sonatype.org/content/groups/forge/org/restlet/org.restlet.ext.jaxrs/1.1.6-SONATYPE-5348-V8/org.restlet.ext.jaxrs-1.1.6-SONATYPE-5348-V8.jar
Downloaded: https://repository.sonatype.org/content/groups/forge/org/sonatype/nexus/plugins/nexus-restlet1x-model/2.6.0-05/nexus-restlet1x-model-2.6.0-05.jar (164 KB at 327.1 KB/sec)
Downloading: https://repository.sonatype.org/content/groups/forge/com/noelios/restlet/com.noelios.restlet/1.1.6-SONATYPE-5348-V8/com.noelios.restlet-1.1.6-SONATYPE-5348-V8.jar
Downloaded: https://repository.sonatype.org/content/groups/forge/org/restlet/org.restlet/1.1.6-SONATYPE-5348-V8/org.restlet-1.1.6-SONATYPE-5348-V8.jar (245 KB at 427.3 KB/sec)
Downloading: https://repository.sonatype.org/content/groups/forge/com/noelios/restlet/com.noelios.restlet.ext.servlet/1.1.6-SONATYPE-5348-V8/com.noelios.restlet.ext.servlet-1.1.6-SONATYPE-5348-V8.jar
Downloaded: https://repository.sonatype.org/content/groups/forge/org/sonatype/nexus/plugins/nexus-restlet1x-plugin/2.6.0-05/nexus-restlet1x-plugin-2.6.0-05.jar (1293 KB at 1674.1 KB/sec)
Downloading: https://repository.sonatype.org/content/groups/forge/org/codehaus/enunciate/enunciate-core/1.26.2/enunciate-core-1.26.2.jar
Downloaded: https://repository.sonatype.org/content/groups/forge/org/restlet/org.restlet.ext.velocity/1.1.6-SONATYPE-5348-V8/org.restlet.ext.velocity-1.1.6-SONATYPE-5348-V8.jar (8 KB at 27.0 KB/sec)
Downloaded: https://repository.sonatype.org/content/groups/forge/com/noelios/restlet/com.noelios.restlet.ext.servlet/1.1.6-SONATYPE-5348-V8/com.noelios.restlet.ext.servlet-1.1.6-SONATYPE-5348-V8.jar (19 KB at 69.1 KB/sec)
Downloaded: https://repository.sonatype.org/content/groups/forge/com/noelios/restlet/com.noelios.restlet/1.1.6-SONATYPE-5348-V8/com.noelios.restlet-1.1.6-SONATYPE-5348-V8.jar (202 KB at 408.9 KB/sec)
Downloaded: https://repository.sonatype.org/content/groups/forge/org/restlet/org.restlet.ext.jaxrs/1.1.6-SONATYPE-5348-V8/org.restlet.ext.jaxrs-1.1.6-SONATYPE-5348-V8.jar (282 KB at 509.8 KB/sec)
Downloading: http://repo1.maven.org/maven2/commons-collections/commons-collections/3.2.1/commons-collections-3.2.1.jar
Downloading: http://repo1.maven.org/maven2/com/thoughtworks/xstream/xstream/1.4.4/xstream-1.4.4.jar
Downloading: http://repo1.maven.org/maven2/commons-codec/commons-codec/1.8/commons-codec-1.8.jar
Downloading: http://repo1.maven.org/maven2/org/codehaus/jackson/jackson-core-asl/1.9.12/jackson-core-asl-1.9.12.jar
Downloading: http://repo1.maven.org/maven2/org/codehaus/jackson/jackson-mapper-asl/1.9.12/jackson-mapper-asl-1.9.12.jar
Downloaded: http://repo1.maven.org/maven2/commons-codec/commons-codec/1.8/commons-codec-1.8.jar (258 KB at 1073.7 KB/sec)
Downloading: http://repo1.maven.org/maven2/org/apache/httpcomponents/httpclient/4.2.5/httpclient-4.2.5.jar
Downloaded: http://repo1.maven.org/maven2/org/codehaus/jackson/jackson-core-asl/1.9.12/jackson-core-asl-1.9.12.jar (227 KB at 929.5 KB/sec)
Downloading: http://repo1.maven.org/maven2/org/apache/httpcomponents/httpcore/4.2.4/httpcore-4.2.4.jar
Downloaded: http://repo1.maven.org/maven2/commons-collections/commons-collections/3.2.1/commons-collections-3.2.1.jar (562 KB at 1707.9 KB/sec)
Downloading: http://repo1.maven.org/maven2/org/apache/maven/maven-model/3.0.5/maven-model-3.0.5.jar
Downloaded: http://repo1.maven.org/maven2/com/thoughtworks/xstream/xstream/1.4.4/xstream-1.4.4.jar (473 KB at 1409.3 KB/sec)
Downloading: http://repo1.maven.org/maven2/org/apache/maven/maven-repository-metadata/3.0.5/maven-repository-metadata-3.0.5.jar
Downloaded: http://repo1.maven.org/maven2/org/codehaus/jackson/jackson-mapper-asl/1.9.12/jackson-mapper-asl-1.9.12.jar (763 KB at 2140.7 KB/sec)
Downloading: http://repo1.maven.org/maven2/org/apache/shiro/shiro-ehcache/1.2.2/shiro-ehcache-1.2.2.jar
Downloaded: http://repo1.maven.org/maven2/org/apache/httpcomponents/httpcore/4.2.4/httpcore-4.2.4.jar (222 KB at 948.5 KB/sec)
Downloading: http://repo1.maven.org/maven2/org/slf4j/jcl-over-slf4j/1.7.5/jcl-over-slf4j-1.7.5.jar
Downloaded: http://repo1.maven.org/maven2/org/apache/shiro/shiro-ehcache/1.2.2/shiro-ehcache-1.2.2.jar (16 KB at 123.0 KB/sec)
Downloading: http://repo1.maven.org/maven2/org/apache/shiro/shiro-web/1.2.2/shiro-web-1.2.2.jar
Downloaded: http://repo1.maven.org/maven2/org/apache/maven/maven-repository-metadata/3.0.5/maven-repository-metadata-3.0.5.jar (30 KB at 194.6 KB/sec)
Downloading: http://repo1.maven.org/maven2/org/apache/shiro/shiro-core/1.2.2/shiro-core-1.2.2.jar
Downloaded: http://repo1.maven.org/maven2/org/apache/httpcomponents/httpclient/4.2.5/httpclient-4.2.5.jar (424 KB at 1434.6 KB/sec)
Downloading: http://repo1.maven.org/maven2/org/apache/shiro/shiro-guice/1.2.2/shiro-guice-1.2.2.jar
Downloaded: http://repo1.maven.org/maven2/org/apache/maven/maven-model/3.0.5/maven-model-3.0.5.jar (160 KB at 742.9 KB/sec)
Downloading: http://repo1.maven.org/maven2/org/apache/httpcomponents/httpmime/4.2.5/httpmime-4.2.5.jar
Downloaded: http://repo1.maven.org/maven2/org/slf4j/jcl-over-slf4j/1.7.5/jcl-over-slf4j-1.7.5.jar (17 KB at 127.0 KB/sec)
Downloading: http://repo1.maven.org/maven2/org/jsoup/jsoup/1.7.2/jsoup-1.7.2.jar
Downloaded: http://repo1.maven.org/maven2/org/apache/httpcomponents/httpmime/4.2.5/httpmime-4.2.5.jar (26 KB at 179.6 KB/sec)
Downloading: http://repo1.maven.org/maven2/joda-time/joda-time/2.2/joda-time-2.2.jar
Downloaded: http://repo1.maven.org/maven2/org/apache/shiro/shiro-web/1.2.2/shiro-web-1.2.2.jar (140 KB at 641.2 KB/sec)
Downloading: http://repo1.maven.org/maven2/com/yammer/metrics/metrics-core/2.2.0/metrics-core-2.2.0.jar
Downloaded: http://repo1.maven.org/maven2/org/apache/shiro/shiro-guice/1.2.2/shiro-guice-1.2.2.jar (44 KB at 216.5 KB/sec)
Downloading: http://repo1.maven.org/maven2/com/yammer/metrics/metrics-guice/2.2.0/metrics-guice-2.2.0.jar
Downloaded: http://repo1.maven.org/maven2/org/apache/shiro/shiro-core/1.2.2/shiro-core-1.2.2.jar (359 KB at 1377.3 KB/sec)
Downloading: http://repo1.maven.org/maven2/com/yammer/metrics/metrics-annotation/2.2.0/metrics-annotation-2.2.0.jar
Downloaded: http://repo1.maven.org/maven2/com/yammer/metrics/metrics-annotation/2.2.0/metrics-annotation-2.2.0.jar (5 KB at 42.6 KB/sec)
Downloading: http://repo1.maven.org/maven2/com/yammer/metrics/metrics-httpclient/2.2.0/metrics-httpclient-2.2.0.jar
Downloaded: http://repo1.maven.org/maven2/org/jsoup/jsoup/1.7.2/jsoup-1.7.2.jar (287 KB at 1161.1 KB/sec)
Downloading: http://repo1.maven.org/maven2/org/slf4j/slf4j-api/1.7.5/slf4j-api-1.7.5.jar
Downloaded: http://repo1.maven.org/maven2/com/yammer/metrics/metrics-core/2.2.0/metrics-core-2.2.0.jar (81 KB at 480.2 KB/sec)
Downloading: http://repo1.maven.org/maven2/org/slf4j/jul-to-slf4j/1.7.5/jul-to-slf4j-1.7.5.jar
Downloaded: http://repo1.maven.org/maven2/com/yammer/metrics/metrics-guice/2.2.0/metrics-guice-2.2.0.jar (18 KB at 110.7 KB/sec)
Downloading: http://repo1.maven.org/maven2/ch/qos/logback/logback-core/1.0.13/logback-core-1.0.13.jar
Downloaded: http://repo1.maven.org/maven2/org/slf4j/jul-to-slf4j/1.7.5/jul-to-slf4j-1.7.5.jar (5 KB at 48.4 KB/sec)
Downloading: http://repo1.maven.org/maven2/ch/qos/logback/logback-classic/1.0.13/logback-classic-1.0.13.jar
Downloaded: http://repo1.maven.org/maven2/com/yammer/metrics/metrics-httpclient/2.2.0/metrics-httpclient-2.2.0.jar (10 KB at 80.1 KB/sec)
Downloading: http://repo1.maven.org/maven2/com/google/guava/guava/14.0.1/guava-14.0.1.jar
Downloaded: http://repo1.maven.org/maven2/joda-time/joda-time/2.2/joda-time-2.2.jar (561 KB at 1939.3 KB/sec)
Downloading: http://repo1.maven.org/maven2/com/intellij/annotations/12.0/annotations-12.0.jar
Downloaded: http://repo1.maven.org/maven2/org/slf4j/slf4j-api/1.7.5/slf4j-api-1.7.5.jar (26 KB at 175.7 KB/sec)
Downloading: http://repo1.maven.org/maven2/javax/mail/mail/1.4.7/mail-1.4.7.jar
Downloaded: http://repo1.maven.org/maven2/com/intellij/annotations/12.0/annotations-12.0.jar (20 KB at 159.0 KB/sec)
Downloading: http://repo1.maven.org/maven2/org/codehaus/enunciate/enunciate-core/1.26.2/enunciate-core-1.26.2.jar
Downloaded: http://repo1.maven.org/maven2/ch/qos/logback/logback-core/1.0.13/logback-core-1.0.13.jar (410 KB at 1410.5 KB/sec)
Downloaded: http://repo1.maven.org/maven2/ch/qos/logback/logback-classic/1.0.13/logback-classic-1.0.13.jar (259 KB at 1063.4 KB/sec)
Downloaded: http://repo1.maven.org/maven2/javax/mail/mail/1.4.7/mail-1.4.7.jar (509 KB at 1595.4 KB/sec)
Downloaded: http://repo1.maven.org/maven2/org/codehaus/enunciate/enunciate-core/1.26.2/enunciate-core-1.26.2.jar (584 KB at 1894.8 KB/sec)
Downloaded: http://repo1.maven.org/maven2/com/google/guava/guava/14.0.1/guava-14.0.1.jar (2138 KB at 4729.7 KB/sec)
[INFO] 
[INFO] --- maven-clean-plugin:2.4.1:clean (default-clean) @ unzip-repository-plugin ---
[INFO] Deleting /opt/users/hudsonbuild/workspace/tycho.nexus-nightly/target
[INFO] 
[INFO] --- app-lifecycle-maven-plugin:1.7:check-dependencies (default-check-dependencies) @ unzip-repository-plugin ---
[INFO] Found dependency with 'provided' scope: org.sonatype.nexus:nexus-plugin-api:jar; ignoring
[INFO] Found dependency with 'provided' scope: org.sonatype.nexus.plugins:nexus-restlet1x-plugin:nexus-plugin; ignoring
[INFO] Found dependency with 'test' scope: junit:junit:jar; ignoring
[INFO] Found dependency with 'test' scope: org.easymock:easymock:jar; ignoring
[INFO] All Nexus dependencies in this project seem to have correct scope.
[INFO] 
[INFO] --- maven-resources-plugin:2.4:resources (default-resources) @ unzip-repository-plugin ---
[WARNING] Using platform encoding (UTF-8 actually) to copy filtered resources, i.e. build is platform dependent!
[INFO] Copying 2 resources
[INFO] 
[INFO] --- maven-compiler-plugin:2.5.1:compile (default-compile) @ unzip-repository-plugin ---
[WARNING] File encoding has not been set, using platform encoding UTF-8, i.e. build is platform dependent!
[INFO] Compiling 23 source files to /opt/users/hudsonbuild/workspace/tycho.nexus-nightly/target/classes
[INFO] 
[INFO] --- app-lifecycle-maven-plugin:1.7:generate-metadata (default-generate-metadata) @ unzip-repository-plugin ---
[INFO] Executing: /bin/sh -c cd /opt/users/hudsonbuild/workspace/tycho.nexus-nightly && git rev-parse HEAD
[INFO] Working directory: /opt/users/hudsonbuild/workspace/tycho.nexus-nightly
[INFO] 
[INFO] --- plexus-component-metadata:1.5.5:generate-metadata (process-classes) @ unzip-repository-plugin ---
[INFO] ------------------------------------------------------------------------
[INFO] BUILD FAILURE
[INFO] ------------------------------------------------------------------------
[INFO] Total time: 1:17.097s
[INFO] Finished at: Tue Sep 03 09:47:24 EDT 2013
[INFO] Final Memory: 41M/259M
[INFO] ------------------------------------------------------------------------
[INFO] o.h.m.e.h.MavenExecutionResultHandler - Build failed with exception(s)
[INFO] o.h.m.e.h.MavenExecutionResultHandler - [1] org.apache.maven.lifecycle.LifecycleExecutionException: Failed to execute goal org.codehaus.plexus:plexus-component-metadata:1.5.5:generate-metadata (process-classes) on project unzip-repository-plugin: Execution process-classes of goal org.codehaus.plexus:plexus-component-metadata:1.5.5:generate-metadata failed: An API incompatibility was encountered while executing org.codehaus.plexus:plexus-component-metadata:1.5.5:generate-metadata: java.lang.UnsupportedClassVersionError: org/sonatype/nexus/proxy/repository/AbstractShadowRepositoryConfigurator : Unsupported major.minor version 51.0
-----------------------------------------------------
realm =    plugin>org.codehaus.plexus:plexus-component-metadata:1.5.5
strategy = org.codehaus.plexus.classworlds.strategy.SelfFirstStrategy
urls[0] = file:/opt/users/hudsonbuild/workspace/tycho.nexus-nightly/.maven/repo/org/codehaus/plexus/plexus-component-metadata/1.5.5/plexus-component-metadata-1.5.5.jar
urls[1] = file:/opt/users/hudsonbuild/workspace/tycho.nexus-nightly/.maven/repo/org/apache/xbean/xbean-reflect/3.4/xbean-reflect-3.4.jar
urls[2] = file:/opt/users/hudsonbuild/workspace/tycho.nexus-nightly/.maven/repo/log4j/log4j/1.2.12/log4j-1.2.12.jar
urls[3] = file:/opt/users/hudsonbuild/workspace/tycho.nexus-nightly/.maven/repo/commons-logging/commons-logging-api/1.1/commons-logging-api-1.1.jar
urls[4] = file:/opt/users/hudsonbuild/workspace/tycho.nexus-nightly/.maven/repo/com/google/collections/google-collections/1.0/google-collections-1.0.jar
urls[5] = file:/opt/users/hudsonbuild/workspace/tycho.nexus-nightly/.maven/repo/junit/junit/3.8.2/junit-3.8.2.jar
urls[6] = file:/opt/users/hudsonbuild/workspace/tycho.nexus-nightly/.maven/repo/org/codehaus/plexus/plexus-component-annotations/1.5.5/plexus-component-annotations-1.5.5.jar
urls[7] = file:/opt/users/hudsonbuild/workspace/tycho.nexus-nightly/.maven/repo/org/codehaus/plexus/plexus-utils/1.4.5/plexus-utils-1.4.5.jar
urls[8] = file:/opt/users/hudsonbuild/workspace/tycho.nexus-nightly/.maven/repo/com/thoughtworks/qdox/qdox/1.9.2/qdox-1.9.2.jar
urls[9] = file:/opt/users/hudsonbuild/workspace/tycho.nexus-nightly/.maven/repo/jdom/jdom/1.0/jdom-1.0.jar
urls[10] = file:/opt/users/hudsonbuild/workspace/tycho.nexus-nightly/.maven/repo/org/codehaus/plexus/plexus-cli/1.2/plexus-cli-1.2.jar
urls[11] = file:/opt/users/hudsonbuild/workspace/tycho.nexus-nightly/.maven/repo/commons-cli/commons-cli/1.0/commons-cli-1.0.jar
urls[12] = file:/opt/users/hudsonbuild/workspace/tycho.nexus-nightly/.maven/repo/commons-logging/commons-logging/1.0/commons-logging-1.0.jar
urls[13] = file:/opt/users/hudsonbuild/workspace/tycho.nexus-nightly/.maven/repo/commons-lang/commons-lang/1.0/commons-lang-1.0.jar
urls[14] = file:/opt/users/hudsonbuild/workspace/tycho.nexus-nightly/.maven/repo/asm/asm/3.1/asm-3.1.jar
Number of foreign imports: 1
import: Entry[import  from realm ClassRealm[project>org.eclipse.tycho.nexus:unzip-repository-plugin:0.12.0-SNAPSHOT, parent: ClassRealm[maven.api, parent: null]]]

-----------------------------------------------------

[DEBUG] Closing connection to remote
[ERROR] Failed to execute goal org.codehaus.plexus:plexus-component-metadata:1.5.5:generate-metadata (process-classes) on project unzip-repository-plugin: Execution process-classes of goal org.codehaus.plexus:plexus-component-metadata:1.5.5:generate-metadata failed: An API incompatibility was encountered while executing org.codehaus.plexus:plexus-component-metadata:1.5.5:generate-metadata: java.lang.UnsupportedClassVersionError: org/sonatype/nexus/proxy/repository/AbstractShadowRepositoryConfigurator : Unsupported major.minor version 51.0
[ERROR] -----------------------------------------------------
[ERROR] realm =    plugin>org.codehaus.plexus:plexus-component-metadata:1.5.5
[ERROR] strategy = org.codehaus.plexus.classworlds.strategy.SelfFirstStrategy
[ERROR] urls[0] = file:/opt/users/hudsonbuild/workspace/tycho.nexus-nightly/.maven/repo/org/codehaus/plexus/plexus-component-metadata/1.5.5/plexus-component-metadata-1.5.5.jar
[ERROR] urls[1] = file:/opt/users/hudsonbuild/workspace/tycho.nexus-nightly/.maven/repo/org/apache/xbean/xbean-reflect/3.4/xbean-reflect-3.4.jar
[ERROR] urls[2] = file:/opt/users/hudsonbuild/workspace/tycho.nexus-nightly/.maven/repo/log4j/log4j/1.2.12/log4j-1.2.12.jar
[ERROR] urls[3] = file:/opt/users/hudsonbuild/workspace/tycho.nexus-nightly/.maven/repo/commons-logging/commons-logging-api/1.1/commons-logging-api-1.1.jar
[ERROR] urls[4] = file:/opt/users/hudsonbuild/workspace/tycho.nexus-nightly/.maven/repo/com/google/collections/google-collections/1.0/google-collections-1.0.jar
[ERROR] urls[5] = file:/opt/users/hudsonbuild/workspace/tycho.nexus-nightly/.maven/repo/junit/junit/3.8.2/junit-3.8.2.jar
[ERROR] urls[6] = file:/opt/users/hudsonbuild/workspace/tycho.nexus-nightly/.maven/repo/org/codehaus/plexus/plexus-component-annotations/1.5.5/plexus-component-annotations-1.5.5.jar
[ERROR] urls[7] = file:/opt/users/hudsonbuild/workspace/tycho.nexus-nightly/.maven/repo/org/codehaus/plexus/plexus-utils/1.4.5/plexus-utils-1.4.5.jar
[ERROR] urls[8] = file:/opt/users/hudsonbuild/workspace/tycho.nexus-nightly/.maven/repo/com/thoughtworks/qdox/qdox/1.9.2/qdox-1.9.2.jar
[ERROR] urls[9] = file:/opt/users/hudsonbuild/workspace/tycho.nexus-nightly/.maven/repo/jdom/jdom/1.0/jdom-1.0.jar
[ERROR] urls[10] = file:/opt/users/hudsonbuild/workspace/tycho.nexus-nightly/.maven/repo/org/codehaus/plexus/plexus-cli/1.2/plexus-cli-1.2.jar
[ERROR] urls[11] = file:/opt/users/hudsonbuild/workspace/tycho.nexus-nightly/.maven/repo/commons-cli/commons-cli/1.0/commons-cli-1.0.jar
[ERROR] urls[12] = file:/opt/users/hudsonbuild/workspace/tycho.nexus-nightly/.maven/repo/commons-logging/commons-logging/1.0/commons-logging-1.0.jar
[ERROR] urls[13] = file:/opt/users/hudsonbuild/workspace/tycho.nexus-nightly/.maven/repo/commons-lang/commons-lang/1.0/commons-lang-1.0.jar
[ERROR] urls[14] = file:/opt/users/hudsonbuild/workspace/tycho.nexus-nightly/.maven/repo/asm/asm/3.1/asm-3.1.jar
[ERROR] Number of foreign imports: 1
[ERROR] import: Entry[import  from realm ClassRealm[project>org.eclipse.tycho.nexus:unzip-repository-plugin:0.12.0-SNAPSHOT, parent: ClassRealm[maven.api, parent: null]]]
[ERROR] 
[ERROR] -----------------------------------------------------
[ERROR] -> [Help 1]
org.apache.maven.lifecycle.LifecycleExecutionException: Failed to execute goal org.codehaus.plexus:plexus-component-metadata:1.5.5:generate-metadata (process-classes) on project unzip-repository-plugin: Execution process-classes of goal org.codehaus.plexus:plexus-component-metadata:1.5.5:generate-metadata failed: An API incompatibility was encountered while executing org.codehaus.plexus:plexus-component-metadata:1.5.5:generate-metadata: java.lang.UnsupportedClassVersionError: org/sonatype/nexus/proxy/repository/AbstractShadowRepositoryConfigurator : Unsupported major.minor version 51.0
-----------------------------------------------------
realm =    plugin>org.codehaus.plexus:plexus-component-metadata:1.5.5
strategy = org.codehaus.plexus.classworlds.strategy.SelfFirstStrategy
urls[0] = file:/opt/users/hudsonbuild/workspace/tycho.nexus-nightly/.maven/repo/org/codehaus/plexus/plexus-component-metadata/1.5.5/plexus-component-metadata-1.5.5.jar
urls[1] = file:/opt/users/hudsonbuild/workspace/tycho.nexus-nightly/.maven/repo/org/apache/xbean/xbean-reflect/3.4/xbean-reflect-3.4.jar
urls[2] = file:/opt/users/hudsonbuild/workspace/tycho.nexus-nightly/.maven/repo/log4j/log4j/1.2.12/log4j-1.2.12.jar
urls[3] = file:/opt/users/hudsonbuild/workspace/tycho.nexus-nightly/.maven/repo/commons-logging/commons-logging-api/1.1/commons-logging-api-1.1.jar
urls[4] = file:/opt/users/hudsonbuild/workspace/tycho.nexus-nightly/.maven/repo/com/google/collections/google-collections/1.0/google-collections-1.0.jar
urls[5] = file:/opt/users/hudsonbuild/workspace/tycho.nexus-nightly/.maven/repo/junit/junit/3.8.2/junit-3.8.2.jar
urls[6] = file:/opt/users/hudsonbuild/workspace/tycho.nexus-nightly/.maven/repo/org/codehaus/plexus/plexus-component-annotations/1.5.5/plexus-component-annotations-1.5.5.jar
urls[7] = file:/opt/users/hudsonbuild/workspace/tycho.nexus-nightly/.maven/repo/org/codehaus/plexus/plexus-utils/1.4.5/plexus-utils-1.4.5.jar
urls[8] = file:/opt/users/hudsonbuild/workspace/tycho.nexus-nightly/.maven/repo/com/thoughtworks/qdox/qdox/1.9.2/qdox-1.9.2.jar
urls[9] = file:/opt/users/hudsonbuild/workspace/tycho.nexus-nightly/.maven/repo/jdom/jdom/1.0/jdom-1.0.jar
urls[10] = file:/opt/users/hudsonbuild/workspace/tycho.nexus-nightly/.maven/repo/org/codehaus/plexus/plexus-cli/1.2/plexus-cli-1.2.jar
urls[11] = file:/opt/users/hudsonbuild/workspace/tycho.nexus-nightly/.maven/repo/commons-cli/commons-cli/1.0/commons-cli-1.0.jar
urls[12] = file:/opt/users/hudsonbuild/workspace/tycho.nexus-nightly/.maven/repo/commons-logging/commons-logging/1.0/commons-logging-1.0.jar
urls[13] = file:/opt/users/hudsonbuild/workspace/tycho.nexus-nightly/.maven/repo/commons-lang/commons-lang/1.0/commons-lang-1.0.jar
urls[14] = file:/opt/users/hudsonbuild/workspace/tycho.nexus-nightly/.maven/repo/asm/asm/3.1/asm-3.1.jar
Number of foreign imports: 1
import: Entry[import  from realm ClassRealm[project>org.eclipse.tycho.nexus:unzip-repository-plugin:0.12.0-SNAPSHOT, parent: ClassRealm[maven.api, parent: null]]]

-----------------------------------------------------

	at org.apache.maven.lifecycle.internal.MojoExecutor.execute(MojoExecutor.java:225)
	at org.apache.maven.lifecycle.internal.MojoExecutor.execute(MojoExecutor.java:153)
	at org.apache.maven.lifecycle.internal.MojoExecutor.execute(MojoExecutor.java:145)
	at org.apache.maven.lifecycle.internal.LifecycleModuleBuilder.buildProject(LifecycleModuleBuilder.java:84)
	at org.apache.maven.lifecycle.internal.LifecycleModuleBuilder.buildProject(LifecycleModuleBuilder.java:59)
	at org.apache.maven.lifecycle.internal.LifecycleStarter.singleThreadedBuild(LifecycleStarter.java:183)
	at org.apache.maven.lifecycle.internal.LifecycleStarter.execute(LifecycleStarter.java:161)
	at org.apache.maven.DefaultMaven.doExecute(DefaultMaven.java:319)
	at org.apache.maven.DefaultMaven.execute(DefaultMaven.java:156)
	at org.apache.maven.cli.MavenCli.execute(MavenCli.java:537)
	at org.apache.maven.cli.MavenCli.doMain(MavenCli.java:196)
	at org.apache.maven.cli.MavenCli.main(MavenCli.java:141)
	at sun.reflect.NativeMethodAccessorImpl.invoke0(Native Method)
	at sun.reflect.NativeMethodAccessorImpl.invoke(NativeMethodAccessorImpl.java:39)
	at sun.reflect.DelegatingMethodAccessorImpl.invoke(DelegatingMethodAccessorImpl.java:25)
	at java.lang.reflect.Method.invoke(Method.java:597)
	at org.codehaus.plexus.classworlds.launcher.Launcher.launchEnhanced(Launcher.java:290)
	at org.codehaus.plexus.classworlds.launcher.Launcher.launch(Launcher.java:230)
	at org.codehaus.plexus.classworlds.launcher.Launcher.mainWithExitCode(Launcher.java:409)
	at org.codehaus.plexus.classworlds.launcher.Launcher.main(Launcher.java:352)
Caused by: org.apache.maven.plugin.PluginExecutionException: Execution process-classes of goal org.codehaus.plexus:plexus-component-metadata:1.5.5:generate-metadata failed: An API incompatibility was encountered while executing org.codehaus.plexus:plexus-component-metadata:1.5.5:generate-metadata: java.lang.UnsupportedClassVersionError: org/sonatype/nexus/proxy/repository/AbstractShadowRepositoryConfigurator : Unsupported major.minor version 51.0
-----------------------------------------------------
realm =    plugin>org.codehaus.plexus:plexus-component-metadata:1.5.5
strategy = org.codehaus.plexus.classworlds.strategy.SelfFirstStrategy
urls[0] = file:/opt/users/hudsonbuild/workspace/tycho.nexus-nightly/.maven/repo/org/codehaus/plexus/plexus-component-metadata/1.5.5/plexus-component-metadata-1.5.5.jar
urls[1] = file:/opt/users/hudsonbuild/workspace/tycho.nexus-nightly/.maven/repo/org/apache/xbean/xbean-reflect/3.4/xbean-reflect-3.4.jar
urls[2] = file:/opt/users/hudsonbuild/workspace/tycho.nexus-nightly/.maven/repo/log4j/log4j/1.2.12/log4j-1.2.12.jar
urls[3] = file:/opt/users/hudsonbuild/workspace/tycho.nexus-nightly/.maven/repo/commons-logging/commons-logging-api/1.1/commons-logging-api-1.1.jar
urls[4] = file:/opt/users/hudsonbuild/workspace/tycho.nexus-nightly/.maven/repo/com/google/collections/google-collections/1.0/google-collections-1.0.jar
urls[5] = file:/opt/users/hudsonbuild/workspace/tycho.nexus-nightly/.maven/repo/junit/junit/3.8.2/junit-3.8.2.jar
urls[6] = file:/opt/users/hudsonbuild/workspace/tycho.nexus-nightly/.maven/repo/org/codehaus/plexus/plexus-component-annotations/1.5.5/plexus-component-annotations-1.5.5.jar
urls[7] = file:/opt/users/hudsonbuild/workspace/tycho.nexus-nightly/.maven/repo/org/codehaus/plexus/plexus-utils/1.4.5/plexus-utils-1.4.5.jar
urls[8] = file:/opt/users/hudsonbuild/workspace/tycho.nexus-nightly/.maven/repo/com/thoughtworks/qdox/qdox/1.9.2/qdox-1.9.2.jar
urls[9] = file:/opt/users/hudsonbuild/workspace/tycho.nexus-nightly/.maven/repo/jdom/jdom/1.0/jdom-1.0.jar
urls[10] = file:/opt/users/hudsonbuild/workspace/tycho.nexus-nightly/.maven/repo/org/codehaus/plexus/plexus-cli/1.2/plexus-cli-1.2.jar
urls[11] = file:/opt/users/hudsonbuild/workspace/tycho.nexus-nightly/.maven/repo/commons-cli/commons-cli/1.0/commons-cli-1.0.jar
urls[12] = file:/opt/users/hudsonbuild/workspace/tycho.nexus-nightly/.maven/repo/commons-logging/commons-logging/1.0/commons-logging-1.0.jar
urls[13] = file:/opt/users/hudsonbuild/workspace/tycho.nexus-nightly/.maven/repo/commons-lang/commons-lang/1.0/commons-lang-1.0.jar
urls[14] = file:/opt/users/hudsonbuild/workspace/tycho.nexus-nightly/.maven/repo/asm/asm/3.1/asm-3.1.jar
Number of foreign imports: 1
import: Entry[import  from realm ClassRealm[project>org.eclipse.tycho.nexus:unzip-repository-plugin:0.12.0-SNAPSHOT, parent: ClassRealm[maven.api, parent: null]]]

-----------------------------------------------------

	at org.apache.maven.plugin.DefaultBuildPluginManager.executeMojo(DefaultBuildPluginManager.java:139)
	at org.apache.maven.lifecycle.internal.MojoExecutor.execute(MojoExecutor.java:209)
	... 19 more
Caused by: org.apache.maven.plugin.PluginContainerException: An API incompatibility was encountered while executing org.codehaus.plexus:plexus-component-metadata:1.5.5:generate-metadata: java.lang.UnsupportedClassVersionError: org/sonatype/nexus/proxy/repository/AbstractShadowRepositoryConfigurator : Unsupported major.minor version 51.0
-----------------------------------------------------
realm =    plugin>org.codehaus.plexus:plexus-component-metadata:1.5.5
strategy = org.codehaus.plexus.classworlds.strategy.SelfFirstStrategy
urls[0] = file:/opt/users/hudsonbuild/workspace/tycho.nexus-nightly/.maven/repo/org/codehaus/plexus/plexus-component-metadata/1.5.5/plexus-component-metadata-1.5.5.jar
urls[1] = file:/opt/users/hudsonbuild/workspace/tycho.nexus-nightly/.maven/repo/org/apache/xbean/xbean-reflect/3.4/xbean-reflect-3.4.jar
urls[2] = file:/opt/users/hudsonbuild/workspace/tycho.nexus-nightly/.maven/repo/log4j/log4j/1.2.12/log4j-1.2.12.jar
urls[3] = file:/opt/users/hudsonbuild/workspace/tycho.nexus-nightly/.maven/repo/commons-logging/commons-logging-api/1.1/commons-logging-api-1.1.jar
urls[4] = file:/opt/users/hudsonbuild/workspace/tycho.nexus-nightly/.maven/repo/com/google/collections/google-collections/1.0/google-collections-1.0.jar
urls[5] = file:/opt/users/hudsonbuild/workspace/tycho.nexus-nightly/.maven/repo/junit/junit/3.8.2/junit-3.8.2.jar
urls[6] = file:/opt/users/hudsonbuild/workspace/tycho.nexus-nightly/.maven/repo/org/codehaus/plexus/plexus-component-annotations/1.5.5/plexus-component-annotations-1.5.5.jar
urls[7] = file:/opt/users/hudsonbuild/workspace/tycho.nexus-nightly/.maven/repo/org/codehaus/plexus/plexus-utils/1.4.5/plexus-utils-1.4.5.jar
urls[8] = file:/opt/users/hudsonbuild/workspace/tycho.nexus-nightly/.maven/repo/com/thoughtworks/qdox/qdox/1.9.2/qdox-1.9.2.jar
urls[9] = file:/opt/users/hudsonbuild/workspace/tycho.nexus-nightly/.maven/repo/jdom/jdom/1.0/jdom-1.0.jar
urls[10] = file:/opt/users/hudsonbuild/workspace/tycho.nexus-nightly/.maven/repo/org/codehaus/plexus/plexus-cli/1.2/plexus-cli-1.2.jar
urls[11] = file:/opt/users/hudsonbuild/workspace/tycho.nexus-nightly/.maven/repo/commons-cli/commons-cli/1.0/commons-cli-1.0.jar
urls[12] = file:/opt/users/hudsonbuild/workspace/tycho.nexus-nightly/.maven/repo/commons-logging/commons-logging/1.0/commons-logging-1.0.jar
urls[13] = file:/opt/users/hudsonbuild/workspace/tycho.nexus-nightly/.maven/repo/commons-lang/commons-lang/1.0/commons-lang-1.0.jar
urls[14] = file:/opt/users/hudsonbuild/workspace/tycho.nexus-nightly/.maven/repo/asm/asm/3.1/asm-3.1.jar
Number of foreign imports: 1
import: Entry[import  from realm ClassRealm[project>org.eclipse.tycho.nexus:unzip-repository-plugin:0.12.0-SNAPSHOT, parent: ClassRealm[maven.api, parent: null]]]

-----------------------------------------------------

	at org.apache.maven.plugin.DefaultBuildPluginManager.executeMojo(DefaultBuildPluginManager.java:137)
	... 20 more
Caused by: java.lang.UnsupportedClassVersionError: org/sonatype/nexus/proxy/repository/AbstractShadowRepositoryConfigurator : Unsupported major.minor version 51.0
	at java.lang.ClassLoader.defineClass1(Native Method)
	at java.lang.ClassLoader.defineClassCond(ClassLoader.java:632)
	at java.lang.ClassLoader.defineClass(ClassLoader.java:616)
	at java.security.SecureClassLoader.defineClass(SecureClassLoader.java:141)
	at java.net.URLClassLoader.defineClass(URLClassLoader.java:283)
	at java.net.URLClassLoader.access$000(URLClassLoader.java:58)
	at java.net.URLClassLoader$1.run(URLClassLoader.java:197)
	at java.security.AccessController.doPrivileged(Native Method)
	at java.net.URLClassLoader.findClass(URLClassLoader.java:190)
	at java.lang.ClassLoader.loadClass(ClassLoader.java:307)
	at java.lang.ClassLoader.loadClass(ClassLoader.java:248)
	at java.lang.ClassLoader.defineClass1(Native Method)
	at java.lang.ClassLoader.defineClassCond(ClassLoader.java:632)
	at java.lang.ClassLoader.defineClass(ClassLoader.java:616)
	at java.security.SecureClassLoader.defineClass(SecureClassLoader.java:141)
	at java.net.URLClassLoader.defineClass(URLClassLoader.java:283)
	at java.net.URLClassLoader.access$000(URLClassLoader.java:58)
	at java.net.URLClassLoader$1.run(URLClassLoader.java:197)
	at java.security.AccessController.doPrivileged(Native Method)
	at java.net.URLClassLoader.findClass(URLClassLoader.java:190)
	at java.lang.ClassLoader.loadClass(ClassLoader.java:307)
	at java.lang.ClassLoader.loadClass(ClassLoader.java:248)
	at java.lang.Class.forName0(Native Method)
	at java.lang.Class.forName(Class.java:247)
	at org.codehaus.plexus.metadata.ann.AnnInvocationHandler.invoke(AnnInvocationHandler.java:63)
	at $Proxy21.role(Unknown Source)
	at org.codehaus.plexus.metadata.gleaner.AnnotationComponentGleaner.glean(AnnotationComponentGleaner.java:72)
	at org.codehaus.plexus.metadata.ClassComponentDescriptorExtractor.extract(ClassComponentDescriptorExtractor.java:145)
	at org.codehaus.plexus.metadata.ClassComponentDescriptorExtractor.extract(ClassComponentDescriptorExtractor.java:79)
	at org.codehaus.plexus.metadata.DefaultMetadataGenerator.generateDescriptor(DefaultMetadataGenerator.java:78)
	at org.codehaus.plexus.maven.plugin.PlexusDescriptorMojo.execute(PlexusDescriptorMojo.java:82)
	at org.apache.maven.plugin.DefaultBuildPluginManager.executeMojo(DefaultBuildPluginManager.java:101)
	... 20 more
[ERROR] 
[ERROR] Re-run Maven using the -X switch to enable full debug logging.
[ERROR] 
[ERROR] For more information about the errors and possible solutions, please read the following articles:
[ERROR] [Help 1] http://cwiki.apache.org/confluence/display/MAVEN/PluginContainerException
[DEBUG] Waiting for process to finish
[DEBUG] Result: 1
Recording test results
Sending e-mails to: jan.sievers@sap.com tobias.oberlies@sap.com
[DEBUG] Skipping watched dependency update for build: tycho.nexus-nightly #18 due to result: FAILURE
Finished: FAILURE