FailedConsole Output

Started by an SCM change
Building remotely on hudson-slave4
Checkout:tycho.nexus-nightly / /opt/users/hudsonbuild/workspace/tycho.nexus-nightly - hudson.remoting.Channel@4229e623:hudson-slave4
Using strategy: Default
Last Built Revision: Revision cbaa96aa1d1c630fea80da16a13db4e5673ad589 (origin/master)
Checkout:tycho.nexus-nightly / /opt/users/hudsonbuild/workspace/tycho.nexus-nightly - hudson.remoting.LocalChannel@7a01ff7e
Fetching changes from the remote Git repository
Fetching upstream changes from git://git.eclipse.org/gitroot/tycho/org.eclipse.tycho.nexus.git
Commencing build of Revision d1232cca1888485900741e672997a4fbefa9ac9e (origin/master)
Checking out Revision d1232cca1888485900741e672997a4fbefa9ac9e (origin/master)
[INFO] Using bundled Maven 3 installation
[INFO] Checking Maven 3 installation environment
[tycho.nexus-nightly] $ /opt/users/hudsonbuild/maven/slavebundle/bundled-maven/bin/mvn --help
[INFO] Checking Maven 3 installation version
[tycho.nexus-nightly] $ /opt/users/hudsonbuild/maven/slavebundle/bundled-maven/bin/mvn --version
[INFO] Detected Maven 3 installation version: 3.0.3
[WARN] Detected superfluous option: -B
[WARN] Detected superfluous option: -V
[DEBUG] Waiting for connection on port: 34621
[tycho.nexus-nightly] $ /opt/users/hudsonbuild/maven/slavebundle/bundled-maven/bin/mvn clean install -B -e -V -V -B -Dmaven.ext.class.path=/opt/users/hudsonbuild/maven/slavebundle/resources:/opt/users/hudsonbuild/maven/slavebundle/lib/maven3-eventspy-3.0.jar:/opt/users/hudsonbuild/slave.jar -Dhudson.eventspy.port=34621 -Dmaven.repo.local=/opt/users/hudsonbuild/workspace/tycho.nexus-nightly/.maven/repo -f pom.xml
Apache Maven 3.0.3 (r1075438; 2011-02-28 12:31:09-0500)
Maven home: /opt/users/hudsonbuild/maven/slavebundle/bundled-maven
Java version: 1.6.0_21, vendor: Sun Microsystems Inc.
Java home: /opt/public/common/sun-jdk1.6.0_21_x64/jre
Default locale: en_US, platform encoding: UTF-8
OS name: "linux", version: "2.6.32.59-0.7-xen", arch: "amd64", family: "unix"
[DEBUG] Connected to remote
[INFO] Error stacktraces are turned on.
[INFO] Scanning for projects...
Downloading: https://repository.sonatype.org/content/groups/forge/org/sonatype/plugins/app-lifecycle-maven-plugin/1.7/app-lifecycle-maven-plugin-1.7.pom
Downloading: http://repo1.maven.org/maven2/org/sonatype/plugins/app-lifecycle-maven-plugin/1.7/app-lifecycle-maven-plugin-1.7.pom
[INFO] o.h.m.e.h.MavenExecutionResultHandler - Build failed with exception(s)
[INFO] o.h.m.e.h.MavenExecutionResultHandler - [1] org.apache.maven.project.ProjectBuildingException: Some problems were encountered while processing the POMs:
[ERROR] Unresolveable build extension: Plugin org.sonatype.plugins:app-lifecycle-maven-plugin:1.7 or one of its dependencies could not be resolved: Failed to collect dependencies for org.sonatype.plugins:app-lifecycle-maven-plugin:jar:1.7 () @ 
[ERROR] Unknown packaging: nexus-plugin @ line 41, column 13

[DEBUG] Closing connection to remote
[ERROR] The build could not read 1 project -> [Help 1]
org.apache.maven.project.ProjectBuildingException: Some problems were encountered while processing the POMs:
[ERROR] Unresolveable build extension: Plugin org.sonatype.plugins:app-lifecycle-maven-plugin:1.7 or one of its dependencies could not be resolved: Failed to collect dependencies for org.sonatype.plugins:app-lifecycle-maven-plugin:jar:1.7 () @ 
[ERROR] Unknown packaging: nexus-plugin @ line 41, column 13

	at org.apache.maven.project.DefaultProjectBuilder.build(DefaultProjectBuilder.java:339)
	at org.apache.maven.DefaultMaven.collectProjects(DefaultMaven.java:632)
	at org.apache.maven.DefaultMaven.getProjectsForMavenReactor(DefaultMaven.java:581)
	at org.apache.maven.DefaultMaven.doExecute(DefaultMaven.java:233)
	at org.apache.maven.DefaultMaven.execute(DefaultMaven.java:156)
	at org.apache.maven.cli.MavenCli.execute(MavenCli.java:537)
	at org.apache.maven.cli.MavenCli.doMain(MavenCli.java:196)
	at org.apache.maven.cli.MavenCli.main(MavenCli.java:141)
	at sun.reflect.NativeMethodAccessorImpl.invoke0(Native Method)
	at sun.reflect.NativeMethodAccessorImpl.invoke(NativeMethodAccessorImpl.java:39)
	at sun.reflect.DelegatingMethodAccessorImpl.invoke(DelegatingMethodAccessorImpl.java:25)
	at java.lang.reflect.Method.invoke(Method.java:597)
	at org.codehaus.plexus.classworlds.launcher.Launcher.launchEnhanced(Launcher.java:290)
	at org.codehaus.plexus.classworlds.launcher.Launcher.launch(Launcher.java:230)
	at org.codehaus.plexus.classworlds.launcher.Launcher.mainWithExitCode(Launcher.java:409)
	at org.codehaus.plexus.classworlds.launcher.Launcher.main(Launcher.java:352)
[ERROR]   
[ERROR]   The project org.eclipse.tycho.nexus:unzip-repository-plugin:0.10.0-SNAPSHOT (/opt/users/hudsonbuild/workspace/tycho.nexus-nightly/pom.xml) has 2 errors
[ERROR]     Unresolveable build extension: Plugin org.sonatype.plugins:app-lifecycle-maven-plugin:1.7 or one of its dependencies could not be resolved: Failed to collect dependencies for org.sonatype.plugins:app-lifecycle-maven-plugin:jar:1.7 (): Failed to read artifact descriptor for org.sonatype.plugins:app-lifecycle-maven-plugin:jar:1.7: Could not transfer artifact org.sonatype.plugins:app-lifecycle-maven-plugin:pom:1.7 from/to repository.sonatype.org (https://repository.sonatype.org/content/groups/forge/): Error transferring file: Unable to tunnel through proxy. Proxy returns "HTTP/1.1 502 Bad Gateway" -> [Help 2]
org.apache.maven.plugin.PluginResolutionException: Plugin org.sonatype.plugins:app-lifecycle-maven-plugin:1.7 or one of its dependencies could not be resolved: Failed to collect dependencies for org.sonatype.plugins:app-lifecycle-maven-plugin:jar:1.7 ()
	at org.apache.maven.plugin.internal.DefaultPluginDependenciesResolver.resolve(DefaultPluginDependenciesResolver.java:211)
	at org.apache.maven.project.DefaultProjectBuildingHelper.resolveExtensionArtifacts(DefaultProjectBuildingHelper.java:377)
	at org.apache.maven.project.DefaultProjectBuildingHelper.createProjectRealm(DefaultProjectBuildingHelper.java:237)
	at org.apache.maven.project.DefaultModelBuildingListener.buildExtensionsAssembled(DefaultModelBuildingListener.java:106)
	at org.apache.maven.model.building.ModelBuildingEventCatapult$1.fire(ModelBuildingEventCatapult.java:43)
	at org.apache.maven.model.building.DefaultModelBuilder.fireEvent(DefaultModelBuilder.java:1041)
	at org.apache.maven.model.building.DefaultModelBuilder.build(DefaultModelBuilder.java:391)
	at org.apache.maven.model.building.DefaultModelBuilder.build(DefaultModelBuilder.java:374)
	at org.apache.maven.project.DefaultProjectBuilder.build(DefaultProjectBuilder.java:536)
	at org.apache.maven.project.DefaultProjectBuilder.build(DefaultProjectBuilder.java:328)
	at org.apache.maven.DefaultMaven.collectProjects(DefaultMaven.java:632)
	at org.apache.maven.DefaultMaven.getProjectsForMavenReactor(DefaultMaven.java:581)
	at org.apache.maven.DefaultMaven.doExecute(DefaultMaven.java:233)
	at org.apache.maven.DefaultMaven.execute(DefaultMaven.java:156)
	at org.apache.maven.cli.MavenCli.execute(MavenCli.java:537)
	at org.apache.maven.cli.MavenCli.doMain(MavenCli.java:196)
	at org.apache.maven.cli.MavenCli.main(MavenCli.java:141)
	at sun.reflect.NativeMethodAccessorImpl.invoke0(Native Method)
	at sun.reflect.NativeMethodAccessorImpl.invoke(NativeMethodAccessorImpl.java:39)
	at sun.reflect.DelegatingMethodAccessorImpl.invoke(DelegatingMethodAccessorImpl.java:25)
	at java.lang.reflect.Method.invoke(Method.java:597)
	at org.codehaus.plexus.classworlds.launcher.Launcher.launchEnhanced(Launcher.java:290)
	at org.codehaus.plexus.classworlds.launcher.Launcher.launch(Launcher.java:230)
	at org.codehaus.plexus.classworlds.launcher.Launcher.mainWithExitCode(Launcher.java:409)
	at org.codehaus.plexus.classworlds.launcher.Launcher.main(Launcher.java:352)
Caused by: org.sonatype.aether.collection.DependencyCollectionException: Failed to collect dependencies for org.sonatype.plugins:app-lifecycle-maven-plugin:jar:1.7 ()
	at org.sonatype.aether.impl.internal.DefaultDependencyCollector.collectDependencies(DefaultDependencyCollector.java:202)
	at org.sonatype.aether.impl.internal.DefaultRepositorySystem.collectDependencies(DefaultRepositorySystem.java:345)
	at org.apache.maven.plugin.internal.DefaultPluginDependenciesResolver.resolve(DefaultPluginDependenciesResolver.java:199)
	... 24 more
Caused by: org.sonatype.aether.resolution.ArtifactDescriptorException: Failed to read artifact descriptor for org.sonatype.plugins:app-lifecycle-maven-plugin:jar:1.7
	at org.apache.maven.repository.internal.DefaultArtifactDescriptorReader.loadPom(DefaultArtifactDescriptorReader.java:282)
	at org.apache.maven.repository.internal.DefaultArtifactDescriptorReader.readArtifactDescriptor(DefaultArtifactDescriptorReader.java:172)
	at org.sonatype.aether.impl.internal.DefaultDependencyCollector.collectDependencies(DefaultDependencyCollector.java:196)
	... 26 more
Caused by: org.sonatype.aether.resolution.ArtifactResolutionException: Could not transfer artifact org.sonatype.plugins:app-lifecycle-maven-plugin:pom:1.7 from/to repository.sonatype.org (https://repository.sonatype.org/content/groups/forge/): Error transferring file: Unable to tunnel through proxy. Proxy returns "HTTP/1.1 502 Bad Gateway"
	at org.sonatype.aether.impl.internal.DefaultArtifactResolver.resolve(DefaultArtifactResolver.java:541)
	at org.sonatype.aether.impl.internal.DefaultArtifactResolver.resolveArtifacts(DefaultArtifactResolver.java:220)
	at org.sonatype.aether.impl.internal.DefaultArtifactResolver.resolveArtifact(DefaultArtifactResolver.java:197)
	at org.apache.maven.repository.internal.DefaultArtifactDescriptorReader.loadPom(DefaultArtifactDescriptorReader.java:267)
	... 28 more
Caused by: org.sonatype.aether.transfer.ArtifactTransferException: Could not transfer artifact org.sonatype.plugins:app-lifecycle-maven-plugin:pom:1.7 from/to repository.sonatype.org (https://repository.sonatype.org/content/groups/forge/): Error transferring file: Unable to tunnel through proxy. Proxy returns "HTTP/1.1 502 Bad Gateway"
	at org.sonatype.aether.connector.wagon.WagonRepositoryConnector$4.wrap(WagonRepositoryConnector.java:949)
	at org.sonatype.aether.connector.wagon.WagonRepositoryConnector$4.wrap(WagonRepositoryConnector.java:940)
	at org.sonatype.aether.connector.wagon.WagonRepositoryConnector$GetTask.flush(WagonRepositoryConnector.java:695)
	at org.sonatype.aether.connector.wagon.WagonRepositoryConnector$GetTask.flush(WagonRepositoryConnector.java:689)
	at org.sonatype.aether.connector.wagon.WagonRepositoryConnector.get(WagonRepositoryConnector.java:445)
	at org.sonatype.aether.impl.internal.DefaultArtifactResolver.resolve(DefaultArtifactResolver.java:460)
	... 31 more
Caused by: org.apache.maven.wagon.TransferFailedException: Error transferring file: Unable to tunnel through proxy. Proxy returns "HTTP/1.1 502 Bad Gateway"
	at org.apache.maven.wagon.providers.http.LightweightHttpWagon.fillInputData(LightweightHttpWagon.java:143)
	at org.apache.maven.wagon.StreamWagon.getInputStream(StreamWagon.java:116)
	at org.apache.maven.wagon.StreamWagon.getIfNewer(StreamWagon.java:88)
	at org.apache.maven.wagon.StreamWagon.get(StreamWagon.java:61)
	at org.sonatype.aether.connector.wagon.WagonRepositoryConnector$GetTask.run(WagonRepositoryConnector.java:608)
	at org.sonatype.aether.util.concurrency.RunnableErrorForwarder$1.run(RunnableErrorForwarder.java:64)
	at java.util.concurrent.ThreadPoolExecutor$Worker.runTask(ThreadPoolExecutor.java:886)
	at java.util.concurrent.ThreadPoolExecutor$Worker.run(ThreadPoolExecutor.java:908)
	at java.lang.Thread.run(Thread.java:619)
Caused by: java.io.IOException: Unable to tunnel through proxy. Proxy returns "HTTP/1.1 502 Bad Gateway"
	at sun.reflect.NativeConstructorAccessorImpl.newInstance0(Native Method)
	at sun.reflect.NativeConstructorAccessorImpl.newInstance(NativeConstructorAccessorImpl.java:39)
	at sun.reflect.DelegatingConstructorAccessorImpl.newInstance(DelegatingConstructorAccessorImpl.java:27)
	at java.lang.reflect.Constructor.newInstance(Constructor.java:513)
	at sun.net.www.protocol.http.HttpURLConnection$6.run(HttpURLConnection.java:1368)
	at java.security.AccessController.doPrivileged(Native Method)
	at sun.net.www.protocol.http.HttpURLConnection.getChainedException(HttpURLConnection.java:1362)
	at sun.net.www.protocol.http.HttpURLConnection.getInputStream(HttpURLConnection.java:1016)
	at sun.net.www.protocol.https.HttpsURLConnectionImpl.getInputStream(HttpsURLConnectionImpl.java:234)
	at org.apache.maven.wagon.providers.http.LightweightHttpWagon.fillInputData(LightweightHttpWagon.java:122)
	... 8 more
Caused by: java.io.IOException: Unable to tunnel through proxy. Proxy returns "HTTP/1.1 502 Bad Gateway"
	at sun.net.www.protocol.http.HttpURLConnection.doTunneling(HttpURLConnection.java:1525)
	at sun.net.www.protocol.https.AbstractDelegateHttpsURLConnection.connect(AbstractDelegateHttpsURLConnection.java:164)
	at sun.net.www.protocol.http.HttpURLConnection.getInputStream(HttpURLConnection.java:1049)
	at java.net.HttpURLConnection.getResponseCode(HttpURLConnection.java:373)
	at sun.net.www.protocol.https.HttpsURLConnectionImpl.getResponseCode(HttpsURLConnectionImpl.java:318)
	at org.apache.maven.wagon.providers.http.LightweightHttpWagon.fillInputData(LightweightHttpWagon.java:115)
	... 8 more
[ERROR]     Unknown packaging: nexus-plugin @ line 41, column 13
[ERROR] 
[ERROR] Re-run Maven using the -X switch to enable full debug logging.
[ERROR] 
[ERROR] For more information about the errors and possible solutions, please read the following articles:
[ERROR] [Help 1] http://cwiki.apache.org/confluence/display/MAVEN/ProjectBuildingException
[ERROR] [Help 2] http://cwiki.apache.org/confluence/display/MAVEN/PluginResolutionException
[DEBUG] Waiting for process to finish
[DEBUG] Result: 1
Recording test results
Sending e-mails to: jan.sievers@sap.com tobias.oberlies@sap.com
[DEBUG] Skipping watched dependency update for build: tycho.nexus-nightly #11 due to result: FAILURE
Finished: FAILURE