FailedConsole Output

Skipping 82 KB.. Full Log
-plugin/src/main/resources
[INFO] 
[INFO] --- maven-compiler-plugin:3.8.1:compile (default-compile) @ tycho-pack200a-plugin ---
[INFO] Changes detected - recompiling the module!
[INFO] Compiling 1 source file to /jobs/genie.tycho/tycho.extras-its/workspace/pack200/tycho-pack200a-plugin/target/classes
[INFO] 
[INFO] --- maven-plugin-plugin:3.6.0:descriptor (default-descriptor) @ tycho-pack200a-plugin ---
[INFO] Using 'UTF-8' encoding to read mojo source files.
[INFO] java-annotations mojo extractor found 1 mojo descriptor.
[INFO] 
[INFO] --- maven-plugin-plugin:3.6.0:descriptor (mojo-descriptor) @ tycho-pack200a-plugin ---
[INFO] Using 'UTF-8' encoding to read mojo source files.
[INFO] java-annotations mojo extractor found 1 mojo descriptor.
[INFO] 
[INFO] --- maven-resources-plugin:3.1.0:testResources (default-testResources) @ tycho-pack200a-plugin ---
[INFO] Using 'UTF-8' encoding to copy filtered resources.
[INFO] skip non existing resourceDirectory /jobs/genie.tycho/tycho.extras-its/workspace/pack200/tycho-pack200a-plugin/src/test/resources
[INFO] 
[INFO] --- maven-compiler-plugin:3.8.1:testCompile (default-testCompile) @ tycho-pack200a-plugin ---
[INFO] No sources to compile
[INFO] 
[INFO] --- maven-surefire-plugin:2.22.0:test (default-test) @ tycho-pack200a-plugin ---
[INFO] No tests to run.
[INFO] 
[INFO] --- maven-jar-plugin:3.1.2:jar (default-jar) @ tycho-pack200a-plugin ---
[INFO] Building jar: /jobs/genie.tycho/tycho.extras-its/workspace/pack200/tycho-pack200a-plugin/target/tycho-pack200a-plugin-1.5.0-SNAPSHOT.jar
[INFO] 
[INFO] --- maven-plugin-plugin:3.6.0:addPluginArtifactMetadata (default-addPluginArtifactMetadata) @ tycho-pack200a-plugin ---
[INFO] 
[INFO] --- maven-source-plugin:3.1.0:jar-no-fork (source-jar) @ tycho-pack200a-plugin ---
[INFO] Building jar: /jobs/genie.tycho/tycho.extras-its/workspace/pack200/tycho-pack200a-plugin/target/tycho-pack200a-plugin-1.5.0-SNAPSHOT-sources.jar
[INFO] 
[INFO] --- maven-install-plugin:2.5.2:install (default-install) @ tycho-pack200a-plugin ---
[INFO] Installing /jobs/genie.tycho/tycho.extras-its/workspace/pack200/tycho-pack200a-plugin/target/tycho-pack200a-plugin-1.5.0-SNAPSHOT.jar to /home/hudson/genie.tycho/.jenkins/jobs/tycho.extras-its/workspace/.repository/org/eclipse/tycho/extras/tycho-pack200a-plugin/1.5.0-SNAPSHOT/tycho-pack200a-plugin-1.5.0-SNAPSHOT.jar
[INFO] Installing /jobs/genie.tycho/tycho.extras-its/workspace/pack200/tycho-pack200a-plugin/pom.xml to /home/hudson/genie.tycho/.jenkins/jobs/tycho.extras-its/workspace/.repository/org/eclipse/tycho/extras/tycho-pack200a-plugin/1.5.0-SNAPSHOT/tycho-pack200a-plugin-1.5.0-SNAPSHOT.pom
[INFO] Installing /jobs/genie.tycho/tycho.extras-its/workspace/pack200/tycho-pack200a-plugin/target/tycho-pack200a-plugin-1.5.0-SNAPSHOT-sources.jar to /home/hudson/genie.tycho/.jenkins/jobs/tycho.extras-its/workspace/.repository/org/eclipse/tycho/extras/tycho-pack200a-plugin/1.5.0-SNAPSHOT/tycho-pack200a-plugin-1.5.0-SNAPSHOT-sources.jar
[INFO] 
[INFO] -----------< org.eclipse.tycho.extras:tycho-pack200b-plugin >-----------
[INFO] Building Pack200 Pack Plugin 1.5.0-SNAPSHOT                      [11/18]
[INFO] ----------------------------[ maven-plugin ]----------------------------
[INFO] 
[INFO] --- maven-clean-plugin:3.1.0:clean (default-clean) @ tycho-pack200b-plugin ---
[INFO] Deleting /jobs/genie.tycho/tycho.extras-its/workspace/pack200/tycho-pack200b-plugin/target
[INFO] 
[INFO] --- maven-resources-plugin:3.1.0:resources (default-resources) @ tycho-pack200b-plugin ---
[INFO] Using 'UTF-8' encoding to copy filtered resources.
[INFO] skip non existing resourceDirectory /jobs/genie.tycho/tycho.extras-its/workspace/pack200/tycho-pack200b-plugin/src/main/resources
[INFO] 
[INFO] --- maven-compiler-plugin:3.8.1:compile (default-compile) @ tycho-pack200b-plugin ---
[INFO] Changes detected - recompiling the module!
[INFO] Compiling 1 source file to /jobs/genie.tycho/tycho.extras-its/workspace/pack200/tycho-pack200b-plugin/target/classes
[INFO] 
[INFO] --- maven-plugin-plugin:3.6.0:descriptor (default-descriptor) @ tycho-pack200b-plugin ---
[INFO] Using 'UTF-8' encoding to read mojo source files.
[INFO] java-annotations mojo extractor found 1 mojo descriptor.
[INFO] 
[INFO] --- maven-plugin-plugin:3.6.0:descriptor (mojo-descriptor) @ tycho-pack200b-plugin ---
[INFO] Using 'UTF-8' encoding to read mojo source files.
[INFO] java-annotations mojo extractor found 1 mojo descriptor.
[INFO] 
[INFO] --- maven-resources-plugin:3.1.0:testResources (default-testResources) @ tycho-pack200b-plugin ---
[INFO] Using 'UTF-8' encoding to copy filtered resources.
[INFO] skip non existing resourceDirectory /jobs/genie.tycho/tycho.extras-its/workspace/pack200/tycho-pack200b-plugin/src/test/resources
[INFO] 
[INFO] --- maven-compiler-plugin:3.8.1:testCompile (default-testCompile) @ tycho-pack200b-plugin ---
[INFO] No sources to compile
[INFO] 
[INFO] --- maven-surefire-plugin:2.22.0:test (default-test) @ tycho-pack200b-plugin ---
[INFO] No tests to run.
[INFO] 
[INFO] --- maven-jar-plugin:3.1.2:jar (default-jar) @ tycho-pack200b-plugin ---
[INFO] Building jar: /jobs/genie.tycho/tycho.extras-its/workspace/pack200/tycho-pack200b-plugin/target/tycho-pack200b-plugin-1.5.0-SNAPSHOT.jar
[INFO] 
[INFO] --- maven-plugin-plugin:3.6.0:addPluginArtifactMetadata (default-addPluginArtifactMetadata) @ tycho-pack200b-plugin ---
[INFO] 
[INFO] --- maven-source-plugin:3.1.0:jar-no-fork (source-jar) @ tycho-pack200b-plugin ---
[INFO] Building jar: /jobs/genie.tycho/tycho.extras-its/workspace/pack200/tycho-pack200b-plugin/target/tycho-pack200b-plugin-1.5.0-SNAPSHOT-sources.jar
[INFO] 
[INFO] --- maven-install-plugin:2.5.2:install (default-install) @ tycho-pack200b-plugin ---
[INFO] Installing /jobs/genie.tycho/tycho.extras-its/workspace/pack200/tycho-pack200b-plugin/target/tycho-pack200b-plugin-1.5.0-SNAPSHOT.jar to /home/hudson/genie.tycho/.jenkins/jobs/tycho.extras-its/workspace/.repository/org/eclipse/tycho/extras/tycho-pack200b-plugin/1.5.0-SNAPSHOT/tycho-pack200b-plugin-1.5.0-SNAPSHOT.jar
[INFO] Installing /jobs/genie.tycho/tycho.extras-its/workspace/pack200/tycho-pack200b-plugin/pom.xml to /home/hudson/genie.tycho/.jenkins/jobs/tycho.extras-its/workspace/.repository/org/eclipse/tycho/extras/tycho-pack200b-plugin/1.5.0-SNAPSHOT/tycho-pack200b-plugin-1.5.0-SNAPSHOT.pom
[INFO] Installing /jobs/genie.tycho/tycho.extras-its/workspace/pack200/tycho-pack200b-plugin/target/tycho-pack200b-plugin-1.5.0-SNAPSHOT-sources.jar to /home/hudson/genie.tycho/.jenkins/jobs/tycho.extras-its/workspace/.repository/org/eclipse/tycho/extras/tycho-pack200b-plugin/1.5.0-SNAPSHOT/tycho-pack200b-plugin-1.5.0-SNAPSHOT-sources.jar
[INFO] 
[INFO] -------------< org.eclipse.tycho.extras:tycho-pack200-its >-------------
[INFO] Building tycho-pack200-its 1.5.0-SNAPSHOT                        [12/18]
[INFO] --------------------------------[ jar ]---------------------------------
[INFO] 
[INFO] --- maven-clean-plugin:3.1.0:clean (default-clean) @ tycho-pack200-its ---
[INFO] Deleting /jobs/genie.tycho/tycho.extras-its/workspace/pack200/tycho-pack200-its/target
[INFO] 
[INFO] --- maven-resources-plugin:3.1.0:resources (default-resources) @ tycho-pack200-its ---
[INFO] Using 'UTF-8' encoding to copy filtered resources.
[INFO] skip non existing resourceDirectory /jobs/genie.tycho/tycho.extras-its/workspace/pack200/tycho-pack200-its/src/main/resources
[INFO] 
[INFO] --- maven-compiler-plugin:3.8.1:compile (default-compile) @ tycho-pack200-its ---
[INFO] Nothing to compile - all classes are up to date
[INFO] 
[INFO] --- maven-resources-plugin:3.1.0:testResources (default-testResources) @ tycho-pack200-its ---
[INFO] Using 'UTF-8' encoding to copy filtered resources.
[INFO] skip non existing resourceDirectory /jobs/genie.tycho/tycho.extras-its/workspace/pack200/tycho-pack200-its/src/test/resources
[INFO] 
[INFO] --- maven-compiler-plugin:3.8.1:testCompile (default-testCompile) @ tycho-pack200-its ---
[INFO] No sources to compile
[INFO] 
[INFO] --- maven-surefire-plugin:2.22.0:test (default-test) @ tycho-pack200-its ---
[INFO] No tests to run.
[INFO] 
[INFO] --- maven-jar-plugin:3.1.2:jar (default-jar) @ tycho-pack200-its ---
[WARNING] JAR will be empty - no content was marked for inclusion!
[INFO] Building jar: /jobs/genie.tycho/tycho.extras-its/workspace/pack200/tycho-pack200-its/target/tycho-pack200-its-1.5.0-SNAPSHOT.jar
[INFO] 
[INFO] --- maven-source-plugin:3.1.0:jar-no-fork (source-jar) @ tycho-pack200-its ---
[INFO] Building jar: /jobs/genie.tycho/tycho.extras-its/workspace/pack200/tycho-pack200-its/target/tycho-pack200-its-1.5.0-SNAPSHOT-sources.jar
[INFO] 
[INFO] --- maven-invoker-plugin:3.2.0:install (integration-test) @ tycho-pack200-its ---
[INFO] Installing /jobs/genie.tycho/tycho.extras-its/workspace/pack200/tycho-pack200-impl/pom.xml to /jobs/genie.tycho/tycho.extras-its/workspace/pack200/tycho-pack200-its/target/local-repo/org/eclipse/tycho/extras/tycho-pack200-impl/1.5.0-SNAPSHOT/tycho-pack200-impl-1.5.0-SNAPSHOT.pom
[INFO] Installing /jobs/genie.tycho/tycho.extras-its/workspace/pack200/tycho-pack200-impl/target/tycho-pack200-impl-1.5.0-SNAPSHOT.jar to /jobs/genie.tycho/tycho.extras-its/workspace/pack200/tycho-pack200-its/target/local-repo/org/eclipse/tycho/extras/tycho-pack200-impl/1.5.0-SNAPSHOT/tycho-pack200-impl-1.5.0-SNAPSHOT.jar
[INFO] Installing /jobs/genie.tycho/tycho.extras-its/workspace/pack200/tycho-pack200-impl/pom.xml to /jobs/genie.tycho/tycho.extras-its/workspace/pack200/tycho-pack200-its/target/local-repo/org/eclipse/tycho/extras/tycho-pack200-impl/1.5.0-SNAPSHOT/tycho-pack200-impl-1.5.0-SNAPSHOT.pom
[INFO] Installing /jobs/genie.tycho/tycho.extras-its/workspace/pack200/tycho-pack200-impl/target/tycho-pack200-impl-1.5.0-SNAPSHOT-sources.jar to /jobs/genie.tycho/tycho.extras-its/workspace/pack200/tycho-pack200-its/target/local-repo/org/eclipse/tycho/extras/tycho-pack200-impl/1.5.0-SNAPSHOT/tycho-pack200-impl-1.5.0-SNAPSHOT-sources.jar
[INFO] Installing /jobs/genie.tycho/tycho.extras-its/workspace/pack200/pom.xml to /jobs/genie.tycho/tycho.extras-its/workspace/pack200/tycho-pack200-its/target/local-repo/org/eclipse/tycho/extras/tycho-pack200/1.5.0-SNAPSHOT/tycho-pack200-1.5.0-SNAPSHOT.pom
[INFO] Installing /jobs/genie.tycho/tycho.extras-its/workspace/pom.xml to /jobs/genie.tycho/tycho.extras-its/workspace/pack200/tycho-pack200-its/target/local-repo/org/eclipse/tycho/extras/tycho-extras/1.5.0-SNAPSHOT/tycho-extras-1.5.0-SNAPSHOT.pom
[INFO] Installing /jobs/genie.tycho/tycho.extras-its/workspace/pack200/tycho-pack200b-plugin/pom.xml to /jobs/genie.tycho/tycho.extras-its/workspace/pack200/tycho-pack200-its/target/local-repo/org/eclipse/tycho/extras/tycho-pack200b-plugin/1.5.0-SNAPSHOT/tycho-pack200b-plugin-1.5.0-SNAPSHOT.pom
[INFO] Installing /jobs/genie.tycho/tycho.extras-its/workspace/pack200/tycho-pack200b-plugin/target/tycho-pack200b-plugin-1.5.0-SNAPSHOT.jar to /jobs/genie.tycho/tycho.extras-its/workspace/pack200/tycho-pack200-its/target/local-repo/org/eclipse/tycho/extras/tycho-pack200b-plugin/1.5.0-SNAPSHOT/tycho-pack200b-plugin-1.5.0-SNAPSHOT.jar
[INFO] Installing /jobs/genie.tycho/tycho.extras-its/workspace/pack200/tycho-pack200b-plugin/pom.xml to /jobs/genie.tycho/tycho.extras-its/workspace/pack200/tycho-pack200-its/target/local-repo/org/eclipse/tycho/extras/tycho-pack200b-plugin/1.5.0-SNAPSHOT/tycho-pack200b-plugin-1.5.0-SNAPSHOT.pom
[INFO] Installing /jobs/genie.tycho/tycho.extras-its/workspace/pack200/tycho-pack200b-plugin/target/tycho-pack200b-plugin-1.5.0-SNAPSHOT-sources.jar to /jobs/genie.tycho/tycho.extras-its/workspace/pack200/tycho-pack200-its/target/local-repo/org/eclipse/tycho/extras/tycho-pack200b-plugin/1.5.0-SNAPSHOT/tycho-pack200b-plugin-1.5.0-SNAPSHOT-sources.jar
[INFO] Installing /jobs/genie.tycho/tycho.extras-its/workspace/pack200/tycho-pack200a-plugin/pom.xml to /jobs/genie.tycho/tycho.extras-its/workspace/pack200/tycho-pack200-its/target/local-repo/org/eclipse/tycho/extras/tycho-pack200a-plugin/1.5.0-SNAPSHOT/tycho-pack200a-plugin-1.5.0-SNAPSHOT.pom
[INFO] Installing /jobs/genie.tycho/tycho.extras-its/workspace/pack200/tycho-pack200a-plugin/target/tycho-pack200a-plugin-1.5.0-SNAPSHOT.jar to /jobs/genie.tycho/tycho.extras-its/workspace/pack200/tycho-pack200-its/target/local-repo/org/eclipse/tycho/extras/tycho-pack200a-plugin/1.5.0-SNAPSHOT/tycho-pack200a-plugin-1.5.0-SNAPSHOT.jar
[INFO] Installing /jobs/genie.tycho/tycho.extras-its/workspace/pack200/tycho-pack200a-plugin/pom.xml to /jobs/genie.tycho/tycho.extras-its/workspace/pack200/tycho-pack200-its/target/local-repo/org/eclipse/tycho/extras/tycho-pack200a-plugin/1.5.0-SNAPSHOT/tycho-pack200a-plugin-1.5.0-SNAPSHOT.pom
[INFO] Installing /jobs/genie.tycho/tycho.extras-its/workspace/pack200/tycho-pack200a-plugin/target/tycho-pack200a-plugin-1.5.0-SNAPSHOT-sources.jar to /jobs/genie.tycho/tycho.extras-its/workspace/pack200/tycho-pack200-its/target/local-repo/org/eclipse/tycho/extras/tycho-pack200a-plugin/1.5.0-SNAPSHOT/tycho-pack200a-plugin-1.5.0-SNAPSHOT-sources.jar
[INFO] Installing /jobs/genie.tycho/tycho.extras-its/workspace/pack200/tycho-pack200-its/pom.xml to /jobs/genie.tycho/tycho.extras-its/workspace/pack200/tycho-pack200-its/target/local-repo/org/eclipse/tycho/extras/tycho-pack200-its/1.5.0-SNAPSHOT/tycho-pack200-its-1.5.0-SNAPSHOT.pom
[INFO] Installing /jobs/genie.tycho/tycho.extras-its/workspace/pack200/tycho-pack200-its/target/tycho-pack200-its-1.5.0-SNAPSHOT.jar to /jobs/genie.tycho/tycho.extras-its/workspace/pack200/tycho-pack200-its/target/local-repo/org/eclipse/tycho/extras/tycho-pack200-its/1.5.0-SNAPSHOT/tycho-pack200-its-1.5.0-SNAPSHOT.jar
[INFO] Installing /jobs/genie.tycho/tycho.extras-its/workspace/pack200/tycho-pack200-its/target/tycho-pack200-its-1.5.0-SNAPSHOT-sources.jar to /jobs/genie.tycho/tycho.extras-its/workspace/pack200/tycho-pack200-its/target/local-repo/org/eclipse/tycho/extras/tycho-pack200-its/1.5.0-SNAPSHOT/tycho-pack200-its-1.5.0-SNAPSHOT-sources.jar
[INFO] 
[INFO] --- maven-invoker-plugin:3.2.0:run (integration-test) @ tycho-pack200-its ---
[INFO] Building: basic/pom.xml
[INFO] run post-build script verify.groovy
[INFO]           basic/pom.xml .................................... SUCCESS (29.2 s)
[INFO] -------------------------------------------------
[INFO] Build Summary:
[INFO]   Passed: 1, Failed: 0, Errors: 0, Skipped: 0
[INFO] -------------------------------------------------
[INFO] 
[INFO] --- maven-install-plugin:2.5.2:install (default-install) @ tycho-pack200-its ---
[INFO] Installing /jobs/genie.tycho/tycho.extras-its/workspace/pack200/tycho-pack200-its/target/tycho-pack200-its-1.5.0-SNAPSHOT.jar to /home/hudson/genie.tycho/.jenkins/jobs/tycho.extras-its/workspace/.repository/org/eclipse/tycho/extras/tycho-pack200-its/1.5.0-SNAPSHOT/tycho-pack200-its-1.5.0-SNAPSHOT.jar
[INFO] Installing /jobs/genie.tycho/tycho.extras-its/workspace/pack200/tycho-pack200-its/pom.xml to /home/hudson/genie.tycho/.jenkins/jobs/tycho.extras-its/workspace/.repository/org/eclipse/tycho/extras/tycho-pack200-its/1.5.0-SNAPSHOT/tycho-pack200-its-1.5.0-SNAPSHOT.pom
[INFO] Installing /jobs/genie.tycho/tycho.extras-its/workspace/pack200/tycho-pack200-its/target/tycho-pack200-its-1.5.0-SNAPSHOT-sources.jar to /home/hudson/genie.tycho/.jenkins/jobs/tycho.extras-its/workspace/.repository/org/eclipse/tycho/extras/tycho-pack200-its/1.5.0-SNAPSHOT/tycho-pack200-its-1.5.0-SNAPSHOT-sources.jar
[INFO] 
[INFO] ---------< org.eclipse.tycho.extras:tycho-buildtimestamp-jgit >---------
[INFO] Building tycho-buildtimestamp-jgit 1.5.0-SNAPSHOT                [13/18]
[INFO] --------------------------------[ jar ]---------------------------------
[INFO] 
[INFO] --- maven-clean-plugin:3.1.0:clean (default-clean) @ tycho-buildtimestamp-jgit ---
[INFO] Deleting /jobs/genie.tycho/tycho.extras-its/workspace/tycho-buildtimestamp-jgit/target
[INFO] 
[INFO] --- maven-resources-plugin:3.1.0:resources (default-resources) @ tycho-buildtimestamp-jgit ---
[INFO] Using 'UTF-8' encoding to copy filtered resources.
[INFO] skip non existing resourceDirectory /jobs/genie.tycho/tycho.extras-its/workspace/tycho-buildtimestamp-jgit/src/main/resources
[INFO] 
[INFO] --- maven-compiler-plugin:3.8.1:compile (default-compile) @ tycho-buildtimestamp-jgit ---
[INFO] Changes detected - recompiling the module!
[INFO] Compiling 2 source files to /jobs/genie.tycho/tycho.extras-its/workspace/tycho-buildtimestamp-jgit/target/classes
[INFO] 
[INFO] --- plexus-component-metadata:2.0.0:generate-metadata (default) @ tycho-buildtimestamp-jgit ---
[INFO] Discovered 1 component descriptors(s)
[INFO] 
[INFO] --- maven-resources-plugin:3.1.0:testResources (default-testResources) @ tycho-buildtimestamp-jgit ---
[INFO] Using 'UTF-8' encoding to copy filtered resources.
[INFO] skip non existing resourceDirectory /jobs/genie.tycho/tycho.extras-its/workspace/tycho-buildtimestamp-jgit/src/test/resources
[INFO] 
[INFO] --- maven-compiler-plugin:3.8.1:testCompile (default-testCompile) @ tycho-buildtimestamp-jgit ---
[INFO] Changes detected - recompiling the module!
[INFO] Compiling 1 source file to /jobs/genie.tycho/tycho.extras-its/workspace/tycho-buildtimestamp-jgit/target/test-classes
[INFO] 
[INFO] --- plexus-component-metadata:2.0.0:generate-test-metadata (default) @ tycho-buildtimestamp-jgit ---
[INFO] 
[INFO] --- maven-surefire-plugin:2.22.0:test (default-test) @ tycho-buildtimestamp-jgit ---
[INFO] 
[INFO] --- maven-jar-plugin:3.1.2:jar (default-jar) @ tycho-buildtimestamp-jgit ---
[INFO] Building jar: /jobs/genie.tycho/tycho.extras-its/workspace/tycho-buildtimestamp-jgit/target/tycho-buildtimestamp-jgit-1.5.0-SNAPSHOT.jar
[INFO] 
[INFO] --- maven-source-plugin:3.1.0:jar-no-fork (source-jar) @ tycho-buildtimestamp-jgit ---
[INFO] Building jar: /jobs/genie.tycho/tycho.extras-its/workspace/tycho-buildtimestamp-jgit/target/tycho-buildtimestamp-jgit-1.5.0-SNAPSHOT-sources.jar
[INFO] 
[INFO] --- maven-invoker-plugin:3.2.0:install (integration-test) @ tycho-buildtimestamp-jgit ---
[INFO] Installing /jobs/genie.tycho/tycho.extras-its/workspace/pom.xml to /jobs/genie.tycho/tycho.extras-its/workspace/tycho-buildtimestamp-jgit/target/local-repo/org/eclipse/tycho/extras/tycho-extras/1.5.0-SNAPSHOT/tycho-extras-1.5.0-SNAPSHOT.pom
[INFO] Installing /jobs/genie.tycho/tycho.extras-its/workspace/tycho-buildtimestamp-jgit/pom.xml to /jobs/genie.tycho/tycho.extras-its/workspace/tycho-buildtimestamp-jgit/target/local-repo/org/eclipse/tycho/extras/tycho-buildtimestamp-jgit/1.5.0-SNAPSHOT/tycho-buildtimestamp-jgit-1.5.0-SNAPSHOT.pom
[INFO] Installing /jobs/genie.tycho/tycho.extras-its/workspace/tycho-buildtimestamp-jgit/target/tycho-buildtimestamp-jgit-1.5.0-SNAPSHOT.jar to /jobs/genie.tycho/tycho.extras-its/workspace/tycho-buildtimestamp-jgit/target/local-repo/org/eclipse/tycho/extras/tycho-buildtimestamp-jgit/1.5.0-SNAPSHOT/tycho-buildtimestamp-jgit-1.5.0-SNAPSHOT.jar
[INFO] Installing /jobs/genie.tycho/tycho.extras-its/workspace/tycho-buildtimestamp-jgit/target/tycho-buildtimestamp-jgit-1.5.0-SNAPSHOT-sources.jar to /jobs/genie.tycho/tycho.extras-its/workspace/tycho-buildtimestamp-jgit/target/local-repo/org/eclipse/tycho/extras/tycho-buildtimestamp-jgit/1.5.0-SNAPSHOT/tycho-buildtimestamp-jgit-1.5.0-SNAPSHOT-sources.jar
[INFO] 
[INFO] --- maven-invoker-plugin:3.2.0:run (integration-test) @ tycho-buildtimestamp-jgit ---
[INFO] Building: submodules/pom.xml
[INFO] run pre-build script prebuild.groovy
[INFO] run post-build script verify.bsh
[INFO]           submodules/pom.xml ............................... SUCCESS (24.5 s)
[INFO] Building: dirtyUnrelatedSubmodules/pom.xml
[INFO] run pre-build script prebuild.groovy
[INFO] run post-build script verify.groovy
[INFO]           dirtyUnrelatedSubmodules/pom.xml ................. SUCCESS (22.6 s)
[INFO] Building: dirtySubmodules/pom.xml
[INFO] run pre-build script prebuild.groovy
[INFO]           dirtySubmodules/pom.xml .......................... SUCCESS (8.0 s)
[INFO] Building: dirtyworkingtree/pom.xml
[INFO] run pre-build script prebuild.groovy
[INFO]           dirtyworkingtree/pom.xml ......................... SUCCESS (8.8 s)
[INFO] Building: basic/pom.xml
[INFO] run pre-build script prebuild.groovy
[INFO] run post-build script verify.groovy
[INFO]           basic/pom.xml .................................... SUCCESS (12.0 s)
[INFO] Building: dirtyWorkingTreeWarningOnly/pom.xml
[INFO] run pre-build script prebuild.groovy
[INFO] run post-build script verify.groovy
[INFO]           dirtyWorkingTreeWarningOnly/pom.xml .............. SUCCESS (14.6 s)
[INFO] -------------------------------------------------
[INFO] Build Summary:
[INFO]   Passed: 6, Failed: 0, Errors: 0, Skipped: 0
[INFO] -------------------------------------------------
[INFO] 
[INFO] --- maven-install-plugin:2.5.2:install (default-install) @ tycho-buildtimestamp-jgit ---
[INFO] Installing /jobs/genie.tycho/tycho.extras-its/workspace/tycho-buildtimestamp-jgit/target/tycho-buildtimestamp-jgit-1.5.0-SNAPSHOT.jar to /home/hudson/genie.tycho/.jenkins/jobs/tycho.extras-its/workspace/.repository/org/eclipse/tycho/extras/tycho-buildtimestamp-jgit/1.5.0-SNAPSHOT/tycho-buildtimestamp-jgit-1.5.0-SNAPSHOT.jar
[INFO] Installing /jobs/genie.tycho/tycho.extras-its/workspace/tycho-buildtimestamp-jgit/pom.xml to /home/hudson/genie.tycho/.jenkins/jobs/tycho.extras-its/workspace/.repository/org/eclipse/tycho/extras/tycho-buildtimestamp-jgit/1.5.0-SNAPSHOT/tycho-buildtimestamp-jgit-1.5.0-SNAPSHOT.pom
[INFO] Installing /jobs/genie.tycho/tycho.extras-its/workspace/tycho-buildtimestamp-jgit/target/tycho-buildtimestamp-jgit-1.5.0-SNAPSHOT-sources.jar to /home/hudson/genie.tycho/.jenkins/jobs/tycho.extras-its/workspace/.repository/org/eclipse/tycho/extras/tycho-buildtimestamp-jgit/1.5.0-SNAPSHOT/tycho-buildtimestamp-jgit-1.5.0-SNAPSHOT-sources.jar
[INFO] 
[INFO] -----------< org.eclipse.tycho.extras:tycho-sourceref-jgit >------------
[INFO] Building tycho-sourceref-jgit 1.5.0-SNAPSHOT                     [14/18]
[INFO] --------------------------------[ jar ]---------------------------------
[INFO] 
[INFO] --- maven-clean-plugin:3.1.0:clean (default-clean) @ tycho-sourceref-jgit ---
[INFO] Deleting /jobs/genie.tycho/tycho.extras-its/workspace/tycho-sourceref-jgit/target
[INFO] 
[INFO] --- maven-resources-plugin:3.1.0:resources (default-resources) @ tycho-sourceref-jgit ---
[INFO] Using 'UTF-8' encoding to copy filtered resources.
[INFO] skip non existing resourceDirectory /jobs/genie.tycho/tycho.extras-its/workspace/tycho-sourceref-jgit/src/main/resources
[INFO] 
[INFO] --- maven-compiler-plugin:3.8.1:compile (default-compile) @ tycho-sourceref-jgit ---
[INFO] Changes detected - recompiling the module!
[INFO] Compiling 1 source file to /jobs/genie.tycho/tycho.extras-its/workspace/tycho-sourceref-jgit/target/classes
[INFO] 
[INFO] --- plexus-component-metadata:2.0.0:generate-metadata (default) @ tycho-sourceref-jgit ---
[INFO] Discovered 1 component descriptors(s)
[INFO] 
[INFO] --- maven-resources-plugin:3.1.0:testResources (default-testResources) @ tycho-sourceref-jgit ---
[INFO] Using 'UTF-8' encoding to copy filtered resources.
[INFO] skip non existing resourceDirectory /jobs/genie.tycho/tycho.extras-its/workspace/tycho-sourceref-jgit/src/test/resources
[INFO] 
[INFO] --- maven-compiler-plugin:3.8.1:testCompile (default-testCompile) @ tycho-sourceref-jgit ---
[INFO] Changes detected - recompiling the module!
[INFO] Compiling 1 source file to /jobs/genie.tycho/tycho.extras-its/workspace/tycho-sourceref-jgit/target/test-classes
[INFO] 
[INFO] --- plexus-component-metadata:2.0.0:generate-test-metadata (default) @ tycho-sourceref-jgit ---
[INFO] 
[INFO] --- maven-surefire-plugin:2.22.0:test (default-test) @ tycho-sourceref-jgit ---
[INFO] 
[INFO] -------------------------------------------------------
[INFO]  T E S T S
[INFO] -------------------------------------------------------
[INFO] Running org.eclipse.tycho.extras.sourceref.jgit.JGitSourceReferencesProviderTest
SLF4J: Failed to load class "org.slf4j.impl.StaticLoggerBinder".
SLF4J: Defaulting to no-operation (NOP) logger implementation
SLF4J: See http://www.slf4j.org/codes.html#StaticLoggerBinder for further details.
[WARNING] Tests run: 5, Failures: 0, Errors: 0, Skipped: 1, Time elapsed: 1.505 s - in org.eclipse.tycho.extras.sourceref.jgit.JGitSourceReferencesProviderTest
[INFO] 
[INFO] Results:
[INFO] 
[WARNING] Tests run: 5, Failures: 0, Errors: 0, Skipped: 1
[INFO] 
[INFO] 
[INFO] --- maven-jar-plugin:3.1.2:jar (default-jar) @ tycho-sourceref-jgit ---
[INFO] Building jar: /jobs/genie.tycho/tycho.extras-its/workspace/tycho-sourceref-jgit/target/tycho-sourceref-jgit-1.5.0-SNAPSHOT.jar
[INFO] 
[INFO] --- maven-source-plugin:3.1.0:jar-no-fork (source-jar) @ tycho-sourceref-jgit ---
[INFO] Building jar: /jobs/genie.tycho/tycho.extras-its/workspace/tycho-sourceref-jgit/target/tycho-sourceref-jgit-1.5.0-SNAPSHOT-sources.jar
[INFO] 
[INFO] --- maven-install-plugin:2.5.2:install (default-install) @ tycho-sourceref-jgit ---
[INFO] Installing /jobs/genie.tycho/tycho.extras-its/workspace/tycho-sourceref-jgit/target/tycho-sourceref-jgit-1.5.0-SNAPSHOT.jar to /home/hudson/genie.tycho/.jenkins/jobs/tycho.extras-its/workspace/.repository/org/eclipse/tycho/extras/tycho-sourceref-jgit/1.5.0-SNAPSHOT/tycho-sourceref-jgit-1.5.0-SNAPSHOT.jar
[INFO] Installing /jobs/genie.tycho/tycho.extras-its/workspace/tycho-sourceref-jgit/pom.xml to /home/hudson/genie.tycho/.jenkins/jobs/tycho.extras-its/workspace/.repository/org/eclipse/tycho/extras/tycho-sourceref-jgit/1.5.0-SNAPSHOT/tycho-sourceref-jgit-1.5.0-SNAPSHOT.pom
[INFO] Installing /jobs/genie.tycho/tycho.extras-its/workspace/tycho-sourceref-jgit/target/tycho-sourceref-jgit-1.5.0-SNAPSHOT-sources.jar to /home/hudson/genie.tycho/.jenkins/jobs/tycho.extras-its/workspace/.repository/org/eclipse/tycho/extras/tycho-sourceref-jgit/1.5.0-SNAPSHOT/tycho-sourceref-jgit-1.5.0-SNAPSHOT-sources.jar
[INFO] 
[INFO] -----< org.eclipse.tycho.extras:target-platform-validation-plugin >-----
[INFO] Building Target Platform Validation Plugin 1.5.0-SNAPSHOT        [15/18]
[INFO] ----------------------------[ maven-plugin ]----------------------------
[INFO] 
[INFO] --- maven-clean-plugin:3.1.0:clean (default-clean) @ target-platform-validation-plugin ---
[INFO] Deleting /jobs/genie.tycho/tycho.extras-its/workspace/target-platform-validation-plugin/target
[INFO] 
[INFO] --- maven-resources-plugin:3.1.0:resources (default-resources) @ target-platform-validation-plugin ---
[INFO] Using 'UTF-8' encoding to copy filtered resources.
[INFO] skip non existing resourceDirectory /jobs/genie.tycho/tycho.extras-its/workspace/target-platform-validation-plugin/src/main/resources
[INFO] 
[INFO] --- maven-compiler-plugin:3.8.1:compile (default-compile) @ target-platform-validation-plugin ---
[INFO] Changes detected - recompiling the module!
[INFO] Compiling 2 source files to /jobs/genie.tycho/tycho.extras-its/workspace/target-platform-validation-plugin/target/classes
[INFO] 
[INFO] --- maven-plugin-plugin:3.6.0:descriptor (default-descriptor) @ target-platform-validation-plugin ---
[INFO] Using 'UTF-8' encoding to read mojo source files.
[INFO] java-annotations mojo extractor found 1 mojo descriptor.
[INFO] 
[INFO] --- maven-plugin-plugin:3.6.0:descriptor (mojo-descriptor) @ target-platform-validation-plugin ---
[INFO] Using 'UTF-8' encoding to read mojo source files.
[INFO] java-annotations mojo extractor found 1 mojo descriptor.
[INFO] 
[INFO] --- maven-resources-plugin:3.1.0:testResources (default-testResources) @ target-platform-validation-plugin ---
[INFO] Using 'UTF-8' encoding to copy filtered resources.
[INFO] skip non existing resourceDirectory /jobs/genie.tycho/tycho.extras-its/workspace/target-platform-validation-plugin/src/test/resources
[INFO] 
[INFO] --- maven-compiler-plugin:3.8.1:testCompile (default-testCompile) @ target-platform-validation-plugin ---
[INFO] No sources to compile
[INFO] 
[INFO] --- maven-surefire-plugin:2.22.0:test (default-test) @ target-platform-validation-plugin ---
[INFO] No tests to run.
[INFO] 
[INFO] --- maven-jar-plugin:3.1.2:jar (default-jar) @ target-platform-validation-plugin ---
[INFO] Building jar: /jobs/genie.tycho/tycho.extras-its/workspace/target-platform-validation-plugin/target/target-platform-validation-plugin-1.5.0-SNAPSHOT.jar
[INFO] 
[INFO] --- maven-plugin-plugin:3.6.0:addPluginArtifactMetadata (default-addPluginArtifactMetadata) @ target-platform-validation-plugin ---
[INFO] 
[INFO] --- maven-source-plugin:3.1.0:jar-no-fork (source-jar) @ target-platform-validation-plugin ---
[INFO] Building jar: /jobs/genie.tycho/tycho.extras-its/workspace/target-platform-validation-plugin/target/target-platform-validation-plugin-1.5.0-SNAPSHOT-sources.jar
[INFO] 
[INFO] --- maven-invoker-plugin:3.2.0:install (integration-test) @ target-platform-validation-plugin ---
[INFO] Installing /jobs/genie.tycho/tycho.extras-its/workspace/pom.xml to /jobs/genie.tycho/tycho.extras-its/workspace/target-platform-validation-plugin/target/local-repo/org/eclipse/tycho/extras/tycho-extras/1.5.0-SNAPSHOT/tycho-extras-1.5.0-SNAPSHOT.pom
[INFO] Installing /jobs/genie.tycho/tycho.extras-its/workspace/target-platform-validation-plugin/pom.xml to /jobs/genie.tycho/tycho.extras-its/workspace/target-platform-validation-plugin/target/local-repo/org/eclipse/tycho/extras/target-platform-validation-plugin/1.5.0-SNAPSHOT/target-platform-validation-plugin-1.5.0-SNAPSHOT.pom
[INFO] Installing /jobs/genie.tycho/tycho.extras-its/workspace/target-platform-validation-plugin/target/target-platform-validation-plugin-1.5.0-SNAPSHOT.jar to /jobs/genie.tycho/tycho.extras-its/workspace/target-platform-validation-plugin/target/local-repo/org/eclipse/tycho/extras/target-platform-validation-plugin/1.5.0-SNAPSHOT/target-platform-validation-plugin-1.5.0-SNAPSHOT.jar
[INFO] Installing /jobs/genie.tycho/tycho.extras-its/workspace/target-platform-validation-plugin/target/target-platform-validation-plugin-1.5.0-SNAPSHOT-sources.jar to /jobs/genie.tycho/tycho.extras-its/workspace/target-platform-validation-plugin/target/local-repo/org/eclipse/tycho/extras/target-platform-validation-plugin/1.5.0-SNAPSHOT/target-platform-validation-plugin-1.5.0-SNAPSHOT-sources.jar
[INFO] 
[INFO] --- maven-invoker-plugin:3.2.0:run (integration-test) @ target-platform-validation-plugin ---
[INFO] Building: explicitTarget_KO/pom.xml
[INFO]           explicitTarget_KO/pom.xml ........................ SUCCESS (14.9 s)
[INFO] Building: explicitTarget_OK/pom.xml
[INFO]           explicitTarget_OK/pom.xml ........................ SUCCESS (10.6 s)
[INFO] Building: implicitTarget_KO/pom.xml
[INFO]           implicitTarget_KO/pom.xml ........................ SUCCESS (35.1 s)
[INFO] Building: explicitTarget_OK_KO_OK_KO/pom.xml
[INFO]           explicitTarget_OK_KO_OK_KO/pom.xml ............... SUCCESS (16.9 s)
[INFO] Building: noTarget/pom.xml
[INFO]           noTarget/pom.xml ................................. SUCCESS (4.8 s)
[INFO] Building: implicitTarget_OK/pom.xml
[INFO]           implicitTarget_OK/pom.xml ........................ SUCCESS (11.7 s)
[INFO] -------------------------------------------------
[INFO] Build Summary:
[INFO]   Passed: 6, Failed: 0, Errors: 0, Skipped: 0
[INFO] -------------------------------------------------
[INFO] 
[INFO] --- maven-install-plugin:2.5.2:install (default-install) @ target-platform-validation-plugin ---
[INFO] Installing /jobs/genie.tycho/tycho.extras-its/workspace/target-platform-validation-plugin/target/target-platform-validation-plugin-1.5.0-SNAPSHOT.jar to /home/hudson/genie.tycho/.jenkins/jobs/tycho.extras-its/workspace/.repository/org/eclipse/tycho/extras/target-platform-validation-plugin/1.5.0-SNAPSHOT/target-platform-validation-plugin-1.5.0-SNAPSHOT.jar
[INFO] Installing /jobs/genie.tycho/tycho.extras-its/workspace/target-platform-validation-plugin/pom.xml to /home/hudson/genie.tycho/.jenkins/jobs/tycho.extras-its/workspace/.repository/org/eclipse/tycho/extras/target-platform-validation-plugin/1.5.0-SNAPSHOT/target-platform-validation-plugin-1.5.0-SNAPSHOT.pom
[INFO] Installing /jobs/genie.tycho/tycho.extras-its/workspace/target-platform-validation-plugin/target/target-platform-validation-plugin-1.5.0-SNAPSHOT-sources.jar to /home/hudson/genie.tycho/.jenkins/jobs/tycho.extras-its/workspace/.repository/org/eclipse/tycho/extras/target-platform-validation-plugin/1.5.0-SNAPSHOT/target-platform-validation-plugin-1.5.0-SNAPSHOT-sources.jar
[INFO] 
[INFO] ---------------< org.eclipse.tycho.extras:tycho-pomless >---------------
[INFO] Building Tycho POM-less build extension 1.5.0-SNAPSHOT           [16/18]
[INFO] --------------------------------[ jar ]---------------------------------
[INFO] 
[INFO] --- maven-clean-plugin:3.1.0:clean (default-clean) @ tycho-pomless ---
[INFO] Deleting /jobs/genie.tycho/tycho.extras-its/workspace/tycho-pomless/target
[INFO] 
[INFO] --- maven-resources-plugin:3.1.0:resources (default-resources) @ tycho-pomless ---
[INFO] Using 'UTF-8' encoding to copy filtered resources.
[INFO] skip non existing resourceDirectory /jobs/genie.tycho/tycho.extras-its/workspace/tycho-pomless/src/main/resources
[INFO] 
[INFO] --- maven-compiler-plugin:3.8.1:compile (default-compile) @ tycho-pomless ---
[INFO] Changes detected - recompiling the module!
[INFO] Compiling 7 source files to /jobs/genie.tycho/tycho.extras-its/workspace/tycho-pomless/target/classes
[INFO] 
[INFO] --- plexus-component-metadata:2.0.0:generate-metadata (default) @ tycho-pomless ---
[INFO] Discovered 5 component descriptors(s)
[INFO] 
[INFO] --- maven-resources-plugin:3.1.0:testResources (default-testResources) @ tycho-pomless ---
[INFO] Using 'UTF-8' encoding to copy filtered resources.
[INFO] Copying 42 resources
[INFO] 
[INFO] --- maven-compiler-plugin:3.8.1:testCompile (default-testCompile) @ tycho-pomless ---
[INFO] Changes detected - recompiling the module!
[INFO] Compiling 2 source files to /jobs/genie.tycho/tycho.extras-its/workspace/tycho-pomless/target/test-classes
[INFO] 
[INFO] --- plexus-component-metadata:2.0.0:generate-test-metadata (default) @ tycho-pomless ---
[INFO] 
[INFO] --- maven-surefire-plugin:2.22.0:test (default-test) @ tycho-pomless ---
[INFO] 
[INFO] -------------------------------------------------------
[INFO]  T E S T S
[INFO] -------------------------------------------------------
[INFO] Running org.eclipse.tycho.pomless.TychoModelReaderTest
[INFO] Running org.eclipse.tycho.pomless.TychoMappingTest
[INFO] Tests run: 2, Failures: 0, Errors: 0, Skipped: 0, Time elapsed: 0.561 s - in org.eclipse.tycho.pomless.TychoMappingTest
[Fatal Error] :6:10: The end-tag for element type "feature" must end with a '>' delimiter.
[Fatal Error] :7:10: The end-tag for element type "product" must end with a '>' delimiter.
[INFO] Tests run: 16, Failures: 0, Errors: 0, Skipped: 0, Time elapsed: 1.251 s - in org.eclipse.tycho.pomless.TychoModelReaderTest
[INFO] 
[INFO] Results:
[INFO] 
[INFO] Tests run: 18, Failures: 0, Errors: 0, Skipped: 0
[INFO] 
[INFO] 
[INFO] --- maven-jar-plugin:3.1.2:jar (default-jar) @ tycho-pomless ---
[INFO] Building jar: /jobs/genie.tycho/tycho.extras-its/workspace/tycho-pomless/target/tycho-pomless-1.5.0-SNAPSHOT.jar
[INFO] 
[INFO] --- maven-source-plugin:3.1.0:jar-no-fork (source-jar) @ tycho-pomless ---
[INFO] Building jar: /jobs/genie.tycho/tycho.extras-its/workspace/tycho-pomless/target/tycho-pomless-1.5.0-SNAPSHOT-sources.jar
[INFO] 
[INFO] --- maven-install-plugin:2.5.2:install (default-install) @ tycho-pomless ---
[INFO] Installing /jobs/genie.tycho/tycho.extras-its/workspace/tycho-pomless/target/tycho-pomless-1.5.0-SNAPSHOT.jar to /home/hudson/genie.tycho/.jenkins/jobs/tycho.extras-its/workspace/.repository/org/eclipse/tycho/extras/tycho-pomless/1.5.0-SNAPSHOT/tycho-pomless-1.5.0-SNAPSHOT.jar
[INFO] Installing /jobs/genie.tycho/tycho.extras-its/workspace/tycho-pomless/pom.xml to /home/hudson/genie.tycho/.jenkins/jobs/tycho.extras-its/workspace/.repository/org/eclipse/tycho/extras/tycho-pomless/1.5.0-SNAPSHOT/tycho-pomless-1.5.0-SNAPSHOT.pom
[INFO] Installing /jobs/genie.tycho/tycho.extras-its/workspace/tycho-pomless/target/tycho-pomless-1.5.0-SNAPSHOT-sources.jar to /home/hudson/genie.tycho/.jenkins/jobs/tycho.extras-its/workspace/.repository/org/eclipse/tycho/extras/tycho-pomless/1.5.0-SNAPSHOT/tycho-pomless-1.5.0-SNAPSHOT-sources.jar
[INFO] 
[INFO] -------< org.eclipse.tycho.extras:tycho-dependency-tools-plugin >-------
[INFO] Building Tycho Dependency Tools Plugin 1.5.0-SNAPSHOT            [17/18]
[INFO] ----------------------------[ maven-plugin ]----------------------------
[INFO] 
[INFO] --- maven-clean-plugin:3.1.0:clean (default-clean) @ tycho-dependency-tools-plugin ---
[INFO] Deleting /jobs/genie.tycho/tycho.extras-its/workspace/tycho-dependency-tools-plugin/target
[INFO] 
[INFO] --- maven-resources-plugin:3.1.0:resources (default-resources) @ tycho-dependency-tools-plugin ---
[INFO] Using 'UTF-8' encoding to copy filtered resources.
[INFO] skip non existing resourceDirectory /jobs/genie.tycho/tycho.extras-its/workspace/tycho-dependency-tools-plugin/src/main/resources
[INFO] 
[INFO] --- maven-compiler-plugin:3.8.1:compile (default-compile) @ tycho-dependency-tools-plugin ---
[INFO] Changes detected - recompiling the module!
[INFO] Compiling 1 source file to /jobs/genie.tycho/tycho.extras-its/workspace/tycho-dependency-tools-plugin/target/classes
[INFO] 
[INFO] --- maven-plugin-plugin:3.6.0:descriptor (default-descriptor) @ tycho-dependency-tools-plugin ---
[INFO] Using 'UTF-8' encoding to read mojo source files.
[INFO] java-annotations mojo extractor found 1 mojo descriptor.
[INFO] 
[INFO] --- plexus-component-metadata:2.0.0:generate-metadata (default) @ tycho-dependency-tools-plugin ---
[INFO] 
[INFO] --- maven-plugin-plugin:3.6.0:descriptor (mojo-descriptor) @ tycho-dependency-tools-plugin ---
[INFO] Using 'UTF-8' encoding to read mojo source files.
[INFO] java-annotations mojo extractor found 1 mojo descriptor.
[INFO] 
[INFO] --- maven-resources-plugin:3.1.0:testResources (default-testResources) @ tycho-dependency-tools-plugin ---
[INFO] Using 'UTF-8' encoding to copy filtered resources.
[INFO] skip non existing resourceDirectory /jobs/genie.tycho/tycho.extras-its/workspace/tycho-dependency-tools-plugin/src/test/resources
[INFO] 
[INFO] --- maven-compiler-plugin:3.8.1:testCompile (default-testCompile) @ tycho-dependency-tools-plugin ---
[INFO] No sources to compile
[INFO] 
[INFO] --- plexus-component-metadata:2.0.0:generate-test-metadata (default) @ tycho-dependency-tools-plugin ---
[INFO] 
[INFO] --- maven-surefire-plugin:2.22.0:test (default-test) @ tycho-dependency-tools-plugin ---
[INFO] No tests to run.
[INFO] 
[INFO] --- maven-jar-plugin:3.1.2:jar (default-jar) @ tycho-dependency-tools-plugin ---
[INFO] Building jar: /jobs/genie.tycho/tycho.extras-its/workspace/tycho-dependency-tools-plugin/target/tycho-dependency-tools-plugin-1.5.0-SNAPSHOT.jar
[INFO] 
[INFO] --- maven-plugin-plugin:3.6.0:addPluginArtifactMetadata (default-addPluginArtifactMetadata) @ tycho-dependency-tools-plugin ---
[INFO] 
[INFO] --- maven-source-plugin:3.1.0:jar-no-fork (source-jar) @ tycho-dependency-tools-plugin ---
[INFO] Building jar: /jobs/genie.tycho/tycho.extras-its/workspace/tycho-dependency-tools-plugin/target/tycho-dependency-tools-plugin-1.5.0-SNAPSHOT-sources.jar
[INFO] 
[INFO] --- maven-invoker-plugin:3.2.0:install (integration-test) @ tycho-dependency-tools-plugin ---
[INFO] Installing /jobs/genie.tycho/tycho.extras-its/workspace/pom.xml to /jobs/genie.tycho/tycho.extras-its/workspace/tycho-dependency-tools-plugin/target/local-repo/org/eclipse/tycho/extras/tycho-extras/1.5.0-SNAPSHOT/tycho-extras-1.5.0-SNAPSHOT.pom
[INFO] Installing /jobs/genie.tycho/tycho.extras-its/workspace/tycho-dependency-tools-plugin/pom.xml to /jobs/genie.tycho/tycho.extras-its/workspace/tycho-dependency-tools-plugin/target/local-repo/org/eclipse/tycho/extras/tycho-dependency-tools-plugin/1.5.0-SNAPSHOT/tycho-dependency-tools-plugin-1.5.0-SNAPSHOT.pom
[INFO] Installing /jobs/genie.tycho/tycho.extras-its/workspace/tycho-dependency-tools-plugin/target/tycho-dependency-tools-plugin-1.5.0-SNAPSHOT.jar to /jobs/genie.tycho/tycho.extras-its/workspace/tycho-dependency-tools-plugin/target/local-repo/org/eclipse/tycho/extras/tycho-dependency-tools-plugin/1.5.0-SNAPSHOT/tycho-dependency-tools-plugin-1.5.0-SNAPSHOT.jar
[INFO] Installing /jobs/genie.tycho/tycho.extras-its/workspace/tycho-dependency-tools-plugin/target/tycho-dependency-tools-plugin-1.5.0-SNAPSHOT-sources.jar to /jobs/genie.tycho/tycho.extras-its/workspace/tycho-dependency-tools-plugin/target/local-repo/org/eclipse/tycho/extras/tycho-dependency-tools-plugin/1.5.0-SNAPSHOT/tycho-dependency-tools-plugin-1.5.0-SNAPSHOT-sources.jar
[INFO] 
[INFO] --- maven-invoker-plugin:3.2.0:run (integration-test) @ tycho-dependency-tools-plugin ---
[INFO] No projects were selected for execution.
[INFO] 
[INFO] --- maven-install-plugin:2.5.2:install (default-install) @ tycho-dependency-tools-plugin ---
[INFO] Installing /jobs/genie.tycho/tycho.extras-its/workspace/tycho-dependency-tools-plugin/target/tycho-dependency-tools-plugin-1.5.0-SNAPSHOT.jar to /home/hudson/genie.tycho/.jenkins/jobs/tycho.extras-its/workspace/.repository/org/eclipse/tycho/extras/tycho-dependency-tools-plugin/1.5.0-SNAPSHOT/tycho-dependency-tools-plugin-1.5.0-SNAPSHOT.jar
[INFO] Installing /jobs/genie.tycho/tycho.extras-its/workspace/tycho-dependency-tools-plugin/pom.xml to /home/hudson/genie.tycho/.jenkins/jobs/tycho.extras-its/workspace/.repository/org/eclipse/tycho/extras/tycho-dependency-tools-plugin/1.5.0-SNAPSHOT/tycho-dependency-tools-plugin-1.5.0-SNAPSHOT.pom
[INFO] Installing /jobs/genie.tycho/tycho.extras-its/workspace/tycho-dependency-tools-plugin/target/tycho-dependency-tools-plugin-1.5.0-SNAPSHOT-sources.jar to /home/hudson/genie.tycho/.jenkins/jobs/tycho.extras-its/workspace/.repository/org/eclipse/tycho/extras/tycho-dependency-tools-plugin/1.5.0-SNAPSHOT/tycho-dependency-tools-plugin-1.5.0-SNAPSHOT-sources.jar
[INFO] 
[INFO] -------------< org.eclipse.tycho.extras:tycho-extras-its >--------------
[INFO] Building Tycho Extras Integration Tests 1.5.0-SNAPSHOT           [18/18]
[INFO] --------------------------------[ jar ]---------------------------------
Downloading from tycho-snapshots: https://repo.eclipse.org/content/repositories/tycho-snapshots/org/eclipse/tycho/tycho-versions-plugin/1.5.0-SNAPSHOT/maven-metadata.xml
Progress (1): 1.0 kB
                    
Downloaded from tycho-snapshots: https://repo.eclipse.org/content/repositories/tycho-snapshots/org/eclipse/tycho/tycho-versions-plugin/1.5.0-SNAPSHOT/maven-metadata.xml (1.0 kB at 22 kB/s)
Downloading from tycho-snapshots: https://repo.eclipse.org/content/repositories/tycho-snapshots/org/eclipse/tycho/tycho-release/1.5.0-SNAPSHOT/maven-metadata.xml
Progress (1): 609 B
                   
Downloaded from tycho-snapshots: https://repo.eclipse.org/content/repositories/tycho-snapshots/org/eclipse/tycho/tycho-release/1.5.0-SNAPSHOT/maven-metadata.xml (609 B at 32 kB/s)
[INFO] 
[INFO] --- maven-clean-plugin:3.1.0:clean (default-clean) @ tycho-extras-its ---
[INFO] Deleting /jobs/genie.tycho/tycho.extras-its/workspace/tycho-extras-its/target
[INFO] 
[INFO] --- maven-dependency-plugin:2.8:unpack-dependencies (unpack-maven) @ tycho-extras-its ---
[INFO] Unpacking /home/hudson/genie.tycho/.jenkins/jobs/tycho.extras-its/workspace/.repository/org/apache/maven/apache-maven/3.3.3/apache-maven-3.3.3-bin.tar.gz to /jobs/genie.tycho/tycho.extras-its/workspace/tycho-extras-its/target with includes "" and excludes ""
[INFO] Expanding: /home/hudson/genie.tycho/.jenkins/jobs/tycho.extras-its/workspace/.repository/org/apache/maven/apache-maven/3.3.3/apache-maven-3.3.3-bin.tar.gz into /jobs/genie.tycho/tycho.extras-its/workspace/tycho-extras-its/target
[INFO] 
[INFO] --- maven-resources-plugin:3.1.0:resources (default-resources) @ tycho-extras-its ---
[INFO] Using 'UTF-8' encoding to copy filtered resources.
[INFO] skip non existing resourceDirectory /jobs/genie.tycho/tycho.extras-its/workspace/tycho-extras-its/src/main/resources
[INFO] 
[INFO] --- maven-compiler-plugin:3.8.1:compile (default-compile) @ tycho-extras-its ---
[INFO] No sources to compile
[INFO] 
[INFO] --- maven-resources-plugin:3.1.0:testResources (default-testResources) @ tycho-extras-its ---
[INFO] Using 'UTF-8' encoding to copy filtered resources.
[INFO] Copying 31 resources
[INFO] Copying 27 resources
[INFO] 
[INFO] --- maven-compiler-plugin:3.8.1:testCompile (default-testCompile) @ tycho-extras-its ---
[INFO] Changes detected - recompiling the module!
[INFO] Compiling 6 source files to /jobs/genie.tycho/tycho.extras-its/workspace/tycho-extras-its/target/test-classes
[INFO] 
[INFO] --- tycho-p2-extras-plugin:1.5.0-SNAPSHOT:mirror (mirror-kepler-test-repo) @ tycho-extras-its ---
[INFO] Mirroring to /jobs/genie.tycho/tycho.extras-its/workspace/tycho-extras-its/repositories/kepler...
Aug 27, 2019 6:44:14 AM org.apache.http.impl.execchain.RetryExec execute
INFO: I/O exception (org.apache.http.NoHttpResponseException) caught when processing request to {}->http://download.eclipse.org:80: The target server failed to respond
Aug 27, 2019 6:44:14 AM org.apache.http.impl.execchain.RetryExec execute
INFO: Retrying request to {}->http://download.eclipse.org:80
Mirroring: osgi.bundle,org.eclipse.core.contenttype,3.4.200.v20130326-1255 (Descriptor: canonical: osgi.bundle,org.eclipse.core.contenttype,3.4.200.v20130326-1255)
Mirroring: osgi.bundle,org.apache.felix.gogo.runtime,0.10.0.v201209301036 (Descriptor: canonical: osgi.bundle,org.apache.felix.gogo.runtime,0.10.0.v201209301036)
Mirroring: osgi.bundle,org.eclipse.equinox.launcher,1.3.0.v20130327-1440 (Descriptor: canonical: osgi.bundle,org.eclipse.equinox.launcher,1.3.0.v20130327-1440)
Mirroring: osgi.bundle,org.eclipse.equinox.registry,3.5.301.v20130717-1549 (Descriptor: canonical: osgi.bundle,org.eclipse.equinox.registry,3.5.301.v20130717-1549)
Mirroring: osgi.bundle,org.eclipse.equinox.log,1.2.300.v20130327-1442 (Descriptor: canonical: osgi.bundle,org.eclipse.equinox.log,1.2.300.v20130327-1442)
Mirroring: osgi.bundle,org.apache.felix.gogo.command,0.10.0.v201209301215 (Descriptor: canonical: osgi.bundle,org.apache.felix.gogo.command,0.10.0.v201209301215)
Mirroring: osgi.bundle,org.eclipse.core.runtime,3.9.100.v20131218-1515 (Descriptor: canonical: osgi.bundle,org.eclipse.core.runtime,3.9.100.v20131218-1515)
Mirroring: osgi.bundle,org.eclipse.equinox.preferences,3.5.100.v20130422-1538 (Descriptor: canonical: osgi.bundle,org.eclipse.equinox.preferences,3.5.100.v20130422-1538)
Mirroring: osgi.bundle,org.eclipse.osgi.services,3.3.100.v20130513-1956 (Descriptor: canonical: osgi.bundle,org.eclipse.osgi.services,3.3.100.v20130513-1956)
Mirroring: osgi.bundle,org.eclipse.core.jobs,3.5.300.v20130429-1813 (Descriptor: canonical: osgi.bundle,org.eclipse.core.jobs,3.5.300.v20130429-1813)
Mirroring: osgi.bundle,org.eclipse.equinox.supplement,1.5.0.v20130812-2109 (Descriptor: canonical: osgi.bundle,org.eclipse.equinox.supplement,1.5.0.v20130812-2109)
Mirroring: osgi.bundle,org.eclipse.osgi,3.9.1.v20140110-1610 (Descriptor: canonical: osgi.bundle,org.eclipse.osgi,3.9.1.v20140110-1610)
Mirroring: osgi.bundle,org.eclipse.equinox.app,1.3.100.v20130327-1442 (Descriptor: canonical: osgi.bundle,org.eclipse.equinox.app,1.3.100.v20130327-1442)
Mirroring: osgi.bundle,org.junit,4.11.0.v201303080030 (Descriptor: canonical: osgi.bundle,org.junit,4.11.0.v201303080030)
Mirroring: osgi.bundle,org.hamcrest.core,1.3.0.v201303031735 (Descriptor: canonical: osgi.bundle,org.hamcrest.core,1.3.0.v201303031735)
Mirroring: osgi.bundle,javax.xml,1.3.4.v201005080400 (Descriptor: canonical: osgi.bundle,javax.xml,1.3.4.v201005080400)
Mirroring: osgi.bundle,org.eclipse.equinox.common,3.6.200.v20130402-1505 (Descriptor: canonical: osgi.bundle,org.eclipse.equinox.common,3.6.200.v20130402-1505)
Mirroring: osgi.bundle,osgi.enterprise,4.2.0.v201108120515 (Descriptor: canonical: osgi.bundle,osgi.enterprise,4.2.0.v201108120515)
[WARNING] Mirror tool: Messages while mirroring artifact descriptors.: [Artifact: canonical: osgi.bundle,org.eclipse.core.contenttype,3.4.200.v20130326-1255 already exists in repository: file:/jobs/genie.tycho/tycho.extras-its/workspace/tycho-extras-its/repositories/kepler/.; Artifact: canonical: osgi.bundle,org.apache.felix.gogo.runtime,0.10.0.v201209301036 already exists in repository: file:/jobs/genie.tycho/tycho.extras-its/workspace/tycho-extras-its/repositories/kepler/.; Artifact: canonical: osgi.bundle,org.eclipse.equinox.launcher,1.3.0.v20130327-1440 already exists in repository: file:/jobs/genie.tycho/tycho.extras-its/workspace/tycho-extras-its/repositories/kepler/.; Artifact: canonical: osgi.bundle,org.eclipse.equinox.registry,3.5.301.v20130717-1549 already exists in repository: file:/jobs/genie.tycho/tycho.extras-its/workspace/tycho-extras-its/repositories/kepler/.; Artifact: canonical: osgi.bundle,org.eclipse.equinox.log,1.2.300.v20130327-1442 already exists in repository: file:/jobs/genie.tycho/tycho.extras-its/workspace/tycho-extras-its/repositories/kepler/.; Artifact: canonical: osgi.bundle,org.apache.felix.gogo.command,0.10.0.v201209301215 already exists in repository: file:/jobs/genie.tycho/tycho.extras-its/workspace/tycho-extras-its/repositories/kepler/.; Artifact: canonical: osgi.bundle,org.eclipse.core.runtime,3.9.100.v20131218-1515 already exists in repository: file:/jobs/genie.tycho/tycho.extras-its/workspace/tycho-extras-its/repositories/kepler/.; Artifact: canonical: osgi.bundle,org.eclipse.equinox.preferences,3.5.100.v20130422-1538 already exists in repository: file:/jobs/genie.tycho/tycho.extras-its/workspace/tycho-extras-its/repositories/kepler/.; Artifact: canonical: osgi.bundle,org.eclipse.osgi.services,3.3.100.v20130513-1956 already exists in repository: file:/jobs/genie.tycho/tycho.extras-its/workspace/tycho-extras-its/repositories/kepler/.; Artifact: canonical: osgi.bundle,org.eclipse.core.jobs,3.5.300.v20130429-1813 already exists in repository: file:/jobs/genie.tycho/tycho.extras-its/workspace/tycho-extras-its/repositories/kepler/.; Artifact: canonical: osgi.bundle,org.eclipse.equinox.supplement,1.5.0.v20130812-2109 already exists in repository: file:/jobs/genie.tycho/tycho.extras-its/workspace/tycho-extras-its/repositories/kepler/.; Artifact: canonical: osgi.bundle,org.eclipse.osgi,3.9.1.v20140110-1610 already exists in repository: file:/jobs/genie.tycho/tycho.extras-its/workspace/tycho-extras-its/repositories/kepler/.; Artifact: canonical: osgi.bundle,org.eclipse.equinox.app,1.3.100.v20130327-1442 already exists in repository: file:/jobs/genie.tycho/tycho.extras-its/workspace/tycho-extras-its/repositories/kepler/.; Artifact: canonical: osgi.bundle,org.junit,4.11.0.v201303080030 already exists in repository: file:/jobs/genie.tycho/tycho.extras-its/workspace/tycho-extras-its/repositories/kepler/.; Artifact: canonical: osgi.bundle,org.hamcrest.core,1.3.0.v201303031735 already exists in repository: file:/jobs/genie.tycho/tycho.extras-its/workspace/tycho-extras-its/repositories/kepler/.; Artifact: canonical: osgi.bundle,javax.xml,1.3.4.v201005080400 already exists in repository: file:/jobs/genie.tycho/tycho.extras-its/workspace/tycho-extras-its/repositories/kepler/.; Artifact: canonical: osgi.bundle,org.eclipse.equinox.common,3.6.200.v20130402-1505 already exists in repository: file:/jobs/genie.tycho/tycho.extras-its/workspace/tycho-extras-its/repositories/kepler/.; Artifact: canonical: osgi.bundle,osgi.enterprise,4.2.0.v201108120515 already exists in repository: file:/jobs/genie.tycho/tycho.extras-its/workspace/tycho-extras-its/repositories/kepler/.]
[INFO] 
[INFO] --- maven-surefire-plugin:2.22.0:test (default-test) @ tycho-extras-its ---
[INFO] 
[INFO] -------------------------------------------------------
[INFO]  T E S T S
[INFO] -------------------------------------------------------
[INFO] Running org.eclipse.tycho.extras.pomless.SetVersionPomlessITest
[INFO] Running org.eclipse.tycho.extras.pomless.TychoPomlessITest
[INFO] Tests run: 1, Failures: 0, Errors: 0, Skipped: 0, Time elapsed: 17.482 s - in org.eclipse.tycho.extras.pomless.SetVersionPomlessITest
[INFO] Running org.eclipse.tycho.extras.pomless.TychoPomlessStructuredITest
[ERROR] Tests run: 1, Failures: 0, Errors: 1, Skipped: 0, Time elapsed: 3.201 s <<< FAILURE! - in org.eclipse.tycho.extras.pomless.TychoPomlessStructuredITest
[ERROR] testPomlessBuildExtension(org.eclipse.tycho.extras.pomless.TychoPomlessStructuredITest)  Time elapsed: 3.199 s  <<< ERROR!
org.apache.maven.it.VerificationException: 
Exit code was non-zero: 1; command line and log = 
/jobs/genie.tycho/tycho.extras-its/workspace/tycho-extras-its/target/apache-maven-3.3.3/bin/mvn -Dmaven.home=/jobs/genie.tycho/tycho.extras-its/workspace/tycho-extras-its/target/apache-maven-3.3.3 -Dtycho-version=1.5.0-SNAPSHOT -Djava.io.tmpdir=/jobs/genie.tycho/tycho.extras-its/workspace/tycho-extras-its/target/tmp -Dtycho.localArtifacts=ignore -X -s /home/hudson/genie.tycho/.jenkins/jobs/tycho.extras-its/workspace/tycho-extras-its/settings-its-eclipse-org.xml -Dp2.repo=file:/jobs/genie.tycho/tycho.extras-its/workspace/tycho-extras-its/repositories/kepler/ -e --batch-mode -Dmaven.repo.local=/home/hudson/genie.tycho/.jenkins/jobs/tycho.extras-its/workspace/.repository org.apache.maven.plugins:maven-clean-plugin:clean clean verify
Picked up JAVA_TOOL_OPTIONS: -Xmx2G -Djava.io.tmpdir=/tmp/genie.tycho -DforkCount=2
Apache Maven 3.3.3 (7994120775791599e205a5524ec3e0dfe41d4a06; 2015-04-22T07:57:37-04:00)
Maven home: /jobs/genie.tycho/tycho.extras-its/workspace/tycho-extras-its/target/apache-maven-3.3.3
Java version: 1.8.0_192, vendor: Oracle Corporation
Java home: /opt/public/common/java/oracle/jdk1.8.0_192_x64/jre
Default locale: en_US, platform encoding: UTF-8
OS name: "linux", version: "3.12.74-60.64.40-default", arch: "amd64", family: "unix"
[DEBUG] Reading global settings from /jobs/genie.tycho/tycho.extras-its/workspace/tycho-extras-its/target/apache-maven-3.3.3/conf/settings.xml
[DEBUG] Reading user settings from /home/hudson/genie.tycho/.jenkins/jobs/tycho.extras-its/workspace/tycho-extras-its/settings-its-eclipse-org.xml
[DEBUG] Using manager EnhancedLocalRepositoryManager with priority 10.0 for /home/hudson/genie.tycho/.jenkins/jobs/tycho.extras-its/workspace/.repository
[DEBUG] Dependency collection stats: {ConflictMarker.analyzeTime=1, ConflictMarker.markTime=0, ConflictMarker.nodeCount=2, ConflictIdSorter.graphTime=1, ConflictIdSorter.topsortTime=0, ConflictIdSorter.conflictIdCount=2, ConflictIdSorter.conflictIdCycleCount=0, ConflictResolver.totalTime=3, ConflictResolver.conflictItemCount=2, DefaultDependencyCollector.collectTime=103, DefaultDependencyCollector.transformTime=7}
[DEBUG] org.eclipse.tycho.extras:tycho-pomless:jar:1.5.0-SNAPSHOT:
[DEBUG]    io.takari.polyglot:polyglot-common:jar:0.1.5:compile
[DEBUG] Populating class realm coreExtension>org.eclipse.tycho.extras:tycho-pomless:1.5.0-SNAPSHOT
[DEBUG]   Included /home/hudson/genie.tycho/.jenkins/jobs/tycho.extras-its/workspace/.repository/org/eclipse/tycho/extras/tycho-pomless/1.5.0-SNAPSHOT/tycho-pomless-1.5.0-SNAPSHOT.jar
[DEBUG]   Included /home/hudson/genie.tycho/.jenkins/jobs/tycho.extras-its/workspace/.repository/io/takari/polyglot/polyglot-common/0.1.5/polyglot-common-0.1.5.jar
[DEBUG] Populating class realm maven.ext
[DEBUG] Created new class realm maven.api
[DEBUG] Importing foreign packages into class realm maven.api
[DEBUG]   Imported: javax.enterprise.inject.* < maven.ext
[DEBUG]   Imported: javax.enterprise.util.* < maven.ext
[DEBUG]   Imported: javax.inject.* < maven.ext
[DEBUG]   Imported: org.apache.maven.* < maven.ext
[DEBUG]   Imported: org.apache.maven.artifact < maven.ext
[DEBUG]   Imported: org.apache.maven.classrealm < maven.ext
[DEBUG]   Imported: org.apache.maven.cli < maven.ext
[DEBUG]   Imported: org.apache.maven.configuration < maven.ext
[DEBUG]   Imported: org.apache.maven.exception < maven.ext
[DEBUG]   Imported: org.apache.maven.execution < maven.ext
[DEBUG]   Imported: org.apache.maven.execution.scope < maven.ext
[DEBUG]   Imported: org.apache.maven.lifecycle < maven.ext
[DEBUG]   Imported: org.apache.maven.model < maven.ext
[DEBUG]   Imported: org.apache.maven.monitor < maven.ext
[DEBUG]   Imported: org.apache.maven.plugin < maven.ext
[DEBUG]   Imported: org.apache.maven.profiles < maven.ext
[DEBUG]   Imported: org.apache.maven.project < maven.ext
[DEBUG]   Imported: org.apache.maven.reporting < maven.ext
[DEBUG]   Imported: org.apache.maven.repository < maven.ext
[DEBUG]   Imported: org.apache.maven.rtinfo < maven.ext
[DEBUG]   Imported: org.apache.maven.settings < maven.ext
[DEBUG]   Imported: org.apache.maven.toolchain < maven.ext
[DEBUG]   Imported: org.apache.maven.usability < maven.ext
[DEBUG]   Imported: org.apache.maven.wagon.* < maven.ext
[DEBUG]   Imported: org.apache.maven.wagon.authentication < maven.ext
[DEBUG]   Imported: org.apache.maven.wagon.authorization < maven.ext
[DEBUG]   Imported: org.apache.maven.wagon.events < maven.ext
[DEBUG]   Imported: org.apache.maven.wagon.observers < maven.ext
[DEBUG]   Imported: org.apache.maven.wagon.proxy < maven.ext
[DEBUG]   Imported: org.apache.maven.wagon.repository < maven.ext
[DEBUG]   Imported: org.apache.maven.wagon.resource < maven.ext
[DEBUG]   Imported: org.codehaus.classworlds < maven.ext
[DEBUG]   Imported: org.codehaus.plexus.* < maven.ext
[DEBUG]   Imported: org.codehaus.plexus.classworlds < maven.ext
[DEBUG]   Imported: org.codehaus.plexus.component < maven.ext
[DEBUG]   Imported: org.codehaus.plexus.configuration < maven.ext
[DEBUG]   Imported: org.codehaus.plexus.container < maven.ext
[DEBUG]   Imported: org.codehaus.plexus.context < maven.ext
[DEBUG]   Imported: org.codehaus.plexus.lifecycle < maven.ext
[DEBUG]   Imported: org.codehaus.plexus.logging < maven.ext
[DEBUG]   Imported: org.codehaus.plexus.personality < maven.ext
[DEBUG]   Imported: org.codehaus.plexus.util.xml.Xpp3Dom < maven.ext
[DEBUG]   Imported: org.codehaus.plexus.util.xml.pull.XmlPullParser < maven.ext
[DEBUG]   Imported: org.codehaus.plexus.util.xml.pull.XmlPullParserException < maven.ext
[DEBUG]   Imported: org.codehaus.plexus.util.xml.pull.XmlSerializer < maven.ext
[DEBUG]   Imported: org.eclipse.aether.* < maven.ext
[DEBUG]   Imported: org.eclipse.aether.artifact < maven.ext
[DEBUG]   Imported: org.eclipse.aether.collection < maven.ext
[DEBUG]   Imported: org.eclipse.aether.deployment < maven.ext
[DEBUG]   Imported: org.eclipse.aether.graph < maven.ext
[DEBUG]   Imported: org.eclipse.aether.impl < maven.ext
[DEBUG]   Imported: org.eclipse.aether.installation < maven.ext
[DEBUG]   Imported: org.eclipse.aether.internal.impl < maven.ext
[DEBUG]   Imported: org.eclipse.aether.metadata < maven.ext
[DEBUG]   Imported: org.eclipse.aether.repository < maven.ext
[DEBUG]   Imported: org.eclipse.aether.resolution < maven.ext
[DEBUG]   Imported: org.eclipse.aether.spi < maven.ext
[DEBUG]   Imported: org.eclipse.aether.transfer < maven.ext
[DEBUG]   Imported: org.eclipse.aether.version < maven.ext
[DEBUG]   Imported: org.slf4j.* < maven.ext
[DEBUG]   Imported: org.slf4j.spi.* < maven.ext
[DEBUG] Populating class realm maven.api
[INFO] Error stacktraces are turned on.
[DEBUG] Reading global settings from /jobs/genie.tycho/tycho.extras-its/workspace/tycho-extras-its/target/apache-maven-3.3.3/conf/settings.xml
[DEBUG] Reading user settings from /home/hudson/genie.tycho/.jenkins/jobs/tycho.extras-its/workspace/tycho-extras-its/settings-its-eclipse-org.xml
[DEBUG] Reading global toolchains from /jobs/genie.tycho/tycho.extras-its/workspace/tycho-extras-its/target/apache-maven-3.3.3/conf/toolchains.xml
[DEBUG] Reading user toolchains from /opt/public/hipp/homes/genie.tycho/.m2/toolchains.xml
[DEBUG] Using local repository at /home/hudson/genie.tycho/.jenkins/jobs/tycho.extras-its/workspace/.repository
[DEBUG] Using manager EnhancedLocalRepositoryManager with priority 10.0 for /home/hudson/genie.tycho/.jenkins/jobs/tycho.extras-its/workspace/.repository
[INFO] Scanning for projects...
[DEBUG] Scanning folder /jobs/genie.tycho/tycho.extras-its/workspace/tycho-extras-its/target/test-classes/testpomless-structured/bundles for modules
[DEBUG] Skip folder /jobs/genie.tycho/tycho.extras-its/workspace/tycho-extras-its/target/test-classes/testpomless-structured/bundles/bundle1 because it does not match any common name [features, tests, plugins, bundles, sites, products, releng]
[DEBUG] Found pom .META-INF_MANIFEST.MF in subfolder bundle1
[DEBUG] Scanning folder /jobs/genie.tycho/tycho.extras-its/workspace/tycho-extras-its/target/test-classes/testpomless-structured/tests for modules
[DEBUG] Skip folder /jobs/genie.tycho/tycho.extras-its/workspace/tycho-extras-its/target/test-classes/testpomless-structured/tests/bundle1.tests because it does not match any common name [features, tests, plugins, bundles, sites, products, releng]
[DEBUG] Found pom .META-INF_MANIFEST.MF in subfolder bundle1.tests
[DEBUG] Scanning folder /jobs/genie.tycho/tycho.extras-its/workspace/tycho-extras-its/target/test-classes/testpomless-structured/features for modules
[DEBUG] Skip folder /jobs/genie.tycho/tycho.extras-its/workspace/tycho-extras-its/target/test-classes/testpomless-structured/features/feature because it does not match any common name [features, tests, plugins, bundles, sites, products, releng]
[DEBUG] Found pom feature.xml.takari_issue_192 in subfolder feature
[DEBUG] Scanning folder /jobs/genie.tycho/tycho.extras-its/workspace/tycho-extras-its/target/test-classes/testpomless-structured/releng for modules
[DEBUG] Skip folder /jobs/genie.tycho/tycho.extras-its/workspace/tycho-extras-its/target/test-classes/testpomless-structured/releng/product because it does not match any common name [features, tests, plugins, bundles, sites, products, releng]
[DEBUG] Found pom test.product in subfolder product
[DEBUG] Skip folder /jobs/genie.tycho/tycho.extras-its/workspace/tycho-extras-its/target/test-classes/testpomless-structured/releng/site1 because it does not match any common name [features, tests, plugins, bundles, sites, products, releng]
[DEBUG] Found pom category.xml.takari_issue_192 in subfolder site1
[DEBUG] Skip folder /jobs/genie.tycho/tycho.extras-its/workspace/tycho-extras-its/target/test-classes/testpomless-structured/releng/targetplatform because it does not match any common name [features, tests, plugins, bundles, sites, products, releng]
[DEBUG] Found pom targetplatform.target in subfolder targetplatform
/jobs/genie.tycho/tycho.extras-its/workspace/tycho-extras-its/target/test-classes/testpomless-structured/bundles/.polyglot.pom.tycho
[DEBUG] Generate aggregator pom for /jobs/genie.tycho/tycho.extras-its/workspace/tycho-extras-its/target/test-classes/testpomless-structured/bundles/pom.tycho
[DEBUG] Adding module bundle1
[DEBUG] Skip folder /jobs/genie.tycho/tycho.extras-its/workspace/tycho-extras-its/target/test-classes/testpomless-structured/bundles/bundle1 because it does not match any common name [features, tests, plugins, bundles, sites, products, releng]
/jobs/genie.tycho/tycho.extras-its/workspace/tycho-extras-its/target/test-classes/testpomless-structured/bundles/bundle1/.polyglot..META-INF_MANIFEST.MF
[DEBUG] Generate aggregator pom for /jobs/genie.tycho/tycho.extras-its/workspace/tycho-extras-its/target/test-classes/testpomless-structured/bundles/bundle1/../pom.tycho
[DEBUG] Adding module bundle1
[DEBUG] Generate aggregator pom for /jobs/genie.tycho/tycho.extras-its/workspace/tycho-extras-its/target/test-classes/testpomless-structured/bundles/pom.tycho
[DEBUG] Adding module bundle1
[DEBUG] Could not find metadata testParent.groupId:..:0.0.1-SNAPSHOT/maven-metadata.xml in local (/home/hudson/genie.tycho/.jenkins/jobs/tycho.extras-its/workspace/.repository)
/jobs/genie.tycho/tycho.extras-its/workspace/tycho-extras-its/target/test-classes/testpomless-structured/tests/.polyglot.pom.tycho
[DEBUG] Generate aggregator pom for /jobs/genie.tycho/tycho.extras-its/workspace/tycho-extras-its/target/test-classes/testpomless-structured/tests/pom.tycho
[DEBUG] Adding module bundle1.tests
[DEBUG] Skip folder /jobs/genie.tycho/tycho.extras-its/workspace/tycho-extras-its/target/test-classes/testpomless-structured/tests/bundle1.tests because it does not match any common name [features, tests, plugins, bundles, sites, products, releng]
/jobs/genie.tycho/tycho.extras-its/workspace/tycho-extras-its/target/test-classes/testpomless-structured/tests/bundle1.tests/.polyglot..META-INF_MANIFEST.MF
[DEBUG] Generate aggregator pom for /jobs/genie.tycho/tycho.extras-its/workspace/tycho-extras-its/target/test-classes/testpomless-structured/tests/bundle1.tests/../pom.tycho
[DEBUG] Adding module bundle1.tests
[DEBUG] Generate aggregator pom for /jobs/genie.tycho/tycho.extras-its/workspace/tycho-extras-its/target/test-classes/testpomless-structured/tests/pom.tycho
[DEBUG] Adding module bundle1.tests
/jobs/genie.tycho/tycho.extras-its/workspace/tycho-extras-its/target/test-classes/testpomless-structured/features/.polyglot.pom.tycho
[DEBUG] Generate aggregator pom for /jobs/genie.tycho/tycho.extras-its/workspace/tycho-extras-its/target/test-classes/testpomless-structured/features/pom.tycho
[DEBUG] Adding module feature
[DEBUG] Skip folder /jobs/genie.tycho/tycho.extras-its/workspace/tycho-extras-its/target/test-classes/testpomless-structured/features/feature because it does not match any common name [features, tests, plugins, bundles, sites, products, releng]
/jobs/genie.tycho/tycho.extras-its/workspace/tycho-extras-its/target/test-classes/testpomless-structured/features/feature/.polyglot.feature.xml.takari_issue_192
[DEBUG] Generate aggregator pom for /jobs/genie.tycho/tycho.extras-its/workspace/tycho-extras-its/target/test-classes/testpomless-structured/features/feature/../pom.tycho
[DEBUG] Adding module feature
[DEBUG] Generate aggregator pom for /jobs/genie.tycho/tycho.extras-its/workspace/tycho-extras-its/target/test-classes/testpomless-structured/features/pom.tycho
[DEBUG] Adding module feature
/jobs/genie.tycho/tycho.extras-its/workspace/tycho-extras-its/target/test-classes/testpomless-structured/releng/.polyglot.pom.tycho
[DEBUG] Generate aggregator pom for /jobs/genie.tycho/tycho.extras-its/workspace/tycho-extras-its/target/test-classes/testpomless-structured/releng/pom.tycho
[DEBUG] Adding module product
[DEBUG] Adding module site1
[DEBUG] Adding module targetplatform
[DEBUG] Skip folder /jobs/genie.tycho/tycho.extras-its/workspace/tycho-extras-its/target/test-classes/testpomless-structured/releng/product because it does not match any common name [features, tests, plugins, bundles, sites, products, releng]
[DEBUG] Skip folder /jobs/genie.tycho/tycho.extras-its/workspace/tycho-extras-its/target/test-classes/testpomless-structured/releng/site1 because it does not match any common name [features, tests, plugins, bundles, sites, products, releng]
[DEBUG] Skip folder /jobs/genie.tycho/tycho.extras-its/workspace/tycho-extras-its/target/test-classes/testpomless-structured/releng/targetplatform because it does not match any common name [features, tests, plugins, bundles, sites, products, releng]
/jobs/genie.tycho/tycho.extras-its/workspace/tycho-extras-its/target/test-classes/testpomless-structured/releng/product/.polyglot.test.product
[DEBUG] Generate aggregator pom for /jobs/genie.tycho/tycho.extras-its/workspace/tycho-extras-its/target/test-classes/testpomless-structured/releng/product/../pom.tycho
[DEBUG] Adding module product
[DEBUG] Adding module site1
[DEBUG] Adding module targetplatform
[DEBUG] Generate aggregator pom for /jobs/genie.tycho/tycho.extras-its/workspace/tycho-extras-its/target/test-classes/testpomless-structured/releng/pom.tycho
[DEBUG] Adding module product
[DEBUG] Adding module site1
[DEBUG] Adding module targetplatform
/jobs/genie.tycho/tycho.extras-its/workspace/tycho-extras-its/target/test-classes/testpomless-structured/releng/site1/.polyglot.category.xml.takari_issue_192
[DEBUG] Generate aggregator pom for /jobs/genie.tycho/tycho.extras-its/workspace/tycho-extras-its/target/test-classes/testpomless-structured/releng/site1/../pom.tycho
[DEBUG] Adding module product
[DEBUG] Adding module site1
[DEBUG] Adding module targetplatform
[DEBUG] Generate aggregator pom for /jobs/genie.tycho/tycho.extras-its/workspace/tycho-extras-its/target/test-classes/testpomless-structured/releng/pom.tycho
[DEBUG] Adding module product
[DEBUG] Adding module site1
[DEBUG] Adding module targetplatform
/jobs/genie.tycho/tycho.extras-its/workspace/tycho-extras-its/target/test-classes/testpomless-structured/releng/targetplatform/.polyglot.targetplatform.target
[DEBUG] Generate aggregator pom for /jobs/genie.tycho/tycho.extras-its/workspace/tycho-extras-its/target/test-classes/testpomless-structured/releng/targetplatform/../pom.tycho
[DEBUG] Adding module product
[DEBUG] Adding module site1
[DEBUG] Adding module targetplatform
[DEBUG] Generate aggregator pom for /jobs/genie.tycho/tycho.extras-its/workspace/tycho-extras-its/target/test-classes/testpomless-structured/releng/pom.tycho
[DEBUG] Adding module product
[DEBUG] Adding module site1
[DEBUG] Adding module targetplatform
[DEBUG] Could not find metadata org.eclipse.tycho:tycho-maven-plugin:1.5.0-SNAPSHOT/maven-metadata.xml in local (/home/hudson/genie.tycho/.jenkins/jobs/tycho.extras-its/workspace/.repository)
[DEBUG] Skipped remote request for org.eclipse.tycho:tycho-maven-plugin:1.5.0-SNAPSHOT/maven-metadata.xml, locally cached metadata up-to-date.
[DEBUG] Could not find metadata org.eclipse.tycho:tycho-maven-plugin:1.5.0-SNAPSHOT/maven-metadata.xml in local (/home/hudson/genie.tycho/.jenkins/jobs/tycho.extras-its/workspace/.repository)
[DEBUG] Skipped remote request for org.eclipse.tycho:tycho-maven-plugin:1.5.0-SNAPSHOT/maven-metadata.xml, locally cached metadata up-to-date.
[DEBUG] Could not find metadata org.eclipse.tycho:tycho:1.5.0-SNAPSHOT/maven-metadata.xml in local (/home/hudson/genie.tycho/.jenkins/jobs/tycho.extras-its/workspace/.repository)
[DEBUG] Skipped remote request for org.eclipse.tycho:tycho:1.5.0-SNAPSHOT/maven-metadata.xml, locally cached metadata up-to-date.
[DEBUG] Could not find metadata org.eclipse.tycho:tycho-core:1.5.0-SNAPSHOT/maven-metadata.xml in local (/home/hudson/genie.tycho/.jenkins/jobs/tycho.extras-its/workspace/.repository)
[DEBUG] Skipped remote request for org.eclipse.tycho:tycho-core:1.5.0-SNAPSHOT/maven-metadata.xml, locally cached metadata up-to-date.
[DEBUG] Could not find metadata org.eclipse.tycho:tycho-core:1.5.0-SNAPSHOT/maven-metadata.xml in local (/home/hudson/genie.tycho/.jenkins/jobs/tycho.extras-its/workspace/.repository)
[DEBUG] Skipped remote request for org.eclipse.tycho:tycho-core:1.5.0-SNAPSHOT/maven-metadata.xml, locally cached metadata up-to-date.
[DEBUG] Could not find metadata org.eclipse.tycho:org.eclipse.tycho.p2.tools.shared:1.5.0-SNAPSHOT/maven-metadata.xml in local (/home/hudson/genie.tycho/.jenkins/jobs/tycho.extras-its/workspace/.repository)
[DEBUG] Skipped remote request for org.eclipse.tycho:org.eclipse.tycho.p2.tools.shared:1.5.0-SNAPSHOT/maven-metadata.xml, locally cached metadata up-to-date.
[DEBUG] Could not find metadata org.eclipse.tycho:org.eclipse.tycho.p2.tools.shared:1.5.0-SNAPSHOT/maven-metadata.xml in local (/home/hudson/genie.tycho/.jenkins/jobs/tycho.extras-its/workspace/.repository)
[DEBUG] Skipped remote request for org.eclipse.tycho:org.eclipse.tycho.p2.tools.shared:1.5.0-SNAPSHOT/maven-metadata.xml, locally cached metadata up-to-date.
[DEBUG] Could not find metadata org.eclipse.tycho:tycho-bundles:1.5.0-SNAPSHOT/maven-metadata.xml in local (/home/hudson/genie.tycho/.jenkins/jobs/tycho.extras-its/workspace/.repository)
[DEBUG] Skipped remote request for org.eclipse.tycho:tycho-bundles:1.5.0-SNAPSHOT/maven-metadata.xml, locally cached metadata up-to-date.
[DEBUG] Could not find metadata org.eclipse.tycho:sisu-equinox-embedder:1.5.0-SNAPSHOT/maven-metadata.xml in local (/home/hudson/genie.tycho/.jenkins/jobs/tycho.extras-its/workspace/.repository)
[DEBUG] Skipped remote request for org.eclipse.tycho:sisu-equinox-embedder:1.5.0-SNAPSHOT/maven-metadata.xml, locally cached metadata up-to-date.
[DEBUG] Could not find metadata org.eclipse.tycho:sisu-equinox-embedder:1.5.0-SNAPSHOT/maven-metadata.xml in local (/home/hudson/genie.tycho/.jenkins/jobs/tycho.extras-its/workspace/.repository)
[DEBUG] Skipped remote request for org.eclipse.tycho:sisu-equinox-embedder:1.5.0-SNAPSHOT/maven-metadata.xml, locally cached metadata up-to-date.
[DEBUG] Could not find metadata org.eclipse.tycho:sisu-equinox:1.5.0-SNAPSHOT/maven-metadata.xml in local (/home/hudson/genie.tycho/.jenkins/jobs/tycho.extras-its/workspace/.repository)
[DEBUG] Skipped remote request for org.eclipse.tycho:sisu-equinox:1.5.0-SNAPSHOT/maven-metadata.xml, locally cached metadata up-to-date.
[DEBUG] Could not find metadata org.eclipse.tycho:sisu-equinox-api:1.5.0-SNAPSHOT/maven-metadata.xml in local (/home/hudson/genie.tycho/.jenkins/jobs/tycho.extras-its/workspace/.repository)
[DEBUG] Skipped remote request for org.eclipse.tycho:sisu-equinox-api:1.5.0-SNAPSHOT/maven-metadata.xml, locally cached metadata up-to-date.
[DEBUG] Could not find metadata org.eclipse.tycho:sisu-equinox-api:1.5.0-SNAPSHOT/maven-metadata.xml in local (/home/hudson/genie.tycho/.jenkins/jobs/tycho.extras-its/workspace/.repository)
[DEBUG] Skipped remote request for org.eclipse.tycho:sisu-equinox-api:1.5.0-SNAPSHOT/maven-metadata.xml, locally cached metadata up-to-date.
[DEBUG] Could not find metadata org.eclipse.tycho:tycho-metadata-model:1.5.0-SNAPSHOT/maven-metadata.xml in local (/home/hudson/genie.tycho/.jenkins/jobs/tycho.extras-its/workspace/.repository)
[DEBUG] Skipped remote request for org.eclipse.tycho:tycho-metadata-model:1.5.0-SNAPSHOT/maven-metadata.xml, locally cached metadata up-to-date.
[DEBUG] Could not find metadata org.eclipse.tycho:tycho-metadata-model:1.5.0-SNAPSHOT/maven-metadata.xml in local (/home/hudson/genie.tycho/.jenkins/jobs/tycho.extras-its/workspace/.repository)
[DEBUG] Skipped remote request for org.eclipse.tycho:tycho-metadata-model:1.5.0-SNAPSHOT/maven-metadata.xml, locally cached metadata up-to-date.
[DEBUG] Could not find metadata org.eclipse.tycho:tycho-embedder-api:1.5.0-SNAPSHOT/maven-metadata.xml in local (/home/hudson/genie.tycho/.jenkins/jobs/tycho.extras-its/workspace/.repository)
[DEBUG] Skipped remote request for org.eclipse.tycho:tycho-embedder-api:1.5.0-SNAPSHOT/maven-metadata.xml, locally cached metadata up-to-date.
[DEBUG] Could not find metadata org.eclipse.tycho:tycho-embedder-api:1.5.0-SNAPSHOT/maven-metadata.xml in local (/home/hudson/genie.tycho/.jenkins/jobs/tycho.extras-its/workspace/.repository)
[DEBUG] Skipped remote request for org.eclipse.tycho:tycho-embedder-api:1.5.0-SNAPSHOT/maven-metadata.xml, locally cached metadata up-to-date.
[DEBUG] Could not find metadata org.eclipse.tycho:org.eclipse.tycho.embedder.shared:1.5.0-SNAPSHOT/maven-metadata.xml in local (/home/hudson/genie.tycho/.jenkins/jobs/tycho.extras-its/workspace/.repository)
[DEBUG] Skipped remote request for org.eclipse.tycho:org.eclipse.tycho.embedder.shared:1.5.0-SNAPSHOT/maven-metadata.xml, locally cached metadata up-to-date.
[DEBUG] Could not find metadata org.eclipse.tycho:org.eclipse.tycho.embedder.shared:1.5.0-SNAPSHOT/maven-metadata.xml in local (/home/hudson/genie.tycho/.jenkins/jobs/tycho.extras-its/workspace/.repository)
[DEBUG] Skipped remote request for org.eclipse.tycho:org.eclipse.tycho.embedder.shared:1.5.0-SNAPSHOT/maven-metadata.xml, locally cached metadata up-to-date.
[DEBUG] Could not find metadata org.eclipse.tycho:org.eclipse.tycho.core.shared:1.5.0-SNAPSHOT/maven-metadata.xml in local (/home/hudson/genie.tycho/.jenkins/jobs/tycho.extras-its/workspace/.repository)
[DEBUG] Skipped remote request for org.eclipse.tycho:org.eclipse.tycho.core.shared:1.5.0-SNAPSHOT/maven-metadata.xml, locally cached metadata up-to-date.
[DEBUG] Could not find metadata org.eclipse.tycho:org.eclipse.tycho.core.shared:1.5.0-SNAPSHOT/maven-metadata.xml in local (/home/hudson/genie.tycho/.jenkins/jobs/tycho.extras-its/workspace/.repository)
[DEBUG] Skipped remote request for org.eclipse.tycho:org.eclipse.tycho.core.shared:1.5.0-SNAPSHOT/maven-metadata.xml, locally cached metadata up-to-date.
[DEBUG] Could not find metadata org.eclipse.tycho:tycho-p2-facade:1.5.0-SNAPSHOT/maven-metadata.xml in local (/home/hudson/genie.tycho/.jenkins/jobs/tycho.extras-its/workspace/.repository)
[DEBUG] Skipped remote request for org.eclipse.tycho:tycho-p2-facade:1.5.0-SNAPSHOT/maven-metadata.xml, locally cached metadata up-to-date.
[DEBUG] Could not find metadata org.eclipse.tycho:tycho-p2-facade:1.5.0-SNAPSHOT/maven-metadata.xml in local (/home/hudson/genie.tycho/.jenkins/jobs/tycho.extras-its/workspace/.repository)
[DEBUG] Skipped remote request for org.eclipse.tycho:tycho-p2-facade:1.5.0-SNAPSHOT/maven-metadata.xml, locally cached metadata up-to-date.
[DEBUG] Could not find metadata org.eclipse.tycho:tycho-p2:1.5.0-SNAPSHOT/maven-metadata.xml in local (/home/hudson/genie.tycho/.jenkins/jobs/tycho.extras-its/workspace/.repository)
[DEBUG] Skipped remote request for org.eclipse.tycho:tycho-p2:1.5.0-SNAPSHOT/maven-metadata.xml, locally cached metadata up-to-date.
[DEBUG] Could not find metadata org.eclipse.tycho:org.eclipse.tycho.p2.resolver.shared:1.5.0-SNAPSHOT/maven-metadata.xml in local (/home/hudson/genie.tycho/.jenkins/jobs/tycho.extras-its/workspace/.repository)
[DEBUG] Skipped remote request for org.eclipse.tycho:org.eclipse.tycho.p2.resolver.shared:1.5.0-SNAPSHOT/maven-metadata.xml, locally cached metadata up-to-date.
[DEBUG] Could not find metadata org.eclipse.tycho:org.eclipse.tycho.p2.resolver.shared:1.5.0-SNAPSHOT/maven-metadata.xml in local (/home/hudson/genie.tycho/.jenkins/jobs/tycho.extras-its/workspace/.repository)
[DEBUG] Skipped remote request for org.eclipse.tycho:org.eclipse.tycho.p2.resolver.shared:1.5.0-SNAPSHOT/maven-metadata.xml, locally cached metadata up-to-date.
[DEBUG] Dependency collection stats: {ConflictMarker.analyzeTime=1, ConflictMarker.markTime=0, ConflictMarker.nodeCount=98, ConflictIdSorter.graphTime=0, ConflictIdSorter.topsortTime=0, ConflictIdSorter.conflictIdCount=44, ConflictIdSorter.conflictIdCycleCount=0, ConflictResolver.totalTime=6, ConflictResolver.conflictItemCount=97, DefaultDependencyCollector.collectTime=276, DefaultDependencyCollector.transformTime=7}
[DEBUG] org.eclipse.tycho:tycho-maven-plugin:jar:1.5.0-SNAPSHOT:
[DEBUG]    org.eclipse.tycho:tycho-core:jar:1.5.0-SNAPSHOT:compile
[DEBUG]       org.apache.maven:maven-core:jar:3.0:compile
[DEBUG]          org.apache.maven:maven-model:jar:3.0:compile
[DEBUG]          org.apache.maven:maven-settings:jar:3.0:compile
[DEBUG]          org.apache.maven:maven-settings-builder:jar:3.0:compile
[DEBUG]          org.apache.maven:maven-repository-metadata:jar:3.0:compile
[DEBUG]          org.apache.maven:maven-artifact:jar:3.0:compile
[DEBUG]          org.apache.maven:maven-model-builder:jar:3.0:compile
[DEBUG]          org.apache.maven:maven-aether-provider:jar:3.0:runtime
[DEBUG]          org.sonatype.aether:aether-impl:jar:1.7:compile
[DEBUG]             org.sonatype.aether:aether-spi:jar:1.7:compile
[DEBUG]          org.sonatype.aether:aether-api:jar:1.7:compile
[DEBUG]          org.sonatype.aether:aether-util:jar:1.7:compile
[DEBUG]          org.sonatype.sisu:sisu-inject-plexus:jar:1.4.2:compile
[DEBUG]             org.sonatype.sisu:sisu-inject-bean:jar:1.4.2:compile
[DEBUG]                org.sonatype.sisu:sisu-guice:jar:noaop:2.1.7:compile
[DEBUG]          org.codehaus.plexus:plexus-interpolation:jar:1.14:compile
[DEBUG]          org.codehaus.plexus:plexus-classworlds:jar:2.2.3:compile
[DEBUG]          org.sonatype.plexus:plexus-sec-dispatcher:jar:1.3:compile
[DEBUG]             org.sonatype.plexus:plexus-cipher:jar:1.7:compile
[DEBUG]       org.apache.maven:maven-plugin-api:jar:3.0:compile
[DEBUG]       org.eclipse.tycho:org.eclipse.tycho.p2.tools.shared:jar:1.5.0-SNAPSHOT:compile
[DEBUG]       org.codehaus.plexus:plexus-utils:jar:3.0.24:compile
[DEBUG]       org.codehaus.plexus:plexus-archiver:jar:3.4:compile
[DEBUG]          org.codehaus.plexus:plexus-io:jar:2.7.1:compile
[DEBUG]          commons-io:commons-io:jar:2.5:compile
[DEBUG]          org.apache.commons:commons-compress:jar:1.18:compile
[DEBUG]          org.iq80.snappy:snappy:jar:0.4:compile
[DEBUG]          org.tukaani:xz:jar:1.5:runtime
[DEBUG]       org.eclipse.platform:org.eclipse.osgi.compatibility.state:jar:1.1.500:compile
[DEBUG]          org.eclipse.platform:org.eclipse.osgi:jar:3.14.0:compile
[DEBUG]       org.eclipse.tycho:sisu-equinox-embedder:jar:1.5.0-SNAPSHOT:compile
[DEBUG]          org.eclipse.tycho:sisu-equinox-api:jar:1.5.0-SNAPSHOT:compile
[DEBUG]       org.eclipse.tycho:tycho-metadata-model:jar:1.5.0-SNAPSHOT:compile
[DEBUG]          de.pdark:decentxml:jar:1.3:compile
[DEBUG]       org.eclipse.tycho:tycho-embedder-api:jar:1.5.0-SNAPSHOT:compile
[DEBUG]          org.eclipse.tycho:org.eclipse.tycho.embedder.shared:jar:1.5.0-SNAPSHOT:compile
[DEBUG]       org.eclipse.tycho:org.eclipse.tycho.core.shared:jar:1.5.0-SNAPSHOT:compile
[DEBUG]       org.apache.maven:maven-compat:jar:3.0:compile
[DEBUG]          org.apache.maven.wagon:wagon-provider-api:jar:1.0-beta-6:compile
[DEBUG]    org.eclipse.tycho:tycho-p2-facade:jar:1.5.0-SNAPSHOT:compile
[DEBUG]       org.codehaus.plexus:plexus-component-annotations:jar:1.7.1:compile
[DEBUG]       org.eclipse.tycho:org.eclipse.tycho.p2.resolver.shared:jar:1.5.0-SNAPSHOT:compile
[DEBUG] Created new class realm extension>org.eclipse.tycho:tycho-maven-plugin:1.5.0-SNAPSHOT
[DEBUG] Importing foreign packages into class realm extension>org.eclipse.tycho:tycho-maven-plugin:1.5.0-SNAPSHOT
[DEBUG]   Imported:  < maven.api
[DEBUG] Populating class realm extension>org.eclipse.tycho:tycho-maven-plugin:1.5.0-SNAPSHOT
[DEBUG]   Included: org.eclipse.tycho:tycho-maven-plugin:jar:1.5.0-SNAPSHOT
[DEBUG]   Included: org.eclipse.tycho:tycho-core:jar:1.5.0-SNAPSHOT
[DEBUG]   Included: org.sonatype.aether:aether-util:jar:1.7
[DEBUG]   Included: org.sonatype.sisu:sisu-inject-bean:jar:1.4.2
[DEBUG]   Included: org.sonatype.sisu:sisu-guice:jar:noaop:2.1.7
[DEBUG]   Included: org.codehaus.plexus:plexus-interpolation:jar:1.14
[DEBUG]   Included: org.sonatype.plexus:plexus-sec-dispatcher:jar:1.3
[DEBUG]   Included: org.sonatype.plexus:plexus-cipher:jar:1.7
[DEBUG]   Included: org.eclipse.tycho:org.eclipse.tycho.p2.tools.shared:jar:1.5.0-SNAPSHOT
[DEBUG]   Included: org.codehaus.plexus:plexus-utils:jar:3.0.24
[DEBUG]   Included: org.codehaus.plexus:plexus-archiver:jar:3.4
[DEBUG]   Included: org.codehaus.plexus:plexus-io:jar:2.7.1
[DEBUG]   Included: commons-io:commons-io:jar:2.5
[DEBUG]   Included: org.apache.commons:commons-compress:jar:1.18
[DEBUG]   Included: org.iq80.snappy:snappy:jar:0.4
[DEBUG]   Included: org.tukaani:xz:jar:1.5
[DEBUG]   Included: org.eclipse.platform:org.eclipse.osgi.compatibility.state:jar:1.1.500
[DEBUG]   Included: org.eclipse.platform:org.eclipse.osgi:jar:3.14.0
[DEBUG]   Included: org.eclipse.tycho:sisu-equinox-embedder:jar:1.5.0-SNAPSHOT
[DEBUG]   Included: org.eclipse.tycho:sisu-equinox-api:jar:1.5.0-SNAPSHOT
[DEBUG]   Included: org.eclipse.tycho:tycho-metadata-model:jar:1.5.0-SNAPSHOT
[DEBUG]   Included: de.pdark:decentxml:jar:1.3
[DEBUG]   Included: org.eclipse.tycho:tycho-embedder-api:jar:1.5.0-SNAPSHOT
[DEBUG]   Included: org.eclipse.tycho:org.eclipse.tycho.embedder.shared:jar:1.5.0-SNAPSHOT
[DEBUG]   Included: org.eclipse.tycho:org.eclipse.tycho.core.shared:jar:1.5.0-SNAPSHOT
[DEBUG]   Included: org.eclipse.tycho:tycho-p2-facade:jar:1.5.0-SNAPSHOT
[DEBUG]   Included: org.codehaus.plexus:plexus-component-annotations:jar:1.7.1
[DEBUG]   Included: org.eclipse.tycho:org.eclipse.tycho.p2.resolver.shared:jar:1.5.0-SNAPSHOT
[DEBUG] Extension realms for project testParent.groupId:testparent:pom:0.0.1-SNAPSHOT: [ClassRealm[extension>org.eclipse.tycho:tycho-maven-plugin:1.5.0-SNAPSHOT, parent: sun.misc.Launcher$AppClassLoader@7852e922]]
[DEBUG] Created new class realm project>testParent.groupId:testparent:0.0.1-SNAPSHOT
[DEBUG] Populating class realm project>testParent.groupId:testparent:0.0.1-SNAPSHOT
[DEBUG] Looking up lifecyle mappings for packaging pom from ClassRealm[project>testParent.groupId:testparent:0.0.1-SNAPSHOT, parent: ClassRealm[maven.api, parent: null]]
[DEBUG] Extension realms for project testParent.groupId:bundles:pom:0.0.1-SNAPSHOT: [ClassRealm[extension>org.eclipse.tycho:tycho-maven-plugin:1.5.0-SNAPSHOT, parent: sun.misc.Launcher$AppClassLoader@7852e922]]
[DEBUG] Looking up lifecyle mappings for packaging pom from ClassRealm[project>testParent.groupId:testparent:0.0.1-SNAPSHOT, parent: ClassRealm[maven.api, parent: null]]
[DEBUG] Extension realms for project testParent.groupId:tests:pom:0.0.1-SNAPSHOT: [ClassRealm[extension>org.eclipse.tycho:tycho-maven-plugin:1.5.0-SNAPSHOT, parent: sun.misc.Launcher$AppClassLoader@7852e922]]
[DEBUG] Looking up lifecyle mappings for packaging pom from ClassRealm[project>testParent.groupId:testparent:0.0.1-SNAPSHOT, parent: ClassRealm[maven.api, parent: null]]
[DEBUG] Extension realms for project testParent.groupId:features:pom:0.0.1-SNAPSHOT: [ClassRealm[extension>org.eclipse.tycho:tycho-maven-plugin:1.5.0-SNAPSHOT, parent: sun.misc.Launcher$AppClassLoader@7852e922]]
[DEBUG] Looking up lifecyle mappings for packaging pom from ClassRealm[project>testParent.groupId:testparent:0.0.1-SNAPSHOT, parent: ClassRealm[maven.api, parent: null]]
[DEBUG] Extension realms for project testParent.groupId:releng:pom:0.0.1-SNAPSHOT: [ClassRealm[extension>org.eclipse.tycho:tycho-maven-plugin:1.5.0-SNAPSHOT, parent: sun.misc.Launcher$AppClassLoader@7852e922]]
[DEBUG] Looking up lifecyle mappings for packaging pom from ClassRealm[project>testParent.groupId:testparent:0.0.1-SNAPSHOT, parent: ClassRealm[maven.api, parent: null]]
[ERROR] [ERROR] Some problems were encountered while processing the POMs:
[WARNING] 'parent.relativePath' of POM testParent.groupId:pomless.bundle:0.1.0-SNAPSHOT (/jobs/genie.tycho/tycho.extras-its/workspace/tycho-extras-its/target/test-classes/testpomless-structured/bundles/bundle1/.polyglot..META-INF_MANIFEST.MF) points at testParent.groupId:bundles instead of testParent.groupId:.., please verify your project structure @ 
[FATAL] Non-resolvable parent POM for testParent.groupId:pomless.bundle:0.1.0-SNAPSHOT: Could not find artifact testParent.groupId:..:pom:0.0.1-SNAPSHOT and 'parent.relativePath' points at wrong local POM @ 
[WARNING] 'parent.relativePath' of POM testParent.groupId:pomless.bundle.tests:1.0.1 (/jobs/genie.tycho/tycho.extras-its/workspace/tycho-extras-its/target/test-classes/testpomless-structured/tests/bundle1.tests/.polyglot..META-INF_MANIFEST.MF) points at testParent.groupId:tests instead of testParent.groupId:.., please verify your project structure @ 
[FATAL] Non-resolvable parent POM for testParent.groupId:pomless.bundle.tests:1.0.1: Could not find artifact testParent.groupId:..:pom:0.0.1-SNAPSHOT and 'parent.relativePath' points at wrong local POM @ 
[WARNING] 'parent.relativePath' of POM testParent.groupId:pomless.feature:1.0.0-SNAPSHOT (/jobs/genie.tycho/tycho.extras-its/workspace/tycho-extras-its/target/test-classes/testpomless-structured/features/feature/.polyglot.feature.xml.takari_issue_192) points at testParent.groupId:features instead of testParent.groupId:.., please verify your project structure @ 
[FATAL] Non-resolvable parent POM for testParent.groupId:pomless.feature:1.0.0-SNAPSHOT: Could not find artifact testParent.groupId:..:pom:0.0.1-SNAPSHOT and 'parent.relativePath' points at wrong local POM @ 
[WARNING] 'parent.relativePath' of POM testParent.groupId:my.test.product.pomless:1.0.0 (/jobs/genie.tycho/tycho.extras-its/workspace/tycho-extras-its/target/test-classes/testpomless-structured/releng/product/.polyglot.test.product) points at testParent.groupId:releng instead of testParent.groupId:.., please verify your project structure @ 
[FATAL] Non-resolvable parent POM for testParent.groupId:my.test.product.pomless:1.0.0: Could not find artifact testParent.groupId:..:pom:0.0.1-SNAPSHOT and 'parent.relativePath' points at wrong local POM @ 
[WARNING] 'parent.relativePath' of POM testParent.groupId:site1.eclipse-repository:0.0.1-SNAPSHOT (/jobs/genie.tycho/tycho.extras-its/workspace/tycho-extras-its/target/test-classes/testpomless-structured/releng/site1/.polyglot.category.xml.takari_issue_192) points at testParent.groupId:releng instead of testParent.groupId:.., please verify your project structure @ 
[FATAL] Non-resolvable parent POM for testParent.groupId:site1.eclipse-repository:0.0.1-SNAPSHOT: Could not find artifact testParent.groupId:..:pom:0.0.1-SNAPSHOT and 'parent.relativePath' points at wrong local POM @ 
[WARNING] 'parent.relativePath' of POM testParent.groupId:targetplatform:0.0.1-SNAPSHOT (/jobs/genie.tycho/tycho.extras-its/workspace/tycho-extras-its/target/test-classes/testpomless-structured/releng/targetplatform/.polyglot.targetplatform.target) points at testParent.groupId:releng instead of testParent.groupId:.., please verify your project structure @ 
[FATAL] Non-resolvable parent POM for testParent.groupId:targetplatform:0.0.1-SNAPSHOT: Could not find artifact testParent.groupId:..:pom:0.0.1-SNAPSHOT and 'parent.relativePath' points at wrong local POM @ 
 @ 
[ERROR] The build could not read 6 projects -> [Help 1]
org.apache.maven.project.ProjectBuildingException: Some problems were encountered while processing the POMs:
[WARNING] 'parent.relativePath' of POM testParent.groupId:pomless.bundle:0.1.0-SNAPSHOT (/jobs/genie.tycho/tycho.extras-its/workspace/tycho-extras-its/target/test-classes/testpomless-structured/bundles/bundle1/.polyglot..META-INF_MANIFEST.MF) points at testParent.groupId:bundles instead of testParent.groupId:.., please verify your project structure @ 
[FATAL] Non-resolvable parent POM for testParent.groupId:pomless.bundle:0.1.0-SNAPSHOT: Could not find artifact testParent.groupId:..:pom:0.0.1-SNAPSHOT and 'parent.relativePath' points at wrong local POM @ 
[WARNING] 'parent.relativePath' of POM testParent.groupId:pomless.bundle.tests:1.0.1 (/jobs/genie.tycho/tycho.extras-its/workspace/tycho-extras-its/target/test-classes/testpomless-structured/tests/bundle1.tests/.polyglot..META-INF_MANIFEST.MF) points at testParent.groupId:tests instead of testParent.groupId:.., please verify your project structure @ 
[FATAL] Non-resolvable parent POM for testParent.groupId:pomless.bundle.tests:1.0.1: Could not find artifact testParent.groupId:..:pom:0.0.1-SNAPSHOT and 'parent.relativePath' points at wrong local POM @ 
[WARNING] 'parent.relativePath' of POM testParent.groupId:pomless.feature:1.0.0-SNAPSHOT (/jobs/genie.tycho/tycho.extras-its/workspace/tycho-extras-its/target/test-classes/testpomless-structured/features/feature/.polyglot.feature.xml.takari_issue_192) points at testParent.groupId:features instead of testParent.groupId:.., please verify your project structure @ 
[FATAL] Non-resolvable parent POM for testParent.groupId:pomless.feature:1.0.0-SNAPSHOT: Could not find artifact testParent.groupId:..:pom:0.0.1-SNAPSHOT and 'parent.relativePath' points at wrong local POM @ 
[WARNING] 'parent.relativePath' of POM testParent.groupId:my.test.product.pomless:1.0.0 (/jobs/genie.tycho/tycho.extras-its/workspace/tycho-extras-its/target/test-classes/testpomless-structured/releng/product/.polyglot.test.product) points at testParent.groupId:releng instead of testParent.groupId:.., please verify your project structure @ 
[FATAL] Non-resolvable parent POM for testParent.groupId:my.test.product.pomless:1.0.0: Could not find artifact testParent.groupId:..:pom:0.0.1-SNAPSHOT and 'parent.relativePath' points at wrong local POM @ 
[WARNING] 'parent.relativePath' of POM testParent.groupId:site1.eclipse-repository:0.0.1-SNAPSHOT (/jobs/genie.tycho/tycho.extras-its/workspace/tycho-extras-its/target/test-classes/testpomless-structured/releng/site1/.polyglot.category.xml.takari_issue_192) points at testParent.groupId:releng instead of testParent.groupId:.., please verify your project structure @ 
[FATAL] Non-resolvable parent POM for testParent.groupId:site1.eclipse-repository:0.0.1-SNAPSHOT: Could not find artifact testParent.groupId:..:pom:0.0.1-SNAPSHOT and 'parent.relativePath' points at wrong local POM @ 
[WARNING] 'parent.relativePath' of POM testParent.groupId:targetplatform:0.0.1-SNAPSHOT (/jobs/genie.tycho/tycho.extras-its/workspace/tycho-extras-its/target/test-classes/testpomless-structured/releng/targetplatform/.polyglot.targetplatform.target) points at testParent.groupId:releng instead of testParent.groupId:.., please verify your project structure @ 
[FATAL] Non-resolvable parent POM for testParent.groupId:targetplatform:0.0.1-SNAPSHOT: Could not find artifact testParent.groupId:..:pom:0.0.1-SNAPSHOT and 'parent.relativePath' points at wrong local POM @ 

	at org.apache.maven.project.DefaultProjectBuilder.build(DefaultProjectBuilder.java:422)
	at org.apache.maven.graph.DefaultGraphBuilder.collectProjects(DefaultGraphBuilder.java:419)
	at org.apache.maven.graph.DefaultGraphBuilder.getProjectsForMavenReactor(DefaultGraphBuilder.java:410)
	at org.apache.maven.graph.DefaultGraphBuilder.build(DefaultGraphBuilder.java:83)
	at org.apache.maven.DefaultMaven.buildGraph(DefaultMaven.java:491)
	at org.apache.maven.DefaultMaven.doExecute(DefaultMaven.java:219)
	at org.apache.maven.DefaultMaven.doExecute(DefaultMaven.java:193)
	at org.apache.maven.DefaultMaven.execute(DefaultMaven.java:106)
	at org.apache.maven.cli.MavenCli.execute(MavenCli.java:862)
	at org.apache.maven.cli.MavenCli.doMain(MavenCli.java:286)
	at org.apache.maven.cli.MavenCli.main(MavenCli.java:197)
	at sun.reflect.NativeMethodAccessorImpl.invoke0(Native Method)
	at sun.reflect.NativeMethodAccessorImpl.invoke(NativeMethodAccessorImpl.java:62)
	at sun.reflect.DelegatingMethodAccessorImpl.invoke(DelegatingMethodAccessorImpl.java:43)
	at java.lang.reflect.Method.invoke(Method.java:498)
	at org.codehaus.plexus.classworlds.launcher.Launcher.launchEnhanced(Launcher.java:289)
	at org.codehaus.plexus.classworlds.launcher.Launcher.launch(Launcher.java:229)
	at org.codehaus.plexus.classworlds.launcher.Launcher.mainWithExitCode(Launcher.java:415)
	at org.codehaus.plexus.classworlds.launcher.Launcher.main(Launcher.java:356)
[ERROR]   
[ERROR]   The project testParent.groupId:pomless.bundle:0.1.0-SNAPSHOT (/jobs/genie.tycho/tycho.extras-its/workspace/tycho-extras-its/target/test-classes/testpomless-structured/bundles/bundle1/.polyglot..META-INF_MANIFEST.MF) has 1 error
[ERROR]     Non-resolvable parent POM for testParent.groupId:pomless.bundle:0.1.0-SNAPSHOT: Could not find artifact testParent.groupId:..:pom:0.0.1-SNAPSHOT and 'parent.relativePath' points at wrong local POM -> [Help 2]
org.apache.maven.model.resolution.UnresolvableModelException: Could not find artifact testParent.groupId:..:pom:0.0.1-SNAPSHOT
	at org.apache.maven.project.ProjectModelResolver.resolveModel(ProjectModelResolver.java:197)
	at org.apache.maven.project.ProjectModelResolver.resolveModel(ProjectModelResolver.java:246)
	at org.apache.maven.model.building.DefaultModelBuilder.readParentExternally(DefaultModelBuilder.java:978)
	at org.apache.maven.model.building.DefaultModelBuilder.readParent(DefaultModelBuilder.java:796)
	at org.apache.maven.model.building.DefaultModelBuilder.build(DefaultModelBuilder.java:325)
	at org.apache.maven.project.DefaultProjectBuilder.build(DefaultProjectBuilder.java:469)
	at org.apache.maven.project.DefaultProjectBuilder.build(DefaultProjectBuilder.java:438)
	at org.apache.maven.project.DefaultProjectBuilder.build(DefaultProjectBuilder.java:555)
	at org.apache.maven.project.DefaultProjectBuilder.build(DefaultProjectBuilder.java:438)
	at org.apache.maven.project.DefaultProjectBuilder.build(DefaultProjectBuilder.java:555)
	at org.apache.maven.project.DefaultProjectBuilder.build(DefaultProjectBuilder.java:438)
	at org.apache.maven.project.DefaultProjectBuilder.build(DefaultProjectBuilder.java:401)
	at org.apache.maven.graph.DefaultGraphBuilder.collectProjects(DefaultGraphBuilder.java:419)
	at org.apache.maven.graph.DefaultGraphBuilder.getProjectsForMavenReactor(DefaultGraphBuilder.java:410)
	at org.apache.maven.graph.DefaultGraphBuilder.build(DefaultGraphBuilder.java:83)
	at org.apache.maven.DefaultMaven.buildGraph(DefaultMaven.java:491)
	at org.apache.maven.DefaultMaven.doExecute(DefaultMaven.java:219)
	at org.apache.maven.DefaultMaven.doExecute(DefaultMaven.java:193)
	at org.apache.maven.DefaultMaven.execute(DefaultMaven.java:106)
	at org.apache.maven.cli.MavenCli.execute(MavenCli.java:862)
	at org.apache.maven.cli.MavenCli.doMain(MavenCli.java:286)
	at org.apache.maven.cli.MavenCli.main(MavenCli.java:197)
	at sun.reflect.NativeMethodAccessorImpl.invoke0(Native Method)
	at sun.reflect.NativeMethodAccessorImpl.invoke(NativeMethodAccessorImpl.java:62)
	at sun.reflect.DelegatingMethodAccessorImpl.invoke(DelegatingMethodAccessorImpl.java:43)
	at java.lang.reflect.Method.invoke(Method.java:498)
	at org.codehaus.plexus.classworlds.launcher.Launcher.launchEnhanced(Launcher.java:289)
	at org.codehaus.plexus.classworlds.launcher.Launcher.launch(Launcher.java:229)
	at org.codehaus.plexus.classworlds.launcher.Launcher.mainWithExitCode(Launcher.java:415)
	at org.codehaus.plexus.classworlds.launcher.Launcher.main(Launcher.java:356)
Caused by: org.eclipse.aether.resolution.ArtifactResolutionException: Could not find artifact testParent.groupId:..:pom:0.0.1-SNAPSHOT
	at org.eclipse.aether.internal.impl.DefaultArtifactResolver.resolve(DefaultArtifactResolver.java:444)
	at org.eclipse.aether.internal.impl.DefaultArtifactResolver.resolveArtifacts(DefaultArtifactResolver.java:246)
	at org.eclipse.aether.internal.impl.DefaultArtifactResolver.resolveArtifact(DefaultArtifactResolver.java:223)
	at org.eclipse.aether.internal.impl.DefaultRepositorySystem.resolveArtifact(DefaultRepositorySystem.java:294)
	at org.apache.maven.project.ProjectModelResolver.resolveModel(ProjectModelResolver.java:193)
	... 29 more
Caused by: org.eclipse.aether.transfer.ArtifactNotFoundException: Could not find artifact testParent.groupId:..:pom:0.0.1-SNAPSHOT
	at org.eclipse.aether.internal.impl.DefaultArtifactResolver.resolve(DefaultArtifactResolver.java:434)
	... 33 more
[ERROR]   
[ERROR]   The project testParent.groupId:pomless.bundle.tests:1.0.1 (/jobs/genie.tycho/tycho.extras-its/workspace/tycho-extras-its/target/test-classes/testpomless-structured/tests/bundle1.tests/.polyglot..META-INF_MANIFEST.MF) has 1 error
[ERROR]     Non-resolvable parent POM for testParent.groupId:pomless.bundle.tests:1.0.1: Could not find artifact testParent.groupId:..:pom:0.0.1-SNAPSHOT and 'parent.relativePath' points at wrong local POM -> [Help 2]
org.apache.maven.model.resolution.UnresolvableModelException: Could not find artifact testParent.groupId:..:pom:0.0.1-SNAPSHOT
	at org.apache.maven.project.ProjectModelResolver.resolveModel(ProjectModelResolver.java:197)
	at org.apache.maven.project.ProjectModelResolver.resolveModel(ProjectModelResolver.java:246)
	at org.apache.maven.model.building.DefaultModelBuilder.readParentExternally(DefaultModelBuilder.java:978)
	at org.apache.maven.model.building.DefaultModelBuilder.readParent(DefaultModelBuilder.java:796)
	at org.apache.maven.model.building.DefaultModelBuilder.build(DefaultModelBuilder.java:325)
	at org.apache.maven.project.DefaultProjectBuilder.build(DefaultProjectBuilder.java:469)
	at org.apache.maven.project.DefaultProjectBuilder.build(DefaultProjectBuilder.java:438)
	at org.apache.maven.project.DefaultProjectBuilder.build(DefaultProjectBuilder.java:555)
	at org.apache.maven.project.DefaultProjectBuilder.build(DefaultProjectBuilder.java:438)
	at org.apache.maven.project.DefaultProjectBuilder.build(DefaultProjectBuilder.java:555)
	at org.apache.maven.project.DefaultProjectBuilder.build(DefaultProjectBuilder.java:438)
	at org.apache.maven.project.DefaultProjectBuilder.build(DefaultProjectBuilder.java:401)
	at org.apache.maven.graph.DefaultGraphBuilder.collectProjects(DefaultGraphBuilder.java:419)
	at org.apache.maven.graph.DefaultGraphBuilder.getProjectsForMavenReactor(DefaultGraphBuilder.java:410)
	at org.apache.maven.graph.DefaultGraphBuilder.build(DefaultGraphBuilder.java:83)
	at org.apache.maven.DefaultMaven.buildGraph(DefaultMaven.java:491)
	at org.apache.maven.DefaultMaven.doExecute(DefaultMaven.java:219)
	at org.apache.maven.DefaultMaven.doExecute(DefaultMaven.java:193)
	at org.apache.maven.DefaultMaven.execute(DefaultMaven.java:106)
	at org.apache.maven.cli.MavenCli.execute(MavenCli.java:862)
	at org.apache.maven.cli.MavenCli.doMain(MavenCli.java:286)
	at org.apache.maven.cli.MavenCli.main(MavenCli.java:197)
	at sun.reflect.NativeMethodAccessorImpl.invoke0(Native Method)
	at sun.reflect.NativeMethodAccessorImpl.invoke(NativeMethodAccessorImpl.java:62)
	at sun.reflect.DelegatingMethodAccessorImpl.invoke(DelegatingMethodAccessorImpl.java:43)
	at java.lang.reflect.Method.invoke(Method.java:498)
	at org.codehaus.plexus.classworlds.launcher.Launcher.launchEnhanced(Launcher.java:289)
	at org.codehaus.plexus.classworlds.launcher.Launcher.launch(Launcher.java:229)
	at org.codehaus.plexus.classworlds.launcher.Launcher.mainWithExitCode(Launcher.java:415)
	at org.codehaus.plexus.classworlds.launcher.Launcher.main(Launcher.java:356)
Caused by: org.eclipse.aether.resolution.ArtifactResolutionException: Could not find artifact testParent.groupId:..:pom:0.0.1-SNAPSHOT
	at org.eclipse.aether.internal.impl.DefaultArtifactResolver.resolve(DefaultArtifactResolver.java:444)
	at org.eclipse.aether.internal.impl.DefaultArtifactResolver.resolveArtifacts(DefaultArtifactResolver.java:246)
	at org.eclipse.aether.internal.impl.DefaultArtifactResolver.resolveArtifact(DefaultArtifactResolver.java:223)
	at org.eclipse.aether.internal.impl.DefaultRepositorySystem.resolveArtifact(DefaultRepositorySystem.java:294)
	at org.apache.maven.project.ProjectModelResolver.resolveModel(ProjectModelResolver.java:193)
	... 29 more
Caused by: org.eclipse.aether.transfer.ArtifactNotFoundException: Could not find artifact testParent.groupId:..:pom:0.0.1-SNAPSHOT
	at org.eclipse.aether.internal.impl.DefaultArtifactResolver.resolve(DefaultArtifactResolver.java:434)
	... 33 more
[ERROR]   
[ERROR]   The project testParent.groupId:pomless.feature:1.0.0-SNAPSHOT (/jobs/genie.tycho/tycho.extras-its/workspace/tycho-extras-its/target/test-classes/testpomless-structured/features/feature/.polyglot.feature.xml.takari_issue_192) has 1 error
[ERROR]     Non-resolvable parent POM for testParent.groupId:pomless.feature:1.0.0-SNAPSHOT: Could not find artifact testParent.groupId:..:pom:0.0.1-SNAPSHOT and 'parent.relativePath' points at wrong local POM -> [Help 2]
org.apache.maven.model.resolution.UnresolvableModelException: Could not find artifact testParent.groupId:..:pom:0.0.1-SNAPSHOT
	at org.apache.maven.project.ProjectModelResolver.resolveModel(ProjectModelResolver.java:197)
	at org.apache.maven.project.ProjectModelResolver.resolveModel(ProjectModelResolver.java:246)
	at org.apache.maven.model.building.DefaultModelBuilder.readParentExternally(DefaultModelBuilder.java:978)
	at org.apache.maven.model.building.DefaultModelBuilder.readParent(DefaultModelBuilder.java:796)
	at org.apache.maven.model.building.DefaultModelBuilder.build(DefaultModelBuilder.java:325)
	at org.apache.maven.project.DefaultProjectBuilder.build(DefaultProjectBuilder.java:469)
	at org.apache.maven.project.DefaultProjectBuilder.build(DefaultProjectBuilder.java:438)
	at org.apache.maven.project.DefaultProjectBuilder.build(DefaultProjectBuilder.java:555)
	at org.apache.maven.project.DefaultProjectBuilder.build(DefaultProjectBuilder.java:438)
	at org.apache.maven.project.DefaultProjectBuilder.build(DefaultProjectBuilder.java:555)
	at org.apache.maven.project.DefaultProjectBuilder.build(DefaultProjectBuilder.java:438)
	at org.apache.maven.project.DefaultProjectBuilder.build(DefaultProjectBuilder.java:401)
	at org.apache.maven.graph.DefaultGraphBuilder.collectProjects(DefaultGraphBuilder.java:419)
	at org.apache.maven.graph.DefaultGraphBuilder.getProjectsForMavenReactor(DefaultGraphBuilder.java:410)
	at org.apache.maven.graph.DefaultGraphBuilder.build(DefaultGraphBuilder.java:83)
	at org.apache.maven.DefaultMaven.buildGraph(DefaultMaven.java:491)
	at org.apache.maven.DefaultMaven.doExecute(DefaultMaven.java:219)
	at org.apache.maven.DefaultMaven.doExecute(DefaultMaven.java:193)
	at org.apache.maven.DefaultMaven.execute(DefaultMaven.java:106)
	at org.apache.maven.cli.MavenCli.execute(MavenCli.java:862)
	at org.apache.maven.cli.MavenCli.doMain(MavenCli.java:286)
	at org.apache.maven.cli.MavenCli.main(MavenCli.java:197)
	at sun.reflect.NativeMethodAccessorImpl.invoke0(Native Method)
	at sun.reflect.NativeMethodAccessorImpl.invoke(NativeMethodAccessorImpl.java:62)
	at sun.reflect.DelegatingMethodAccessorImpl.invoke(DelegatingMethodAccessorImpl.java:43)
	at java.lang.reflect.Method.invoke(Method.java:498)
	at org.codehaus.plexus.classworlds.launcher.Launcher.launchEnhanced(Launcher.java:289)
	at org.codehaus.plexus.classworlds.launcher.Launcher.launch(Launcher.java:229)
	at org.codehaus.plexus.classworlds.launcher.Launcher.mainWithExitCode(Launcher.java:415)
	at org.codehaus.plexus.classworlds.launcher.Launcher.main(Launcher.java:356)
Caused by: org.eclipse.aether.resolution.ArtifactResolutionException: Could not find artifact testParent.groupId:..:pom:0.0.1-SNAPSHOT
	at org.eclipse.aether.internal.impl.DefaultArtifactResolver.resolve(DefaultArtifactResolver.java:444)
	at org.eclipse.aether.internal.impl.DefaultArtifactResolver.resolveArtifacts(DefaultArtifactResolver.java:246)
	at org.eclipse.aether.internal.impl.DefaultArtifactResolver.resolveArtifact(DefaultArtifactResolver.java:223)
	at org.eclipse.aether.internal.impl.DefaultRepositorySystem.resolveArtifact(DefaultRepositorySystem.java:294)
	at org.apache.maven.project.ProjectModelResolver.resolveModel(ProjectModelResolver.java:193)
	... 29 more
Caused by: org.eclipse.aether.transfer.ArtifactNotFoundException: Could not find artifact testParent.groupId:..:pom:0.0.1-SNAPSHOT
	at org.eclipse.aether.internal.impl.DefaultArtifactResolver.resolve(DefaultArtifactResolver.java:434)
	... 33 more
[ERROR]   
[ERROR]   The project testParent.groupId:my.test.product.pomless:1.0.0 (/jobs/genie.tycho/tycho.extras-its/workspace/tycho-extras-its/target/test-classes/testpomless-structured/releng/product/.polyglot.test.product) has 1 error
[ERROR]     Non-resolvable parent POM for testParent.groupId:my.test.product.pomless:1.0.0: Could not find artifact testParent.groupId:..:pom:0.0.1-SNAPSHOT and 'parent.relativePath' points at wrong local POM -> [Help 2]
org.apache.maven.model.resolution.UnresolvableModelException: Could not find artifact testParent.groupId:..:pom:0.0.1-SNAPSHOT
	at org.apache.maven.project.ProjectModelResolver.resolveModel(ProjectModelResolver.java:197)
	at org.apache.maven.project.ProjectModelResolver.resolveModel(ProjectModelResolver.java:246)
	at org.apache.maven.model.building.DefaultModelBuilder.readParentExternally(DefaultModelBuilder.java:978)
	at org.apache.maven.model.building.DefaultModelBuilder.readParent(DefaultModelBuilder.java:796)
	at org.apache.maven.model.building.DefaultModelBuilder.build(DefaultModelBuilder.java:325)
	at org.apache.maven.project.DefaultProjectBuilder.build(DefaultProjectBuilder.java:469)
	at org.apache.maven.project.DefaultProjectBuilder.build(DefaultProjectBuilder.java:438)
	at org.apache.maven.project.DefaultProjectBuilder.build(DefaultProjectBuilder.java:555)
	at org.apache.maven.project.DefaultProjectBuilder.build(DefaultProjectBuilder.java:438)
	at org.apache.maven.project.DefaultProjectBuilder.build(DefaultProjectBuilder.java:555)
	at org.apache.maven.project.DefaultProjectBuilder.build(DefaultProjectBuilder.java:438)
	at org.apache.maven.project.DefaultProjectBuilder.build(DefaultProjectBuilder.java:401)
	at org.apache.maven.graph.DefaultGraphBuilder.collectProjects(DefaultGraphBuilder.java:419)
	at org.apache.maven.graph.DefaultGraphBuilder.getProjectsForMavenReactor(DefaultGraphBuilder.java:410)
	at org.apache.maven.graph.DefaultGraphBuilder.build(DefaultGraphBuilder.java:83)
	at org.apache.maven.DefaultMaven.buildGraph(DefaultMaven.java:491)
	at org.apache.maven.DefaultMaven.doExecute(DefaultMaven.java:219)
	at org.apache.maven.DefaultMaven.doExecute(DefaultMaven.java:193)
	at org.apache.maven.DefaultMaven.execute(DefaultMaven.java:106)
	at org.apache.maven.cli.MavenCli.execute(MavenCli.java:862)
	at org.apache.maven.cli.MavenCli.doMain(MavenCli.java:286)
	at org.apache.maven.cli.MavenCli.main(MavenCli.java:197)
	at sun.reflect.NativeMethodAccessorImpl.invoke0(Native Method)
	at sun.reflect.NativeMethodAccessorImpl.invoke(NativeMethodAccessorImpl.java:62)
	at sun.reflect.DelegatingMethodAccessorImpl.invoke(DelegatingMethodAccessorImpl.java:43)
	at java.lang.reflect.Method.invoke(Method.java:498)
	at org.codehaus.plexus.classworlds.launcher.Launcher.launchEnhanced(Launcher.java:289)
	at org.codehaus.plexus.classworlds.launcher.Launcher.launch(Launcher.java:229)
	at org.codehaus.plexus.classworlds.launcher.Launcher.mainWithExitCode(Launcher.java:415)
	at org.codehaus.plexus.classworlds.launcher.Launcher.main(Launcher.java:356)
Caused by: org.eclipse.aether.resolution.ArtifactResolutionException: Could not find artifact testParent.groupId:..:pom:0.0.1-SNAPSHOT
	at org.eclipse.aether.internal.impl.DefaultArtifactResolver.resolve(DefaultArtifactResolver.java:444)
	at org.eclipse.aether.internal.impl.DefaultArtifactResolver.resolveArtifacts(DefaultArtifactResolver.java:246)
	at org.eclipse.aether.internal.impl.DefaultArtifactResolver.resolveArtifact(DefaultArtifactResolver.java:223)
	at org.eclipse.aether.internal.impl.DefaultRepositorySystem.resolveArtifact(DefaultRepositorySystem.java:294)
	at org.apache.maven.project.ProjectModelResolver.resolveModel(ProjectModelResolver.java:193)
	... 29 more
Caused by: org.eclipse.aether.transfer.ArtifactNotFoundException: Could not find artifact testParent.groupId:..:pom:0.0.1-SNAPSHOT
	at org.eclipse.aether.internal.impl.DefaultArtifactResolver.resolve(DefaultArtifactResolver.java:434)
	... 33 more
[ERROR]   
[ERROR]   The project testParent.groupId:site1.eclipse-repository:0.0.1-SNAPSHOT (/jobs/genie.tycho/tycho.extras-its/workspace/tycho-extras-its/target/test-classes/testpomless-structured/releng/site1/.polyglot.category.xml.takari_issue_192) has 1 error
[ERROR]     Non-resolvable parent POM for testParent.groupId:site1.eclipse-repository:0.0.1-SNAPSHOT: Could not find artifact testParent.groupId:..:pom:0.0.1-SNAPSHOT and 'parent.relativePath' points at wrong local POM -> [Help 2]
org.apache.maven.model.resolution.UnresolvableModelException: Could not find artifact testParent.groupId:..:pom:0.0.1-SNAPSHOT
	at org.apache.maven.project.ProjectModelResolver.resolveModel(ProjectModelResolver.java:197)
	at org.apache.maven.project.ProjectModelResolver.resolveModel(ProjectModelResolver.java:246)
	at org.apache.maven.model.building.DefaultModelBuilder.readParentExternally(DefaultModelBuilder.java:978)
	at org.apache.maven.model.building.DefaultModelBuilder.readParent(DefaultModelBuilder.java:796)
	at org.apache.maven.model.building.DefaultModelBuilder.build(DefaultModelBuilder.java:325)
	at org.apache.maven.project.DefaultProjectBuilder.build(DefaultProjectBuilder.java:469)
	at org.apache.maven.project.DefaultProjectBuilder.build(DefaultProjectBuilder.java:438)
	at org.apache.maven.project.DefaultProjectBuilder.build(DefaultProjectBuilder.java:555)
	at org.apache.maven.project.DefaultProjectBuilder.build(DefaultProjectBuilder.java:438)
	at org.apache.maven.project.DefaultProjectBuilder.build(DefaultProjectBuilder.java:555)
	at org.apache.maven.project.DefaultProjectBuilder.build(DefaultProjectBuilder.java:438)
	at org.apache.maven.project.DefaultProjectBuilder.build(DefaultProjectBuilder.java:401)
	at org.apache.maven.graph.DefaultGraphBuilder.collectProjects(DefaultGraphBuilder.java:419)
	at org.apache.maven.graph.DefaultGraphBuilder.getProjectsForMavenReactor(DefaultGraphBuilder.java:410)
	at org.apache.maven.graph.DefaultGraphBuilder.build(DefaultGraphBuilder.java:83)
	at org.apache.maven.DefaultMaven.buildGraph(DefaultMaven.java:491)
	at org.apache.maven.DefaultMaven.doExecute(DefaultMaven.java:219)
	at org.apache.maven.DefaultMaven.doExecute(DefaultMaven.java:193)
	at org.apache.maven.DefaultMaven.execute(DefaultMaven.java:106)
	at org.apache.maven.cli.MavenCli.execute(MavenCli.java:862)
	at org.apache.maven.cli.MavenCli.doMain(MavenCli.java:286)
	at org.apache.maven.cli.MavenCli.main(MavenCli.java:197)
	at sun.reflect.NativeMethodAccessorImpl.invoke0(Native Method)
	at sun.reflect.NativeMethodAccessorImpl.invoke(NativeMethodAccessorImpl.java:62)
	at sun.reflect.DelegatingMethodAccessorImpl.invoke(DelegatingMethodAccessorImpl.java:43)
	at java.lang.reflect.Method.invoke(Method.java:498)
	at org.codehaus.plexus.classworlds.launcher.Launcher.launchEnhanced(Launcher.java:289)
	at org.codehaus.plexus.classworlds.launcher.Launcher.launch(Launcher.java:229)
	at org.codehaus.plexus.classworlds.launcher.Launcher.mainWithExitCode(Launcher.java:415)
	at org.codehaus.plexus.classworlds.launcher.Launcher.main(Launcher.java:356)
Caused by: org.eclipse.aether.resolution.ArtifactResolutionException: Could not find artifact testParent.groupId:..:pom:0.0.1-SNAPSHOT
	at org.eclipse.aether.internal.impl.DefaultArtifactResolver.resolve(DefaultArtifactResolver.java:444)
	at org.eclipse.aether.internal.impl.DefaultArtifactResolver.resolveArtifacts(DefaultArtifactResolver.java:246)
	at org.eclipse.aether.internal.impl.DefaultArtifactResolver.resolveArtifact(DefaultArtifactResolver.java:223)
	at org.eclipse.aether.internal.impl.DefaultRepositorySystem.resolveArtifact(DefaultRepositorySystem.java:294)
	at org.apache.maven.project.ProjectModelResolver.resolveModel(ProjectModelResolver.java:193)
	... 29 more
Caused by: org.eclipse.aether.transfer.ArtifactNotFoundException: Could not find artifact testParent.groupId:..:pom:0.0.1-SNAPSHOT
	at org.eclipse.aether.internal.impl.DefaultArtifactResolver.resolve(DefaultArtifactResolver.java:434)
	... 33 more
[ERROR]   
[ERROR]   The project testParent.groupId:targetplatform:0.0.1-SNAPSHOT (/jobs/genie.tycho/tycho.extras-its/workspace/tycho-extras-its/target/test-classes/testpomless-structured/releng/targetplatform/.polyglot.targetplatform.target) has 1 error
[ERROR]     Non-resolvable parent POM for testParent.groupId:targetplatform:0.0.1-SNAPSHOT: Could not find artifact testParent.groupId:..:pom:0.0.1-SNAPSHOT and 'parent.relativePath' points at wrong local POM -> [Help 2]
org.apache.maven.model.resolution.UnresolvableModelException: Could not find artifact testParent.groupId:..:pom:0.0.1-SNAPSHOT
	at org.apache.maven.project.ProjectModelResolver.resolveModel(ProjectModelResolver.java:197)
	at org.apache.maven.project.ProjectModelResolver.resolveModel(ProjectModelResolver.java:246)
	at org.apache.maven.model.building.DefaultModelBuilder.readParentExternally(DefaultModelBuilder.java:978)
	at org.apache.maven.model.building.DefaultModelBuilder.readParent(DefaultModelBuilder.java:796)
	at org.apache.maven.model.building.DefaultModelBuilder.build(DefaultModelBuilder.java:325)
	at org.apache.maven.project.DefaultProjectBuilder.build(DefaultProjectBuilder.java:469)
	at org.apache.maven.project.DefaultProjectBuilder.build(DefaultProjectBuilder.java:438)
	at org.apache.maven.project.DefaultProjectBuilder.build(DefaultProjectBuilder.java:555)
	at org.apache.maven.project.DefaultProjectBuilder.build(DefaultProjectBuilder.java:438)
	at org.apache.maven.project.DefaultProjectBuilder.build(DefaultProjectBuilder.java:555)
	at org.apache.maven.project.DefaultProjectBuilder.build(DefaultProjectBuilder.java:438)
	at org.apache.maven.project.DefaultProjectBuilder.build(DefaultProjectBuilder.java:401)
	at org.apache.maven.graph.DefaultGraphBuilder.collectProjects(DefaultGraphBuilder.java:419)
	at org.apache.maven.graph.DefaultGraphBuilder.getProjectsForMavenReactor(DefaultGraphBuilder.java:410)
	at org.apache.maven.graph.DefaultGraphBuilder.build(DefaultGraphBuilder.java:83)
	at org.apache.maven.DefaultMaven.buildGraph(DefaultMaven.java:491)
	at org.apache.maven.DefaultMaven.doExecute(DefaultMaven.java:219)
	at org.apache.maven.DefaultMaven.doExecute(DefaultMaven.java:193)
	at org.apache.maven.DefaultMaven.execute(DefaultMaven.java:106)
	at org.apache.maven.cli.MavenCli.execute(MavenCli.java:862)
	at org.apache.maven.cli.MavenCli.doMain(MavenCli.java:286)
	at org.apache.maven.cli.MavenCli.main(MavenCli.java:197)
	at sun.reflect.NativeMethodAccessorImpl.invoke0(Native Method)
	at sun.reflect.NativeMethodAccessorImpl.invoke(NativeMethodAccessorImpl.java:62)
	at sun.reflect.DelegatingMethodAccessorImpl.invoke(DelegatingMethodAccessorImpl.java:43)
	at java.lang.reflect.Method.invoke(Method.java:498)
	at org.codehaus.plexus.classworlds.launcher.Launcher.launchEnhanced(Launcher.java:289)
	at org.codehaus.plexus.classworlds.launcher.Launcher.launch(Launcher.java:229)
	at org.codehaus.plexus.classworlds.launcher.Launcher.mainWithExitCode(Launcher.java:415)
	at org.codehaus.plexus.classworlds.launcher.Launcher.main(Launcher.java:356)
Caused by: org.eclipse.aether.resolution.ArtifactResolutionException: Could not find artifact testParent.groupId:..:pom:0.0.1-SNAPSHOT
	at org.eclipse.aether.internal.impl.DefaultArtifactResolver.resolve(DefaultArtifactResolver.java:444)
	at org.eclipse.aether.internal.impl.DefaultArtifactResolver.resolveArtifacts(DefaultArtifactResolver.java:246)
	at org.eclipse.aether.internal.impl.DefaultArtifactResolver.resolveArtifact(DefaultArtifactResolver.java:223)
	at org.eclipse.aether.internal.impl.DefaultRepositorySystem.resolveArtifact(DefaultRepositorySystem.java:294)
	at org.apache.maven.project.ProjectModelResolver.resolveModel(ProjectModelResolver.java:193)
	... 29 more
Caused by: org.eclipse.aether.transfer.ArtifactNotFoundException: Could not find artifact testParent.groupId:..:pom:0.0.1-SNAPSHOT
	at org.eclipse.aether.internal.impl.DefaultArtifactResolver.resolve(DefaultArtifactResolver.java:434)
	... 33 more
[ERROR] 
[ERROR] 
[ERROR] For more information about the errors and possible solutions, please read the following articles:
[ERROR] [Help 1] http://cwiki.apache.org/confluence/display/MAVEN/ProjectBuildingException
[ERROR] [Help 2] http://cwiki.apache.org/confluence/display/MAVEN/UnresolvableModelException

	at org.eclipse.tycho.extras.pomless.TychoPomlessStructuredITest.testPomlessBuildExtension(TychoPomlessStructuredITest.java:29)

[INFO] Running org.eclipse.tycho.extras.pde.TestListDependencies
[INFO] Tests run: 2, Failures: 0, Errors: 0, Skipped: 0, Time elapsed: 14.254 s - in org.eclipse.tycho.extras.pde.TestListDependencies
[INFO] Tests run: 2, Failures: 0, Errors: 0, Skipped: 0, Time elapsed: 63.058 s - in org.eclipse.tycho.extras.pomless.TychoPomlessITest
[INFO] 
[INFO] Results:
[INFO] 
[ERROR] Errors: 
[ERROR]   TychoPomlessStructuredITest.testPomlessBuildExtension:29 » Verification Exit c...
[INFO] 
[ERROR] Tests run: 6, Failures: 0, Errors: 1, Skipped: 0
[INFO] 
[INFO] ------------------------------------------------------------------------
[INFO] Reactor Summary for Tycho Extras 1.5.0-SNAPSHOT:
[INFO] 
[INFO] Tycho Extras ....................................... SUCCESS [  0.900 s]
[INFO] p2 Extras Plugin ................................... SUCCESS [03:49 min]
[INFO] Tycho Document Bundle Plugin ....................... SUCCESS [ 43.348 s]
[INFO] Tycho Version Bump Plugin .......................... SUCCESS [ 14.897 s]
[INFO] Source Feature Generation Plugin ................... SUCCESS [01:53 min]
[INFO] tycho-custom-bundle-plugin ......................... SUCCESS [ 48.897 s]
[INFO] Eclipserun Plugin .................................. SUCCESS [ 41.790 s]
[INFO] tycho-pack200 ...................................... SUCCESS [  0.006 s]
[INFO] tycho-pack200-impl ................................. SUCCESS [  2.912 s]
[INFO] Pack200 Normalization Plugin ....................... SUCCESS [  0.331 s]
[INFO] Pack200 Pack Plugin ................................ SUCCESS [  0.267 s]
[INFO] tycho-pack200-its .................................. SUCCESS [ 29.438 s]
[INFO] tycho-buildtimestamp-jgit .......................... SUCCESS [01:31 min]
[INFO] tycho-sourceref-jgit ............................... SUCCESS [  2.840 s]
[INFO] Target Platform Validation Plugin .................. SUCCESS [01:35 min]
[INFO] Tycho POM-less build extension ..................... SUCCESS [  3.259 s]
[INFO] Tycho Dependency Tools Plugin ...................... SUCCESS [  0.866 s]
[INFO] Tycho Extras Integration Tests ..................... FAILURE [01:08 min]
[INFO] ------------------------------------------------------------------------
[INFO] BUILD FAILURE
[INFO] ------------------------------------------------------------------------
[INFO] Total time:  13:09 min
[INFO] Finished at: 2019-08-27T06:45:19-04:00
[INFO] ------------------------------------------------------------------------
[ERROR] Failed to execute goal org.apache.maven.plugins:maven-surefire-plugin:2.22.0:test (default-test) on project tycho-extras-its: There are test failures.
[ERROR] 
[ERROR] Please refer to /jobs/genie.tycho/tycho.extras-its/workspace/tycho-extras-its/target/surefire-reports for the individual test results.
[ERROR] Please refer to dump files (if any exist) [date]-jvmRun[N].dump, [date].dumpstream and [date]-jvmRun[N].dumpstream.
[ERROR] -> [Help 1]
[ERROR] 
[ERROR] To see the full stack trace of the errors, re-run Maven with the -e switch.
[ERROR] Re-run Maven using the -X switch to enable full debug logging.
[ERROR] 
[ERROR] For more information about the errors and possible solutions, please read the following articles:
[ERROR] [Help 1] http://cwiki.apache.org/confluence/display/MAVEN/MojoFailureException
[ERROR] 
[ERROR] After correcting the problems, you can resume the build with the command
[ERROR]   mvn <goals> -rf :tycho-extras-its
Build step 'Invoke top-level Maven targets' marked build as failure
Sending e-mails to: jan.sievers@sap.com mistria@redhat.com akurtako@redhat.com m.schreiber@bachmann.info
Recording test results
Started calculate disk usage of build
Finished Calculation of disk usage of build in 0 seconds
Started calculate disk usage of workspace
Finished Calculation of disk usage of workspace in 0 seconds
Finished: FAILURE