FailedConsole Output

Skipping 500 KB.. Full Log
----------------------------------------
[INFO]  T E S T S
[INFO] -------------------------------------------------------
[INFO] Running org.eclipse.tycho.pomgenerator.test.GeneratePomsMojoTest
[INFO] Scanning /jobs/genie.tycho/tycho-sonar/workspace/tycho-pomgenerator-plugin/target/projects/tests basedir
[WARNING] Old style update site found for /jobs/genie.tycho/tycho-sonar/workspace/tycho-pomgenerator-plugin/target/projects/tests/p003. It is recommended you rename your site.xml to category.xml and use packaging type eclipse-repository instead.
[INFO] Scanning /jobs/genie.tycho/tycho-sonar/workspace/tycho-pomgenerator-plugin/target/projects/simple/p001 basedir
[INFO] Scanning /jobs/genie.tycho/tycho-sonar/workspace/tycho-pomgenerator-plugin/target/projects/simple/p003 basedir
[WARNING] Old style update site found for /jobs/genie.tycho/tycho-sonar/workspace/tycho-pomgenerator-plugin/target/projects/simple/p003. It is recommended you rename your site.xml to category.xml and use packaging type eclipse-repository instead.
[WARNING] Not a directory /jobs/genie.tycho/tycho-sonar/workspace/tycho-pomgenerator-plugin/target/projects/malformed/base
[INFO] Scanning /jobs/genie.tycho/tycho-sonar/workspace/tycho-pomgenerator-plugin/target/projects/malformed basedir
[INFO] Scanning /jobs/genie.tycho/tycho-sonar/workspace/tycho-pomgenerator-plugin/target/projects/simple/p002 basedir
[INFO] Scanning /jobs/genie.tycho/tycho-sonar/workspace/tycho-pomgenerator-plugin/target/projects/withmetadata basedir
[INFO] Scanning /jobs/genie.tycho/tycho-sonar/workspace/tycho-pomgenerator-plugin/target/projects/rootprojects basedir
[INFO] Resolving root project /jobs/genie.tycho/tycho-sonar/workspace/tycho-pomgenerator-plugin/target/projects/rootprojects/p004
[WARNING] Old style update site found for /jobs/genie.tycho/tycho-sonar/workspace/tycho-pomgenerator-plugin/target/projects/rootprojects/p004. It is recommended you rename your site.xml to category.xml and use packaging type eclipse-repository instead.
[INFO] Scanning /jobs/genie.tycho/tycho-sonar/workspace/tycho-pomgenerator-plugin/target/projects/simple/p006 basedir
[INFO] Scanning /jobs/genie.tycho/tycho-sonar/workspace/tycho-pomgenerator-plugin/target/projects/simple basedir
[WARNING] Old style update site found for /jobs/genie.tycho/tycho-sonar/workspace/tycho-pomgenerator-plugin/target/projects/simple/p003. It is recommended you rename your site.xml to category.xml and use packaging type eclipse-repository instead.
[INFO] Scanning /jobs/genie.tycho/tycho-sonar/workspace/tycho-pomgenerator-plugin/target/projects/deepmodule basedir
[INFO] Scanning /jobs/genie.tycho/tycho-sonar/workspace/tycho-pomgenerator-plugin/target/projects/deepmodule/base basedir
[INFO] Scanning /jobs/genie.tycho/tycho-sonar/workspace/tycho-pomgenerator-plugin/target/projects/deepmodule/base basedir
[INFO] Scanning /jobs/genie.tycho/tycho-sonar/workspace/tycho-pomgenerator-plugin/target/projects/multibase basedir
[INFO] Scanning /jobs/genie.tycho/tycho-sonar/workspace/tycho-pomgenerator-plugin/target/projects/multibase/base1 basedir
[INFO] Scanning /jobs/genie.tycho/tycho-sonar/workspace/tycho-pomgenerator-plugin/target/projects/multibase/base2 basedir
[WARNING] Old style update site found for /jobs/genie.tycho/tycho-sonar/workspace/tycho-pomgenerator-plugin/target/projects/multibase/base1/p003. It is recommended you rename your site.xml to category.xml and use packaging type eclipse-repository instead.
[WARNING] Old style update site found for /jobs/genie.tycho/tycho-sonar/workspace/tycho-pomgenerator-plugin/target/projects/multibase/base2/p006. It is recommended you rename your site.xml to category.xml and use packaging type eclipse-repository instead.
[WARNING] Unknown feature reference p002
[WARNING] Unknown feature reference p002
[WARNING] Unknown feature reference p005
[INFO] Scanning /jobs/genie.tycho/tycho-sonar/workspace/tycho-pomgenerator-plugin/target/projects/multibase/base1 basedir
[INFO] Scanning /jobs/genie.tycho/tycho-sonar/workspace/tycho-pomgenerator-plugin/target/projects/multibase/base2 basedir
[WARNING] Old style update site found for /jobs/genie.tycho/tycho-sonar/workspace/tycho-pomgenerator-plugin/target/projects/multibase/base1/p003. It is recommended you rename your site.xml to category.xml and use packaging type eclipse-repository instead.
[WARNING] Old style update site found for /jobs/genie.tycho/tycho-sonar/workspace/tycho-pomgenerator-plugin/target/projects/multibase/base2/p006. It is recommended you rename your site.xml to category.xml and use packaging type eclipse-repository instead.
[INFO] Tests run: 12, Failures: 0, Errors: 0, Skipped: 0, Time elapsed: 3.317 s - in org.eclipse.tycho.pomgenerator.test.GeneratePomsMojoTest
[INFO] 
[INFO] Results:
[INFO] 
[INFO] Tests run: 12, Failures: 0, Errors: 0, Skipped: 0
[INFO] 
[INFO] 
[INFO] --- maven-jar-plugin:3.1.2:jar (default-jar) @ tycho-pomgenerator-plugin ---
[INFO] Building jar: /jobs/genie.tycho/tycho-sonar/workspace/tycho-pomgenerator-plugin/target/tycho-pomgenerator-plugin-1.5.0-SNAPSHOT.jar
[INFO] 
[INFO] --- maven-plugin-plugin:3.6.0:addPluginArtifactMetadata (default-addPluginArtifactMetadata) @ tycho-pomgenerator-plugin ---
[INFO] 
[INFO] --- maven-source-plugin:3.1.0:jar-no-fork (default) @ tycho-pomgenerator-plugin ---
[INFO] Building jar: /jobs/genie.tycho/tycho-sonar/workspace/tycho-pomgenerator-plugin/target/tycho-pomgenerator-plugin-1.5.0-SNAPSHOT-sources.jar
[INFO] 
[INFO] --- maven-install-plugin:2.5.2:install (default-install) @ tycho-pomgenerator-plugin ---
[INFO] Installing /jobs/genie.tycho/tycho-sonar/workspace/tycho-pomgenerator-plugin/target/tycho-pomgenerator-plugin-1.5.0-SNAPSHOT.jar to /home/hudson/genie.tycho/.jenkins/jobs/tycho-sonar/workspace/.repository/org/eclipse/tycho/tycho-pomgenerator-plugin/1.5.0-SNAPSHOT/tycho-pomgenerator-plugin-1.5.0-SNAPSHOT.jar
[INFO] Installing /jobs/genie.tycho/tycho-sonar/workspace/tycho-pomgenerator-plugin/pom.xml to /home/hudson/genie.tycho/.jenkins/jobs/tycho-sonar/workspace/.repository/org/eclipse/tycho/tycho-pomgenerator-plugin/1.5.0-SNAPSHOT/tycho-pomgenerator-plugin-1.5.0-SNAPSHOT.pom
[INFO] Installing /jobs/genie.tycho/tycho-sonar/workspace/tycho-pomgenerator-plugin/target/tycho-pomgenerator-plugin-1.5.0-SNAPSHOT-sources.jar to /home/hudson/genie.tycho/.jenkins/jobs/tycho-sonar/workspace/.repository/org/eclipse/tycho/tycho-pomgenerator-plugin/1.5.0-SNAPSHOT/tycho-pomgenerator-plugin-1.5.0-SNAPSHOT-sources.jar
[INFO] 
[INFO] ------< org.eclipse.tycho:org.eclipse.tycho.surefire.osgibooter >-------
[INFO] Building Tycho Surefire OSGi Booter Eclipse Application 1.5.0-SNAPSHOT [38/52]
[INFO] ---------------------------[ eclipse-plugin ]---------------------------
[INFO] 
[INFO] --- maven-clean-plugin:3.1.0:clean (default-clean) @ org.eclipse.tycho.surefire.osgibooter ---
[INFO] Deleting /jobs/genie.tycho/tycho-sonar/workspace/tycho-surefire/org.eclipse.tycho.surefire.osgibooter/target
[INFO] Deleting /jobs/genie.tycho/tycho-sonar/workspace/tycho-surefire/org.eclipse.tycho.surefire.osgibooter/jars (includes = [], excludes = [])
[INFO] 
[INFO] --- tycho-packaging-plugin:1.4.0:build-qualifier (default-build-qualifier) @ org.eclipse.tycho.surefire.osgibooter ---
[INFO] The project's OSGi version is 1.5.0.201907070400
[INFO] 
[INFO] --- tycho-packaging-plugin:1.4.0:validate-id (default-validate-id) @ org.eclipse.tycho.surefire.osgibooter ---
[INFO] 
[INFO] --- tycho-packaging-plugin:1.4.0:validate-version (default-validate-version) @ org.eclipse.tycho.surefire.osgibooter ---
[INFO] 
[INFO] --- jacoco-maven-plugin:0.8.4:prepare-agent (default) @ org.eclipse.tycho.surefire.osgibooter ---
[INFO] argLine set to -javaagent:/home/hudson/genie.tycho/.jenkins/jobs/tycho-sonar/workspace/.repository/org/jacoco/org.jacoco.agent/0.8.4/org.jacoco.agent-0.8.4-runtime.jar=destfile=/home/hudson/genie.tycho/.jenkins/jobs/tycho-sonar/workspace/target/jacoco.exec,append=true
[INFO] 
[INFO] --- maven-resources-plugin:3.1.0:resources (default-resources) @ org.eclipse.tycho.surefire.osgibooter ---
[INFO] Using 'UTF-8' encoding to copy filtered resources.
[INFO] Copying 1 resource
[INFO] Copying 2 resources
[INFO] 
[INFO] --- maven-dependency-plugin:3.1.1:copy (copy) @ org.eclipse.tycho.surefire.osgibooter ---
[INFO] Configured Artifact: org.apache.maven.surefire:surefire-api:2.22.0:jar
[INFO] Configured Artifact: org.apache.maven.surefire:surefire-logger-api:2.22.0:jar
[INFO] Configured Artifact: org.apache.maven.surefire:surefire-booter:2.22.0:jar
[INFO] Configured Artifact: org.apache.maven.surefire:maven-surefire-common:2.22.0:jar
[INFO] Copying surefire-api-2.22.0.jar to /jobs/genie.tycho/tycho-sonar/workspace/tycho-surefire/org.eclipse.tycho.surefire.osgibooter/jars/surefire-api-2.22.0.jar
[INFO] Copying surefire-logger-api-2.22.0.jar to /jobs/genie.tycho/tycho-sonar/workspace/tycho-surefire/org.eclipse.tycho.surefire.osgibooter/jars/surefire-logger-api-2.22.0.jar
[INFO] Copying surefire-booter-2.22.0.jar to /jobs/genie.tycho/tycho-sonar/workspace/tycho-surefire/org.eclipse.tycho.surefire.osgibooter/jars/surefire-booter-2.22.0.jar
[INFO] Copying maven-surefire-common-2.22.0.jar to /jobs/genie.tycho/tycho-sonar/workspace/tycho-surefire/org.eclipse.tycho.surefire.osgibooter/jars/maven-surefire-common-2.22.0.jar
[INFO] 
[INFO] --- tycho-compiler-plugin:1.4.0:compile (default-compile) @ org.eclipse.tycho.surefire.osgibooter ---
[INFO] Compiling 9 source files to /jobs/genie.tycho/tycho-sonar/workspace/tycho-surefire/org.eclipse.tycho.surefire.osgibooter/target/classes
[INFO] 
[INFO] --- maven-resources-plugin:3.1.0:testResources (default-testResources) @ org.eclipse.tycho.surefire.osgibooter ---
[INFO] Using 'UTF-8' encoding to copy filtered resources.
[INFO] skip non existing resourceDirectory /jobs/genie.tycho/tycho-sonar/workspace/tycho-surefire/org.eclipse.tycho.surefire.osgibooter/src/test/resources
[INFO] 
[INFO] --- target-platform-configuration:1.4.0:target-platform (default-target-platform) @ org.eclipse.tycho.surefire.osgibooter ---
[INFO] 
[INFO] --- tycho-packaging-plugin:1.4.0:package-plugin (default-package-plugin) @ org.eclipse.tycho.surefire.osgibooter ---
[INFO] Building jar: /jobs/genie.tycho/tycho-sonar/workspace/tycho-surefire/org.eclipse.tycho.surefire.osgibooter/target/org.eclipse.tycho.surefire.osgibooter-1.5.0-SNAPSHOT.jar
[INFO] 
[INFO] --- tycho-p2-plugin:1.4.0:p2-metadata-default (default-p2-metadata-default) @ org.eclipse.tycho.surefire.osgibooter ---
[INFO] 
[INFO] --- maven-source-plugin:3.1.0:jar-no-fork (default) @ org.eclipse.tycho.surefire.osgibooter ---
[INFO] Building jar: /jobs/genie.tycho/tycho-sonar/workspace/tycho-surefire/org.eclipse.tycho.surefire.osgibooter/target/org.eclipse.tycho.surefire.osgibooter-1.5.0-SNAPSHOT-sources.jar
[INFO] 
[INFO] --- maven-install-plugin:2.5.2:install (default-install) @ org.eclipse.tycho.surefire.osgibooter ---
[INFO] Installing /jobs/genie.tycho/tycho-sonar/workspace/tycho-surefire/org.eclipse.tycho.surefire.osgibooter/target/org.eclipse.tycho.surefire.osgibooter-1.5.0-SNAPSHOT.jar to /home/hudson/genie.tycho/.jenkins/jobs/tycho-sonar/workspace/.repository/org/eclipse/tycho/org.eclipse.tycho.surefire.osgibooter/1.5.0-SNAPSHOT/org.eclipse.tycho.surefire.osgibooter-1.5.0-SNAPSHOT.jar
[INFO] Installing /jobs/genie.tycho/tycho-sonar/workspace/tycho-surefire/org.eclipse.tycho.surefire.osgibooter/pom.xml to /home/hudson/genie.tycho/.jenkins/jobs/tycho-sonar/workspace/.repository/org/eclipse/tycho/org.eclipse.tycho.surefire.osgibooter/1.5.0-SNAPSHOT/org.eclipse.tycho.surefire.osgibooter-1.5.0-SNAPSHOT.pom
[INFO] Installing /jobs/genie.tycho/tycho-sonar/workspace/tycho-surefire/org.eclipse.tycho.surefire.osgibooter/target/p2content.xml to /home/hudson/genie.tycho/.jenkins/jobs/tycho-sonar/workspace/.repository/org/eclipse/tycho/org.eclipse.tycho.surefire.osgibooter/1.5.0-SNAPSHOT/org.eclipse.tycho.surefire.osgibooter-1.5.0-SNAPSHOT-p2metadata.xml
[INFO] Installing /jobs/genie.tycho/tycho-sonar/workspace/tycho-surefire/org.eclipse.tycho.surefire.osgibooter/target/p2artifacts.xml to /home/hudson/genie.tycho/.jenkins/jobs/tycho-sonar/workspace/.repository/org/eclipse/tycho/org.eclipse.tycho.surefire.osgibooter/1.5.0-SNAPSHOT/org.eclipse.tycho.surefire.osgibooter-1.5.0-SNAPSHOT-p2artifacts.xml
[INFO] Installing /jobs/genie.tycho/tycho-sonar/workspace/tycho-surefire/org.eclipse.tycho.surefire.osgibooter/target/org.eclipse.tycho.surefire.osgibooter-1.5.0-SNAPSHOT-sources.jar to /home/hudson/genie.tycho/.jenkins/jobs/tycho-sonar/workspace/.repository/org/eclipse/tycho/org.eclipse.tycho.surefire.osgibooter/1.5.0-SNAPSHOT/org.eclipse.tycho.surefire.osgibooter-1.5.0-SNAPSHOT-sources.jar
[INFO] 
[INFO] --- tycho-p2-plugin:1.4.0:update-local-index (default-update-local-index) @ org.eclipse.tycho.surefire.osgibooter ---
[INFO] 
[INFO] ------------------< org.eclipse.tycho:tycho-surefire >------------------
[INFO] Building Tycho Surefire Parent 1.5.0-SNAPSHOT                    [39/52]
[INFO] --------------------------------[ pom ]---------------------------------
[INFO] 
[INFO] --- maven-clean-plugin:3.1.0:clean (default-clean) @ tycho-surefire ---
[INFO] 
[INFO] --- jacoco-maven-plugin:0.8.4:prepare-agent (default) @ tycho-surefire ---
[INFO] argLine set to -javaagent:/home/hudson/genie.tycho/.jenkins/jobs/tycho-sonar/workspace/.repository/org/jacoco/org.jacoco.agent/0.8.4/org.jacoco.agent-0.8.4-runtime.jar=destfile=/home/hudson/genie.tycho/.jenkins/jobs/tycho-sonar/workspace/target/jacoco.exec,append=true
[INFO] 
[INFO] --- maven-source-plugin:3.1.0:jar-no-fork (default) @ tycho-surefire ---
[INFO] 
[INFO] --- maven-install-plugin:2.5.2:install (default-install) @ tycho-surefire ---
[INFO] Installing /jobs/genie.tycho/tycho-sonar/workspace/tycho-surefire/pom.xml to /home/hudson/genie.tycho/.jenkins/jobs/tycho-sonar/workspace/.repository/org/eclipse/tycho/tycho-surefire/1.5.0-SNAPSHOT/tycho-surefire-1.5.0-SNAPSHOT.pom
[INFO] 
[INFO] ---------< org.eclipse.tycho:org.eclipse.tycho.surefire.junit >---------
[INFO] Building Tycho Surefire OSGi JUnit 3 Runner 1.5.0-SNAPSHOT       [40/52]
[INFO] --------------------------------[ jar ]---------------------------------
[INFO] 
[INFO] --- maven-clean-plugin:3.1.0:clean (default-clean) @ org.eclipse.tycho.surefire.junit ---
[INFO] Deleting /jobs/genie.tycho/tycho-sonar/workspace/tycho-surefire/org.eclipse.tycho.surefire.junit/target
[INFO] 
[INFO] --- jacoco-maven-plugin:0.8.4:prepare-agent (default) @ org.eclipse.tycho.surefire.junit ---
[INFO] argLine set to -javaagent:/home/hudson/genie.tycho/.jenkins/jobs/tycho-sonar/workspace/.repository/org/jacoco/org.jacoco.agent/0.8.4/org.jacoco.agent-0.8.4-runtime.jar=destfile=/home/hudson/genie.tycho/.jenkins/jobs/tycho-sonar/workspace/target/jacoco.exec,append=true
[INFO] 
[INFO] --- maven-dependency-plugin:3.1.1:unpack (unpack) @ org.eclipse.tycho.surefire.junit ---
[INFO] Configured Artifact: org.apache.maven.surefire:surefire-junit3:2.22.0:jar
[INFO] Unpacking /home/hudson/genie.tycho/.jenkins/jobs/tycho-sonar/workspace/.repository/org/apache/maven/surefire/surefire-junit3/2.22.0/surefire-junit3-2.22.0.jar to /jobs/genie.tycho/tycho-sonar/workspace/tycho-surefire/org.eclipse.tycho.surefire.junit/target/classes with includes "" and excludes "META-INF/maven/**,META-INF/DEPENDENCIES,META-INF/LICENSE*,META-INF/NOTICE*"
[INFO] 
[INFO] --- maven-resources-plugin:3.1.0:resources (default-resources) @ org.eclipse.tycho.surefire.junit ---
[INFO] Using 'UTF-8' encoding to copy filtered resources.
[INFO] Copying 1 resource
[INFO] Copying 2 resources
[INFO] 
[INFO] --- maven-compiler-plugin:3.8.1:compile (default-compile) @ org.eclipse.tycho.surefire.junit ---
[INFO] No sources to compile
[INFO] 
[INFO] --- bnd-maven-plugin:3.5.0:bnd-process (default) @ org.eclipse.tycho.surefire.junit ---
[INFO] 
[INFO] --- maven-resources-plugin:3.1.0:testResources (default-testResources) @ org.eclipse.tycho.surefire.junit ---
[INFO] Using 'UTF-8' encoding to copy filtered resources.
[INFO] skip non existing resourceDirectory /jobs/genie.tycho/tycho-sonar/workspace/tycho-surefire/org.eclipse.tycho.surefire.junit/src/test/resources
[INFO] 
[INFO] --- maven-compiler-plugin:3.8.1:testCompile (default-testCompile) @ org.eclipse.tycho.surefire.junit ---
[INFO] No sources to compile
[INFO] 
[INFO] --- maven-surefire-plugin:2.22.0:test (default-test) @ org.eclipse.tycho.surefire.junit ---
[INFO] No tests to run.
[INFO] 
[INFO] --- maven-jar-plugin:3.1.2:jar (default-jar) @ org.eclipse.tycho.surefire.junit ---
[INFO] Building jar: /jobs/genie.tycho/tycho-sonar/workspace/tycho-surefire/org.eclipse.tycho.surefire.junit/target/org.eclipse.tycho.surefire.junit-1.5.0-SNAPSHOT.jar
[INFO] 
[INFO] --- maven-source-plugin:3.1.0:jar-no-fork (default) @ org.eclipse.tycho.surefire.junit ---
[INFO] Building jar: /jobs/genie.tycho/tycho-sonar/workspace/tycho-surefire/org.eclipse.tycho.surefire.junit/target/org.eclipse.tycho.surefire.junit-1.5.0-SNAPSHOT-sources.jar
[INFO] 
[INFO] --- maven-install-plugin:2.5.2:install (default-install) @ org.eclipse.tycho.surefire.junit ---
[INFO] Installing /jobs/genie.tycho/tycho-sonar/workspace/tycho-surefire/org.eclipse.tycho.surefire.junit/target/org.eclipse.tycho.surefire.junit-1.5.0-SNAPSHOT.jar to /home/hudson/genie.tycho/.jenkins/jobs/tycho-sonar/workspace/.repository/org/eclipse/tycho/org.eclipse.tycho.surefire.junit/1.5.0-SNAPSHOT/org.eclipse.tycho.surefire.junit-1.5.0-SNAPSHOT.jar
[INFO] Installing /jobs/genie.tycho/tycho-sonar/workspace/tycho-surefire/org.eclipse.tycho.surefire.junit/pom.xml to /home/hudson/genie.tycho/.jenkins/jobs/tycho-sonar/workspace/.repository/org/eclipse/tycho/org.eclipse.tycho.surefire.junit/1.5.0-SNAPSHOT/org.eclipse.tycho.surefire.junit-1.5.0-SNAPSHOT.pom
[INFO] Installing /jobs/genie.tycho/tycho-sonar/workspace/tycho-surefire/org.eclipse.tycho.surefire.junit/target/org.eclipse.tycho.surefire.junit-1.5.0-SNAPSHOT-sources.jar to /home/hudson/genie.tycho/.jenkins/jobs/tycho-sonar/workspace/.repository/org/eclipse/tycho/org.eclipse.tycho.surefire.junit/1.5.0-SNAPSHOT/org.eclipse.tycho.surefire.junit-1.5.0-SNAPSHOT-sources.jar
[INFO] 
[INFO] --------< org.eclipse.tycho:org.eclipse.tycho.surefire.junit4 >---------
[INFO] Building Tycho Surefire OSGi JUnit 4 Runner 1.5.0-SNAPSHOT       [41/52]
[INFO] --------------------------------[ jar ]---------------------------------
[INFO] 
[INFO] --- maven-clean-plugin:3.1.0:clean (default-clean) @ org.eclipse.tycho.surefire.junit4 ---
[INFO] Deleting /jobs/genie.tycho/tycho-sonar/workspace/tycho-surefire/org.eclipse.tycho.surefire.junit4/target
[INFO] 
[INFO] --- jacoco-maven-plugin:0.8.4:prepare-agent (default) @ org.eclipse.tycho.surefire.junit4 ---
[INFO] argLine set to -javaagent:/home/hudson/genie.tycho/.jenkins/jobs/tycho-sonar/workspace/.repository/org/jacoco/org.jacoco.agent/0.8.4/org.jacoco.agent-0.8.4-runtime.jar=destfile=/home/hudson/genie.tycho/.jenkins/jobs/tycho-sonar/workspace/target/jacoco.exec,append=true
[INFO] 
[INFO] --- maven-dependency-plugin:3.1.1:unpack (unpack) @ org.eclipse.tycho.surefire.junit4 ---
[INFO] Configured Artifact: org.apache.maven.surefire:surefire-junit4:2.22.0:jar
[INFO] Unpacking /home/hudson/genie.tycho/.jenkins/jobs/tycho-sonar/workspace/.repository/org/apache/maven/surefire/surefire-junit4/2.22.0/surefire-junit4-2.22.0.jar to /jobs/genie.tycho/tycho-sonar/workspace/tycho-surefire/org.eclipse.tycho.surefire.junit4/target/classes with includes "" and excludes "META-INF/maven/**,META-INF/DEPENDENCIES,META-INF/LICENSE*,META-INF/NOTICE*"
[INFO] 
[INFO] --- maven-resources-plugin:3.1.0:resources (default-resources) @ org.eclipse.tycho.surefire.junit4 ---
[INFO] Using 'UTF-8' encoding to copy filtered resources.
[INFO] Copying 1 resource
[INFO] Copying 2 resources
[INFO] 
[INFO] --- maven-compiler-plugin:3.8.1:compile (default-compile) @ org.eclipse.tycho.surefire.junit4 ---
[INFO] No sources to compile
[INFO] 
[INFO] --- bnd-maven-plugin:3.5.0:bnd-process (default) @ org.eclipse.tycho.surefire.junit4 ---
[INFO] 
[INFO] --- maven-resources-plugin:3.1.0:testResources (default-testResources) @ org.eclipse.tycho.surefire.junit4 ---
[INFO] Using 'UTF-8' encoding to copy filtered resources.
[INFO] skip non existing resourceDirectory /jobs/genie.tycho/tycho-sonar/workspace/tycho-surefire/org.eclipse.tycho.surefire.junit4/src/test/resources
[INFO] 
[INFO] --- maven-compiler-plugin:3.8.1:testCompile (default-testCompile) @ org.eclipse.tycho.surefire.junit4 ---
[INFO] No sources to compile
[INFO] 
[INFO] --- maven-surefire-plugin:2.22.0:test (default-test) @ org.eclipse.tycho.surefire.junit4 ---
[INFO] No tests to run.
[INFO] 
[INFO] --- maven-jar-plugin:3.1.2:jar (default-jar) @ org.eclipse.tycho.surefire.junit4 ---
[INFO] Building jar: /jobs/genie.tycho/tycho-sonar/workspace/tycho-surefire/org.eclipse.tycho.surefire.junit4/target/org.eclipse.tycho.surefire.junit4-1.5.0-SNAPSHOT.jar
[INFO] 
[INFO] --- maven-source-plugin:3.1.0:jar-no-fork (default) @ org.eclipse.tycho.surefire.junit4 ---
[INFO] Building jar: /jobs/genie.tycho/tycho-sonar/workspace/tycho-surefire/org.eclipse.tycho.surefire.junit4/target/org.eclipse.tycho.surefire.junit4-1.5.0-SNAPSHOT-sources.jar
[INFO] 
[INFO] --- maven-install-plugin:2.5.2:install (default-install) @ org.eclipse.tycho.surefire.junit4 ---
[INFO] Installing /jobs/genie.tycho/tycho-sonar/workspace/tycho-surefire/org.eclipse.tycho.surefire.junit4/target/org.eclipse.tycho.surefire.junit4-1.5.0-SNAPSHOT.jar to /home/hudson/genie.tycho/.jenkins/jobs/tycho-sonar/workspace/.repository/org/eclipse/tycho/org.eclipse.tycho.surefire.junit4/1.5.0-SNAPSHOT/org.eclipse.tycho.surefire.junit4-1.5.0-SNAPSHOT.jar
[INFO] Installing /jobs/genie.tycho/tycho-sonar/workspace/tycho-surefire/org.eclipse.tycho.surefire.junit4/pom.xml to /home/hudson/genie.tycho/.jenkins/jobs/tycho-sonar/workspace/.repository/org/eclipse/tycho/org.eclipse.tycho.surefire.junit4/1.5.0-SNAPSHOT/org.eclipse.tycho.surefire.junit4-1.5.0-SNAPSHOT.pom
[INFO] Installing /jobs/genie.tycho/tycho-sonar/workspace/tycho-surefire/org.eclipse.tycho.surefire.junit4/target/org.eclipse.tycho.surefire.junit4-1.5.0-SNAPSHOT-sources.jar to /home/hudson/genie.tycho/.jenkins/jobs/tycho-sonar/workspace/.repository/org/eclipse/tycho/org.eclipse.tycho.surefire.junit4/1.5.0-SNAPSHOT/org.eclipse.tycho.surefire.junit4-1.5.0-SNAPSHOT-sources.jar
[INFO] 
[INFO] --------< org.eclipse.tycho:org.eclipse.tycho.surefire.junit47 >--------
[INFO] Building Tycho Surefire OSGi JUnit 4.7 Runner 1.5.0-SNAPSHOT     [42/52]
[INFO] --------------------------------[ jar ]---------------------------------
[INFO] 
[INFO] --- maven-clean-plugin:3.1.0:clean (default-clean) @ org.eclipse.tycho.surefire.junit47 ---
[INFO] Deleting /jobs/genie.tycho/tycho-sonar/workspace/tycho-surefire/org.eclipse.tycho.surefire.junit47/target
[INFO] 
[INFO] --- jacoco-maven-plugin:0.8.4:prepare-agent (default) @ org.eclipse.tycho.surefire.junit47 ---
[INFO] argLine set to -javaagent:/home/hudson/genie.tycho/.jenkins/jobs/tycho-sonar/workspace/.repository/org/jacoco/org.jacoco.agent/0.8.4/org.jacoco.agent-0.8.4-runtime.jar=destfile=/home/hudson/genie.tycho/.jenkins/jobs/tycho-sonar/workspace/target/jacoco.exec,append=true
[INFO] 
[INFO] --- maven-dependency-plugin:3.1.1:unpack (unpack) @ org.eclipse.tycho.surefire.junit47 ---
[INFO] Configured Artifact: org.apache.maven.surefire:surefire-junit47:2.22.0:jar
[INFO] Configured Artifact: org.apache.maven.surefire:common-junit48:2.22.0:jar
[INFO] Configured Artifact: org.apache.maven.surefire:surefire-grouper:2.22.0:jar
[INFO] Unpacking /home/hudson/genie.tycho/.jenkins/jobs/tycho-sonar/workspace/.repository/org/apache/maven/surefire/surefire-junit47/2.22.0/surefire-junit47-2.22.0.jar to /jobs/genie.tycho/tycho-sonar/workspace/tycho-surefire/org.eclipse.tycho.surefire.junit47/target/classes with includes "" and excludes "META-INF/maven/**,META-INF/DEPENDENCIES,META-INF/LICENSE*,META-INF/NOTICE*"
[INFO] Unpacking /home/hudson/genie.tycho/.jenkins/jobs/tycho-sonar/workspace/.repository/org/apache/maven/surefire/common-junit48/2.22.0/common-junit48-2.22.0.jar to /jobs/genie.tycho/tycho-sonar/workspace/tycho-surefire/org.eclipse.tycho.surefire.junit47/target/classes with includes "" and excludes "META-INF/maven/**,META-INF/DEPENDENCIES,META-INF/LICENSE*,META-INF/NOTICE*"
[INFO] Unpacking /home/hudson/genie.tycho/.jenkins/jobs/tycho-sonar/workspace/.repository/org/apache/maven/surefire/surefire-grouper/2.22.0/surefire-grouper-2.22.0.jar to /jobs/genie.tycho/tycho-sonar/workspace/tycho-surefire/org.eclipse.tycho.surefire.junit47/target/classes with includes "" and excludes "META-INF/maven/**,META-INF/DEPENDENCIES,META-INF/LICENSE*,META-INF/NOTICE*"
[INFO] 
[INFO] --- maven-resources-plugin:3.1.0:resources (default-resources) @ org.eclipse.tycho.surefire.junit47 ---
[INFO] Using 'UTF-8' encoding to copy filtered resources.
[INFO] Copying 1 resource
[INFO] Copying 2 resources
[INFO] 
[INFO] --- maven-compiler-plugin:3.8.1:compile (default-compile) @ org.eclipse.tycho.surefire.junit47 ---
[INFO] No sources to compile
[INFO] 
[INFO] --- bnd-maven-plugin:3.5.0:bnd-process (default) @ org.eclipse.tycho.surefire.junit47 ---
[INFO] 
[INFO] --- maven-resources-plugin:3.1.0:testResources (default-testResources) @ org.eclipse.tycho.surefire.junit47 ---
[INFO] Using 'UTF-8' encoding to copy filtered resources.
[INFO] skip non existing resourceDirectory /jobs/genie.tycho/tycho-sonar/workspace/tycho-surefire/org.eclipse.tycho.surefire.junit47/src/test/resources
[INFO] 
[INFO] --- maven-compiler-plugin:3.8.1:testCompile (default-testCompile) @ org.eclipse.tycho.surefire.junit47 ---
[INFO] No sources to compile
[INFO] 
[INFO] --- maven-surefire-plugin:2.22.0:test (default-test) @ org.eclipse.tycho.surefire.junit47 ---
[INFO] No tests to run.
[INFO] 
[INFO] --- maven-jar-plugin:3.1.2:jar (default-jar) @ org.eclipse.tycho.surefire.junit47 ---
[INFO] Building jar: /jobs/genie.tycho/tycho-sonar/workspace/tycho-surefire/org.eclipse.tycho.surefire.junit47/target/org.eclipse.tycho.surefire.junit47-1.5.0-SNAPSHOT.jar
[INFO] 
[INFO] --- maven-source-plugin:3.1.0:jar-no-fork (default) @ org.eclipse.tycho.surefire.junit47 ---
[INFO] Building jar: /jobs/genie.tycho/tycho-sonar/workspace/tycho-surefire/org.eclipse.tycho.surefire.junit47/target/org.eclipse.tycho.surefire.junit47-1.5.0-SNAPSHOT-sources.jar
[INFO] 
[INFO] --- maven-install-plugin:2.5.2:install (default-install) @ org.eclipse.tycho.surefire.junit47 ---
[INFO] Installing /jobs/genie.tycho/tycho-sonar/workspace/tycho-surefire/org.eclipse.tycho.surefire.junit47/target/org.eclipse.tycho.surefire.junit47-1.5.0-SNAPSHOT.jar to /home/hudson/genie.tycho/.jenkins/jobs/tycho-sonar/workspace/.repository/org/eclipse/tycho/org.eclipse.tycho.surefire.junit47/1.5.0-SNAPSHOT/org.eclipse.tycho.surefire.junit47-1.5.0-SNAPSHOT.jar
[INFO] Installing /jobs/genie.tycho/tycho-sonar/workspace/tycho-surefire/org.eclipse.tycho.surefire.junit47/pom.xml to /home/hudson/genie.tycho/.jenkins/jobs/tycho-sonar/workspace/.repository/org/eclipse/tycho/org.eclipse.tycho.surefire.junit47/1.5.0-SNAPSHOT/org.eclipse.tycho.surefire.junit47-1.5.0-SNAPSHOT.pom
[INFO] Installing /jobs/genie.tycho/tycho-sonar/workspace/tycho-surefire/org.eclipse.tycho.surefire.junit47/target/org.eclipse.tycho.surefire.junit47-1.5.0-SNAPSHOT-sources.jar to /home/hudson/genie.tycho/.jenkins/jobs/tycho-sonar/workspace/.repository/org/eclipse/tycho/org.eclipse.tycho.surefire.junit47/1.5.0-SNAPSHOT/org.eclipse.tycho.surefire.junit47-1.5.0-SNAPSHOT-sources.jar
[INFO] 
[INFO] --------< org.eclipse.tycho:org.eclipse.tycho.surefire.junit5 >---------
[INFO] Building Tycho Surefire OSGi JUnit 5 Runner 1.5.0-SNAPSHOT       [43/52]
[INFO] --------------------------------[ jar ]---------------------------------
[INFO] 
[INFO] --- maven-clean-plugin:3.1.0:clean (default-clean) @ org.eclipse.tycho.surefire.junit5 ---
[INFO] Deleting /jobs/genie.tycho/tycho-sonar/workspace/tycho-surefire/org.eclipse.tycho.surefire.junit5/target
[INFO] 
[INFO] --- jacoco-maven-plugin:0.8.4:prepare-agent (default) @ org.eclipse.tycho.surefire.junit5 ---
[INFO] argLine set to -javaagent:/home/hudson/genie.tycho/.jenkins/jobs/tycho-sonar/workspace/.repository/org/jacoco/org.jacoco.agent/0.8.4/org.jacoco.agent-0.8.4-runtime.jar=destfile=/home/hudson/genie.tycho/.jenkins/jobs/tycho-sonar/workspace/target/jacoco.exec,append=true
[INFO] 
[INFO] --- maven-dependency-plugin:3.1.1:unpack (unpack) @ org.eclipse.tycho.surefire.junit5 ---
[INFO] Configured Artifact: org.apache.maven.surefire:surefire-junit-platform:2.22.0:jar
[INFO] Configured Artifact: org.junit.platform:junit-platform-launcher:1.0.3:jar
[INFO] Configured Artifact: org.junit.platform:junit-platform-engine:1.0.3:jar
[INFO] Configured Artifact: org.junit.platform:junit-platform-commons:1.0.3:jar
[INFO] Configured Artifact: org.junit.jupiter:junit-jupiter-engine:5.0.3:jar
[INFO] Configured Artifact: org.apache.maven.surefire:common-java5:2.22.0:jar
[INFO] Configured Artifact: org.junit.vintage:junit-vintage-engine:4.12.3:jar
[INFO] Configured Artifact: org.opentest4j:opentest4j:1.0.0:jar
[INFO] Configured Artifact: org.apiguardian:apiguardian-api:1.0.0:jar
[INFO] Unpacking /home/hudson/genie.tycho/.jenkins/jobs/tycho-sonar/workspace/.repository/org/apache/maven/surefire/surefire-junit-platform/2.22.0/surefire-junit-platform-2.22.0.jar to /jobs/genie.tycho/tycho-sonar/workspace/tycho-surefire/org.eclipse.tycho.surefire.junit5/target/classes with includes "" and excludes "META-INF/maven/**,META-INF/DEPENDENCIES,META-INF/LICENSE*,META-INF/NOTICE*"
[INFO] Unpacking /home/hudson/genie.tycho/.jenkins/jobs/tycho-sonar/workspace/.repository/org/junit/platform/junit-platform-launcher/1.0.3/junit-platform-launcher-1.0.3.jar to /jobs/genie.tycho/tycho-sonar/workspace/tycho-surefire/org.eclipse.tycho.surefire.junit5/target/classes with includes "" and excludes "META-INF/maven/**,META-INF/DEPENDENCIES,META-INF/LICENSE*,META-INF/NOTICE*"
[INFO] Unpacking /home/hudson/genie.tycho/.jenkins/jobs/tycho-sonar/workspace/.repository/org/junit/platform/junit-platform-engine/1.0.3/junit-platform-engine-1.0.3.jar to /jobs/genie.tycho/tycho-sonar/workspace/tycho-surefire/org.eclipse.tycho.surefire.junit5/target/classes with includes "" and excludes "META-INF/maven/**,META-INF/DEPENDENCIES,META-INF/LICENSE*,META-INF/NOTICE*"
[INFO] Unpacking /home/hudson/genie.tycho/.jenkins/jobs/tycho-sonar/workspace/.repository/org/junit/platform/junit-platform-commons/1.0.3/junit-platform-commons-1.0.3.jar to /jobs/genie.tycho/tycho-sonar/workspace/tycho-surefire/org.eclipse.tycho.surefire.junit5/target/classes with includes "" and excludes "META-INF/maven/**,META-INF/DEPENDENCIES,META-INF/LICENSE*,META-INF/NOTICE*"
[INFO] Unpacking /home/hudson/genie.tycho/.jenkins/jobs/tycho-sonar/workspace/.repository/org/junit/jupiter/junit-jupiter-engine/5.0.3/junit-jupiter-engine-5.0.3.jar to /jobs/genie.tycho/tycho-sonar/workspace/tycho-surefire/org.eclipse.tycho.surefire.junit5/target/classes with includes "" and excludes "META-INF/maven/**,META-INF/DEPENDENCIES,META-INF/LICENSE*,META-INF/NOTICE*"
[INFO] Unpacking /home/hudson/genie.tycho/.jenkins/jobs/tycho-sonar/workspace/.repository/org/apache/maven/surefire/common-java5/2.22.0/common-java5-2.22.0.jar to /jobs/genie.tycho/tycho-sonar/workspace/tycho-surefire/org.eclipse.tycho.surefire.junit5/target/classes with includes "" and excludes "META-INF/maven/**,META-INF/DEPENDENCIES,META-INF/LICENSE*,META-INF/NOTICE*"
[INFO] Unpacking /home/hudson/genie.tycho/.jenkins/jobs/tycho-sonar/workspace/.repository/org/junit/vintage/junit-vintage-engine/4.12.3/junit-vintage-engine-4.12.3.jar to /jobs/genie.tycho/tycho-sonar/workspace/tycho-surefire/org.eclipse.tycho.surefire.junit5/target/classes with includes "" and excludes "META-INF/maven/**,META-INF/DEPENDENCIES,META-INF/LICENSE*,META-INF/NOTICE*"
[INFO] Unpacking /home/hudson/genie.tycho/.jenkins/jobs/tycho-sonar/workspace/.repository/org/opentest4j/opentest4j/1.0.0/opentest4j-1.0.0.jar to /jobs/genie.tycho/tycho-sonar/workspace/tycho-surefire/org.eclipse.tycho.surefire.junit5/target/classes with includes "" and excludes "META-INF/maven/**,META-INF/DEPENDENCIES,META-INF/LICENSE*,META-INF/NOTICE*"
[INFO] Unpacking /home/hudson/genie.tycho/.jenkins/jobs/tycho-sonar/workspace/.repository/org/apiguardian/apiguardian-api/1.0.0/apiguardian-api-1.0.0.jar to /jobs/genie.tycho/tycho-sonar/workspace/tycho-surefire/org.eclipse.tycho.surefire.junit5/target/classes with includes "" and excludes "META-INF/maven/**,META-INF/DEPENDENCIES,META-INF/LICENSE*,META-INF/NOTICE*"
[INFO] 
[INFO] --- maven-resources-plugin:3.1.0:resources (default-resources) @ org.eclipse.tycho.surefire.junit5 ---
[INFO] Using 'UTF-8' encoding to copy filtered resources.
[INFO] Copying 1 resource
[INFO] Copying 4 resources
[INFO] 
[INFO] --- maven-compiler-plugin:3.8.1:compile (default-compile) @ org.eclipse.tycho.surefire.junit5 ---
[INFO] No sources to compile
[INFO] 
[INFO] --- bnd-maven-plugin:3.5.0:bnd-process (default) @ org.eclipse.tycho.surefire.junit5 ---
[INFO] 
[INFO] --- maven-resources-plugin:3.1.0:testResources (default-testResources) @ org.eclipse.tycho.surefire.junit5 ---
[INFO] Using 'UTF-8' encoding to copy filtered resources.
[INFO] skip non existing resourceDirectory /jobs/genie.tycho/tycho-sonar/workspace/tycho-surefire/org.eclipse.tycho.surefire.junit5/src/test/resources
[INFO] 
[INFO] --- maven-compiler-plugin:3.8.1:testCompile (default-testCompile) @ org.eclipse.tycho.surefire.junit5 ---
[INFO] No sources to compile
[INFO] 
[INFO] --- maven-surefire-plugin:2.22.0:test (default-test) @ org.eclipse.tycho.surefire.junit5 ---
[INFO] No tests to run.
[INFO] 
[INFO] --- maven-jar-plugin:3.1.2:jar (default-jar) @ org.eclipse.tycho.surefire.junit5 ---
[INFO] Building jar: /jobs/genie.tycho/tycho-sonar/workspace/tycho-surefire/org.eclipse.tycho.surefire.junit5/target/org.eclipse.tycho.surefire.junit5-1.5.0-SNAPSHOT.jar
[INFO] 
[INFO] --- maven-source-plugin:3.1.0:jar-no-fork (default) @ org.eclipse.tycho.surefire.junit5 ---
[INFO] Building jar: /jobs/genie.tycho/tycho-sonar/workspace/tycho-surefire/org.eclipse.tycho.surefire.junit5/target/org.eclipse.tycho.surefire.junit5-1.5.0-SNAPSHOT-sources.jar
[INFO] 
[INFO] --- maven-install-plugin:2.5.2:install (default-install) @ org.eclipse.tycho.surefire.junit5 ---
[INFO] Installing /jobs/genie.tycho/tycho-sonar/workspace/tycho-surefire/org.eclipse.tycho.surefire.junit5/target/org.eclipse.tycho.surefire.junit5-1.5.0-SNAPSHOT.jar to /home/hudson/genie.tycho/.jenkins/jobs/tycho-sonar/workspace/.repository/org/eclipse/tycho/org.eclipse.tycho.surefire.junit5/1.5.0-SNAPSHOT/org.eclipse.tycho.surefire.junit5-1.5.0-SNAPSHOT.jar
[INFO] Installing /jobs/genie.tycho/tycho-sonar/workspace/tycho-surefire/org.eclipse.tycho.surefire.junit5/pom.xml to /home/hudson/genie.tycho/.jenkins/jobs/tycho-sonar/workspace/.repository/org/eclipse/tycho/org.eclipse.tycho.surefire.junit5/1.5.0-SNAPSHOT/org.eclipse.tycho.surefire.junit5-1.5.0-SNAPSHOT.pom
[INFO] Installing /jobs/genie.tycho/tycho-sonar/workspace/tycho-surefire/org.eclipse.tycho.surefire.junit5/target/org.eclipse.tycho.surefire.junit5-1.5.0-SNAPSHOT-sources.jar to /home/hudson/genie.tycho/.jenkins/jobs/tycho-sonar/workspace/.repository/org/eclipse/tycho/org.eclipse.tycho.surefire.junit5/1.5.0-SNAPSHOT/org.eclipse.tycho.surefire.junit5-1.5.0-SNAPSHOT-sources.jar
[INFO] 
[INFO] --------< org.eclipse.tycho:org.eclipse.tycho.surefire.testng >---------
[INFO] Building Tycho Surefire OSGi TestNG Runner 1.5.0-SNAPSHOT        [44/52]
[INFO] --------------------------------[ jar ]---------------------------------
[INFO] 
[INFO] --- maven-clean-plugin:3.1.0:clean (default-clean) @ org.eclipse.tycho.surefire.testng ---
[INFO] Deleting /jobs/genie.tycho/tycho-sonar/workspace/tycho-surefire/org.eclipse.tycho.surefire.testng/target
[INFO] 
[INFO] --- jacoco-maven-plugin:0.8.4:prepare-agent (default) @ org.eclipse.tycho.surefire.testng ---
[INFO] argLine set to -javaagent:/home/hudson/genie.tycho/.jenkins/jobs/tycho-sonar/workspace/.repository/org/jacoco/org.jacoco.agent/0.8.4/org.jacoco.agent-0.8.4-runtime.jar=destfile=/home/hudson/genie.tycho/.jenkins/jobs/tycho-sonar/workspace/target/jacoco.exec,append=true
[INFO] 
[INFO] --- maven-dependency-plugin:3.1.1:unpack (unpack) @ org.eclipse.tycho.surefire.testng ---
[INFO] Configured Artifact: org.apache.maven.surefire:surefire-testng-utils:2.22.0:jar
[INFO] Configured Artifact: org.apache.maven.surefire:surefire-testng:2.22.0:jar
[INFO] Configured Artifact: org.apache.maven.surefire:surefire-grouper:2.22.0:jar
[INFO] Configured Artifact: org.apache.maven.surefire:common-java5:2.22.0:jar
[INFO] Unpacking /home/hudson/genie.tycho/.jenkins/jobs/tycho-sonar/workspace/.repository/org/apache/maven/surefire/surefire-testng-utils/2.22.0/surefire-testng-utils-2.22.0.jar to /jobs/genie.tycho/tycho-sonar/workspace/tycho-surefire/org.eclipse.tycho.surefire.testng/target/classes with includes "" and excludes "META-INF/maven/**,META-INF/DEPENDENCIES,META-INF/LICENSE*,META-INF/NOTICE*"
[INFO] Unpacking /home/hudson/genie.tycho/.jenkins/jobs/tycho-sonar/workspace/.repository/org/apache/maven/surefire/surefire-testng/2.22.0/surefire-testng-2.22.0.jar to /jobs/genie.tycho/tycho-sonar/workspace/tycho-surefire/org.eclipse.tycho.surefire.testng/target/classes with includes "" and excludes "META-INF/maven/**,META-INF/DEPENDENCIES,META-INF/LICENSE*,META-INF/NOTICE*"
[INFO] Unpacking /home/hudson/genie.tycho/.jenkins/jobs/tycho-sonar/workspace/.repository/org/apache/maven/surefire/surefire-grouper/2.22.0/surefire-grouper-2.22.0.jar to /jobs/genie.tycho/tycho-sonar/workspace/tycho-surefire/org.eclipse.tycho.surefire.testng/target/classes with includes "" and excludes "META-INF/maven/**,META-INF/DEPENDENCIES,META-INF/LICENSE*,META-INF/NOTICE*"
[INFO] Unpacking /home/hudson/genie.tycho/.jenkins/jobs/tycho-sonar/workspace/.repository/org/apache/maven/surefire/common-java5/2.22.0/common-java5-2.22.0.jar to /jobs/genie.tycho/tycho-sonar/workspace/tycho-surefire/org.eclipse.tycho.surefire.testng/target/classes with includes "" and excludes "META-INF/maven/**,META-INF/DEPENDENCIES,META-INF/LICENSE*,META-INF/NOTICE*"
[INFO] 
[INFO] --- maven-resources-plugin:3.1.0:resources (default-resources) @ org.eclipse.tycho.surefire.testng ---
[INFO] Using 'UTF-8' encoding to copy filtered resources.
[INFO] Copying 1 resource
[INFO] Copying 2 resources
[INFO] 
[INFO] --- maven-compiler-plugin:3.8.1:compile (default-compile) @ org.eclipse.tycho.surefire.testng ---
[INFO] No sources to compile
[INFO] 
[INFO] --- bnd-maven-plugin:3.5.0:bnd-process (default) @ org.eclipse.tycho.surefire.testng ---
[WARNING] /jobs/genie.tycho/tycho-sonar/workspace/tycho-surefire/org.eclipse.tycho.surefire.testng/bnd.bnd [0:0]: Classpath is empty. Private-Package (-privatepackage) and Export-Package can only expand from the classpath when there is one
[WARNING] /jobs/genie.tycho/tycho-sonar/workspace/tycho-surefire/org.eclipse.tycho.surefire.testng/bnd.bnd [0:0]: Export org.apache.maven.surefire.testng.utils,  has 1,  private references [org.apache.maven.surefire.group.match], 
[INFO] 
[INFO] --- maven-resources-plugin:3.1.0:testResources (default-testResources) @ org.eclipse.tycho.surefire.testng ---
[INFO] Using 'UTF-8' encoding to copy filtered resources.
[INFO] skip non existing resourceDirectory /jobs/genie.tycho/tycho-sonar/workspace/tycho-surefire/org.eclipse.tycho.surefire.testng/src/test/resources
[INFO] 
[INFO] --- maven-compiler-plugin:3.8.1:testCompile (default-testCompile) @ org.eclipse.tycho.surefire.testng ---
[INFO] No sources to compile
[INFO] 
[INFO] --- maven-surefire-plugin:2.22.0:test (default-test) @ org.eclipse.tycho.surefire.testng ---
[INFO] No tests to run.
[INFO] 
[INFO] --- maven-jar-plugin:3.1.2:jar (default-jar) @ org.eclipse.tycho.surefire.testng ---
[INFO] Building jar: /jobs/genie.tycho/tycho-sonar/workspace/tycho-surefire/org.eclipse.tycho.surefire.testng/target/org.eclipse.tycho.surefire.testng-1.5.0-SNAPSHOT.jar
[INFO] 
[INFO] --- maven-source-plugin:3.1.0:jar-no-fork (default) @ org.eclipse.tycho.surefire.testng ---
[INFO] Building jar: /jobs/genie.tycho/tycho-sonar/workspace/tycho-surefire/org.eclipse.tycho.surefire.testng/target/org.eclipse.tycho.surefire.testng-1.5.0-SNAPSHOT-sources.jar
[INFO] 
[INFO] --- maven-install-plugin:2.5.2:install (default-install) @ org.eclipse.tycho.surefire.testng ---
[INFO] Installing /jobs/genie.tycho/tycho-sonar/workspace/tycho-surefire/org.eclipse.tycho.surefire.testng/target/org.eclipse.tycho.surefire.testng-1.5.0-SNAPSHOT.jar to /home/hudson/genie.tycho/.jenkins/jobs/tycho-sonar/workspace/.repository/org/eclipse/tycho/org.eclipse.tycho.surefire.testng/1.5.0-SNAPSHOT/org.eclipse.tycho.surefire.testng-1.5.0-SNAPSHOT.jar
[INFO] Installing /jobs/genie.tycho/tycho-sonar/workspace/tycho-surefire/org.eclipse.tycho.surefire.testng/pom.xml to /home/hudson/genie.tycho/.jenkins/jobs/tycho-sonar/workspace/.repository/org/eclipse/tycho/org.eclipse.tycho.surefire.testng/1.5.0-SNAPSHOT/org.eclipse.tycho.surefire.testng-1.5.0-SNAPSHOT.pom
[INFO] Installing /jobs/genie.tycho/tycho-sonar/workspace/tycho-surefire/org.eclipse.tycho.surefire.testng/target/org.eclipse.tycho.surefire.testng-1.5.0-SNAPSHOT-sources.jar to /home/hudson/genie.tycho/.jenkins/jobs/tycho-sonar/workspace/.repository/org/eclipse/tycho/org.eclipse.tycho.surefire.testng/1.5.0-SNAPSHOT/org.eclipse.tycho.surefire.testng-1.5.0-SNAPSHOT-sources.jar
[INFO] 
[INFO] --------------< org.eclipse.tycho:tycho-surefire-plugin >---------------
[INFO] Building Tycho Surefire Plugin 1.5.0-SNAPSHOT                    [45/52]
[INFO] ----------------------------[ maven-plugin ]----------------------------
[INFO] 
[INFO] --- maven-clean-plugin:3.1.0:clean (default-clean) @ tycho-surefire-plugin ---
[INFO] Deleting /jobs/genie.tycho/tycho-sonar/workspace/tycho-surefire/tycho-surefire-plugin/target
[INFO] 
[INFO] --- jacoco-maven-plugin:0.8.4:prepare-agent (default) @ tycho-surefire-plugin ---
[INFO] argLine set to -javaagent:/home/hudson/genie.tycho/.jenkins/jobs/tycho-sonar/workspace/.repository/org/jacoco/org.jacoco.agent/0.8.4/org.jacoco.agent-0.8.4-runtime.jar=destfile=/home/hudson/genie.tycho/.jenkins/jobs/tycho-sonar/workspace/target/jacoco.exec,append=true
[INFO] 
[INFO] --- maven-resources-plugin:3.1.0:resources (default-resources) @ tycho-surefire-plugin ---
[INFO] Using 'UTF-8' encoding to copy filtered resources.
[INFO] skip non existing resourceDirectory /jobs/genie.tycho/tycho-sonar/workspace/tycho-surefire/tycho-surefire-plugin/src/main/resources
[INFO] 
[INFO] --- maven-compiler-plugin:3.8.1:compile (default-compile) @ tycho-surefire-plugin ---
[INFO] Changes detected - recompiling the module!
[INFO] Compiling 15 source files to /jobs/genie.tycho/tycho-sonar/workspace/tycho-surefire/tycho-surefire-plugin/target/classes
[INFO] 
[INFO] --- maven-plugin-plugin:3.6.0:descriptor (default-descriptor) @ tycho-surefire-plugin ---
[INFO] Using 'UTF-8' encoding to read mojo source files.
[INFO] java-annotations mojo extractor found 1 mojo descriptor.
[INFO] 
[INFO] --- plexus-component-metadata:1.7.1:generate-metadata (default) @ tycho-surefire-plugin ---
[INFO] Discovered 7 component descriptors(s)
[INFO] 
[INFO] --- maven-resources-plugin:3.1.0:testResources (default-testResources) @ tycho-surefire-plugin ---
[INFO] Using 'UTF-8' encoding to copy filtered resources.
[INFO] Copying 20 resources
[INFO] 
[INFO] --- maven-compiler-plugin:3.8.1:testCompile (default-testCompile) @ tycho-surefire-plugin ---
[INFO] Changes detected - recompiling the module!
[INFO] Compiling 8 source files to /jobs/genie.tycho/tycho-sonar/workspace/tycho-surefire/tycho-surefire-plugin/target/test-classes
[INFO] 
[INFO] --- plexus-component-metadata:1.7.1:generate-test-metadata (default) @ tycho-surefire-plugin ---
[INFO] 
[INFO] --- maven-surefire-plugin:2.22.0:test (default-test) @ tycho-surefire-plugin ---
[INFO] 
[INFO] -------------------------------------------------------
[INFO]  T E S T S
[INFO] -------------------------------------------------------
[INFO] Running org.eclipse.tycho.surefire.provider.impl.Junit3ProviderTest
[INFO] Tests run: 3, Failures: 0, Errors: 0, Skipped: 0, Time elapsed: 0.185 s - in org.eclipse.tycho.surefire.provider.impl.Junit3ProviderTest
[INFO] Running org.eclipse.tycho.surefire.provider.impl.ProviderHelperTest
[INFO] Tests run: 16, Failures: 0, Errors: 0, Skipped: 0, Time elapsed: 2.372 s - in org.eclipse.tycho.surefire.provider.impl.ProviderHelperTest
[INFO] Running org.eclipse.tycho.surefire.provider.impl.Junit4ProviderTest
[INFO] Tests run: 3, Failures: 0, Errors: 0, Skipped: 0, Time elapsed: 0.001 s - in org.eclipse.tycho.surefire.provider.impl.Junit4ProviderTest
[INFO] Running org.eclipse.tycho.surefire.provider.impl.Junit47ProviderTest
[INFO] Tests run: 3, Failures: 0, Errors: 0, Skipped: 0, Time elapsed: 0.001 s - in org.eclipse.tycho.surefire.provider.impl.Junit47ProviderTest
[INFO] Running org.eclipse.tycho.surefire.TestMojoTest
[warn] Both parameter 'skipTests' and 'maven.test.skip' are set, 'skipTests' has a higher priority!
[INFO] Tests run: 18, Failures: 0, Errors: 0, Skipped: 0, Time elapsed: 0.041 s - in org.eclipse.tycho.surefire.TestMojoTest
[INFO] Running org.eclipse.tycho.surefire.TestMojoToolchainTests
[INFO] Tests run: 4, Failures: 0, Errors: 0, Skipped: 0, Time elapsed: 1.022 s - in org.eclipse.tycho.surefire.TestMojoToolchainTests
[INFO] Running org.eclipse.tycho.surefire.provisioning.ProvisionedInstallationBuilderTest
[INFO] Tests run: 2, Failures: 0, Errors: 0, Skipped: 0, Time elapsed: 0.005 s - in org.eclipse.tycho.surefire.provisioning.ProvisionedInstallationBuilderTest
[INFO] 
[INFO] Results:
[INFO] 
[INFO] Tests run: 49, Failures: 0, Errors: 0, Skipped: 0
[INFO] 
[INFO] 
[INFO] --- maven-jar-plugin:3.1.2:jar (default-jar) @ tycho-surefire-plugin ---
[INFO] Building jar: /jobs/genie.tycho/tycho-sonar/workspace/tycho-surefire/tycho-surefire-plugin/target/tycho-surefire-plugin-1.5.0-SNAPSHOT.jar
[INFO] 
[INFO] --- maven-plugin-plugin:3.6.0:addPluginArtifactMetadata (default-addPluginArtifactMetadata) @ tycho-surefire-plugin ---
[INFO] 
[INFO] --- maven-source-plugin:3.1.0:jar-no-fork (default) @ tycho-surefire-plugin ---
[INFO] Building jar: /jobs/genie.tycho/tycho-sonar/workspace/tycho-surefire/tycho-surefire-plugin/target/tycho-surefire-plugin-1.5.0-SNAPSHOT-sources.jar
[INFO] 
[INFO] --- maven-install-plugin:2.5.2:install (default-install) @ tycho-surefire-plugin ---
[INFO] Installing /jobs/genie.tycho/tycho-sonar/workspace/tycho-surefire/tycho-surefire-plugin/target/tycho-surefire-plugin-1.5.0-SNAPSHOT.jar to /home/hudson/genie.tycho/.jenkins/jobs/tycho-sonar/workspace/.repository/org/eclipse/tycho/tycho-surefire-plugin/1.5.0-SNAPSHOT/tycho-surefire-plugin-1.5.0-SNAPSHOT.jar
[INFO] Installing /jobs/genie.tycho/tycho-sonar/workspace/tycho-surefire/tycho-surefire-plugin/pom.xml to /home/hudson/genie.tycho/.jenkins/jobs/tycho-sonar/workspace/.repository/org/eclipse/tycho/tycho-surefire-plugin/1.5.0-SNAPSHOT/tycho-surefire-plugin-1.5.0-SNAPSHOT.pom
[INFO] Installing /jobs/genie.tycho/tycho-sonar/workspace/tycho-surefire/tycho-surefire-plugin/target/tycho-surefire-plugin-1.5.0-SNAPSHOT-sources.jar to /home/hudson/genie.tycho/.jenkins/jobs/tycho-sonar/workspace/.repository/org/eclipse/tycho/tycho-surefire-plugin/1.5.0-SNAPSHOT/tycho-surefire-plugin-1.5.0-SNAPSHOT-sources.jar
[INFO] 
[INFO] ------------------< org.eclipse.tycho:tycho-release >-------------------
[INFO] Building Tycho Release Parent 1.5.0-SNAPSHOT                     [46/52]
[INFO] --------------------------------[ pom ]---------------------------------
[INFO] 
[INFO] --- maven-clean-plugin:3.1.0:clean (default-clean) @ tycho-release ---
[INFO] 
[INFO] --- jacoco-maven-plugin:0.8.4:prepare-agent (default) @ tycho-release ---
[INFO] argLine set to -javaagent:/home/hudson/genie.tycho/.jenkins/jobs/tycho-sonar/workspace/.repository/org/jacoco/org.jacoco.agent/0.8.4/org.jacoco.agent-0.8.4-runtime.jar=destfile=/home/hudson/genie.tycho/.jenkins/jobs/tycho-sonar/workspace/target/jacoco.exec,append=true
[INFO] 
[INFO] --- maven-source-plugin:3.1.0:jar-no-fork (default) @ tycho-release ---
[INFO] 
[INFO] --- maven-install-plugin:2.5.2:install (default-install) @ tycho-release ---
[INFO] Installing /jobs/genie.tycho/tycho-sonar/workspace/tycho-release/pom.xml to /home/hudson/genie.tycho/.jenkins/jobs/tycho-sonar/workspace/.repository/org/eclipse/tycho/tycho-release/1.5.0-SNAPSHOT/tycho-release-1.5.0-SNAPSHOT.pom
[INFO] 
[INFO] --------------< org.eclipse.tycho:tycho-versions-plugin >---------------
[INFO] Building Tycho Versions Plugin 1.5.0-SNAPSHOT                    [47/52]
[INFO] ----------------------------[ maven-plugin ]----------------------------
[INFO] 
[INFO] --- maven-clean-plugin:3.1.0:clean (default-clean) @ tycho-versions-plugin ---
[INFO] Deleting /jobs/genie.tycho/tycho-sonar/workspace/tycho-release/tycho-versions-plugin/target
[INFO] 
[INFO] --- jacoco-maven-plugin:0.8.4:prepare-agent (default) @ tycho-versions-plugin ---
[INFO] argLine set to -javaagent:/home/hudson/genie.tycho/.jenkins/jobs/tycho-sonar/workspace/.repository/org/jacoco/org.jacoco.agent/0.8.4/org.jacoco.agent-0.8.4-runtime.jar=destfile=/home/hudson/genie.tycho/.jenkins/jobs/tycho-sonar/workspace/target/jacoco.exec,append=true
[INFO] 
[INFO] --- maven-resources-plugin:3.1.0:resources (default-resources) @ tycho-versions-plugin ---
[INFO] Using 'UTF-8' encoding to copy filtered resources.
[INFO] skip non existing resourceDirectory /jobs/genie.tycho/tycho-sonar/workspace/tycho-release/tycho-versions-plugin/src/main/resources
[INFO] 
[INFO] --- maven-compiler-plugin:3.8.1:compile (default-compile) @ tycho-versions-plugin ---
[INFO] Changes detected - recompiling the module!
[INFO] Compiling 43 source files to /jobs/genie.tycho/tycho-sonar/workspace/tycho-release/tycho-versions-plugin/target/classes
[INFO] 
[INFO] --- maven-plugin-plugin:3.6.0:descriptor (default-descriptor) @ tycho-versions-plugin ---
[INFO] Using 'UTF-8' encoding to read mojo source files.
[INFO] java-annotations mojo extractor found 3 mojo descriptors.
[INFO] 
[INFO] --- plexus-component-metadata:1.7.1:generate-metadata (default) @ tycho-versions-plugin ---
[INFO] Discovered 12 component descriptors(s)
[INFO] 
[INFO] --- maven-resources-plugin:3.1.0:testResources (default-testResources) @ tycho-versions-plugin ---
[INFO] Using 'UTF-8' encoding to copy filtered resources.
[INFO] Copying 262 resources
[INFO] 
[INFO] --- maven-compiler-plugin:3.8.1:testCompile (default-testCompile) @ tycho-versions-plugin ---
[INFO] Changes detected - recompiling the module!
[INFO] Compiling 12 source files to /jobs/genie.tycho/tycho-sonar/workspace/tycho-release/tycho-versions-plugin/target/test-classes
[INFO] 
[INFO] --- plexus-component-metadata:1.7.1:generate-test-metadata (default) @ tycho-versions-plugin ---
[INFO] 
[INFO] --- maven-surefire-plugin:2.22.0:test (default-test) @ tycho-versions-plugin ---
[INFO] 
[INFO] -------------------------------------------------------
[INFO]  T E S T S
[INFO] -------------------------------------------------------
[INFO] Running org.eclipse.tycho.versions.engine.tests.DefaultVersionRangeUpdateStrategyTest
[INFO] Tests run: 11, Failures: 0, Errors: 0, Skipped: 0, Time elapsed: 0.087 s - in org.eclipse.tycho.versions.engine.tests.DefaultVersionRangeUpdateStrategyTest
[INFO] Running org.eclipse.tycho.versions.engine.tests.ImportRefVersionConstraintTest
[INFO] Tests run: 5, Failures: 0, Errors: 0, Skipped: 0, Time elapsed: 0 s - in org.eclipse.tycho.versions.engine.tests.ImportRefVersionConstraintTest
[INFO] Running org.eclipse.tycho.versions.engine.tests.ProjectMetadataReaderTest
[INFO] Custom pom.xml file name is not supported at src/test/resources/projects/simple/pom.xml_expected
[INFO] Project does not exist at src/test/resources/projects/simple/missing
[INFO] Tests run: 3, Failures: 0, Errors: 0, Skipped: 0, Time elapsed: 0.932 s - in org.eclipse.tycho.versions.engine.tests.ProjectMetadataReaderTest
[INFO] Running org.eclipse.tycho.versions.engine.tests.VersionsEngineTest
[INFO] Making changes in /jobs/genie.tycho/tycho-sonar/workspace/tycho-release/tycho-versions-plugin/target/projects/exportpackage
[INFO]   pom.xml//project/version: 1.0.0-SNAPSHOT => 1.0.1-SNAPSHOT
[INFO]   META-INF/MANIFEST.MF//Bundle-Version: 1.0.0.qualifier => 1.0.1.qualifier
[INFO]   META-INF/MANIFEST.MF//Export-Package//org.eclipse.tycho.test;version: 1.0.0 => 1.0.1
[INFO]   META-INF/MANIFEST.MF//Export-Package//org.eclipse.tycho.core;version: 1.0.0 => 1.0.1
[INFO]   META-INF/MANIFEST.MF//Export-Package//org.eclipse.tycho;version: 1.0.0 => 1.0.1
[INFO] Making changes in /jobs/genie.tycho/tycho-sonar/workspace/tycho-release/tycho-versions-plugin/target/projects/dependencysimple
[INFO] Making changes in /jobs/genie.tycho/tycho-sonar/workspace/tycho-release/tycho-versions-plugin/target/projects/dependencysimple/bundle
[INFO]   pom.xml//project/dependencies/dependency/[ dependencysimple:someproject ] 1.0.0-SNAPSHOT => 1.0.1-SNAPSHOT
[INFO]   pom.xml//project/profiles/profile[ test ]/dependencies/dependency/[ dependencysimple:someproject ] 1.0.0-SNAPSHOT => 1.0.1-SNAPSHOT
[INFO] Making changes in /jobs/genie.tycho/tycho-sonar/workspace/tycho-release/tycho-versions-plugin/target/projects/dependencysimple/someproject
[INFO]   pom.xml//project/version: 1.0.0-SNAPSHOT => 1.0.1-SNAPSHOT
[INFO] Making changes in /jobs/genie.tycho/tycho-sonar/workspace/tycho-release/tycho-versions-plugin/target/projects/dependencymanagementotherversion
[INFO] Making changes in /jobs/genie.tycho/tycho-sonar/workspace/tycho-release/tycho-versions-plugin/target/projects/dependencymanagementotherversion/bundle
[INFO] Making changes in /jobs/genie.tycho/tycho-sonar/workspace/tycho-release/tycho-versions-plugin/target/projects/dependencymanagementotherversion/someproject
[INFO]   pom.xml//project/version: 1.0.0-SNAPSHOT => 1.0.1-SNAPSHOT
[INFO] Making changes in /jobs/genie.tycho/tycho-sonar/workspace/tycho-release/tycho-versions-plugin/target/projects/versionranges
[INFO]   pom.xml//project/version: 1.0.0-SNAPSHOT => 1.0.1-SNAPSHOT
[INFO] Making changes in /jobs/genie.tycho/tycho-sonar/workspace/tycho-release/tycho-versions-plugin/target/projects/versionranges/bundle1
[INFO]   pom.xml//project/parent/version: 1.0.0-SNAPSHOT => 1.0.1-SNAPSHOT
[INFO]   pom.xml//project/version: 1.0.0-SNAPSHOT => 1.0.1-SNAPSHOT
[INFO]   META-INF/MANIFEST.MF//Bundle-Version: 1.0.0.qualifier => 1.0.1.qualifier
[INFO]   META-INF/MANIFEST.MF//Export-Package//org.bundle1.package1;version: 1.0.0 => 1.0.1
[INFO] Making changes in /jobs/genie.tycho/tycho-sonar/workspace/tycho-release/tycho-versions-plugin/target/projects/versionranges/bundle2
[INFO]   pom.xml//project/version: 1.0.0-SNAPSHOT => 1.0.1-SNAPSHOT
[INFO]   pom.xml//project/parent/version: 1.0.0-SNAPSHOT => 1.0.1-SNAPSHOT
[INFO]   META-INF/MANIFEST.MF//Bundle-Version: 1.0.0.qualifier => 1.0.1.qualifier
[INFO]   META-INF/MANIFEST.MF//Import-Package//org.bundle1.package1;version: 1.0.0 => 1.0.1
[INFO] Making changes in /jobs/genie.tycho/tycho-sonar/workspace/tycho-release/tycho-versions-plugin/target/projects/versionranges/bundle3
[INFO]   pom.xml//project/parent/version: 1.0.0-SNAPSHOT => 1.0.1-SNAPSHOT
[INFO] Making changes in /jobs/genie.tycho/tycho-sonar/workspace/tycho-release/tycho-versions-plugin/target/projects/versionranges/fragment
[INFO]   pom.xml//project/parent/version: 1.0.0-SNAPSHOT => 1.0.1-SNAPSHOT
[INFO]   pom.xml//project/version: 1.0.0-SNAPSHOT => 1.0.1-SNAPSHOT
[INFO]   META-INF/MANIFEST.MF//Bundle-Version: 1.0.0.qualifier => 1.0.1.qualifier
[INFO]   META-INF/MANIFEST.MF//Fragment-Host//bundle1;bundle-version: 1.0.1 => 1.0.1
[INFO] Making changes in /jobs/genie.tycho/tycho-sonar/workspace/tycho-release/tycho-versions-plugin/target/projects/pomproperties
[INFO]   pom.xml//project/properties/[ p1 ] original => changed
[INFO]   pom.xml//project/profiles/profile[ test ]/properties/[ p1 ] original => changed
[INFO] Making changes in /jobs/genie.tycho/tycho-sonar/workspace/tycho-release/tycho-versions-plugin/target/projects/exlicitversion
[INFO]   pom.xml//project/version: 1.0.0-SNAPSHOT => 1.0.1-SNAPSHOT
[INFO] Making changes in /jobs/genie.tycho/tycho-sonar/workspace/tycho-release/tycho-versions-plugin/target/projects/exlicitversion/otherversion
[INFO]   pom.xml//project/parent/version: 1.0.0-SNAPSHOT => 1.0.1-SNAPSHOT
[INFO] Making changes in /jobs/genie.tycho/tycho-sonar/workspace/tycho-release/tycho-versions-plugin/target/projects/exlicitversion/sameversion
[INFO]   pom.xml//project/parent/version: 1.0.0-SNAPSHOT => 1.0.1-SNAPSHOT
[INFO]   pom.xml//project/version: 1.0.0-SNAPSHOT => 1.0.1-SNAPSHOT
[INFO]   META-INF/MANIFEST.MF//Bundle-Version: 1.0.0.qualifier => 1.0.1.qualifier
[INFO] Making changes in /jobs/genie.tycho/tycho-sonar/workspace/tycho-release/tycho-versions-plugin/target/projects/targetplatform
[INFO]   pom.xml//project/version: 0.1.0-SNAPSHOT => 0.2.0-SNAPSHOT
[INFO] Making changes in /jobs/genie.tycho/tycho-sonar/workspace/tycho-release/tycho-versions-plugin/target/projects/targetplatform/bundle01
[INFO]   pom.xml//project/version: 0.1.0-SNAPSHOT => 0.2.0-SNAPSHOT
[INFO]   pom.xml//project/parent/version: 0.1.0-SNAPSHOT => 0.2.0-SNAPSHOT
[INFO]   META-INF/MANIFEST.MF//Bundle-Version: 0.1.0.qualifier => 0.2.0.qualifier
[INFO] Making changes in /jobs/genie.tycho/tycho-sonar/workspace/tycho-release/tycho-versions-plugin/target/projects/targetplatform/targetplatform
[INFO]   pom.xml//project/build/plugins/plugin/[ org.eclipse.tycho:target-platform-configuration ] /configuration/target/artifact/[ targetplatform:bundle01 ] 0.1.0-SNAPSHOT => 0.2.0-SNAPSHOT
[INFO] Making changes in /jobs/genie.tycho/tycho-sonar/workspace/tycho-release/tycho-versions-plugin/target/projects/profile
[INFO]   pom.xml//project/version: 1.0.0-SNAPSHOT => 1.0.1-SNAPSHOT
[INFO] Making changes in /jobs/genie.tycho/tycho-sonar/workspace/tycho-release/tycho-versions-plugin/target/projects/profile/bundle01
[INFO]   pom.xml//project/version: 1.0.0-SNAPSHOT => 1.0.1-SNAPSHOT
[INFO]   pom.xml//project/parent/version: 1.0.0-SNAPSHOT => 1.0.1-SNAPSHOT
[INFO]   META-INF/MANIFEST.MF//Bundle-Version: 1.0.0.qualifier => 1.0.1.qualifier
[INFO] Making changes in /jobs/genie.tycho/tycho-sonar/workspace/tycho-release/tycho-versions-plugin/target/projects/profile/bundle02
[INFO]   pom.xml//project/parent/version: 1.0.0-SNAPSHOT => 1.0.1-SNAPSHOT
[INFO]   pom.xml//project/version: 1.0.0-SNAPSHOT => 1.0.1-SNAPSHOT
[INFO]   META-INF/MANIFEST.MF//Bundle-Version: 1.0.0.qualifier => 1.0.1.qualifier
[INFO] Making changes in /jobs/genie.tycho/tycho-sonar/workspace/tycho-release/tycho-versions-plugin/target/projects/nonosgiversion/maven
[INFO]   pom.xml//project/version: 1.0.0-SNAPSHOT => 1.0.1-01
[INFO] Making changes in /jobs/genie.tycho/tycho-sonar/workspace/tycho-release/tycho-versions-plugin/target/projects/deepnesting
[INFO]   pom.xml//project/version: 1.0.0-SNAPSHOT => 1.0.1-SNAPSHOT
[INFO] Making changes in /jobs/genie.tycho/tycho-sonar/workspace/tycho-release/tycho-versions-plugin/target/projects/deepnesting/child
[INFO]   pom.xml//project/parent/version: 1.0.0-SNAPSHOT => 1.0.1-SNAPSHOT
[INFO]   pom.xml//project/version: 1.0.0-SNAPSHOT => 1.0.1-SNAPSHOT
[INFO] Making changes in /jobs/genie.tycho/tycho-sonar/workspace/tycho-release/tycho-versions-plugin/target/projects/deepnesting/child/grandchild
[INFO]   pom.xml//project/version: 1.0.0-SNAPSHOT => 1.0.1-SNAPSHOT
[INFO]   pom.xml//project/parent/version: 1.0.0-SNAPSHOT => 1.0.1-SNAPSHOT
[INFO] Making changes in /jobs/genie.tycho/tycho-sonar/workspace/tycho-release/tycho-versions-plugin/target/projects/deepnesting/child/grandchild/bundle
[INFO]   pom.xml//project/parent/version: 1.0.0-SNAPSHOT => 1.0.1-SNAPSHOT
[INFO]   pom.xml//project/version: 1.0.0-SNAPSHOT => 1.0.1-SNAPSHOT
[INFO]   META-INF/MANIFEST.MF//Bundle-Version: 1.0.0.qualifier => 1.0.1.qualifier
[INFO] Making changes in /jobs/genie.tycho/tycho-sonar/workspace/tycho-release/tycho-versions-plugin/target/projects/profilenoid
[INFO]   pom.xml//project/version: 0.0.1-SNAPSHOT => 1.0.1-01
[INFO] Making changes in /jobs/genie.tycho/tycho-sonar/workspace/tycho-release/tycho-versions-plugin/target/projects/multimodule
[INFO]   pom.xml//project/version: 1.0.0-SNAPSHOT => 1.0.1-SNAPSHOT
[INFO] Making changes in /jobs/genie.tycho/tycho-sonar/workspace/tycho-release/tycho-versions-plugin/target/projects/multimodule/bundle
[INFO]   pom.xml//project/version: 1.0.0-SNAPSHOT => 1.0.1-SNAPSHOT
[INFO]   pom.xml//project/parent/version: 1.0.0-SNAPSHOT => 1.0.1-SNAPSHOT
[INFO]   META-INF/MANIFEST.MF//Bundle-Version: 1.0.0.qualifier => 1.0.1.qualifier
[INFO] Making changes in /jobs/genie.tycho/tycho-sonar/workspace/tycho-release/tycho-versions-plugin/target/projects/multimodule/feature01
[INFO]   pom.xml//project/parent/version: 1.0.0-SNAPSHOT => 1.0.1-SNAPSHOT
[INFO]   pom.xml//project/version: 1.0.0-SNAPSHOT => 1.0.1-SNAPSHOT
[INFO]   feature.xml//feature/includes/@id='feature02'/@version: 1.0.0.qualifier => 1.0.1.qualifier
[INFO]   feature.xml//feature/plugin/@id='bundle'/@version: 1.0.0.qualifier => 1.0.1.qualifier
[INFO]   feature.xml//feature/@version: 1.0.0.qualifier => 1.0.1.qualifier
[INFO] Making changes in /jobs/genie.tycho/tycho-sonar/workspace/tycho-release/tycho-versions-plugin/target/projects/multimodule/feature02
[INFO]   pom.xml//project/version: 1.0.0-SNAPSHOT => 1.0.1-SNAPSHOT
[INFO]   pom.xml//project/parent/version: 1.0.0-SNAPSHOT => 1.0.1-SNAPSHOT
[INFO]   feature.xml//feature/@version: 1.0.0.qualifier => 1.0.1.qualifier
[INFO] Making changes in /jobs/genie.tycho/tycho-sonar/workspace/tycho-release/tycho-versions-plugin/target/projects/multimodule/feature03
[INFO]   pom.xml//project/version: 1.0.0-SNAPSHOT => 1.0.1-SNAPSHOT
[INFO]   pom.xml//project/parent/version: 1.0.0-SNAPSHOT => 1.0.1-SNAPSHOT
[INFO]   feature.xml//feature/@version: 1.0.0.qualifier => 1.0.1.qualifier
[INFO]   feature.xml//feature/requires/import/@feature='feature02'/@version: 1.0.0(match=perfect) => 1.0.1(match=perfect)
[INFO]   feature.xml//feature/requires/import/@plugin='bundle'/@version: 1.0.0(match=perfect) => 1.0.1(match=perfect)
[INFO] Making changes in /jobs/genie.tycho/tycho-sonar/workspace/tycho-release/tycho-versions-plugin/target/projects/multimodule/site
[INFO]   site.xml//site/feature/@id=feature01/@version: 1.0.0.qualifier => 1.0.1.qualifier
[INFO]   site.xml//site/feature/@id=feature01/@url: features/feature01_1.0.0.qualifier.jar => features/feature01_1.0.1.qualifier.jar
[INFO]   pom.xml//project/version: 1.0.0-SNAPSHOT => 1.0.1-SNAPSHOT
[INFO]   pom.xml//project/parent/version: 1.0.0-SNAPSHOT => 1.0.1-SNAPSHOT
[INFO] Making changes in /jobs/genie.tycho/tycho-sonar/workspace/tycho-release/tycho-versions-plugin/target/projects/multimodule/product
[INFO]   product.product//product/@version: 1.0.0.qualifier => 1.0.1.qualifier
[INFO]   product.product//product/plugins/plugin/@id=bundle/@version: 1.0.0.qualifier => 1.0.1.qualifier
[INFO]   product.product//product/features/feature/@id=feature01/@version: 1.0.0.qualifier => 1.0.1.qualifier
[INFO]   pom.xml//project/version: 1.0.0-SNAPSHOT => 1.0.1-SNAPSHOT
[INFO]   pom.xml//project/parent/version: 1.0.0-SNAPSHOT => 1.0.1-SNAPSHOT
[INFO] Making changes in /jobs/genie.tycho/tycho-sonar/workspace/tycho-release/tycho-versions-plugin/target/projects/multimodule/repository
[INFO]   category.xml//site/bundle[@id=bundle]/@version: 1.0.0.qualifier => 1.0.1.qualifier
[INFO]   category.xml//site/feature[@id=feature01]/@version: 1.0.0.qualifier => 1.0.1.qualifier
[INFO]   category.xml//site/feature[@id=feature01]/@url: features/feature01_1.0.0.qualifier => features/feature01_1.0.1.qualifier
[INFO]   category.xml//site/feature[@id=feature01]/@version: 1.0.0.qualifier => 1.0.1.qualifier
[INFO]   pom.xml//project/version: 1.0.0-SNAPSHOT => 1.0.1-SNAPSHOT
[INFO]   pom.xml//project/parent/version: 1.0.0-SNAPSHOT => 1.0.1-SNAPSHOT
[INFO]   differentversion.product//product/plugins/plugin/@id=bundle/@version: 1.0.0.qualifier => 1.0.1.qualifier
[INFO]   product.product//product/plugins/plugin/@id=bundle/@version: 1.0.0.qualifier => 1.0.1.qualifier
[INFO]   product.product//product/@version: 1.0.0.qualifier => 1.0.1.qualifier
[INFO]   differentversion.product//product/features/feature/@id=feature01/@version: 1.0.0.qualifier => 1.0.1.qualifier
[INFO]   product.product//product/features/feature/@id=feature01/@version: 1.0.0.qualifier => 1.0.1.qualifier
[INFO] Making changes in /jobs/genie.tycho/tycho-sonar/workspace/tycho-release/tycho-versions-plugin/target/projects/multimodule/repository-product-only
[INFO]   pom.xml//project/version: 1.0.0-SNAPSHOT => 1.0.1-SNAPSHOT
[INFO]   pom.xml//project/parent/version: 1.0.0-SNAPSHOT => 1.0.1-SNAPSHOT
[INFO]   product2.product//product/@version: 1.0.0.qualifier => 1.0.1.qualifier
[INFO]   product2.product//product/features/feature/@id=feature01/@version: 1.0.0.qualifier => 1.0.1.qualifier
[INFO] Making changes in /jobs/genie.tycho/tycho-sonar/workspace/tycho-release/tycho-versions-plugin/target/projects/multimodule/iu
[INFO]   p2iu.xml//unit/@version: 1.0.0.qualifier => 1.0.1.qualifier
[INFO]   pom.xml//project/version: 1.0.0-SNAPSHOT => 1.0.1-SNAPSHOT
[INFO]   pom.xml//project/parent/version: 1.0.0-SNAPSHOT => 1.0.1-SNAPSHOT
[INFO] Making changes in /jobs/genie.tycho/tycho-sonar/workspace/tycho-release/tycho-versions-plugin/target/projects/dependencyotherversion
[INFO] Making changes in /jobs/genie.tycho/tycho-sonar/workspace/tycho-release/tycho-versions-plugin/target/projects/dependencyotherversion/bundle
[INFO] Making changes in /jobs/genie.tycho/tycho-sonar/workspace/tycho-release/tycho-versions-plugin/target/projects/dependencyotherversion/someproject
[INFO]   pom.xml//project/version: 1.0.0-SNAPSHOT => 1.0.1-SNAPSHOT
[INFO] Making changes in /jobs/genie.tycho/tycho-sonar/workspace/tycho-release/tycho-versions-plugin/target/projects/aggregator
[INFO]   pom.xml//project/version: 1.0.0-SNAPSHOT => 1.0.1-SNAPSHOT
[INFO] Making changes in /jobs/genie.tycho/tycho-sonar/workspace/tycho-release/tycho-versions-plugin/target/projects/aggregator/parent
[INFO]   pom.xml//project/version: 1.0.0-SNAPSHOT => 1.0.1-SNAPSHOT
[INFO] Making changes in /jobs/genie.tycho/tycho-sonar/workspace/tycho-release/tycho-versions-plugin/target/projects/aggregator/bundle
[INFO]   pom.xml//project/version: 1.0.0-SNAPSHOT => 1.0.1-SNAPSHOT
[INFO]   pom.xml//project/parent/version: 1.0.0-SNAPSHOT => 1.0.1-SNAPSHOT
[INFO]   META-INF/MANIFEST.MF//Bundle-Version: 1.0.0.qualifier => 1.0.1.qualifier
[INFO] Making changes in /jobs/genie.tycho/tycho-sonar/workspace/tycho-release/tycho-versions-plugin/target/projects/aggregator/detached
[INFO] Making changes in /jobs/genie.tycho/tycho-sonar/workspace/tycho-release/tycho-versions-plugin/target/projects/deepnesting
[INFO]   pom.xml//project/version: 1.0.0-SNAPSHOT => 1.0.1-SNAPSHOT
[INFO] Making changes in /jobs/genie.tycho/tycho-sonar/workspace/tycho-release/tycho-versions-plugin/target/projects/deepnesting/child
[INFO]   pom.xml//project/parent/version: 1.0.0-SNAPSHOT => 1.0.1-SNAPSHOT
[INFO]   pom.xml//project/version: 1.0.0-SNAPSHOT => 1.0.1-SNAPSHOT
[INFO] Making changes in /jobs/genie.tycho/tycho-sonar/workspace/tycho-release/tycho-versions-plugin/target/projects/deepnesting/child/grandchild
[INFO]   pom.xml//project/version: 1.0.0-SNAPSHOT => 1.0.1-SNAPSHOT
[INFO]   pom.xml//project/parent/version: 1.0.0-SNAPSHOT => 1.0.1-SNAPSHOT
[INFO] Making changes in /jobs/genie.tycho/tycho-sonar/workspace/tycho-release/tycho-versions-plugin/target/projects/deepnesting/child/grandchild/bundle
[INFO]   pom.xml//project/parent/version: 1.0.0-SNAPSHOT => 1.0.1-SNAPSHOT
[INFO]   pom.xml//project/version: 1.0.0-SNAPSHOT => 1.0.1-SNAPSHOT
[INFO]   META-INF/MANIFEST.MF//Bundle-Version: 1.0.0.qualifier => 1.0.1.qualifier
[INFO] Making changes in /jobs/genie.tycho/tycho-sonar/workspace/tycho-release/tycho-versions-plugin/target/projects/buildpluginnogroupid
[INFO]   pom.xml//project/version: 0.0.1-SNAPSHOT => 1.0.1-01
[INFO] Making changes in /jobs/genie.tycho/tycho-sonar/workspace/tycho-release/tycho-versions-plugin/target/projects/pluginmanagement
[INFO]   pom.xml//project/build/plugins/plugin/[ pluginmanagement:plugin ] 1.0.0-SNAPSHOT => 1.0.1-SNAPSHOT
[INFO]   pom.xml//project/build/pluginManagemment/plugins/plugin/[ pluginmanagement:plugin ] 1.0.0-SNAPSHOT => 1.0.1-SNAPSHOT
[INFO]   pom.xml//project/profiles/profile[ test ]/build/plugins/plugin/[ pluginmanagement:plugin ] 1.0.0-SNAPSHOT => 1.0.1-SNAPSHOT
[INFO]   pom.xml//project/profiles/profile[ test ]/build/pluginManagemment/plugins/plugin/[ pluginmanagement:plugin ] 1.0.0-SNAPSHOT => 1.0.1-SNAPSHOT
[INFO]   pom.xml//project/version: 1.0.0-SNAPSHOT => 1.0.1-SNAPSHOT
[INFO]   pom.xml//project/build/plugins/plugin/[ pluginmanagement:plugin ] /dependencies/dependency/[ pluginmanagement:jar ] 1.0.0-SNAPSHOT => 1.0.1-SNAPSHOT
[INFO]   pom.xml//project/build/pluginManagemment/plugins/plugin/[ pluginmanagement:plugin ] /dependencies/dependency/[ pluginmanagement:jar ] 1.0.0-SNAPSHOT => 1.0.1-SNAPSHOT
[INFO]   pom.xml//project/profiles/profile[ test ]/build/plugins/plugin/[ pluginmanagement:plugin ] /dependencies/dependency/[ pluginmanagement:jar ] 1.0.0-SNAPSHOT => 1.0.1-SNAPSHOT
[INFO]   pom.xml//project/profiles/profile[ test ]/build/pluginManagemment/plugins/plugin/[ pluginmanagement:plugin ] /dependencies/dependency/[ pluginmanagement:jar ] 1.0.0-SNAPSHOT => 1.0.1-SNAPSHOT
[INFO] Making changes in /jobs/genie.tycho/tycho-sonar/workspace/tycho-release/tycho-versions-plugin/target/projects/pluginmanagement/plugin
[INFO]   pom.xml//project/version: 1.0.0-SNAPSHOT => 1.0.1-SNAPSHOT
[INFO]   pom.xml//project/parent/version: 1.0.0-SNAPSHOT => 1.0.1-SNAPSHOT
[INFO] Making changes in /jobs/genie.tycho/tycho-sonar/workspace/tycho-release/tycho-versions-plugin/target/projects/pluginmanagement/jar
[INFO]   pom.xml//project/parent/version: 1.0.0-SNAPSHOT => 1.0.1-SNAPSHOT
[INFO]   pom.xml//project/version: 1.0.0-SNAPSHOT => 1.0.1-SNAPSHOT
[INFO] Making changes in /jobs/genie.tycho/tycho-sonar/workspace/tycho-release/tycho-versions-plugin/target/projects/dependencymanagementsimple
[INFO] Making changes in /jobs/genie.tycho/tycho-sonar/workspace/tycho-release/tycho-versions-plugin/target/projects/dependencymanagementsimple/bundle
[INFO]   pom.xml//project/dependencyManagement/dependencies/dependency/[ dependencymanagementsimple:someproject ] 1.0.0-SNAPSHOT => 1.0.1-SNAPSHOT
[INFO]   pom.xml//project/profiles/profile[ test ]/dependencyManagement/dependencies/dependency/[ dependencymanagementsimple:someproject ] 1.0.0-SNAPSHOT => 1.0.1-SNAPSHOT
[INFO] Making changes in /jobs/genie.tycho/tycho-sonar/workspace/tycho-release/tycho-versions-plugin/target/projects/dependencymanagementsimple/someproject
[INFO]   pom.xml//project/version: 1.0.0-SNAPSHOT => 1.0.1-SNAPSHOT
[INFO] Making changes in /jobs/genie.tycho/tycho-sonar/workspace/tycho-release/tycho-versions-plugin/target/projects/dependencynoversion
[INFO]   pom.xml//project/dependencyManagement/dependencies/dependency/[ dependencynoversion:testmodule ] 1.0.0-SNAPSHOT => 4.8
[INFO] Making changes in /jobs/genie.tycho/tycho-sonar/workspace/tycho-release/tycho-versions-plugin/target/projects/dependencynoversion/module
[INFO] Making changes in /jobs/genie.tycho/tycho-sonar/workspace/tycho-release/tycho-versions-plugin/target/projects/dependencynoversion/testmodule
[INFO]   pom.xml//project/version: 1.0.0-SNAPSHOT => 4.8
[INFO] Making changes in /jobs/genie.tycho/tycho-sonar/workspace/tycho-release/tycho-versions-plugin/target/projects/simple
[INFO]   pom.xml//project/version: 1.0.0-SNAPSHOT => 1.0.1-SNAPSHOT
[INFO]   META-INF/MANIFEST.MF//Bundle-Version: 1.0.0.qualifier => 1.0.1.qualifier
[INFO] Tests run: 23, Failures: 0, Errors: 0, Skipped: 0, Time elapsed: 1.395 s - in org.eclipse.tycho.versions.engine.tests.VersionsEngineTest
[INFO] Running org.eclipse.tycho.versions.engine.tests.PomUpdaterTest
[WARNING] Skipping updating pom in directory /jobs/genie.tycho/tycho-sonar/workspace/tycho-release/tycho-versions-plugin/target/projects/updatepom/repositoryWith2ProductFiles because more than one product files have been found. Only one product file is supported or one must be named <artifactId>.product
[INFO] Making changes in /jobs/genie.tycho/tycho-sonar/workspace/tycho-release/tycho-versions-plugin/target/projects/updatepom
[INFO] Making changes in /jobs/genie.tycho/tycho-sonar/workspace/tycho-release/tycho-versions-plugin/target/projects/updatepom/bundle
[INFO]   pom.xml//project/version: 1.0.0-SNAPSHOT => 1.0.1-SNAPSHOT
[INFO] Making changes in /jobs/genie.tycho/tycho-sonar/workspace/tycho-release/tycho-versions-plugin/target/projects/updatepom/feature
[INFO]   pom.xml//project/version: 1.0.0-SNAPSHOT => 1.0.1-SNAPSHOT
[INFO] Making changes in /jobs/genie.tycho/tycho-sonar/workspace/tycho-release/tycho-versions-plugin/target/projects/updatepom/product
[INFO]   pom.xml//project/version: 1.0.0-SNAPSHOT => 1.0.1-SNAPSHOT
[INFO] Making changes in /jobs/genie.tycho/tycho-sonar/workspace/tycho-release/tycho-versions-plugin/target/projects/updatepom/repository
[INFO]   pom.xml//project/version: 1.0.0-SNAPSHOT => 1.0.1-SNAPSHOT
[INFO] Making changes in /jobs/genie.tycho/tycho-sonar/workspace/tycho-release/tycho-versions-plugin/target/projects/updatepom/repositoryWithOneProductFile
[INFO]   pom.xml//project/version: 1.0.0-SNAPSHOT => 1.0.1-SNAPSHOT
[INFO] Making changes in /jobs/genie.tycho/tycho-sonar/workspace/tycho-release/tycho-versions-plugin/target/projects/updatepom/repositoryWith2ProductFiles
[INFO] Making changes in /jobs/genie.tycho/tycho-sonar/workspace/tycho-release/tycho-versions-plugin/target/projects/updatepom/iu
[INFO]   pom.xml//project/version: 1.0.0-SNAPSHOT => 1.0.1-SNAPSHOT
[INFO] Tests run: 1, Failures: 0, Errors: 0, Skipped: 0, Time elapsed: 0.066 s - in org.eclipse.tycho.versions.engine.tests.PomUpdaterTest
[INFO] Running org.eclipse.tycho.versions.engine.tests.EclipseVersionUpdaterTest
[WARNING] Skipping updating pom in directory /jobs/genie.tycho/tycho-sonar/workspace/tycho-release/tycho-versions-plugin/target/projects/updateeclipse/repositoryWith2ProductFiles because more than one product files have been found. Only one product file is supported or one must be named <artifactId>.product
[INFO] Making changes in /jobs/genie.tycho/tycho-sonar/workspace/tycho-release/tycho-versions-plugin/target/projects/updateeclipse
[INFO] Making changes in /jobs/genie.tycho/tycho-sonar/workspace/tycho-release/tycho-versions-plugin/target/projects/updateeclipse/bundle
[INFO]   META-INF/MANIFEST.MF//Bundle-Version: 1.0.0.qualifier => 1.0.1.qualifier
[INFO] Making changes in /jobs/genie.tycho/tycho-sonar/workspace/tycho-release/tycho-versions-plugin/target/projects/updateeclipse/feature
[INFO]   feature.xml//feature/@version: 1.0.0.qualifier => 1.0.1.qualifier
[INFO] Making changes in /jobs/genie.tycho/tycho-sonar/workspace/tycho-release/tycho-versions-plugin/target/projects/updateeclipse/product
[INFO]   product.product//product/@version: 1.0.0.qualifier => 1.0.1.qualifier
[INFO] Making changes in /jobs/genie.tycho/tycho-sonar/workspace/tycho-release/tycho-versions-plugin/target/projects/updateeclipse/repository
[INFO]   repository.product//product/@version: 1.0.0.qualifier => 1.0.1.qualifier
[INFO] Making changes in /jobs/genie.tycho/tycho-sonar/workspace/tycho-release/tycho-versions-plugin/target/projects/updateeclipse/repositoryWithOneProductFile
[INFO]   anotherNameThanArtifactId.product//product/@version: 1.0.0.qualifier => 1.0.1.qualifier
[INFO] Making changes in /jobs/genie.tycho/tycho-sonar/workspace/tycho-release/tycho-versions-plugin/target/projects/updateeclipse/repositoryWith2ProductFiles
[INFO] Making changes in /jobs/genie.tycho/tycho-sonar/workspace/tycho-release/tycho-versions-plugin/target/projects/updateeclipse/iu
[INFO]   p2iu.xml//unit/@version: 1.0.0.qualifier => 1.0.1.qualifier
[INFO] Tests run: 1, Failures: 0, Errors: 0, Skipped: 0, Time elapsed: 0.06 s - in org.eclipse.tycho.versions.engine.tests.EclipseVersionUpdaterTest
[INFO] Running org.eclipse.tycho.versions.bundle.tests.MutableManifestElementTest
[INFO] Tests run: 8, Failures: 0, Errors: 0, Skipped: 0, Time elapsed: 0.002 s - in org.eclipse.tycho.versions.bundle.tests.MutableManifestElementTest
[INFO] Running org.eclipse.tycho.versions.bundle.tests.MutableBundleManifestTest
[INFO] Tests run: 12, Failures: 0, Errors: 0, Skipped: 0, Time elapsed: 0.008 s - in org.eclipse.tycho.versions.bundle.tests.MutableBundleManifestTest
[INFO] Running org.eclipse.tycho.versions.bundle.tests.ManifestAttributeTest
[INFO] Tests run: 11, Failures: 0, Errors: 0, Skipped: 0, Time elapsed: 0.002 s - in org.eclipse.tycho.versions.bundle.tests.ManifestAttributeTest
[INFO] Running org.eclipse.tycho.versions.manipulation.SiteXmlManipulatorTest
[INFO] Tests run: 1, Failures: 0, Errors: 0, Skipped: 0, Time elapsed: 0 s - in org.eclipse.tycho.versions.manipulation.SiteXmlManipulatorTest
[INFO] Running org.eclipse.tycho.versions.pom.tests.MutablePomFileTest
[INFO] Tests run: 9, Failures: 0, Errors: 0, Skipped: 0, Time elapsed: 0.017 s - in org.eclipse.tycho.versions.pom.tests.MutablePomFileTest
[INFO] 
[INFO] Results:
[INFO] 
[INFO] Tests run: 85, Failures: 0, Errors: 0, Skipped: 0
[INFO] 
[INFO] 
[INFO] --- maven-jar-plugin:3.1.2:jar (default-jar) @ tycho-versions-plugin ---
[INFO] Building jar: /jobs/genie.tycho/tycho-sonar/workspace/tycho-release/tycho-versions-plugin/target/tycho-versions-plugin-1.5.0-SNAPSHOT.jar
[INFO] 
[INFO] --- maven-plugin-plugin:3.6.0:addPluginArtifactMetadata (default-addPluginArtifactMetadata) @ tycho-versions-plugin ---
[INFO] 
[INFO] --- maven-source-plugin:3.1.0:jar-no-fork (default) @ tycho-versions-plugin ---
[INFO] Building jar: /jobs/genie.tycho/tycho-sonar/workspace/tycho-release/tycho-versions-plugin/target/tycho-versions-plugin-1.5.0-SNAPSHOT-sources.jar
[INFO] 
[INFO] --- maven-install-plugin:2.5.2:install (default-install) @ tycho-versions-plugin ---
[INFO] Installing /jobs/genie.tycho/tycho-sonar/workspace/tycho-release/tycho-versions-plugin/target/tycho-versions-plugin-1.5.0-SNAPSHOT.jar to /home/hudson/genie.tycho/.jenkins/jobs/tycho-sonar/workspace/.repository/org/eclipse/tycho/tycho-versions-plugin/1.5.0-SNAPSHOT/tycho-versions-plugin-1.5.0-SNAPSHOT.jar
[INFO] Installing /jobs/genie.tycho/tycho-sonar/workspace/tycho-release/tycho-versions-plugin/pom.xml to /home/hudson/genie.tycho/.jenkins/jobs/tycho-sonar/workspace/.repository/org/eclipse/tycho/tycho-versions-plugin/1.5.0-SNAPSHOT/tycho-versions-plugin-1.5.0-SNAPSHOT.pom
[INFO] Installing /jobs/genie.tycho/tycho-sonar/workspace/tycho-release/tycho-versions-plugin/target/tycho-versions-plugin-1.5.0-SNAPSHOT-sources.jar to /home/hudson/genie.tycho/.jenkins/jobs/tycho-sonar/workspace/.repository/org/eclipse/tycho/tycho-versions-plugin/1.5.0-SNAPSHOT/tycho-versions-plugin-1.5.0-SNAPSHOT-sources.jar
[INFO] 
[INFO] -------------< org.eclipse.tycho:tycho-p2-director-plugin >-------------
[INFO] Building Tycho p2 Director Plugin 1.5.0-SNAPSHOT                 [48/52]
[INFO] ----------------------------[ maven-plugin ]----------------------------
[INFO] 
[INFO] --- maven-clean-plugin:3.1.0:clean (default-clean) @ tycho-p2-director-plugin ---
[INFO] Deleting /jobs/genie.tycho/tycho-sonar/workspace/tycho-p2/tycho-p2-director-plugin/target
[INFO] 
[INFO] --- jacoco-maven-plugin:0.8.4:prepare-agent (default) @ tycho-p2-director-plugin ---
[INFO] argLine set to -javaagent:/home/hudson/genie.tycho/.jenkins/jobs/tycho-sonar/workspace/.repository/org/jacoco/org.jacoco.agent/0.8.4/org.jacoco.agent-0.8.4-runtime.jar=destfile=/home/hudson/genie.tycho/.jenkins/jobs/tycho-sonar/workspace/target/jacoco.exec,append=true
[INFO] 
[INFO] --- maven-resources-plugin:3.1.0:resources (default-resources) @ tycho-p2-director-plugin ---
[INFO] Using 'UTF-8' encoding to copy filtered resources.
[INFO] Copying 2 resources
[INFO] 
[INFO] --- maven-compiler-plugin:3.8.1:compile (default-compile) @ tycho-p2-director-plugin ---
[INFO] Changes detected - recompiling the module!
[INFO] Compiling 10 source files to /jobs/genie.tycho/tycho-sonar/workspace/tycho-p2/tycho-p2-director-plugin/target/classes
[INFO] 
[INFO] --- maven-plugin-plugin:3.6.0:descriptor (default-descriptor) @ tycho-p2-director-plugin ---
[INFO] Using 'UTF-8' encoding to read mojo source files.
[INFO] java-annotations mojo extractor found 2 mojo descriptors.
[INFO] 
[INFO] --- plexus-component-metadata:1.7.1:generate-metadata (default) @ tycho-p2-director-plugin ---
[INFO] Discovered 1 component descriptors(s)
[INFO] 
[INFO] --- maven-resources-plugin:3.1.0:testResources (default-testResources) @ tycho-p2-director-plugin ---
[INFO] Using 'UTF-8' encoding to copy filtered resources.
[INFO] skip non existing resourceDirectory /jobs/genie.tycho/tycho-sonar/workspace/tycho-p2/tycho-p2-director-plugin/src/test/resources
[INFO] 
[INFO] --- maven-compiler-plugin:3.8.1:testCompile (default-testCompile) @ tycho-p2-director-plugin ---
[INFO] Changes detected - recompiling the module!
[INFO] Compiling 5 source files to /jobs/genie.tycho/tycho-sonar/workspace/tycho-p2/tycho-p2-director-plugin/target/test-classes
[INFO] 
[INFO] --- plexus-component-metadata:1.7.1:generate-test-metadata (default) @ tycho-p2-director-plugin ---
[INFO] 
[INFO] --- maven-surefire-plugin:2.22.0:test (default-test) @ tycho-p2-director-plugin ---
[INFO] 
[INFO] -------------------------------------------------------
[INFO]  T E S T S
[INFO] -------------------------------------------------------
[INFO] Running org.eclipse.tycho.plugins.p2.director.ProfileNameTest
[INFO] Tests run: 5, Failures: 0, Errors: 0, Skipped: 0, Time elapsed: 0.227 s - in org.eclipse.tycho.plugins.p2.director.ProfileNameTest
[INFO] Running org.eclipse.tycho.plugins.p2.director.ProductConfigTest
[INFO] Tests run: 9, Failures: 0, Errors: 0, Skipped: 0, Time elapsed: 0.012 s - in org.eclipse.tycho.plugins.p2.director.ProductConfigTest
[INFO] Running org.eclipse.tycho.plugins.p2.director.ProductArchiverMojoTest
[INFO] Tests run: 2, Failures: 0, Errors: 0, Skipped: 0, Time elapsed: 0.006 s - in org.eclipse.tycho.plugins.p2.director.ProductArchiverMojoTest
[INFO] Running org.eclipse.tycho.plugins.tar.FilePermissionHelperTest
[INFO] Tests run: 2, Failures: 0, Errors: 0, Skipped: 0, Time elapsed: 0.001 s - in org.eclipse.tycho.plugins.tar.FilePermissionHelperTest
[INFO] Running org.eclipse.tycho.plugins.tar.TarGzArchiverTest
[info] Building tar: /tmp/genie.tycho/junit5249629769754460216/test.tar.gz
[debug] Adding entry dir2
[debug] Adding entry dir2/test.txt
[debug] Adding entry dir2/dir3
[debug] Adding entry dir2/dir3/test.sh
[debug] Adding entry dir2/testPermissions
[debug] Adding entry dir2/testLastModified
[debug] Adding entry dir2/testOwnerAndGroupName
[info] Building tar: /tmp/genie.tycho/junit7573070060192677106/test.tar.gz
[debug] Adding entry dir2
[debug] Adding entry dir2/test.txt
[debug] Adding entry dir2/dir3
[debug] Adding entry dir2/dir3/test.sh
[debug] Adding entry dir2/testPermissions
[debug] Adding entry dir2/testLastModified
[debug] Adding entry dir2/testOwnerAndGroupName
[info] Building tar: /tmp/genie.tycho/junit8419126259456986803/test.tar.gz
[debug] Adding entry dir2
[debug] Adding entry dir2/test.txt
[debug] Adding entry dir2/dir3
[debug] Adding entry dir2/dir3/test.sh
[debug] Adding entry dir2/testPermissions
[debug] Adding entry dir2/testLastModified
[debug] Adding entry dir2/testOwnerAndGroupName
[debug] Adding entry testSymLink
[debug] Computed symlink target path ../linkTargetOutsideArchiveRoot for symlink /tmp/genie.tycho/junit8419126259456986803/dir1/testSymLink relative to /tmp/genie.tycho/junit8419126259456986803/dir1
[info] Building tar: /tmp/genie.tycho/junit2444816402293129153/test.tar.gz
[debug] Adding entry dir2
[debug] Adding entry dir2/test.txt
[debug] Adding entry dir2/dir3
[debug] Adding entry dir2/dir3/test.sh
[debug] Adding entry dir2/testPermissions
[debug] Adding entry dir2/testLastModified
[debug] Adding entry dir2/testOwnerAndGroupName
[debug] Adding entry dir2/testSymLink
[debug] Computed symlink target path  for symlink /tmp/genie.tycho/junit2444816402293129153/dir1/dir2/testSymLink relative to /tmp/genie.tycho/junit2444816402293129153/dir1
[debug] Computed symlink target path .. for symlink /tmp/genie.tycho/junit2444816402293129153/dir1/dir2/testSymLink relative to /tmp/genie.tycho/junit2444816402293129153/dir1/dir2
[debug] Computed symlink target path  for symlink /tmp/genie.tycho/junit2444816402293129153/dir1/dir2/testSymLink relative to /tmp/genie.tycho/junit2444816402293129153/dir1
[info] Building tar: /tmp/genie.tycho/junit5993299640477174176/test.tar.gz
[debug] Adding entry dir2
[debug] Adding entry dir2/test.txt
[debug] Adding entry dir2/dir3
[debug] Adding entry dir2/dir3/test.sh
[debug] Adding entry dir2/testPermissions
[debug] Adding entry dir2/testLastModified
[debug] Adding entry dir2/testOwnerAndGroupName
[debug] Adding entry very
[debug] Adding entry very/long
[debug] Adding entry very/long/path
[debug] Adding entry very/long/path/exceeding
[debug] Adding entry very/long/path/exceeding/100
[debug] Adding entry very/long/path/exceeding/100/chars
[debug] Adding entry very/long/path/exceeding/100/chars/very
[debug] Adding entry very/long/path/exceeding/100/chars/very/long
[debug] Adding entry very/long/path/exceeding/100/chars/very/long/path
[debug] Adding entry very/long/path/exceeding/100/chars/very/long/path/exceeding
[debug] Adding entry very/long/path/exceeding/100/chars/very/long/path/exceeding/100
[debug] Adding entry very/long/path/exceeding/100/chars/very/long/path/exceeding/100/chars
[debug] Adding entry very/long/path/exceeding/100/chars/very/long/path/exceeding/100/chars/very
[debug] Adding entry very/long/path/exceeding/100/chars/very/long/path/exceeding/100/chars/very/long
[debug] Adding entry very/long/path/exceeding/100/chars/very/long/path/exceeding/100/chars/very/long/path
[debug] Adding entry very/long/path/exceeding/100/chars/very/long/path/exceeding/100/chars/very/long/path/exceeding
[debug] Adding entry very/long/path/exceeding/100/chars/very/long/path/exceeding/100/chars/very/long/path/exceeding/100
[debug] Adding entry very/long/path/exceeding/100/chars/very/long/path/exceeding/100/chars/very/long/path/exceeding/100/chars
[debug] Adding entry very/long/path/exceeding/100/chars/very/long/path/exceeding/100/chars/very/long/path/exceeding/100/chars/test.txt
[info] Building tar: /tmp/genie.tycho/junit6076974405140089913/test.tar.gz
[debug] Adding entry dir2
[debug] Adding entry dir2/test.txt
[debug] Adding entry dir2/dir3
[debug] Adding entry dir2/dir3/test.sh
[debug] Adding entry dir2/testPermissions
[debug] Adding entry dir2/testLastModified
[debug] Adding entry dir2/testOwnerAndGroupName
[info] Building tar: /tmp/genie.tycho/junit2762787581139232173/test.tar.gz
[debug] Adding entry dir2
[debug] Adding entry dir2/test.txt
[debug] Adding entry dir2/dir3
[debug] Adding entry dir2/dir3/test.sh
[debug] Adding entry dir2/testPermissions
[debug] Adding entry dir2/testLastModified
[debug] Adding entry dir2/testOwnerAndGroupName
[debug] Adding entry dir2/testSymLink
[debug] Computed symlink target path test.sh for symlink /tmp/genie.tycho/junit2762787581139232173/dir1/dir2/testSymLink relative to /tmp/genie.tycho/junit2762787581139232173/dir1
[debug] Computed symlink target path ../test.sh for symlink /tmp/genie.tycho/junit2762787581139232173/dir1/dir2/testSymLink relative to /tmp/genie.tycho/junit2762787581139232173/dir1/dir2
[info] Building tar: /tmp/genie.tycho/junit5217645449402156418/test.tar.gz
[debug] Adding entry dir2
[debug] Adding entry dir2/test.txt
[debug] Adding entry dir2/dir3
[debug] Adding entry dir2/dir3/test.sh
[debug] Adding entry dir2/testPermissions
[debug] Adding entry dir2/testLastModified
[debug] Adding entry dir2/testOwnerAndGroupName
[debug] Adding entry testSymLink
[debug] Computed symlink target path dir2/dir3/test.sh for symlink /tmp/genie.tycho/junit5217645449402156418/dir1/testSymLink relative to /tmp/genie.tycho/junit5217645449402156418/dir1
[debug] Computed symlink target path dir2/dir3/test.sh for symlink /tmp/genie.tycho/junit5217645449402156418/dir1/testSymLink relative to /tmp/genie.tycho/junit5217645449402156418/dir1
[info] Building tar: /tmp/genie.tycho/junit4492303465272464073/test.tar.gz
[debug] Adding entry dir2
[debug] Adding entry dir2/test.txt
[debug] Adding entry dir2/dir3
[debug] Adding entry dir2/dir3/test.sh
[debug] Adding entry dir2/testPermissions
[debug] Adding entry dir2/testLastModified
[debug] Adding entry dir2/testOwnerAndGroupName
[debug] Adding entry testDirSymLink
[debug] Computed symlink target path ../dirLinkTargetOutsideArchiveRoot for symlink /tmp/genie.tycho/junit4492303465272464073/dir1/testDirSymLink relative to /tmp/genie.tycho/junit4492303465272464073/dir1
[debug] Adding entry testDirSymLink/test.txt
[info] Building tar: /tmp/genie.tycho/junit7810508624961140204/test.tar.gz
[debug] Adding entry dir2
[debug] Adding entry dir2/test.txt
[debug] Adding entry dir2/dir3
[debug] Adding entry dir2/dir3/test.sh
[debug] Adding entry dir2/testPermissions
[debug] Adding entry dir2/testLastModified
[debug] Adding entry dir2/testOwnerAndGroupName
[debug] Adding entry dir2/testSymLink
[debug] Computed symlink target path dir2/dir3/test.sh for symlink /tmp/genie.tycho/junit7810508624961140204/dir1/dir2/testSymLink relative to /tmp/genie.tycho/junit7810508624961140204/dir1
[debug] Computed symlink target path dir3/test.sh for symlink /tmp/genie.tycho/junit7810508624961140204/dir1/dir2/testSymLink relative to /tmp/genie.tycho/junit7810508624961140204/dir1/dir2
[INFO] Tests run: 10, Failures: 0, Errors: 0, Skipped: 0, Time elapsed: 0.21 s - in org.eclipse.tycho.plugins.tar.TarGzArchiverTest
[INFO] 
[INFO] Results:
[INFO] 
[INFO] Tests run: 28, Failures: 0, Errors: 0, Skipped: 0
[INFO] 
[INFO] 
[INFO] --- maven-jar-plugin:3.1.2:jar (default-jar) @ tycho-p2-director-plugin ---
[INFO] Building jar: /jobs/genie.tycho/tycho-sonar/workspace/tycho-p2/tycho-p2-director-plugin/target/tycho-p2-director-plugin-1.5.0-SNAPSHOT.jar
[INFO] 
[INFO] --- maven-plugin-plugin:3.6.0:addPluginArtifactMetadata (default-addPluginArtifactMetadata) @ tycho-p2-director-plugin ---
[INFO] 
[INFO] --- maven-source-plugin:3.1.0:jar-no-fork (default) @ tycho-p2-director-plugin ---
[INFO] Building jar: /jobs/genie.tycho/tycho-sonar/workspace/tycho-p2/tycho-p2-director-plugin/target/tycho-p2-director-plugin-1.5.0-SNAPSHOT-sources.jar
[INFO] 
[INFO] --- maven-install-plugin:2.5.2:install (default-install) @ tycho-p2-director-plugin ---
[INFO] Installing /jobs/genie.tycho/tycho-sonar/workspace/tycho-p2/tycho-p2-director-plugin/target/tycho-p2-director-plugin-1.5.0-SNAPSHOT.jar to /home/hudson/genie.tycho/.jenkins/jobs/tycho-sonar/workspace/.repository/org/eclipse/tycho/tycho-p2-director-plugin/1.5.0-SNAPSHOT/tycho-p2-director-plugin-1.5.0-SNAPSHOT.jar
[INFO] Installing /jobs/genie.tycho/tycho-sonar/workspace/tycho-p2/tycho-p2-director-plugin/pom.xml to /home/hudson/genie.tycho/.jenkins/jobs/tycho-sonar/workspace/.repository/org/eclipse/tycho/tycho-p2-director-plugin/1.5.0-SNAPSHOT/tycho-p2-director-plugin-1.5.0-SNAPSHOT.pom
[INFO] Installing /jobs/genie.tycho/tycho-sonar/workspace/tycho-p2/tycho-p2-director-plugin/target/tycho-p2-director-plugin-1.5.0-SNAPSHOT-sources.jar to /home/hudson/genie.tycho/.jenkins/jobs/tycho-sonar/workspace/.repository/org/eclipse/tycho/tycho-p2-director-plugin/1.5.0-SNAPSHOT/tycho-p2-director-plugin-1.5.0-SNAPSHOT-sources.jar
[INFO] 
[INFO] -------------< org.eclipse.tycho:tycho-artifactcomparator >-------------
[INFO] Building tycho-artifactcomparator 1.5.0-SNAPSHOT                 [49/52]
[INFO] --------------------------------[ jar ]---------------------------------
[INFO] 
[INFO] --- maven-clean-plugin:3.1.0:clean (default-clean) @ tycho-artifactcomparator ---
[INFO] Deleting /jobs/genie.tycho/tycho-sonar/workspace/tycho-artifactcomparator/target
[INFO] 
[INFO] --- jacoco-maven-plugin:0.8.4:prepare-agent (default) @ tycho-artifactcomparator ---
[INFO] argLine set to -javaagent:/home/hudson/genie.tycho/.jenkins/jobs/tycho-sonar/workspace/.repository/org/jacoco/org.jacoco.agent/0.8.4/org.jacoco.agent-0.8.4-runtime.jar=destfile=/home/hudson/genie.tycho/.jenkins/jobs/tycho-sonar/workspace/target/jacoco.exec,append=true
[INFO] 
[INFO] --- maven-resources-plugin:3.1.0:resources (default-resources) @ tycho-artifactcomparator ---
[INFO] Using 'UTF-8' encoding to copy filtered resources.
[INFO] skip non existing resourceDirectory /jobs/genie.tycho/tycho-sonar/workspace/tycho-artifactcomparator/src/main/resources
[INFO] 
[INFO] --- maven-compiler-plugin:3.8.1:compile (default-compile) @ tycho-artifactcomparator ---
[INFO] Changes detected - recompiling the module!
[INFO] Compiling 11 source files to /jobs/genie.tycho/tycho-sonar/workspace/tycho-artifactcomparator/target/classes
[INFO] 
[INFO] --- plexus-component-metadata:1.7.1:generate-metadata (default) @ tycho-artifactcomparator ---
[INFO] Discovered 6 component descriptors(s)
[INFO] 
[INFO] --- maven-resources-plugin:3.1.0:testResources (default-testResources) @ tycho-artifactcomparator ---
[INFO] Using 'UTF-8' encoding to copy filtered resources.
[INFO] Copying 8 resources
[INFO] 
[INFO] --- maven-compiler-plugin:3.8.1:testCompile (default-testCompile) @ tycho-artifactcomparator ---
[INFO] Changes detected - recompiling the module!
[INFO] Compiling 3 source files to /jobs/genie.tycho/tycho-sonar/workspace/tycho-artifactcomparator/target/test-classes
[INFO] 
[INFO] --- plexus-component-metadata:1.7.1:generate-test-metadata (default) @ tycho-artifactcomparator ---
[INFO] Discovered 1 component descriptors(s)
[INFO] 
[INFO] --- maven-surefire-plugin:2.22.0:test (default-test) @ tycho-artifactcomparator ---
[INFO] 
[INFO] -------------------------------------------------------
[INFO]  T E S T S
[INFO] -------------------------------------------------------
[INFO] Running org.eclipse.tycho.jarcomparator.tests.ContentsComparatorTest
[INFO] Tests run: 4, Failures: 0, Errors: 0, Skipped: 0, Time elapsed: 0.748 s - in org.eclipse.tycho.jarcomparator.tests.ContentsComparatorTest
[INFO] Running org.eclipse.tycho.jarcomparator.tests.CompoundArtifactDeltaTest
[INFO] Tests run: 1, Failures: 0, Errors: 0, Skipped: 0, Time elapsed: 0.023 s - in org.eclipse.tycho.jarcomparator.tests.CompoundArtifactDeltaTest
[INFO] 
[INFO] Results:
[INFO] 
[INFO] Tests run: 5, Failures: 0, Errors: 0, Skipped: 0
[INFO] 
[INFO] 
[INFO] --- maven-jar-plugin:3.1.2:jar (default-jar) @ tycho-artifactcomparator ---
[INFO] Building jar: /jobs/genie.tycho/tycho-sonar/workspace/tycho-artifactcomparator/target/tycho-artifactcomparator-1.5.0-SNAPSHOT.jar
[INFO] 
[INFO] --- maven-source-plugin:3.1.0:jar-no-fork (default) @ tycho-artifactcomparator ---
[INFO] Building jar: /jobs/genie.tycho/tycho-sonar/workspace/tycho-artifactcomparator/target/tycho-artifactcomparator-1.5.0-SNAPSHOT-sources.jar
[INFO] 
[INFO] --- maven-install-plugin:2.5.2:install (default-install) @ tycho-artifactcomparator ---
[INFO] Installing /jobs/genie.tycho/tycho-sonar/workspace/tycho-artifactcomparator/target/tycho-artifactcomparator-1.5.0-SNAPSHOT.jar to /home/hudson/genie.tycho/.jenkins/jobs/tycho-sonar/workspace/.repository/org/eclipse/tycho/tycho-artifactcomparator/1.5.0-SNAPSHOT/tycho-artifactcomparator-1.5.0-SNAPSHOT.jar
[INFO] Installing /jobs/genie.tycho/tycho-sonar/workspace/tycho-artifactcomparator/pom.xml to /home/hudson/genie.tycho/.jenkins/jobs/tycho-sonar/workspace/.repository/org/eclipse/tycho/tycho-artifactcomparator/1.5.0-SNAPSHOT/tycho-artifactcomparator-1.5.0-SNAPSHOT.pom
[INFO] Installing /jobs/genie.tycho/tycho-sonar/workspace/tycho-artifactcomparator/target/tycho-artifactcomparator-1.5.0-SNAPSHOT-sources.jar to /home/hudson/genie.tycho/.jenkins/jobs/tycho-sonar/workspace/.repository/org/eclipse/tycho/tycho-artifactcomparator/1.5.0-SNAPSHOT/tycho-artifactcomparator-1.5.0-SNAPSHOT-sources.jar
[INFO] 
[INFO] -----------------< org.eclipse.tycho:tycho-p2-plugin >------------------
[INFO] Building Tycho p2 Metadata Plugin 1.5.0-SNAPSHOT                 [50/52]
[INFO] ----------------------------[ maven-plugin ]----------------------------
[INFO] 
[INFO] --- maven-clean-plugin:3.1.0:clean (default-clean) @ tycho-p2-plugin ---
[INFO] Deleting /jobs/genie.tycho/tycho-sonar/workspace/tycho-p2/tycho-p2-plugin/target
[INFO] 
[INFO] --- jacoco-maven-plugin:0.8.4:prepare-agent (default) @ tycho-p2-plugin ---
[INFO] argLine set to -javaagent:/home/hudson/genie.tycho/.jenkins/jobs/tycho-sonar/workspace/.repository/org/jacoco/org.jacoco.agent/0.8.4/org.jacoco.agent-0.8.4-runtime.jar=destfile=/home/hudson/genie.tycho/.jenkins/jobs/tycho-sonar/workspace/target/jacoco.exec,append=true
[INFO] 
[INFO] --- maven-resources-plugin:3.1.0:resources (default-resources) @ tycho-p2-plugin ---
[INFO] Using 'UTF-8' encoding to copy filtered resources.
[INFO] skip non existing resourceDirectory /jobs/genie.tycho/tycho-sonar/workspace/tycho-p2/tycho-p2-plugin/src/main/resources
[INFO] 
[INFO] --- maven-compiler-plugin:3.8.1:compile (default-compile) @ tycho-p2-plugin ---
[INFO] Changes detected - recompiling the module!
[INFO] Compiling 11 source files to /jobs/genie.tycho/tycho-sonar/workspace/tycho-p2/tycho-p2-plugin/target/classes
[INFO] /jobs/genie.tycho/tycho-sonar/workspace/tycho-p2/tycho-p2-plugin/src/main/java/org/eclipse/tycho/plugins/p2/AbstractP2MetadataMojo.java: Some input files use or override a deprecated API.
[INFO] /jobs/genie.tycho/tycho-sonar/workspace/tycho-p2/tycho-p2-plugin/src/main/java/org/eclipse/tycho/plugins/p2/AbstractP2MetadataMojo.java: Recompile with -Xlint:deprecation for details.
[INFO] 
[INFO] --- maven-plugin-plugin:3.6.0:descriptor (default-descriptor) @ tycho-p2-plugin ---
[INFO] Using 'UTF-8' encoding to read mojo source files.
[INFO] java-annotations mojo extractor found 6 mojo descriptors.
[INFO] 
[INFO] --- plexus-component-metadata:1.7.1:generate-metadata (default) @ tycho-p2-plugin ---
[INFO] Discovered 1 component descriptors(s)
[INFO] 
[INFO] --- maven-resources-plugin:3.1.0:testResources (default-testResources) @ tycho-p2-plugin ---
[INFO] Using 'UTF-8' encoding to copy filtered resources.
[INFO] skip non existing resourceDirectory /jobs/genie.tycho/tycho-sonar/workspace/tycho-p2/tycho-p2-plugin/src/test/resources
[INFO] 
[INFO] --- maven-compiler-plugin:3.8.1:testCompile (default-testCompile) @ tycho-p2-plugin ---
[INFO] Changes detected - recompiling the module!
[INFO] Compiling 1 source file to /jobs/genie.tycho/tycho-sonar/workspace/tycho-p2/tycho-p2-plugin/target/test-classes
[INFO] 
[INFO] --- plexus-component-metadata:1.7.1:generate-test-metadata (default) @ tycho-p2-plugin ---
[INFO] 
[INFO] --- maven-surefire-plugin:2.22.0:test (default-test) @ tycho-p2-plugin ---
[INFO] 
[INFO] -------------------------------------------------------
[INFO]  T E S T S
[INFO] -------------------------------------------------------
[INFO] Running org.eclipse.tycho.plugins.p2.P2MetadataMojoTest
[INFO] Tests run: 2, Failures: 0, Errors: 0, Skipped: 0, Time elapsed: 0.122 s - in org.eclipse.tycho.plugins.p2.P2MetadataMojoTest
[INFO] 
[INFO] Results:
[INFO] 
[INFO] Tests run: 2, Failures: 0, Errors: 0, Skipped: 0
[INFO] 
[INFO] 
[INFO] --- maven-jar-plugin:3.1.2:jar (default-jar) @ tycho-p2-plugin ---
[INFO] Building jar: /jobs/genie.tycho/tycho-sonar/workspace/tycho-p2/tycho-p2-plugin/target/tycho-p2-plugin-1.5.0-SNAPSHOT.jar
[INFO] 
[INFO] --- maven-plugin-plugin:3.6.0:addPluginArtifactMetadata (default-addPluginArtifactMetadata) @ tycho-p2-plugin ---
[INFO] 
[INFO] --- maven-source-plugin:3.1.0:jar-no-fork (default) @ tycho-p2-plugin ---
[INFO] Building jar: /jobs/genie.tycho/tycho-sonar/workspace/tycho-p2/tycho-p2-plugin/target/tycho-p2-plugin-1.5.0-SNAPSHOT-sources.jar
[INFO] 
[INFO] --- maven-install-plugin:2.5.2:install (default-install) @ tycho-p2-plugin ---
[INFO] Installing /jobs/genie.tycho/tycho-sonar/workspace/tycho-p2/tycho-p2-plugin/target/tycho-p2-plugin-1.5.0-SNAPSHOT.jar to /home/hudson/genie.tycho/.jenkins/jobs/tycho-sonar/workspace/.repository/org/eclipse/tycho/tycho-p2-plugin/1.5.0-SNAPSHOT/tycho-p2-plugin-1.5.0-SNAPSHOT.jar
[INFO] Installing /jobs/genie.tycho/tycho-sonar/workspace/tycho-p2/tycho-p2-plugin/pom.xml to /home/hudson/genie.tycho/.jenkins/jobs/tycho-sonar/workspace/.repository/org/eclipse/tycho/tycho-p2-plugin/1.5.0-SNAPSHOT/tycho-p2-plugin-1.5.0-SNAPSHOT.pom
[INFO] Installing /jobs/genie.tycho/tycho-sonar/workspace/tycho-p2/tycho-p2-plugin/target/tycho-p2-plugin-1.5.0-SNAPSHOT-sources.jar to /home/hudson/genie.tycho/.jenkins/jobs/tycho-sonar/workspace/.repository/org/eclipse/tycho/tycho-p2-plugin/1.5.0-SNAPSHOT/tycho-p2-plugin-1.5.0-SNAPSHOT-sources.jar
[INFO] 
[INFO] ------------< org.eclipse.tycho:tycho-p2-publisher-plugin >-------------
[INFO] Building Tycho p2 Publisher Plugin 1.5.0-SNAPSHOT                [51/52]
[INFO] ----------------------------[ maven-plugin ]----------------------------
[INFO] 
[INFO] --- maven-clean-plugin:3.1.0:clean (default-clean) @ tycho-p2-publisher-plugin ---
[INFO] Deleting /jobs/genie.tycho/tycho-sonar/workspace/tycho-p2/tycho-p2-publisher-plugin/target
[INFO] 
[INFO] --- jacoco-maven-plugin:0.8.4:prepare-agent (default) @ tycho-p2-publisher-plugin ---
[INFO] argLine set to -javaagent:/home/hudson/genie.tycho/.jenkins/jobs/tycho-sonar/workspace/.repository/org/jacoco/org.jacoco.agent/0.8.4/org.jacoco.agent-0.8.4-runtime.jar=destfile=/home/hudson/genie.tycho/.jenkins/jobs/tycho-sonar/workspace/target/jacoco.exec,append=true
[INFO] 
[INFO] --- maven-resources-plugin:3.1.0:resources (default-resources) @ tycho-p2-publisher-plugin ---
[INFO] Using 'UTF-8' encoding to copy filtered resources.
[INFO] skip non existing resourceDirectory /jobs/genie.tycho/tycho-sonar/workspace/tycho-p2/tycho-p2-publisher-plugin/src/main/resources
[INFO] 
[INFO] --- maven-compiler-plugin:3.8.1:compile (default-compile) @ tycho-p2-publisher-plugin ---
[INFO] Changes detected - recompiling the module!
[INFO] Compiling 6 source files to /jobs/genie.tycho/tycho-sonar/workspace/tycho-p2/tycho-p2-publisher-plugin/target/classes
[INFO] 
[INFO] --- maven-plugin-plugin:3.6.0:descriptor (default-descriptor) @ tycho-p2-publisher-plugin ---
[INFO] Using 'UTF-8' encoding to read mojo source files.
[INFO] java-annotations mojo extractor found 5 mojo descriptors.
[INFO] 
[INFO] --- maven-resources-plugin:3.1.0:testResources (default-testResources) @ tycho-p2-publisher-plugin ---
[INFO] Using 'UTF-8' encoding to copy filtered resources.
[INFO] skip non existing resourceDirectory /jobs/genie.tycho/tycho-sonar/workspace/tycho-p2/tycho-p2-publisher-plugin/src/test/resources
[INFO] 
[INFO] --- maven-compiler-plugin:3.8.1:testCompile (default-testCompile) @ tycho-p2-publisher-plugin ---
[INFO] Changes detected - recompiling the module!
[INFO] Compiling 1 source file to /jobs/genie.tycho/tycho-sonar/workspace/tycho-p2/tycho-p2-publisher-plugin/target/test-classes
[INFO] 
[INFO] --- maven-surefire-plugin:2.22.0:test (default-test) @ tycho-p2-publisher-plugin ---
[INFO] 
[INFO] -------------------------------------------------------
[INFO]  T E S T S
[INFO] -------------------------------------------------------
[INFO] Running org.eclipse.tycho.plugins.p2.publisher.PublishProductMojoTest
[INFO] Tests run: 1, Failures: 0, Errors: 0, Skipped: 0, Time elapsed: 0.211 s - in org.eclipse.tycho.plugins.p2.publisher.PublishProductMojoTest
[INFO] 
[INFO] Results:
[INFO] 
[INFO] Tests run: 1, Failures: 0, Errors: 0, Skipped: 0
[INFO] 
[INFO] 
[INFO] --- maven-jar-plugin:3.1.2:jar (default-jar) @ tycho-p2-publisher-plugin ---
[INFO] Building jar: /jobs/genie.tycho/tycho-sonar/workspace/tycho-p2/tycho-p2-publisher-plugin/target/tycho-p2-publisher-plugin-1.5.0-SNAPSHOT.jar
[INFO] 
[INFO] --- maven-plugin-plugin:3.6.0:addPluginArtifactMetadata (default-addPluginArtifactMetadata) @ tycho-p2-publisher-plugin ---
[INFO] 
[INFO] --- maven-source-plugin:3.1.0:jar-no-fork (default) @ tycho-p2-publisher-plugin ---
[INFO] Building jar: /jobs/genie.tycho/tycho-sonar/workspace/tycho-p2/tycho-p2-publisher-plugin/target/tycho-p2-publisher-plugin-1.5.0-SNAPSHOT-sources.jar
[INFO] 
[INFO] --- maven-install-plugin:2.5.2:install (default-install) @ tycho-p2-publisher-plugin ---
[INFO] Installing /jobs/genie.tycho/tycho-sonar/workspace/tycho-p2/tycho-p2-publisher-plugin/target/tycho-p2-publisher-plugin-1.5.0-SNAPSHOT.jar to /home/hudson/genie.tycho/.jenkins/jobs/tycho-sonar/workspace/.repository/org/eclipse/tycho/tycho-p2-publisher-plugin/1.5.0-SNAPSHOT/tycho-p2-publisher-plugin-1.5.0-SNAPSHOT.jar
[INFO] Installing /jobs/genie.tycho/tycho-sonar/workspace/tycho-p2/tycho-p2-publisher-plugin/pom.xml to /home/hudson/genie.tycho/.jenkins/jobs/tycho-sonar/workspace/.repository/org/eclipse/tycho/tycho-p2-publisher-plugin/1.5.0-SNAPSHOT/tycho-p2-publisher-plugin-1.5.0-SNAPSHOT.pom
[INFO] Installing /jobs/genie.tycho/tycho-sonar/workspace/tycho-p2/tycho-p2-publisher-plugin/target/tycho-p2-publisher-plugin-1.5.0-SNAPSHOT-sources.jar to /home/hudson/genie.tycho/.jenkins/jobs/tycho-sonar/workspace/.repository/org/eclipse/tycho/tycho-p2-publisher-plugin/1.5.0-SNAPSHOT/tycho-p2-publisher-plugin-1.5.0-SNAPSHOT-sources.jar
[INFO] 
[INFO] ------------< org.eclipse.tycho:tycho-p2-repository-plugin >------------
[INFO] Building Tycho p2 Repository Plugin 1.5.0-SNAPSHOT               [52/52]
[INFO] ----------------------------[ maven-plugin ]----------------------------
[INFO] 
[INFO] --- maven-clean-plugin:3.1.0:clean (default-clean) @ tycho-p2-repository-plugin ---
[INFO] Deleting /jobs/genie.tycho/tycho-sonar/workspace/tycho-p2/tycho-p2-repository-plugin/target
[INFO] 
[INFO] --- jacoco-maven-plugin:0.8.4:prepare-agent (default) @ tycho-p2-repository-plugin ---
[INFO] argLine set to -javaagent:/home/hudson/genie.tycho/.jenkins/jobs/tycho-sonar/workspace/.repository/org/jacoco/org.jacoco.agent/0.8.4/org.jacoco.agent-0.8.4-runtime.jar=destfile=/home/hudson/genie.tycho/.jenkins/jobs/tycho-sonar/workspace/target/jacoco.exec,append=true
[INFO] 
[INFO] --- maven-resources-plugin:3.1.0:resources (default-resources) @ tycho-p2-repository-plugin ---
[INFO] Using 'UTF-8' encoding to copy filtered resources.
[INFO] skip non existing resourceDirectory /jobs/genie.tycho/tycho-sonar/workspace/tycho-p2/tycho-p2-repository-plugin/src/main/resources
[INFO] 
[INFO] --- maven-compiler-plugin:3.8.1:compile (default-compile) @ tycho-p2-repository-plugin ---
[INFO] Changes detected - recompiling the module!
[INFO] Compiling 4 source files to /jobs/genie.tycho/tycho-sonar/workspace/tycho-p2/tycho-p2-repository-plugin/target/classes
[INFO] 
[INFO] --- maven-plugin-plugin:3.6.0:descriptor (default-descriptor) @ tycho-p2-repository-plugin ---
[INFO] Using 'UTF-8' encoding to read mojo source files.
[INFO] java-annotations mojo extractor found 3 mojo descriptors.
[INFO] 
[INFO] --- maven-resources-plugin:3.1.0:testResources (default-testResources) @ tycho-p2-repository-plugin ---
[INFO] Using 'UTF-8' encoding to copy filtered resources.
[INFO] skip non existing resourceDirectory /jobs/genie.tycho/tycho-sonar/workspace/tycho-p2/tycho-p2-repository-plugin/src/test/resources
[INFO] 
[INFO] --- maven-compiler-plugin:3.8.1:testCompile (default-testCompile) @ tycho-p2-repository-plugin ---
[INFO] No sources to compile
[INFO] 
[INFO] --- maven-surefire-plugin:2.22.0:test (default-test) @ tycho-p2-repository-plugin ---
[INFO] No tests to run.
[INFO] 
[INFO] --- maven-jar-plugin:3.1.2:jar (default-jar) @ tycho-p2-repository-plugin ---
[INFO] Building jar: /jobs/genie.tycho/tycho-sonar/workspace/tycho-p2/tycho-p2-repository-plugin/target/tycho-p2-repository-plugin-1.5.0-SNAPSHOT.jar
[INFO] 
[INFO] --- maven-plugin-plugin:3.6.0:addPluginArtifactMetadata (default-addPluginArtifactMetadata) @ tycho-p2-repository-plugin ---
[INFO] 
[INFO] --- maven-source-plugin:3.1.0:jar-no-fork (default) @ tycho-p2-repository-plugin ---
[INFO] Building jar: /jobs/genie.tycho/tycho-sonar/workspace/tycho-p2/tycho-p2-repository-plugin/target/tycho-p2-repository-plugin-1.5.0-SNAPSHOT-sources.jar
[INFO] 
[INFO] --- maven-install-plugin:2.5.2:install (default-install) @ tycho-p2-repository-plugin ---
[INFO] Installing /jobs/genie.tycho/tycho-sonar/workspace/tycho-p2/tycho-p2-repository-plugin/target/tycho-p2-repository-plugin-1.5.0-SNAPSHOT.jar to /home/hudson/genie.tycho/.jenkins/jobs/tycho-sonar/workspace/.repository/org/eclipse/tycho/tycho-p2-repository-plugin/1.5.0-SNAPSHOT/tycho-p2-repository-plugin-1.5.0-SNAPSHOT.jar
[INFO] Installing /jobs/genie.tycho/tycho-sonar/workspace/tycho-p2/tycho-p2-repository-plugin/pom.xml to /home/hudson/genie.tycho/.jenkins/jobs/tycho-sonar/workspace/.repository/org/eclipse/tycho/tycho-p2-repository-plugin/1.5.0-SNAPSHOT/tycho-p2-repository-plugin-1.5.0-SNAPSHOT.pom
[INFO] Installing /jobs/genie.tycho/tycho-sonar/workspace/tycho-p2/tycho-p2-repository-plugin/target/tycho-p2-repository-plugin-1.5.0-SNAPSHOT-sources.jar to /home/hudson/genie.tycho/.jenkins/jobs/tycho-sonar/workspace/.repository/org/eclipse/tycho/tycho-p2-repository-plugin/1.5.0-SNAPSHOT/tycho-p2-repository-plugin-1.5.0-SNAPSHOT-sources.jar
[INFO] ------------------------------------------------------------------------
[INFO] Reactor Summary for Tycho 1.5.0-SNAPSHOT:
[INFO] 
[INFO] Tycho .............................................. SUCCESS [  2.134 s]
[INFO] Tycho OSGi Bundles Parent .......................... SUCCESS [  0.014 s]
[INFO] Tycho OSGi Bundles Target Platform ................. SUCCESS [  0.138 s]
[INFO] Tycho Noop Equinox password provider ............... SUCCESS [  1.540 s]
[INFO] Repository with p2 Director Bundles ................ SUCCESS [  2.554 s]
[INFO] Tycho Embedder API Maven/OSGi Shared Classes ....... SUCCESS [  0.312 s]
[INFO] Tycho Core Maven/OSGi Shared Classes ............... SUCCESS [ 22.724 s]
[INFO] Tycho p2 Resolver Maven/OSGi Shared Classes ........ SUCCESS [  0.779 s]
[INFO] Tycho p2 Tools Maven/OSGi Shared Classes ........... SUCCESS [  0.295 s]
[INFO] Tycho Maven/p2 Repository Integration .............. SUCCESS [  1.134 s]
[INFO] Tycho p2 Resolver Bundle ........................... SUCCESS [  1.195 s]
[INFO] Tycho p2 Tools Bundle .............................. SUCCESS [  0.407 s]
[INFO] Tycho Core Maven/OSGi Shared Classes Tests ......... SUCCESS [ 17.942 s]
[INFO] Tycho Test Utilities ............................... SUCCESS [  4.111 s]
[INFO] Tycho p2 Resolver Bundle Tests ..................... SUCCESS [ 48.155 s]
[INFO] Tycho p2 Resolver Maven/OSGi Shared Classes Tests .. SUCCESS [  6.263 s]
[INFO] Tycho Maven/p2 Repository Integration Tests ........ SUCCESS [01:07 min]
[INFO] Tycho p2 Tools Tests ............................... SUCCESS [ 30.900 s]
[INFO] Tycho OSGi Runtime External Bundles ................ SUCCESS [  0.247 s]
[INFO] Sisu Equinox/Plexus bridge ......................... SUCCESS [  0.007 s]
[INFO] Sisu Equinox Services API .......................... SUCCESS [  4.397 s]
[INFO] Sisu Equinox Embedder .............................. SUCCESS [  1.086 s]
[INFO] Tycho Eclipse Project Metadata Model ............... SUCCESS [  2.184 s]
[INFO] Tycho Embedder API ................................. SUCCESS [  0.486 s]
[INFO] Tycho Testing Harness .............................. SUCCESS [  0.776 s]
[INFO] Tycho Core ......................................... SUCCESS [ 19.823 s]
[INFO] Sisu Equinox Launching ............................. SUCCESS [  3.752 s]
[INFO] Tycho JVM Library Detector ......................... SUCCESS [  2.106 s]
[INFO] Tycho JDT Compiler Component ....................... SUCCESS [  1.709 s]
[INFO] Tycho OSGi Compiler Plugin ......................... SUCCESS [ 13.532 s]
[INFO] Tycho OSGi Packaging Plugin ........................ SUCCESS [ 12.030 s]
[INFO] Tycho p2 Tools Parent .............................. SUCCESS [  0.008 s]
[INFO] Tycho p2 Resolver Component ........................ SUCCESS [  1.757 s]
[INFO] Tycho OSGi Source Plugin ........................... SUCCESS [ 11.679 s]
[INFO] Tycho Target Platform Configuration Plugin ......... SUCCESS [  0.456 s]
[INFO] Tycho Maven Build Extension ........................ SUCCESS [  0.384 s]
[INFO] Tycho POM Generator Plugin ......................... SUCCESS [  4.997 s]
[INFO] Tycho Surefire OSGi Booter Eclipse Application ..... SUCCESS [  0.939 s]
[INFO] Tycho Surefire Parent .............................. SUCCESS [  0.009 s]
[INFO] Tycho Surefire OSGi JUnit 3 Runner ................. SUCCESS [  0.684 s]
[INFO] Tycho Surefire OSGi JUnit 4 Runner ................. SUCCESS [  0.210 s]
[INFO] Tycho Surefire OSGi JUnit 4.7 Runner ............... SUCCESS [  0.471 s]
[INFO] Tycho Surefire OSGi JUnit 5 Runner ................. SUCCESS [  0.916 s]
[INFO] Tycho Surefire OSGi TestNG Runner .................. SUCCESS [  0.267 s]
[INFO] Tycho Surefire Plugin .............................. SUCCESS [  6.317 s]
[INFO] Tycho Release Parent ............................... SUCCESS [  0.015 s]
[INFO] Tycho Versions Plugin .............................. SUCCESS [ 10.136 s]
[INFO] Tycho p2 Director Plugin ........................... SUCCESS [  5.823 s]
[INFO] tycho-artifactcomparator ........................... SUCCESS [  2.308 s]
[INFO] Tycho p2 Metadata Plugin ........................... SUCCESS [  2.005 s]
[INFO] Tycho p2 Publisher Plugin .......................... SUCCESS [  2.155 s]
[INFO] Tycho p2 Repository Plugin ......................... SUCCESS [  0.529 s]
[INFO] ------------------------------------------------------------------------
[INFO] BUILD SUCCESS
[INFO] ------------------------------------------------------------------------
[INFO] Total time:  06:12 min
[INFO] Finished at: 2019-07-07T00:06:32-04:00
[INFO] ------------------------------------------------------------------------
[workspace] $ mvn -f /home/hudson/genie.tycho/.jenkins/jobs/tycho-sonar/workspace/pom.xml -e -B sonar:sonar -Dmaven.repo.local=/home/hudson/genie.tycho/.jenkins/jobs/tycho-sonar/workspace/.maven/repo -Dsonar.jacoco.reportPath=/home/hudson/genie.tycho/.jenkins/jobs/tycho-sonar/workspace/target/jacoco.exec -Pcoverage -Dsonar.jdbc.url=jdbc:mysql://dbmaster:3306/sonar?autoReconnect=true&useUnicode=true&characterEncoding=utf8 ******** ******** -Dsonar.host.url=https://sonar.eclipse.org
FATAL: command execution failed
java.io.IOException: error=2, No such file or directory
	at java.lang.UNIXProcess.forkAndExec(Native Method)
	at java.lang.UNIXProcess.<init>(UNIXProcess.java:247)
	at java.lang.ProcessImpl.start(ProcessImpl.java:134)
	at java.lang.ProcessBuilder.start(ProcessBuilder.java:1029)
Caused: java.io.IOException: Cannot run program "mvn" (in directory "/home/hudson/genie.tycho/.jenkins/jobs/tycho-sonar/workspace"): error=2, No such file or directory
	at java.lang.ProcessBuilder.start(ProcessBuilder.java:1048)
	at hudson.Proc$LocalProc.<init>(Proc.java:249)
	at hudson.Proc$LocalProc.<init>(Proc.java:218)
	at hudson.Launcher$LocalLauncher.launch(Launcher.java:936)
	at hudson.Launcher$ProcStarter.start(Launcher.java:455)
	at hudson.Launcher$ProcStarter.join(Launcher.java:466)
	at hudson.tasks.Maven.perform(Maven.java:368)
	at hudson.plugins.sonar.utils.SonarMaven.executeMaven(SonarMaven.java:185)
	at hudson.plugins.sonar.SonarPublisher.executeSonar(SonarPublisher.java:370)
	at hudson.plugins.sonar.SonarPublisher.perform(SonarPublisher.java:328)
	at hudson.tasks.BuildStepMonitor$3.perform(BuildStepMonitor.java:45)
	at hudson.model.AbstractBuild$AbstractBuildExecution.perform(AbstractBuild.java:744)
	at hudson.model.AbstractBuild$AbstractBuildExecution.performAllBuildSteps(AbstractBuild.java:690)
	at hudson.model.Build$BuildExecution.post2(Build.java:186)
	at hudson.model.AbstractBuild$AbstractBuildExecution.post(AbstractBuild.java:635)
	at hudson.model.Run.execute(Run.java:1835)
	at hudson.model.FreeStyleBuild.run(FreeStyleBuild.java:43)
	at hudson.model.ResourceController.execute(ResourceController.java:97)
	at hudson.model.Executor.run(Executor.java:429)
SonarQube analysis completed: FAILURE
Build step 'SonarQube analysis with Maven' changed build result to FAILURE
Build step 'SonarQube analysis with Maven' marked build as failure
Not sending mail to unregistered user mat.booth@redhat.com
Not sending mail to unregistered user carsten.hammer@t-online.de
Not sending mail to unregistered user akurtako@redhat.com
Not sending mail to unregistered user mn@mn.com.ua
Not sending mail to unregistered user bsd@mt.ca
Not sending mail to unregistered user karsten.thoms@itemis.de
Not sending mail to unregistered user laeubi@laeubi-soft.de
Not sending mail to unregistered user mistria@redhat.com
Not sending mail to unregistered user jan.sievers@sap.com
Not sending mail to unregistered user michael.keppler@gmx.de
Not sending mail to unregistered user mat.booth@redhat.com
Not sending mail to unregistered user martin.schreiber@bachmann.info
Not sending mail to unregistered user mistria@redhat.com
Not sending mail to unregistered user akurtako@redhat.com
Not sending mail to unregistered user sebastian.ratz@sap.com
Not sending mail to unregistered user jonah@kichwacoders.com
Sending e-mails to: mistria@redhat.com
Started calculate disk usage of build
Finished Calculation of disk usage of build in 0 seconds
Started calculate disk usage of workspace
Finished Calculation of disk usage of workspace in  1 second
Finished: FAILURE