FailedConsole Output

Skipping 324 KB.. Full Log
vPjexLDVPzxdEGvvmZ+X75ZekLlOVfvTjc8FPJgaGiiIGKaiG5Py84vycVD1nCA1SyAABjCCFBQCV27OjYAAAAA==[INFO] --- maven-plugin-plugin:3.6.0:descriptor (default-descriptor) @ tycho-p2-extras-plugin ---
[INFO] Using 'UTF-8' encoding to read mojo source files.
[INFO] java-annotations mojo extractor found 3 mojo descriptors.
[INFO] 
[INFO] --- plexus-component-metadata:2.0.0:generate-metadata (default) @ tycho-p2-extras-plugin ---
[INFO] Discovered 1 component descriptors(s)
[INFO] 
[INFO] --- maven-resources-plugin:3.1.0:testResources (default-testResources) @ tycho-p2-extras-plugin ---
[INFO] Using 'UTF-8' encoding to copy filtered resources.
[INFO] Copying 14 resources
[INFO] 
[INFO] --- maven-properties-plugin:0.0.2:filter-file (default) @ tycho-p2-extras-plugin ---
[INFO] 
[INFO] --- maven-compiler-plugin:3.8.1:testCompile (default-testCompile) @ tycho-p2-extras-plugin ---
[INFO] Changes detected - recompiling the module!
[INFO] Compiling 2 source files to /jobs/genie.tycho/tycho-nightly/workspace/tycho-extras/tycho-p2-extras-plugin/target/test-classes
[INFO] 
[INFO] --- plexus-component-metadata:2.0.0:generate-test-metadata (default) @ tycho-p2-extras-plugin ---
[INFO] 
[INFO] --- maven-surefire-plugin:2.22.0:test (default-test) @ tycho-p2-extras-plugin ---
[INFO] Tests are skipped.
[INFO] 
[INFO] --- maven-jar-plugin:3.1.2:jar (default-jar) @ tycho-p2-extras-plugin ---
[INFO] Building jar: /jobs/genie.tycho/tycho-nightly/workspace/tycho-extras/tycho-p2-extras-plugin/target/tycho-p2-extras-plugin-1.6.0-SNAPSHOT.jar
[INFO] 
[INFO] --- maven-plugin-plugin:3.6.0:addPluginArtifactMetadata (default-addPluginArtifactMetadata) @ tycho-p2-extras-plugin ---
[INFO] 
[INFO] --- maven-source-plugin:3.1.0:jar-no-fork (default) @ tycho-p2-extras-plugin ---
[INFO] Building jar: /jobs/genie.tycho/tycho-nightly/workspace/tycho-extras/tycho-p2-extras-plugin/target/tycho-p2-extras-plugin-1.6.0-SNAPSHOT-sources.jar
[INFO] 
[INFO] --- maven-install-plugin:2.5.2:install (default-install) @ tycho-p2-extras-plugin ---
[INFO] Installing /jobs/genie.tycho/tycho-nightly/workspace/tycho-extras/tycho-p2-extras-plugin/target/tycho-p2-extras-plugin-1.6.0-SNAPSHOT.jar to /home/hudson/genie.tycho/.jenkins/jobs/tycho-nightly/workspace/.repository/org/eclipse/tycho/extras/tycho-p2-extras-plugin/1.6.0-SNAPSHOT/tycho-p2-extras-plugin-1.6.0-SNAPSHOT.jar
[INFO] Installing /jobs/genie.tycho/tycho-nightly/workspace/tycho-extras/tycho-p2-extras-plugin/pom.xml to /home/hudson/genie.tycho/.jenkins/jobs/tycho-nightly/workspace/.repository/org/eclipse/tycho/extras/tycho-p2-extras-plugin/1.6.0-SNAPSHOT/tycho-p2-extras-plugin-1.6.0-SNAPSHOT.pom
[INFO] Installing /jobs/genie.tycho/tycho-nightly/workspace/tycho-extras/tycho-p2-extras-plugin/target/tycho-p2-extras-plugin-1.6.0-SNAPSHOT-sources.jar to /home/hudson/genie.tycho/.jenkins/jobs/tycho-nightly/workspace/.repository/org/eclipse/tycho/extras/tycho-p2-extras-plugin/1.6.0-SNAPSHOT/tycho-p2-extras-plugin-1.6.0-SNAPSHOT-sources.jar
[INFO] 
[INFO] -------< org.eclipse.tycho.extras:tycho-document-bundle-plugin >--------
[INFO] Building Tycho Document Bundle Plugin 1.6.0-SNAPSHOT             [55/69]
[INFO] ----------------------------[ maven-plugin ]----------------------------
[INFO] 
[INFO] --- maven-clean-plugin:3.1.0:clean (default-clean) @ tycho-document-bundle-plugin ---
[INFO] Deleting /jobs/genie.tycho/tycho-nightly/workspace/tycho-extras/tycho-document-bundle-plugin/target
[INFO] 
[INFO] --- maven-resources-plugin:3.1.0:resources (default-resources) @ tycho-document-bundle-plugin ---
[INFO] Using 'UTF-8' encoding to copy filtered resources.
[INFO] skip non existing resourceDirectory /jobs/genie.tycho/tycho-nightly/workspace/tycho-extras/tycho-document-bundle-plugin/src/main/resources
[INFO] 
[INFO] --- maven-compiler-plugin:3.8.1:compile (default-compile) @ tycho-document-bundle-plugin ---
[INFO] Changes detected - recompiling the module!
[INFO] Compiling 7 source files to /jobs/genie.tycho/tycho-nightly/workspace/tycho-extras/tycho-document-bundle-plugin/target/classes
[INFO] 
[INFO] --- maven-plugin-plugin:3.6.0:descriptor (default-descriptor) @ tycho-document-bundle-plugin ---
[INFO] Using 'UTF-8' encoding to read mojo source files.
[INFO] java-annotations mojo extractor found 1 mojo descriptor.
[INFO] 
[INFO] --- plexus-component-metadata:2.0.0:generate-metadata (default) @ tycho-document-bundle-plugin ---
[INFO] Discovered 1 component descriptors(s)
[INFO] 
[INFO] --- maven-resources-plugin:3.1.0:testResources (default-testResources) @ tycho-document-bundle-plugin ---
[INFO] Using 'UTF-8' encoding to copy filtered resources.
[INFO] Copying 1 resource
[INFO] 
[INFO] --- maven-compiler-plugin:3.8.1:testCompile (default-testCompile) @ tycho-document-bundle-plugin ---
[INFO] Changes detected - recompiling the module!
[INFO] Compiling 3 source files to /jobs/genie.tycho/tycho-nightly/workspace/tycho-extras/tycho-document-bundle-plugin/target/test-classes
[INFO] 
[INFO] --- plexus-component-metadata:2.0.0:generate-test-metadata (default) @ tycho-document-bundle-plugin ---
[INFO] 
[INFO] --- maven-surefire-plugin:2.22.0:test (default-test) @ tycho-document-bundle-plugin ---
[INFO] Tests are skipped.
[INFO] 
[INFO] --- maven-jar-plugin:3.1.2:jar (default-jar) @ tycho-document-bundle-plugin ---
[INFO] Building jar: /jobs/genie.tycho/tycho-nightly/workspace/tycho-extras/tycho-document-bundle-plugin/target/tycho-document-bundle-plugin-1.6.0-SNAPSHOT.jar
[INFO] 
[INFO] --- maven-plugin-plugin:3.6.0:addPluginArtifactMetadata (default-addPluginArtifactMetadata) @ tycho-document-bundle-plugin ---
[INFO] 
[INFO] --- maven-source-plugin:3.1.0:jar-no-fork (default) @ tycho-document-bundle-plugin ---
[INFO] Building jar: /jobs/genie.tycho/tycho-nightly/workspace/tycho-extras/tycho-document-bundle-plugin/target/tycho-document-bundle-plugin-1.6.0-SNAPSHOT-sources.jar
[INFO] 
[INFO] --- maven-install-plugin:2.5.2:install (default-install) @ tycho-document-bundle-plugin ---
[INFO] Installing /jobs/genie.tycho/tycho-nightly/workspace/tycho-extras/tycho-document-bundle-plugin/target/tycho-document-bundle-plugin-1.6.0-SNAPSHOT.jar to /home/hudson/genie.tycho/.jenkins/jobs/tycho-nightly/workspace/.repository/org/eclipse/tycho/extras/tycho-document-bundle-plugin/1.6.0-SNAPSHOT/tycho-document-bundle-plugin-1.6.0-SNAPSHOT.jar
[INFO] Installing /jobs/genie.tycho/tycho-nightly/workspace/tycho-extras/tycho-document-bundle-plugin/pom.xml to /home/hudson/genie.tycho/.jenkins/jobs/tycho-nightly/workspace/.repository/org/eclipse/tycho/extras/tycho-document-bundle-plugin/1.6.0-SNAPSHOT/tycho-document-bundle-plugin-1.6.0-SNAPSHOT.pom
[INFO] Installing /jobs/genie.tycho/tycho-nightly/workspace/tycho-extras/tycho-document-bundle-plugin/target/tycho-document-bundle-plugin-1.6.0-SNAPSHOT-sources.jar to /home/hudson/genie.tycho/.jenkins/jobs/tycho-nightly/workspace/.repository/org/eclipse/tycho/extras/tycho-document-bundle-plugin/1.6.0-SNAPSHOT/tycho-document-bundle-plugin-1.6.0-SNAPSHOT-sources.jar
[INFO] 
[INFO] ---------< org.eclipse.tycho.extras:tycho-version-bump-plugin >---------
[INFO] Building Tycho Version Bump Plugin 1.6.0-SNAPSHOT                [56/69]
[INFO] ----------------------------[ maven-plugin ]----------------------------
[INFO] 
[INFO] --- maven-clean-plugin:3.1.0:clean (default-clean) @ tycho-version-bump-plugin ---
[INFO] Deleting /jobs/genie.tycho/tycho-nightly/workspace/tycho-extras/tycho-version-bump-plugin/target
[INFO] 
[INFO] --- maven-resources-plugin:3.1.0:resources (default-resources) @ tycho-version-bump-plugin ---
[INFO] Using 'UTF-8' encoding to copy filtered resources.
[INFO] skip non existing resourceDirectory /jobs/genie.tycho/tycho-nightly/workspace/tycho-extras/tycho-version-bump-plugin/src/main/resources
[INFO] 
[INFO] --- maven-compiler-plugin:3.8.1:compile (default-compile) @ tycho-version-bump-plugin ---
[INFO] Changes detected - recompiling the module!
[INFO] Compiling 3 source files to /jobs/genie.tycho/tycho-nightly/workspace/tycho-extras/tycho-version-bump-plugin/target/classes
[INFO] /jobs/genie.tycho/tycho-nightly/workspace/tycho-extras/tycho-version-bump-plugin/src/main/java/org/eclipse/tycho/versionbump/UpdateTargetMojo.java: /jobs/genie.tycho/tycho-nightly/workspace/tycho-extras/tycho-version-bump-plugin/src/main/java/org/eclipse/tycho/versionbump/UpdateTargetMojo.java uses or overrides a deprecated API.
[INFO] /jobs/genie.tycho/tycho-nightly/workspace/tycho-extras/tycho-version-bump-plugin/src/main/java/org/eclipse/tycho/versionbump/UpdateTargetMojo.java: Recompile with -Xlint:deprecation for details.
[INFO] 
[INFO] --- maven-plugin-plugin:3.6.0:descriptor (default-descriptor) @ tycho-version-bump-plugin ---
[INFO] Using 'UTF-8' encoding to read mojo source files.
[INFO] java-annotations mojo extractor found 2 mojo descriptors.
[INFO] 
[INFO] --- maven-resources-plugin:3.1.0:testResources (default-testResources) @ tycho-version-bump-plugin ---
[INFO] Using 'UTF-8' encoding to copy filtered resources.
[INFO] skip non existing resourceDirectory /jobs/genie.tycho/tycho-nightly/workspace/tycho-extras/tycho-version-bump-plugin/src/test/resources
[INFO] 
[INFO] --- maven-compiler-plugin:3.8.1:testCompile (default-testCompile) @ tycho-version-bump-plugin ---
[INFO] No sources to compile
[INFO] 
[INFO] --- maven-surefire-plugin:2.22.0:test (default-test) @ tycho-version-bump-plugin ---
[INFO] Tests are skipped.
[INFO] 
[INFO] --- maven-jar-plugin:3.1.2:jar (default-jar) @ tycho-version-bump-plugin ---
[INFO] Building jar: /jobs/genie.tycho/tycho-nightly/workspace/tycho-extras/tycho-version-bump-plugin/target/tycho-version-bump-plugin-1.6.0-SNAPSHOT.jar
[INFO] 
[INFO] --- maven-plugin-plugin:3.6.0:addPluginArtifactMetadata (default-addPluginArtifactMetadata) @ tycho-version-bump-plugin ---
[INFO] 
[INFO] --- maven-source-plugin:3.1.0:jar-no-fork (default) @ tycho-version-bump-plugin ---
[INFO] Building jar: /jobs/genie.tycho/tycho-nightly/workspace/tycho-extras/tycho-version-bump-plugin/target/tycho-version-bump-plugin-1.6.0-SNAPSHOT-sources.jar
[INFO] 
[INFO] --- maven-install-plugin:2.5.2:install (default-install) @ tycho-version-bump-plugin ---
[INFO] Installing /jobs/genie.tycho/tycho-nightly/workspace/tycho-extras/tycho-version-bump-plugin/target/tycho-version-bump-plugin-1.6.0-SNAPSHOT.jar to /home/hudson/genie.tycho/.jenkins/jobs/tycho-nightly/workspace/.repository/org/eclipse/tycho/extras/tycho-version-bump-plugin/1.6.0-SNAPSHOT/tycho-version-bump-plugin-1.6.0-SNAPSHOT.jar
[INFO] Installing /jobs/genie.tycho/tycho-nightly/workspace/tycho-extras/tycho-version-bump-plugin/pom.xml to /home/hudson/genie.tycho/.jenkins/jobs/tycho-nightly/workspace/.repository/org/eclipse/tycho/extras/tycho-version-bump-plugin/1.6.0-SNAPSHOT/tycho-version-bump-plugin-1.6.0-SNAPSHOT.pom
[INFO] Installing /jobs/genie.tycho/tycho-nightly/workspace/tycho-extras/tycho-version-bump-plugin/target/tycho-version-bump-plugin-1.6.0-SNAPSHOT-sources.jar to /home/hudson/genie.tycho/.jenkins/jobs/tycho-nightly/workspace/.repository/org/eclipse/tycho/extras/tycho-version-bump-plugin/1.6.0-SNAPSHOT/tycho-version-bump-plugin-1.6.0-SNAPSHOT-sources.jar
[INFO] 
[INFO] --------< org.eclipse.tycho.extras:tycho-source-feature-plugin >--------
[INFO] Building Tycho Source Feature Generation Plugin 1.6.0-SNAPSHOT   [57/69]
[INFO] ----------------------------[ maven-plugin ]----------------------------
[INFO] 
[INFO] --- maven-clean-plugin:3.1.0:clean (default-clean) @ tycho-source-feature-plugin ---
[INFO] Deleting /jobs/genie.tycho/tycho-nightly/workspace/tycho-extras/tycho-source-feature-plugin/target
[INFO] 
[INFO] --- maven-resources-plugin:3.1.0:resources (default-resources) @ tycho-source-feature-plugin ---
[INFO] Using 'UTF-8' encoding to copy filtered resources.
[INFO] skip non existing resourceDirectory /jobs/genie.tycho/tycho-nightly/workspace/tycho-extras/tycho-source-feature-plugin/src/main/resources
[INFO] 
[INFO] --- maven-compiler-plugin:3.8.1:compile (default-compile) @ tycho-source-feature-plugin ---
[INFO] Changes detected - recompiling the module!
[INFO] Compiling 2 source files to /jobs/genie.tycho/tycho-nightly/workspace/tycho-extras/tycho-source-feature-plugin/target/classes
[INFO] /jobs/genie.tycho/tycho-nightly/workspace/tycho-extras/tycho-source-feature-plugin/src/main/java/org/eclipse/tycho/extras/sourcefeature/SourceFeatureMojo.java: /jobs/genie.tycho/tycho-nightly/workspace/tycho-extras/tycho-source-feature-plugin/src/main/java/org/eclipse/tycho/extras/sourcefeature/SourceFeatureMojo.java uses or overrides a deprecated API.
[INFO] /jobs/genie.tycho/tycho-nightly/workspace/tycho-extras/tycho-source-feature-plugin/src/main/java/org/eclipse/tycho/extras/sourcefeature/SourceFeatureMojo.java: Recompile with -Xlint:deprecation for details.
[INFO] 
[INFO] --- maven-plugin-plugin:3.6.0:descriptor (default-descriptor) @ tycho-source-feature-plugin ---
[INFO] Using 'UTF-8' encoding to read mojo source files.
[INFO] java-annotations mojo extractor found 1 mojo descriptor.
[INFO] 
[INFO] --- plexus-component-metadata:2.0.0:generate-metadata (default) @ tycho-source-feature-plugin ---
[INFO] Discovered 1 component descriptors(s)
[INFO] 
[INFO] --- maven-resources-plugin:3.1.0:testResources (default-testResources) @ tycho-source-feature-plugin ---
[INFO] Using 'UTF-8' encoding to copy filtered resources.
[INFO] Copying 2 resources
[INFO] 
[INFO] --- maven-compiler-plugin:3.8.1:testCompile (default-testCompile) @ tycho-source-feature-plugin ---
[INFO] Changes detected - recompiling the module!
[INFO] Compiling 1 source file to /jobs/genie.tycho/tycho-nightly/workspace/tycho-extras/tycho-source-feature-plugin/target/test-classes
[INFO] 
[INFO] --- plexus-component-metadata:2.0.0:generate-test-metadata (default) @ tycho-source-feature-plugin ---
[INFO] 
[INFO] --- maven-surefire-plugin:2.22.0:test (default-test) @ tycho-source-feature-plugin ---
[INFO] Tests are skipped.
[INFO] 
[INFO] --- maven-jar-plugin:3.1.2:jar (default-jar) @ tycho-source-feature-plugin ---
[INFO] Building jar: /jobs/genie.tycho/tycho-nightly/workspace/tycho-extras/tycho-source-feature-plugin/target/tycho-source-feature-plugin-1.6.0-SNAPSHOT.jar
[INFO] 
[INFO] --- maven-plugin-plugin:3.6.0:addPluginArtifactMetadata (default-addPluginArtifactMetadata) @ tycho-source-feature-plugin ---
[INFO] 
[INFO] --- maven-source-plugin:3.1.0:jar-no-fork (default) @ tycho-source-feature-plugin ---
[INFO] Building jar: /jobs/genie.tycho/tycho-nightly/workspace/tycho-extras/tycho-source-feature-plugin/target/tycho-source-feature-plugin-1.6.0-SNAPSHOT-sources.jar
[INFO] 
[INFO] --- maven-install-plugin:2.5.2:install (default-install) @ tycho-source-feature-plugin ---
[INFO] Installing /jobs/genie.tycho/tycho-nightly/workspace/tycho-extras/tycho-source-feature-plugin/target/tycho-source-feature-plugin-1.6.0-SNAPSHOT.jar to /home/hudson/genie.tycho/.jenkins/jobs/tycho-nightly/workspace/.repository/org/eclipse/tycho/extras/tycho-source-feature-plugin/1.6.0-SNAPSHOT/tycho-source-feature-plugin-1.6.0-SNAPSHOT.jar
[INFO] Installing /jobs/genie.tycho/tycho-nightly/workspace/tycho-extras/tycho-source-feature-plugin/pom.xml to /home/hudson/genie.tycho/.jenkins/jobs/tycho-nightly/workspace/.repository/org/eclipse/tycho/extras/tycho-source-feature-plugin/1.6.0-SNAPSHOT/tycho-source-feature-plugin-1.6.0-SNAPSHOT.pom
[INFO] Installing /jobs/genie.tycho/tycho-nightly/workspace/tycho-extras/tycho-source-feature-plugin/target/tycho-source-feature-plugin-1.6.0-SNAPSHOT-sources.jar to /home/hudson/genie.tycho/.jenkins/jobs/tycho-nightly/workspace/.repository/org/eclipse/tycho/extras/tycho-source-feature-plugin/1.6.0-SNAPSHOT/tycho-source-feature-plugin-1.6.0-SNAPSHOT-sources.jar
[INFO] 
[INFO] --------< org.eclipse.tycho.extras:tycho-custom-bundle-plugin >---------
[INFO] Building Tycho Custom Bundle Plugin 1.6.0-SNAPSHOT               [58/69]
[INFO] ----------------------------[ maven-plugin ]----------------------------
[INFO] 
[INFO] --- maven-clean-plugin:3.1.0:clean (default-clean) @ tycho-custom-bundle-plugin ---
[INFO] Deleting /jobs/genie.tycho/tycho-nightly/workspace/tycho-extras/tycho-custom-bundle-plugin/target
[INFO] 
[INFO] --- maven-resources-plugin:3.1.0:resources (default-resources) @ tycho-custom-bundle-plugin ---
[INFO] Using 'UTF-8' encoding to copy filtered resources.
[INFO] skip non existing resourceDirectory /jobs/genie.tycho/tycho-nightly/workspace/tycho-extras/tycho-custom-bundle-plugin/src/main/resources
[INFO] 
[INFO] --- maven-compiler-plugin:3.8.1:compile (default-compile) @ tycho-custom-bundle-plugin ---
[INFO] Changes detected - recompiling the module!
[INFO] Compiling 2 source files to /jobs/genie.tycho/tycho-nightly/workspace/tycho-extras/tycho-custom-bundle-plugin/target/classes
[INFO] 
[INFO] --- maven-plugin-plugin:3.6.0:descriptor (default-descriptor) @ tycho-custom-bundle-plugin ---
[INFO] Using 'UTF-8' encoding to read mojo source files.
[INFO] java-annotations mojo extractor found 1 mojo descriptor.
[INFO] 
[INFO] --- plexus-component-metadata:2.0.0:generate-metadata (default) @ tycho-custom-bundle-plugin ---
[INFO] Discovered 1 component descriptors(s)
[INFO] 
[INFO] --- maven-resources-plugin:3.1.0:testResources (default-testResources) @ tycho-custom-bundle-plugin ---
[INFO] Using 'UTF-8' encoding to copy filtered resources.
[INFO] skip non existing resourceDirectory /jobs/genie.tycho/tycho-nightly/workspace/tycho-extras/tycho-custom-bundle-plugin/src/test/resources
[INFO] 
[INFO] --- maven-compiler-plugin:3.8.1:testCompile (default-testCompile) @ tycho-custom-bundle-plugin ---
[INFO] No sources to compile
[INFO] 
[INFO] --- plexus-component-metadata:2.0.0:generate-test-metadata (default) @ tycho-custom-bundle-plugin ---
[INFO] 
[INFO] --- maven-surefire-plugin:2.22.0:test (default-test) @ tycho-custom-bundle-plugin ---
[INFO] Tests are skipped.
[INFO] 
[INFO] --- maven-jar-plugin:3.1.2:jar (default-jar) @ tycho-custom-bundle-plugin ---
[INFO] Building jar: /jobs/genie.tycho/tycho-nightly/workspace/tycho-extras/tycho-custom-bundle-plugin/target/tycho-custom-bundle-plugin-1.6.0-SNAPSHOT.jar
[INFO] 
[INFO] --- maven-plugin-plugin:3.6.0:addPluginArtifactMetadata (default-addPluginArtifactMetadata) @ tycho-custom-bundle-plugin ---
[INFO] 
[INFO] --- maven-source-plugin:3.1.0:jar-no-fork (default) @ tycho-custom-bundle-plugin ---
[INFO] Building jar: /jobs/genie.tycho/tycho-nightly/workspace/tycho-extras/tycho-custom-bundle-plugin/target/tycho-custom-bundle-plugin-1.6.0-SNAPSHOT-sources.jar
[INFO] 
[INFO] --- maven-install-plugin:2.5.2:install (default-install) @ tycho-custom-bundle-plugin ---
[INFO] Installing /jobs/genie.tycho/tycho-nightly/workspace/tycho-extras/tycho-custom-bundle-plugin/target/tycho-custom-bundle-plugin-1.6.0-SNAPSHOT.jar to /home/hudson/genie.tycho/.jenkins/jobs/tycho-nightly/workspace/.repository/org/eclipse/tycho/extras/tycho-custom-bundle-plugin/1.6.0-SNAPSHOT/tycho-custom-bundle-plugin-1.6.0-SNAPSHOT.jar
[INFO] Installing /jobs/genie.tycho/tycho-nightly/workspace/tycho-extras/tycho-custom-bundle-plugin/pom.xml to /home/hudson/genie.tycho/.jenkins/jobs/tycho-nightly/workspace/.repository/org/eclipse/tycho/extras/tycho-custom-bundle-plugin/1.6.0-SNAPSHOT/tycho-custom-bundle-plugin-1.6.0-SNAPSHOT.pom
[INFO] Installing /jobs/genie.tycho/tycho-nightly/workspace/tycho-extras/tycho-custom-bundle-plugin/target/tycho-custom-bundle-plugin-1.6.0-SNAPSHOT-sources.jar to /home/hudson/genie.tycho/.jenkins/jobs/tycho-nightly/workspace/.repository/org/eclipse/tycho/extras/tycho-custom-bundle-plugin/1.6.0-SNAPSHOT/tycho-custom-bundle-plugin-1.6.0-SNAPSHOT-sources.jar
[INFO] 
[INFO] ----------< org.eclipse.tycho.extras:tycho-eclipserun-plugin >----------
[INFO] Building Tycho Eclipserun Plugin 1.6.0-SNAPSHOT                  [59/69]
[INFO] ----------------------------[ maven-plugin ]----------------------------
[INFO] 
[INFO] --- maven-clean-plugin:3.1.0:clean (default-clean) @ tycho-eclipserun-plugin ---
[INFO] Deleting /jobs/genie.tycho/tycho-nightly/workspace/tycho-extras/tycho-eclipserun-plugin/target
[INFO] 
[INFO] --- maven-resources-plugin:3.1.0:resources (default-resources) @ tycho-eclipserun-plugin ---
[INFO] Using 'UTF-8' encoding to copy filtered resources.
[INFO] skip non existing resourceDirectory /jobs/genie.tycho/tycho-nightly/workspace/tycho-extras/tycho-eclipserun-plugin/src/main/resources
[INFO] 
[INFO] --- maven-compiler-plugin:3.8.1:compile (default-compile) @ tycho-eclipserun-plugin ---
[INFO] Changes detected - recompiling the module!
[INFO] Compiling 1 source file to /jobs/genie.tycho/tycho-nightly/workspace/tycho-extras/tycho-eclipserun-plugin/target/classes
[INFO] /jobs/genie.tycho/tycho-nightly/workspace/tycho-extras/tycho-eclipserun-plugin/src/main/java/org/eclipse/tycho/extras/eclipserun/EclipseRunMojo.java: /jobs/genie.tycho/tycho-nightly/workspace/tycho-extras/tycho-eclipserun-plugin/src/main/java/org/eclipse/tycho/extras/eclipserun/EclipseRunMojo.java uses or overrides a deprecated API.
[INFO] /jobs/genie.tycho/tycho-nightly/workspace/tycho-extras/tycho-eclipserun-plugin/src/main/java/org/eclipse/tycho/extras/eclipserun/EclipseRunMojo.java: Recompile with -Xlint:deprecation for details.
[INFO] 
[INFO] --- maven-plugin-plugin:3.6.0:descriptor (default-descriptor) @ tycho-eclipserun-plugin ---
[INFO] Using 'UTF-8' encoding to read mojo source files.
[INFO] java-annotations mojo extractor found 1 mojo descriptor.
[INFO] 
[INFO] --- maven-resources-plugin:3.1.0:testResources (default-testResources) @ tycho-eclipserun-plugin ---
[INFO] Using 'UTF-8' encoding to copy filtered resources.
[INFO] skip non existing resourceDirectory /jobs/genie.tycho/tycho-nightly/workspace/tycho-extras/tycho-eclipserun-plugin/src/test/resources
[INFO] 
[INFO] --- maven-compiler-plugin:3.8.1:testCompile (default-testCompile) @ tycho-eclipserun-plugin ---
[INFO] Changes detected - recompiling the module!
[INFO] Compiling 1 source file to /jobs/genie.tycho/tycho-nightly/workspace/tycho-extras/tycho-eclipserun-plugin/target/test-classes
[INFO] 
[INFO] --- maven-surefire-plugin:2.22.0:test (default-test) @ tycho-eclipserun-plugin ---
[INFO] Tests are skipped.
[INFO] 
[INFO] --- maven-jar-plugin:3.1.2:jar (default-jar) @ tycho-eclipserun-plugin ---
[INFO] Building jar: /jobs/genie.tycho/tycho-nightly/workspace/tycho-extras/tycho-eclipserun-plugin/target/tycho-eclipserun-plugin-1.6.0-SNAPSHOT.jar
[INFO] 
[INFO] --- maven-plugin-plugin:3.6.0:addPluginArtifactMetadata (default-addPluginArtifactMetadata) @ tycho-eclipserun-plugin ---
[INFO] 
[INFO] --- maven-source-plugin:3.1.0:jar-no-fork (default) @ tycho-eclipserun-plugin ---
[INFO] Building jar: /jobs/genie.tycho/tycho-nightly/workspace/tycho-extras/tycho-eclipserun-plugin/target/tycho-eclipserun-plugin-1.6.0-SNAPSHOT-sources.jar
[INFO] 
[INFO] --- maven-install-plugin:2.5.2:install (default-install) @ tycho-eclipserun-plugin ---
[INFO] Installing /jobs/genie.tycho/tycho-nightly/workspace/tycho-extras/tycho-eclipserun-plugin/target/tycho-eclipserun-plugin-1.6.0-SNAPSHOT.jar to /home/hudson/genie.tycho/.jenkins/jobs/tycho-nightly/workspace/.repository/org/eclipse/tycho/extras/tycho-eclipserun-plugin/1.6.0-SNAPSHOT/tycho-eclipserun-plugin-1.6.0-SNAPSHOT.jar
[INFO] Installing /jobs/genie.tycho/tycho-nightly/workspace/tycho-extras/tycho-eclipserun-plugin/pom.xml to /home/hudson/genie.tycho/.jenkins/jobs/tycho-nightly/workspace/.repository/org/eclipse/tycho/extras/tycho-eclipserun-plugin/1.6.0-SNAPSHOT/tycho-eclipserun-plugin-1.6.0-SNAPSHOT.pom
[INFO] Installing /jobs/genie.tycho/tycho-nightly/workspace/tycho-extras/tycho-eclipserun-plugin/target/tycho-eclipserun-plugin-1.6.0-SNAPSHOT-sources.jar to /home/hudson/genie.tycho/.jenkins/jobs/tycho-nightly/workspace/.repository/org/eclipse/tycho/extras/tycho-eclipserun-plugin/1.6.0-SNAPSHOT/tycho-eclipserun-plugin-1.6.0-SNAPSHOT-sources.jar
[INFO] 
[INFO] ---------------< org.eclipse.tycho.extras:tycho-pack200 >---------------
[INFO] Building Tycho Pack200 Archive Plugins 1.6.0-SNAPSHOT            [60/69]
[INFO] --------------------------------[ pom ]---------------------------------
[INFO] 
[INFO] --- maven-clean-plugin:3.1.0:clean (default-clean) @ tycho-pack200 ---
[INFO] 
[INFO] --- maven-source-plugin:3.1.0:jar-no-fork (default) @ tycho-pack200 ---
[INFO] 
[INFO] --- maven-install-plugin:2.5.2:install (default-install) @ tycho-pack200 ---
[INFO] Installing /jobs/genie.tycho/tycho-nightly/workspace/tycho-extras/pack200/pom.xml to /home/hudson/genie.tycho/.jenkins/jobs/tycho-nightly/workspace/.repository/org/eclipse/tycho/extras/tycho-pack200/1.6.0-SNAPSHOT/tycho-pack200-1.6.0-SNAPSHOT.pom
[INFO] 
[INFO] ------------< org.eclipse.tycho.extras:tycho-pack200-impl >-------------
[INFO] Building Tycho Pack200 Archive Format Plugin 1.6.0-SNAPSHOT      [61/69]
[INFO] --------------------------------[ jar ]---------------------------------
[INFO] 
[INFO] --- maven-clean-plugin:3.1.0:clean (default-clean) @ tycho-pack200-impl ---
[INFO] Deleting /jobs/genie.tycho/tycho-nightly/workspace/tycho-extras/pack200/tycho-pack200-impl/target
[INFO] 
[INFO] --- maven-resources-plugin:3.1.0:resources (default-resources) @ tycho-pack200-impl ---
[INFO] Using 'UTF-8' encoding to copy filtered resources.
[INFO] skip non existing resourceDirectory /jobs/genie.tycho/tycho-nightly/workspace/tycho-extras/pack200/tycho-pack200-impl/src/main/resources
[INFO] 
[INFO] --- maven-compiler-plugin:3.8.1:compile (default-compile) @ tycho-pack200-impl ---
[INFO] Changes detected - recompiling the module!
[INFO] Compiling 4 source files to /jobs/genie.tycho/tycho-nightly/workspace/tycho-extras/pack200/tycho-pack200-impl/target/classes
[INFO] 
[INFO] --- plexus-component-metadata:2.0.0:generate-metadata (default) @ tycho-pack200-impl ---
[INFO] Discovered 1 component descriptors(s)
[INFO] 
[INFO] --- maven-resources-plugin:3.1.0:testResources (default-testResources) @ tycho-pack200-impl ---
[INFO] Using 'UTF-8' encoding to copy filtered resources.
[INFO] skip non existing resourceDirectory /jobs/genie.tycho/tycho-nightly/workspace/tycho-extras/pack200/tycho-pack200-impl/src/test/resources
[INFO] 
[INFO] --- maven-compiler-plugin:3.8.1:testCompile (default-testCompile) @ tycho-pack200-impl ---
[INFO] No sources to compile
[INFO] 
[INFO] --- plexus-component-metadata:2.0.0:generate-test-metadata (default) @ tycho-pack200-impl ---
[INFO] 
[INFO] --- maven-surefire-plugin:2.22.0:test (default-test) @ tycho-pack200-impl ---
[INFO] Tests are skipped.
[INFO] 
[INFO] --- maven-jar-plugin:3.1.2:jar (default-jar) @ tycho-pack200-impl ---
[INFO] Building jar: /jobs/genie.tycho/tycho-nightly/workspace/tycho-extras/pack200/tycho-pack200-impl/target/tycho-pack200-impl-1.6.0-SNAPSHOT.jar
[INFO] 
[INFO] --- maven-source-plugin:3.1.0:jar-no-fork (default) @ tycho-pack200-impl ---
[INFO] Building jar: /jobs/genie.tycho/tycho-nightly/workspace/tycho-extras/pack200/tycho-pack200-impl/target/tycho-pack200-impl-1.6.0-SNAPSHOT-sources.jar
[INFO] 
[INFO] --- maven-install-plugin:2.5.2:install (default-install) @ tycho-pack200-impl ---
[INFO] Installing /jobs/genie.tycho/tycho-nightly/workspace/tycho-extras/pack200/tycho-pack200-impl/target/tycho-pack200-impl-1.6.0-SNAPSHOT.jar to /home/hudson/genie.tycho/.jenkins/jobs/tycho-nightly/workspace/.repository/org/eclipse/tycho/extras/tycho-pack200-impl/1.6.0-SNAPSHOT/tycho-pack200-impl-1.6.0-SNAPSHOT.jar
[INFO] Installing /jobs/genie.tycho/tycho-nightly/workspace/tycho-extras/pack200/tycho-pack200-impl/pom.xml to /home/hudson/genie.tycho/.jenkins/jobs/tycho-nightly/workspace/.repository/org/eclipse/tycho/extras/tycho-pack200-impl/1.6.0-SNAPSHOT/tycho-pack200-impl-1.6.0-SNAPSHOT.pom
[INFO] Installing /jobs/genie.tycho/tycho-nightly/workspace/tycho-extras/pack200/tycho-pack200-impl/target/tycho-pack200-impl-1.6.0-SNAPSHOT-sources.jar to /home/hudson/genie.tycho/.jenkins/jobs/tycho-nightly/workspace/.repository/org/eclipse/tycho/extras/tycho-pack200-impl/1.6.0-SNAPSHOT/tycho-pack200-impl-1.6.0-SNAPSHOT-sources.jar
[INFO] 
[INFO] -----------< org.eclipse.tycho.extras:tycho-pack200a-plugin >-----------
[INFO] Building Tycho Pack200 Normalization Plugin 1.6.0-SNAPSHOT       [62/69]
[INFO] ----------------------------[ maven-plugin ]----------------------------
[INFO] 
[INFO] --- maven-clean-plugin:3.1.0:clean (default-clean) @ tycho-pack200a-plugin ---
[INFO] Deleting /jobs/genie.tycho/tycho-nightly/workspace/tycho-extras/pack200/tycho-pack200a-plugin/target
[INFO] 
[INFO] --- maven-resources-plugin:3.1.0:resources (default-resources) @ tycho-pack200a-plugin ---
[INFO] Using 'UTF-8' encoding to copy filtered resources.
[INFO] skip non existing resourceDirectory /jobs/genie.tycho/tycho-nightly/workspace/tycho-extras/pack200/tycho-pack200a-plugin/src/main/resources
[INFO] 
[INFO] --- maven-compiler-plugin:3.8.1:compile (default-compile) @ tycho-pack200a-plugin ---
[INFO] Changes detected - recompiling the module!
[INFO] Compiling 1 source file to /jobs/genie.tycho/tycho-nightly/workspace/tycho-extras/pack200/tycho-pack200a-plugin/target/classes
[INFO] 
[INFO] --- maven-plugin-plugin:3.6.0:descriptor (default-descriptor) @ tycho-pack200a-plugin ---
[INFO] Using 'UTF-8' encoding to read mojo source files.
[INFO] java-annotations mojo extractor found 1 mojo descriptor.
[INFO] 
[INFO] --- maven-resources-plugin:3.1.0:testResources (default-testResources) @ tycho-pack200a-plugin ---
[INFO] Using 'UTF-8' encoding to copy filtered resources.
[INFO] skip non existing resourceDirectory /jobs/genie.tycho/tycho-nightly/workspace/tycho-extras/pack200/tycho-pack200a-plugin/src/test/resources
[INFO] 
[INFO] --- maven-compiler-plugin:3.8.1:testCompile (default-testCompile) @ tycho-pack200a-plugin ---
[INFO] No sources to compile
[INFO] 
[INFO] --- maven-surefire-plugin:2.22.0:test (default-test) @ tycho-pack200a-plugin ---
[INFO] Tests are skipped.
[INFO] 
[INFO] --- maven-jar-plugin:3.1.2:jar (default-jar) @ tycho-pack200a-plugin ---
[INFO] Building jar: /jobs/genie.tycho/tycho-nightly/workspace/tycho-extras/pack200/tycho-pack200a-plugin/target/tycho-pack200a-plugin-1.6.0-SNAPSHOT.jar
[INFO] 
[INFO] --- maven-plugin-plugin:3.6.0:addPluginArtifactMetadata (default-addPluginArtifactMetadata) @ tycho-pack200a-plugin ---
[INFO] 
[INFO] --- maven-source-plugin:3.1.0:jar-no-fork (default) @ tycho-pack200a-plugin ---
[INFO] Building jar: /jobs/genie.tycho/tycho-nightly/workspace/tycho-extras/pack200/tycho-pack200a-plugin/target/tycho-pack200a-plugin-1.6.0-SNAPSHOT-sources.jar
[INFO] 
[INFO] --- maven-install-plugin:2.5.2:install (default-install) @ tycho-pack200a-plugin ---
[INFO] Installing /jobs/genie.tycho/tycho-nightly/workspace/tycho-extras/pack200/tycho-pack200a-plugin/target/tycho-pack200a-plugin-1.6.0-SNAPSHOT.jar to /home/hudson/genie.tycho/.jenkins/jobs/tycho-nightly/workspace/.repository/org/eclipse/tycho/extras/tycho-pack200a-plugin/1.6.0-SNAPSHOT/tycho-pack200a-plugin-1.6.0-SNAPSHOT.jar
[INFO] Installing /jobs/genie.tycho/tycho-nightly/workspace/tycho-extras/pack200/tycho-pack200a-plugin/pom.xml to /home/hudson/genie.tycho/.jenkins/jobs/tycho-nightly/workspace/.repository/org/eclipse/tycho/extras/tycho-pack200a-plugin/1.6.0-SNAPSHOT/tycho-pack200a-plugin-1.6.0-SNAPSHOT.pom
[INFO] Installing /jobs/genie.tycho/tycho-nightly/workspace/tycho-extras/pack200/tycho-pack200a-plugin/target/tycho-pack200a-plugin-1.6.0-SNAPSHOT-sources.jar to /home/hudson/genie.tycho/.jenkins/jobs/tycho-nightly/workspace/.repository/org/eclipse/tycho/extras/tycho-pack200a-plugin/1.6.0-SNAPSHOT/tycho-pack200a-plugin-1.6.0-SNAPSHOT-sources.jar
[INFO] 
[INFO] -----------< org.eclipse.tycho.extras:tycho-pack200b-plugin >-----------
[INFO] Building Tycho Pack200 Pack Plugin 1.6.0-SNAPSHOT                [63/69]
[INFO] ----------------------------[ maven-plugin ]----------------------------
[INFO] 
[INFO] --- maven-clean-plugin:3.1.0:clean (default-clean) @ tycho-pack200b-plugin ---
[INFO] Deleting /jobs/genie.tycho/tycho-nightly/workspace/tycho-extras/pack200/tycho-pack200b-plugin/target
[INFO] 
[INFO] --- maven-resources-plugin:3.1.0:resources (default-resources) @ tycho-pack200b-plugin ---
[INFO] Using 'UTF-8' encoding to copy filtered resources.
[INFO] skip non existing resourceDirectory /jobs/genie.tycho/tycho-nightly/workspace/tycho-extras/pack200/tycho-pack200b-plugin/src/main/resources
[INFO] 
[INFO] --- maven-compiler-plugin:3.8.1:compile (default-compile) @ tycho-pack200b-plugin ---
[INFO] Changes detected - recompiling the module!
[INFO] Compiling 1 source file to /jobs/genie.tycho/tycho-nightly/workspace/tycho-extras/pack200/tycho-pack200b-plugin/target/classes
[INFO] 
[INFO] --- maven-plugin-plugin:3.6.0:descriptor (default-descriptor) @ tycho-pack200b-plugin ---
[INFO] Using 'UTF-8' encoding to read mojo source files.
[INFO] java-annotations mojo extractor found 1 mojo descriptor.
[INFO] 
[INFO] --- maven-resources-plugin:3.1.0:testResources (default-testResources) @ tycho-pack200b-plugin ---
[INFO] Using 'UTF-8' encoding to copy filtered resources.
[INFO] skip non existing resourceDirectory /jobs/genie.tycho/tycho-nightly/workspace/tycho-extras/pack200/tycho-pack200b-plugin/src/test/resources
[INFO] 
[INFO] --- maven-compiler-plugin:3.8.1:testCompile (default-testCompile) @ tycho-pack200b-plugin ---
[INFO] No sources to compile
[INFO] 
[INFO] --- maven-surefire-plugin:2.22.0:test (default-test) @ tycho-pack200b-plugin ---
[INFO] Tests are skipped.
[INFO] 
[INFO] --- maven-jar-plugin:3.1.2:jar (default-jar) @ tycho-pack200b-plugin ---
[INFO] Building jar: /jobs/genie.tycho/tycho-nightly/workspace/tycho-extras/pack200/tycho-pack200b-plugin/target/tycho-pack200b-plugin-1.6.0-SNAPSHOT.jar
[INFO] 
[INFO] --- maven-plugin-plugin:3.6.0:addPluginArtifactMetadata (default-addPluginArtifactMetadata) @ tycho-pack200b-plugin ---
[INFO] 
[INFO] --- maven-source-plugin:3.1.0:jar-no-fork (default) @ tycho-pack200b-plugin ---
[INFO] Building jar: /jobs/genie.tycho/tycho-nightly/workspace/tycho-extras/pack200/tycho-pack200b-plugin/target/tycho-pack200b-plugin-1.6.0-SNAPSHOT-sources.jar
[INFO] 
[INFO] --- maven-install-plugin:2.5.2:install (default-install) @ tycho-pack200b-plugin ---
[INFO] Installing /jobs/genie.tycho/tycho-nightly/workspace/tycho-extras/pack200/tycho-pack200b-plugin/target/tycho-pack200b-plugin-1.6.0-SNAPSHOT.jar to /home/hudson/genie.tycho/.jenkins/jobs/tycho-nightly/workspace/.repository/org/eclipse/tycho/extras/tycho-pack200b-plugin/1.6.0-SNAPSHOT/tycho-pack200b-plugin-1.6.0-SNAPSHOT.jar
[INFO] Installing /jobs/genie.tycho/tycho-nightly/workspace/tycho-extras/pack200/tycho-pack200b-plugin/pom.xml to /home/hudson/genie.tycho/.jenkins/jobs/tycho-nightly/workspace/.repository/org/eclipse/tycho/extras/tycho-pack200b-plugin/1.6.0-SNAPSHOT/tycho-pack200b-plugin-1.6.0-SNAPSHOT.pom
[INFO] Installing /jobs/genie.tycho/tycho-nightly/workspace/tycho-extras/pack200/tycho-pack200b-plugin/target/tycho-pack200b-plugin-1.6.0-SNAPSHOT-sources.jar to /home/hudson/genie.tycho/.jenkins/jobs/tycho-nightly/workspace/.repository/org/eclipse/tycho/extras/tycho-pack200b-plugin/1.6.0-SNAPSHOT/tycho-pack200b-plugin-1.6.0-SNAPSHOT-sources.jar
[INFO] 
[INFO] -------------< org.eclipse.tycho.extras:tycho-pack200-its >-------------
[INFO] Building Tycho Pack200 Integration Tests 1.6.0-SNAPSHOT          [64/69]
[INFO] --------------------------------[ jar ]---------------------------------
[INFO] 
[INFO] --- maven-clean-plugin:3.1.0:clean (default-clean) @ tycho-pack200-its ---
[INFO] Deleting /jobs/genie.tycho/tycho-nightly/workspace/tycho-extras/pack200/tycho-pack200-its/target
[INFO] 
[INFO] --- maven-resources-plugin:3.1.0:resources (default-resources) @ tycho-pack200-its ---
[INFO] Using 'UTF-8' encoding to copy filtered resources.
[INFO] skip non existing resourceDirectory /jobs/genie.tycho/tycho-nightly/workspace/tycho-extras/pack200/tycho-pack200-its/src/main/resources
[INFO] 
[INFO] --- maven-compiler-plugin:3.8.1:compile (default-compile) @ tycho-pack200-its ---
[INFO] Nothing to compile - all classes are up to date
[INFO] 
[INFO] --- maven-resources-plugin:3.1.0:testResources (default-testResources) @ tycho-pack200-its ---
[INFO] Using 'UTF-8' encoding to copy filtered resources.
[INFO] skip non existing resourceDirectory /jobs/genie.tycho/tycho-nightly/workspace/tycho-extras/pack200/tycho-pack200-its/src/test/resources
[INFO] 
[INFO] --- maven-compiler-plugin:3.8.1:testCompile (default-testCompile) @ tycho-pack200-its ---
[INFO] No sources to compile
[INFO] 
[INFO] --- maven-surefire-plugin:2.22.0:test (default-test) @ tycho-pack200-its ---
[INFO] Tests are skipped.
[INFO] 
[INFO] --- maven-jar-plugin:3.1.2:jar (default-jar) @ tycho-pack200-its ---
[WARNING] JAR will be empty - no content was marked for inclusion!
[INFO] Building jar: /jobs/genie.tycho/tycho-nightly/workspace/tycho-extras/pack200/tycho-pack200-its/target/tycho-pack200-its-1.6.0-SNAPSHOT.jar
[INFO] 
[INFO] --- maven-source-plugin:3.1.0:jar-no-fork (default) @ tycho-pack200-its ---
[INFO] Building jar: /jobs/genie.tycho/tycho-nightly/workspace/tycho-extras/pack200/tycho-pack200-its/target/tycho-pack200-its-1.6.0-SNAPSHOT-sources.jar
[INFO] 
[INFO] --- maven-install-plugin:2.5.2:install (default-install) @ tycho-pack200-its ---
[INFO] Installing /jobs/genie.tycho/tycho-nightly/workspace/tycho-extras/pack200/tycho-pack200-its/target/tycho-pack200-its-1.6.0-SNAPSHOT.jar to /home/hudson/genie.tycho/.jenkins/jobs/tycho-nightly/workspace/.repository/org/eclipse/tycho/extras/tycho-pack200-its/1.6.0-SNAPSHOT/tycho-pack200-its-1.6.0-SNAPSHOT.jar
[INFO] Installing /jobs/genie.tycho/tycho-nightly/workspace/tycho-extras/pack200/tycho-pack200-its/pom.xml to /home/hudson/genie.tycho/.jenkins/jobs/tycho-nightly/workspace/.repository/org/eclipse/tycho/extras/tycho-pack200-its/1.6.0-SNAPSHOT/tycho-pack200-its-1.6.0-SNAPSHOT.pom
[INFO] Installing /jobs/genie.tycho/tycho-nightly/workspace/tycho-extras/pack200/tycho-pack200-its/target/tycho-pack200-its-1.6.0-SNAPSHOT-sources.jar to /home/hudson/genie.tycho/.jenkins/jobs/tycho-nightly/workspace/.repository/org/eclipse/tycho/extras/tycho-pack200-its/1.6.0-SNAPSHOT/tycho-pack200-its-1.6.0-SNAPSHOT-sources.jar
[INFO] 
[INFO] ---------< org.eclipse.tycho.extras:tycho-buildtimestamp-jgit >---------
[INFO] Building Tycho JGit Build Timestamp Provider Plugin 1.6.0-SNAPSHOT [65/69]
[INFO] --------------------------------[ jar ]---------------------------------
[INFO] 
[INFO] --- maven-clean-plugin:3.1.0:clean (default-clean) @ tycho-buildtimestamp-jgit ---
[INFO] Deleting /jobs/genie.tycho/tycho-nightly/workspace/tycho-extras/tycho-buildtimestamp-jgit/target
[INFO] 
[INFO] --- maven-resources-plugin:3.1.0:resources (default-resources) @ tycho-buildtimestamp-jgit ---
[INFO] Using 'UTF-8' encoding to copy filtered resources.
[INFO] skip non existing resourceDirectory /jobs/genie.tycho/tycho-nightly/workspace/tycho-extras/tycho-buildtimestamp-jgit/src/main/resources
[INFO] 
[INFO] --- maven-compiler-plugin:3.8.1:compile (default-compile) @ tycho-buildtimestamp-jgit ---
[INFO] Changes detected - recompiling the module!
[INFO] Compiling 2 source files to /jobs/genie.tycho/tycho-nightly/workspace/tycho-extras/tycho-buildtimestamp-jgit/target/classes
[INFO] 
[INFO] --- plexus-component-metadata:2.0.0:generate-metadata (default) @ tycho-buildtimestamp-jgit ---
[INFO] Discovered 1 component descriptors(s)
[INFO] 
[INFO] --- maven-resources-plugin:3.1.0:testResources (default-testResources) @ tycho-buildtimestamp-jgit ---
[INFO] Using 'UTF-8' encoding to copy filtered resources.
[INFO] skip non existing resourceDirectory /jobs/genie.tycho/tycho-nightly/workspace/tycho-extras/tycho-buildtimestamp-jgit/src/test/resources
[INFO] 
[INFO] --- maven-compiler-plugin:3.8.1:testCompile (default-testCompile) @ tycho-buildtimestamp-jgit ---
[INFO] Changes detected - recompiling the module!
[INFO] Compiling 1 source file to /jobs/genie.tycho/tycho-nightly/workspace/tycho-extras/tycho-buildtimestamp-jgit/target/test-classes
[INFO] 
[INFO] --- plexus-component-metadata:2.0.0:generate-test-metadata (default) @ tycho-buildtimestamp-jgit ---
[INFO] 
[INFO] --- maven-surefire-plugin:2.22.0:test (default-test) @ tycho-buildtimestamp-jgit ---
[INFO] Tests are skipped.
[INFO] 
[INFO] --- maven-jar-plugin:3.1.2:jar (default-jar) @ tycho-buildtimestamp-jgit ---
[INFO] Building jar: /jobs/genie.tycho/tycho-nightly/workspace/tycho-extras/tycho-buildtimestamp-jgit/target/tycho-buildtimestamp-jgit-1.6.0-SNAPSHOT.jar
[INFO] 
[INFO] --- maven-source-plugin:3.1.0:jar-no-fork (default) @ tycho-buildtimestamp-jgit ---
[INFO] Building jar: /jobs/genie.tycho/tycho-nightly/workspace/tycho-extras/tycho-buildtimestamp-jgit/target/tycho-buildtimestamp-jgit-1.6.0-SNAPSHOT-sources.jar
[INFO] 
[INFO] --- maven-install-plugin:2.5.2:install (default-install) @ tycho-buildtimestamp-jgit ---
[INFO] Installing /jobs/genie.tycho/tycho-nightly/workspace/tycho-extras/tycho-buildtimestamp-jgit/target/tycho-buildtimestamp-jgit-1.6.0-SNAPSHOT.jar to /home/hudson/genie.tycho/.jenkins/jobs/tycho-nightly/workspace/.repository/org/eclipse/tycho/extras/tycho-buildtimestamp-jgit/1.6.0-SNAPSHOT/tycho-buildtimestamp-jgit-1.6.0-SNAPSHOT.jar
[INFO] Installing /jobs/genie.tycho/tycho-nightly/workspace/tycho-extras/tycho-buildtimestamp-jgit/pom.xml to /home/hudson/genie.tycho/.jenkins/jobs/tycho-nightly/workspace/.repository/org/eclipse/tycho/extras/tycho-buildtimestamp-jgit/1.6.0-SNAPSHOT/tycho-buildtimestamp-jgit-1.6.0-SNAPSHOT.pom
[INFO] Installing /jobs/genie.tycho/tycho-nightly/workspace/tycho-extras/tycho-buildtimestamp-jgit/target/tycho-buildtimestamp-jgit-1.6.0-SNAPSHOT-sources.jar to /home/hudson/genie.tycho/.jenkins/jobs/tycho-nightly/workspace/.repository/org/eclipse/tycho/extras/tycho-buildtimestamp-jgit/1.6.0-SNAPSHOT/tycho-buildtimestamp-jgit-1.6.0-SNAPSHOT-sources.jar
[INFO] 
[INFO] -----------< org.eclipse.tycho.extras:tycho-sourceref-jgit >------------
[INFO] Building Tycho JGit Source Reference Provider Plugin 1.6.0-SNAPSHOT [66/69]
[INFO] --------------------------------[ jar ]---------------------------------
[INFO] 
[INFO] --- maven-clean-plugin:3.1.0:clean (default-clean) @ tycho-sourceref-jgit ---
[INFO] Deleting /jobs/genie.tycho/tycho-nightly/workspace/tycho-extras/tycho-sourceref-jgit/target
[INFO] 
[INFO] --- maven-resources-plugin:3.1.0:resources (default-resources) @ tycho-sourceref-jgit ---
[INFO] Using 'UTF-8' encoding to copy filtered resources.
[INFO] skip non existing resourceDirectory /jobs/genie.tycho/tycho-nightly/workspace/tycho-extras/tycho-sourceref-jgit/src/main/resources
[INFO] 
[INFO] --- maven-compiler-plugin:3.8.1:compile (default-compile) @ tycho-sourceref-jgit ---
[INFO] Changes detected - recompiling the module!
[INFO] Compiling 1 source file to /jobs/genie.tycho/tycho-nightly/workspace/tycho-extras/tycho-sourceref-jgit/target/classes
[INFO] 
[INFO] --- plexus-component-metadata:2.0.0:generate-metadata (default) @ tycho-sourceref-jgit ---
[INFO] Discovered 1 component descriptors(s)
[INFO] 
[INFO] --- maven-resources-plugin:3.1.0:testResources (default-testResources) @ tycho-sourceref-jgit ---
[INFO] Using 'UTF-8' encoding to copy filtered resources.
[INFO] skip non existing resourceDirectory /jobs/genie.tycho/tycho-nightly/workspace/tycho-extras/tycho-sourceref-jgit/src/test/resources
[INFO] 
[INFO] --- maven-compiler-plugin:3.8.1:testCompile (default-testCompile) @ tycho-sourceref-jgit ---
[INFO] Changes detected - recompiling the module!
[INFO] Compiling 1 source file to /jobs/genie.tycho/tycho-nightly/workspace/tycho-extras/tycho-sourceref-jgit/target/test-classes
[INFO] 
[INFO] --- plexus-component-metadata:2.0.0:generate-test-metadata (default) @ tycho-sourceref-jgit ---
[INFO] 
[INFO] --- maven-surefire-plugin:2.22.0:test (default-test) @ tycho-sourceref-jgit ---
[INFO] Tests are skipped.
[INFO] 
[INFO] --- maven-jar-plugin:3.1.2:jar (default-jar) @ tycho-sourceref-jgit ---
[INFO] Building jar: /jobs/genie.tycho/tycho-nightly/workspace/tycho-extras/tycho-sourceref-jgit/target/tycho-sourceref-jgit-1.6.0-SNAPSHOT.jar
[INFO] 
[INFO] --- maven-source-plugin:3.1.0:jar-no-fork (default) @ tycho-sourceref-jgit ---
[INFO] Building jar: /jobs/genie.tycho/tycho-nightly/workspace/tycho-extras/tycho-sourceref-jgit/target/tycho-sourceref-jgit-1.6.0-SNAPSHOT-sources.jar
[INFO] 
[INFO] --- maven-install-plugin:2.5.2:install (default-install) @ tycho-sourceref-jgit ---
[INFO] Installing /jobs/genie.tycho/tycho-nightly/workspace/tycho-extras/tycho-sourceref-jgit/target/tycho-sourceref-jgit-1.6.0-SNAPSHOT.jar to /home/hudson/genie.tycho/.jenkins/jobs/tycho-nightly/workspace/.repository/org/eclipse/tycho/extras/tycho-sourceref-jgit/1.6.0-SNAPSHOT/tycho-sourceref-jgit-1.6.0-SNAPSHOT.jar
[INFO] Installing /jobs/genie.tycho/tycho-nightly/workspace/tycho-extras/tycho-sourceref-jgit/pom.xml to /home/hudson/genie.tycho/.jenkins/jobs/tycho-nightly/workspace/.repository/org/eclipse/tycho/extras/tycho-sourceref-jgit/1.6.0-SNAPSHOT/tycho-sourceref-jgit-1.6.0-SNAPSHOT.pom
[INFO] Installing /jobs/genie.tycho/tycho-nightly/workspace/tycho-extras/tycho-sourceref-jgit/target/tycho-sourceref-jgit-1.6.0-SNAPSHOT-sources.jar to /home/hudson/genie.tycho/.jenkins/jobs/tycho-nightly/workspace/.repository/org/eclipse/tycho/extras/tycho-sourceref-jgit/1.6.0-SNAPSHOT/tycho-sourceref-jgit-1.6.0-SNAPSHOT-sources.jar
[INFO] 
[INFO] -----< org.eclipse.tycho.extras:target-platform-validation-plugin >-----
[INFO] Building Tycho Target Platform Validation Plugin 1.6.0-SNAPSHOT  [67/69]
[INFO] ----------------------------[ maven-plugin ]----------------------------
[INFO] 
[INFO] --- maven-clean-plugin:3.1.0:clean (default-clean) @ target-platform-validation-plugin ---
[INFO] Deleting /jobs/genie.tycho/tycho-nightly/workspace/tycho-extras/target-platform-validation-plugin/target
[INFO] 
[INFO] --- maven-resources-plugin:3.1.0:resources (default-resources) @ target-platform-validation-plugin ---
[INFO] Using 'UTF-8' encoding to copy filtered resources.
[INFO] skip non existing resourceDirectory /jobs/genie.tycho/tycho-nightly/workspace/tycho-extras/target-platform-validation-plugin/src/main/resources
[INFO] 
[INFO] --- maven-compiler-plugin:3.8.1:compile (default-compile) @ target-platform-validation-plugin ---
[INFO] Changes detected - recompiling the module!
[INFO] Compiling 2 source files to /jobs/genie.tycho/tycho-nightly/workspace/tycho-extras/target-platform-validation-plugin/target/classes
[INFO] 
[INFO] --- maven-plugin-plugin:3.6.0:descriptor (default-descriptor) @ target-platform-validation-plugin ---
[INFO] Using 'UTF-8' encoding to read mojo source files.
[INFO] java-annotations mojo extractor found 1 mojo descriptor.
[INFO] 
[INFO] --- maven-resources-plugin:3.1.0:testResources (default-testResources) @ target-platform-validation-plugin ---
[INFO] Using 'UTF-8' encoding to copy filtered resources.
[INFO] skip non existing resourceDirectory /jobs/genie.tycho/tycho-nightly/workspace/tycho-extras/target-platform-validation-plugin/src/test/resources
[INFO] 
[INFO] --- maven-compiler-plugin:3.8.1:testCompile (default-testCompile) @ target-platform-validation-plugin ---
[INFO] No sources to compile
[INFO] 
[INFO] --- maven-surefire-plugin:2.22.0:test (default-test) @ target-platform-validation-plugin ---
[INFO] Tests are skipped.
[INFO] 
[INFO] --- maven-jar-plugin:3.1.2:jar (default-jar) @ target-platform-validation-plugin ---
[INFO] Building jar: /jobs/genie.tycho/tycho-nightly/workspace/tycho-extras/target-platform-validation-plugin/target/target-platform-validation-plugin-1.6.0-SNAPSHOT.jar
[INFO] 
[INFO] --- maven-plugin-plugin:3.6.0:addPluginArtifactMetadata (default-addPluginArtifactMetadata) @ target-platform-validation-plugin ---
[INFO] 
[INFO] --- maven-source-plugin:3.1.0:jar-no-fork (default) @ target-platform-validation-plugin ---
[INFO] Building jar: /jobs/genie.tycho/tycho-nightly/workspace/tycho-extras/target-platform-validation-plugin/target/target-platform-validation-plugin-1.6.0-SNAPSHOT-sources.jar
[INFO] 
[INFO] --- maven-install-plugin:2.5.2:install (default-install) @ target-platform-validation-plugin ---
[INFO] Installing /jobs/genie.tycho/tycho-nightly/workspace/tycho-extras/target-platform-validation-plugin/target/target-platform-validation-plugin-1.6.0-SNAPSHOT.jar to /home/hudson/genie.tycho/.jenkins/jobs/tycho-nightly/workspace/.repository/org/eclipse/tycho/extras/target-platform-validation-plugin/1.6.0-SNAPSHOT/target-platform-validation-plugin-1.6.0-SNAPSHOT.jar
[INFO] Installing /jobs/genie.tycho/tycho-nightly/workspace/tycho-extras/target-platform-validation-plugin/pom.xml to /home/hudson/genie.tycho/.jenkins/jobs/tycho-nightly/workspace/.repository/org/eclipse/tycho/extras/target-platform-validation-plugin/1.6.0-SNAPSHOT/target-platform-validation-plugin-1.6.0-SNAPSHOT.pom
[INFO] Installing /jobs/genie.tycho/tycho-nightly/workspace/tycho-extras/target-platform-validation-plugin/target/target-platform-validation-plugin-1.6.0-SNAPSHOT-sources.jar to /home/hudson/genie.tycho/.jenkins/jobs/tycho-nightly/workspace/.repository/org/eclipse/tycho/extras/target-platform-validation-plugin/1.6.0-SNAPSHOT/target-platform-validation-plugin-1.6.0-SNAPSHOT-sources.jar
[INFO] 
[INFO] ---------------< org.eclipse.tycho.extras:tycho-pomless >---------------
[INFO] Building Tycho POM-less build extension 1.6.0-SNAPSHOT           [68/69]
[INFO] --------------------------------[ jar ]---------------------------------
[INFO] 
[INFO] --- maven-clean-plugin:3.1.0:clean (default-clean) @ tycho-pomless ---
[INFO] Deleting /jobs/genie.tycho/tycho-nightly/workspace/tycho-extras/tycho-pomless/target
[INFO] 
[INFO] --- maven-resources-plugin:3.1.0:resources (default-resources) @ tycho-pomless ---
[INFO] Using 'UTF-8' encoding to copy filtered resources.
[INFO] skip non existing resourceDirectory /jobs/genie.tycho/tycho-nightly/workspace/tycho-extras/tycho-pomless/src/main/resources
[INFO] 
[INFO] --- maven-compiler-plugin:3.8.1:compile (default-compile) @ tycho-pomless ---
[INFO] Changes detected - recompiling the module!
[INFO] Compiling 8 source files to /jobs/genie.tycho/tycho-nightly/workspace/tycho-extras/tycho-pomless/target/classes
[INFO] 
[INFO] --- plexus-component-metadata:2.0.0:generate-metadata (default) @ tycho-pomless ---
[INFO] Discovered 5 component descriptors(s)
[INFO] 
[INFO] --- maven-resources-plugin:3.1.0:testResources (default-testResources) @ tycho-pomless ---
[INFO] Using 'UTF-8' encoding to copy filtered resources.
[INFO] Copying 51 resources
[INFO] 
[INFO] --- maven-compiler-plugin:3.8.1:testCompile (default-testCompile) @ tycho-pomless ---
[INFO] Changes detected - recompiling the module!
[INFO] Compiling 2 source files to /jobs/genie.tycho/tycho-nightly/workspace/tycho-extras/tycho-pomless/target/test-classes
[INFO] 
[INFO] --- plexus-component-metadata:2.0.0:generate-test-metadata (default) @ tycho-pomless ---
[INFO] 
[INFO] --- maven-surefire-plugin:2.22.0:test (default-test) @ tycho-pomless ---
[INFO] Tests are skipped.
[INFO] 
[INFO] --- maven-jar-plugin:3.1.2:jar (default-jar) @ tycho-pomless ---
[INFO] Building jar: /jobs/genie.tycho/tycho-nightly/workspace/tycho-extras/tycho-pomless/target/tycho-pomless-1.6.0-SNAPSHOT.jar
[INFO] 
[INFO] --- maven-source-plugin:3.1.0:jar-no-fork (default) @ tycho-pomless ---
[INFO] Building jar: /jobs/genie.tycho/tycho-nightly/workspace/tycho-extras/tycho-pomless/target/tycho-pomless-1.6.0-SNAPSHOT-sources.jar
[INFO] 
[INFO] --- maven-install-plugin:2.5.2:install (default-install) @ tycho-pomless ---
[INFO] Installing /jobs/genie.tycho/tycho-nightly/workspace/tycho-extras/tycho-pomless/target/tycho-pomless-1.6.0-SNAPSHOT.jar to /home/hudson/genie.tycho/.jenkins/jobs/tycho-nightly/workspace/.repository/org/eclipse/tycho/extras/tycho-pomless/1.6.0-SNAPSHOT/tycho-pomless-1.6.0-SNAPSHOT.jar
[INFO] Installing /jobs/genie.tycho/tycho-nightly/workspace/tycho-extras/tycho-pomless/pom.xml to /home/hudson/genie.tycho/.jenkins/jobs/tycho-nightly/workspace/.repository/org/eclipse/tycho/extras/tycho-pomless/1.6.0-SNAPSHOT/tycho-pomless-1.6.0-SNAPSHOT.pom
[INFO] Installing /jobs/genie.tycho/tycho-nightly/workspace/tycho-extras/tycho-pomless/target/tycho-pomless-1.6.0-SNAPSHOT-sources.jar to /home/hudson/genie.tycho/.jenkins/jobs/tycho-nightly/workspace/.repository/org/eclipse/tycho/extras/tycho-pomless/1.6.0-SNAPSHOT/tycho-pomless-1.6.0-SNAPSHOT-sources.jar
[INFO] 
[INFO] -------< org.eclipse.tycho.extras:tycho-dependency-tools-plugin >-------
[INFO] Building Tycho Dependency Tools Plugin 1.6.0-SNAPSHOT            [69/69]
[INFO] ----------------------------[ maven-plugin ]----------------------------
[INFO] 
[INFO] --- maven-clean-plugin:3.1.0:clean (default-clean) @ tycho-dependency-tools-plugin ---
[INFO] Deleting /jobs/genie.tycho/tycho-nightly/workspace/tycho-extras/tycho-dependency-tools-plugin/target
[INFO] 
[INFO] --- maven-resources-plugin:3.1.0:resources (default-resources) @ tycho-dependency-tools-plugin ---
[INFO] Using 'UTF-8' encoding to copy filtered resources.
[INFO] skip non existing resourceDirectory /jobs/genie.tycho/tycho-nightly/workspace/tycho-extras/tycho-dependency-tools-plugin/src/main/resources
[INFO] 
[INFO] --- maven-compiler-plugin:3.8.1:compile (default-compile) @ tycho-dependency-tools-plugin ---
[INFO] Changes detected - recompiling the module!
[INFO] Compiling 1 source file to /jobs/genie.tycho/tycho-nightly/workspace/tycho-extras/tycho-dependency-tools-plugin/target/classes
[INFO] 
[INFO] --- maven-plugin-plugin:3.6.0:descriptor (default-descriptor) @ tycho-dependency-tools-plugin ---
[INFO] Using 'UTF-8' encoding to read mojo source files.
[INFO] java-annotations mojo extractor found 1 mojo descriptor.
[INFO] 
[INFO] --- plexus-component-metadata:2.0.0:generate-metadata (default) @ tycho-dependency-tools-plugin ---
[INFO] 
[INFO] --- maven-resources-plugin:3.1.0:testResources (default-testResources) @ tycho-dependency-tools-plugin ---
[INFO] Using 'UTF-8' encoding to copy filtered resources.
[INFO] skip non existing resourceDirectory /jobs/genie.tycho/tycho-nightly/workspace/tycho-extras/tycho-dependency-tools-plugin/src/test/resources
[INFO] 
[INFO] --- maven-compiler-plugin:3.8.1:testCompile (default-testCompile) @ tycho-dependency-tools-plugin ---
[INFO] No sources to compile
[INFO] 
[INFO] --- plexus-component-metadata:2.0.0:generate-test-metadata (default) @ tycho-dependency-tools-plugin ---
[INFO] 
[INFO] --- maven-surefire-plugin:2.22.0:test (default-test) @ tycho-dependency-tools-plugin ---
[INFO] Tests are skipped.
[INFO] 
[INFO] --- maven-jar-plugin:3.1.2:jar (default-jar) @ tycho-dependency-tools-plugin ---
[INFO] Building jar: /jobs/genie.tycho/tycho-nightly/workspace/tycho-extras/tycho-dependency-tools-plugin/target/tycho-dependency-tools-plugin-1.6.0-SNAPSHOT.jar
[INFO] 
[INFO] --- maven-plugin-plugin:3.6.0:addPluginArtifactMetadata (default-addPluginArtifactMetadata) @ tycho-dependency-tools-plugin ---
[INFO] 
[INFO] --- maven-source-plugin:3.1.0:jar-no-fork (default) @ tycho-dependency-tools-plugin ---
[INFO] Building jar: /jobs/genie.tycho/tycho-nightly/workspace/tycho-extras/tycho-dependency-tools-plugin/target/tycho-dependency-tools-plugin-1.6.0-SNAPSHOT-sources.jar
[INFO] 
[INFO] --- maven-install-plugin:2.5.2:install (default-install) @ tycho-dependency-tools-plugin ---
[INFO] Installing /jobs/genie.tycho/tycho-nightly/workspace/tycho-extras/tycho-dependency-tools-plugin/target/tycho-dependency-tools-plugin-1.6.0-SNAPSHOT.jar to /home/hudson/genie.tycho/.jenkins/jobs/tycho-nightly/workspace/.repository/org/eclipse/tycho/extras/tycho-dependency-tools-plugin/1.6.0-SNAPSHOT/tycho-dependency-tools-plugin-1.6.0-SNAPSHOT.jar
[INFO] Installing /jobs/genie.tycho/tycho-nightly/workspace/tycho-extras/tycho-dependency-tools-plugin/pom.xml to /home/hudson/genie.tycho/.jenkins/jobs/tycho-nightly/workspace/.repository/org/eclipse/tycho/extras/tycho-dependency-tools-plugin/1.6.0-SNAPSHOT/tycho-dependency-tools-plugin-1.6.0-SNAPSHOT.pom
[INFO] Installing /jobs/genie.tycho/tycho-nightly/workspace/tycho-extras/tycho-dependency-tools-plugin/target/tycho-dependency-tools-plugin-1.6.0-SNAPSHOT-sources.jar to /home/hudson/genie.tycho/.jenkins/jobs/tycho-nightly/workspace/.repository/org/eclipse/tycho/extras/tycho-dependency-tools-plugin/1.6.0-SNAPSHOT/tycho-dependency-tools-plugin-1.6.0-SNAPSHOT-sources.jar
[INFO] ------------------------------------------------------------------------
[INFO] Reactor Summary for Tycho 1.6.0-SNAPSHOT:
[INFO] 
[INFO] Tycho .............................................. SUCCESS [  0.241 s]
[INFO] Tycho OSGi Bundles Parent .......................... SUCCESS [  0.008 s]
[INFO] Tycho OSGi Bundles Target Platform ................. SUCCESS [  0.137 s]
[INFO] Tycho Noop Equinox password provider ............... SUCCESS [  4.805 s]
[INFO] Repository with p2 Director Bundles ................ SUCCESS [  2.408 s]
[INFO] Tycho Embedder API Maven/OSGi Shared Classes ....... SUCCESS [  0.233 s]
[INFO] Tycho Core Maven/OSGi Shared Classes ............... SUCCESS [  0.481 s]
[INFO] Tycho p2 Resolver Maven/OSGi Shared Classes ........ SUCCESS [  0.277 s]
[INFO] Tycho p2 Tools Maven/OSGi Shared Classes ........... SUCCESS [  0.240 s]
[INFO] Tycho Maven/p2 Repository Integration .............. SUCCESS [  1.147 s]
[INFO] Tycho p2 Resolver Bundle ........................... SUCCESS [  0.817 s]
[INFO] Tycho p2 Tools Bundle .............................. SUCCESS [  0.313 s]
[INFO] Tycho Core Maven/OSGi Shared Classes Tests ......... SUCCESS [  0.168 s]
[INFO] Tycho Test Utilities ............................... SUCCESS [  0.346 s]
[INFO] Tycho p2 Resolver Bundle Tests ..................... SUCCESS [  0.684 s]
[INFO] Tycho p2 Resolver Maven/OSGi Shared Classes Tests .. SUCCESS [  0.107 s]
[INFO] Tycho Maven/p2 Repository Integration Tests ........ SUCCESS [  0.396 s]
[INFO] Tycho p2 Tools Tests ............................... SUCCESS [  0.242 s]
[INFO] Tycho OSGi Runtime External Bundles ................ SUCCESS [  0.215 s]
[INFO] Sisu Equinox/Plexus bridge ......................... SUCCESS [  0.005 s]
[INFO] Sisu Equinox Services API .......................... SUCCESS [  1.544 s]
[INFO] Sisu Equinox Embedder .............................. SUCCESS [  0.641 s]
[INFO] Tycho Eclipse Project Metadata Model ............... SUCCESS [  0.545 s]
[INFO] Tycho Embedder API ................................. SUCCESS [  0.261 s]
[INFO] Tycho Testing Harness .............................. SUCCESS [  0.475 s]
[INFO] Tycho Core ......................................... SUCCESS [  2.439 s]
[INFO] Sisu Equinox Launching ............................. SUCCESS [  0.470 s]
[INFO] Tycho JVM Library Detector ......................... SUCCESS [  0.969 s]
[INFO] Tycho JDT Compiler Component ....................... SUCCESS [  0.386 s]
[INFO] Tycho OSGi Compiler Plugin ......................... SUCCESS [  1.584 s]
[INFO] Tycho OSGi Packaging Plugin ........................ SUCCESS [  7.655 s]
[INFO] Tycho p2 Tools Parent .............................. SUCCESS [  0.004 s]
[INFO] Tycho p2 Resolver Component ........................ SUCCESS [  2.179 s]
[INFO] Tycho OSGi Source Plugin ........................... SUCCESS [  0.901 s]
[INFO] Tycho Target Platform Configuration Plugin ......... SUCCESS [  0.347 s]
[INFO] Tycho Maven Build Extension ........................ SUCCESS [  0.311 s]
[INFO] Tycho POM Generator Plugin ......................... SUCCESS [  0.516 s]
[INFO] Tycho Surefire OSGi Booter Eclipse Application ..... SUCCESS [  0.592 s]
[INFO] Tycho Surefire Parent .............................. SUCCESS [  0.004 s]
[INFO] Tycho Surefire OSGi JUnit 3 Runner ................. SUCCESS [  0.891 s]
[INFO] Tycho Surefire OSGi JUnit 4 Runner ................. SUCCESS [  0.173 s]
[INFO] Tycho Surefire OSGi JUnit 4.7 Runner ............... SUCCESS [  0.306 s]
[INFO] Tycho Surefire OSGi JUnit 5 Runner ................. SUCCESS [  0.517 s]
[INFO] Tycho Surefire OSGi TestNG Runner .................. SUCCESS [  0.189 s]
[INFO] Tycho Surefire Plugin .............................. SUCCESS [  2.266 s]
[INFO] Tycho Release Parent ............................... SUCCESS [  0.004 s]
[INFO] Tycho Versions Plugin .............................. SUCCESS [  0.901 s]
[INFO] Tycho p2 Director Plugin ........................... SUCCESS [  0.875 s]
[INFO] Tycho Artifactor Comparator Plugin ................. SUCCESS [  0.304 s]
[INFO] Tycho p2 Metadata Plugin ........................... SUCCESS [  0.555 s]
[INFO] Tycho p2 Publisher Plugin .......................... SUCCESS [  0.795 s]
[INFO] Tycho p2 Repository Plugin ......................... SUCCESS [  0.489 s]
[INFO] Tycho Extras ....................................... SUCCESS [  0.004 s]
[INFO] Tycho p2 Extras Plugin ............................. SUCCESS [  0.977 s]
[INFO] Tycho Document Bundle Plugin ....................... SUCCESS [  0.590 s]
[INFO] Tycho Version Bump Plugin .......................... SUCCESS [  0.404 s]
[INFO] Tycho Source Feature Generation Plugin ............. SUCCESS [  0.773 s]
[INFO] Tycho Custom Bundle Plugin ......................... SUCCESS [  0.399 s]
[INFO] Tycho Eclipserun Plugin ............................ SUCCESS [  0.548 s]
[INFO] Tycho Pack200 Archive Plugins ...................... SUCCESS [  0.004 s]
[INFO] Tycho Pack200 Archive Format Plugin ................ SUCCESS [  0.108 s]
[INFO] Tycho Pack200 Normalization Plugin ................. SUCCESS [  0.173 s]
[INFO] Tycho Pack200 Pack Plugin .......................... SUCCESS [  0.156 s]
[INFO] Tycho Pack200 Integration Tests .................... SUCCESS [  0.030 s]
[INFO] Tycho JGit Build Timestamp Provider Plugin ......... SUCCESS [  0.220 s]
[INFO] Tycho JGit Source Reference Provider Plugin ........ SUCCESS [  0.163 s]
[INFO] Tycho Target Platform Validation Plugin ............ SUCCESS [  0.448 s]
[INFO] Tycho POM-less build extension ..................... SUCCESS [  0.361 s]
[INFO] Tycho Dependency Tools Plugin ...................... SUCCESS [  0.387 s]
[INFO] ------------------------------------------------------------------------
[INFO] BUILD SUCCESS
[INFO] ------------------------------------------------------------------------
[INFO] Total time:  56.820 s
[INFO] Finished at: 2019-11-12T09:42:42-05:00
[INFO] ------------------------------------------------------------------------
[workspace] $ /shared/common/apache-maven-latest/bin/mvn -Dmaven.test.failure.ignore=true -Dmaven.test.error.ignore=true -Dmaven.repo.local=/home/hudson/genie.tycho/.jenkins/jobs/tycho-nightly/workspace/.repository clean test -U -Pits -pl tycho-its,tycho-extras/tycho-extras-its -fae
Picked up JAVA_TOOL_OPTIONS: -Xmx2G -Djava.io.tmpdir=/tmp/genie.tycho -DforkCount=1
[INFO] Scanning for projects...
[INFO] ------------------------------------------------------------------------
[INFO] Reactor Build Order:
[INFO] 
[INFO] Tycho Extras Integration Tests                                     [jar]
[INFO] Tycho Integration Tests                                            [jar]
[INFO] 
[INFO] -------------< org.eclipse.tycho.extras:tycho-extras-its >--------------
[INFO] Building Tycho Extras Integration Tests 1.6.0-SNAPSHOT             [1/2]
[INFO] --------------------------------[ jar ]---------------------------------
[INFO] 
[INFO] --- maven-clean-plugin:3.1.0:clean (default-clean) @ tycho-extras-its ---
[INFO] Deleting /jobs/genie.tycho/tycho-nightly/workspace/tycho-extras/tycho-extras-its/target
[INFO] 
[INFO] --- maven-dependency-plugin:3.1.1:unpack-dependencies (unpack-maven) @ tycho-extras-its ---
[INFO] Unpacking /home/hudson/genie.tycho/.jenkins/jobs/tycho-nightly/workspace/.repository/org/apache/maven/apache-maven/3.3.3/apache-maven-3.3.3-bin.tar.gz to /jobs/genie.tycho/tycho-nightly/workspace/tycho-extras/tycho-extras-its/target with includes "" and excludes ""
[INFO] Expanding: /home/hudson/genie.tycho/.jenkins/jobs/tycho-nightly/workspace/.repository/org/apache/maven/apache-maven/3.3.3/apache-maven-3.3.3-bin.tar.gz into /jobs/genie.tycho/tycho-nightly/workspace/tycho-extras/tycho-extras-its/target
[INFO] 
[INFO] --- maven-resources-plugin:3.1.0:resources (default-resources) @ tycho-extras-its ---
[INFO] Using 'UTF-8' encoding to copy filtered resources.
[INFO] skip non existing resourceDirectory /jobs/genie.tycho/tycho-nightly/workspace/tycho-extras/tycho-extras-its/src/main/resources
[INFO] 
[INFO] --- maven-compiler-plugin:3.8.1:compile (default-compile) @ tycho-extras-its ---
[INFO] No sources to compile
[INFO] 
[INFO] --- maven-resources-plugin:3.1.0:testResources (default-testResources) @ tycho-extras-its ---
[INFO] Using 'UTF-8' encoding to copy filtered resources.
[INFO] Copying 31 resources
[INFO] Copying 28 resources
[INFO] 
[INFO] --- maven-compiler-plugin:3.8.1:testCompile (default-testCompile) @ tycho-extras-its ---
[INFO] Changes detected - recompiling the module!
[INFO] Compiling 5 source files to /jobs/genie.tycho/tycho-nightly/workspace/tycho-extras/tycho-extras-its/target/test-classes
[INFO] 
[INFO] --- tycho-p2-extras-plugin:1.6.0-SNAPSHOT:mirror (mirror-kepler-test-repo) @ tycho-extras-its ---
[INFO] 
[INFO] --------------------< org.eclipse.tycho:tycho-its >---------------------
[INFO] Building Tycho Integration Tests 1.6.0-SNAPSHOT                    [2/2]
[INFO] --------------------------------[ jar ]---------------------------------
[INFO] 
[INFO] --- maven-clean-plugin:3.1.0:clean (default-clean) @ tycho-its ---
[INFO] Deleting /jobs/genie.tycho/tycho-nightly/workspace/tycho-its/target
[INFO] 
[INFO] --- maven-dependency-plugin:3.1.1:unpack-dependencies (unpack-maven) @ tycho-its ---
[INFO] Unpacking /home/hudson/genie.tycho/.jenkins/jobs/tycho-nightly/workspace/.repository/org/apache/maven/apache-maven/3.1.0/apache-maven-3.1.0-bin.tar.gz to /jobs/genie.tycho/tycho-nightly/workspace/tycho-its/target with includes "" and excludes ""
[INFO] Expanding: /home/hudson/genie.tycho/.jenkins/jobs/tycho-nightly/workspace/.repository/org/apache/maven/apache-maven/3.1.0/apache-maven-3.1.0-bin.tar.gz into /jobs/genie.tycho/tycho-nightly/workspace/tycho-its/target
[INFO] 
[INFO] --- maven-dependency-plugin:3.1.1:unpack (unpack-eclipse-sdk) @ tycho-its ---
[INFO] Configured Artifact: org.eclipse.tycho.ci:eclipse-SDK:win32:3.6.2:zip
Downloading from eclipse.maven.central.mirror: https://repo.eclipse.org/content/repositories/maven_central/org/eclipse/tycho/ci/eclipse-SDK/3.6.2/eclipse-SDK-3.6.2.pom
[WARNING] The POM for org.eclipse.tycho.ci:eclipse-SDK:zip:win32:3.6.2 is missing, no dependency information available
[INFO] Configured Artifact: org.eclipse.tycho.ci:eclipse-delta-pack:3.6.2:zip
Downloading from eclipse.maven.central.mirror: https://repo.eclipse.org/content/repositories/maven_central/org/eclipse/tycho/ci/eclipse-delta-pack/3.6.2/eclipse-delta-pack-3.6.2.pom
[WARNING] The POM for org.eclipse.tycho.ci:eclipse-delta-pack:zip:3.6.2 is missing, no dependency information available
[INFO] Unpacking /home/hudson/genie.tycho/.jenkins/jobs/tycho-nightly/workspace/.repository/org/eclipse/tycho/ci/eclipse-SDK/3.6.2/eclipse-SDK-3.6.2-win32.zip to /home/hudson/genie.tycho/.jenkins/jobs/tycho-nightly/workspace/tmp/tycho-ci/win32/3.6.2 with includes "" and excludes ""
[INFO] Unpacking /home/hudson/genie.tycho/.jenkins/jobs/tycho-nightly/workspace/.repository/org/eclipse/tycho/ci/eclipse-delta-pack/3.6.2/eclipse-delta-pack-3.6.2.zip to /home/hudson/genie.tycho/.jenkins/jobs/tycho-nightly/workspace/tmp/tycho-ci/win32/3.6.2 with includes "" and excludes ""
[INFO] 
[INFO] --- maven-resources-plugin:3.1.0:resources (default-resources) @ tycho-its ---
[INFO] Using 'UTF-8' encoding to copy filtered resources.
[INFO] skip non existing resourceDirectory /jobs/genie.tycho/tycho-nightly/workspace/tycho-its/src/main/resources
[INFO] 
[INFO] --- maven-compiler-plugin:3.8.1:compile (default-compile) @ tycho-its ---
[INFO] No sources to compile
[INFO] 
[INFO] --- maven-resources-plugin:3.1.0:testResources (default-testResources) @ tycho-its ---
[INFO] Using 'UTF-8' encoding to copy filtered resources.
[INFO] Copying 1 resource
[INFO] 
[INFO] --- maven-properties-plugin:0.0.2:filter-file (default) @ tycho-its ---
[INFO] 
[INFO] --- maven-compiler-plugin:3.8.1:testCompile (default-testCompile) @ tycho-its ---
[INFO] Changes detected - recompiling the module!
[INFO] Compiling 132 source files to /jobs/genie.tycho/tycho-nightly/workspace/tycho-its/target/test-classes
[INFO] /jobs/genie.tycho/tycho-nightly/workspace/tycho-its/src/test/java/org/eclipse/tycho/test/util/TargetDefinitionUtil.java: Some input files use or override a deprecated API.
[INFO] /jobs/genie.tycho/tycho-nightly/workspace/tycho-its/src/test/java/org/eclipse/tycho/test/util/TargetDefinitionUtil.java: Recompile with -Xlint:deprecation for details.
[INFO] 
[INFO] --- tycho-p2-extras-plugin:1.5.1:mirror (mirror-kepler-test-repo) @ tycho-its ---
Downloading from eclipse.maven.central.mirror: https://repo.eclipse.org/content/repositories/maven_central/org/eclipse/platform/org.eclipse.osgi/maven-metadata.xml
Downloading from tycho-snapshots: https://repo.eclipse.org/content/repositories/tycho-snapshots/org/eclipse/platform/org.eclipse.osgi/maven-metadata.xml
Progress (1): 675 B
                   
Downloaded from eclipse.maven.central.mirror: https://repo.eclipse.org/content/repositories/maven_central/org/eclipse/platform/org.eclipse.osgi/maven-metadata.xml (675 B at 12 kB/s)
[INFO] Mirroring to /jobs/genie.tycho/tycho-nightly/workspace/tycho-its/repositories/kepler...
Nov 12, 2019 9:43:06 AM org.apache.http.impl.execchain.RetryExec execute
INFO: I/O exception (org.apache.http.NoHttpResponseException) caught when processing request to {}->http://download.eclipse.org:80: The target server failed to respond
Nov 12, 2019 9:43:06 AM org.apache.http.impl.execchain.RetryExec execute
INFO: Retrying request to {}->http://download.eclipse.org:80
Mirroring: osgi.bundle,org.eclipse.core.contenttype,3.4.200.v20130326-1255 (Descriptor: canonical: osgi.bundle,org.eclipse.core.contenttype,3.4.200.v20130326-1255)
Mirroring: osgi.bundle,org.apache.felix.gogo.runtime,0.10.0.v201209301036 (Descriptor: canonical: osgi.bundle,org.apache.felix.gogo.runtime,0.10.0.v201209301036)
Mirroring: osgi.bundle,org.eclipse.equinox.launcher,1.3.0.v20130327-1440 (Descriptor: canonical: osgi.bundle,org.eclipse.equinox.launcher,1.3.0.v20130327-1440)
Mirroring: osgi.bundle,org.eclipse.equinox.registry,3.5.301.v20130717-1549 (Descriptor: canonical: osgi.bundle,org.eclipse.equinox.registry,3.5.301.v20130717-1549)
Mirroring: osgi.bundle,org.eclipse.equinox.log,1.2.300.v20130327-1442 (Descriptor: canonical: osgi.bundle,org.eclipse.equinox.log,1.2.300.v20130327-1442)
Mirroring: osgi.bundle,org.apache.felix.gogo.command,0.10.0.v201209301215 (Descriptor: canonical: osgi.bundle,org.apache.felix.gogo.command,0.10.0.v201209301215)
Mirroring: osgi.bundle,org.eclipse.core.runtime,3.9.100.v20131218-1515 (Descriptor: canonical: osgi.bundle,org.eclipse.core.runtime,3.9.100.v20131218-1515)
Mirroring: osgi.bundle,org.eclipse.equinox.launcher.win32.win32.x86_64,1.1.200.v20140116-2212 (Descriptor: canonical: osgi.bundle,org.eclipse.equinox.launcher.win32.win32.x86_64,1.1.200.v20140116-2212)
Mirroring: osgi.bundle,org.eclipse.equinox.preferences,3.5.100.v20130422-1538 (Descriptor: canonical: osgi.bundle,org.eclipse.equinox.preferences,3.5.100.v20130422-1538)
Mirroring: osgi.bundle,org.eclipse.osgi.services,3.3.100.v20130513-1956 (Descriptor: canonical: osgi.bundle,org.eclipse.osgi.services,3.3.100.v20130513-1956)
Mirroring: osgi.bundle,org.eclipse.core.jobs,3.5.300.v20130429-1813 (Descriptor: canonical: osgi.bundle,org.eclipse.core.jobs,3.5.300.v20130429-1813)
Mirroring: osgi.bundle,org.eclipse.equinox.supplement,1.5.0.v20130812-2109 (Descriptor: canonical: osgi.bundle,org.eclipse.equinox.supplement,1.5.0.v20130812-2109)
Mirroring: osgi.bundle,org.eclipse.osgi,3.9.1.v20140110-1610 (Descriptor: canonical: osgi.bundle,org.eclipse.osgi,3.9.1.v20140110-1610)
Mirroring: osgi.bundle,org.eclipse.equinox.app,1.3.100.v20130327-1442 (Descriptor: canonical: osgi.bundle,org.eclipse.equinox.app,1.3.100.v20130327-1442)
Mirroring: osgi.bundle,org.junit,4.11.0.v201303080030 (Descriptor: canonical: osgi.bundle,org.junit,4.11.0.v201303080030)
Mirroring: binary,org.eclipse.equinox.executable_root.win32.win32.x86_64,3.6.0.v20140117-1004 (Descriptor: canonical: binary,org.eclipse.equinox.executable_root.win32.win32.x86_64,3.6.0.v20140117-1004)
Mirroring: osgi.bundle,org.hamcrest.core,1.3.0.v201303031735 (Descriptor: canonical: osgi.bundle,org.hamcrest.core,1.3.0.v201303031735)
Mirroring: org.eclipse.update.feature,org.eclipse.equinox.executable,3.6.0.v20140117-1004 (Descriptor: canonical: org.eclipse.update.feature,org.eclipse.equinox.executable,3.6.0.v20140117-1004)
Mirroring: osgi.bundle,javax.xml,1.3.4.v201005080400 (Descriptor: canonical: osgi.bundle,javax.xml,1.3.4.v201005080400)
Mirroring: osgi.bundle,org.eclipse.equinox.common,3.6.200.v20130402-1505 (Descriptor: canonical: osgi.bundle,org.eclipse.equinox.common,3.6.200.v20130402-1505)
Mirroring: osgi.bundle,osgi.enterprise,4.2.0.v201108120515 (Descriptor: canonical: osgi.bundle,osgi.enterprise,4.2.0.v201108120515)
[WARNING] Mirror tool: Messages while mirroring artifact descriptors.: [Artifact: canonical: osgi.bundle,org.eclipse.core.contenttype,3.4.200.v20130326-1255 already exists in repository: file:/jobs/genie.tycho/tycho-nightly/workspace/tycho-its/repositories/kepler/.; Artifact: canonical: osgi.bundle,org.apache.felix.gogo.runtime,0.10.0.v201209301036 already exists in repository: file:/jobs/genie.tycho/tycho-nightly/workspace/tycho-its/repositories/kepler/.; Artifact: canonical: osgi.bundle,org.eclipse.equinox.launcher,1.3.0.v20130327-1440 already exists in repository: file:/jobs/genie.tycho/tycho-nightly/workspace/tycho-its/repositories/kepler/.; Artifact: canonical: osgi.bundle,org.eclipse.equinox.registry,3.5.301.v20130717-1549 already exists in repository: file:/jobs/genie.tycho/tycho-nightly/workspace/tycho-its/repositories/kepler/.; Artifact: canonical: osgi.bundle,org.eclipse.equinox.log,1.2.300.v20130327-1442 already exists in repository: file:/jobs/genie.tycho/tycho-nightly/workspace/tycho-its/repositories/kepler/.; Artifact: canonical: osgi.bundle,org.apache.felix.gogo.command,0.10.0.v201209301215 already exists in repository: file:/jobs/genie.tycho/tycho-nightly/workspace/tycho-its/repositories/kepler/.; Artifact: canonical: osgi.bundle,org.eclipse.core.runtime,3.9.100.v20131218-1515 already exists in repository: file:/jobs/genie.tycho/tycho-nightly/workspace/tycho-its/repositories/kepler/.; Artifact: canonical: osgi.bundle,org.eclipse.equinox.launcher.win32.win32.x86_64,1.1.200.v20140116-2212 already exists in repository: file:/jobs/genie.tycho/tycho-nightly/workspace/tycho-its/repositories/kepler/.; Artifact: canonical: osgi.bundle,org.eclipse.equinox.preferences,3.5.100.v20130422-1538 already exists in repository: file:/jobs/genie.tycho/tycho-nightly/workspace/tycho-its/repositories/kepler/.; Artifact: canonical: osgi.bundle,org.eclipse.osgi.services,3.3.100.v20130513-1956 already exists in repository: file:/jobs/genie.tycho/tycho-nightly/workspace/tycho-its/repositories/kepler/.; Artifact: canonical: osgi.bundle,org.eclipse.core.jobs,3.5.300.v20130429-1813 already exists in repository: file:/jobs/genie.tycho/tycho-nightly/workspace/tycho-its/repositories/kepler/.; Artifact: canonical: osgi.bundle,org.eclipse.equinox.supplement,1.5.0.v20130812-2109 already exists in repository: file:/jobs/genie.tycho/tycho-nightly/workspace/tycho-its/repositories/kepler/.; Artifact: canonical: osgi.bundle,org.eclipse.osgi,3.9.1.v20140110-1610 already exists in repository: file:/jobs/genie.tycho/tycho-nightly/workspace/tycho-its/repositories/kepler/.; Artifact: canonical: osgi.bundle,org.eclipse.equinox.app,1.3.100.v20130327-1442 already exists in repository: file:/jobs/genie.tycho/tycho-nightly/workspace/tycho-its/repositories/kepler/.; Artifact: canonical: osgi.bundle,org.junit,4.11.0.v201303080030 already exists in repository: file:/jobs/genie.tycho/tycho-nightly/workspace/tycho-its/repositories/kepler/.; Artifact: canonical: binary,org.eclipse.equinox.executable_root.win32.win32.x86_64,3.6.0.v20140117-1004 already exists in repository: file:/jobs/genie.tycho/tycho-nightly/workspace/tycho-its/repositories/kepler/.; Artifact: canonical: osgi.bundle,org.hamcrest.core,1.3.0.v201303031735 already exists in repository: file:/jobs/genie.tycho/tycho-nightly/workspace/tycho-its/repositories/kepler/.; Artifact: canonical: org.eclipse.update.feature,org.eclipse.equinox.executable,3.6.0.v20140117-1004 already exists in repository: file:/jobs/genie.tycho/tycho-nightly/workspace/tycho-its/repositories/kepler/.; Artifact: canonical: osgi.bundle,javax.xml,1.3.4.v201005080400 already exists in repository: file:/jobs/genie.tycho/tycho-nightly/workspace/tycho-its/repositories/kepler/.; Artifact: canonical: osgi.bundle,org.eclipse.equinox.common,3.6.200.v20130402-1505 already exists in repository: file:/jobs/genie.tycho/tycho-nightly/workspace/tycho-its/repositories/kepler/.; Artifact: canonical: osgi.bundle,osgi.enterprise,4.2.0.v201108120515 already exists in repository: file:/jobs/genie.tycho/tycho-nightly/workspace/tycho-its/repositories/kepler/.]
[INFO] 
[INFO] --- tycho-p2-extras-plugin:1.5.1:mirror (mirror-oxygen-test-repo) @ tycho-its ---
[INFO] Mirroring to /jobs/genie.tycho/tycho-nightly/workspace/tycho-its/repositories/oxygen...
Mirroring: osgi.bundle,org.apache.xml.resolver,1.2.0.v201005080400 (Descriptor: canonical: osgi.bundle,org.apache.xml.resolver,1.2.0.v201005080400)
Mirroring: osgi.bundle,org.eclipse.equinox.registry,3.7.0.v20170222-1344 (Descriptor: canonical: osgi.bundle,org.eclipse.equinox.registry,3.7.0.v20170222-1344)
Mirroring: osgi.bundle,org.eclipse.core.jobs,3.9.3.v20180115-1757 (Descriptor: canonical: osgi.bundle,org.eclipse.core.jobs,3.9.3.v20180115-1757)
Mirroring: osgi.bundle,org.apache.felix.gogo.command,0.10.0.v201209301215 (Descriptor: canonical: osgi.bundle,org.apache.felix.gogo.command,0.10.0.v201209301215)
Mirroring: osgi.bundle,org.eclipse.osgi,3.12.50.v20170928-1321 (Descriptor: canonical: osgi.bundle,org.eclipse.osgi,3.12.50.v20170928-1321)
Mirroring: osgi.bundle,org.apache.xerces,2.9.0.v201101211617 (Descriptor: canonical: osgi.bundle,org.apache.xerces,2.9.0.v201101211617)
Mirroring: osgi.bundle,org.eclipse.core.runtime,3.13.0.v20170207-1030 (Descriptor: canonical: osgi.bundle,org.eclipse.core.runtime,3.13.0.v20170207-1030)
Mirroring: osgi.bundle,org.eclipse.equinox.launcher,1.4.0.v20161219-1356 (Descriptor: canonical: osgi.bundle,org.eclipse.equinox.launcher,1.4.0.v20161219-1356)
Mirroring: osgi.bundle,org.junit.platform.commons,1.0.0.v20170910-2246 (Descriptor: canonical: osgi.bundle,org.junit.platform.commons,1.0.0.v20170910-2246)
Mirroring: osgi.bundle,org.hamcrest.core,1.3.0.v201303031735 (Descriptor: canonical: osgi.bundle,org.hamcrest.core,1.3.0.v201303031735)
Mirroring: osgi.bundle,org.eclipse.equinox.common,3.9.0.v20170207-1454 (Descriptor: canonical: osgi.bundle,org.eclipse.equinox.common,3.9.0.v20170207-1454)
Mirroring: osgi.bundle,org.apache.xml.serializer,2.7.1.v201005080400 (Descriptor: canonical: osgi.bundle,org.apache.xml.serializer,2.7.1.v201005080400)
Mirroring: osgi.bundle,osgi.enterprise,4.2.0.v201108120515 (Descriptor: canonical: osgi.bundle,osgi.enterprise,4.2.0.v201108120515)
Mirroring: osgi.bundle,org.apache.felix.gogo.runtime,0.10.0.v201209301036 (Descriptor: canonical: osgi.bundle,org.apache.felix.gogo.runtime,0.10.0.v201209301036)
Mirroring: osgi.bundle,org.junit.jupiter.api,5.0.0.v20170910-2246 (Descriptor: canonical: osgi.bundle,org.junit.jupiter.api,5.0.0.v20170910-2246)
Mirroring: osgi.bundle,org.eclipse.equinox.preferences,3.7.0.v20170126-2132 (Descriptor: canonical: osgi.bundle,org.eclipse.equinox.preferences,3.7.0.v20170126-2132)
Mirroring: osgi.bundle,org.junit,4.12.0.v201504281640 (Descriptor: canonical: osgi.bundle,org.junit,4.12.0.v201504281640)
Mirroring: osgi.bundle,org.eclipse.equinox.app,1.3.400.v20150715-1528 (Descriptor: canonical: osgi.bundle,org.eclipse.equinox.app,1.3.400.v20150715-1528)
Mirroring: osgi.bundle,org.eclipse.pde.ds.lib,1.1.0.v20170303-1624 (Descriptor: canonical: osgi.bundle,org.eclipse.pde.ds.lib,1.1.0.v20170303-1624)
Mirroring: osgi.bundle,org.opentest4j,1.0.0.v20170910-2246 (Descriptor: canonical: osgi.bundle,org.opentest4j,1.0.0.v20170910-2246)
Mirroring: osgi.bundle,org.eclipse.core.jobs,3.9.2.v20171030-1027 (Descriptor: canonical: osgi.bundle,org.eclipse.core.jobs,3.9.2.v20171030-1027)
Mirroring: osgi.bundle,org.eclipse.equinox.supplement,1.7.0.v20170329-1416 (Descriptor: canonical: osgi.bundle,org.eclipse.equinox.supplement,1.7.0.v20170329-1416)
Mirroring: osgi.bundle,org.eclipse.osgi,3.12.100.v20180210-1608 (Descriptor: canonical: osgi.bundle,org.eclipse.osgi,3.12.100.v20180210-1608)
Mirroring: osgi.bundle,org.eclipse.core.contenttype,3.6.0.v20170207-1037 (Descriptor: canonical: osgi.bundle,org.eclipse.core.contenttype,3.6.0.v20170207-1037)
Mirroring: osgi.bundle,org.eclipse.osgi.util,3.4.0.v20170111-1608 (Descriptor: canonical: osgi.bundle,org.eclipse.osgi.util,3.4.0.v20170111-1608)
Mirroring: osgi.bundle,org.eclipse.osgi.services,3.6.0.v20170228-1906 (Descriptor: canonical: osgi.bundle,org.eclipse.osgi.services,3.6.0.v20170228-1906)
Mirroring: osgi.bundle,org.apiguardian,1.0.0.v20170910-2246 (Descriptor: canonical: osgi.bundle,org.apiguardian,1.0.0.v20170910-2246)
Mirroring: osgi.bundle,javax.xml,1.3.4.v201005080400 (Descriptor: canonical: osgi.bundle,javax.xml,1.3.4.v201005080400)
[WARNING] Mirror tool: Messages while mirroring artifact descriptors.: [Artifact: canonical: osgi.bundle,org.apache.xml.resolver,1.2.0.v201005080400 already exists in repository: file:/jobs/genie.tycho/tycho-nightly/workspace/tycho-its/repositories/oxygen/.; Artifact: canonical: osgi.bundle,org.eclipse.equinox.registry,3.7.0.v20170222-1344 already exists in repository: file:/jobs/genie.tycho/tycho-nightly/workspace/tycho-its/repositories/oxygen/.; Artifact: canonical: osgi.bundle,org.eclipse.core.jobs,3.9.3.v20180115-1757 already exists in repository: file:/jobs/genie.tycho/tycho-nightly/workspace/tycho-its/repositories/oxygen/.; Artifact: canonical: osgi.bundle,org.apache.felix.gogo.command,0.10.0.v201209301215 already exists in repository: file:/jobs/genie.tycho/tycho-nightly/workspace/tycho-its/repositories/oxygen/.; Artifact: canonical: osgi.bundle,org.eclipse.osgi,3.12.50.v20170928-1321 already exists in repository: file:/jobs/genie.tycho/tycho-nightly/workspace/tycho-its/repositories/oxygen/.; Artifact: canonical: osgi.bundle,org.apache.xerces,2.9.0.v201101211617 already exists in repository: file:/jobs/genie.tycho/tycho-nightly/workspace/tycho-its/repositories/oxygen/.; Artifact: canonical: osgi.bundle,org.eclipse.core.runtime,3.13.0.v20170207-1030 already exists in repository: file:/jobs/genie.tycho/tycho-nightly/workspace/tycho-its/repositories/oxygen/.; Artifact: canonical: osgi.bundle,org.eclipse.equinox.launcher,1.4.0.v20161219-1356 already exists in repository: file:/jobs/genie.tycho/tycho-nightly/workspace/tycho-its/repositories/oxygen/.; Artifact: canonical: osgi.bundle,org.junit.platform.commons,1.0.0.v20170910-2246 already exists in repository: file:/jobs/genie.tycho/tycho-nightly/workspace/tycho-its/repositories/oxygen/.; Artifact: canonical: osgi.bundle,org.hamcrest.core,1.3.0.v201303031735 already exists in repository: file:/jobs/genie.tycho/tycho-nightly/workspace/tycho-its/repositories/oxygen/.; Artifact: canonical: osgi.bundle,org.eclipse.equinox.common,3.9.0.v20170207-1454 already exists in repository: file:/jobs/genie.tycho/tycho-nightly/workspace/tycho-its/repositories/oxygen/.; Artifact: canonical: osgi.bundle,org.apache.xml.serializer,2.7.1.v201005080400 already exists in repository: file:/jobs/genie.tycho/tycho-nightly/workspace/tycho-its/repositories/oxygen/.; Artifact: canonical: osgi.bundle,osgi.enterprise,4.2.0.v201108120515 already exists in repository: file:/jobs/genie.tycho/tycho-nightly/workspace/tycho-its/repositories/oxygen/.; Artifact: canonical: osgi.bundle,org.apache.felix.gogo.runtime,0.10.0.v201209301036 already exists in repository: file:/jobs/genie.tycho/tycho-nightly/workspace/tycho-its/repositories/oxygen/.; Artifact: canonical: osgi.bundle,org.junit.jupiter.api,5.0.0.v20170910-2246 already exists in repository: file:/jobs/genie.tycho/tycho-nightly/workspace/tycho-its/repositories/oxygen/.; Artifact: canonical: osgi.bundle,org.eclipse.equinox.preferences,3.7.0.v20170126-2132 already exists in repository: file:/jobs/genie.tycho/tycho-nightly/workspace/tycho-its/repositories/oxygen/.; Artifact: canonical: osgi.bundle,org.junit,4.12.0.v201504281640 already exists in repository: file:/jobs/genie.tycho/tycho-nightly/workspace/tycho-its/repositories/oxygen/.; Artifact: canonical: osgi.bundle,org.eclipse.equinox.app,1.3.400.v20150715-1528 already exists in repository: file:/jobs/genie.tycho/tycho-nightly/workspace/tycho-its/repositories/oxygen/.; Artifact: canonical: osgi.bundle,org.eclipse.pde.ds.lib,1.1.0.v20170303-1624 already exists in repository: file:/jobs/genie.tycho/tycho-nightly/workspace/tycho-its/repositories/oxygen/.; Artifact: canonical: osgi.bundle,org.opentest4j,1.0.0.v20170910-2246 already exists in repository: file:/jobs/genie.tycho/tycho-nightly/workspace/tycho-its/repositories/oxygen/.; Artifact: canonical: osgi.bundle,org.eclipse.core.jobs,3.9.2.v20171030-1027 already exists in repository: file:/jobs/genie.tycho/tycho-nightly/workspace/tycho-its/repositories/oxygen/.; Artifact: canonical: osgi.bundle,org.eclipse.equinox.supplement,1.7.0.v20170329-1416 already exists in repository: file:/jobs/genie.tycho/tycho-nightly/workspace/tycho-its/repositories/oxygen/.; Artifact: canonical: osgi.bundle,org.eclipse.osgi,3.12.100.v20180210-1608 already exists in repository: file:/jobs/genie.tycho/tycho-nightly/workspace/tycho-its/repositories/oxygen/.; Artifact: canonical: osgi.bundle,org.eclipse.core.contenttype,3.6.0.v20170207-1037 already exists in repository: file:/jobs/genie.tycho/tycho-nightly/workspace/tycho-its/repositories/oxygen/.; Artifact: canonical: osgi.bundle,org.eclipse.osgi.util,3.4.0.v20170111-1608 already exists in repository: file:/jobs/genie.tycho/tycho-nightly/workspace/tycho-its/repositories/oxygen/.; Artifact: canonical: osgi.bundle,org.eclipse.osgi.services,3.6.0.v20170228-1906 already exists in repository: file:/jobs/genie.tycho/tycho-nightly/workspace/tycho-its/repositories/oxygen/.; Artifact: canonical: osgi.bundle,org.apiguardian,1.0.0.v20170910-2246 already exists in repository: file:/jobs/genie.tycho/tycho-nightly/workspace/tycho-its/repositories/oxygen/.; Artifact: canonical: osgi.bundle,javax.xml,1.3.4.v201005080400 already exists in repository: file:/jobs/genie.tycho/tycho-nightly/workspace/tycho-its/repositories/oxygen/.]
[INFO] 
[INFO] --- maven-surefire-plugin:2.22.0:test (default-test) @ tycho-its ---
[INFO] 
[INFO] -------------------------------------------------------
[INFO]  T E S T S
[INFO] -------------------------------------------------------
[INFO] Running org.eclipse.tycho.test.eeProfile.FragmentsAttachedTest
[INFO] Tests run: 1, Failures: 0, Errors: 0, Skipped: 0, Time elapsed: 8.459 s - in org.eclipse.tycho.test.eeProfile.FragmentsAttachedTest
[INFO] Running org.eclipse.tycho.test.eeProfile.Java13ResolutionTest
[INFO] Tests run: 1, Failures: 0, Errors: 0, Skipped: 0, Time elapsed: 10.451 s - in org.eclipse.tycho.test.eeProfile.Java13ResolutionTest
[INFO] Running org.eclipse.tycho.test.eeProfile.Java7ResolutionTest
[INFO] Tests run: 3, Failures: 0, Errors: 0, Skipped: 0, Time elapsed: 21.292 s - in org.eclipse.tycho.test.eeProfile.Java7ResolutionTest
[INFO] Running org.eclipse.tycho.test.eeProfile.Java12ResolutionTest
[INFO] Tests run: 1, Failures: 0, Errors: 0, Skipped: 0, Time elapsed: 10.196 s - in org.eclipse.tycho.test.eeProfile.Java12ResolutionTest
[INFO] Running org.eclipse.tycho.test.eeProfile.Java14ResolutionTest
[INFO] Tests run: 1, Failures: 0, Errors: 0, Skipped: 0, Time elapsed: 14.03 s - in org.eclipse.tycho.test.eeProfile.Java14ResolutionTest
[INFO] Running org.eclipse.tycho.test.eeProfile.Java11ResolutionTest
[INFO] Tests run: 1, Failures: 0, Errors: 0, Skipped: 0, Time elapsed: 13.625 s - in org.eclipse.tycho.test.eeProfile.Java11ResolutionTest
[INFO] Running org.eclipse.tycho.test.eeProfile.Java10ResolutionTest
[INFO] Tests run: 1, Failures: 0, Errors: 0, Skipped: 0, Time elapsed: 10.565 s - in org.eclipse.tycho.test.eeProfile.Java10ResolutionTest
[INFO] Running org.eclipse.tycho.test.eeProfile.CustomProfileIntegrationTest
[INFO] Tests run: 1, Failures: 0, Errors: 0, Skipped: 0, Time elapsed: 14.385 s - in org.eclipse.tycho.test.eeProfile.CustomProfileIntegrationTest
[INFO] Running org.eclipse.tycho.test.eeProfile.DependencyResolverEETest
[INFO] Tests run: 3, Failures: 0, Errors: 0, Skipped: 0, Time elapsed: 21.193 s - in org.eclipse.tycho.test.eeProfile.DependencyResolverEETest
[INFO] Running org.eclipse.tycho.test.packaging.BaselineValidateAndReplaceTest
[INFO] Tests run: 16, Failures: 0, Errors: 0, Skipped: 0, Time elapsed: 154.814 s - in org.eclipse.tycho.test.packaging.BaselineValidateAndReplaceTest
[INFO] Running org.eclipse.tycho.test.packaging.PackageNestedJarsAndDirsTest
[INFO] Tests run: 1, Failures: 0, Errors: 0, Skipped: 0, Time elapsed: 6.469 s - in org.eclipse.tycho.test.packaging.PackageNestedJarsAndDirsTest
[INFO] Running org.eclipse.tycho.test.packaging.RepositoryPackedArtifactsTest
[INFO] Tests run: 2, Failures: 0, Errors: 0, Skipped: 0, Time elapsed: 24.057 s - in org.eclipse.tycho.test.packaging.RepositoryPackedArtifactsTest
[INFO] Running org.eclipse.tycho.test.packaging.AttachedZipTest
[INFO] Tests run: 1, Failures: 0, Errors: 0, Skipped: 0, Time elapsed: 6.582 s - in org.eclipse.tycho.test.packaging.AttachedZipTest
[INFO] Running org.eclipse.tycho.test.packaging.DefaultBuildTimestampProviderTest
[INFO] Tests run: 1, Failures: 0, Errors: 0, Skipped: 0, Time elapsed: 6.79 s - in org.eclipse.tycho.test.packaging.DefaultBuildTimestampProviderTest
[INFO] Running org.eclipse.tycho.test.compiler.FailOnWarningTest
[INFO] Tests run: 1, Failures: 0, Errors: 0, Skipped: 0, Time elapsed: 6.345 s - in org.eclipse.tycho.test.compiler.FailOnWarningTest
[INFO] Running org.eclipse.tycho.test.compiler.MisconfigurationTest
[INFO] Tests run: 1, Failures: 0, Errors: 0, Skipped: 0, Time elapsed: 7.609 s - in org.eclipse.tycho.test.compiler.MisconfigurationTest
[INFO] Running org.eclipse.tycho.test.compiler.AnnotationProcessorTest
[INFO] Tests run: 1, Failures: 0, Errors: 0, Skipped: 0, Time elapsed: 4.421 s - in org.eclipse.tycho.test.compiler.AnnotationProcessorTest
[INFO] Running org.eclipse.tycho.test.compiler.JavaxAnnotationImportTest
[INFO] Tests run: 1, Failures: 0, Errors: 0, Skipped: 0, Time elapsed: 9.14 s - in org.eclipse.tycho.test.compiler.JavaxAnnotationImportTest
[INFO] Running org.eclipse.tycho.test.compiler.MavenCompilerPluginTest
[INFO] Tests run: 1, Failures: 0, Errors: 0, Skipped: 0, Time elapsed: 3.032 s - in org.eclipse.tycho.test.compiler.MavenCompilerPluginTest
[INFO] Running org.eclipse.tycho.test.compiler.RequireJREPackagesImportTest
[WARNING] Tests run: 1, Failures: 0, Errors: 0, Skipped: 1, Time elapsed: 0.001 s - in org.eclipse.tycho.test.compiler.RequireJREPackagesImportTest
[INFO] Running org.eclipse.tycho.test.product.ProductArchiveFormatTest
[INFO] Tests run: 1, Failures: 0, Errors: 0, Skipped: 0, Time elapsed: 12.852 s - in org.eclipse.tycho.test.product.ProductArchiveFormatTest
[INFO] Running org.eclipse.tycho.test.product.BuildProductWithoutCleanTest
[INFO] Tests run: 1, Failures: 0, Errors: 0, Skipped: 0, Time elapsed: 19.585 s - in org.eclipse.tycho.test.product.BuildProductWithoutCleanTest
[INFO] Running org.eclipse.tycho.test.product.MetaRequirementsTest
[INFO] Tests run: 1, Failures: 0, Errors: 0, Skipped: 0, Time elapsed: 27.725 s - in org.eclipse.tycho.test.product.MetaRequirementsTest
[INFO] Running org.eclipse.tycho.test.product.Tycho188P2EnabledRcpTest
[INFO] Tests run: 6, Failures: 0, Errors: 0, Skipped: 0, Time elapsed: 25.972 s - in org.eclipse.tycho.test.product.Tycho188P2EnabledRcpTest
[INFO] Running org.eclipse.tycho.test.product.ProductDuplicateIUsTest
[INFO] Tests run: 1, Failures: 0, Errors: 0, Skipped: 0, Time elapsed: 16.299 s - in org.eclipse.tycho.test.product.ProductDuplicateIUsTest
[INFO] Running org.eclipse.tycho.test.product.Tycho465RootFilesTest
[INFO] Tests run: 1, Failures: 0, Errors: 0, Skipped: 0, Time elapsed: 35.863 s - in org.eclipse.tycho.test.product.Tycho465RootFilesTest
[INFO] Running org.eclipse.tycho.test.product.ProductDefinitionCrosstalkTest
[INFO] Tests run: 1, Failures: 0, Errors: 0, Skipped: 0, Time elapsed: 10.055 s - in org.eclipse.tycho.test.product.ProductDefinitionCrosstalkTest
[INFO] Running org.eclipse.tycho.test.product.BuildProductWithIgnoredContentTest
[INFO] Tests run: 1, Failures: 0, Errors: 0, Skipped: 0, Time elapsed: 9.719 s - in org.eclipse.tycho.test.product.BuildProductWithIgnoredContentTest
[INFO] Running org.eclipse.tycho.test.product.ReferenceBetweenProductsTest
[INFO] Tests run: 1, Failures: 0, Errors: 0, Skipped: 0, Time elapsed: 13.126 s - in org.eclipse.tycho.test.product.ReferenceBetweenProductsTest
[INFO] Running org.eclipse.tycho.test.TYCHO0453expandReleaseVersion.ExpandReleaseVersionTest
[INFO] Tests run: 1, Failures: 0, Errors: 0, Skipped: 0, Time elapsed: 20.842 s - in org.eclipse.tycho.test.TYCHO0453expandReleaseVersion.ExpandReleaseVersionTest
[INFO] Running org.eclipse.tycho.test.surefire.BundleStartInSurefireTest
[INFO] Tests run: 2, Failures: 0, Errors: 0, Skipped: 0, Time elapsed: 25.212 s - in org.eclipse.tycho.test.surefire.BundleStartInSurefireTest
[INFO] Running org.eclipse.tycho.test.surefire.ExplodedTestDependenciesTest
[INFO] Tests run: 1, Failures: 0, Errors: 0, Skipped: 0, Time elapsed: 15.906 s - in org.eclipse.tycho.test.surefire.ExplodedTestDependenciesTest
[INFO] Running org.eclipse.tycho.test.surefire.ExtraTestApplicationArgumentsTest
[INFO] Tests run: 1, Failures: 0, Errors: 0, Skipped: 0, Time elapsed: 10.852 s - in org.eclipse.tycho.test.surefire.ExtraTestApplicationArgumentsTest
[INFO] Running org.eclipse.tycho.test.surefire.TwoJunitVersionsTest
[INFO] Tests run: 1, Failures: 0, Errors: 0, Skipped: 0, Time elapsed: 9.648 s - in org.eclipse.tycho.test.surefire.TwoJunitVersionsTest
[INFO] Running org.eclipse.tycho.test.surefire.TestNGBundleTest
[INFO] Tests run: 1, Failures: 0, Errors: 0, Skipped: 0, Time elapsed: 24.846 s - in org.eclipse.tycho.test.surefire.TestNGBundleTest
[INFO] Running org.eclipse.tycho.test.surefire.SystemPropertiesTest
[INFO] Tests run: 1, Failures: 0, Errors: 0, Skipped: 0, Time elapsed: 11.72 s - in org.eclipse.tycho.test.surefire.SystemPropertiesTest
[INFO] Running org.eclipse.tycho.test.surefire.DirectTestPluginInvocationTest
[INFO] Tests run: 1, Failures: 0, Errors: 0, Skipped: 0, Time elapsed: 15.27 s - in org.eclipse.tycho.test.surefire.DirectTestPluginInvocationTest
[INFO] Running org.eclipse.tycho.test.surefire.RequireBundleTest
[INFO] Tests run: 1, Failures: 0, Errors: 0, Skipped: 0, Time elapsed: 11.19 s - in org.eclipse.tycho.test.surefire.RequireBundleTest
[INFO] Running org.eclipse.tycho.test.surefire.JavaToolchainInSurefireTest
[INFO] Tests run: 1, Failures: 0, Errors: 0, Skipped: 0, Time elapsed: 12.511 s - in org.eclipse.tycho.test.surefire.JavaToolchainInSurefireTest
[INFO] Running org.eclipse.tycho.test.surefire.RunOrderTest
[INFO] Tests run: 1, Failures: 0, Errors: 0, Skipped: 0, Time elapsed: 12.725 s - in org.eclipse.tycho.test.surefire.RunOrderTest
[INFO] Running org.eclipse.tycho.test.surefire.RunSingleTestTest
[INFO] Tests run: 1, Failures: 0, Errors: 0, Skipped: 0, Time elapsed: 10.648 s - in org.eclipse.tycho.test.surefire.RunSingleTestTest
[INFO] Running org.eclipse.tycho.test.surefire.CategoriesTest
[INFO] Tests run: 1, Failures: 0, Errors: 0, Skipped: 0, Time elapsed: 9.917 s - in org.eclipse.tycho.test.surefire.CategoriesTest
[INFO] Running org.eclipse.tycho.test.surefire.FailIfNoTestsTest
[INFO] Tests run: 2, Failures: 0, Errors: 0, Skipped: 0, Time elapsed: 23.807 s - in org.eclipse.tycho.test.surefire.FailIfNoTestsTest
[INFO] Running org.eclipse.tycho.test.surefire.JUnit5Test
[INFO] Tests run: 1, Failures: 0, Errors: 0, Skipped: 0, Time elapsed: 10.251 s - in org.eclipse.tycho.test.surefire.JUnit5Test
[INFO] Running org.eclipse.tycho.test.surefire.TestFragmentTest
[INFO] Tests run: 1, Failures: 0, Errors: 0, Skipped: 0, Time elapsed: 14.258 s - in org.eclipse.tycho.test.surefire.TestFragmentTest
[INFO] Running org.eclipse.tycho.test.surefire.FrameworkExtensionsTest
[INFO] Tests run: 1, Failures: 0, Errors: 0, Skipped: 0, Time elapsed: 18.993 s - in org.eclipse.tycho.test.surefire.FrameworkExtensionsTest
[INFO] Running org.eclipse.tycho.test.surefire.TestOptionalDependenciesTest
[INFO] Tests run: 2, Failures: 0, Errors: 0, Skipped: 0, Time elapsed: 24.232 s - in org.eclipse.tycho.test.surefire.TestOptionalDependenciesTest
[INFO] Running org.eclipse.tycho.test.surefire.P2InstalledTestRuntimeTest
[INFO] Tests run: 3, Failures: 0, Errors: 0, Skipped: 0, Time elapsed: 57.992 s - in org.eclipse.tycho.test.surefire.P2InstalledTestRuntimeTest
[INFO] Running org.eclipse.tycho.test.surefire.ParallelTestExecutionTest
[INFO] Tests run: 1, Failures: 0, Errors: 0, Skipped: 0, Time elapsed: 15.101 s - in org.eclipse.tycho.test.surefire.ParallelTestExecutionTest
[INFO] Running org.eclipse.tycho.test.surefire.JVMArgsTest
[INFO] Tests run: 1, Failures: 0, Errors: 0, Skipped: 0, Time elapsed: 11.433 s - in org.eclipse.tycho.test.surefire.JVMArgsTest
[INFO] Running org.eclipse.tycho.test.surefire.Junit4TestBundleTest
[INFO] Tests run: 1, Failures: 0, Errors: 0, Skipped: 0, Time elapsed: 10.763 s - in org.eclipse.tycho.test.surefire.Junit4TestBundleTest
[INFO] Running org.eclipse.tycho.test.surefire.EnableAssertionsTest
[INFO] Tests run: 1, Failures: 0, Errors: 0, Skipped: 0, Time elapsed: 16.97 s - in org.eclipse.tycho.test.surefire.EnableAssertionsTest
[INFO] Running org.eclipse.tycho.test.surefire.EnvVarTest
[INFO] Tests run: 1, Failures: 0, Errors: 0, Skipped: 0, Time elapsed: 10.957 s - in org.eclipse.tycho.test.surefire.EnvVarTest
[INFO] Running org.eclipse.tycho.test.surefire.TestBundleShapeTest
[INFO] Tests run: 1, Failures: 0, Errors: 0, Skipped: 0, Time elapsed: 12.953 s - in org.eclipse.tycho.test.surefire.TestBundleShapeTest
[INFO] Running org.eclipse.tycho.test.featurePatch.EclipseRepoIncludingFeaturePatchTest
[INFO] Tests run: 1, Failures: 0, Errors: 0, Skipped: 0, Time elapsed: 9.729 s - in org.eclipse.tycho.test.featurePatch.EclipseRepoIncludingFeaturePatchTest
[INFO] Running org.eclipse.tycho.test.featurePatch.FeaturePatchTest
[INFO] Tests run: 1, Failures: 0, Errors: 0, Skipped: 0, Time elapsed: 6.268 s - in org.eclipse.tycho.test.featurePatch.FeaturePatchTest
[INFO] Running org.eclipse.tycho.test.pomGenerator.TYCHO45Test
[INFO] Tests run: 1, Failures: 0, Errors: 0, Skipped: 0, Time elapsed: 22.145 s - in org.eclipse.tycho.test.pomGenerator.TYCHO45Test
[INFO] Running org.eclipse.tycho.test.pomGenerator.Tycho122GeneratePomFileTest
[INFO] Tests run: 1, Failures: 0, Errors: 0, Skipped: 0, Time elapsed: 2.416 s - in org.eclipse.tycho.test.pomGenerator.Tycho122GeneratePomFileTest
[INFO] Running org.eclipse.tycho.test.tycho503.TYCHO503DoubleEncodedUrlTest
[INFO] Tests run: 1, Failures: 0, Errors: 0, Skipped: 0, Time elapsed: 14.383 s - in org.eclipse.tycho.test.tycho503.TYCHO503DoubleEncodedUrlTest
[INFO] Running org.eclipse.tycho.test.TYCHO0209tychoRepositoryRoundtrip.TychoRepositoryRoundtripTest
[INFO] Tests run: 1, Failures: 0, Errors: 0, Skipped: 0, Time elapsed: 36.72 s - in org.eclipse.tycho.test.TYCHO0209tychoRepositoryRoundtrip.TychoRepositoryRoundtripTest
[INFO] Running org.eclipse.tycho.test.p2Repository.P2RepositoryPropertiesTest
[INFO] Tests run: 1, Failures: 0, Errors: 0, Skipped: 0, Time elapsed: 11.26 s - in org.eclipse.tycho.test.p2Repository.P2RepositoryPropertiesTest
[INFO] Running org.eclipse.tycho.test.p2Repository.BasicP2RepositoryIntegrationTest
[INFO] Tests run: 6, Failures: 0, Errors: 0, Skipped: 0, Time elapsed: 12.672 s - in org.eclipse.tycho.test.p2Repository.BasicP2RepositoryIntegrationTest
[INFO] Running org.eclipse.tycho.test.p2Repository.QualifierExpansionAndArtifactAssemblyTest
[INFO] Tests run: 6, Failures: 0, Errors: 0, Skipped: 0, Time elapsed: 10.224 s - in org.eclipse.tycho.test.p2Repository.QualifierExpansionAndArtifactAssemblyTest
[INFO] Running org.eclipse.tycho.test.p2Repository.TransitiveP2RepoTest
[INFO] Tests run: 2, Failures: 0, Errors: 0, Skipped: 0, Time elapsed: 12.303 s - in org.eclipse.tycho.test.p2Repository.TransitiveP2RepoTest
[INFO] Running org.eclipse.tycho.test.p2Repository.RepoRefLocationP2RepositoryIntegrationTest
[INFO] Tests run: 1, Failures: 0, Errors: 0, Skipped: 0, Time elapsed: 11.83 s - in org.eclipse.tycho.test.p2Repository.RepoRefLocationP2RepositoryIntegrationTest
[INFO] Running org.eclipse.tycho.test.pomDependencyConsider.PomDependencyOnNonTychoArtifactTest
[INFO] Tests run: 1, Failures: 0, Errors: 0, Skipped: 0, Time elapsed: 10.004 s - in org.eclipse.tycho.test.pomDependencyConsider.PomDependencyOnNonTychoArtifactTest
[INFO] Running org.eclipse.tycho.test.pomDependencyConsider.PomDependencySystemScopedTest
[INFO] Tests run: 1, Failures: 0, Errors: 0, Skipped: 0, Time elapsed: 10.503 s - in org.eclipse.tycho.test.pomDependencyConsider.PomDependencySystemScopedTest
[INFO] Running org.eclipse.tycho.test.pomDependencyConsider.PomDependencyOnLocallyBuiltTychoArtifactTest
[INFO] Tests run: 1, Failures: 0, Errors: 0, Skipped: 0, Time elapsed: 16.873 s - in org.eclipse.tycho.test.pomDependencyConsider.PomDependencyOnLocallyBuiltTychoArtifactTest
[INFO] Running org.eclipse.tycho.test.target.PasswordProtectedP2RepositoryTest
[INFO] Tests run: 4, Failures: 0, Errors: 0, Skipped: 0, Time elapsed: 36.933 s - in org.eclipse.tycho.test.target.PasswordProtectedP2RepositoryTest
[INFO] Running org.eclipse.tycho.test.target.OfflineModeTest
[INFO] Tests run: 3, Failures: 0, Errors: 0, Skipped: 0, Time elapsed: 54.009 s - in org.eclipse.tycho.test.target.OfflineModeTest
[INFO] Running org.eclipse.tycho.test.target.TargetPlatformFilteringIntegrationTest
[INFO] Tests run: 1, Failures: 0, Errors: 0, Skipped: 0, Time elapsed: 9.282 s - in org.eclipse.tycho.test.target.TargetPlatformFilteringIntegrationTest
[INFO] Running org.eclipse.tycho.test.target.TargetRestrictionThroughTargetFilesTest
[INFO] Tests run: 2, Failures: 0, Errors: 0, Skipped: 0, Time elapsed: 20.201 s - in org.eclipse.tycho.test.target.TargetRestrictionThroughTargetFilesTest
[INFO] Running org.eclipse.tycho.test.target.TargetDefinitionPackagingTypeTest
[INFO] Tests run: 2, Failures: 0, Errors: 0, Skipped: 0, Time elapsed: 16.437 s - in org.eclipse.tycho.test.target.TargetDefinitionPackagingTypeTest
[INFO] Running org.eclipse.tycho.test.TYCHO321deployableFeature.DeployableFeatureTest
[INFO] Tests run: 1, Failures: 0, Errors: 0, Skipped: 0, Time elapsed: 11.66 s - in org.eclipse.tycho.test.TYCHO321deployableFeature.DeployableFeatureTest
[INFO] Running org.eclipse.tycho.test.tycho154.Tycho154BundleJarTest
[INFO] Tests run: 1, Failures: 0, Errors: 0, Skipped: 0, Time elapsed: 16.079 s - in org.eclipse.tycho.test.tycho154.Tycho154BundleJarTest
[INFO] Running org.eclipse.tycho.test.TYCHO309pomDependencyConsider.PomDependencyConsiderTest
[INFO] Tests run: 1, Failures: 0, Errors: 0, Skipped: 0, Time elapsed: 13.349 s - in org.eclipse.tycho.test.TYCHO309pomDependencyConsider.PomDependencyConsiderTest
[INFO] Running org.eclipse.tycho.test.TYCHO192sourceBundles.Tycho192SourceBundleTest
[INFO] Tests run: 1, Failures: 0, Errors: 0, Skipped: 0, Time elapsed: 11.239 s - in org.eclipse.tycho.test.TYCHO192sourceBundles.Tycho192SourceBundleTest
[INFO] Running org.eclipse.tycho.test.TYCHO308importSystemPackage.ImportSystemPackagesTest
[INFO] Tests run: 2, Failures: 0, Errors: 0, Skipped: 0, Time elapsed: 19.185 s - in org.eclipse.tycho.test.TYCHO308importSystemPackage.ImportSystemPackagesTest
[INFO] Running org.eclipse.tycho.test.TYCHO502sourceBundleQualifier.Tycho502SourceBundleQualifierTest
[INFO] Tests run: 1, Failures: 0, Errors: 0, Skipped: 0, Time elapsed: 13.474 s - in org.eclipse.tycho.test.TYCHO502sourceBundleQualifier.Tycho502SourceBundleQualifierTest
[INFO] Running org.eclipse.tycho.test.MNGECLIPSE949jarDirectoryBundles.JarDirectoryBundlesTest
[INFO] Tests run: 1, Failures: 0, Errors: 0, Skipped: 0, Time elapsed: 13.793 s - in org.eclipse.tycho.test.MNGECLIPSE949jarDirectoryBundles.JarDirectoryBundlesTest
[INFO] Running org.eclipse.tycho.test.limitations.NonUniqueBasedirsTest
[INFO] Tests run: 1, Failures: 0, Errors: 0, Skipped: 0, Time elapsed: 2.269 s - in org.eclipse.tycho.test.limitations.NonUniqueBasedirsTest
[INFO] Running org.eclipse.tycho.test.limitations.MixedTychoVersionsTest
[INFO] Tests run: 1, Failures: 0, Errors: 0, Skipped: 0, Time elapsed: 4.507 s - in org.eclipse.tycho.test.limitations.MixedTychoVersionsTest
[INFO] Running org.eclipse.tycho.test.TYCHO253extraClassPathEntries.ExtraClassPathEntriesTest
[INFO] Tests run: 3, Failures: 0, Errors: 0, Skipped: 0, Time elapsed: 28.138 s - in org.eclipse.tycho.test.TYCHO253extraClassPathEntries.ExtraClassPathEntriesTest
[INFO] Running org.eclipse.tycho.test.tycho98.Tycho98MultiSourcesBundleJarTest
[INFO] Tests run: 1, Failures: 0, Errors: 0, Skipped: 0, Time elapsed: 11.224 s - in org.eclipse.tycho.test.tycho98.Tycho98MultiSourcesBundleJarTest
[INFO] Running org.eclipse.tycho.test.TYCHO279HttpProxy.ProxySupportTest
[INFO] Tests run: 3, Failures: 0, Errors: 0, Skipped: 0, Time elapsed: 55.476 s - in org.eclipse.tycho.test.TYCHO279HttpProxy.ProxySupportTest
[INFO] Running org.eclipse.tycho.test.tycho026.Tycho26MissingFeatureTest
[INFO] Tests run: 1, Failures: 0, Errors: 0, Skipped: 0, Time elapsed: 3.538 s - in org.eclipse.tycho.test.tycho026.Tycho26MissingFeatureTest
[INFO] Running org.eclipse.tycho.test.iu.IUMetadataGenerationTest
[INFO] Tests run: 2, Failures: 0, Errors: 0, Skipped: 0, Time elapsed: 9.712 s - in org.eclipse.tycho.test.iu.IUMetadataGenerationTest
[INFO] Running org.eclipse.tycho.test.iu.ProductWithIUTest
[INFO] Tests run: 1, Failures: 0, Errors: 0, Skipped: 0, Time elapsed: 10.658 s - in org.eclipse.tycho.test.iu.ProductWithIUTest
[INFO] Running org.eclipse.tycho.test.sourceBundle.SourceBundlesNestedJarsTest
[INFO] Tests run: 1, Failures: 0, Errors: 0, Skipped: 0, Time elapsed: 22.139 s - in org.eclipse.tycho.test.sourceBundle.SourceBundlesNestedJarsTest
[INFO] Running org.eclipse.tycho.test.sourceBundle.AutoNoSourceBundleTest
[INFO] Tests run: 1, Failures: 0, Errors: 0, Skipped: 0, Time elapsed: 6.187 s - in org.eclipse.tycho.test.sourceBundle.AutoNoSourceBundleTest
[INFO] Running org.eclipse.tycho.test.TYCHO0294ProductP2TargetPlatformResolver.ProductP2TargetPlatformResolverTest
[INFO] Tests run: 1, Failures: 0, Errors: 0, Skipped: 0, Time elapsed: 7.149 s - in org.eclipse.tycho.test.TYCHO0294ProductP2TargetPlatformResolver.ProductP2TargetPlatformResolverTest
[INFO] Running org.eclipse.tycho.test.TYCHO0404pomDependencyConsiderExtraClasspath.PomDependencyConsiderExtraClasspathTest
[INFO] Tests run: 1, Failures: 0, Errors: 0, Skipped: 0, Time elapsed: 7.696 s - in org.eclipse.tycho.test.TYCHO0404pomDependencyConsiderExtraClasspath.PomDependencyConsiderExtraClasspathTest
[INFO] Running org.eclipse.tycho.test.TYCHO0374dirBundleShape.DirectoryBundleShapeTest
[INFO] Tests run: 1, Failures: 0, Errors: 0, Skipped: 0, Time elapsed: 13.882 s - in org.eclipse.tycho.test.TYCHO0374dirBundleShape.DirectoryBundleShapeTest
[INFO] Running org.eclipse.tycho.test.licenseFeature.SetLicenseFeatureVersionTest
[INFO] Tests run: 1, Failures: 0, Errors: 0, Skipped: 0, Time elapsed: 8.383 s - in org.eclipse.tycho.test.licenseFeature.SetLicenseFeatureVersionTest
[INFO] Running org.eclipse.tycho.test.licenseFeature.LicenseFeatureTest
[INFO] Tests run: 1, Failures: 0, Errors: 0, Skipped: 0, Time elapsed: 9.649 s - in org.eclipse.tycho.test.licenseFeature.LicenseFeatureTest
[INFO] Running org.eclipse.tycho.test.p2Inf.MultienvP2infTest
[INFO] Tests run: 1, Failures: 0, Errors: 0, Skipped: 0, Time elapsed: 12.442 s - in org.eclipse.tycho.test.p2Inf.MultienvP2infTest
[INFO] Running org.eclipse.tycho.test.p2Inf.ExtraUnitsTest
[INFO] Tests run: 1, Failures: 0, Errors: 0, Skipped: 0, Time elapsed: 6.591 s - in org.eclipse.tycho.test.p2Inf.ExtraUnitsTest
[INFO] Running org.eclipse.tycho.test.p2Inf.HostRequiresFragmentWithP2InfTest
[INFO] Tests run: 1, Failures: 0, Errors: 0, Skipped: 0, Time elapsed: 10.495 s - in org.eclipse.tycho.test.p2Inf.HostRequiresFragmentWithP2InfTest
[INFO] Running org.eclipse.tycho.test.mngeclipse937.CustomSourceEncodingTest
[INFO] Tests run: 1, Failures: 0, Errors: 0, Skipped: 0, Time elapsed: 10.972 s - in org.eclipse.tycho.test.mngeclipse937.CustomSourceEncodingTest
[INFO] Running org.eclipse.tycho.test.symlinks.SymbolicLinkTest
[INFO] Tests run: 1, Failures: 0, Errors: 0, Skipped: 0, Time elapsed: 6.687 s - in org.eclipse.tycho.test.symlinks.SymbolicLinkTest
[INFO] Running org.eclipse.tycho.test.mngeclipse1105PackageRootFiles.PackageRootFilesTest
[INFO] Tests run: 1, Failures: 0, Errors: 0, Skipped: 0, Time elapsed: 3.575 s - in org.eclipse.tycho.test.mngeclipse1105PackageRootFiles.PackageRootFilesTest
[INFO] Running org.eclipse.tycho.test.TYCHO240includeLaunchers.IncludeLaunchersTest
[INFO] Tests run: 2, Failures: 0, Errors: 0, Skipped: 0, Time elapsed: 6.635 s - in org.eclipse.tycho.test.TYCHO240includeLaunchers.IncludeLaunchersTest
[INFO] Running org.eclipse.tycho.test.TYCHO0367localRepositoryCrosstalk.LocalRepositoryCrosstalkTest
[INFO] Tests run: 1, Failures: 0, Errors: 0, Skipped: 0, Time elapsed: 21.755 s - in org.eclipse.tycho.test.TYCHO0367localRepositoryCrosstalk.LocalRepositoryCrosstalkTest
[INFO] Running org.eclipse.tycho.test.TYCHO285EclipseSourceBundles.TYCHO285EclipseSourceBundlesTest
[INFO] Tests run: 1, Failures: 0, Errors: 0, Skipped: 0, Time elapsed: 9.649 s - in org.eclipse.tycho.test.TYCHO285EclipseSourceBundles.TYCHO285EclipseSourceBundlesTest
[INFO] Running org.eclipse.tycho.test.jarsigning.JarSigningTest
[INFO] Tests run: 1, Failures: 0, Errors: 0, Skipped: 0, Time elapsed: 19.389 s - in org.eclipse.tycho.test.jarsigning.JarSigningTest
[INFO] Running org.eclipse.tycho.test.tycho001.P2MetadataGenerationTest
[INFO] Tests run: 1, Failures: 0, Errors: 0, Skipped: 0, Time elapsed: 12.036 s - in org.eclipse.tycho.test.tycho001.P2MetadataGenerationTest
[INFO] Running org.eclipse.tycho.test.TYCHO0439repositoryCategories.RepositoryCategoriesTest
[INFO] Tests run: 1, Failures: 0, Errors: 0, Skipped: 0, Time elapsed: 12.908 s - in org.eclipse.tycho.test.TYCHO0439repositoryCategories.RepositoryCategoriesTest
[INFO] Running org.eclipse.tycho.test.MissingPluginVersionsTest
[INFO] Tests run: 1, Failures: 0, Errors: 0, Skipped: 0, Time elapsed: 5.96 s - in org.eclipse.tycho.test.MissingPluginVersionsTest
[INFO] Running org.eclipse.tycho.test.TYCHO0383dotQualifierMatching.DotQualifierMatchingTest
[INFO] Tests run: 2, Failures: 0, Errors: 0, Skipped: 0, Time elapsed: 16.752 s - in org.eclipse.tycho.test.TYCHO0383dotQualifierMatching.DotQualifierMatchingTest
[INFO] Running org.eclipse.tycho.test.TYCHO418pomDependencyConsider.PomDependencyConsiderTest
[INFO] Tests run: 1, Failures: 0, Errors: 0, Skipped: 0, Time elapsed: 22.509 s - in org.eclipse.tycho.test.TYCHO418pomDependencyConsider.PomDependencyConsiderTest
[INFO] Running org.eclipse.tycho.test.resolver.OptionalDependenciesTest
[INFO] Tests run: 2, Failures: 0, Errors: 0, Skipped: 0, Time elapsed: 15.583 s - in org.eclipse.tycho.test.resolver.OptionalDependenciesTest
[INFO] Running org.eclipse.tycho.test.resolver.ExtraCompilerRequirementsTest
[INFO] Tests run: 5, Failures: 0, Errors: 0, Skipped: 0, Time elapsed: 59.254 s - in org.eclipse.tycho.test.resolver.ExtraCompilerRequirementsTest
[INFO] Running org.eclipse.tycho.test.TYCHO0452conflictingDependencies.ConflictingDependenciesTest
[INFO] Tests run: 1, Failures: 0, Errors: 0, Skipped: 0, Time elapsed: 9.042 s - in org.eclipse.tycho.test.TYCHO0452conflictingDependencies.ConflictingDependenciesTest
[INFO] Running org.eclipse.tycho.test.multiplatform.MultiplatformReactorTest
[INFO] Tests run: 1, Failures: 0, Errors: 0, Skipped: 0, Time elapsed: 13.195 s - in org.eclipse.tycho.test.multiplatform.MultiplatformReactorTest
[INFO] Running org.eclipse.tycho.test.multiplatform.MultiplatformProductTest
[INFO] Tests run: 1, Failures: 0, Errors: 0, Skipped: 0, Time elapsed: 8.141 s - in org.eclipse.tycho.test.multiplatform.MultiplatformProductTest
[INFO] Running org.eclipse.tycho.test.TYCHO449SrcIncludesExcludes.Tycho449SrcIncludesExcludesTest
[INFO] Tests run: 1, Failures: 0, Errors: 0, Skipped: 0, Time elapsed: 7.417 s - in org.eclipse.tycho.test.TYCHO449SrcIncludesExcludes.Tycho449SrcIncludesExcludesTest
[INFO] Running org.eclipse.tycho.test.TYCHO300launcherIcons.LauncherIconsTest
[INFO] Tests run: 1, Failures: 0, Errors: 0, Skipped: 0, Time elapsed: 3.264 s - in org.eclipse.tycho.test.TYCHO300launcherIcons.LauncherIconsTest
[INFO] Running org.eclipse.tycho.test.TYCHO246rcpSourceBundles.TYCHO246rcpSourceBundlesTest
[INFO] Tests run: 1, Failures: 0, Errors: 0, Skipped: 0, Time elapsed: 6.134 s - in org.eclipse.tycho.test.TYCHO246rcpSourceBundles.TYCHO246rcpSourceBundlesTest
[INFO] Running org.eclipse.tycho.test.mngeclipse1007.BinExcludedTest
[INFO] Tests run: 1, Failures: 0, Errors: 0, Skipped: 0, Time elapsed: 8.38 s - in org.eclipse.tycho.test.mngeclipse1007.BinExcludedTest
[INFO] Running org.eclipse.tycho.test.TYCHO109product.Tycho109ProductExportTest
[INFO] Tests run: 3, Failures: 0, Errors: 0, Skipped: 0, Time elapsed: 20.307 s - in org.eclipse.tycho.test.TYCHO109product.Tycho109ProductExportTest
[INFO] Running org.eclipse.tycho.test.downloadstats.DownloadStatsTest
[INFO] Tests run: 2, Failures: 0, Errors: 0, Skipped: 0, Time elapsed: 21.55 s - in org.eclipse.tycho.test.downloadstats.DownloadStatsTest
[INFO] Running org.eclipse.tycho.test.TYCHO330validateVersion.ValidateVersionTest
[INFO] Tests run: 2, Failures: 0, Errors: 0, Skipped: 0, Time elapsed: 19.198 s - in org.eclipse.tycho.test.TYCHO330validateVersion.ValidateVersionTest
[INFO] Running org.eclipse.tycho.test.versionsplugin.TychoVersionsPluginCompatibilityTest
[INFO] Tests run: 1, Failures: 0, Errors: 0, Skipped: 0, Time elapsed: 3.155 s - in org.eclipse.tycho.test.versionsplugin.TychoVersionsPluginCompatibilityTest
[INFO] Running org.eclipse.tycho.test.tycho476.ExecutionEnvironmentTest
[INFO] Tests run: 1, Failures: 0, Errors: 0, Skipped: 0, Time elapsed: 6.85 s - in org.eclipse.tycho.test.tycho476.ExecutionEnvironmentTest
[INFO] Running org.eclipse.tycho.test.feature.FeatureWithMultipleFiltersTest
[INFO] Tests run: 1, Failures: 0, Errors: 0, Skipped: 0, Time elapsed: 6.99 s - in org.eclipse.tycho.test.feature.FeatureWithMultipleFiltersTest
[INFO] 
[INFO] Results:
[INFO] 
[WARNING] Tests run: 190, Failures: 0, Errors: 0, Skipped: 1
[INFO] 
[INFO] ------------------------------------------------------------------------
[INFO] Reactor Summary for Tycho Extras Integration Tests 1.6.0-SNAPSHOT:
[INFO] 
[INFO] Tycho Extras Integration Tests ..................... FAILURE [  2.206 s]
[INFO] Tycho Integration Tests ............................ SUCCESS [33:48 min]
[INFO] ------------------------------------------------------------------------
[INFO] BUILD FAILURE
[INFO] ------------------------------------------------------------------------
[INFO] Total time:  33:52 min
[INFO] Finished at: 2019-11-12T10:16:43-05:00
[INFO] ------------------------------------------------------------------------
[ERROR] Failed to execute goal org.eclipse.tycho.extras:tycho-p2-extras-plugin:1.6.0-SNAPSHOT:mirror (mirror-kepler-test-repo) on project tycho-extras-its: Execution mirror-kepler-test-repo of goal org.eclipse.tycho.extras:tycho-p2-extras-plugin:1.6.0-SNAPSHOT:mirror failed: java.io.IOException: No such file or directory -> [Help 1]
[ERROR] 
[ERROR] To see the full stack trace of the errors, re-run Maven with the -e switch.
[ERROR] Re-run Maven using the -X switch to enable full debug logging.
[ERROR] 
[ERROR] For more information about the errors and possible solutions, please read the following articles:
[ERROR] [Help 1] http://cwiki.apache.org/confluence/display/MAVEN/PluginExecutionException
Build step 'Invoke top-level Maven targets' marked build as failure
Recording test results
Not sending mail to unregistered user mistria@redhat.com
Not sending mail to unregistered user michael.keppler@gmx.de
Sending e-mails to: jan.sievers@sap.com mistria@redhat.com akurtako@redhat.com m.schreiber@bachmann.info
Started calculate disk usage of build
Finished Calculation of disk usage of build in 0 seconds
Started calculate disk usage of workspace
Finished Calculation of disk usage of workspace in  1 second
Finished: FAILURE