UnstableConsole Output

Skipping 2,040 KB.. Full Log
Imported: org.apache.maven.model < maven.ext
[DEBUG]   Imported: org.apache.maven.monitor < maven.ext
[DEBUG]   Imported: org.apache.maven.plugin < maven.ext
[DEBUG]   Imported: org.apache.maven.profiles < maven.ext
[DEBUG]   Imported: org.apache.maven.project < maven.ext
[DEBUG]   Imported: org.apache.maven.reporting < maven.ext
[DEBUG]   Imported: org.apache.maven.repository < maven.ext
[DEBUG]   Imported: org.apache.maven.rtinfo < maven.ext
[DEBUG]   Imported: org.apache.maven.settings < maven.ext
[DEBUG]   Imported: org.apache.maven.toolchain < maven.ext
[DEBUG]   Imported: org.apache.maven.usability < maven.ext
[DEBUG]   Imported: org.apache.maven.wagon.* < maven.ext
[DEBUG]   Imported: org.apache.maven.wagon.authentication < maven.ext
[DEBUG]   Imported: org.apache.maven.wagon.authorization < maven.ext
[DEBUG]   Imported: org.apache.maven.wagon.events < maven.ext
[DEBUG]   Imported: org.apache.maven.wagon.observers < maven.ext
[DEBUG]   Imported: org.apache.maven.wagon.proxy < maven.ext
[DEBUG]   Imported: org.apache.maven.wagon.repository < maven.ext
[DEBUG]   Imported: org.apache.maven.wagon.resource < maven.ext
[DEBUG]   Imported: org.codehaus.classworlds < maven.ext
[DEBUG]   Imported: org.codehaus.plexus.* < maven.ext
[DEBUG]   Imported: org.codehaus.plexus.classworlds < maven.ext
[DEBUG]   Imported: org.codehaus.plexus.component < maven.ext
[DEBUG]   Imported: org.codehaus.plexus.configuration < maven.ext
[DEBUG]   Imported: org.codehaus.plexus.container < maven.ext
[DEBUG]   Imported: org.codehaus.plexus.context < maven.ext
[DEBUG]   Imported: org.codehaus.plexus.lifecycle < maven.ext
[DEBUG]   Imported: org.codehaus.plexus.logging < maven.ext
[DEBUG]   Imported: org.codehaus.plexus.personality < maven.ext
[DEBUG]   Imported: org.codehaus.plexus.util.xml.Xpp3Dom < maven.ext
[DEBUG]   Imported: org.codehaus.plexus.util.xml.pull.XmlPullParser < maven.ext
[DEBUG]   Imported: org.codehaus.plexus.util.xml.pull.XmlPullParserException < maven.ext
[DEBUG]   Imported: org.codehaus.plexus.util.xml.pull.XmlSerializer < maven.ext
[DEBUG]   Imported: org.eclipse.aether.* < maven.ext
[DEBUG]   Imported: org.eclipse.aether.artifact < maven.ext
[DEBUG]   Imported: org.eclipse.aether.collection < maven.ext
[DEBUG]   Imported: org.eclipse.aether.deployment < maven.ext
[DEBUG]   Imported: org.eclipse.aether.graph < maven.ext
[DEBUG]   Imported: org.eclipse.aether.impl < maven.ext
[DEBUG]   Imported: org.eclipse.aether.installation < maven.ext
[DEBUG]   Imported: org.eclipse.aether.internal.impl < maven.ext
[DEBUG]   Imported: org.eclipse.aether.metadata < maven.ext
[DEBUG]   Imported: org.eclipse.aether.repository < maven.ext
[DEBUG]   Imported: org.eclipse.aether.resolution < maven.ext
[DEBUG]   Imported: org.eclipse.aether.spi < maven.ext
[DEBUG]   Imported: org.eclipse.aether.transfer < maven.ext
[DEBUG]   Imported: org.eclipse.aether.version < maven.ext
[DEBUG]   Imported: org.fusesource.jansi.* < maven.ext
[DEBUG]   Imported: org.slf4j.* < maven.ext
[DEBUG]   Imported: org.slf4j.event.* < maven.ext
[DEBUG]   Imported: org.slf4j.helpers.* < maven.ext
[DEBUG]   Imported: org.slf4j.spi.* < maven.ext
[DEBUG] Populating class realm maven.api
[INFO] Error stacktraces are turned on.
[DEBUG] Message scheme: plain
[DEBUG] Reading global settings from /home/hudson/genie.tycho/.jenkins/jobs/tycho-build-with-maven-snapshots/workspace/maven/conf/settings.xml
[DEBUG] Reading user settings from /jobs/genie.tycho/tycho-build-with-maven-snapshots/workspace/tycho-extras/tycho-extras-its/settings.xml
[DEBUG] Reading global toolchains from /home/hudson/genie.tycho/.jenkins/jobs/tycho-build-with-maven-snapshots/workspace/maven/conf/toolchains.xml
[DEBUG] Reading user toolchains from /opt/public/hipp/homes/genie.tycho/.m2/toolchains.xml
[DEBUG] Using local repository at /home/hudson/genie.tycho/.jenkins/jobs/tycho-build-with-maven-snapshots/workspace/.m2/repo
[DEBUG] Using manager EnhancedLocalRepositoryManager with priority 10.0 for /home/hudson/genie.tycho/.jenkins/jobs/tycho-build-with-maven-snapshots/workspace/.m2/repo
[INFO] Scanning for projects...
[DEBUG] Scanning folder /jobs/genie.tycho/tycho-build-with-maven-snapshots/workspace/tycho-extras/tycho-extras-its/target/test-classes/testpomless-structured/bundles for modules
[DEBUG] Skip folder /jobs/genie.tycho/tycho-build-with-maven-snapshots/workspace/tycho-extras/tycho-extras-its/target/test-classes/testpomless-structured/bundles/bundle1 because it does not match any common name [features, tests, plugins, bundles, sites, products, releng]
[DEBUG] Found pom .polyglot..META-INF_MANIFEST.MF in subfolder bundle1
[DEBUG] Skip folder /jobs/genie.tycho/tycho-build-with-maven-snapshots/workspace/tycho-extras/tycho-extras-its/target/test-classes/testpomless-structured/bundles/notabundle because it does not match any common name [features, tests, plugins, bundles, sites, products, releng]
[DEBUG] Scanning folder /jobs/genie.tycho/tycho-build-with-maven-snapshots/workspace/tycho-extras/tycho-extras-its/target/test-classes/testpomless-structured/tests for modules
[DEBUG] Skip folder /jobs/genie.tycho/tycho-build-with-maven-snapshots/workspace/tycho-extras/tycho-extras-its/target/test-classes/testpomless-structured/tests/bundle1.tests because it does not match any common name [features, tests, plugins, bundles, sites, products, releng]
[DEBUG] Found pom .polyglot..META-INF_MANIFEST.MF in subfolder bundle1.tests
[DEBUG] Scanning folder /jobs/genie.tycho/tycho-build-with-maven-snapshots/workspace/tycho-extras/tycho-extras-its/target/test-classes/testpomless-structured/features for modules
[DEBUG] Skip folder /jobs/genie.tycho/tycho-build-with-maven-snapshots/workspace/tycho-extras/tycho-extras-its/target/test-classes/testpomless-structured/features/feature because it does not match any common name [features, tests, plugins, bundles, sites, products, releng]
[DEBUG] Found pom .polyglot.feature.xml.takari_issue_192 in subfolder feature
[DEBUG] Scanning folder /jobs/genie.tycho/tycho-build-with-maven-snapshots/workspace/tycho-extras/tycho-extras-its/target/test-classes/testpomless-structured/releng for modules
[DEBUG] Skip folder /jobs/genie.tycho/tycho-build-with-maven-snapshots/workspace/tycho-extras/tycho-extras-its/target/test-classes/testpomless-structured/releng/product because it does not match any common name [features, tests, plugins, bundles, sites, products, releng]
[DEBUG] Found pom .polyglot.test.product in subfolder product
[DEBUG] Skip folder /jobs/genie.tycho/tycho-build-with-maven-snapshots/workspace/tycho-extras/tycho-extras-its/target/test-classes/testpomless-structured/releng/site1 because it does not match any common name [features, tests, plugins, bundles, sites, products, releng]
[DEBUG] Found pom .polyglot.category.xml.takari_issue_192 in subfolder site1
[DEBUG] Skip folder /jobs/genie.tycho/tycho-build-with-maven-snapshots/workspace/tycho-extras/tycho-extras-its/target/test-classes/testpomless-structured/releng/targetplatform because it does not match any common name [features, tests, plugins, bundles, sites, products, releng]
[DEBUG] Found pom .polyglot.targetplatform.target in subfolder targetplatform
[DEBUG] /jobs/genie.tycho/tycho-build-with-maven-snapshots/workspace/tycho-extras/tycho-extras-its/target/test-classes/testpomless-structured/bundles/.polyglot.pom.tycho
[DEBUG] Generate aggregator pom for /jobs/genie.tycho/tycho-build-with-maven-snapshots/workspace/tycho-extras/tycho-extras-its/target/test-classes/testpomless-structured/bundles/pom.tycho
[DEBUG] Adding module bundle1
[DEBUG] Derived parent for path /jobs/genie.tycho/tycho-build-with-maven-snapshots/workspace/tycho-extras/tycho-extras-its/target/test-classes/testpomless-structured/bundles is goupId: testParent.groupId, artifactId: testparent, relativePath: ../pom.xml
[DEBUG] Skip folder /jobs/genie.tycho/tycho-build-with-maven-snapshots/workspace/tycho-extras/tycho-extras-its/target/test-classes/testpomless-structured/bundles/bundle1 because it does not match any common name [features, tests, plugins, bundles, sites, products, releng]
[DEBUG] /jobs/genie.tycho/tycho-build-with-maven-snapshots/workspace/tycho-extras/tycho-extras-its/target/test-classes/testpomless-structured/bundles/bundle1/.polyglot..META-INF_MANIFEST.MF
[DEBUG] /jobs/genie.tycho/tycho-build-with-maven-snapshots/workspace/tycho-extras/tycho-extras-its/target/test-classes/testpomless-structured/bundles/.polyglot.pom.tycho
[DEBUG] Generate aggregator pom for /jobs/genie.tycho/tycho-build-with-maven-snapshots/workspace/tycho-extras/tycho-extras-its/target/test-classes/testpomless-structured/bundles/pom.tycho
[DEBUG] Adding module bundle1
[DEBUG] Derived parent for path /jobs/genie.tycho/tycho-build-with-maven-snapshots/workspace/tycho-extras/tycho-extras-its/target/test-classes/testpomless-structured/bundles is goupId: testParent.groupId, artifactId: testparent, relativePath: ../pom.xml
[DEBUG] Derived parent for path /jobs/genie.tycho/tycho-build-with-maven-snapshots/workspace/tycho-extras/tycho-extras-its/target/test-classes/testpomless-structured/bundles/bundle1 is goupId: testParent.groupId, artifactId: bundles, relativePath: ../.polyglot.pom.tycho
[DEBUG] /jobs/genie.tycho/tycho-build-with-maven-snapshots/workspace/tycho-extras/tycho-extras-its/target/test-classes/testpomless-structured/bundles/.polyglot.pom.tycho
[DEBUG] Generate aggregator pom for /jobs/genie.tycho/tycho-build-with-maven-snapshots/workspace/tycho-extras/tycho-extras-its/target/test-classes/testpomless-structured/bundles/pom.tycho
[DEBUG] Adding module bundle1
[DEBUG] Derived parent for path /jobs/genie.tycho/tycho-build-with-maven-snapshots/workspace/tycho-extras/tycho-extras-its/target/test-classes/testpomless-structured/bundles is goupId: testParent.groupId, artifactId: testparent, relativePath: ../pom.xml
[DEBUG] /jobs/genie.tycho/tycho-build-with-maven-snapshots/workspace/tycho-extras/tycho-extras-its/target/test-classes/testpomless-structured/tests/.polyglot.pom.tycho
[DEBUG] Generate aggregator pom for /jobs/genie.tycho/tycho-build-with-maven-snapshots/workspace/tycho-extras/tycho-extras-its/target/test-classes/testpomless-structured/tests/pom.tycho
[DEBUG] Adding module bundle1.tests
[DEBUG] Derived parent for path /jobs/genie.tycho/tycho-build-with-maven-snapshots/workspace/tycho-extras/tycho-extras-its/target/test-classes/testpomless-structured/tests is goupId: testParent.groupId, artifactId: testparent, relativePath: ../pom.xml
[DEBUG] Skip folder /jobs/genie.tycho/tycho-build-with-maven-snapshots/workspace/tycho-extras/tycho-extras-its/target/test-classes/testpomless-structured/tests/bundle1.tests because it does not match any common name [features, tests, plugins, bundles, sites, products, releng]
[DEBUG] /jobs/genie.tycho/tycho-build-with-maven-snapshots/workspace/tycho-extras/tycho-extras-its/target/test-classes/testpomless-structured/tests/bundle1.tests/.polyglot..META-INF_MANIFEST.MF
[DEBUG] /jobs/genie.tycho/tycho-build-with-maven-snapshots/workspace/tycho-extras/tycho-extras-its/target/test-classes/testpomless-structured/tests/.polyglot.pom.tycho
[DEBUG] Generate aggregator pom for /jobs/genie.tycho/tycho-build-with-maven-snapshots/workspace/tycho-extras/tycho-extras-its/target/test-classes/testpomless-structured/tests/pom.tycho
[DEBUG] Adding module bundle1.tests
[DEBUG] Derived parent for path /jobs/genie.tycho/tycho-build-with-maven-snapshots/workspace/tycho-extras/tycho-extras-its/target/test-classes/testpomless-structured/tests is goupId: testParent.groupId, artifactId: testparent, relativePath: ../pom.xml
[DEBUG] Derived parent for path /jobs/genie.tycho/tycho-build-with-maven-snapshots/workspace/tycho-extras/tycho-extras-its/target/test-classes/testpomless-structured/tests/bundle1.tests is goupId: testParent.groupId, artifactId: tests, relativePath: ../.polyglot.pom.tycho
[DEBUG] /jobs/genie.tycho/tycho-build-with-maven-snapshots/workspace/tycho-extras/tycho-extras-its/target/test-classes/testpomless-structured/tests/.polyglot.pom.tycho
[DEBUG] Generate aggregator pom for /jobs/genie.tycho/tycho-build-with-maven-snapshots/workspace/tycho-extras/tycho-extras-its/target/test-classes/testpomless-structured/tests/pom.tycho
[DEBUG] Adding module bundle1.tests
[DEBUG] Derived parent for path /jobs/genie.tycho/tycho-build-with-maven-snapshots/workspace/tycho-extras/tycho-extras-its/target/test-classes/testpomless-structured/tests is goupId: testParent.groupId, artifactId: testparent, relativePath: ../pom.xml
[DEBUG] /jobs/genie.tycho/tycho-build-with-maven-snapshots/workspace/tycho-extras/tycho-extras-its/target/test-classes/testpomless-structured/features/.polyglot.pom.tycho
[DEBUG] Generate aggregator pom for /jobs/genie.tycho/tycho-build-with-maven-snapshots/workspace/tycho-extras/tycho-extras-its/target/test-classes/testpomless-structured/features/pom.tycho
[DEBUG] Adding module feature
[DEBUG] Derived parent for path /jobs/genie.tycho/tycho-build-with-maven-snapshots/workspace/tycho-extras/tycho-extras-its/target/test-classes/testpomless-structured/features is goupId: testParent.groupId, artifactId: testparent, relativePath: ../pom.xml
[DEBUG] Skip folder /jobs/genie.tycho/tycho-build-with-maven-snapshots/workspace/tycho-extras/tycho-extras-its/target/test-classes/testpomless-structured/features/feature because it does not match any common name [features, tests, plugins, bundles, sites, products, releng]
[DEBUG] /jobs/genie.tycho/tycho-build-with-maven-snapshots/workspace/tycho-extras/tycho-extras-its/target/test-classes/testpomless-structured/features/feature/.polyglot.feature.xml.takari_issue_192
[DEBUG] /jobs/genie.tycho/tycho-build-with-maven-snapshots/workspace/tycho-extras/tycho-extras-its/target/test-classes/testpomless-structured/features/.polyglot.pom.tycho
[DEBUG] Generate aggregator pom for /jobs/genie.tycho/tycho-build-with-maven-snapshots/workspace/tycho-extras/tycho-extras-its/target/test-classes/testpomless-structured/features/pom.tycho
[DEBUG] Adding module feature
[DEBUG] Derived parent for path /jobs/genie.tycho/tycho-build-with-maven-snapshots/workspace/tycho-extras/tycho-extras-its/target/test-classes/testpomless-structured/features is goupId: testParent.groupId, artifactId: testparent, relativePath: ../pom.xml
[DEBUG] Derived parent for path /jobs/genie.tycho/tycho-build-with-maven-snapshots/workspace/tycho-extras/tycho-extras-its/target/test-classes/testpomless-structured/features/feature is goupId: testParent.groupId, artifactId: features, relativePath: ../.polyglot.pom.tycho
[DEBUG] /jobs/genie.tycho/tycho-build-with-maven-snapshots/workspace/tycho-extras/tycho-extras-its/target/test-classes/testpomless-structured/features/.polyglot.pom.tycho
[DEBUG] Generate aggregator pom for /jobs/genie.tycho/tycho-build-with-maven-snapshots/workspace/tycho-extras/tycho-extras-its/target/test-classes/testpomless-structured/features/pom.tycho
[DEBUG] Adding module feature
[DEBUG] Derived parent for path /jobs/genie.tycho/tycho-build-with-maven-snapshots/workspace/tycho-extras/tycho-extras-its/target/test-classes/testpomless-structured/features is goupId: testParent.groupId, artifactId: testparent, relativePath: ../pom.xml
[DEBUG] /jobs/genie.tycho/tycho-build-with-maven-snapshots/workspace/tycho-extras/tycho-extras-its/target/test-classes/testpomless-structured/releng/.polyglot.pom.tycho
[DEBUG] Generate aggregator pom for /jobs/genie.tycho/tycho-build-with-maven-snapshots/workspace/tycho-extras/tycho-extras-its/target/test-classes/testpomless-structured/releng/pom.tycho
[DEBUG] Adding module product
[DEBUG] Adding module site1
[DEBUG] Adding module targetplatform
[DEBUG] Derived parent for path /jobs/genie.tycho/tycho-build-with-maven-snapshots/workspace/tycho-extras/tycho-extras-its/target/test-classes/testpomless-structured/releng is goupId: testParent.groupId, artifactId: testparent, relativePath: ../pom.xml
[DEBUG] Skip folder /jobs/genie.tycho/tycho-build-with-maven-snapshots/workspace/tycho-extras/tycho-extras-its/target/test-classes/testpomless-structured/releng/product because it does not match any common name [features, tests, plugins, bundles, sites, products, releng]
[DEBUG] Skip folder /jobs/genie.tycho/tycho-build-with-maven-snapshots/workspace/tycho-extras/tycho-extras-its/target/test-classes/testpomless-structured/releng/site1 because it does not match any common name [features, tests, plugins, bundles, sites, products, releng]
[DEBUG] Skip folder /jobs/genie.tycho/tycho-build-with-maven-snapshots/workspace/tycho-extras/tycho-extras-its/target/test-classes/testpomless-structured/releng/targetplatform because it does not match any common name [features, tests, plugins, bundles, sites, products, releng]
[DEBUG] /jobs/genie.tycho/tycho-build-with-maven-snapshots/workspace/tycho-extras/tycho-extras-its/target/test-classes/testpomless-structured/releng/product/.polyglot.test.product
[DEBUG] /jobs/genie.tycho/tycho-build-with-maven-snapshots/workspace/tycho-extras/tycho-extras-its/target/test-classes/testpomless-structured/releng/.polyglot.pom.tycho
[DEBUG] Generate aggregator pom for /jobs/genie.tycho/tycho-build-with-maven-snapshots/workspace/tycho-extras/tycho-extras-its/target/test-classes/testpomless-structured/releng/pom.tycho
[DEBUG] Adding module product
[DEBUG] Adding module site1
[DEBUG] Adding module targetplatform
[DEBUG] Derived parent for path /jobs/genie.tycho/tycho-build-with-maven-snapshots/workspace/tycho-extras/tycho-extras-its/target/test-classes/testpomless-structured/releng is goupId: testParent.groupId, artifactId: testparent, relativePath: ../pom.xml
[DEBUG] Derived parent for path /jobs/genie.tycho/tycho-build-with-maven-snapshots/workspace/tycho-extras/tycho-extras-its/target/test-classes/testpomless-structured/releng/product is goupId: testParent.groupId, artifactId: releng, relativePath: ../.polyglot.pom.tycho
[ERROR] Internal error: java.lang.ClassCastException: org.codehaus.plexus.util.xml.Xpp3Dom cannot be cast to org.codehaus.plexus.util.xml.Xpp3Dom -> [Help 1]
org.apache.maven.InternalErrorException: Internal error: java.lang.ClassCastException: org.codehaus.plexus.util.xml.Xpp3Dom cannot be cast to org.codehaus.plexus.util.xml.Xpp3Dom
    at org.apache.maven.DefaultMaven.execute (DefaultMaven.java:120)
    at org.apache.maven.cli.MavenCli.execute (MavenCli.java:957)
    at org.apache.maven.cli.MavenCli.doMain (MavenCli.java:289)
    at org.apache.maven.cli.MavenCli.main (MavenCli.java:193)
    at sun.reflect.NativeMethodAccessorImpl.invoke0 (Native Method)
    at sun.reflect.NativeMethodAccessorImpl.invoke (NativeMethodAccessorImpl.java:62)
    at sun.reflect.DelegatingMethodAccessorImpl.invoke (DelegatingMethodAccessorImpl.java:43)
    at java.lang.reflect.Method.invoke (Method.java:498)
    at org.codehaus.plexus.classworlds.launcher.Launcher.launchEnhanced (Launcher.java:282)
    at org.codehaus.plexus.classworlds.launcher.Launcher.launch (Launcher.java:225)
    at org.codehaus.plexus.classworlds.launcher.Launcher.mainWithExitCode (Launcher.java:406)
    at org.codehaus.plexus.classworlds.launcher.Launcher.main (Launcher.java:347)
Caused by: java.lang.ClassCastException: org.codehaus.plexus.util.xml.Xpp3Dom cannot be cast to org.codehaus.plexus.util.xml.Xpp3Dom
    at org.apache.maven.model.io.xpp3.MavenXpp3Writer.writePluginExecution (MavenXpp3Writer.java:1535)
    at org.apache.maven.model.io.xpp3.MavenXpp3Writer.writePlugin (MavenXpp3Writer.java:1416)
    at org.apache.maven.model.io.xpp3.MavenXpp3Writer.writeBuild (MavenXpp3Writer.java:344)
    at org.apache.maven.model.io.xpp3.MavenXpp3Writer.writeModel (MavenXpp3Writer.java:1138)
    at org.apache.maven.model.io.xpp3.MavenXpp3Writer.write (MavenXpp3Writer.java:115)
    at org.sonatype.maven.polyglot.TeslaModelProcessor.read (TeslaModelProcessor.java:118)
    at org.sonatype.maven.polyglot.TeslaModelProcessor.read (TeslaModelProcessor.java:95)
    at org.apache.maven.model.building.DefaultModelBuilder.readModel (DefaultModelBuilder.java:552)
    at org.apache.maven.model.building.DefaultModelBuilder.build (DefaultModelBuilder.java:281)
    at org.apache.maven.project.DefaultProjectBuilder.build (DefaultProjectBuilder.java:448)
    at org.apache.maven.project.DefaultProjectBuilder.build (DefaultProjectBuilder.java:414)
    at org.apache.maven.project.DefaultProjectBuilder.build (DefaultProjectBuilder.java:558)
    at org.apache.maven.project.DefaultProjectBuilder.build (DefaultProjectBuilder.java:414)
    at org.apache.maven.project.DefaultProjectBuilder.build (DefaultProjectBuilder.java:558)
    at org.apache.maven.project.DefaultProjectBuilder.build (DefaultProjectBuilder.java:414)
    at org.apache.maven.project.DefaultProjectBuilder.build (DefaultProjectBuilder.java:377)
    at org.apache.maven.graph.DefaultGraphBuilder.collectProjects (DefaultGraphBuilder.java:414)
    at org.apache.maven.graph.DefaultGraphBuilder.getProjectsForMavenReactor (DefaultGraphBuilder.java:405)
    at org.apache.maven.graph.DefaultGraphBuilder.build (DefaultGraphBuilder.java:82)
    at org.apache.maven.DefaultMaven.buildGraph (DefaultMaven.java:507)
    at org.apache.maven.DefaultMaven.doExecute (DefaultMaven.java:219)
    at org.apache.maven.DefaultMaven.doExecute (DefaultMaven.java:192)
    at org.apache.maven.DefaultMaven.execute (DefaultMaven.java:105)
    at org.apache.maven.cli.MavenCli.execute (MavenCli.java:957)
    at org.apache.maven.cli.MavenCli.doMain (MavenCli.java:289)
    at org.apache.maven.cli.MavenCli.main (MavenCli.java:193)
    at sun.reflect.NativeMethodAccessorImpl.invoke0 (Native Method)
    at sun.reflect.NativeMethodAccessorImpl.invoke (NativeMethodAccessorImpl.java:62)
    at sun.reflect.DelegatingMethodAccessorImpl.invoke (DelegatingMethodAccessorImpl.java:43)
    at java.lang.reflect.Method.invoke (Method.java:498)
    at org.codehaus.plexus.classworlds.launcher.Launcher.launchEnhanced (Launcher.java:282)
    at org.codehaus.plexus.classworlds.launcher.Launcher.launch (Launcher.java:225)
    at org.codehaus.plexus.classworlds.launcher.Launcher.mainWithExitCode (Launcher.java:406)
    at org.codehaus.plexus.classworlds.launcher.Launcher.main (Launcher.java:347)
[ERROR] 
[ERROR] 
[ERROR] For more information about the errors and possible solutions, please read the following articles:
[ERROR] [Help 1] http://cwiki.apache.org/confluence/display/MAVEN/InternalErrorException

	at org.eclipse.tycho.extras.pomless.TychoPomlessITest.testPomlessStructuredBuildExtension(TychoPomlessITest.java:64)

[INFO] Running org.eclipse.tycho.extras.pomless.SetVersionPomlessITest
[INFO] Tests run: 1, Failures: 0, Errors: 0, Skipped: 0, Time elapsed: 7.98 s - in org.eclipse.tycho.extras.pomless.SetVersionPomlessITest
[INFO] 
[INFO] Results:
[INFO] 
[ERROR] Errors: 
[ERROR]   TychoPomlessITest.testPomlessBuildExtension:30 » Verification Exit code was no...
[ERROR]   TychoPomlessITest.testPomlessFlatBuildExtension:53 » Verification Exit code wa...
[ERROR]   TychoPomlessITest.testPomlessStructuredBuildExtension:64 » Verification Exit c...
[INFO] 
[ERROR] Tests run: 6, Failures: 0, Errors: 3, Skipped: 0
[INFO] 
[ERROR] There are test failures.

Please refer to /jobs/genie.tycho/tycho-build-with-maven-snapshots/workspace/tycho-extras/tycho-extras-its/target/surefire-reports for the individual test results.
Please refer to dump files (if any exist) [date]-jvmRun[N].dump, [date].dumpstream and [date]-jvmRun[N].dumpstream.
[INFO] 
[INFO] --- maven-jar-plugin:3.1.2:jar (default-jar) @ tycho-extras-its ---
[WARNING] JAR will be empty - no content was marked for inclusion!
[INFO] Building jar: /jobs/genie.tycho/tycho-build-with-maven-snapshots/workspace/tycho-extras/tycho-extras-its/target/tycho-extras-its-1.6.0-SNAPSHOT.jar
[INFO] 
[INFO] --- maven-source-plugin:3.1.0:jar-no-fork (default) @ tycho-extras-its ---
[INFO] No sources in project. Archive not created.
[INFO] 
[INFO] --- maven-install-plugin:2.5.2:install (default-install) @ tycho-extras-its ---
[INFO] Installing /jobs/genie.tycho/tycho-build-with-maven-snapshots/workspace/tycho-extras/tycho-extras-its/target/tycho-extras-its-1.6.0-SNAPSHOT.jar to /home/hudson/genie.tycho/.jenkins/jobs/tycho-build-with-maven-snapshots/workspace/.m2/repo/org/eclipse/tycho/extras/tycho-extras-its/1.6.0-SNAPSHOT/tycho-extras-its-1.6.0-SNAPSHOT.jar
[INFO] Installing /jobs/genie.tycho/tycho-build-with-maven-snapshots/workspace/tycho-extras/tycho-extras-its/pom.xml to /home/hudson/genie.tycho/.jenkins/jobs/tycho-build-with-maven-snapshots/workspace/.m2/repo/org/eclipse/tycho/extras/tycho-extras-its/1.6.0-SNAPSHOT/tycho-extras-its-1.6.0-SNAPSHOT.pom
[INFO] 
[INFO] --------------------< org.eclipse.tycho:tycho-its >---------------------
[INFO] Building Tycho Integration Tests 1.6.0-SNAPSHOT                  [71/71]
[INFO] --------------------------------[ jar ]---------------------------------
Downloading from eclipse.maven.central.mirror: https://repo.eclipse.org/content/repositories/maven_central/org/eclipse/tycho/extras/tycho-p2-extras-plugin/1.5.1/tycho-p2-extras-plugin-1.5.1.pom
Progress (1): 4.1/5.6 kB
Progress (1): 5.6 kB    
                    
Downloaded from eclipse.maven.central.mirror: https://repo.eclipse.org/content/repositories/maven_central/org/eclipse/tycho/extras/tycho-p2-extras-plugin/1.5.1/tycho-p2-extras-plugin-1.5.1.pom (5.6 kB at 151 kB/s)
Downloading from eclipse.maven.central.mirror: https://repo.eclipse.org/content/repositories/maven_central/org/eclipse/tycho/extras/tycho-extras/1.5.1/tycho-extras-1.5.1.pom
Progress (1): 4.1/16 kB
Progress (1): 7.7/16 kB
Progress (1): 12/16 kB 
Progress (1): 16/16 kB
Progress (1): 16 kB   
                   
Downloaded from eclipse.maven.central.mirror: https://repo.eclipse.org/content/repositories/maven_central/org/eclipse/tycho/extras/tycho-extras/1.5.1/tycho-extras-1.5.1.pom (16 kB at 604 kB/s)
Downloading from eclipse.maven.central.mirror: https://repo.eclipse.org/content/repositories/maven_central/org/eclipse/tycho/extras/tycho-p2-extras-plugin/1.5.1/tycho-p2-extras-plugin-1.5.1.jar
Progress (1): 4.1/29 kB
Progress (1): 7.7/29 kB
Progress (1): 12/29 kB 
Progress (1): 16/29 kB
Progress (1): 20/29 kB
Progress (1): 24/29 kB
Progress (1): 28/29 kB
Progress (1): 29 kB   
                   
Downloaded from eclipse.maven.central.mirror: https://repo.eclipse.org/content/repositories/maven_central/org/eclipse/tycho/extras/tycho-p2-extras-plugin/1.5.1/tycho-p2-extras-plugin-1.5.1.jar (29 kB at 1.5 MB/s)
Downloading from eclipse.maven.central.mirror: https://repo.eclipse.org/content/repositories/maven_central/org/apache/maven/apache-maven/3.1.0/apache-maven-3.1.0.pom
Progress (1): 4.1/5.9 kB
Progress (1): 5.9 kB    
                    
Downloaded from eclipse.maven.central.mirror: https://repo.eclipse.org/content/repositories/maven_central/org/apache/maven/apache-maven/3.1.0/apache-maven-3.1.0.pom (5.9 kB at 32 kB/s)
Downloading from eclipse.maven.central.mirror: https://repo.eclipse.org/content/repositories/maven_central/org/apache/maven/maven/3.1.0/maven-3.1.0.pom
Progress (1): 4.1/22 kB
Progress (1): 7.7/22 kB
Progress (1): 12/22 kB 
Progress (1): 16/22 kB
Progress (1): 20/22 kB
Progress (1): 22 kB   
                   
Downloaded from eclipse.maven.central.mirror: https://repo.eclipse.org/content/repositories/maven_central/org/apache/maven/maven/3.1.0/maven-3.1.0.pom (22 kB at 1.2 MB/s)
Downloading from eclipse.maven.central.mirror: https://repo.eclipse.org/content/repositories/maven_central/org/apache/maven/maven-embedder/3.1.0/maven-embedder-3.1.0.pom
Progress (1): 4.1/4.3 kB
Progress (1): 4.3 kB    
                    
Downloaded from eclipse.maven.central.mirror: https://repo.eclipse.org/content/repositories/maven_central/org/apache/maven/maven-embedder/3.1.0/maven-embedder-3.1.0.pom (4.3 kB at 29 kB/s)
Downloading from eclipse.maven.central.mirror: https://repo.eclipse.org/content/repositories/maven_central/org/apache/maven/maven-model-builder/3.1.0/maven-model-builder-3.1.0.pom
Progress (1): 2.5 kB
                    
Downloaded from eclipse.maven.central.mirror: https://repo.eclipse.org/content/repositories/maven_central/org/apache/maven/maven-model-builder/3.1.0/maven-model-builder-3.1.0.pom (2.5 kB at 165 kB/s)
Downloading from eclipse.maven.central.mirror: https://repo.eclipse.org/content/repositories/maven_central/org/codehaus/plexus/plexus-interpolation/1.16/plexus-interpolation-1.16.pom
Progress (1): 1.0 kB
                    
Downloaded from eclipse.maven.central.mirror: https://repo.eclipse.org/content/repositories/maven_central/org/codehaus/plexus/plexus-interpolation/1.16/plexus-interpolation-1.16.pom (1.0 kB at 41 kB/s)
Downloading from eclipse.maven.central.mirror: https://repo.eclipse.org/content/repositories/maven_central/org/codehaus/plexus/plexus-classworlds/2.4.2/plexus-classworlds-2.4.2.pom
Progress (1): 3.5 kB
                    
Downloaded from eclipse.maven.central.mirror: https://repo.eclipse.org/content/repositories/maven_central/org/codehaus/plexus/plexus-classworlds/2.4.2/plexus-classworlds-2.4.2.pom (3.5 kB at 140 kB/s)
Downloading from eclipse.maven.central.mirror: https://repo.eclipse.org/content/repositories/maven_central/org/slf4j/slf4j-api/1.7.4/slf4j-api-1.7.4.pom
Progress (1): 2.7 kB
                    
Downloaded from eclipse.maven.central.mirror: https://repo.eclipse.org/content/repositories/maven_central/org/slf4j/slf4j-api/1.7.4/slf4j-api-1.7.4.pom (2.7 kB at 25 kB/s)
Downloading from eclipse.maven.central.mirror: https://repo.eclipse.org/content/repositories/maven_central/org/slf4j/slf4j-parent/1.7.4/slf4j-parent-1.7.4.pom
Progress (1): 4.1/12 kB
Progress (1): 7.7/12 kB
Progress (1): 12/12 kB 
Progress (1): 12 kB   
                   
Downloaded from eclipse.maven.central.mirror: https://repo.eclipse.org/content/repositories/maven_central/org/slf4j/slf4j-parent/1.7.4/slf4j-parent-1.7.4.pom (12 kB at 122 kB/s)
Downloading from eclipse.maven.central.mirror: https://repo.eclipse.org/content/repositories/maven_central/org/apache/maven/wagon/wagon-http/2.4/wagon-http-2.4.pom
Progress (1): 4.1/4.5 kB
Progress (1): 4.5 kB    
                    
Downloaded from eclipse.maven.central.mirror: https://repo.eclipse.org/content/repositories/maven_central/org/apache/maven/wagon/wagon-http/2.4/wagon-http-2.4.pom (4.5 kB at 50 kB/s)
Downloading from eclipse.maven.central.mirror: https://repo.eclipse.org/content/repositories/maven_central/org/apache/maven/wagon/wagon-providers/2.4/wagon-providers-2.4.pom
Progress (1): 2.8 kB
                    
Downloaded from eclipse.maven.central.mirror: https://repo.eclipse.org/content/repositories/maven_central/org/apache/maven/wagon/wagon-providers/2.4/wagon-providers-2.4.pom (2.8 kB at 33 kB/s)
Downloading from eclipse.maven.central.mirror: https://repo.eclipse.org/content/repositories/maven_central/org/apache/maven/wagon/wagon/2.4/wagon-2.4.pom
Progress (1): 4.1/20 kB
Progress (1): 7.7/20 kB
Progress (1): 12/20 kB 
Progress (1): 16/20 kB
Progress (1): 20/20 kB
Progress (1): 20 kB   
                   
Downloaded from eclipse.maven.central.mirror: https://repo.eclipse.org/content/repositories/maven_central/org/apache/maven/wagon/wagon/2.4/wagon-2.4.pom (20 kB at 1.4 MB/s)
Downloading from eclipse.maven.central.mirror: https://repo.eclipse.org/content/repositories/maven_central/org/apache/maven/wagon/wagon-provider-api/2.4/wagon-provider-api-2.4.pom
Progress (1): 1.7 kB
                    
Downloaded from eclipse.maven.central.mirror: https://repo.eclipse.org/content/repositories/maven_central/org/apache/maven/wagon/wagon-provider-api/2.4/wagon-provider-api-2.4.pom (1.7 kB at 123 kB/s)
Downloading from eclipse.maven.central.mirror: https://repo.eclipse.org/content/repositories/maven_central/org/apache/maven/wagon/wagon-file/2.4/wagon-file-2.4.pom
Progress (1): 1.4 kB
                    
Downloaded from eclipse.maven.central.mirror: https://repo.eclipse.org/content/repositories/maven_central/org/apache/maven/wagon/wagon-file/2.4/wagon-file-2.4.pom (1.4 kB at 19 kB/s)
Downloading from eclipse.maven.central.mirror: https://repo.eclipse.org/content/repositories/maven_central/org/eclipse/aether/aether-connector-wagon/0.9.0.M2/aether-connector-wagon-0.9.0.M2.pom
Progress (1): 4.1 kB
                    
Downloaded from eclipse.maven.central.mirror: https://repo.eclipse.org/content/repositories/maven_central/org/eclipse/aether/aether-connector-wagon/0.9.0.M2/aether-connector-wagon-0.9.0.M2.pom (4.1 kB at 240 kB/s)
Downloading from eclipse.maven.central.mirror: https://repo.eclipse.org/content/repositories/maven_central/org/eclipse/aether/aether-api/0.9.0.M2/aether-api-0.9.0.M2.pom
Progress (1): 1.7 kB
                    
Downloaded from eclipse.maven.central.mirror: https://repo.eclipse.org/content/repositories/maven_central/org/eclipse/aether/aether-api/0.9.0.M2/aether-api-0.9.0.M2.pom (1.7 kB at 124 kB/s)
Downloading from eclipse.maven.central.mirror: https://repo.eclipse.org/content/repositories/maven_central/org/eclipse/aether/aether-spi/0.9.0.M2/aether-spi-0.9.0.M2.pom
Progress (1): 1.8 kB
                    
Downloaded from eclipse.maven.central.mirror: https://repo.eclipse.org/content/repositories/maven_central/org/eclipse/aether/aether-spi/0.9.0.M2/aether-spi-0.9.0.M2.pom (1.8 kB at 110 kB/s)
Downloading from eclipse.maven.central.mirror: https://repo.eclipse.org/content/repositories/maven_central/org/slf4j/slf4j-simple/1.7.4/slf4j-simple-1.7.4.pom
Progress (1): 1.5 kB
                    
Downloaded from eclipse.maven.central.mirror: https://repo.eclipse.org/content/repositories/maven_central/org/slf4j/slf4j-simple/1.7.4/slf4j-simple-1.7.4.pom (1.5 kB at 14 kB/s)
Downloading from eclipse.maven.central.mirror: https://repo.eclipse.org/content/repositories/maven_central/org/sonatype/plexus/plexus-jetty-testsuite/2.1/plexus-jetty-testsuite-2.1.pom
Progress (1): 2.6 kB
                    
Downloaded from eclipse.maven.central.mirror: https://repo.eclipse.org/content/repositories/maven_central/org/sonatype/plexus/plexus-jetty-testsuite/2.1/plexus-jetty-testsuite-2.1.pom (2.6 kB at 26 kB/s)
Downloading from eclipse.maven.central.mirror: https://repo.eclipse.org/content/repositories/maven_central/org/sonatype/spice/spice-parent/19/spice-parent-19.pom
Progress (1): 4.1/9.9 kB
Progress (1): 7.7/9.9 kB
Progress (1): 9.9 kB    
                    
Downloaded from eclipse.maven.central.mirror: https://repo.eclipse.org/content/repositories/maven_central/org/sonatype/spice/spice-parent/19/spice-parent-19.pom (9.9 kB at 99 kB/s)
Downloading from eclipse.maven.central.mirror: https://repo.eclipse.org/content/repositories/maven_central/org/sonatype/forge/forge-parent/11/forge-parent-11.pom
Progress (1): 4.1/14 kB
Progress (1): 7.7/14 kB
Progress (1): 12/14 kB 
Progress (1): 14 kB   
                   
Downloaded from eclipse.maven.central.mirror: https://repo.eclipse.org/content/repositories/maven_central/org/sonatype/forge/forge-parent/11/forge-parent-11.pom (14 kB at 644 kB/s)
Downloading from eclipse.maven.central.mirror: https://repo.eclipse.org/content/repositories/maven_central/javax/servlet/javax.servlet-api/3.0.1/javax.servlet-api-3.0.1.pom
Progress (1): 4.1/13 kB
Progress (1): 7.7/13 kB
Progress (1): 12/13 kB 
Progress (1): 13 kB   
                   
Downloaded from eclipse.maven.central.mirror: https://repo.eclipse.org/content/repositories/maven_central/javax/servlet/javax.servlet-api/3.0.1/javax.servlet-api-3.0.1.pom (13 kB at 102 kB/s)
Downloading from eclipse.maven.central.mirror: https://repo.eclipse.org/content/repositories/maven_central/net/java/jvnet-parent/1/jvnet-parent-1.pom
Progress (1): 4.1/4.7 kB
Progress (1): 4.7 kB    
                    
Downloaded from eclipse.maven.central.mirror: https://repo.eclipse.org/content/repositories/maven_central/net/java/jvnet-parent/1/jvnet-parent-1.pom (4.7 kB at 188 kB/s)
Downloading from eclipse.maven.central.mirror: https://repo.eclipse.org/content/repositories/maven_central/org/eclipse/jetty/jetty-webapp/8.1.1.v20120215/jetty-webapp-8.1.1.v20120215.pom
Progress (1): 3.5 kB
                    
Downloaded from eclipse.maven.central.mirror: https://repo.eclipse.org/content/repositories/maven_central/org/eclipse/jetty/jetty-webapp/8.1.1.v20120215/jetty-webapp-8.1.1.v20120215.pom (3.5 kB at 40 kB/s)
Downloading from eclipse.maven.central.mirror: https://repo.eclipse.org/content/repositories/maven_central/org/eclipse/jetty/jetty-project/8.1.1.v20120215/jetty-project-8.1.1.v20120215.pom
Progress (1): 4.1/25 kB
Progress (1): 7.7/25 kB
Progress (1): 12/25 kB 
Progress (1): 16/25 kB
Progress (1): 20/25 kB
Progress (1): 24/25 kB
Progress (1): 25 kB   
                   
Downloaded from eclipse.maven.central.mirror: https://repo.eclipse.org/content/repositories/maven_central/org/eclipse/jetty/jetty-project/8.1.1.v20120215/jetty-project-8.1.1.v20120215.pom (25 kB at 155 kB/s)
Downloading from eclipse.maven.central.mirror: https://repo.eclipse.org/content/repositories/maven_central/org/eclipse/jetty/jetty-parent/19/jetty-parent-19.pom
Progress (1): 4.1/20 kB
Progress (1): 7.7/20 kB
Progress (1): 12/20 kB 
Progress (1): 16/20 kB
Progress (1): 20/20 kB
Progress (1): 20 kB   
                   
Downloaded from eclipse.maven.central.mirror: https://repo.eclipse.org/content/repositories/maven_central/org/eclipse/jetty/jetty-parent/19/jetty-parent-19.pom (20 kB at 425 kB/s)
Downloading from eclipse.maven.central.mirror: https://repo.eclipse.org/content/repositories/maven_central/org/eclipse/jetty/jetty-xml/8.1.1.v20120215/jetty-xml-8.1.1.v20120215.pom
Progress (1): 1.9 kB
                    
Downloaded from eclipse.maven.central.mirror: https://repo.eclipse.org/content/repositories/maven_central/org/eclipse/jetty/jetty-xml/8.1.1.v20120215/jetty-xml-8.1.1.v20120215.pom (1.9 kB at 22 kB/s)
Downloading from eclipse.maven.central.mirror: https://repo.eclipse.org/content/repositories/maven_central/org/eclipse/jetty/jetty-util/8.1.1.v20120215/jetty-util-8.1.1.v20120215.pom
Progress (1): 3.4 kB
                    
Downloaded from eclipse.maven.central.mirror: https://repo.eclipse.org/content/repositories/maven_central/org/eclipse/jetty/jetty-util/8.1.1.v20120215/jetty-util-8.1.1.v20120215.pom (3.4 kB at 35 kB/s)
Downloading from eclipse.maven.central.mirror: https://repo.eclipse.org/content/repositories/maven_central/org/eclipse/jetty/jetty-servlet/8.1.1.v20120215/jetty-servlet-8.1.1.v20120215.pom
Progress (1): 2.7 kB
                    
Downloaded from eclipse.maven.central.mirror: https://repo.eclipse.org/content/repositories/maven_central/org/eclipse/jetty/jetty-servlet/8.1.1.v20120215/jetty-servlet-8.1.1.v20120215.pom (2.7 kB at 25 kB/s)
Downloading from eclipse.maven.central.mirror: https://repo.eclipse.org/content/repositories/maven_central/org/eclipse/jetty/jetty-security/8.1.1.v20120215/jetty-security-8.1.1.v20120215.pom
Progress (1): 2.7 kB
                    
Downloaded from eclipse.maven.central.mirror: https://repo.eclipse.org/content/repositories/maven_central/org/eclipse/jetty/jetty-security/8.1.1.v20120215/jetty-security-8.1.1.v20120215.pom (2.7 kB at 21 kB/s)
Downloading from eclipse.maven.central.mirror: https://repo.eclipse.org/content/repositories/maven_central/org/eclipse/jetty/jetty-server/8.1.1.v20120215/jetty-server-8.1.1.v20120215.pom
Progress (1): 3.7 kB
                    
Downloaded from eclipse.maven.central.mirror: https://repo.eclipse.org/content/repositories/maven_central/org/eclipse/jetty/jetty-server/8.1.1.v20120215/jetty-server-8.1.1.v20120215.pom (3.7 kB at 46 kB/s)
Downloading from eclipse.maven.central.mirror: https://repo.eclipse.org/content/repositories/maven_central/org/eclipse/jetty/orbit/javax.servlet/3.0.0.v201112011016/javax.servlet-3.0.0.v201112011016.pom
Progress (1): 732 B
                   
Downloaded from eclipse.maven.central.mirror: https://repo.eclipse.org/content/repositories/maven_central/org/eclipse/jetty/orbit/javax.servlet/3.0.0.v201112011016/javax.servlet-3.0.0.v201112011016.pom (732 B at 16 kB/s)
Downloading from eclipse.maven.central.mirror: https://repo.eclipse.org/content/repositories/maven_central/org/eclipse/jetty/orbit/jetty-orbit/1/jetty-orbit-1.pom
Progress (1): 2.2 kB
                    
Downloaded from eclipse.maven.central.mirror: https://repo.eclipse.org/content/repositories/maven_central/org/eclipse/jetty/orbit/jetty-orbit/1/jetty-orbit-1.pom (2.2 kB at 31 kB/s)
Downloading from eclipse.maven.central.mirror: https://repo.eclipse.org/content/repositories/maven_central/org/eclipse/jetty/jetty-parent/18/jetty-parent-18.pom
Progress (1): 4.1/16 kB
Progress (1): 7.7/16 kB
Progress (1): 12/16 kB 
Progress (1): 16/16 kB
Progress (1): 16 kB   
                   
Downloaded from eclipse.maven.central.mirror: https://repo.eclipse.org/content/repositories/maven_central/org/eclipse/jetty/jetty-parent/18/jetty-parent-18.pom (16 kB at 1.1 MB/s)
Downloading from eclipse.maven.central.mirror: https://repo.eclipse.org/content/repositories/maven_central/org/eclipse/jetty/jetty-continuation/8.1.1.v20120215/jetty-continuation-8.1.1.v20120215.pom
Progress (1): 2.7 kB
                    
Downloaded from eclipse.maven.central.mirror: https://repo.eclipse.org/content/repositories/maven_central/org/eclipse/jetty/jetty-continuation/8.1.1.v20120215/jetty-continuation-8.1.1.v20120215.pom (2.7 kB at 31 kB/s)
Downloading from eclipse.maven.central.mirror: https://repo.eclipse.org/content/repositories/maven_central/org/eclipse/jetty/jetty-http/8.1.1.v20120215/jetty-http-8.1.1.v20120215.pom
Progress (1): 2.6 kB
                    
Downloaded from eclipse.maven.central.mirror: https://repo.eclipse.org/content/repositories/maven_central/org/eclipse/jetty/jetty-http/8.1.1.v20120215/jetty-http-8.1.1.v20120215.pom (2.6 kB at 32 kB/s)
Downloading from eclipse.maven.central.mirror: https://repo.eclipse.org/content/repositories/maven_central/org/eclipse/jetty/jetty-io/8.1.1.v20120215/jetty-io-8.1.1.v20120215.pom
Progress (1): 2.1 kB
                    
Downloaded from eclipse.maven.central.mirror: https://repo.eclipse.org/content/repositories/maven_central/org/eclipse/jetty/jetty-io/8.1.1.v20120215/jetty-io-8.1.1.v20120215.pom (2.1 kB at 23 kB/s)
Downloading from eclipse.maven.central.mirror: https://repo.eclipse.org/content/repositories/maven_central/org/eclipse/jetty/jetty-client/8.1.1.v20120215/jetty-client-8.1.1.v20120215.pom
Progress (1): 4.1/4.7 kB
Progress (1): 4.7 kB    
                    
Downloaded from eclipse.maven.central.mirror: https://repo.eclipse.org/content/repositories/maven_central/org/eclipse/jetty/jetty-client/8.1.1.v20120215/jetty-client-8.1.1.v20120215.pom (4.7 kB at 27 kB/s)
Downloading from eclipse.maven.central.mirror: https://repo.eclipse.org/content/repositories/maven_central/org/eclipse/jetty/jetty-servlets/8.1.1.v20120215/jetty-servlets-8.1.1.v20120215.pom
Progress (1): 3.3 kB
                    
Downloaded from eclipse.maven.central.mirror: https://repo.eclipse.org/content/repositories/maven_central/org/eclipse/jetty/jetty-servlets/8.1.1.v20120215/jetty-servlets-8.1.1.v20120215.pom (3.3 kB at 23 kB/s)
Downloading from eclipse.maven.central.mirror: https://repo.eclipse.org/content/repositories/maven_central/org/apache/maven/apache-maven/3.1.0/apache-maven-3.1.0-bin.tar.gz
Downloading from eclipse.maven.central.mirror: https://repo.eclipse.org/content/repositories/maven_central/org/apache/maven/maven-model-builder/3.1.0/maven-model-builder-3.1.0.jar
Downloading from eclipse.maven.central.mirror: https://repo.eclipse.org/content/repositories/maven_central/org/apache/maven/maven-embedder/3.1.0/maven-embedder-3.1.0.jar
Downloading from eclipse.maven.central.mirror: https://repo.eclipse.org/content/repositories/maven_central/org/slf4j/slf4j-api/1.7.4/slf4j-api-1.7.4.jar
Downloading from eclipse.maven.central.mirror: https://repo.eclipse.org/content/repositories/maven_central/org/codehaus/plexus/plexus-classworlds/2.4.2/plexus-classworlds-2.4.2.jar
Progress (1): 4.1/159 kB
Progress (1): 7.7/159 kB
Progress (1): 12/159 kB 
Progress (1): 16/159 kB
Progress (1): 20/159 kB
Progress (1): 24/159 kB
Progress (2): 24/159 kB | 4.1/47 kB
Progress (2): 24/159 kB | 7.7/47 kB
Progress (2): 28/159 kB | 7.7/47 kB
Progress (2): 32/159 kB | 7.7/47 kB
Progress (2): 36/159 kB | 7.7/47 kB
Progress (2): 36/159 kB | 12/47 kB 
Progress (2): 40/159 kB | 12/47 kB
Progress (2): 40/159 kB | 16/47 kB
Progress (2): 44/159 kB | 16/47 kB
Progress (2): 44/159 kB | 20/47 kB
Progress (2): 48/159 kB | 20/47 kB
Progress (2): 48/159 kB | 24/47 kB
Progress (2): 52/159 kB | 24/47 kB
Progress (2): 52/159 kB | 28/47 kB
Progress (2): 56/159 kB | 28/47 kB
Progress (2): 56/159 kB | 32/47 kB
Progress (2): 60/159 kB | 32/47 kB
Progress (2): 60/159 kB | 36/47 kB
Progress (2): 64/159 kB | 36/47 kB
Progress (2): 64/159 kB | 40/47 kB
Progress (2): 68/159 kB | 40/47 kB
Progress (2): 68/159 kB | 44/47 kB
Progress (2): 72/159 kB | 44/47 kB
Progress (2): 72/159 kB | 47 kB   
Progress (2): 76/159 kB | 47 kB
Progress (2): 80/159 kB | 47 kB
Progress (2): 84/159 kB | 47 kB
Progress (2): 88/159 kB | 47 kB
Progress (2): 92/159 kB | 47 kB
Progress (2): 96/159 kB | 47 kB
Progress (2): 100/159 kB | 47 kB
Progress (2): 104/159 kB | 47 kB
Progress (2): 108/159 kB | 47 kB
Progress (2): 112/159 kB | 47 kB
Progress (2): 116/159 kB | 47 kB
Progress (2): 120/159 kB | 47 kB
Progress (2): 124/159 kB | 47 kB
Progress (2): 128/159 kB | 47 kB
Progress (2): 132/159 kB | 47 kB
Progress (2): 136/159 kB | 47 kB
Progress (2): 140/159 kB | 47 kB
Progress (2): 144/159 kB | 47 kB
Progress (2): 148/159 kB | 47 kB
Progress (2): 152/159 kB | 47 kB
Progress (2): 156/159 kB | 47 kB
Progress (2): 159 kB | 47 kB    
                            
Downloaded from eclipse.maven.central.mirror: https://repo.eclipse.org/content/repositories/maven_central/org/codehaus/plexus/plexus-classworlds/2.4.2/plexus-classworlds-2.4.2.jar (47 kB at 1.2 MB/s)
Downloading from eclipse.maven.central.mirror: https://repo.eclipse.org/content/repositories/maven_central/org/apache/maven/wagon/wagon-http/2.4/wagon-http-2.4-shaded.jar
Downloaded from eclipse.maven.central.mirror: https://repo.eclipse.org/content/repositories/maven_central/org/apache/maven/maven-model-builder/3.1.0/maven-model-builder-3.1.0.jar (159 kB at 3.8 MB/s)
Downloading from eclipse.maven.central.mirror: https://repo.eclipse.org/content/repositories/maven_central/org/apache/maven/wagon/wagon-file/2.4/wagon-file-2.4.jar
Progress (1): 4.1/26 kB
Progress (1): 7.7/26 kB
Progress (1): 12/26 kB 
Progress (1): 16/26 kB
Progress (1): 20/26 kB
Progress (1): 24/26 kB
Progress (1): 26 kB   
Progress (2): 26 kB | 4.1/11 kB
Progress (2): 26 kB | 7.7/11 kB
Progress (2): 26 kB | 11 kB    
Progress (3): 26 kB | 11 kB | 4.1/57 kB
Progress (3): 26 kB | 11 kB | 7.7/57 kB
Progress (3): 26 kB | 11 kB | 12/57 kB 
Progress (3): 26 kB | 11 kB | 16/57 kB
Progress (3): 26 kB | 11 kB | 20/57 kB
Progress (3): 26 kB | 11 kB | 24/57 kB
Progress (3): 26 kB | 11 kB | 28/57 kB
Progress (3): 26 kB | 11 kB | 32/57 kB
Progress (3): 26 kB | 11 kB | 36/57 kB
Progress (3): 26 kB | 11 kB | 40/57 kB
Progress (3): 26 kB | 11 kB | 44/57 kB
Progress (3): 26 kB | 11 kB | 48/57 kB
Progress (3): 26 kB | 11 kB | 52/57 kB
Progress (3): 26 kB | 11 kB | 56/57 kB
Progress (3): 26 kB | 11 kB | 57 kB   
                                   
Downloaded from eclipse.maven.central.mirror: https://repo.eclipse.org/content/repositories/maven_central/org/slf4j/slf4j-api/1.7.4/slf4j-api-1.7.4.jar (26 kB at 115 kB/s)
Downloading from eclipse.maven.central.mirror: https://repo.eclipse.org/content/repositories/maven_central/org/eclipse/aether/aether-connector-wagon/0.9.0.M2/aether-connector-wagon-0.9.0.M2.jar
Downloaded from eclipse.maven.central.mirror: https://repo.eclipse.org/content/repositories/maven_central/org/apache/maven/maven-embedder/3.1.0/maven-embedder-3.1.0.jar (57 kB at 244 kB/s)
Downloading from eclipse.maven.central.mirror: https://repo.eclipse.org/content/repositories/maven_central/org/eclipse/aether/aether-api/0.9.0.M2/aether-api-0.9.0.M2.jar
Downloaded from eclipse.maven.central.mirror: https://repo.eclipse.org/content/repositories/maven_central/org/apache/maven/wagon/wagon-file/2.4/wagon-file-2.4.jar (11 kB at 48 kB/s)
Downloading from eclipse.maven.central.mirror: https://repo.eclipse.org/content/repositories/maven_central/org/eclipse/aether/aether-spi/0.9.0.M2/aether-spi-0.9.0.M2.jar
Progress (1): 4.1/34 kB
Progress (1): 7.7/34 kB
Progress (1): 12/34 kB 
Progress (1): 16/34 kB
Progress (1): 20/34 kB
Progress (1): 24/34 kB
Progress (1): 28/34 kB
Progress (1): 32/34 kB
Progress (1): 34 kB   
Progress (2): 34 kB | 4.1/134 kB
Progress (2): 34 kB | 7.7/134 kB
Progress (2): 34 kB | 12/134 kB 
Progress (2): 34 kB | 16/134 kB
Progress (2): 34 kB | 20/134 kB
Progress (2): 34 kB | 24/134 kB
Progress (2): 34 kB | 28/134 kB
Progress (2): 34 kB | 32/134 kB
Progress (2): 34 kB | 36/134 kB
Progress (2): 34 kB | 40/134 kB
                               
Downloaded from eclipse.maven.central.mirror: https://repo.eclipse.org/content/repositories/maven_central/org/eclipse/aether/aether-connector-wagon/0.9.0.M2/aether-connector-wagon-0.9.0.M2.jar (34 kB at 140 kB/s)
Progress (1): 44/134 kB
                       
Downloading from eclipse.maven.central.mirror: https://repo.eclipse.org/content/repositories/maven_central/org/slf4j/slf4j-simple/1.7.4/slf4j-simple-1.7.4.jar
Progress (1): 48/134 kB
Progress (1): 52/134 kB
Progress (1): 56/134 kB
Progress (1): 60/134 kB
Progress (1): 64/134 kB
Progress (1): 69/134 kB
Progress (1): 73/134 kB
Progress (1): 77/134 kB
Progress (1): 81/134 kB
Progress (1): 85/134 kB
Progress (1): 89/134 kB
Progress (1): 93/134 kB
Progress (1): 97/134 kB
Progress (1): 101/134 kB
Progress (1): 105/134 kB
Progress (1): 109/134 kB
Progress (1): 114/134 kB
Progress (1): 118/134 kB
Progress (1): 122/134 kB
Progress (2): 122/134 kB | 0/1.1 MB
Progress (2): 126/134 kB | 0/1.1 MB
Progress (2): 130/134 kB | 0/1.1 MB
Progress (2): 134 kB | 0/1.1 MB    
Progress (3): 134 kB | 0/1.1 MB | 4.1/18 kB
Progress (3): 134 kB | 0/1.1 MB | 4.1/18 kB
Progress (3): 134 kB | 0/1.1 MB | 7.7/18 kB
Progress (3): 134 kB | 0/1.1 MB | 7.7/18 kB
Progress (3): 134 kB | 0/1.1 MB | 12/18 kB 
Progress (3): 134 kB | 0/1.1 MB | 16/18 kB
Progress (3): 134 kB | 0/1.1 MB | 16/18 kB
Progress (3): 134 kB | 0/1.1 MB | 18 kB   
Progress (3): 134 kB | 0/1.1 MB | 18 kB
Progress (3): 134 kB | 0/1.1 MB | 18 kB
Progress (3): 134 kB | 0.1/1.1 MB | 18 kB
Progress (3): 134 kB | 0.1/1.1 MB | 18 kB
                                         
Downloaded from eclipse.maven.central.mirror: https://repo.eclipse.org/content/repositories/maven_central/org/eclipse/aether/aether-api/0.9.0.M2/aether-api-0.9.0.M2.jar (134 kB at 527 kB/s)
Downloading from eclipse.maven.central.mirror: https://repo.eclipse.org/content/repositories/maven_central/org/sonatype/plexus/plexus-jetty-testsuite/2.1/plexus-jetty-testsuite-2.1.jar
Downloaded from eclipse.maven.central.mirror: https://repo.eclipse.org/content/repositories/maven_central/org/eclipse/aether/aether-spi/0.9.0.M2/aether-spi-0.9.0.M2.jar (18 kB at 69 kB/s)
Downloading from eclipse.maven.central.mirror: https://repo.eclipse.org/content/repositories/maven_central/javax/servlet/javax.servlet-api/3.0.1/javax.servlet-api-3.0.1.jar
Progress (2): 0.1/1.1 MB | 0/5.4 MB
Progress (2): 0.1/1.1 MB | 0/5.4 MB
Progress (2): 0.1/1.1 MB | 0/5.4 MB
Progress (2): 0.1/1.1 MB | 0.1/5.4 MB
Progress (2): 0.1/1.1 MB | 0.1/5.4 MB
Progress (2): 0.1/1.1 MB | 0.1/5.4 MB
Progress (2): 0.1/1.1 MB | 0.1/5.4 MB
Progress (2): 0.1/1.1 MB | 0.1/5.4 MB
Progress (2): 0.1/1.1 MB | 0.1/5.4 MB
Progress (2): 0.1/1.1 MB | 0.1/5.4 MB
Progress (2): 0.1/1.1 MB | 0.1/5.4 MB
Progress (2): 0.1/1.1 MB | 0.1/5.4 MB
Progress (2): 0.1/1.1 MB | 0.2/5.4 MB
Progress (2): 0.1/1.1 MB | 0.2/5.4 MB
Progress (2): 0.1/1.1 MB | 0.2/5.4 MB
Progress (2): 0.2/1.1 MB | 0.2/5.4 MB
Progress (2): 0.2/1.1 MB | 0.2/5.4 MB
Progress (2): 0.2/1.1 MB | 0.2/5.4 MB
Progress (2): 0.2/1.1 MB | 0.2/5.4 MB
Progress (2): 0.2/1.1 MB | 0.2/5.4 MB
Progress (2): 0.2/1.1 MB | 0.2/5.4 MB
Progress (2): 0.2/1.1 MB | 0.2/5.4 MB
Progress (2): 0.2/1.1 MB | 0.2/5.4 MB
Progress (2): 0.2/1.1 MB | 0.2/5.4 MB
Progress (2): 0.2/1.1 MB | 0.2/5.4 MB
Progress (2): 0.2/1.1 MB | 0.2/5.4 MB
Progress (2): 0.2/1.1 MB | 0.2/5.4 MB
Progress (2): 0.3/1.1 MB | 0.2/5.4 MB
Progress (2): 0.3/1.1 MB | 0.2/5.4 MB
Progress (2): 0.3/1.1 MB | 0.2/5.4 MB
Progress (2): 0.3/1.1 MB | 0.2/5.4 MB
Progress (2): 0.3/1.1 MB | 0.2/5.4 MB
Progress (2): 0.3/1.1 MB | 0.2/5.4 MB
Progress (2): 0.3/1.1 MB | 0.2/5.4 MB
Progress (2): 0.3/1.1 MB | 0.2/5.4 MB
Progress (2): 0.3/1.1 MB | 0.3/5.4 MB
Progress (2): 0.3/1.1 MB | 0.3/5.4 MB
Progress (2): 0.3/1.1 MB | 0.3/5.4 MB
Progress (2): 0.3/1.1 MB | 0.4/5.4 MB
Progress (2): 0.3/1.1 MB | 0.4/5.4 MB
Progress (2): 0.3/1.1 MB | 0.4/5.4 MB
Progress (2): 0.3/1.1 MB | 0.4/5.4 MB
Progress (2): 0.3/1.1 MB | 0.5/5.4 MB
Progress (2): 0.3/1.1 MB | 0.5/5.4 MB
Progress (2): 0.3/1.1 MB | 0.5/5.4 MB
Progress (2): 0.3/1.1 MB | 0.6/5.4 MB
Progress (2): 0.3/1.1 MB | 0.6/5.4 MB
Progress (2): 0.3/1.1 MB | 0.6/5.4 MB
Progress (2): 0.3/1.1 MB | 0.7/5.4 MB
Progress (2): 0.3/1.1 MB | 0.7/5.4 MB
Progress (2): 0.3/1.1 MB | 0.7/5.4 MB
Progress (2): 0.3/1.1 MB | 0.8/5.4 MB
Progress (2): 0.3/1.1 MB | 0.8/5.4 MB
Progress (2): 0.3/1.1 MB | 0.8/5.4 MB
Progress (2): 0.3/1.1 MB | 0.9/5.4 MB
Progress (2): 0.3/1.1 MB | 0.9/5.4 MB
Progress (2): 0.3/1.1 MB | 0.9/5.4 MB
Progress (2): 0.3/1.1 MB | 0.9/5.4 MB
Progress (2): 0.3/1.1 MB | 0.9/5.4 MB
Progress (2): 0.3/1.1 MB | 0.9/5.4 MB
Progress (2): 0.3/1.1 MB | 0.9/5.4 MB
Progress (2): 0.3/1.1 MB | 1.0/5.4 MB
Progress (2): 0.3/1.1 MB | 1.0/5.4 MB
Progress (2): 0.3/1.1 MB | 1.0/5.4 MB
Progress (2): 0.3/1.1 MB | 1.1/5.4 MB
Progress (2): 0.3/1.1 MB | 1.1/5.4 MB
Progress (2): 0.3/1.1 MB | 1.1/5.4 MB
Progress (2): 0.3/1.1 MB | 1.2/5.4 MB
Progress (2): 0.3/1.1 MB | 1.2/5.4 MB
Progress (2): 0.3/1.1 MB | 1.2/5.4 MB
Progress (2): 0.3/1.1 MB | 1.2/5.4 MB
Progress (2): 0.3/1.1 MB | 1.2/5.4 MB
Progress (2): 0.4/1.1 MB | 1.2/5.4 MB
Progress (2): 0.4/1.1 MB | 1.2/5.4 MB
Progress (2): 0.4/1.1 MB | 1.2/5.4 MB
Progress (2): 0.4/1.1 MB | 1.3/5.4 MB
Progress (2): 0.4/1.1 MB | 1.3/5.4 MB
Progress (2): 0.4/1.1 MB | 1.3/5.4 MB
Progress (2): 0.4/1.1 MB | 1.4/5.4 MB
Progress (2): 0.4/1.1 MB | 1.4/5.4 MB
Progress (2): 0.4/1.1 MB | 1.4/5.4 MB
Progress (2): 0.4/1.1 MB | 1.5/5.4 MB
Progress (2): 0.4/1.1 MB | 1.5/5.4 MB
Progress (2): 0.4/1.1 MB | 1.5/5.4 MB
Progress (2): 0.4/1.1 MB | 1.6/5.4 MB
Progress (2): 0.4/1.1 MB | 1.6/5.4 MB
Progress (2): 0.4/1.1 MB | 1.6/5.4 MB
Progress (2): 0.4/1.1 MB | 1.7/5.4 MB
Progress (2): 0.4/1.1 MB | 1.7/5.4 MB
Progress (2): 0.4/1.1 MB | 1.7/5.4 MB
Progress (2): 0.4/1.1 MB | 1.8/5.4 MB
Progress (2): 0.4/1.1 MB | 1.8/5.4 MB
Progress (2): 0.4/1.1 MB | 1.8/5.4 MB
Progress (2): 0.4/1.1 MB | 1.9/5.4 MB
Progress (2): 0.4/1.1 MB | 1.9/5.4 MB
Progress (2): 0.4/1.1 MB | 1.9/5.4 MB
Progress (2): 0.4/1.1 MB | 2.0/5.4 MB
Progress (2): 0.4/1.1 MB | 2.0/5.4 MB
Progress (2): 0.4/1.1 MB | 2.0/5.4 MB
Progress (2): 0.4/1.1 MB | 2.0/5.4 MB
Progress (2): 0.4/1.1 MB | 2.1/5.4 MB
Progress (2): 0.4/1.1 MB | 2.1/5.4 MB
Progress (2): 0.4/1.1 MB | 2.1/5.4 MB
Progress (2): 0.4/1.1 MB | 2.1/5.4 MB
Progress (2): 0.4/1.1 MB | 2.1/5.4 MB
Progress (2): 0.4/1.1 MB | 2.1/5.4 MB
Progress (2): 0.4/1.1 MB | 2.1/5.4 MB
Progress (2): 0.4/1.1 MB | 2.1/5.4 MB
Progress (2): 0.4/1.1 MB | 2.2/5.4 MB
Progress (2): 0.4/1.1 MB | 2.2/5.4 MB
Progress (2): 0.4/1.1 MB | 2.2/5.4 MB
Progress (2): 0.4/1.1 MB | 2.2/5.4 MB
Progress (2): 0.4/1.1 MB | 2.2/5.4 MB
Progress (2): 0.4/1.1 MB | 2.2/5.4 MB
Progress (2): 0.4/1.1 MB | 2.2/5.4 MB
Progress (2): 0.4/1.1 MB | 2.2/5.4 MB
Progress (2): 0.4/1.1 MB | 2.2/5.4 MB
Progress (2): 0.4/1.1 MB | 2.3/5.4 MB
Progress (2): 0.4/1.1 MB | 2.3/5.4 MB
Progress (2): 0.5/1.1 MB | 2.3/5.4 MB
Progress (2): 0.5/1.1 MB | 2.3/5.4 MB
Progress (2): 0.5/1.1 MB | 2.3/5.4 MB
Progress (2): 0.5/1.1 MB | 2.3/5.4 MB
Progress (2): 0.5/1.1 MB | 2.4/5.4 MB
Progress (2): 0.5/1.1 MB | 2.4/5.4 MB
Progress (2): 0.5/1.1 MB | 2.4/5.4 MB
Progress (2): 0.5/1.1 MB | 2.4/5.4 MB
Progress (2): 0.5/1.1 MB | 2.4/5.4 MB
Progress (2): 0.5/1.1 MB | 2.4/5.4 MB
Progress (2): 0.5/1.1 MB | 2.5/5.4 MB
Progress (2): 0.5/1.1 MB | 2.5/5.4 MB
Progress (2): 0.5/1.1 MB | 2.5/5.4 MB
Progress (2): 0.5/1.1 MB | 2.5/5.4 MB
Progress (2): 0.5/1.1 MB | 2.5/5.4 MB
Progress (2): 0.5/1.1 MB | 2.5/5.4 MB
Progress (2): 0.5/1.1 MB | 2.5/5.4 MB
Progress (2): 0.5/1.1 MB | 2.5/5.4 MB
Progress (2): 0.5/1.1 MB | 2.5/5.4 MB
Progress (2): 0.6/1.1 MB | 2.5/5.4 MB
Progress (2): 0.6/1.1 MB | 2.6/5.4 MB
Progress (2): 0.6/1.1 MB | 2.6/5.4 MB
Progress (2): 0.6/1.1 MB | 2.6/5.4 MB
Progress (2): 0.6/1.1 MB | 2.6/5.4 MB
Progress (2): 0.6/1.1 MB | 2.6/5.4 MB
Progress (2): 0.6/1.1 MB | 2.6/5.4 MB
Progress (2): 0.6/1.1 MB | 2.6/5.4 MB
Progress (2): 0.6/1.1 MB | 2.6/5.4 MB
Progress (2): 0.6/1.1 MB | 2.6/5.4 MB
Progress (2): 0.6/1.1 MB | 2.6/5.4 MB
Progress (2): 0.6/1.1 MB | 2.6/5.4 MB
Progress (2): 0.6/1.1 MB | 2.6/5.4 MB
Progress (2): 0.6/1.1 MB | 2.6/5.4 MB
Progress (2): 0.6/1.1 MB | 2.6/5.4 MB
Progress (2): 0.6/1.1 MB | 2.6/5.4 MB
Progress (2): 0.7/1.1 MB | 2.6/5.4 MB
Progress (2): 0.7/1.1 MB | 2.7/5.4 MB
Progress (2): 0.7/1.1 MB | 2.7/5.4 MB
Progress (2): 0.7/1.1 MB | 2.7/5.4 MB
Progress (2): 0.7/1.1 MB | 2.7/5.4 MB
Progress (2): 0.7/1.1 MB | 2.7/5.4 MB
Progress (2): 0.7/1.1 MB | 2.7/5.4 MB
Progress (2): 0.7/1.1 MB | 2.7/5.4 MB
Progress (2): 0.7/1.1 MB | 2.7/5.4 MB
Progress (2): 0.7/1.1 MB | 2.7/5.4 MB
Progress (2): 0.7/1.1 MB | 2.7/5.4 MB
Progress (2): 0.7/1.1 MB | 2.7/5.4 MB
Progress (2): 0.7/1.1 MB | 2.8/5.4 MB
Progress (2): 0.7/1.1 MB | 2.8/5.4 MB
Progress (2): 0.7/1.1 MB | 2.8/5.4 MB
Progress (2): 0.7/1.1 MB | 2.8/5.4 MB
Progress (2): 0.7/1.1 MB | 2.8/5.4 MB
Progress (2): 0.8/1.1 MB | 2.8/5.4 MB
Progress (2): 0.8/1.1 MB | 2.8/5.4 MB
Progress (2): 0.8/1.1 MB | 2.8/5.4 MB
Progress (2): 0.8/1.1 MB | 2.8/5.4 MB
Progress (2): 0.8/1.1 MB | 2.8/5.4 MB
Progress (2): 0.8/1.1 MB | 2.8/5.4 MB
Progress (2): 0.8/1.1 MB | 2.8/5.4 MB
Progress (2): 0.8/1.1 MB | 2.9/5.4 MB
Progress (2): 0.8/1.1 MB | 2.9/5.4 MB
Progress (2): 0.8/1.1 MB | 2.9/5.4 MB
Progress (2): 0.8/1.1 MB | 2.9/5.4 MB
Progress (2): 0.8/1.1 MB | 2.9/5.4 MB
Progress (2): 0.8/1.1 MB | 2.9/5.4 MB
Progress (2): 0.8/1.1 MB | 2.9/5.4 MB
Progress (2): 0.8/1.1 MB | 2.9/5.4 MB
Progress (2): 0.8/1.1 MB | 3.0/5.4 MB
Progress (2): 0.8/1.1 MB | 3.0/5.4 MB
Progress (2): 0.8/1.1 MB | 3.0/5.4 MB
Progress (2): 0.8/1.1 MB | 3.0/5.4 MB
Progress (2): 0.8/1.1 MB | 3.0/5.4 MB
Progress (2): 0.9/1.1 MB | 3.0/5.4 MB
Progress (2): 0.9/1.1 MB | 3.0/5.4 MB
Progress (2): 0.9/1.1 MB | 3.0/5.4 MB
Progress (2): 0.9/1.1 MB | 3.0/5.4 MB
Progress (2): 0.9/1.1 MB | 3.0/5.4 MB
Progress (2): 0.9/1.1 MB | 3.1/5.4 MB
Progress (2): 0.9/1.1 MB | 3.1/5.4 MB
Progress (2): 0.9/1.1 MB | 3.1/5.4 MB
Progress (2): 0.9/1.1 MB | 3.1/5.4 MB
Progress (2): 0.9/1.1 MB | 3.1/5.4 MB
Progress (2): 0.9/1.1 MB | 3.1/5.4 MB
Progress (3): 0.9/1.1 MB | 3.1/5.4 MB | 4.1/85 kB
Progress (3): 0.9/1.1 MB | 3.1/5.4 MB | 4.1/85 kB
Progress (3): 0.9/1.1 MB | 3.1/5.4 MB | 7.7/85 kB
Progress (3): 0.9/1.1 MB | 3.1/5.4 MB | 7.7/85 kB
Progress (3): 0.9/1.1 MB | 3.1/5.4 MB | 12/85 kB 
Progress (3): 0.9/1.1 MB | 3.1/5.4 MB | 12/85 kB
Progress (3): 0.9/1.1 MB | 3.1/5.4 MB | 16/85 kB
Progress (3): 0.9/1.1 MB | 3.1/5.4 MB | 16/85 kB
Progress (3): 0.9/1.1 MB | 3.1/5.4 MB | 20/85 kB
Progress (3): 0.9/1.1 MB | 3.2/5.4 MB | 20/85 kB
Progress (3): 0.9/1.1 MB | 3.2/5.4 MB | 24/85 kB
Progress (3): 0.9/1.1 MB | 3.2/5.4 MB | 24/85 kB
Progress (3): 0.9/1.1 MB | 3.2/5.4 MB | 28/85 kB
Progress (3): 1.0/1.1 MB | 3.2/5.4 MB | 28/85 kB
Progress (3): 1.0/1.1 MB | 3.2/5.4 MB | 32/85 kB
Progress (3): 1.0/1.1 MB | 3.2/5.4 MB | 32/85 kB
Progress (3): 1.0/1.1 MB | 3.2/5.4 MB | 32/85 kB
Progress (3): 1.0/1.1 MB | 3.2/5.4 MB | 36/85 kB
Progress (3): 1.0/1.1 MB | 3.2/5.4 MB | 36/85 kB
Progress (3): 1.0/1.1 MB | 3.2/5.4 MB | 40/85 kB
Progress (3): 1.0/1.1 MB | 3.2/5.4 MB | 40/85 kB
Progress (3): 1.0/1.1 MB | 3.2/5.4 MB | 44/85 kB
Progress (3): 1.0/1.1 MB | 3.2/5.4 MB | 48/85 kB
Progress (3): 1.0/1.1 MB | 3.2/5.4 MB | 48/85 kB
Progress (3): 1.0/1.1 MB | 3.2/5.4 MB | 48/85 kB
Progress (3): 1.0/1.1 MB | 3.2/5.4 MB | 52/85 kB
Progress (3): 1.0/1.1 MB | 3.2/5.4 MB | 52/85 kB
Progress (3): 1.0/1.1 MB | 3.2/5.4 MB | 56/85 kB
Progress (3): 1.0/1.1 MB | 3.2/5.4 MB | 56/85 kB
Progress (3): 1.0/1.1 MB | 3.2/5.4 MB | 60/85 kB
Progress (3): 1.0/1.1 MB | 3.2/5.4 MB | 64/85 kB
Progress (3): 1.0/1.1 MB | 3.3/5.4 MB | 64/85 kB
Progress (3): 1.0/1.1 MB | 3.3/5.4 MB | 64/85 kB
Progress (3): 1.0/1.1 MB | 3.3/5.4 MB | 64/85 kB
Progress (3): 1.0/1.1 MB | 3.3/5.4 MB | 64/85 kB
Progress (3): 1.0/1.1 MB | 3.3/5.4 MB | 64/85 kB
Progress (3): 1.0/1.1 MB | 3.3/5.4 MB | 64/85 kB
Progress (3): 1.0/1.1 MB | 3.3/5.4 MB | 64/85 kB
Progress (3): 1.0/1.1 MB | 3.3/5.4 MB | 64/85 kB
Progress (3): 1.0/1.1 MB | 3.3/5.4 MB | 64/85 kB
Progress (3): 1.1/1.1 MB | 3.3/5.4 MB | 64/85 kB
Progress (3): 1.1/1.1 MB | 3.3/5.4 MB | 64/85 kB
Progress (3): 1.1/1.1 MB | 3.4/5.4 MB | 64/85 kB
Progress (3): 1.1/1.1 MB | 3.4/5.4 MB | 64/85 kB
Progress (3): 1.1/1.1 MB | 3.4/5.4 MB | 64/85 kB
Progress (3): 1.1/1.1 MB | 3.4/5.4 MB | 64/85 kB
Progress (3): 1.1/1.1 MB | 3.4/5.4 MB | 64/85 kB
Progress (3): 1.1/1.1 MB | 3.4/5.4 MB | 64/85 kB
Progress (3): 1.1/1.1 MB | 3.4/5.4 MB | 64/85 kB
Progress (3): 1.1/1.1 MB | 3.4/5.4 MB | 64/85 kB
Progress (3): 1.1/1.1 MB | 3.4/5.4 MB | 64/85 kB
Progress (3): 1.1/1.1 MB | 3.4/5.4 MB | 64/85 kB
Progress (3): 1.1/1.1 MB | 3.5/5.4 MB | 64/85 kB
Progress (3): 1.1/1.1 MB | 3.5/5.4 MB | 64/85 kB
Progress (3): 1.1 MB | 3.5/5.4 MB | 64/85 kB    
Progress (3): 1.1 MB | 3.5/5.4 MB | 64/85 kB
Progress (3): 1.1 MB | 3.5/5.4 MB | 64/85 kB
Progress (3): 1.1 MB | 3.6/5.4 MB | 64/85 kB
Progress (3): 1.1 MB | 3.6/5.4 MB | 64/85 kB
Progress (3): 1.1 MB | 3.6/5.4 MB | 64/85 kB
Progress (3): 1.1 MB | 3.6/5.4 MB | 64/85 kB
Progress (3): 1.1 MB | 3.7/5.4 MB | 64/85 kB
Progress (3): 1.1 MB | 3.7/5.4 MB | 64/85 kB
Progress (3): 1.1 MB | 3.7/5.4 MB | 64/85 kB
Progress (3): 1.1 MB | 3.8/5.4 MB | 64/85 kB
Progress (3): 1.1 MB | 3.8/5.4 MB | 64/85 kB
                                            
Downloaded from eclipse.maven.central.mirror: https://repo.eclipse.org/content/repositories/maven_central/org/apache/maven/wagon/wagon-http/2.4/wagon-http-2.4-shaded.jar (1.1 MB at 2.8 MB/s)
Progress (2): 3.8/5.4 MB | 64/85 kB
                                   
Downloading from eclipse.maven.central.mirror: https://repo.eclipse.org/content/repositories/maven_central/org/eclipse/jetty/jetty-webapp/8.1.1.v20120215/jetty-webapp-8.1.1.v20120215.jar
Progress (2): 3.9/5.4 MB | 64/85 kB
Progress (2): 3.9/5.4 MB | 64/85 kB
Progress (2): 3.9/5.4 MB | 64/85 kB
Progress (2): 4.0/5.4 MB | 64/85 kB
Progress (2): 4.0/5.4 MB | 64/85 kB
Progress (2): 4.0/5.4 MB | 64/85 kB
Progress (2): 4.1/5.4 MB | 64/85 kB
Progress (2): 4.1/5.4 MB | 64/85 kB
Progress (2): 4.1/5.4 MB | 64/85 kB
Progress (2): 4.2/5.4 MB | 64/85 kB
Progress (2): 4.2/5.4 MB | 64/85 kB
Progress (2): 4.2/5.4 MB | 64/85 kB
Progress (2): 4.3/5.4 MB | 64/85 kB
Progress (2): 4.3/5.4 MB | 64/85 kB
Progress (2): 4.3/5.4 MB | 64/85 kB
Progress (2): 4.4/5.4 MB | 64/85 kB
Progress (2): 4.4/5.4 MB | 64/85 kB
Progress (2): 4.4/5.4 MB | 64/85 kB
Progress (2): 4.4/5.4 MB | 64/85 kB
Progress (2): 4.5/5.4 MB | 64/85 kB
Progress (2): 4.5/5.4 MB | 64/85 kB
Progress (2): 4.5/5.4 MB | 64/85 kB
Progress (2): 4.6/5.4 MB | 64/85 kB
Progress (2): 4.6/5.4 MB | 64/85 kB
Progress (2): 4.6/5.4 MB | 64/85 kB
Progress (2): 4.7/5.4 MB | 64/85 kB
Progress (2): 4.7/5.4 MB | 64/85 kB
Progress (2): 4.7/5.4 MB | 64/85 kB
Progress (2): 4.8/5.4 MB | 64/85 kB
Progress (2): 4.8/5.4 MB | 64/85 kB
Progress (2): 4.8/5.4 MB | 64/85 kB
Progress (2): 4.9/5.4 MB | 64/85 kB
Progress (2): 4.9/5.4 MB | 64/85 kB
Progress (2): 4.9/5.4 MB | 64/85 kB
Progress (2): 5.0/5.4 MB | 64/85 kB
Progress (2): 5.0/5.4 MB | 64/85 kB
Progress (2): 5.0/5.4 MB | 64/85 kB
Progress (2): 5.1/5.4 MB | 64/85 kB
Progress (2): 5.1/5.4 MB | 64/85 kB
Progress (2): 5.1/5.4 MB | 64/85 kB
Progress (2): 5.2/5.4 MB | 64/85 kB
Progress (2): 5.2/5.4 MB | 64/85 kB
Progress (2): 5.2/5.4 MB | 64/85 kB
Progress (2): 5.2/5.4 MB | 64/85 kB
Progress (2): 5.3/5.4 MB | 64/85 kB
Progress (2): 5.3/5.4 MB | 64/85 kB
Progress (2): 5.3/5.4 MB | 64/85 kB
Progress (2): 5.4/5.4 MB | 64/85 kB
Progress (2): 5.4/5.4 MB | 64/85 kB
Progress (2): 5.4 MB | 64/85 kB    
                               
Downloaded from eclipse.maven.central.mirror: https://repo.eclipse.org/content/repositories/maven_central/org/apache/maven/apache-maven/3.1.0/apache-maven-3.1.0-bin.tar.gz (5.4 MB at 12 MB/s)
Downloading from eclipse.maven.central.mirror: https://repo.eclipse.org/content/repositories/maven_central/org/eclipse/jetty/jetty-xml/8.1.1.v20120215/jetty-xml-8.1.1.v20120215.jar
Progress (1): 69/85 kB
Progress (1): 73/85 kB
Progress (1): 77/85 kB
Progress (1): 81/85 kB
Progress (1): 85/85 kB
Progress (1): 85 kB   
                   
Downloaded from eclipse.maven.central.mirror: https://repo.eclipse.org/content/repositories/maven_central/javax/servlet/javax.servlet-api/3.0.1/javax.servlet-api-3.0.1.jar (85 kB at 163 kB/s)
Downloading from eclipse.maven.central.mirror: https://repo.eclipse.org/content/repositories/maven_central/org/eclipse/jetty/jetty-servlet/8.1.1.v20120215/jetty-servlet-8.1.1.v20120215.jar
Progress (1): 4.1/68 kB
Progress (1): 7.7/68 kB
Progress (1): 12/68 kB 
Progress (1): 16/68 kB
Progress (1): 20/68 kB
Progress (1): 24/68 kB
Progress (1): 28/68 kB
Progress (1): 32/68 kB
Progress (1): 36/68 kB
Progress (1): 40/68 kB
Progress (1): 44/68 kB
Progress (1): 48/68 kB
Progress (1): 52/68 kB
Progress (1): 56/68 kB
Progress (1): 60/68 kB
Progress (1): 64/68 kB
Progress (1): 68 kB   
Progress (2): 68 kB | 4.1/11 kB
Progress (2): 68 kB | 7.7/11 kB
Progress (2): 68 kB | 11 kB    
                           
Downloaded from eclipse.maven.central.mirror: https://repo.eclipse.org/content/repositories/maven_central/org/slf4j/slf4j-simple/1.7.4/slf4j-simple-1.7.4.jar (11 kB at 19 kB/s)
Downloading from eclipse.maven.central.mirror: https://repo.eclipse.org/content/repositories/maven_central/org/eclipse/jetty/jetty-security/8.1.1.v20120215/jetty-security-8.1.1.v20120215.jar
Downloaded from eclipse.maven.central.mirror: https://repo.eclipse.org/content/repositories/maven_central/org/sonatype/plexus/plexus-jetty-testsuite/2.1/plexus-jetty-testsuite-2.1.jar (68 kB at 123 kB/s)
Downloading from eclipse.maven.central.mirror: https://repo.eclipse.org/content/repositories/maven_central/org/eclipse/jetty/jetty-server/8.1.1.v20120215/jetty-server-8.1.1.v20120215.jar
Progress (1): 4.1/107 kB
Progress (1): 7.7/107 kB
Progress (1): 12/107 kB 
Progress (1): 16/107 kB
Progress (1): 20/107 kB
Progress (1): 24/107 kB
Progress (1): 28/107 kB
Progress (1): 32/107 kB
Progress (1): 36/107 kB
Progress (1): 40/107 kB
Progress (1): 44/107 kB
Progress (1): 48/107 kB
Progress (1): 52/107 kB
Progress (1): 56/107 kB
Progress (1): 60/107 kB
Progress (1): 64/107 kB
Progress (1): 69/107 kB
Progress (1): 73/107 kB
Progress (1): 77/107 kB
Progress (1): 81/107 kB
Progress (1): 85/107 kB
Progress (1): 89/107 kB
Progress (1): 93/107 kB
Progress (1): 97/107 kB
Progress (1): 101/107 kB
Progress (1): 105/107 kB
Progress (1): 107 kB    
Progress (2): 107 kB | 4.1/38 kB
Progress (2): 107 kB | 7.7/38 kB
Progress (2): 107 kB | 12/38 kB 
Progress (2): 107 kB | 16/38 kB
Progress (2): 107 kB | 20/38 kB
Progress (2): 107 kB | 24/38 kB
                               
Downloaded from eclipse.maven.central.mirror: https://repo.eclipse.org/content/repositories/maven_central/org/eclipse/jetty/jetty-webapp/8.1.1.v20120215/jetty-webapp-8.1.1.v20120215.jar (107 kB at 162 kB/s)
Progress (1): 28/38 kB
                      
Downloading from eclipse.maven.central.mirror: https://repo.eclipse.org/content/repositories/maven_central/org/eclipse/jetty/orbit/javax.servlet/3.0.0.v201112011016/javax.servlet-3.0.0.v201112011016.jar
Progress (1): 32/38 kB
Progress (1): 36/38 kB
Progress (1): 38 kB   
Progress (2): 38 kB | 4.1/86 kB
Progress (2): 38 kB | 7.7/86 kB
Progress (2): 38 kB | 12/86 kB 
Progress (2): 38 kB | 16/86 kB
Progress (2): 38 kB | 20/86 kB
Progress (2): 38 kB | 24/86 kB
Progress (2): 38 kB | 28/86 kB
Progress (2): 38 kB | 32/86 kB
Progress (2): 38 kB | 36/86 kB
Progress (2): 38 kB | 40/86 kB
Progress (2): 38 kB | 44/86 kB
Progress (2): 38 kB | 48/86 kB
Progress (2): 38 kB | 52/86 kB
Progress (2): 38 kB | 56/86 kB
Progress (2): 38 kB | 60/86 kB
Progress (2): 38 kB | 64/86 kB
Progress (2): 38 kB | 69/86 kB
Progress (2): 38 kB | 73/86 kB
Progress (2): 38 kB | 77/86 kB
Progress (2): 38 kB | 81/86 kB
Progress (2): 38 kB | 85/86 kB
Progress (2): 38 kB | 86 kB   
                           
Downloaded from eclipse.maven.central.mirror: https://repo.eclipse.org/content/repositories/maven_central/org/eclipse/jetty/jetty-xml/8.1.1.v20120215/jetty-xml-8.1.1.v20120215.jar (38 kB at 56 kB/s)
Downloading from eclipse.maven.central.mirror: https://repo.eclipse.org/content/repositories/maven_central/org/eclipse/jetty/jetty-client/8.1.1.v20120215/jetty-client-8.1.1.v20120215.jar
Progress (2): 86 kB | 4.1/95 kB
Progress (2): 86 kB | 7.7/95 kB
Progress (2): 86 kB | 12/95 kB 
Progress (2): 86 kB | 16/95 kB
Progress (2): 86 kB | 20/95 kB
Progress (2): 86 kB | 24/95 kB
Progress (2): 86 kB | 28/95 kB
Progress (2): 86 kB | 32/95 kB
                              
Downloaded from eclipse.maven.central.mirror: https://repo.eclipse.org/content/repositories/maven_central/org/eclipse/jetty/jetty-security/8.1.1.v20120215/jetty-security-8.1.1.v20120215.jar (86 kB at 127 kB/s)
Downloading from eclipse.maven.central.mirror: https://repo.eclipse.org/content/repositories/maven_central/org/eclipse/jetty/jetty-http/8.1.1.v20120215/jetty-http-8.1.1.v20120215.jar
Progress (1): 36/95 kB
Progress (1): 40/95 kB
Progress (1): 44/95 kB
Progress (1): 48/95 kB
Progress (1): 52/95 kB
Progress (1): 56/95 kB
Progress (1): 60/95 kB
Progress (1): 64/95 kB
Progress (1): 69/95 kB
Progress (1): 73/95 kB
Progress (1): 77/95 kB
Progress (1): 81/95 kB
Progress (1): 85/95 kB
Progress (1): 89/95 kB
Progress (1): 93/95 kB
Progress (1): 95 kB   
                   
Downloaded from eclipse.maven.central.mirror: https://repo.eclipse.org/content/repositories/maven_central/org/eclipse/jetty/jetty-servlet/8.1.1.v20120215/jetty-servlet-8.1.1.v20120215.jar (95 kB at 139 kB/s)
Downloading from eclipse.maven.central.mirror: https://repo.eclipse.org/content/repositories/maven_central/org/eclipse/jetty/jetty-io/8.1.1.v20120215/jetty-io-8.1.1.v20120215.jar
Progress (1): 4.1/330 kB
Progress (1): 7.7/330 kB
Progress (1): 12/330 kB 
Progress (1): 16/330 kB
Progress (1): 20/330 kB
Progress (1): 24/330 kB
Progress (1): 28/330 kB
Progress (1): 32/330 kB
Progress (1): 36/330 kB
Progress (1): 40/330 kB
Progress (1): 44/330 kB
Progress (1): 48/330 kB
Progress (1): 52/330 kB
Progress (1): 56/330 kB
Progress (1): 60/330 kB
Progress (1): 64/330 kB
Progress (1): 69/330 kB
Progress (1): 73/330 kB
Progress (1): 77/330 kB
Progress (1): 81/330 kB
Progress (1): 85/330 kB
Progress (1): 89/330 kB
Progress (1): 93/330 kB
Progress (1): 97/330 kB
Progress (1): 101/330 kB
Progress (1): 105/330 kB
Progress (1): 109/330 kB
Progress (1): 113/330 kB
Progress (1): 117/330 kB
Progress (1): 121/330 kB
Progress (1): 125/330 kB
Progress (1): 129/330 kB
Progress (1): 133/330 kB
Progress (1): 137/330 kB
Progress (1): 141/330 kB
Progress (1): 145/330 kB
Progress (1): 149/330 kB
Progress (1): 153/330 kB
Progress (1): 157/330 kB
Progress (1): 161/330 kB
Progress (1): 165/330 kB
Progress (1): 169/330 kB
Progress (1): 173/330 kB
Progress (1): 177/330 kB
Progress (1): 181/330 kB
Progress (1): 185/330 kB
Progress (1): 189/330 kB
Progress (1): 193/330 kB
Progress (1): 197/330 kB
Progress (1): 201/330 kB
Progress (1): 205/330 kB
Progress (1): 209/330 kB
Progress (1): 213/330 kB
Progress (1): 217/330 kB
Progress (1): 221/330 kB
Progress (1): 225/330 kB
Progress (1): 229/330 kB
Progress (1): 233/330 kB
Progress (1): 237/330 kB
Progress (1): 241/330 kB
Progress (1): 245/330 kB
Progress (1): 249/330 kB
Progress (1): 253/330 kB
Progress (1): 257/330 kB
Progress (1): 261/330 kB
Progress (1): 265/330 kB
Progress (1): 269/330 kB
Progress (1): 273/330 kB
Progress (1): 277/330 kB
Progress (1): 281/330 kB
Progress (1): 285/330 kB
Progress (1): 289/330 kB
Progress (1): 293/330 kB
Progress (1): 297/330 kB
Progress (1): 301/330 kB
Progress (1): 305/330 kB
Progress (1): 309/330 kB
Progress (1): 313/330 kB
Progress (1): 317/330 kB
Progress (1): 321/330 kB
Progress (1): 325/330 kB
Progress (1): 329/330 kB
Progress (1): 330 kB    
                    
Downloaded from eclipse.maven.central.mirror: https://repo.eclipse.org/content/repositories/maven_central/org/eclipse/jetty/jetty-server/8.1.1.v20120215/jetty-server-8.1.1.v20120215.jar (330 kB at 463 kB/s)
Downloading from eclipse.maven.central.mirror: https://repo.eclipse.org/content/repositories/maven_central/org/eclipse/jetty/jetty-servlets/8.1.1.v20120215/jetty-servlets-8.1.1.v20120215.jar
Progress (1): 4.1/200 kB
Progress (1): 7.7/200 kB
Progress (1): 12/200 kB 
Progress (1): 16/200 kB
Progress (1): 20/200 kB
Progress (1): 24/200 kB
Progress (1): 28/200 kB
Progress (1): 32/200 kB
Progress (1): 36/200 kB
Progress (1): 40/200 kB
Progress (1): 44/200 kB
Progress (1): 48/200 kB
Progress (1): 52/200 kB
Progress (1): 56/200 kB
Progress (1): 60/200 kB
Progress (1): 64/200 kB
Progress (1): 69/200 kB
Progress (1): 73/200 kB
Progress (1): 77/200 kB
Progress (1): 81/200 kB
Progress (1): 85/200 kB
Progress (1): 89/200 kB
Progress (1): 93/200 kB
Progress (1): 97/200 kB
Progress (1): 101/200 kB
Progress (1): 105/200 kB
Progress (1): 109/200 kB
Progress (1): 114/200 kB
Progress (1): 118/200 kB
Progress (1): 122/200 kB
Progress (1): 126/200 kB
Progress (1): 130/200 kB
Progress (1): 134/200 kB
Progress (1): 138/200 kB
Progress (1): 142/200 kB
Progress (1): 146/200 kB
Progress (1): 150/200 kB
Progress (1): 155/200 kB
Progress (1): 159/200 kB
Progress (1): 163/200 kB
Progress (1): 167/200 kB
Progress (1): 171/200 kB
Progress (1): 175/200 kB
Progress (1): 179/200 kB
Progress (1): 183/200 kB
Progress (1): 187/200 kB
Progress (1): 191/200 kB
Progress (1): 196/200 kB
Progress (1): 200/200 kB
Progress (1): 200 kB    
                    
Downloaded from eclipse.maven.central.mirror: https://repo.eclipse.org/content/repositories/maven_central/org/eclipse/jetty/orbit/javax.servlet/3.0.0.v201112011016/javax.servlet-3.0.0.v201112011016.jar (200 kB at 273 kB/s)
Downloading from eclipse.maven.central.mirror: https://repo.eclipse.org/content/repositories/maven_central/org/eclipse/jetty/jetty-continuation/8.1.1.v20120215/jetty-continuation-8.1.1.v20120215.jar
Progress (1): 4.1/93 kB
Progress (1): 7.7/93 kB
Progress (1): 12/93 kB 
Progress (1): 16/93 kB
Progress (1): 20/93 kB
Progress (1): 24/93 kB
Progress (1): 28/93 kB
Progress (1): 32/93 kB
Progress (1): 36/93 kB
Progress (1): 40/93 kB
Progress (1): 44/93 kB
Progress (1): 48/93 kB
Progress (1): 52/93 kB
Progress (1): 56/93 kB
Progress (1): 60/93 kB
Progress (1): 64/93 kB
Progress (1): 69/93 kB
Progress (1): 73/93 kB
Progress (1): 77/93 kB
Progress (1): 81/93 kB
Progress (1): 85/93 kB
Progress (1): 89/93 kB
Progress (1): 93/93 kB
Progress (1): 93 kB   
Progress (2): 93 kB | 4.1/101 kB
Progress (2): 93 kB | 7.7/101 kB
Progress (2): 93 kB | 12/101 kB 
Progress (2): 93 kB | 16/101 kB
Progress (2): 93 kB | 20/101 kB
Progress (2): 93 kB | 24/101 kB
Progress (2): 93 kB | 28/101 kB
Progress (2): 93 kB | 32/101 kB
                               
Downloaded from eclipse.maven.central.mirror: https://repo.eclipse.org/content/repositories/maven_central/org/eclipse/jetty/jetty-http/8.1.1.v20120215/jetty-http-8.1.1.v20120215.jar (93 kB at 119 kB/s)
Downloading from eclipse.maven.central.mirror: https://repo.eclipse.org/content/repositories/maven_central/org/eclipse/jetty/jetty-util/8.1.1.v20120215/jetty-util-8.1.1.v20120215.jar
Progress (1): 36/101 kB
Progress (1): 40/101 kB
Progress (1): 44/101 kB
Progress (1): 48/101 kB
Progress (1): 52/101 kB
Progress (1): 56/101 kB
Progress (1): 60/101 kB
Progress (1): 64/101 kB
Progress (1): 69/101 kB
Progress (1): 73/101 kB
Progress (1): 77/101 kB
Progress (1): 81/101 kB
Progress (1): 85/101 kB
Progress (1): 89/101 kB
Progress (1): 93/101 kB
Progress (1): 97/101 kB
Progress (1): 101/101 kB
Progress (1): 101 kB    
                    
Downloaded from eclipse.maven.central.mirror: https://repo.eclipse.org/content/repositories/maven_central/org/eclipse/jetty/jetty-io/8.1.1.v20120215/jetty-io-8.1.1.v20120215.jar (101 kB at 127 kB/s)
Progress (1): 4.1/72 kB
Progress (1): 7.7/72 kB
Progress (1): 12/72 kB 
Progress (1): 16/72 kB
Progress (1): 20/72 kB
Progress (1): 24/72 kB
Progress (1): 28/72 kB
Progress (1): 32/72 kB
Progress (1): 36/72 kB
Progress (1): 40/72 kB
Progress (1): 44/72 kB
Progress (1): 48/72 kB
Progress (1): 52/72 kB
Progress (1): 56/72 kB
Progress (1): 60/72 kB
Progress (1): 64/72 kB
Progress (1): 69/72 kB
Progress (1): 72 kB   
Progress (2): 72 kB | 4.1/21 kB
Progress (2): 72 kB | 7.7/21 kB
Progress (2): 72 kB | 12/21 kB 
Progress (2): 72 kB | 16/21 kB
Progress (2): 72 kB | 20/21 kB
Progress (2): 72 kB | 21 kB   
                           
Downloaded from eclipse.maven.central.mirror: https://repo.eclipse.org/content/repositories/maven_central/org/eclipse/jetty/jetty-continuation/8.1.1.v20120215/jetty-continuation-8.1.1.v20120215.jar (21 kB at 26 kB/s)
Downloaded from eclipse.maven.central.mirror: https://repo.eclipse.org/content/repositories/maven_central/org/eclipse/jetty/jetty-servlets/8.1.1.v20120215/jetty-servlets-8.1.1.v20120215.jar (72 kB at 87 kB/s)
Progress (1): 4.1/87 kB
Progress (1): 7.7/87 kB
Progress (1): 12/87 kB 
Progress (1): 16/87 kB
Progress (1): 20/87 kB
Progress (1): 24/87 kB
Progress (1): 28/87 kB
Progress (1): 32/87 kB
Progress (1): 36/87 kB
Progress (1): 40/87 kB
Progress (1): 44/87 kB
Progress (1): 48/87 kB
Progress (1): 52/87 kB
Progress (1): 56/87 kB
Progress (1): 60/87 kB
Progress (1): 64/87 kB
Progress (1): 69/87 kB
Progress (1): 73/87 kB
Progress (1): 77/87 kB
Progress (1): 81/87 kB
Progress (1): 85/87 kB
Progress (1): 87 kB   
                   
Downloaded from eclipse.maven.central.mirror: https://repo.eclipse.org/content/repositories/maven_central/org/eclipse/jetty/jetty-client/8.1.1.v20120215/jetty-client-8.1.1.v20120215.jar (87 kB at 97 kB/s)
Progress (1): 4.1/268 kB
Progress (1): 7.7/268 kB
Progress (1): 12/268 kB 
Progress (1): 16/268 kB
Progress (1): 20/268 kB
Progress (1): 24/268 kB
Progress (1): 28/268 kB
Progress (1): 32/268 kB
Progress (1): 36/268 kB
Progress (1): 40/268 kB
Progress (1): 44/268 kB
Progress (1): 48/268 kB
Progress (1): 52/268 kB
Progress (1): 56/268 kB
Progress (1): 60/268 kB
Progress (1): 64/268 kB
Progress (1): 69/268 kB
Progress (1): 73/268 kB
Progress (1): 77/268 kB
Progress (1): 81/268 kB
Progress (1): 85/268 kB
Progress (1): 89/268 kB
Progress (1): 93/268 kB
Progress (1): 97/268 kB
Progress (1): 101/268 kB
Progress (1): 105/268 kB
Progress (1): 109/268 kB
Progress (1): 114/268 kB
Progress (1): 118/268 kB
Progress (1): 122/268 kB
Progress (1): 126/268 kB
Progress (1): 130/268 kB
Progress (1): 134/268 kB
Progress (1): 138/268 kB
Progress (1): 142/268 kB
Progress (1): 146/268 kB
Progress (1): 150/268 kB
Progress (1): 154/268 kB
Progress (1): 158/268 kB
Progress (1): 162/268 kB
Progress (1): 166/268 kB
Progress (1): 170/268 kB
Progress (1): 175/268 kB
Progress (1): 179/268 kB
Progress (1): 183/268 kB
Progress (1): 187/268 kB
Progress (1): 191/268 kB
Progress (1): 195/268 kB
Progress (1): 199/268 kB
Progress (1): 203/268 kB
Progress (1): 207/268 kB
Progress (1): 211/268 kB
Progress (1): 216/268 kB
Progress (1): 220/268 kB
Progress (1): 224/268 kB
Progress (1): 228/268 kB
Progress (1): 232/268 kB
Progress (1): 236/268 kB
Progress (1): 240/268 kB
Progress (1): 244/268 kB
Progress (1): 248/268 kB
Progress (1): 252/268 kB
Progress (1): 257/268 kB
Progress (1): 261/268 kB
Progress (1): 265/268 kB
Progress (1): 268 kB    
                    
Downloaded from eclipse.maven.central.mirror: https://repo.eclipse.org/content/repositories/maven_central/org/eclipse/jetty/jetty-util/8.1.1.v20120215/jetty-util-8.1.1.v20120215.jar (268 kB at 291 kB/s)
[INFO] 
[INFO] --- maven-clean-plugin:3.1.0:clean (default-clean) @ tycho-its ---
[INFO] 
[INFO] --- maven-dependency-plugin:3.1.1:unpack-dependencies (unpack-maven) @ tycho-its ---
[INFO] Unpacking /home/hudson/genie.tycho/.jenkins/jobs/tycho-build-with-maven-snapshots/workspace/.m2/repo/org/apache/maven/apache-maven/3.1.0/apache-maven-3.1.0-bin.tar.gz to /jobs/genie.tycho/tycho-build-with-maven-snapshots/workspace/tycho-its/target with includes "" and excludes ""
[INFO] Expanding: /home/hudson/genie.tycho/.jenkins/jobs/tycho-build-with-maven-snapshots/workspace/.m2/repo/org/apache/maven/apache-maven/3.1.0/apache-maven-3.1.0-bin.tar.gz into /jobs/genie.tycho/tycho-build-with-maven-snapshots/workspace/tycho-its/target
[INFO] 
[INFO] --- maven-dependency-plugin:3.1.1:unpack (unpack-eclipse-sdk) @ tycho-its ---
[INFO] Configured Artifact: org.eclipse.tycho.ci:eclipse-SDK:win32:3.6.2:zip
Downloading from eclipse.maven.central.mirror: https://repo.eclipse.org/content/repositories/maven_central/org/eclipse/tycho/ci/eclipse-SDK/3.6.2/eclipse-SDK-3.6.2.pom
[WARNING] The POM for org.eclipse.tycho.ci:eclipse-SDK:zip:win32:3.6.2 is missing, no dependency information available
Downloading from eclipse.maven.central.mirror: https://repo.eclipse.org/content/repositories/maven_central/org/eclipse/tycho/ci/eclipse-SDK/3.6.2/eclipse-SDK-3.6.2-win32.zip
Progress (1): 0.3/179 MB
Progress (1): 0.5/179 MB
Progress (1): 0.8/179 MB
Progress (1): 1.1/179 MB
Progress (1): 1.3/179 MB
Progress (1): 1.6/179 MB
Progress (1): 1.9/179 MB
Progress (1): 2.1/179 MB
Progress (1): 2.4/179 MB
Progress (1): 2.6/179 MB
Progress (1): 2.9/179 MB
Progress (1): 3.2/179 MB
Progress (1): 3.4/179 MB
Progress (1): 3.7/179 MB
Progress (1): 4.0/179 MB
Progress (1): 4.2/179 MB
Progress (1): 4.5/179 MB
Progress (1): 4.8/179 MB
Progress (1): 5.0/179 MB
Progress (1): 5.3/179 MB
Progress (1): 5.5/179 MB
Progress (1): 5.8/179 MB
Progress (1): 6.1/179 MB
Progress (1): 6.3/179 MB
Progress (1): 6.6/179 MB
Progress (1): 6.9/179 MB
Progress (1): 7.1/179 MB
Progress (1): 7.4/179 MB
Progress (1): 7.7/179 MB
Progress (1): 7.9/179 MB
Progress (1): 8.2/179 MB
Progress (1): 8.5/179 MB
Progress (1): 8.7/179 MB
Progress (1): 9.0/179 MB
Progress (1): 9.2/179 MB
Progress (1): 9.5/179 MB
Progress (1): 9.8/179 MB
Progress (1): 10/179 MB 
Progress (1): 10/179 MB
Progress (1): 11/179 MB
Progress (1): 11/179 MB
Progress (1): 11/179 MB
Progress (1): 11/179 MB
Progress (1): 12/179 MB
Progress (1): 12/179 MB
Progress (1): 12/179 MB
Progress (1): 12/179 MB
Progress (1): 13/179 MB
Progress (1): 13/179 MB
Progress (1): 13/179 MB
Progress (1): 13/179 MB
Progress (1): 14/179 MB
Progress (1): 14/179 MB
Progress (1): 14/179 MB
Progress (1): 15/179 MB
Progress (1): 15/179 MB
Progress (1): 15/179 MB
Progress (1): 15/179 MB
Progress (1): 16/179 MB
Progress (1): 16/179 MB
Progress (1): 16/179 MB
Progress (1): 16/179 MB
Progress (1): 17/179 MB
Progress (1): 17/179 MB
Progress (1): 17/179 MB
Progress (1): 17/179 MB
Progress (1): 18/179 MB
Progress (1): 18/179 MB
Progress (1): 18/179 MB
Progress (1): 18/179 MB
Progress (1): 19/179 MB
Progress (1): 19/179 MB
Progress (1): 19/179 MB
Progress (1): 20/179 MB
Progress (1): 20/179 MB
Progress (1): 20/179 MB
Progress (1): 20/179 MB
Progress (1): 21/179 MB
Progress (1): 21/179 MB
Progress (1): 21/179 MB
Progress (1): 21/179 MB
Progress (1): 22/179 MB
Progress (1): 22/179 MB
Progress (1): 22/179 MB
Progress (1): 22/179 MB
Progress (1): 23/179 MB
Progress (1): 23/179 MB
Progress (1): 23/179 MB
Progress (1): 23/179 MB
Progress (1): 24/179 MB
Progress (1): 24/179 MB
Progress (1): 24/179 MB
Progress (1): 25/179 MB
Progress (1): 25/179 MB
Progress (1): 25/179 MB
Progress (1): 25/179 MB
Progress (1): 26/179 MB
Progress (1): 26/179 MB
Progress (1): 26/179 MB
Progress (1): 26/179 MB
Progress (1): 27/179 MB
Progress (1): 27/179 MB
Progress (1): 27/179 MB
Progress (1): 27/179 MB
Progress (1): 28/179 MB
Progress (1): 28/179 MB
Progress (1): 28/179 MB
Progress (1): 29/179 MB
Progress (1): 29/179 MB
Progress (1): 29/179 MB
Progress (1): 29/179 MB
Progress (1): 30/179 MB
Progress (1): 30/179 MB
Progress (1): 30/179 MB
Progress (1): 30/179 MB
Progress (1): 31/179 MB
Progress (1): 31/179 MB
Progress (1): 31/179 MB
Progress (1): 31/179 MB
Progress (1): 32/179 MB
Progress (1): 32/179 MB
Progress (1): 32/179 MB
Progress (1): 32/179 MB
Progress (1): 33/179 MB
Progress (1): 33/179 MB
Progress (1): 33/179 MB
Progress (1): 34/179 MB
Progress (1): 34/179 MB
Progress (1): 34/179 MB
Progress (1): 34/179 MB
Progress (1): 35/179 MB
Progress (1): 35/179 MB
Progress (1): 35/179 MB
Progress (1): 35/179 MB
Progress (1): 36/179 MB
Progress (1): 36/179 MB
Progress (1): 36/179 MB
Progress (1): 36/179 MB
Progress (1): 37/179 MB
Progress (1): 37/179 MB
Progress (1): 37/179 MB
Progress (1): 37/179 MB
Progress (1): 38/179 MB
Progress (1): 38/179 MB
Progress (1): 38/179 MB
Progress (1): 39/179 MB
Progress (1): 39/179 MB
Progress (1): 39/179 MB
Progress (1): 39/179 MB
Progress (1): 40/179 MB
Progress (1): 40/179 MB
Progress (1): 40/179 MB
Progress (1): 40/179 MB
Progress (1): 41/179 MB
Progress (1): 41/179 MB
Progress (1): 41/179 MB
Progress (1): 41/179 MB
Progress (1): 42/179 MB
Progress (1): 42/179 MB
Progress (1): 42/179 MB
Progress (1): 43/179 MB
Progress (1): 43/179 MB
Progress (1): 43/179 MB
Progress (1): 43/179 MB
Progress (1): 44/179 MB
Progress (1): 44/179 MB
Progress (1): 44/179 MB
Progress (1): 44/179 MB
Progress (1): 45/179 MB
Progress (1): 45/179 MB
Progress (1): 45/179 MB
Progress (1): 45/179 MB
Progress (1): 46/179 MB
Progress (1): 46/179 MB
Progress (1): 46/179 MB
Progress (1): 46/179 MB
Progress (1): 47/179 MB
Progress (1): 47/179 MB
Progress (1): 47/179 MB
Progress (1): 48/179 MB
Progress (1): 48/179 MB
Progress (1): 48/179 MB
Progress (1): 48/179 MB
Progress (1): 49/179 MB
Progress (1): 49/179 MB
Progress (1): 49/179 MB
Progress (1): 49/179 MB
Progress (1): 50/179 MB
Progress (1): 50/179 MB
Progress (1): 50/179 MB
Progress (1): 50/179 MB
Progress (1): 51/179 MB
Progress (1): 51/179 MB
Progress (1): 51/179 MB
Progress (1): 51/179 MB
Progress (1): 52/179 MB
Progress (1): 52/179 MB
Progress (1): 52/179 MB
Progress (1): 53/179 MB
Progress (1): 53/179 MB
Progress (1): 53/179 MB
Progress (1): 53/179 MB
Progress (1): 54/179 MB
Progress (1): 54/179 MB
Progress (1): 54/179 MB
Progress (1): 54/179 MB
Progress (1): 55/179 MB
Progress (1): 55/179 MB
Progress (1): 55/179 MB
Progress (1): 55/179 MB
Progress (1): 56/179 MB
Progress (1): 56/179 MB
Progress (1): 56/179 MB
Progress (1): 56/179 MB
Progress (1): 57/179 MB
Progress (1): 57/179 MB
Progress (1): 57/179 MB
Progress (1): 58/179 MB
Progress (1): 58/179 MB
Progress (1): 58/179 MB
Progress (1): 58/179 MB
Progress (1): 59/179 MB
Progress (1): 59/179 MB
Progress (1): 59/179 MB
Progress (1): 59/179 MB
Progress (1): 60/179 MB
Progress (1): 60/179 MB
Progress (1): 60/179 MB
Progress (1): 60/179 MB
Progress (1): 61/179 MB
Progress (1): 61/179 MB
Progress (1): 61/179 MB
Progress (1): 62/179 MB
Progress (1): 62/179 MB
Progress (1): 62/179 MB
Progress (1): 62/179 MB
Progress (1): 63/179 MB
Progress (1): 63/179 MB
Progress (1): 63/179 MB
Progress (1): 63/179 MB
Progress (1): 64/179 MB
Progress (1): 64/179 MB
Progress (1): 64/179 MB
Progress (1): 64/179 MB
Progress (1): 65/179 MB
Progress (1): 65/179 MB
Progress (1): 65/179 MB
Progress (1): 65/179 MB
Progress (1): 66/179 MB
Progress (1): 66/179 MB
Progress (1): 66/179 MB
Progress (1): 67/179 MB
Progress (1): 67/179 MB
Progress (1): 67/179 MB
Progress (1): 67/179 MB
Progress (1): 68/179 MB
Progress (1): 68/179 MB
Progress (1): 68/179 MB
Progress (1): 68/179 MB
Progress (1): 69/179 MB
Progress (1): 69/179 MB
Progress (1): 69/179 MB
Progress (1): 69/179 MB
Progress (1): 70/179 MB
Progress (1): 70/179 MB
Progress (1): 70/179 MB
Progress (1): 70/179 MB
Progress (1): 71/179 MB
Progress (1): 71/179 MB
Progress (1): 71/179 MB
Progress (1): 72/179 MB
Progress (1): 72/179 MB
Progress (1): 72/179 MB
Progress (1): 72/179 MB
Progress (1): 73/179 MB
Progress (1): 73/179 MB
Progress (1): 73/179 MB
Progress (1): 73/179 MB
Progress (1): 74/179 MB
Progress (1): 74/179 MB
Progress (1): 74/179 MB
Progress (1): 74/179 MB
Progress (1): 75/179 MB
Progress (1): 75/179 MB
Progress (1): 75/179 MB
Progress (1): 76/179 MB
Progress (1): 76/179 MB
Progress (1): 76/179 MB
Progress (1): 76/179 MB
Progress (1): 77/179 MB
Progress (1): 77/179 MB
Progress (1): 77/179 MB
Progress (1): 77/179 MB
Progress (1): 78/179 MB
Progress (1): 78/179 MB
Progress (1): 78/179 MB
Progress (1): 78/179 MB
Progress (1): 79/179 MB
Progress (1): 79/179 MB
Progress (1): 79/179 MB
Progress (1): 79/179 MB
Progress (1): 80/179 MB
Progress (1): 80/179 MB
Progress (1): 80/179 MB
Progress (1): 81/179 MB
Progress (1): 81/179 MB
Progress (1): 81/179 MB
Progress (1): 81/179 MB
Progress (1): 82/179 MB
Progress (1): 82/179 MB
Progress (1): 82/179 MB
Progress (1): 82/179 MB
Progress (1): 83/179 MB
Progress (1): 83/179 MB
Progress (1): 83/179 MB
Progress (1): 83/179 MB
Progress (1): 84/179 MB
Progress (1): 84/179 MB
Progress (1): 84/179 MB
Progress (1): 84/179 MB
Progress (1): 85/179 MB
Progress (1): 85/179 MB
Progress (1): 85/179 MB
Progress (1): 86/179 MB
Progress (1): 86/179 MB
Progress (1): 86/179 MB
Progress (1): 86/179 MB
Progress (1): 87/179 MB
Progress (1): 87/179 MB
Progress (1): 87/179 MB
Progress (1): 87/179 MB
Progress (1): 88/179 MB
Progress (1): 88/179 MB
Progress (1): 88/179 MB
Progress (1): 88/179 MB
Progress (1): 89/179 MB
Progress (1): 89/179 MB
Progress (1): 89/179 MB
Progress (1): 89/179 MB
Progress (1): 90/179 MB
Progress (1): 90/179 MB
Progress (1): 90/179 MB
Progress (1): 91/179 MB
Progress (1): 91/179 MB
Progress (1): 91/179 MB
Progress (1): 91/179 MB
Progress (1): 92/179 MB
Progress (1): 92/179 MB
Progress (1): 92/179 MB
Progress (1): 92/179 MB
Progress (1): 93/179 MB
Progress (1): 93/179 MB
Progress (1): 93/179 MB
Progress (1): 93/179 MB
Progress (1): 94/179 MB
Progress (1): 94/179 MB
Progress (1): 94/179 MB
Progress (1): 95/179 MB
Progress (1): 95/179 MB
Progress (1): 95/179 MB
Progress (1): 95/179 MB
Progress (1): 96/179 MB
Progress (1): 96/179 MB
Progress (1): 96/179 MB
Progress (1): 96/179 MB
Progress (1): 97/179 MB
Progress (1): 97/179 MB
Progress (1): 97/179 MB
Progress (1): 97/179 MB
Progress (1): 98/179 MB
Progress (1): 98/179 MB
Progress (1): 98/179 MB
Progress (1): 98/179 MB
Progress (1): 99/179 MB
Progress (1): 99/179 MB
Progress (1): 99/179 MB
Progress (1): 100/179 MB
Progress (1): 100/179 MB
Progress (1): 100/179 MB
Progress (1): 100/179 MB
Progress (1): 101/179 MB
Progress (1): 101/179 MB
Progress (1): 101/179 MB
Progress (1): 101/179 MB
Progress (1): 102/179 MB
Progress (1): 102/179 MB
Progress (1): 102/179 MB
Progress (1): 102/179 MB
Progress (1): 103/179 MB
Progress (1): 103/179 MB
Progress (1): 103/179 MB
Progress (1): 103/179 MB
Progress (1): 104/179 MB
Progress (1): 104/179 MB
Progress (1): 104/179 MB
Progress (1): 105/179 MB
Progress (1): 105/179 MB
Progress (1): 105/179 MB
Progress (1): 105/179 MB
Progress (1): 106/179 MB
Progress (1): 106/179 MB
Progress (1): 106/179 MB
Progress (1): 106/179 MB
Progress (1): 107/179 MB
Progress (1): 107/179 MB
Progress (1): 107/179 MB
Progress (1): 107/179 MB
Progress (1): 108/179 MB
Progress (1): 108/179 MB
Progress (1): 108/179 MB
Progress (1): 109/179 MB
Progress (1): 109/179 MB
Progress (1): 109/179 MB
Progress (1): 109/179 MB
Progress (1): 110/179 MB
Progress (1): 110/179 MB
Progress (1): 110/179 MB
Progress (1): 110/179 MB
Progress (1): 111/179 MB
Progress (1): 111/179 MB
Progress (1): 111/179 MB
Progress (1): 111/179 MB
Progress (1): 112/179 MB
Progress (1): 112/179 MB
Progress (1): 112/179 MB
Progress (1): 112/179 MB
Progress (1): 113/179 MB
Progress (1): 113/179 MB
Progress (1): 113/179 MB
Progress (1): 114/179 MB
Progress (1): 114/179 MB
Progress (1): 114/179 MB
Progress (1): 114/179 MB
Progress (1): 115/179 MB
Progress (1): 115/179 MB
Progress (1): 115/179 MB
Progress (1): 115/179 MB
Progress (1): 116/179 MB
Progress (1): 116/179 MB
Progress (1): 116/179 MB
Progress (1): 116/179 MB
Progress (1): 117/179 MB
Progress (1): 117/179 MB
Progress (1): 117/179 MB
Progress (1): 117/179 MB
Progress (1): 118/179 MB
Progress (1): 118/179 MB
Progress (1): 118/179 MB
Progress (1): 119/179 MB
Progress (1): 119/179 MB
Progress (1): 119/179 MB
Progress (1): 119/179 MB
Progress (1): 120/179 MB
Progress (1): 120/179 MB
Progress (1): 120/179 MB
Progress (1): 120/179 MB
Progress (1): 121/179 MB
Progress (1): 121/179 MB
Progress (1): 121/179 MB
Progress (1): 121/179 MB
Progress (1): 122/179 MB
Progress (1): 122/179 MB
Progress (1): 122/179 MB
Progress (1): 122/179 MB
Progress (1): 123/179 MB
Progress (1): 123/179 MB
Progress (1): 123/179 MB
Progress (1): 124/179 MB
Progress (1): 124/179 MB
Progress (1): 124/179 MB
Progress (1): 124/179 MB
Progress (1): 125/179 MB
Progress (1): 125/179 MB
Progress (1): 125/179 MB
Progress (1): 125/179 MB
Progress (1): 126/179 MB
Progress (1): 126/179 MB
Progress (1): 126/179 MB
Progress (1): 126/179 MB
Progress (1): 127/179 MB
Progress (1): 127/179 MB
Progress (1): 127/179 MB
Progress (1): 128/179 MB
Progress (1): 128/179 MB
Progress (1): 128/179 MB
Progress (1): 128/179 MB
Progress (1): 129/179 MB
Progress (1): 129/179 MB
Progress (1): 129/179 MB
Progress (1): 129/179 MB
Progress (1): 130/179 MB
Progress (1): 130/179 MB
Progress (1): 130/179 MB
Progress (1): 130/179 MB
Progress (1): 131/179 MB
Progress (1): 131/179 MB
Progress (1): 131/179 MB
Progress (1): 131/179 MB
Progress (1): 132/179 MB
Progress (1): 132/179 MB
Progress (1): 132/179 MB
Progress (1): 133/179 MB
Progress (1): 133/179 MB
Progress (1): 133/179 MB
Progress (1): 133/179 MB
Progress (1): 134/179 MB
Progress (1): 134/179 MB
Progress (1): 134/179 MB
Progress (1): 134/179 MB
Progress (1): 135/179 MB
Progress (1): 135/179 MB
Progress (1): 135/179 MB
Progress (1): 135/179 MB
Progress (1): 136/179 MB
Progress (1): 136/179 MB
Progress (1): 136/179 MB
Progress (1): 136/179 MB
Progress (1): 137/179 MB
Progress (1): 137/179 MB
Progress (1): 137/179 MB
Progress (1): 138/179 MB
Progress (1): 138/179 MB
Progress (1): 138/179 MB
Progress (1): 138/179 MB
Progress (1): 139/179 MB
Progress (1): 139/179 MB
Progress (1): 139/179 MB
Progress (1): 139/179 MB
Progress (1): 140/179 MB
Progress (1): 140/179 MB
Progress (1): 140/179 MB
Progress (1): 140/179 MB
Progress (1): 141/179 MB
Progress (1): 141/179 MB
Progress (1): 141/179 MB
Progress (1): 142/179 MB
Progress (1): 142/179 MB
Progress (1): 142/179 MB
Progress (1): 142/179 MB
Progress (1): 143/179 MB
Progress (1): 143/179 MB
Progress (1): 143/179 MB
Progress (1): 143/179 MB
Progress (1): 144/179 MB
Progress (1): 144/179 MB
Progress (1): 144/179 MB
Progress (1): 144/179 MB
Progress (1): 145/179 MB
Progress (1): 145/179 MB
Progress (1): 145/179 MB
Progress (1): 145/179 MB
Progress (1): 146/179 MB
Progress (1): 146/179 MB
Progress (1): 146/179 MB
Progress (1): 147/179 MB
Progress (1): 147/179 MB
Progress (1): 147/179 MB
Progress (1): 147/179 MB
Progress (1): 148/179 MB
Progress (1): 148/179 MB
Progress (1): 148/179 MB
Progress (1): 148/179 MB
Progress (1): 149/179 MB
Progress (1): 149/179 MB
Progress (1): 149/179 MB
Progress (1): 149/179 MB
Progress (1): 150/179 MB
Progress (1): 150/179 MB
Progress (1): 150/179 MB
Progress (1): 150/179 MB
Progress (1): 151/179 MB
Progress (1): 151/179 MB
Progress (1): 151/179 MB
Progress (1): 152/179 MB
Progress (1): 152/179 MB
Progress (1): 152/179 MB
Progress (1): 152/179 MB
Progress (1): 153/179 MB
Progress (1): 153/179 MB
Progress (1): 153/179 MB
Progress (1): 153/179 MB
Progress (1): 154/179 MB
Progress (1): 154/179 MB
Progress (1): 154/179 MB
Progress (1): 154/179 MB
Progress (1): 155/179 MB
Progress (1): 155/179 MB
Progress (1): 155/179 MB
Progress (1): 156/179 MB
Progress (1): 156/179 MB
Progress (1): 156/179 MB
Progress (1): 156/179 MB
Progress (1): 157/179 MB
Progress (1): 157/179 MB
Progress (1): 157/179 MB
Progress (1): 157/179 MB
Progress (1): 158/179 MB
Progress (1): 158/179 MB
Progress (1): 158/179 MB
Progress (1): 158/179 MB
Progress (1): 159/179 MB
Progress (1): 159/179 MB
Progress (1): 159/179 MB
Progress (1): 159/179 MB
Progress (1): 160/179 MB
Progress (1): 160/179 MB
Progress (1): 160/179 MB
Progress (1): 161/179 MB
Progress (1): 161/179 MB
Progress (1): 161/179 MB
Progress (1): 161/179 MB
Progress (1): 162/179 MB
Progress (1): 162/179 MB
Progress (1): 162/179 MB
Progress (1): 162/179 MB
Progress (1): 163/179 MB
Progress (1): 163/179 MB
Progress (1): 163/179 MB
Progress (1): 163/179 MB
Progress (1): 164/179 MB
Progress (1): 164/179 MB
Progress (1): 164/179 MB
Progress (1): 164/179 MB
Progress (1): 165/179 MB
Progress (1): 165/179 MB
Progress (1): 165/179 MB
Progress (1): 166/179 MB
Progress (1): 166/179 MB
Progress (1): 166/179 MB
Progress (1): 166/179 MB
Progress (1): 167/179 MB
Progress (1): 167/179 MB
Progress (1): 167/179 MB
Progress (1): 167/179 MB
Progress (1): 168/179 MB
Progress (1): 168/179 MB
Progress (1): 168/179 MB
Progress (1): 168/179 MB
Progress (1): 169/179 MB
Progress (1): 169/179 MB
Progress (1): 169/179 MB
Progress (1): 169/179 MB
Progress (1): 170/179 MB
Progress (1): 170/179 MB
Progress (1): 170/179 MB
Progress (1): 171/179 MB
Progress (1): 171/179 MB
Progress (1): 171/179 MB
Progress (1): 171/179 MB
Progress (1): 172/179 MB
Progress (1): 172/179 MB
Progress (1): 172/179 MB
Progress (1): 172/179 MB
Progress (1): 173/179 MB
Progress (1): 173/179 MB
Progress (1): 173/179 MB
Progress (1): 173/179 MB
Progress (1): 174/179 MB
Progress (1): 174/179 MB
Progress (1): 174/179 MB
Progress (1): 175/179 MB
Progress (1): 175/179 MB
Progress (1): 175/179 MB
Progress (1): 175/179 MB
Progress (1): 176/179 MB
Progress (1): 176/179 MB
Progress (1): 176/179 MB
Progress (1): 176/179 MB
Progress (1): 177/179 MB
Progress (1): 177/179 MB
Progress (1): 177/179 MB
Progress (1): 177/179 MB
Progress (1): 178/179 MB
Progress (1): 178/179 MB
Progress (1): 178/179 MB
Progress (1): 178/179 MB
Progress (1): 179/179 MB
Progress (1): 179/179 MB
Progress (1): 179/179 MB
Progress (1): 179 MB    
                    
Downloaded from eclipse.maven.central.mirror: https://repo.eclipse.org/content/repositories/maven_central/org/eclipse/tycho/ci/eclipse-SDK/3.6.2/eclipse-SDK-3.6.2-win32.zip (179 MB at 28 MB/s)
[INFO] Configured Artifact: org.eclipse.tycho.ci:eclipse-delta-pack:3.6.2:zip
Downloading from eclipse.maven.central.mirror: https://repo.eclipse.org/content/repositories/maven_central/org/eclipse/tycho/ci/eclipse-delta-pack/3.6.2/eclipse-delta-pack-3.6.2.pom
[WARNING] The POM for org.eclipse.tycho.ci:eclipse-delta-pack:zip:3.6.2 is missing, no dependency information available
Downloading from eclipse.maven.central.mirror: https://repo.eclipse.org/content/repositories/maven_central/org/eclipse/tycho/ci/eclipse-delta-pack/3.6.2/eclipse-delta-pack-3.6.2.zip
Progress (1): 0.3/77 MB
Progress (1): 0.5/77 MB
Progress (1): 0.8/77 MB
Progress (1): 1.1/77 MB
Progress (1): 1.3/77 MB
Progress (1): 1.6/77 MB
Progress (1): 1.8/77 MB
Progress (1): 2.1/77 MB
Progress (1): 2.4/77 MB
Progress (1): 2.6/77 MB
Progress (1): 2.9/77 MB
Progress (1): 3.2/77 MB
Progress (1): 3.4/77 MB
Progress (1): 3.7/77 MB
Progress (1): 4.0/77 MB
Progress (1): 4.2/77 MB
Progress (1): 4.5/77 MB
Progress (1): 4.8/77 MB
Progress (1): 5.0/77 MB
Progress (1): 5.3/77 MB
Progress (1): 5.5/77 MB
Progress (1): 5.8/77 MB
Progress (1): 6.1/77 MB
Progress (1): 6.3/77 MB
Progress (1): 6.6/77 MB
Progress (1): 6.9/77 MB
Progress (1): 7.1/77 MB
Progress (1): 7.4/77 MB
Progress (1): 7.7/77 MB
Progress (1): 7.9/77 MB
Progress (1): 8.2/77 MB
Progress (1): 8.4/77 MB
Progress (1): 8.7/77 MB
Progress (1): 9.0/77 MB
Progress (1): 9.2/77 MB
Progress (1): 9.5/77 MB
Progress (1): 9.8/77 MB
Progress (1): 10/77 MB 
Progress (1): 10/77 MB
Progress (1): 11/77 MB
Progress (1): 11/77 MB
Progress (1): 11/77 MB
Progress (1): 11/77 MB
Progress (1): 12/77 MB
Progress (1): 12/77 MB
Progress (1): 12/77 MB
Progress (1): 12/77 MB
Progress (1): 13/77 MB
Progress (1): 13/77 MB
Progress (1): 13/77 MB
Progress (1): 13/77 MB
Progress (1): 14/77 MB
Progress (1): 14/77 MB
Progress (1): 14/77 MB
Progress (1): 15/77 MB
Progress (1): 15/77 MB
Progress (1): 15/77 MB
Progress (1): 15/77 MB
Progress (1): 16/77 MB
Progress (1): 16/77 MB
Progress (1): 16/77 MB
Progress (1): 16/77 MB
Progress (1): 17/77 MB
Progress (1): 17/77 MB
Progress (1): 17/77 MB
Progress (1): 17/77 MB
Progress (1): 18/77 MB
Progress (1): 18/77 MB
Progress (1): 18/77 MB
Progress (1): 18/77 MB
Progress (1): 19/77 MB
Progress (1): 19/77 MB
Progress (1): 19/77 MB
Progress (1): 20/77 MB
Progress (1): 20/77 MB
Progress (1): 20/77 MB
Progress (1): 20/77 MB
Progress (1): 21/77 MB
Progress (1): 21/77 MB
Progress (1): 21/77 MB
Progress (1): 21/77 MB
Progress (1): 22/77 MB
Progress (1): 22/77 MB
Progress (1): 22/77 MB
Progress (1): 22/77 MB
Progress (1): 23/77 MB
Progress (1): 23/77 MB
Progress (1): 23/77 MB
Progress (1): 23/77 MB
Progress (1): 24/77 MB
Progress (1): 24/77 MB
Progress (1): 24/77 MB
Progress (1): 25/77 MB
Progress (1): 25/77 MB
Progress (1): 25/77 MB
Progress (1): 25/77 MB
Progress (1): 26/77 MB
Progress (1): 26/77 MB
Progress (1): 26/77 MB
Progress (1): 26/77 MB
Progress (1): 27/77 MB
Progress (1): 27/77 MB
Progress (1): 27/77 MB
Progress (1): 27/77 MB
Progress (1): 28/77 MB
Progress (1): 28/77 MB
Progress (1): 28/77 MB
Progress (1): 29/77 MB
Progress (1): 29/77 MB
Progress (1): 29/77 MB
Progress (1): 29/77 MB
Progress (1): 30/77 MB
Progress (1): 30/77 MB
Progress (1): 30/77 MB
Progress (1): 30/77 MB
Progress (1): 31/77 MB
Progress (1): 31/77 MB
Progress (1): 31/77 MB
Progress (1): 31/77 MB
Progress (1): 32/77 MB
Progress (1): 32/77 MB
Progress (1): 32/77 MB
Progress (1): 32/77 MB
Progress (1): 33/77 MB
Progress (1): 33/77 MB
Progress (1): 33/77 MB
Progress (1): 34/77 MB
Progress (1): 34/77 MB
Progress (1): 34/77 MB
Progress (1): 34/77 MB
Progress (1): 35/77 MB
Progress (1): 35/77 MB
Progress (1): 35/77 MB
Progress (1): 35/77 MB
Progress (1): 36/77 MB
Progress (1): 36/77 MB
Progress (1): 36/77 MB
Progress (1): 36/77 MB
Progress (1): 37/77 MB
Progress (1): 37/77 MB
Progress (1): 37/77 MB
Progress (1): 37/77 MB
Progress (1): 38/77 MB
Progress (1): 38/77 MB
Progress (1): 38/77 MB
Progress (1): 39/77 MB
Progress (1): 39/77 MB
Progress (1): 39/77 MB
Progress (1): 39/77 MB
Progress (1): 40/77 MB
Progress (1): 40/77 MB
Progress (1): 40/77 MB
Progress (1): 40/77 MB
Progress (1): 41/77 MB
Progress (1): 41/77 MB
Progress (1): 41/77 MB
Progress (1): 41/77 MB
Progress (1): 42/77 MB
Progress (1): 42/77 MB
Progress (1): 42/77 MB
Progress (1): 43/77 MB
Progress (1): 43/77 MB
Progress (1): 43/77 MB
Progress (1): 43/77 MB
Progress (1): 44/77 MB
Progress (1): 44/77 MB
Progress (1): 44/77 MB
Progress (1): 44/77 MB
Progress (1): 45/77 MB
Progress (1): 45/77 MB
Progress (1): 45/77 MB
Progress (1): 45/77 MB
Progress (1): 46/77 MB
Progress (1): 46/77 MB
Progress (1): 46/77 MB
Progress (1): 46/77 MB
Progress (1): 47/77 MB
Progress (1): 47/77 MB
Progress (1): 47/77 MB
Progress (1): 48/77 MB
Progress (1): 48/77 MB
Progress (1): 48/77 MB
Progress (1): 48/77 MB
Progress (1): 49/77 MB
Progress (1): 49/77 MB
Progress (1): 49/77 MB
Progress (1): 49/77 MB
Progress (1): 50/77 MB
Progress (1): 50/77 MB
Progress (1): 50/77 MB
Progress (1): 50/77 MB
Progress (1): 51/77 MB
Progress (1): 51/77 MB
Progress (1): 51/77 MB
Progress (1): 51/77 MB
Progress (1): 52/77 MB
Progress (1): 52/77 MB
Progress (1): 52/77 MB
Progress (1): 53/77 MB
Progress (1): 53/77 MB
Progress (1): 53/77 MB
Progress (1): 53/77 MB
Progress (1): 54/77 MB
Progress (1): 54/77 MB
Progress (1): 54/77 MB
Progress (1): 54/77 MB
Progress (1): 55/77 MB
Progress (1): 55/77 MB
Progress (1): 55/77 MB
Progress (1): 55/77 MB
Progress (1): 56/77 MB
Progress (1): 56/77 MB
Progress (1): 56/77 MB
Progress (1): 56/77 MB
Progress (1): 57/77 MB
Progress (1): 57/77 MB
Progress (1): 57/77 MB
Progress (1): 58/77 MB
Progress (1): 58/77 MB
Progress (1): 58/77 MB
Progress (1): 58/77 MB
Progress (1): 59/77 MB
Progress (1): 59/77 MB
Progress (1): 59/77 MB
Progress (1): 59/77 MB
Progress (1): 60/77 MB
Progress (1): 60/77 MB
Progress (1): 60/77 MB
Progress (1): 60/77 MB
Progress (1): 61/77 MB
Progress (1): 61/77 MB
Progress (1): 61/77 MB
Progress (1): 62/77 MB
Progress (1): 62/77 MB
Progress (1): 62/77 MB
Progress (1): 62/77 MB
Progress (1): 63/77 MB
Progress (1): 63/77 MB
Progress (1): 63/77 MB
Progress (1): 63/77 MB
Progress (1): 64/77 MB
Progress (1): 64/77 MB
Progress (1): 64/77 MB
Progress (1): 64/77 MB
Progress (1): 65/77 MB
Progress (1): 65/77 MB
Progress (1): 65/77 MB
Progress (1): 65/77 MB
Progress (1): 66/77 MB
Progress (1): 66/77 MB
Progress (1): 66/77 MB
Progress (1): 67/77 MB
Progress (1): 67/77 MB
Progress (1): 67/77 MB
Progress (1): 67/77 MB
Progress (1): 68/77 MB
Progress (1): 68/77 MB
Progress (1): 68/77 MB
Progress (1): 68/77 MB
Progress (1): 69/77 MB
Progress (1): 69/77 MB
Progress (1): 69/77 MB
Progress (1): 69/77 MB
Progress (1): 70/77 MB
Progress (1): 70/77 MB
Progress (1): 70/77 MB
Progress (1): 70/77 MB
Progress (1): 71/77 MB
Progress (1): 71/77 MB
Progress (1): 71/77 MB
Progress (1): 72/77 MB
Progress (1): 72/77 MB
Progress (1): 72/77 MB
Progress (1): 72/77 MB
Progress (1): 73/77 MB
Progress (1): 73/77 MB
Progress (1): 73/77 MB
Progress (1): 73/77 MB
Progress (1): 74/77 MB
Progress (1): 74/77 MB
Progress (1): 74/77 MB
Progress (1): 74/77 MB
Progress (1): 75/77 MB
Progress (1): 75/77 MB
Progress (1): 75/77 MB
Progress (1): 76/77 MB
Progress (1): 76/77 MB
Progress (1): 76/77 MB
Progress (1): 76/77 MB
Progress (1): 77/77 MB
Progress (1): 77/77 MB
Progress (1): 77/77 MB
Progress (1): 77/77 MB
Progress (1): 77 MB   
                   
Downloaded from eclipse.maven.central.mirror: https://repo.eclipse.org/content/repositories/maven_central/org/eclipse/tycho/ci/eclipse-delta-pack/3.6.2/eclipse-delta-pack-3.6.2.zip (77 MB at 19 MB/s)
[INFO] Unpacking /home/hudson/genie.tycho/.jenkins/jobs/tycho-build-with-maven-snapshots/workspace/.m2/repo/org/eclipse/tycho/ci/eclipse-SDK/3.6.2/eclipse-SDK-3.6.2-win32.zip to /tmp/genie.tycho/tycho-ci/win32/3.6.2 with includes "" and excludes ""
[INFO] Unpacking /home/hudson/genie.tycho/.jenkins/jobs/tycho-build-with-maven-snapshots/workspace/.m2/repo/org/eclipse/tycho/ci/eclipse-delta-pack/3.6.2/eclipse-delta-pack-3.6.2.zip to /tmp/genie.tycho/tycho-ci/win32/3.6.2 with includes "" and excludes ""
[INFO] 
[INFO] --- maven-resources-plugin:3.1.0:resources (default-resources) @ tycho-its ---
[INFO] Using 'UTF-8' encoding to copy filtered resources.
[INFO] skip non existing resourceDirectory /jobs/genie.tycho/tycho-build-with-maven-snapshots/workspace/tycho-its/src/main/resources
[INFO] 
[INFO] --- maven-compiler-plugin:3.8.1:compile (default-compile) @ tycho-its ---
[INFO] No sources to compile
[INFO] 
[INFO] --- maven-resources-plugin:3.1.0:testResources (default-testResources) @ tycho-its ---
[INFO] Using 'UTF-8' encoding to copy filtered resources.
[INFO] Copying 1 resource
[INFO] 
[INFO] --- maven-properties-plugin:0.0.2:filter-file (default) @ tycho-its ---
[INFO] 
[INFO] --- maven-compiler-plugin:3.8.1:testCompile (default-testCompile) @ tycho-its ---
[INFO] Changes detected - recompiling the module!
[INFO] Compiling 131 source files to /jobs/genie.tycho/tycho-build-with-maven-snapshots/workspace/tycho-its/target/test-classes
[INFO] /jobs/genie.tycho/tycho-build-with-maven-snapshots/workspace/tycho-its/src/test/java/org/eclipse/tycho/test/product/Tycho465RootFilesTest.java: Some input files use or override a deprecated API.
[INFO] /jobs/genie.tycho/tycho-build-with-maven-snapshots/workspace/tycho-its/src/test/java/org/eclipse/tycho/test/product/Tycho465RootFilesTest.java: Recompile with -Xlint:deprecation for details.
[INFO] 
[INFO] --- tycho-p2-extras-plugin:1.5.1:mirror (mirror-kepler-test-repo) @ tycho-its ---
Downloading from eclipse.maven.central.mirror: https://repo.eclipse.org/content/repositories/maven_central/org/codehaus/plexus/plexus-component-annotations/1.5.4/plexus-component-annotations-1.5.4.pom
Progress (1): 815 B
                   
Downloaded from eclipse.maven.central.mirror: https://repo.eclipse.org/content/repositories/maven_central/org/codehaus/plexus/plexus-component-annotations/1.5.4/plexus-component-annotations-1.5.4.pom (815 B at 41 kB/s)
Downloading from eclipse.maven.central.mirror: https://repo.eclipse.org/content/repositories/maven_central/org/codehaus/plexus/plexus-containers/1.5.4/plexus-containers-1.5.4.pom
Progress (1): 4.1/4.2 kB
Progress (1): 4.2 kB    
                    
Downloaded from eclipse.maven.central.mirror: https://repo.eclipse.org/content/repositories/maven_central/org/codehaus/plexus/plexus-containers/1.5.4/plexus-containers-1.5.4.pom (4.2 kB at 283 kB/s)
Downloading from eclipse.maven.central.mirror: https://repo.eclipse.org/content/repositories/maven_central/org/codehaus/plexus/plexus/2.0.5/plexus-2.0.5.pom
Progress (1): 4.1/17 kB
Progress (1): 7.7/17 kB
Progress (1): 12/17 kB 
Progress (1): 16/17 kB
Progress (1): 17 kB   
                   
Downloaded from eclipse.maven.central.mirror: https://repo.eclipse.org/content/repositories/maven_central/org/codehaus/plexus/plexus/2.0.5/plexus-2.0.5.pom (17 kB at 1.1 MB/s)
Downloading from tycho-snapshots: https://repo.eclipse.org/content/repositories/tycho-snapshots/org/eclipse/platform/org.eclipse.osgi/maven-metadata.xml
[INFO] Mirroring to /jobs/genie.tycho/tycho-build-with-maven-snapshots/workspace/tycho-its/repositories/kepler...
Nov 07, 2019 1:46:46 PM org.apache.http.impl.execchain.RetryExec execute
INFO: I/O exception (org.apache.http.NoHttpResponseException) caught when processing request to {}->http://download.eclipse.org:80: The target server failed to respond
Nov 07, 2019 1:46:46 PM org.apache.http.impl.execchain.RetryExec execute
INFO: Retrying request to {}->http://download.eclipse.org:80
Mirroring: osgi.bundle,org.eclipse.core.contenttype,3.4.200.v20130326-1255 (Descriptor: canonical: osgi.bundle,org.eclipse.core.contenttype,3.4.200.v20130326-1255)
Mirroring: osgi.bundle,org.apache.felix.gogo.runtime,0.10.0.v201209301036 (Descriptor: canonical: osgi.bundle,org.apache.felix.gogo.runtime,0.10.0.v201209301036)
Mirroring: osgi.bundle,org.eclipse.equinox.launcher,1.3.0.v20130327-1440 (Descriptor: canonical: osgi.bundle,org.eclipse.equinox.launcher,1.3.0.v20130327-1440)
Mirroring: osgi.bundle,org.eclipse.equinox.registry,3.5.301.v20130717-1549 (Descriptor: canonical: osgi.bundle,org.eclipse.equinox.registry,3.5.301.v20130717-1549)
Mirroring: osgi.bundle,org.eclipse.equinox.log,1.2.300.v20130327-1442 (Descriptor: canonical: osgi.bundle,org.eclipse.equinox.log,1.2.300.v20130327-1442)
Mirroring: osgi.bundle,org.apache.felix.gogo.command,0.10.0.v201209301215 (Descriptor: canonical: osgi.bundle,org.apache.felix.gogo.command,0.10.0.v201209301215)
Mirroring: osgi.bundle,org.eclipse.core.runtime,3.9.100.v20131218-1515 (Descriptor: canonical: osgi.bundle,org.eclipse.core.runtime,3.9.100.v20131218-1515)
Mirroring: osgi.bundle,org.eclipse.equinox.launcher.win32.win32.x86_64,1.1.200.v20140116-2212 (Descriptor: canonical: osgi.bundle,org.eclipse.equinox.launcher.win32.win32.x86_64,1.1.200.v20140116-2212)
Mirroring: osgi.bundle,org.eclipse.equinox.preferences,3.5.100.v20130422-1538 (Descriptor: canonical: osgi.bundle,org.eclipse.equinox.preferences,3.5.100.v20130422-1538)
Mirroring: osgi.bundle,org.eclipse.osgi.services,3.3.100.v20130513-1956 (Descriptor: canonical: osgi.bundle,org.eclipse.osgi.services,3.3.100.v20130513-1956)
Mirroring: osgi.bundle,org.eclipse.core.jobs,3.5.300.v20130429-1813 (Descriptor: canonical: osgi.bundle,org.eclipse.core.jobs,3.5.300.v20130429-1813)
Mirroring: osgi.bundle,org.eclipse.equinox.supplement,1.5.0.v20130812-2109 (Descriptor: canonical: osgi.bundle,org.eclipse.equinox.supplement,1.5.0.v20130812-2109)
Mirroring: osgi.bundle,org.eclipse.osgi,3.9.1.v20140110-1610 (Descriptor: canonical: osgi.bundle,org.eclipse.osgi,3.9.1.v20140110-1610)
Mirroring: osgi.bundle,org.eclipse.equinox.app,1.3.100.v20130327-1442 (Descriptor: canonical: osgi.bundle,org.eclipse.equinox.app,1.3.100.v20130327-1442)
Mirroring: osgi.bundle,org.junit,4.11.0.v201303080030 (Descriptor: canonical: osgi.bundle,org.junit,4.11.0.v201303080030)
Mirroring: binary,org.eclipse.equinox.executable_root.win32.win32.x86_64,3.6.0.v20140117-1004 (Descriptor: canonical: binary,org.eclipse.equinox.executable_root.win32.win32.x86_64,3.6.0.v20140117-1004)
Mirroring: osgi.bundle,org.hamcrest.core,1.3.0.v201303031735 (Descriptor: canonical: osgi.bundle,org.hamcrest.core,1.3.0.v201303031735)
Mirroring: org.eclipse.update.feature,org.eclipse.equinox.executable,3.6.0.v20140117-1004 (Descriptor: canonical: org.eclipse.update.feature,org.eclipse.equinox.executable,3.6.0.v20140117-1004)
Mirroring: osgi.bundle,javax.xml,1.3.4.v201005080400 (Descriptor: canonical: osgi.bundle,javax.xml,1.3.4.v201005080400)
Mirroring: osgi.bundle,org.eclipse.equinox.common,3.6.200.v20130402-1505 (Descriptor: canonical: osgi.bundle,org.eclipse.equinox.common,3.6.200.v20130402-1505)
Mirroring: osgi.bundle,osgi.enterprise,4.2.0.v201108120515 (Descriptor: canonical: osgi.bundle,osgi.enterprise,4.2.0.v201108120515)
[INFO] 
[INFO] --- tycho-p2-extras-plugin:1.5.1:mirror (mirror-oxygen-test-repo) @ tycho-its ---
[INFO] Mirroring to /jobs/genie.tycho/tycho-build-with-maven-snapshots/workspace/tycho-its/repositories/oxygen...
Mirroring: osgi.bundle,org.apache.xml.resolver,1.2.0.v201005080400 (Descriptor: canonical: osgi.bundle,org.apache.xml.resolver,1.2.0.v201005080400)
Mirroring: osgi.bundle,org.eclipse.equinox.registry,3.7.0.v20170222-1344 (Descriptor: canonical: osgi.bundle,org.eclipse.equinox.registry,3.7.0.v20170222-1344)
Mirroring: osgi.bundle,org.eclipse.core.jobs,3.9.3.v20180115-1757 (Descriptor: canonical: osgi.bundle,org.eclipse.core.jobs,3.9.3.v20180115-1757)
Mirroring: osgi.bundle,org.apache.felix.gogo.command,0.10.0.v201209301215 (Descriptor: canonical: osgi.bundle,org.apache.felix.gogo.command,0.10.0.v201209301215)
Mirroring: osgi.bundle,org.eclipse.osgi,3.12.50.v20170928-1321 (Descriptor: canonical: osgi.bundle,org.eclipse.osgi,3.12.50.v20170928-1321)
Mirroring: osgi.bundle,org.apache.xerces,2.9.0.v201101211617 (Descriptor: canonical: osgi.bundle,org.apache.xerces,2.9.0.v201101211617)
Mirroring: osgi.bundle,org.eclipse.core.runtime,3.13.0.v20170207-1030 (Descriptor: canonical: osgi.bundle,org.eclipse.core.runtime,3.13.0.v20170207-1030)
Mirroring: osgi.bundle,org.eclipse.equinox.launcher,1.4.0.v20161219-1356 (Descriptor: canonical: osgi.bundle,org.eclipse.equinox.launcher,1.4.0.v20161219-1356)
Mirroring: osgi.bundle,org.junit.platform.commons,1.0.0.v20170910-2246 (Descriptor: canonical: osgi.bundle,org.junit.platform.commons,1.0.0.v20170910-2246)
Mirroring: osgi.bundle,org.hamcrest.core,1.3.0.v201303031735 (Descriptor: canonical: osgi.bundle,org.hamcrest.core,1.3.0.v201303031735)
Mirroring: osgi.bundle,org.eclipse.equinox.common,3.9.0.v20170207-1454 (Descriptor: canonical: osgi.bundle,org.eclipse.equinox.common,3.9.0.v20170207-1454)
Mirroring: osgi.bundle,org.apache.xml.serializer,2.7.1.v201005080400 (Descriptor: canonical: osgi.bundle,org.apache.xml.serializer,2.7.1.v201005080400)
Mirroring: osgi.bundle,osgi.enterprise,4.2.0.v201108120515 (Descriptor: canonical: osgi.bundle,osgi.enterprise,4.2.0.v201108120515)
Mirroring: osgi.bundle,org.apache.felix.gogo.runtime,0.10.0.v201209301036 (Descriptor: canonical: osgi.bundle,org.apache.felix.gogo.runtime,0.10.0.v201209301036)
Mirroring: osgi.bundle,org.junit.jupiter.api,5.0.0.v20170910-2246 (Descriptor: canonical: osgi.bundle,org.junit.jupiter.api,5.0.0.v20170910-2246)
Mirroring: osgi.bundle,org.eclipse.equinox.preferences,3.7.0.v20170126-2132 (Descriptor: canonical: osgi.bundle,org.eclipse.equinox.preferences,3.7.0.v20170126-2132)
Mirroring: osgi.bundle,org.junit,4.12.0.v201504281640 (Descriptor: canonical: osgi.bundle,org.junit,4.12.0.v201504281640)
Mirroring: osgi.bundle,org.eclipse.equinox.app,1.3.400.v20150715-1528 (Descriptor: canonical: osgi.bundle,org.eclipse.equinox.app,1.3.400.v20150715-1528)
Mirroring: osgi.bundle,org.eclipse.pde.ds.lib,1.1.0.v20170303-1624 (Descriptor: canonical: osgi.bundle,org.eclipse.pde.ds.lib,1.1.0.v20170303-1624)
Mirroring: osgi.bundle,org.opentest4j,1.0.0.v20170910-2246 (Descriptor: canonical: osgi.bundle,org.opentest4j,1.0.0.v20170910-2246)
Mirroring: osgi.bundle,org.eclipse.core.jobs,3.9.2.v20171030-1027 (Descriptor: canonical: osgi.bundle,org.eclipse.core.jobs,3.9.2.v20171030-1027)
Mirroring: osgi.bundle,org.eclipse.equinox.supplement,1.7.0.v20170329-1416 (Descriptor: canonical: osgi.bundle,org.eclipse.equinox.supplement,1.7.0.v20170329-1416)
Mirroring: osgi.bundle,org.eclipse.osgi,3.12.100.v20180210-1608 (Descriptor: canonical: osgi.bundle,org.eclipse.osgi,3.12.100.v20180210-1608)
Mirroring: osgi.bundle,org.eclipse.core.contenttype,3.6.0.v20170207-1037 (Descriptor: canonical: osgi.bundle,org.eclipse.core.contenttype,3.6.0.v20170207-1037)
Mirroring: osgi.bundle,org.eclipse.osgi.util,3.4.0.v20170111-1608 (Descriptor: canonical: osgi.bundle,org.eclipse.osgi.util,3.4.0.v20170111-1608)
Mirroring: osgi.bundle,org.eclipse.osgi.services,3.6.0.v20170228-1906 (Descriptor: canonical: osgi.bundle,org.eclipse.osgi.services,3.6.0.v20170228-1906)
Mirroring: osgi.bundle,org.apiguardian,1.0.0.v20170910-2246 (Descriptor: canonical: osgi.bundle,org.apiguardian,1.0.0.v20170910-2246)
Mirroring: osgi.bundle,javax.xml,1.3.4.v201005080400 (Descriptor: canonical: osgi.bundle,javax.xml,1.3.4.v201005080400)
[INFO] 
[INFO] --- maven-surefire-plugin:2.22.0:test (default-test) @ tycho-its ---
[INFO] Surefire report directory: /jobs/genie.tycho/tycho-build-with-maven-snapshots/workspace/tycho-its/target/surefire-reports
[INFO] 
[INFO] -------------------------------------------------------
[INFO]  T E S T S
[INFO] -------------------------------------------------------
[INFO] Running org.eclipse.tycho.test.mngeclipse1007.BinExcludedTest
[INFO] Tests run: 1, Failures: 0, Errors: 0, Skipped: 0, Time elapsed: 6.386 s - in org.eclipse.tycho.test.mngeclipse1007.BinExcludedTest
[INFO] Running org.eclipse.tycho.test.product.Tycho188P2EnabledRcpTest
[INFO] Tests run: 6, Failures: 0, Errors: 0, Skipped: 0, Time elapsed: 70.207 s - in org.eclipse.tycho.test.product.Tycho188P2EnabledRcpTest
[INFO] Running org.eclipse.tycho.test.product.ProductDefinitionCrosstalkTest
[INFO] Tests run: 1, Failures: 0, Errors: 0, Skipped: 0, Time elapsed: 12.556 s - in org.eclipse.tycho.test.product.ProductDefinitionCrosstalkTest
[INFO] Running org.eclipse.tycho.test.product.ProductArchiveFormatTest
[INFO] Tests run: 1, Failures: 0, Errors: 0, Skipped: 0, Time elapsed: 10.994 s - in org.eclipse.tycho.test.product.ProductArchiveFormatTest
[INFO] Running org.eclipse.tycho.test.product.MetaRequirementsTest
[INFO] Tests run: 1, Failures: 0, Errors: 0, Skipped: 0, Time elapsed: 34.626 s - in org.eclipse.tycho.test.product.MetaRequirementsTest
[INFO] Running org.eclipse.tycho.test.product.BuildProductWithIgnoredContentTest
[INFO] Tests run: 1, Failures: 0, Errors: 0, Skipped: 0, Time elapsed: 8.532 s - in org.eclipse.tycho.test.product.BuildProductWithIgnoredContentTest
[INFO] Running org.eclipse.tycho.test.product.Tycho465RootFilesTest
[INFO] Tests run: 1, Failures: 0, Errors: 0, Skipped: 0, Time elapsed: 28.578 s - in org.eclipse.tycho.test.product.Tycho465RootFilesTest
[INFO] Running org.eclipse.tycho.test.product.ProductDuplicateIUsTest
[INFO] Tests run: 1, Failures: 0, Errors: 0, Skipped: 0, Time elapsed: 18.192 s - in org.eclipse.tycho.test.product.ProductDuplicateIUsTest
[INFO] Running org.eclipse.tycho.test.product.BuildProductWithoutCleanTest
[INFO] Tests run: 1, Failures: 0, Errors: 0, Skipped: 0, Time elapsed: 18.19 s - in org.eclipse.tycho.test.product.BuildProductWithoutCleanTest
[INFO] Running org.eclipse.tycho.test.product.ReferenceBetweenProductsTest
[INFO] Tests run: 1, Failures: 0, Errors: 0, Skipped: 0, Time elapsed: 14.371 s - in org.eclipse.tycho.test.product.ReferenceBetweenProductsTest
[INFO] Running org.eclipse.tycho.test.TYCHO0374dirBundleShape.DirectoryBundleShapeTest
[INFO] Tests run: 1, Failures: 0, Errors: 0, Skipped: 0, Time elapsed: 11.359 s - in org.eclipse.tycho.test.TYCHO0374dirBundleShape.DirectoryBundleShapeTest
[INFO] Running org.eclipse.tycho.test.compiler.AnnotationProcessorTest
[INFO] Tests run: 1, Failures: 0, Errors: 0, Skipped: 0, Time elapsed: 7.287 s - in org.eclipse.tycho.test.compiler.AnnotationProcessorTest
[INFO] Running org.eclipse.tycho.test.compiler.FailOnWarningTest
[INFO] Tests run: 1, Failures: 0, Errors: 0, Skipped: 0, Time elapsed: 6.109 s - in org.eclipse.tycho.test.compiler.FailOnWarningTest
[INFO] Running org.eclipse.tycho.test.compiler.RequireJREPackagesImportTest
[WARNING] Tests run: 1, Failures: 0, Errors: 0, Skipped: 1, Time elapsed: 0 s - in org.eclipse.tycho.test.compiler.RequireJREPackagesImportTest
[INFO] Running org.eclipse.tycho.test.compiler.MavenCompilerPluginTest
[INFO] Tests run: 1, Failures: 0, Errors: 0, Skipped: 0, Time elapsed: 4.629 s - in org.eclipse.tycho.test.compiler.MavenCompilerPluginTest
[INFO] Running org.eclipse.tycho.test.compiler.MisconfigurationTest
[INFO] Tests run: 1, Failures: 0, Errors: 0, Skipped: 0, Time elapsed: 6.624 s - in org.eclipse.tycho.test.compiler.MisconfigurationTest
[INFO] Running org.eclipse.tycho.test.compiler.JavaxAnnotationImportTest
[INFO] Tests run: 1, Failures: 0, Errors: 0, Skipped: 0, Time elapsed: 10.759 s - in org.eclipse.tycho.test.compiler.JavaxAnnotationImportTest
[INFO] Running org.eclipse.tycho.test.multiplatform.MultiplatformProductTest
[INFO] Tests run: 1, Failures: 0, Errors: 0, Skipped: 0, Time elapsed: 8.013 s - in org.eclipse.tycho.test.multiplatform.MultiplatformProductTest
[INFO] Running org.eclipse.tycho.test.multiplatform.MultiplatformReactorTest
[INFO] Tests run: 1, Failures: 0, Errors: 0, Skipped: 0, Time elapsed: 19.439 s - in org.eclipse.tycho.test.multiplatform.MultiplatformReactorTest
[INFO] Running org.eclipse.tycho.test.p2Inf.ExtraUnitsTest
[INFO] Tests run: 1, Failures: 0, Errors: 0, Skipped: 0, Time elapsed: 6.883 s - in org.eclipse.tycho.test.p2Inf.ExtraUnitsTest
[INFO] Running org.eclipse.tycho.test.p2Inf.MultienvP2infTest
[INFO] Tests run: 1, Failures: 0, Errors: 0, Skipped: 0, Time elapsed: 23.097 s - in org.eclipse.tycho.test.p2Inf.MultienvP2infTest
[INFO] Running org.eclipse.tycho.test.p2Inf.HostRequiresFragmentWithP2InfTest
[INFO] Tests run: 1, Failures: 0, Errors: 0, Skipped: 0, Time elapsed: 10.331 s - in org.eclipse.tycho.test.p2Inf.HostRequiresFragmentWithP2InfTest
[INFO] Running org.eclipse.tycho.test.target.TargetPlatformFilteringIntegrationTest
[INFO] Tests run: 1, Failures: 0, Errors: 0, Skipped: 0, Time elapsed: 9.226 s - in org.eclipse.tycho.test.target.TargetPlatformFilteringIntegrationTest
[INFO] Running org.eclipse.tycho.test.target.TargetRestrictionThroughTargetFilesTest
[INFO] Tests run: 2, Failures: 0, Errors: 0, Skipped: 0, Time elapsed: 33.609 s - in org.eclipse.tycho.test.target.TargetRestrictionThroughTargetFilesTest
[INFO] Running org.eclipse.tycho.test.target.OfflineModeTest
[INFO] Tests run: 3, Failures: 0, Errors: 0, Skipped: 0, Time elapsed: 54.564 s - in org.eclipse.tycho.test.target.OfflineModeTest
[INFO] Running org.eclipse.tycho.test.target.TargetDefinitionPackagingTypeTest
[INFO] Tests run: 2, Failures: 0, Errors: 0, Skipped: 0, Time elapsed: 19.404 s - in org.eclipse.tycho.test.target.TargetDefinitionPackagingTypeTest
[INFO] Running org.eclipse.tycho.test.target.PasswordProtectedP2RepositoryTest
[INFO] Tests run: 4, Failures: 0, Errors: 0, Skipped: 0, Time elapsed: 29.621 s - in org.eclipse.tycho.test.target.PasswordProtectedP2RepositoryTest
[INFO] Running org.eclipse.tycho.test.TYCHO309pomDependencyConsider.PomDependencyConsiderTest
[INFO] Tests run: 1, Failures: 0, Errors: 0, Skipped: 0, Time elapsed: 20.578 s - in org.eclipse.tycho.test.TYCHO309pomDependencyConsider.PomDependencyConsiderTest
[INFO] Running org.eclipse.tycho.test.TYCHO285EclipseSourceBundles.TYCHO285EclipseSourceBundlesTest
[INFO] Tests run: 1, Failures: 0, Errors: 0, Skipped: 0, Time elapsed: 7.654 s - in org.eclipse.tycho.test.TYCHO285EclipseSourceBundles.TYCHO285EclipseSourceBundlesTest
[INFO] Running org.eclipse.tycho.test.surefire.RequireBundleTest
[INFO] Tests run: 1, Failures: 0, Errors: 0, Skipped: 0, Time elapsed: 10.703 s - in org.eclipse.tycho.test.surefire.RequireBundleTest
[INFO] Running org.eclipse.tycho.test.surefire.JUnit5Test
[INFO] Tests run: 1, Failures: 0, Errors: 0, Skipped: 0, Time elapsed: 9.132 s - in org.eclipse.tycho.test.surefire.JUnit5Test
[INFO] Running org.eclipse.tycho.test.surefire.JavaToolchainInSurefireTest
[INFO] Tests run: 1, Failures: 0, Errors: 0, Skipped: 0, Time elapsed: 11.729 s - in org.eclipse.tycho.test.surefire.JavaToolchainInSurefireTest
[INFO] Running org.eclipse.tycho.test.surefire.TestBundleShapeTest
[INFO] Tests run: 1, Failures: 0, Errors: 0, Skipped: 0, Time elapsed: 13.998 s - in org.eclipse.tycho.test.surefire.TestBundleShapeTest
[INFO] Running org.eclipse.tycho.test.surefire.P2InstalledTestRuntimeTest
[INFO] Tests run: 3, Failures: 0, Errors: 0, Skipped: 0, Time elapsed: 57.777 s - in org.eclipse.tycho.test.surefire.P2InstalledTestRuntimeTest
[INFO] Running org.eclipse.tycho.test.surefire.FrameworkExtensionsTest
[INFO] Tests run: 1, Failures: 0, Errors: 0, Skipped: 0, Time elapsed: 11.476 s - in org.eclipse.tycho.test.surefire.FrameworkExtensionsTest
[INFO] Running org.eclipse.tycho.test.surefire.DirectTestPluginInvocationTest
[INFO] Tests run: 1, Failures: 0, Errors: 0, Skipped: 0, Time elapsed: 15.534 s - in org.eclipse.tycho.test.surefire.DirectTestPluginInvocationTest
[INFO] Running org.eclipse.tycho.test.surefire.SystemPropertiesTest
[INFO] Tests run: 1, Failures: 0, Errors: 0, Skipped: 0, Time elapsed: 10.723 s - in org.eclipse.tycho.test.surefire.SystemPropertiesTest
[INFO] Running org.eclipse.tycho.test.surefire.FailIfNoTestsTest
[INFO] Tests run: 2, Failures: 0, Errors: 0, Skipped: 0, Time elapsed: 24.832 s - in org.eclipse.tycho.test.surefire.FailIfNoTestsTest
[INFO] Running org.eclipse.tycho.test.surefire.EnvVarTest
[INFO] Tests run: 1, Failures: 0, Errors: 0, Skipped: 0, Time elapsed: 11.569 s - in org.eclipse.tycho.test.surefire.EnvVarTest
[INFO] Running org.eclipse.tycho.test.surefire.RunSingleTestTest
[INFO] Tests run: 1, Failures: 0, Errors: 0, Skipped: 0, Time elapsed: 11.953 s - in org.eclipse.tycho.test.surefire.RunSingleTestTest
[INFO] Running org.eclipse.tycho.test.surefire.ParallelTestExecutionTest
[INFO] Tests run: 1, Failures: 0, Errors: 0, Skipped: 0, Time elapsed: 10.918 s - in org.eclipse.tycho.test.surefire.ParallelTestExecutionTest
[INFO] Running org.eclipse.tycho.test.surefire.ExplodedTestDependenciesTest
[INFO] Tests run: 1, Failures: 0, Errors: 0, Skipped: 0, Time elapsed: 10.897 s - in org.eclipse.tycho.test.surefire.ExplodedTestDependenciesTest
[INFO] Running org.eclipse.tycho.test.surefire.TestNGBundleTest
[INFO] Tests run: 1, Failures: 0, Errors: 0, Skipped: 0, Time elapsed: 23.137 s - in org.eclipse.tycho.test.surefire.TestNGBundleTest
[INFO] Running org.eclipse.tycho.test.surefire.TestOptionalDependenciesTest
[INFO] Tests run: 2, Failures: 0, Errors: 0, Skipped: 0, Time elapsed: 19.926 s - in org.eclipse.tycho.test.surefire.TestOptionalDependenciesTest
[INFO] Running org.eclipse.tycho.test.surefire.JVMArgsTest
[INFO] Tests run: 1, Failures: 0, Errors: 0, Skipped: 0, Time elapsed: 10.931 s - in org.eclipse.tycho.test.surefire.JVMArgsTest
[INFO] Running org.eclipse.tycho.test.surefire.EnableAssertionsTest
[INFO] Tests run: 1, Failures: 0, Errors: 0, Skipped: 0, Time elapsed: 11.436 s - in org.eclipse.tycho.test.surefire.EnableAssertionsTest
[INFO] Running org.eclipse.tycho.test.surefire.ExtraTestApplicationArgumentsTest
[INFO] Tests run: 1, Failures: 0, Errors: 0, Skipped: 0, Time elapsed: 14.888 s - in org.eclipse.tycho.test.surefire.ExtraTestApplicationArgumentsTest
[INFO] Running org.eclipse.tycho.test.surefire.Junit4TestBundleTest
[INFO] Tests run: 1, Failures: 0, Errors: 0, Skipped: 0, Time elapsed: 13.738 s - in org.eclipse.tycho.test.surefire.Junit4TestBundleTest
[INFO] Running org.eclipse.tycho.test.surefire.BundleStartInSurefireTest
[INFO] Tests run: 2, Failures: 0, Errors: 0, Skipped: 0, Time elapsed: 22.134 s - in org.eclipse.tycho.test.surefire.BundleStartInSurefireTest
[INFO] Running org.eclipse.tycho.test.surefire.TestFragmentTest
[INFO] Tests run: 1, Failures: 0, Errors: 0, Skipped: 0, Time elapsed: 12.307 s - in org.eclipse.tycho.test.surefire.TestFragmentTest
[INFO] Running org.eclipse.tycho.test.surefire.CategoriesTest
[INFO] Tests run: 1, Failures: 0, Errors: 0, Skipped: 0, Time elapsed: 10.315 s - in org.eclipse.tycho.test.surefire.CategoriesTest
[INFO] Running org.eclipse.tycho.test.surefire.TwoJunitVersionsTest
[INFO] Tests run: 1, Failures: 0, Errors: 0, Skipped: 0, Time elapsed: 9.164 s - in org.eclipse.tycho.test.surefire.TwoJunitVersionsTest
[INFO] Running org.eclipse.tycho.test.surefire.RunOrderTest
[INFO] Tests run: 1, Failures: 0, Errors: 0, Skipped: 0, Time elapsed: 12.374 s - in org.eclipse.tycho.test.surefire.RunOrderTest
[INFO] Running org.eclipse.tycho.test.TYCHO0294ProductP2TargetPlatformResolver.ProductP2TargetPlatformResolverTest
[INFO] Tests run: 1, Failures: 0, Errors: 0, Skipped: 0, Time elapsed: 7.065 s - in org.eclipse.tycho.test.TYCHO0294ProductP2TargetPlatformResolver.ProductP2TargetPlatformResolverTest
[INFO] Running org.eclipse.tycho.test.packaging.DefaultBuildTimestampProviderTest
[INFO] Tests run: 1, Failures: 0, Errors: 0, Skipped: 0, Time elapsed: 7.242 s - in org.eclipse.tycho.test.packaging.DefaultBuildTimestampProviderTest
[INFO] Running org.eclipse.tycho.test.packaging.AttachedZipTest
[INFO] Tests run: 1, Failures: 0, Errors: 0, Skipped: 0, Time elapsed: 7.036 s - in org.eclipse.tycho.test.packaging.AttachedZipTest
[INFO] Running org.eclipse.tycho.test.packaging.BaselineValidateAndReplaceTest
[INFO] Tests run: 16, Failures: 0, Errors: 0, Skipped: 0, Time elapsed: 145.329 s - in org.eclipse.tycho.test.packaging.BaselineValidateAndReplaceTest
[INFO] Running org.eclipse.tycho.test.packaging.PackageNestedJarsAndDirsTest
[INFO] Tests run: 1, Failures: 0, Errors: 0, Skipped: 0, Time elapsed: 6.507 s - in org.eclipse.tycho.test.packaging.PackageNestedJarsAndDirsTest
[INFO] Running org.eclipse.tycho.test.packaging.RepositoryPackedArtifactsTest
[INFO] Tests run: 2, Failures: 0, Errors: 0, Skipped: 0, Time elapsed: 20.629 s - in org.eclipse.tycho.test.packaging.RepositoryPackedArtifactsTest
[INFO] Running org.eclipse.tycho.test.eeProfile.Java12ResolutionTest
[INFO] Tests run: 1, Failures: 0, Errors: 0, Skipped: 0, Time elapsed: 11.285 s - in org.eclipse.tycho.test.eeProfile.Java12ResolutionTest
[INFO] Running org.eclipse.tycho.test.eeProfile.Java13ResolutionTest
[INFO] Tests run: 1, Failures: 0, Errors: 0, Skipped: 0, Time elapsed: 11.893 s - in org.eclipse.tycho.test.eeProfile.Java13ResolutionTest
[INFO] Running org.eclipse.tycho.test.eeProfile.Java7ResolutionTest
[INFO] Tests run: 3, Failures: 0, Errors: 0, Skipped: 0, Time elapsed: 18.097 s - in org.eclipse.tycho.test.eeProfile.Java7ResolutionTest
[INFO] Running org.eclipse.tycho.test.eeProfile.DependencyResolverEETest
[INFO] Tests run: 3, Failures: 0, Errors: 0, Skipped: 0, Time elapsed: 19.536 s - in org.eclipse.tycho.test.eeProfile.DependencyResolverEETest
[INFO] Running org.eclipse.tycho.test.eeProfile.CustomProfileIntegrationTest
[INFO] Tests run: 1, Failures: 0, Errors: 0, Skipped: 0, Time elapsed: 14.343 s - in org.eclipse.tycho.test.eeProfile.CustomProfileIntegrationTest
[INFO] Running org.eclipse.tycho.test.eeProfile.Java11ResolutionTest
[INFO] Tests run: 1, Failures: 0, Errors: 0, Skipped: 0, Time elapsed: 11.084 s - in org.eclipse.tycho.test.eeProfile.Java11ResolutionTest
[INFO] Running org.eclipse.tycho.test.eeProfile.Java10ResolutionTest
[INFO] Tests run: 1, Failures: 0, Errors: 0, Skipped: 0, Time elapsed: 10.218 s - in org.eclipse.tycho.test.eeProfile.Java10ResolutionTest
[INFO] Running org.eclipse.tycho.test.eeProfile.FragmentsAttachedTest
[INFO] Tests run: 1, Failures: 0, Errors: 0, Skipped: 0, Time elapsed: 9.383 s - in org.eclipse.tycho.test.eeProfile.FragmentsAttachedTest
[INFO] Running org.eclipse.tycho.test.TYCHO0439repositoryCategories.RepositoryCategoriesTest
[INFO] Tests run: 1, Failures: 0, Errors: 0, Skipped: 0, Time elapsed: 11.61 s - in org.eclipse.tycho.test.TYCHO0439repositoryCategories.RepositoryCategoriesTest
[INFO] Running org.eclipse.tycho.test.TYCHO240includeLaunchers.IncludeLaunchersTest
[INFO] Tests run: 2, Failures: 0, Errors: 0, Skipped: 0, Time elapsed: 7.041 s - in org.eclipse.tycho.test.TYCHO240includeLaunchers.IncludeLaunchersTest
[INFO] Running org.eclipse.tycho.test.TYCHO279HttpProxy.ProxySupportTest
[INFO] Tests run: 3, Failures: 0, Errors: 0, Skipped: 0, Time elapsed: 23.726 s - in org.eclipse.tycho.test.TYCHO279HttpProxy.ProxySupportTest
[INFO] Running org.eclipse.tycho.test.pomDependencyConsider.PomDependencyOnLocallyBuiltTychoArtifactTest
[INFO] Tests run: 1, Failures: 0, Errors: 0, Skipped: 0, Time elapsed: 19.487 s - in org.eclipse.tycho.test.pomDependencyConsider.PomDependencyOnLocallyBuiltTychoArtifactTest
[INFO] Running org.eclipse.tycho.test.pomDependencyConsider.PomDependencyOnNonTychoArtifactTest
[INFO] Tests run: 1, Failures: 0, Errors: 0, Skipped: 0, Time elapsed: 9.735 s - in org.eclipse.tycho.test.pomDependencyConsider.PomDependencyOnNonTychoArtifactTest
[INFO] Running org.eclipse.tycho.test.pomDependencyConsider.PomDependencySystemScopedTest
[INFO] Tests run: 1, Failures: 0, Errors: 0, Skipped: 0, Time elapsed: 13.005 s - in org.eclipse.tycho.test.pomDependencyConsider.PomDependencySystemScopedTest
[INFO] Running org.eclipse.tycho.test.TYCHO308importSystemPackage.ImportSystemPackagesTest
[INFO] Tests run: 2, Failures: 0, Errors: 0, Skipped: 0, Time elapsed: 15.539 s - in org.eclipse.tycho.test.TYCHO308importSystemPackage.ImportSystemPackagesTest
[INFO] Running org.eclipse.tycho.test.limitations.NonUniqueBasedirsTest
[INFO] Tests run: 1, Failures: 0, Errors: 0, Skipped: 0, Time elapsed: 2.398 s - in org.eclipse.tycho.test.limitations.NonUniqueBasedirsTest
[INFO] Running org.eclipse.tycho.test.limitations.MixedTychoVersionsTest
[INFO] Tests run: 1, Failures: 0, Errors: 0, Skipped: 0, Time elapsed: 4.783 s - in org.eclipse.tycho.test.limitations.MixedTychoVersionsTest
[INFO] Running org.eclipse.tycho.test.licenseFeature.LicenseFeatureTest
[INFO] Tests run: 1, Failures: 0, Errors: 0, Skipped: 0, Time elapsed: 9.093 s - in org.eclipse.tycho.test.licenseFeature.LicenseFeatureTest
[INFO] Running org.eclipse.tycho.test.licenseFeature.SetLicenseFeatureVersionTest
[INFO] Tests run: 1, Failures: 0, Errors: 0, Skipped: 0, Time elapsed: 5.572 s - in org.eclipse.tycho.test.licenseFeature.SetLicenseFeatureVersionTest
[INFO] Running org.eclipse.tycho.test.mngeclipse937.CustomSourceEncodingTest
[INFO] Tests run: 1, Failures: 0, Errors: 0, Skipped: 0, Time elapsed: 11.59 s - in org.eclipse.tycho.test.mngeclipse937.CustomSourceEncodingTest
[INFO] Running org.eclipse.tycho.test.jarsigning.JarSigningTest
[INFO] Tests run: 1, Failures: 0, Errors: 0, Skipped: 0, Time elapsed: 26.599 s - in org.eclipse.tycho.test.jarsigning.JarSigningTest
[INFO] Running org.eclipse.tycho.test.TYCHO0404pomDependencyConsiderExtraClasspath.PomDependencyConsiderExtraClasspathTest
[INFO] Tests run: 1, Failures: 0, Errors: 0, Skipped: 0, Time elapsed: 8.981 s - in org.eclipse.tycho.test.TYCHO0404pomDependencyConsiderExtraClasspath.PomDependencyConsiderExtraClasspathTest
[INFO] Running org.eclipse.tycho.test.TYCHO246rcpSourceBundles.TYCHO246rcpSourceBundlesTest
[INFO] Tests run: 1, Failures: 0, Errors: 0, Skipped: 0, Time elapsed: 6.525 s - in org.eclipse.tycho.test.TYCHO246rcpSourceBundles.TYCHO246rcpSourceBundlesTest
[INFO] Running org.eclipse.tycho.test.TYCHO253extraClassPathEntries.ExtraClassPathEntriesTest
[INFO] Tests run: 3, Failures: 0, Errors: 0, Skipped: 0, Time elapsed: 24.12 s - in org.eclipse.tycho.test.TYCHO253extraClassPathEntries.ExtraClassPathEntriesTest
[INFO] Running org.eclipse.tycho.test.TYCHO0383dotQualifierMatching.DotQualifierMatchingTest
[INFO] Tests run: 2, Failures: 0, Errors: 0, Skipped: 0, Time elapsed: 16.231 s - in org.eclipse.tycho.test.TYCHO0383dotQualifierMatching.DotQualifierMatchingTest
[INFO] Running org.eclipse.tycho.test.versionsplugin.TychoVersionsPluginCompatibilityTest
[INFO] Tests run: 1, Failures: 0, Errors: 0, Skipped: 0, Time elapsed: 3.36 s - in org.eclipse.tycho.test.versionsplugin.TychoVersionsPluginCompatibilityTest
[INFO] Running org.eclipse.tycho.test.p2Repository.RepoRefLocationP2RepositoryIntegrationTest
[INFO] Tests run: 1, Failures: 0, Errors: 0, Skipped: 0, Time elapsed: 8.61 s - in org.eclipse.tycho.test.p2Repository.RepoRefLocationP2RepositoryIntegrationTest
[INFO] Running org.eclipse.tycho.test.p2Repository.QualifierExpansionAndArtifactAssemblyTest
[INFO] Tests run: 6, Failures: 0, Errors: 0, Skipped: 0, Time elapsed: 10.628 s - in org.eclipse.tycho.test.p2Repository.QualifierExpansionAndArtifactAssemblyTest
[INFO] Running org.eclipse.tycho.test.p2Repository.BasicP2RepositoryIntegrationTest
[INFO] Tests run: 6, Failures: 0, Errors: 0, Skipped: 0, Time elapsed: 8.198 s - in org.eclipse.tycho.test.p2Repository.BasicP2RepositoryIntegrationTest
[INFO] Running org.eclipse.tycho.test.p2Repository.P2RepositoryPropertiesTest
[INFO] Tests run: 1, Failures: 0, Errors: 0, Skipped: 0, Time elapsed: 10.015 s - in org.eclipse.tycho.test.p2Repository.P2RepositoryPropertiesTest
[INFO] Running org.eclipse.tycho.test.p2Repository.TransitiveP2RepoTest
[INFO] Tests run: 2, Failures: 0, Errors: 0, Skipped: 0, Time elapsed: 11.647 s - in org.eclipse.tycho.test.p2Repository.TransitiveP2RepoTest
[INFO] Running org.eclipse.tycho.test.TYCHO449SrcIncludesExcludes.Tycho449SrcIncludesExcludesTest
[INFO] Tests run: 1, Failures: 0, Errors: 0, Skipped: 0, Time elapsed: 8.412 s - in org.eclipse.tycho.test.TYCHO449SrcIncludesExcludes.Tycho449SrcIncludesExcludesTest
[INFO] Running org.eclipse.tycho.test.TYCHO502sourceBundleQualifier.Tycho502SourceBundleQualifierTest
[INFO] Tests run: 1, Failures: 0, Errors: 0, Skipped: 0, Time elapsed: 13.168 s - in org.eclipse.tycho.test.TYCHO502sourceBundleQualifier.Tycho502SourceBundleQualifierTest
[INFO] Running org.eclipse.tycho.test.TYCHO321deployableFeature.DeployableFeatureTest
[INFO] Tests run: 1, Failures: 0, Errors: 0, Skipped: 0, Time elapsed: 10.03 s - in org.eclipse.tycho.test.TYCHO321deployableFeature.DeployableFeatureTest
[INFO] Running org.eclipse.tycho.test.TYCHO0367localRepositoryCrosstalk.LocalRepositoryCrosstalkTest
[INFO] Tests run: 1, Failures: 0, Errors: 0, Skipped: 0, Time elapsed: 18.693 s - in org.eclipse.tycho.test.TYCHO0367localRepositoryCrosstalk.LocalRepositoryCrosstalkTest
[INFO] Running org.eclipse.tycho.test.sourceBundle.AutoNoSourceBundleTest
[INFO] Tests run: 1, Failures: 0, Errors: 0, Skipped: 0, Time elapsed: 5.646 s - in org.eclipse.tycho.test.sourceBundle.AutoNoSourceBundleTest
[INFO] Running org.eclipse.tycho.test.sourceBundle.SourceBundlesNestedJarsTest
[INFO] Tests run: 1, Failures: 0, Errors: 0, Skipped: 0, Time elapsed: 12.177 s - in org.eclipse.tycho.test.sourceBundle.SourceBundlesNestedJarsTest
[INFO] Running org.eclipse.tycho.test.tycho98.Tycho98MultiSourcesBundleJarTest
[INFO] Tests run: 1, Failures: 0, Errors: 0, Skipped: 0, Time elapsed: 12.183 s - in org.eclipse.tycho.test.tycho98.Tycho98MultiSourcesBundleJarTest
[INFO] Running org.eclipse.tycho.test.featurePatch.EclipseRepoIncludingFeaturePatchTest
[INFO] Tests run: 1, Failures: 0, Errors: 0, Skipped: 0, Time elapsed: 8.901 s - in org.eclipse.tycho.test.featurePatch.EclipseRepoIncludingFeaturePatchTest
[INFO] Running org.eclipse.tycho.test.featurePatch.FeaturePatchTest
[INFO] Tests run: 1, Failures: 0, Errors: 0, Skipped: 0, Time elapsed: 6.02 s - in org.eclipse.tycho.test.featurePatch.FeaturePatchTest
[INFO] Running org.eclipse.tycho.test.TYCHO0453expandReleaseVersion.ExpandReleaseVersionTest
[INFO] Tests run: 1, Failures: 0, Errors: 0, Skipped: 0, Time elapsed: 9.753 s - in org.eclipse.tycho.test.TYCHO0453expandReleaseVersion.ExpandReleaseVersionTest
[INFO] Running org.eclipse.tycho.test.MissingPluginVersionsTest
[INFO] Tests run: 1, Failures: 0, Errors: 0, Skipped: 0, Time elapsed: 8.058 s - in org.eclipse.tycho.test.MissingPluginVersionsTest
[INFO] Running org.eclipse.tycho.test.tycho476.ExecutionEnvironmentTest
[INFO] Tests run: 1, Failures: 0, Errors: 0, Skipped: 0, Time elapsed: 6.11 s - in org.eclipse.tycho.test.tycho476.ExecutionEnvironmentTest
[INFO] Running org.eclipse.tycho.test.mngeclipse1105PackageRootFiles.PackageRootFilesTest
[INFO] Tests run: 1, Failures: 0, Errors: 0, Skipped: 0, Time elapsed: 8.798 s - in org.eclipse.tycho.test.mngeclipse1105PackageRootFiles.PackageRootFilesTest
[INFO] Running org.eclipse.tycho.test.symlinks.SymbolicLinkTest
[INFO] Tests run: 1, Failures: 0, Errors: 0, Skipped: 0, Time elapsed: 6.005 s - in org.eclipse.tycho.test.symlinks.SymbolicLinkTest
[INFO] Running org.eclipse.tycho.test.TYCHO192sourceBundles.Tycho192SourceBundleTest
[INFO] Tests run: 1, Failures: 0, Errors: 0, Skipped: 0, Time elapsed: 15.612 s - in org.eclipse.tycho.test.TYCHO192sourceBundles.Tycho192SourceBundleTest
[INFO] Running org.eclipse.tycho.test.TYCHO330validateVersion.ValidateVersionTest
[INFO] Tests run: 2, Failures: 0, Errors: 0, Skipped: 0, Time elapsed: 11.174 s - in org.eclipse.tycho.test.TYCHO330validateVersion.ValidateVersionTest
[INFO] Running org.eclipse.tycho.test.tycho503.TYCHO503DoubleEncodedUrlTest
[INFO] Tests run: 1, Failures: 0, Errors: 0, Skipped: 0, Time elapsed: 16.915 s - in org.eclipse.tycho.test.tycho503.TYCHO503DoubleEncodedUrlTest
[INFO] Running org.eclipse.tycho.test.tycho001.P2MetadataGenerationTest
[INFO] Tests run: 1, Failures: 0, Errors: 0, Skipped: 0, Time elapsed: 12.858 s - in org.eclipse.tycho.test.tycho001.P2MetadataGenerationTest
[INFO] Running org.eclipse.tycho.test.TYCHO0452conflictingDependencies.ConflictingDependenciesTest
[INFO] Tests run: 1, Failures: 0, Errors: 0, Skipped: 0, Time elapsed: 9.003 s - in org.eclipse.tycho.test.TYCHO0452conflictingDependencies.ConflictingDependenciesTest
[INFO] Running org.eclipse.tycho.test.feature.FeatureWithMultipleFiltersTest
[INFO] Tests run: 1, Failures: 0, Errors: 0, Skipped: 0, Time elapsed: 7.636 s - in org.eclipse.tycho.test.feature.FeatureWithMultipleFiltersTest
[INFO] Running org.eclipse.tycho.test.pomGenerator.Tycho122GeneratePomFileTest
[INFO] Tests run: 1, Failures: 0, Errors: 0, Skipped: 0, Time elapsed: 2.417 s - in org.eclipse.tycho.test.pomGenerator.Tycho122GeneratePomFileTest
[INFO] Running org.eclipse.tycho.test.pomGenerator.TYCHO45Test
[INFO] Tests run: 1, Failures: 0, Errors: 0, Skipped: 0, Time elapsed: 22.396 s - in org.eclipse.tycho.test.pomGenerator.TYCHO45Test
[INFO] Running org.eclipse.tycho.test.resolver.ExtraCompilerRequirementsTest
[INFO] Tests run: 5, Failures: 0, Errors: 0, Skipped: 0, Time elapsed: 56.278 s - in org.eclipse.tycho.test.resolver.ExtraCompilerRequirementsTest
[INFO] Running org.eclipse.tycho.test.resolver.OptionalDependenciesTest
[INFO] Tests run: 2, Failures: 0, Errors: 0, Skipped: 0, Time elapsed: 18.186 s - in org.eclipse.tycho.test.resolver.OptionalDependenciesTest
[INFO] Running org.eclipse.tycho.test.downloadstats.DownloadStatsTest
[INFO] Tests run: 2, Failures: 0, Errors: 0, Skipped: 0, Time elapsed: 21.857 s - in org.eclipse.tycho.test.downloadstats.DownloadStatsTest
[INFO] Running org.eclipse.tycho.test.iu.ProductWithIUTest
[INFO] Tests run: 1, Failures: 0, Errors: 0, Skipped: 0, Time elapsed: 9.801 s - in org.eclipse.tycho.test.iu.ProductWithIUTest
[INFO] Running org.eclipse.tycho.test.iu.IUMetadataGenerationTest
[INFO] Tests run: 2, Failures: 0, Errors: 0, Skipped: 0, Time elapsed: 8.561 s - in org.eclipse.tycho.test.iu.IUMetadataGenerationTest
[INFO] Running org.eclipse.tycho.test.TYCHO300launcherIcons.LauncherIconsTest
[INFO] Tests run: 1, Failures: 0, Errors: 0, Skipped: 0, Time elapsed: 4.035 s - in org.eclipse.tycho.test.TYCHO300launcherIcons.LauncherIconsTest
[INFO] Running org.eclipse.tycho.test.MNGECLIPSE949jarDirectoryBundles.JarDirectoryBundlesTest
[INFO] Tests run: 1, Failures: 0, Errors: 0, Skipped: 0, Time elapsed: 9.291 s - in org.eclipse.tycho.test.MNGECLIPSE949jarDirectoryBundles.JarDirectoryBundlesTest
[INFO] Running org.eclipse.tycho.test.TYCHO418pomDependencyConsider.PomDependencyConsiderTest
[INFO] Tests run: 1, Failures: 0, Errors: 0, Skipped: 0, Time elapsed: 15.382 s - in org.eclipse.tycho.test.TYCHO418pomDependencyConsider.PomDependencyConsiderTest
[INFO] Running org.eclipse.tycho.test.TYCHO109product.Tycho109ProductExportTest
[INFO] Tests run: 3, Failures: 0, Errors: 0, Skipped: 0, Time elapsed: 18.912 s - in org.eclipse.tycho.test.TYCHO109product.Tycho109ProductExportTest
[INFO] Running org.eclipse.tycho.test.TYCHO0209tychoRepositoryRoundtrip.TychoRepositoryRoundtripTest
[INFO] Tests run: 1, Failures: 0, Errors: 0, Skipped: 0, Time elapsed: 38.376 s - in org.eclipse.tycho.test.TYCHO0209tychoRepositoryRoundtrip.TychoRepositoryRoundtripTest
[INFO] Running org.eclipse.tycho.test.tycho154.Tycho154BundleJarTest
[INFO] Tests run: 1, Failures: 0, Errors: 0, Skipped: 0, Time elapsed: 10.913 s - in org.eclipse.tycho.test.tycho154.Tycho154BundleJarTest
[INFO] Running org.eclipse.tycho.test.tycho026.Tycho26MissingFeatureTest
[INFO] Tests run: 1, Failures: 0, Errors: 0, Skipped: 0, Time elapsed: 3.519 s - in org.eclipse.tycho.test.tycho026.Tycho26MissingFeatureTest
[INFO] 
[INFO] Results:
[INFO] 
[WARNING] Tests run: 189, Failures: 0, Errors: 0, Skipped: 1
[INFO] 
[INFO] 
[INFO] --- maven-jar-plugin:3.1.2:jar (default-jar) @ tycho-its ---
[WARNING] JAR will be empty - no content was marked for inclusion!
[INFO] Building jar: /jobs/genie.tycho/tycho-build-with-maven-snapshots/workspace/tycho-its/target/tycho-its-1.6.0-SNAPSHOT.jar
[INFO] 
[INFO] --- maven-source-plugin:3.1.0:jar-no-fork (default) @ tycho-its ---
[INFO] No sources in project. Archive not created.
[INFO] 
[INFO] --- maven-install-plugin:2.5.2:install (default-install) @ tycho-its ---
[INFO] Installing /jobs/genie.tycho/tycho-build-with-maven-snapshots/workspace/tycho-its/target/tycho-its-1.6.0-SNAPSHOT.jar to /home/hudson/genie.tycho/.jenkins/jobs/tycho-build-with-maven-snapshots/workspace/.m2/repo/org/eclipse/tycho/tycho-its/1.6.0-SNAPSHOT/tycho-its-1.6.0-SNAPSHOT.jar
[INFO] Installing /jobs/genie.tycho/tycho-build-with-maven-snapshots/workspace/tycho-its/pom.xml to /home/hudson/genie.tycho/.jenkins/jobs/tycho-build-with-maven-snapshots/workspace/.m2/repo/org/eclipse/tycho/tycho-its/1.6.0-SNAPSHOT/tycho-its-1.6.0-SNAPSHOT.pom
[INFO] ------------------------------------------------------------------------
[INFO] Reactor Summary for Tycho 1.6.0-SNAPSHOT:
[INFO] 
[INFO] Tycho .............................................. SUCCESS [  1.045 s]
[INFO] Tycho OSGi Bundles Parent .......................... SUCCESS [  0.007 s]
[INFO] Tycho OSGi Bundles Target Platform ................. SUCCESS [  0.142 s]
[INFO] Tycho Noop Equinox password provider ............... SUCCESS [  2.214 s]
[INFO] Repository with p2 Director Bundles ................ SUCCESS [  2.054 s]
[INFO] Tycho Embedder API Maven/OSGi Shared Classes ....... SUCCESS [  0.193 s]
[INFO] Tycho Core Maven/OSGi Shared Classes ............... SUCCESS [  0.440 s]
[INFO] Tycho p2 Resolver Maven/OSGi Shared Classes ........ SUCCESS [  0.294 s]
[INFO] Tycho p2 Tools Maven/OSGi Shared Classes ........... SUCCESS [  0.212 s]
[INFO] Tycho Maven/p2 Repository Integration .............. SUCCESS [  0.715 s]
[INFO] Tycho p2 Resolver Bundle ........................... SUCCESS [  0.873 s]
[INFO] Tycho p2 Tools Bundle .............................. SUCCESS [  0.324 s]
[INFO] Tycho Core Maven/OSGi Shared Classes Tests ......... SUCCESS [  2.905 s]
[INFO] Tycho Test Utilities ............................... SUCCESS [  0.388 s]
[INFO] Tycho p2 Resolver Bundle Tests ..................... SUCCESS [ 31.771 s]
[INFO] Tycho p2 Resolver Maven/OSGi Shared Classes Tests .. SUCCESS [  4.390 s]
[INFO] Tycho Maven/p2 Repository Integration Tests ........ SUCCESS [01:04 min]
[INFO] Tycho p2 Tools Tests ............................... SUCCESS [ 29.681 s]
[INFO] Tycho OSGi Runtime External Bundles ................ SUCCESS [  0.587 s]
[INFO] Sisu Equinox/Plexus bridge ......................... SUCCESS [  0.005 s]
[INFO] Sisu Equinox Services API .......................... SUCCESS [  6.946 s]
[INFO] Sisu Equinox Embedder .............................. SUCCESS [  1.707 s]
[INFO] Tycho Eclipse Project Metadata Model ............... SUCCESS [  1.669 s]
[INFO] Tycho Embedder API ................................. SUCCESS [  0.272 s]
[INFO] Tycho Testing Harness .............................. SUCCESS [  0.675 s]
[INFO] Tycho Core ......................................... SUCCESS [ 12.676 s]
[INFO] Sisu Equinox Launching ............................. SUCCESS [  1.972 s]
[INFO] Tycho JVM Library Detector ......................... SUCCESS [  1.025 s]
[INFO] Tycho JDT Compiler Component ....................... SUCCESS [  1.308 s]
[INFO] Tycho OSGi Compiler Plugin ......................... SUCCESS [ 17.990 s]
[INFO] Tycho OSGi Packaging Plugin ........................ SUCCESS [  8.777 s]
[INFO] Tycho p2 Tools Parent .............................. SUCCESS [  0.004 s]
[INFO] Tycho p2 Resolver Component ........................ SUCCESS [  1.149 s]
[INFO] Tycho OSGi Source Plugin ........................... SUCCESS [ 10.897 s]
[INFO] Tycho Target Platform Configuration Plugin ......... SUCCESS [  0.432 s]
[INFO] Tycho Maven Build Extension ........................ SUCCESS [  0.305 s]
[INFO] Tycho POM Generator Plugin ......................... SUCCESS [  3.485 s]
[INFO] Tycho Surefire OSGi Booter Eclipse Application ..... SUCCESS [ 10.314 s]
[INFO] Tycho Surefire Parent .............................. SUCCESS [  0.004 s]
[INFO] Tycho Surefire OSGi JUnit 3 Runner ................. SUCCESS [  0.438 s]
[INFO] Tycho Surefire OSGi JUnit 4 Runner ................. SUCCESS [  0.225 s]
[INFO] Tycho Surefire OSGi JUnit 4.7 Runner ............... SUCCESS [  0.659 s]
[INFO] Tycho Surefire OSGi JUnit 5 Runner ................. SUCCESS [  1.602 s]
[INFO] Tycho Surefire OSGi TestNG Runner .................. SUCCESS [  0.343 s]
[INFO] Tycho Surefire Plugin .............................. SUCCESS [  4.256 s]
[INFO] Tycho Release Parent ............................... SUCCESS [  0.004 s]
[INFO] Tycho Versions Plugin .............................. SUCCESS [  3.497 s]
[INFO] Tycho p2 Director Plugin ........................... SUCCESS [  1.856 s]
[INFO] tycho-artifactcomparator ........................... SUCCESS [  1.574 s]
[INFO] Tycho p2 Metadata Plugin ........................... SUCCESS [  1.507 s]
[INFO] Tycho p2 Publisher Plugin .......................... SUCCESS [  1.661 s]
[INFO] Tycho p2 Repository Plugin ......................... SUCCESS [  0.540 s]
[INFO] Tycho Extras ....................................... SUCCESS [  0.006 s]
[INFO] p2 Extras Plugin ................................... SUCCESS [ 24.413 s]
[INFO] Tycho Document Bundle Plugin ....................... SUCCESS [  6.809 s]
[INFO] Tycho Version Bump Plugin .......................... SUCCESS [  2.918 s]
[INFO] Source Feature Generation Plugin ................... SUCCESS [ 14.657 s]
[INFO] tycho-custom-bundle-plugin ......................... SUCCESS [  4.382 s]
[INFO] Eclipserun Plugin .................................. SUCCESS [  5.721 s]
[INFO] tycho-pack200 ...................................... SUCCESS [  0.004 s]
[INFO] tycho-pack200-impl ................................. SUCCESS [  0.128 s]
[INFO] Pack200 Normalization Plugin ....................... SUCCESS [  0.171 s]
[INFO] Pack200 Pack Plugin ................................ SUCCESS [  0.158 s]
[INFO] tycho-pack200-its .................................. SUCCESS [  2.028 s]
[INFO] tycho-buildtimestamp-jgit .......................... SUCCESS [ 14.189 s]
[INFO] tycho-sourceref-jgit ............................... SUCCESS [  1.136 s]
[INFO] Target Platform Validation Plugin .................. SUCCESS [ 16.857 s]
[INFO] Tycho POM-less build extension ..................... SUCCESS [ 22.847 s]
[INFO] Tycho Dependency Tools Plugin ...................... SUCCESS [  2.094 s]
[INFO] Tycho Extras Integration Tests ..................... SUCCESS [ 44.020 s]
[INFO] Tycho Integration Tests ............................ SUCCESS [32:18 min]
[INFO] ------------------------------------------------------------------------
[INFO] BUILD SUCCESS
[INFO] ------------------------------------------------------------------------
[INFO] Total time:  40:00 min
[INFO] Finished at: 2019-11-07T14:18:43-05:00
[INFO] ------------------------------------------------------------------------
Recording test results
Build step 'Publish JUnit test result report' changed build result to UNSTABLE
Sending e-mails to: mistria@redhat.com Martin.SCHREIBER@bachmann.info akurtakov@redhat.com jan.sievers@sap.com
Started calculate disk usage of build
Finished Calculation of disk usage of build in 0 seconds
Started calculate disk usage of workspace
Finished Calculation of disk usage of workspace in  1 second
Finished: UNSTABLE