FailedConsole Output

Started by user alexmonthy@efficios.com
Checkout:workspace / /home/hudson/genie.tracecompass/.hudson/jobs/tracecompass-test-traces-nightly/workspace - hudson.remoting.LocalChannel@5c0b8e70
Using strategy: Default
Last Built Revision: Revision 6507725dd124a32a3c76b67cfa61a3775e2da94d (origin/master)
Checkout:workspace / /home/hudson/genie.tracecompass/.hudson/jobs/tracecompass-test-traces-nightly/workspace - hudson.remoting.LocalChannel@5c0b8e70
Fetching changes from the remote Git repository
Fetching upstream changes from git://git.eclipse.org/gitroot/tracecompass/tracecompass-test-traces.git
Commencing build of Revision d4a363337b06caff09ae8e6b3b2843db2472ccfc (origin/master)
Checking out Revision d4a363337b06caff09ae8e6b3b2843db2472ccfc (origin/master)
[INFO] Using Maven 3 installation: Maven 3.0.5
[INFO] Checking Maven 3 installation environment
[workspace] $ /shared/common/apache-maven-3.0.5/bin/mvn --help
[INFO] Checking Maven 3 installation version
[INFO] Detected Maven 3 installation version: 3.0.5
[workspace] $ /shared/common/apache-maven-3.0.5/bin/mvn clean deploy -V -B -Dmaven.ext.class.path=/home/hudson/genie.tracecompass/.hudson/maven/slavebundle/resources:/home/hudson/genie.tracecompass/.hudson/maven/slavebundle/lib/maven3-eventspy-3.0.jar:/home/hudson/genie.tracecompass/.hudson/war/webapp/WEB-INF/lib/hudson-remoting-3.0.0.jar -Dhudson.eventspy.port=53566 -Dmaven.repo.local=/home/hudson/genie.tracecompass/.hudson/jobs/tracecompass-test-traces-nightly/workspace/.maven/repo -f pom.xml
[DEBUG] Waiting for connection on port: 53566
Apache Maven 3.0.5 (r01de14724cdef164cd33c7c8c2fe155faf9602da; 2013-02-19 08:51:28-0500)
Maven home: /shared/common/apache-maven-3.0.5
Java version: 1.8.0_51, vendor: Oracle Corporation
Java home: /opt/public/common/jdk1.8.0_51.x64/jre
Default locale: en_US, platform encoding: UTF-8
OS name: "linux", version: "3.0.101-0.46-default", arch: "amd64", family: "unix"
[DEBUG] Connected to remote
[INFO] Scanning for projects...
[INFO] ------------------------------------------------------------------------
[INFO] Reactor Build Order:
[INFO] 
[INFO] tracecompass-test-traces-parent
[INFO] tracecompass-test-traces-ctf
[INFO] tracecompass-test-traces-update-site
[INFO]                                                                         
[INFO] ------------------------------------------------------------------------
[INFO] Building tracecompass-test-traces-parent 1.0.0
[INFO] ------------------------------------------------------------------------
[INFO] 
[INFO] --- maven-clean-plugin:2.4.1:clean (default-clean) @ tracecompass-test-traces-parent ---
[INFO] 
[INFO] --- maven-install-plugin:2.3.1:install (default-install) @ tracecompass-test-traces-parent ---
[INFO] Installing /jobs/genie.tracecompass/tracecompass-test-traces-nightly/workspace/pom.xml to /home/hudson/genie.tracecompass/.hudson/jobs/tracecompass-test-traces-nightly/workspace/.maven/repo/org/eclipse/tracecompass/testtraces/tracecompass-test-traces-parent/1.0.0/tracecompass-test-traces-parent-1.0.0.pom
[INFO] 
[INFO] --- maven-deploy-plugin:2.7:deploy (default-deploy) @ tracecompass-test-traces-parent ---
Uploading: file:///home/data/httpd/archive.eclipse.org/tracecompass/tracecompass-test-traces/maven/org/eclipse/tracecompass/testtraces/tracecompass-test-traces-parent/1.0.0/tracecompass-test-traces-parent-1.0.0.pom
Uploaded: file:///home/data/httpd/archive.eclipse.org/tracecompass/tracecompass-test-traces/maven/org/eclipse/tracecompass/testtraces/tracecompass-test-traces-parent/1.0.0/tracecompass-test-traces-parent-1.0.0.pom (3 KB at 50.5 KB/sec)
Downloading: file:///home/data/httpd/archive.eclipse.org/tracecompass/tracecompass-test-traces/maven/org/eclipse/tracecompass/testtraces/tracecompass-test-traces-parent/maven-metadata.xml
Downloaded: file:///home/data/httpd/archive.eclipse.org/tracecompass/tracecompass-test-traces/maven/org/eclipse/tracecompass/testtraces/tracecompass-test-traces-parent/maven-metadata.xml (377 B at 73.6 KB/sec)
Uploading: file:///home/data/httpd/archive.eclipse.org/tracecompass/tracecompass-test-traces/maven/org/eclipse/tracecompass/testtraces/tracecompass-test-traces-parent/maven-metadata.xml
Uploaded: file:///home/data/httpd/archive.eclipse.org/tracecompass/tracecompass-test-traces/maven/org/eclipse/tracecompass/testtraces/tracecompass-test-traces-parent/maven-metadata.xml (377 B at 122.7 KB/sec)
[INFO]                                                                         
[INFO] ------------------------------------------------------------------------
[INFO] Building tracecompass-test-traces-ctf 1.0.0
[INFO] ------------------------------------------------------------------------
[INFO] 
[INFO] --- maven-clean-plugin:2.4.1:clean (default-clean) @ tracecompass-test-traces-ctf ---
[INFO] Deleting /jobs/genie.tracecompass/tracecompass-test-traces-nightly/workspace/ctf/target
[INFO] 
[INFO] --- maven-resources-plugin:2.5:resources (default-resources) @ tracecompass-test-traces-ctf ---
[debug] execute contextualize
[WARNING] Using platform encoding (UTF-8 actually) to copy filtered resources, i.e. build is platform dependent!
[INFO] Copying 2194 resources
[INFO] 
[INFO] --- maven-compiler-plugin:3.3:compile (default-compile) @ tracecompass-test-traces-ctf ---
[INFO] Changes detected - recompiling the module!
[WARNING] File encoding has not been set, using platform encoding UTF-8, i.e. build is platform dependent!
[INFO] Compiling 1 source file to /jobs/genie.tracecompass/tracecompass-test-traces-nightly/workspace/ctf/target/classes
[INFO] 
[INFO] --- maven-bundle-plugin:2.1.0:manifest (bundle-manifest) @ tracecompass-test-traces-ctf ---
[WARNING] Warning in manifest for org.eclipse.tracecompass.testtraces:tracecompass-test-traces-ctf:jar:1.0.0 : Superfluous export-package instructions: [exp, org.eclipse.tracecompass.testtraces, django-benchmark, org.eclipse.tracecompass, org, org.eclipse, synctraces]
[INFO] 
[INFO] --- maven-resources-plugin:2.5:testResources (default-testResources) @ tracecompass-test-traces-ctf ---
[debug] execute contextualize
[WARNING] Using platform encoding (UTF-8 actually) to copy filtered resources, i.e. build is platform dependent!
[INFO] skip non existing resourceDirectory /jobs/genie.tracecompass/tracecompass-test-traces-nightly/workspace/ctf/src/test/resources
[INFO] 
[INFO] --- maven-compiler-plugin:3.3:testCompile (default-testCompile) @ tracecompass-test-traces-ctf ---
[INFO] Changes detected - recompiling the module!
[WARNING] File encoding has not been set, using platform encoding UTF-8, i.e. build is platform dependent!
[INFO] Compiling 1 source file to /jobs/genie.tracecompass/tracecompass-test-traces-nightly/workspace/ctf/target/test-classes
[INFO] 
[INFO] --- maven-surefire-plugin:2.10:test (default-test) @ tracecompass-test-traces-ctf ---
[INFO] Surefire report directory: /jobs/genie.tracecompass/tracecompass-test-traces-nightly/workspace/ctf/target/surefire-reports

-------------------------------------------------------
 T E S T S
-------------------------------------------------------
Running org.eclipse.tracecompass.testtraces.ctf.CtfTestTraceTest
Tests run: 1, Failures: 0, Errors: 0, Skipped: 0, Time elapsed: 0.071 sec

Results :

Tests run: 1, Failures: 0, Errors: 0, Skipped: 0

[INFO] 
[INFO] --- maven-jar-plugin:2.3.1:jar (default-jar) @ tracecompass-test-traces-ctf ---
[INFO] Building jar: /jobs/genie.tracecompass/tracecompass-test-traces-nightly/workspace/ctf/target/tracecompass-test-traces-ctf-1.0.0.jar
[INFO] 
[INFO] >>> maven-source-plugin:2.4:jar (attach-sources) @ tracecompass-test-traces-ctf >>>
[INFO] 
[INFO] <<< maven-source-plugin:2.4:jar (attach-sources) @ tracecompass-test-traces-ctf <<<
[INFO] 
[INFO] --- maven-source-plugin:2.4:jar (attach-sources) @ tracecompass-test-traces-ctf ---
[INFO] Building jar: /jobs/genie.tracecompass/tracecompass-test-traces-nightly/workspace/ctf/target/tracecompass-test-traces-ctf-1.0.0-sources.jar
[INFO] 
[INFO] --- maven-install-plugin:2.3.1:install (default-install) @ tracecompass-test-traces-ctf ---
[INFO] Installing /jobs/genie.tracecompass/tracecompass-test-traces-nightly/workspace/ctf/target/tracecompass-test-traces-ctf-1.0.0.jar to /home/hudson/genie.tracecompass/.hudson/jobs/tracecompass-test-traces-nightly/workspace/.maven/repo/org/eclipse/tracecompass/testtraces/tracecompass-test-traces-ctf/1.0.0/tracecompass-test-traces-ctf-1.0.0.jar
[INFO] Installing /jobs/genie.tracecompass/tracecompass-test-traces-nightly/workspace/ctf/pom.xml to /home/hudson/genie.tracecompass/.hudson/jobs/tracecompass-test-traces-nightly/workspace/.maven/repo/org/eclipse/tracecompass/testtraces/tracecompass-test-traces-ctf/1.0.0/tracecompass-test-traces-ctf-1.0.0.pom
[INFO] Installing /jobs/genie.tracecompass/tracecompass-test-traces-nightly/workspace/ctf/target/tracecompass-test-traces-ctf-1.0.0-sources.jar to /home/hudson/genie.tracecompass/.hudson/jobs/tracecompass-test-traces-nightly/workspace/.maven/repo/org/eclipse/tracecompass/testtraces/tracecompass-test-traces-ctf/1.0.0/tracecompass-test-traces-ctf-1.0.0-sources.jar
[INFO] 
[INFO] --- maven-deploy-plugin:2.7:deploy (default-deploy) @ tracecompass-test-traces-ctf ---
Uploading: file:///home/data/httpd/archive.eclipse.org/tracecompass/tracecompass-test-traces/maven/org/eclipse/tracecompass/testtraces/tracecompass-test-traces-ctf/1.0.0/tracecompass-test-traces-ctf-1.0.0.jar
Uploaded: file:///home/data/httpd/archive.eclipse.org/tracecompass/tracecompass-test-traces/maven/org/eclipse/tracecompass/testtraces/tracecompass-test-traces-ctf/1.0.0/tracecompass-test-traces-ctf-1.0.0.jar (52546 KB at 21686.3 KB/sec)
Uploading: file:///home/data/httpd/archive.eclipse.org/tracecompass/tracecompass-test-traces/maven/org/eclipse/tracecompass/testtraces/tracecompass-test-traces-ctf/1.0.0/tracecompass-test-traces-ctf-1.0.0.pom
Uploaded: file:///home/data/httpd/archive.eclipse.org/tracecompass/tracecompass-test-traces/maven/org/eclipse/tracecompass/testtraces/tracecompass-test-traces-ctf/1.0.0/tracecompass-test-traces-ctf-1.0.0.pom (2 KB at 4.6 KB/sec)
Downloading: file:///home/data/httpd/archive.eclipse.org/tracecompass/tracecompass-test-traces/maven/org/eclipse/tracecompass/testtraces/tracecompass-test-traces-ctf/maven-metadata.xml
Downloaded: file:///home/data/httpd/archive.eclipse.org/tracecompass/tracecompass-test-traces/maven/org/eclipse/tracecompass/testtraces/tracecompass-test-traces-ctf/maven-metadata.xml (374 B at 91.3 KB/sec)
Uploading: file:///home/data/httpd/archive.eclipse.org/tracecompass/tracecompass-test-traces/maven/org/eclipse/tracecompass/testtraces/tracecompass-test-traces-ctf/maven-metadata.xml
Uploaded: file:///home/data/httpd/archive.eclipse.org/tracecompass/tracecompass-test-traces/maven/org/eclipse/tracecompass/testtraces/tracecompass-test-traces-ctf/maven-metadata.xml (374 B at 7.5 KB/sec)
Uploading: file:///home/data/httpd/archive.eclipse.org/tracecompass/tracecompass-test-traces/maven/org/eclipse/tracecompass/testtraces/tracecompass-test-traces-ctf/1.0.0/tracecompass-test-traces-ctf-1.0.0-sources.jar
Uploaded: file:///home/data/httpd/archive.eclipse.org/tracecompass/tracecompass-test-traces/maven/org/eclipse/tracecompass/testtraces/tracecompass-test-traces-ctf/1.0.0/tracecompass-test-traces-ctf-1.0.0-sources.jar (4 KB at 394.4 KB/sec)
[INFO]                                                                         
[INFO] ------------------------------------------------------------------------
[INFO] Building tracecompass-test-traces-update-site 1.0.0
[INFO] ------------------------------------------------------------------------
[INFO] 
[INFO] --- maven-clean-plugin:2.4.1:clean (default-clean) @ tracecompass-test-traces-update-site ---
[INFO] Deleting /jobs/genie.tracecompass/tracecompass-test-traces-nightly/workspace/update-site/target
[INFO] 
[INFO] --- p2-maven-plugin:1.2.0-SNAPSHOT:site (generate-p2-repo) @ tracecompass-test-traces-update-site ---
[info] Resolving artifact=[org.eclipse.tracecompass.testtraces:tracecompass-test-traces-ctf:1.0.0] transitive=[true] source=[true]
[info] 	 [JAR] tracecompass-test-traces-ctf-1.0.0.jar
[info] 	 [SRC] tracecompass-test-traces-ctf-1.0.0-sources.jar
[info] 	 [JAR] junit-4.12.jar
[info] 	 [SRC] junit-4.12-sources.jar
[info] 	 [JAR] hamcrest-core-1.3.jar
[info] 	 [SRC] hamcrest-core-1.3-sources.jar
[info] Executing Bundler:
[info] 	 [SKIP] tracecompass-test-traces-ctf-1.0.0.jar
[info] 	 [EXEC] tracecompass-test-traces-ctf-1.0.0-sources.jar
[info] Executing Bundler:
[info] 	 [EXEC] junit-4.12.jar
[warn]  : Superfluous export-package instructions: [junit, org]
[info] 	 [EXEC] junit-4.12-sources.jar
[info] Executing Bundler:
[info] 	 [EXEC] hamcrest-core-1.3.jar
[warn]  : Superfluous export-package instructions: [org]
[info] 	 [EXEC] hamcrest-core-1.3-sources.jar
[info] Resolved 0 features
[INFO] Command line:
	/bin/sh -c cd /jobs/genie.tracecompass/tracecompass-test-traces-nightly/workspace/update-site && /opt/public/common/jdk1.8.0_51.x64/jre/bin/java -jar /jobs/genie.tracecompass/tracecompass-test-traces-nightly/workspace/.maven/repo/org/eclipse/tycho/tycho-bundles-external/0.18.1/eclipse/plugins/org.eclipse.equinox.launcher_1.3.0.v20130327-1440.jar -configuration /tmp/tycho-p2-runtime2533935964763219742.tmp/configuration -nosplash -application org.eclipse.equinox.p2.publisher.FeaturesAndBundlesPublisher -artifactRepository file:/jobs/genie.tracecompass/tracecompass-test-traces-nightly/workspace/update-site/target/repository -metadataRepository file:/jobs/genie.tracecompass/tracecompass-test-traces-nightly/workspace/update-site/target/repository -publishArtifacts -compress -source /jobs/genie.tracecompass/tracecompass-test-traces-nightly/workspace/update-site/target/source
Generating metadata for ..
Generation completed with success [0 seconds].
[INFO] Command line:
	/opt/public/common/jdk1.8.0_51.x64/jre/bin/java -jar /jobs/genie.tracecompass/tracecompass-test-traces-nightly/workspace/.maven/repo/org/eclipse/tycho/tycho-bundles-external/0.21.0/eclipse/plugins/org.eclipse.equinox.launcher_1.3.0.v20140415-2008.jar -configuration /tmp/tycho-p2-runtime5763715436475902608.tmp/configuration -nosplash -application org.eclipse.equinox.p2.publisher.CategoryPublisher -categoryDefinition file://jobs/genie.tracecompass/tracecompass-test-traces-nightly/workspace/update-site/target/repository/category.xml -metadataRepository file://jobs/genie.tracecompass/tracecompass-test-traces-nightly/workspace/update-site/target/repository
Generating metadata for ..
Generation completed with success [0 seconds].
[INFO] 
[INFO] --- maven-install-plugin:2.3.1:install (default-install) @ tracecompass-test-traces-update-site ---
[INFO] Installing /jobs/genie.tracecompass/tracecompass-test-traces-nightly/workspace/update-site/pom.xml to /home/hudson/genie.tracecompass/.hudson/jobs/tracecompass-test-traces-nightly/workspace/.maven/repo/org/eclipse/tracecompass/testtraces/tracecompass-test-traces-update-site/1.0.0/tracecompass-test-traces-update-site-1.0.0.pom
[INFO] 
[INFO] --- maven-deploy-plugin:2.7:deploy (default-deploy) @ tracecompass-test-traces-update-site ---
Uploading: file:///home/data/httpd/archive.eclipse.org/tracecompass/tracecompass-test-traces/maven/org/eclipse/tracecompass/testtraces/tracecompass-test-traces-update-site/1.0.0/tracecompass-test-traces-update-site-1.0.0.pom
Uploaded: file:///home/data/httpd/archive.eclipse.org/tracecompass/tracecompass-test-traces/maven/org/eclipse/tracecompass/testtraces/tracecompass-test-traces-update-site/1.0.0/tracecompass-test-traces-update-site-1.0.0.pom (3 KB at 5.1 KB/sec)
Downloading: file:///home/data/httpd/archive.eclipse.org/tracecompass/tracecompass-test-traces/maven/org/eclipse/tracecompass/testtraces/tracecompass-test-traces-update-site/maven-metadata.xml
Downloaded: file:///home/data/httpd/archive.eclipse.org/tracecompass/tracecompass-test-traces/maven/org/eclipse/tracecompass/testtraces/tracecompass-test-traces-update-site/maven-metadata.xml (382 B at 124.3 KB/sec)
Uploading: file:///home/data/httpd/archive.eclipse.org/tracecompass/tracecompass-test-traces/maven/org/eclipse/tracecompass/testtraces/tracecompass-test-traces-update-site/maven-metadata.xml
Uploaded: file:///home/data/httpd/archive.eclipse.org/tracecompass/tracecompass-test-traces/maven/org/eclipse/tracecompass/testtraces/tracecompass-test-traces-update-site/maven-metadata.xml (382 B at 186.5 KB/sec)
[INFO] 
[INFO] --- maven-antrun-plugin:1.8:run (deploy-p2-repo) @ tracecompass-test-traces-update-site ---
[INFO] Executing tasks

main:
[INFO] ------------------------------------------------------------------------
[INFO] Reactor Summary:
[INFO] 
[INFO] tracecompass-test-traces-parent ................... SUCCESS [0.502s]
[INFO] tracecompass-test-traces-ctf ...................... SUCCESS [32.641s]
[INFO] tracecompass-test-traces-update-site .............. FAILURE [13.147s]
[INFO] ------------------------------------------------------------------------
[INFO] BUILD FAILURE
[INFO] ------------------------------------------------------------------------
[INFO] Total time: 46.657s
[INFO] Finished at: Fri Nov 27 17:55:28 EST 2015
[INFO] Final Memory: 50M/2090M
[INFO] ------------------------------------------------------------------------
[INFO] o.h.m.e.h.MavenExecutionResultHandler - Build failed with exception(s)
[INFO] o.h.m.e.h.MavenExecutionResultHandler - [1] org.apache.maven.lifecycle.LifecycleExecutionException: Failed to execute goal org.apache.maven.plugins:maven-antrun-plugin:1.8:run (deploy-p2-repo) on project tracecompass-test-traces-update-site: An Ant BuildException has occured: Directory does not exist: /jobs/genie.tracecompass/tracecompass-test-traces-nightly/workspace/update-site/${deploy-destination}
around Ant part ...<delete includeemptydirs="false">... @ 4:36 in /jobs/genie.tracecompass/tracecompass-test-traces-nightly/workspace/update-site/target/antrun/build-main.xml
[DEBUG] Closing connection to remote
[ERROR] Failed to execute goal org.apache.maven.plugins:maven-antrun-plugin:1.8:run (deploy-p2-repo) on project tracecompass-test-traces-update-site: An Ant BuildException has occured: Directory does not exist: /jobs/genie.tracecompass/tracecompass-test-traces-nightly/workspace/update-site/${deploy-destination}
[ERROR] around Ant part ...<delete includeemptydirs="false">... @ 4:36 in /jobs/genie.tracecompass/tracecompass-test-traces-nightly/workspace/update-site/target/antrun/build-main.xml
[ERROR] -> [Help 1]
[ERROR] 
[ERROR] To see the full stack trace of the errors, re-run Maven with the -e switch.
[ERROR] Re-run Maven using the -X switch to enable full debug logging.
[ERROR] 
[ERROR] For more information about the errors and possible solutions, please read the following articles:
[ERROR] [Help 1] http://cwiki.apache.org/confluence/display/MAVEN/MojoExecutionException
[ERROR] 
[ERROR] After correcting the problems, you can resume the build with the command
[ERROR]   mvn <goals> -rf :tracecompass-test-traces-update-site
[DEBUG] Waiting for process to finish
[DEBUG] Result: 1
Recording test results
Sending e-mails to: alexmonthy@voxpopuli.im
Finished: FAILURE