FailedConsole Output

Skipping 24,803 KB.. Full Log
-signed-as-string](org.eclipse.tracecompass.tmf.ctf.ui.swtbot.tests.TestInvalidCtfTrace)  Time elapsed: 4.597 sec
testOpen[4: ../../ctf/org.eclipse.tracecompass.ctf.core.tests/traces/ctf-testsuite/tests/1.8/regression/metadata/fail/array-size-keyword](org.eclipse.tracecompass.tmf.ctf.ui.swtbot.tests.TestInvalidCtfTrace)  Time elapsed: 4.456 sec
testOpen[5: ../../ctf/org.eclipse.tracecompass.ctf.core.tests/traces/ctf-testsuite/tests/1.8/regression/metadata/fail/integer-range](org.eclipse.tracecompass.tmf.ctf.ui.swtbot.tests.TestInvalidCtfTrace)  Time elapsed: 4.635 sec
testOpen[6: ../../ctf/org.eclipse.tracecompass.ctf.core.tests/traces/ctf-testsuite/tests/1.8/regression/metadata/fail/integer-signed-invalid](org.eclipse.tracecompass.tmf.ctf.ui.swtbot.tests.TestInvalidCtfTrace)  Time elapsed: 4.273 sec
testOpen[7: ../../ctf/org.eclipse.tracecompass.ctf.core.tests/traces/ctf-testsuite/tests/1.8/regression/metadata/fail/struct-align-string](org.eclipse.tracecompass.tmf.ctf.ui.swtbot.tests.TestInvalidCtfTrace)  Time elapsed: 4.346 sec
testOpen[8: ../../ctf/org.eclipse.tracecompass.ctf.core.tests/traces/ctf-testsuite/tests/1.8/regression/metadata/fail/array-size-type-field](org.eclipse.tracecompass.tmf.ctf.ui.swtbot.tests.TestInvalidCtfTrace)  Time elapsed: 4.747 sec
testOpen[9: ../../ctf/org.eclipse.tracecompass.ctf.core.tests/traces/ctf-testsuite/tests/1.8/regression/metadata/fail/struct-duplicate-struct-name](org.eclipse.tracecompass.tmf.ctf.ui.swtbot.tests.TestInvalidCtfTrace)  Time elapsed: 4.652 sec
testOpen[10: ../../ctf/org.eclipse.tracecompass.ctf.core.tests/traces/ctf-testsuite/tests/1.8/regression/metadata/fail/integer-encoding-invalid](org.eclipse.tracecompass.tmf.ctf.ui.swtbot.tests.TestInvalidCtfTrace)  Time elapsed: 4.484 sec
testOpen[11: ../../ctf/org.eclipse.tracecompass.ctf.core.tests/traces/ctf-testsuite/tests/1.8/regression/metadata/fail/integer-size-as-string](org.eclipse.tracecompass.tmf.ctf.ui.swtbot.tests.TestInvalidCtfTrace)  Time elapsed: 4.853 sec
testOpen[12: ../../ctf/org.eclipse.tracecompass.ctf.core.tests/traces/ctf-testsuite/tests/1.8/regression/metadata/fail/array-size-type](org.eclipse.tracecompass.tmf.ctf.ui.swtbot.tests.TestInvalidCtfTrace)  Time elapsed: 5.05 sec
testOpen[13: ../../ctf/org.eclipse.tracecompass.ctf.core.tests/traces/ctf-testsuite/tests/1.8/regression/metadata/fail/array-size-not-present](org.eclipse.tracecompass.tmf.ctf.ui.swtbot.tests.TestInvalidCtfTrace)  Time elapsed: 4.346 sec
testOpen[14: ../../ctf/org.eclipse.tracecompass.ctf.core.tests/traces/ctf-testsuite/tests/1.8/regression/metadata/fail/struct-duplicate-field-name](org.eclipse.tracecompass.tmf.ctf.ui.swtbot.tests.TestInvalidCtfTrace)  Time elapsed: 4.147 sec
testOpen[15: ../../ctf/org.eclipse.tracecompass.ctf.core.tests/traces/ctf-testsuite/tests/1.8/regression/metadata/fail/array-size-string](org.eclipse.tracecompass.tmf.ctf.ui.swtbot.tests.TestInvalidCtfTrace)  Time elapsed: 3.938 sec
testOpen[16: ../../ctf/org.eclipse.tracecompass.ctf.core.tests/traces/ctf-testsuite/tests/1.8/regression/metadata/fail/integer-size-missing](org.eclipse.tracecompass.tmf.ctf.ui.swtbot.tests.TestInvalidCtfTrace)  Time elapsed: 4.568 sec
testOpen[17: ../../ctf/org.eclipse.tracecompass.ctf.core.tests/traces/ctf-testsuite/tests/1.8/regression/metadata/fail/integer-negative-bit-size](org.eclipse.tracecompass.tmf.ctf.ui.swtbot.tests.TestInvalidCtfTrace)  Time elapsed: 4.206 sec
testOpen[18: ../../ctf/org.eclipse.tracecompass.ctf.core.tests/traces/ctf-testsuite/tests/1.8/regression/metadata/fail/struct-align-enum](org.eclipse.tracecompass.tmf.ctf.ui.swtbot.tests.TestInvalidCtfTrace)  Time elapsed: 4.366 sec
testOpen[19: ../../ctf/org.eclipse.tracecompass.ctf.core.tests/traces/ctf-testsuite/tests/1.8/regression/metadata/fail/integer-encoding-as-string](org.eclipse.tracecompass.tmf.ctf.ui.swtbot.tests.TestInvalidCtfTrace)  Time elapsed: 4.722 sec
testOpen[20: ../../ctf/org.eclipse.tracecompass.ctf.core.tests/traces/ctf-testsuite/tests/1.8/regression/metadata/fail/struct-align-zero](org.eclipse.tracecompass.tmf.ctf.ui.swtbot.tests.TestInvalidCtfTrace)  Time elapsed: 5.207 sec
testOpen[21: ../../ctf/org.eclipse.tracecompass.ctf.core.tests/traces/ctf-testsuite/tests/1.8/regression/metadata/fail/array-redefinition](org.eclipse.tracecompass.tmf.ctf.ui.swtbot.tests.TestInvalidCtfTrace)  Time elapsed: 3.993 sec
testOpen[22: ../../ctf/org.eclipse.tracecompass.ctf.core.tests/traces/ctf-testsuite/tests/1.8/regression/metadata/fail/array-size-negative](org.eclipse.tracecompass.tmf.ctf.ui.swtbot.tests.TestInvalidCtfTrace)  Time elapsed: 4.93 sec
testOpen[23: ../../ctf/org.eclipse.tracecompass.ctf.core.tests/traces/ctf-testsuite/tests/1.8/regression/metadata/fail/struct-field-name-keyword](org.eclipse.tracecompass.tmf.ctf.ui.swtbot.tests.TestInvalidCtfTrace)  Time elapsed: 4.243 sec
test(org.eclipse.tracecompass.tmf.pcap.ui.swtbot.tests.ImportAndReadPcapTest)  Time elapsed: 28.496 sec
testPerspectiveComplete(org.eclipse.tracecompass.tmf.pcap.ui.swtbot.tests.NetworkPerspectiveChecker)  Time elapsed: 0 sec
testPerspectiveForViews(org.eclipse.tracecompass.tmf.pcap.ui.swtbot.tests.NetworkPerspectiveChecker)  Time elapsed: 0.001 sec
org.eclipse.tracecompass.tmf.remote.ui.swtbot.tests.fetch.FetchRemoteTracesTest(junit.framework.TestSuite)  Time elapsed: 0.002 sec  <<< ERROR!
java.lang.NoClassDefFoundError: Could not initialize class org.eclipse.tracecompass.tmf.remote.ui.swtbot.tests.fetch.FetchRemoteTracesTest
	at sun.reflect.NativeMethodAccessorImpl.invoke0(Native Method)
	at sun.reflect.NativeMethodAccessorImpl.invoke(NativeMethodAccessorImpl.java:57)
	at sun.reflect.DelegatingMethodAccessorImpl.invoke(DelegatingMethodAccessorImpl.java:43)
	at java.lang.reflect.Method.invoke(Method.java:606)
	at org.junit.runners.model.FrameworkMethod$1.runReflectiveCall(FrameworkMethod.java:50)
	at org.junit.internal.runners.model.ReflectiveCallable.run(ReflectiveCallable.java:12)
	at org.junit.runners.model.FrameworkMethod.invokeExplosively(FrameworkMethod.java:47)
	at org.junit.internal.runners.statements.RunBefores.evaluate(RunBefores.java:24)
	at org.junit.runners.ParentRunner.run(ParentRunner.java:363)
	at org.eclipse.swtbot.swt.finder.junit.SWTBotJunit4ClassRunner.run(SWTBotJunit4ClassRunner.java:54)
	at org.junit.runners.Suite.runChild(Suite.java:128)
	at org.junit.runners.Suite.runChild(Suite.java:27)
	at org.junit.runners.ParentRunner$3.run(ParentRunner.java:290)
	at org.junit.runners.ParentRunner$1.schedule(ParentRunner.java:71)
	at org.junit.runners.ParentRunner.runChildren(ParentRunner.java:288)
	at org.junit.runners.ParentRunner.access$000(ParentRunner.java:58)
	at org.junit.runners.ParentRunner$2.evaluate(ParentRunner.java:268)
	at org.junit.runners.ParentRunner.run(ParentRunner.java:363)
	at org.junit.runners.Suite.runChild(Suite.java:128)
	at org.junit.runners.Suite.runChild(Suite.java:27)
	at org.junit.runners.ParentRunner$3.run(ParentRunner.java:290)
	at org.junit.runners.ParentRunner$1.schedule(ParentRunner.java:71)
	at org.junit.runners.ParentRunner.runChildren(ParentRunner.java:288)
	at org.junit.runners.ParentRunner.access$000(ParentRunner.java:58)
	at org.junit.runners.ParentRunner$2.evaluate(ParentRunner.java:268)
	at org.junit.runners.ParentRunner.run(ParentRunner.java:363)
	at junit.framework.JUnit4TestAdapter.run(JUnit4TestAdapter.java:38)
	at junit.framework.TestSuite.runTest(TestSuite.java:252)
	at junit.framework.TestSuite.run(TestSuite.java:247)

testPerspectiveComplete(org.eclipse.tracecompass.lttng2.kernel.ui.swtbot.tests.KernelPerspectiveChecker)  Time elapsed: 0.537 sec
testPerspectiveForViews(org.eclipse.tracecompass.lttng2.kernel.ui.swtbot.tests.KernelPerspectiveChecker)  Time elapsed: 0.037 sec
test(org.eclipse.tracecompass.lttng2.kernel.ui.swtbot.tests.ImportAndReadKernelSmokeTest)  Time elapsed: 15.523 sec
testToolBarFollowCPUForwardBackward(org.eclipse.tracecompass.lttng2.kernel.ui.swtbot.tests.ControlFlowViewTest)  Time elapsed: 20.303 sec
testKeyboardLeftRight(org.eclipse.tracecompass.lttng2.kernel.ui.swtbot.tests.ControlFlowViewTest)  Time elapsed: 16.791 sec
testToolBarSelectNextPreviousEvent(org.eclipse.tracecompass.lttng2.kernel.ui.swtbot.tests.ControlFlowViewTest)  Time elapsed: 18.097 sec
testOpenAndCloseConcurrency(org.eclipse.tracecompass.lttng2.kernel.ui.swtbot.tests.OpenTraceStressTest)  Time elapsed: 50.389 sec
testNew(org.eclipse.tracecompass.tmf.ui.swtbot.tests.parsers.custom.TestCustomTxtWizard)  Time elapsed: 9.097 sec
testEdit(org.eclipse.tracecompass.tmf.ui.swtbot.tests.parsers.custom.TestCustomTxtWizard)  Time elapsed: 9.056 sec
testNew(org.eclipse.tracecompass.tmf.ui.swtbot.tests.parsers.custom.TestCustomXmlWizard)  Time elapsed: 8.439 sec
testPerspectiveComplete(org.eclipse.tracecompass.tmf.ui.swtbot.tests.perspectives.TracingPerspectiveChecker)  Time elapsed: 0.001 sec  <<< FAILURE!
java.lang.AssertionError: view org.eclipse.linuxtools.tmf.ui.tmfUml2SDSyncView is present
	at org.junit.Assert.fail(Assert.java:88)
	at org.junit.Assert.assertTrue(Assert.java:41)
	at org.eclipse.tracecompass.tmf.ui.swtbot.tests.shared.AbstractPerspectiveChecker.testPerspectiveComplete(AbstractPerspectiveChecker.java:118)
	at sun.reflect.GeneratedMethodAccessor156.invoke(Unknown Source)
	at sun.reflect.DelegatingMethodAccessorImpl.invoke(DelegatingMethodAccessorImpl.java:43)
	at java.lang.reflect.Method.invoke(Method.java:606)
	at org.junit.runners.model.FrameworkMethod$1.runReflectiveCall(FrameworkMethod.java:50)
	at org.junit.internal.runners.model.ReflectiveCallable.run(ReflectiveCallable.java:12)
	at org.junit.runners.model.FrameworkMethod.invokeExplosively(FrameworkMethod.java:47)
	at org.junit.internal.runners.statements.InvokeMethod.evaluate(InvokeMethod.java:17)
	at org.junit.internal.runners.statements.RunBefores.evaluate(RunBefores.java:26)
	at org.junit.runners.ParentRunner.runLeaf(ParentRunner.java:325)
	at org.junit.runners.BlockJUnit4ClassRunner.runChild(BlockJUnit4ClassRunner.java:78)
	at org.junit.runners.BlockJUnit4ClassRunner.runChild(BlockJUnit4ClassRunner.java:57)
	at org.junit.runners.ParentRunner$3.run(ParentRunner.java:290)
	at org.junit.runners.ParentRunner$1.schedule(ParentRunner.java:71)
	at org.junit.runners.ParentRunner.runChildren(ParentRunner.java:288)
	at org.junit.runners.ParentRunner.access$000(ParentRunner.java:58)
	at org.junit.runners.ParentRunner$2.evaluate(ParentRunner.java:268)
	at org.junit.internal.runners.statements.RunBefores.evaluate(RunBefores.java:26)
	at org.junit.internal.runners.statements.RunAfters.evaluate(RunAfters.java:27)
	at org.junit.runners.ParentRunner.run(ParentRunner.java:363)
	at org.eclipse.swtbot.swt.finder.junit.SWTBotJunit4ClassRunner.run(SWTBotJunit4ClassRunner.java:54)
	at org.junit.runners.Suite.runChild(Suite.java:128)
	at org.junit.runners.Suite.runChild(Suite.java:27)
	at org.junit.runners.ParentRunner$3.run(ParentRunner.java:290)
	at org.junit.runners.ParentRunner$1.schedule(ParentRunner.java:71)
	at org.junit.runners.ParentRunner.runChildren(ParentRunner.java:288)
	at org.junit.runners.ParentRunner.access$000(ParentRunner.java:58)
	at org.junit.runners.ParentRunner$2.evaluate(ParentRunner.java:268)
	at org.junit.runners.ParentRunner.run(ParentRunner.java:363)
	at org.junit.runners.Suite.runChild(Suite.java:128)
	at org.junit.runners.Suite.runChild(Suite.java:27)
	at org.junit.runners.ParentRunner$3.run(ParentRunner.java:290)
	at org.junit.runners.ParentRunner$1.schedule(ParentRunner.java:71)
	at org.junit.runners.ParentRunner.runChildren(ParentRunner.java:288)
	at org.junit.runners.ParentRunner.access$000(ParentRunner.java:58)
	at org.junit.runners.ParentRunner$2.evaluate(ParentRunner.java:268)
	at org.junit.runners.ParentRunner.run(ParentRunner.java:363)
	at junit.framework.JUnit4TestAdapter.run(JUnit4TestAdapter.java:38)
	at junit.framework.TestSuite.runTest(TestSuite.java:252)
	at junit.framework.TestSuite.run(TestSuite.java:247)
	at org.junit.internal.runners.JUnit38ClassRunner.run(JUnit38ClassRunner.java:86)
	at org.apache.maven.surefire.junit4.JUnit4Provider.execute(JUnit4Provider.java:264)
	at org.apache.maven.surefire.junit4.JUnit4Provider.executeTestSet(JUnit4Provider.java:153)
	at org.apache.maven.surefire.junit4.JUnit4Provider.invoke(JUnit4Provider.java:124)
	at sun.reflect.NativeMethodAccessorImpl.invoke0(Native Method)
	at sun.reflect.NativeMethodAccessorImpl.invoke(NativeMethodAccessorImpl.java:57)
	at sun.reflect.DelegatingMethodAccessorImpl.invoke(DelegatingMethodAccessorImpl.java:43)
	at java.lang.reflect.Method.invoke(Method.java:606)
	at org.apache.maven.surefire.util.ReflectionUtils.invokeMethodWithArray2(ReflectionUtils.java:208)
	at org.apache.maven.surefire.booter.ProviderFactory$ProviderProxy.invoke(ProviderFactory.java:156)
	at org.apache.maven.surefire.booter.ProviderFactory.invokeProvider(ProviderFactory.java:82)
	at org.eclipse.tycho.surefire.osgibooter.OsgiSurefireBooter.run(OsgiSurefireBooter.java:91)
	at org.eclipse.tycho.surefire.osgibooter.AbstractUITestApplication.runTests(AbstractUITestApplication.java:44)
	at org.eclipse.e4.ui.internal.workbench.swt.E4Testable$1.run(E4Testable.java:73)
	at java.lang.Thread.run(Thread.java:745)

testPerspectiveForViews(org.eclipse.tracecompass.tmf.ui.swtbot.tests.perspectives.TracingPerspectiveChecker)  Time elapsed: 0.1 sec
test(org.eclipse.tracecompass.tmf.ui.swtbot.tests.viewers.events.CallsiteEventsInTableTest)  Time elapsed: 7.305 sec
test(org.eclipse.tracecompass.tmf.ui.swtbot.tests.viewers.events.CollapseEventsInTableTest)  Time elapsed: 7.923 sec
testYellow(org.eclipse.tracecompass.tmf.ui.swtbot.tests.viewers.events.ColorsViewTest)  Time elapsed: 8.514 sec
testToggleColumns(org.eclipse.tracecompass.tmf.ui.swtbot.tests.viewers.events.ColumnHeaderMenuTest)  Time elapsed: 3.146 sec
testShowAll(org.eclipse.tracecompass.tmf.ui.swtbot.tests.viewers.events.ColumnHeaderMenuTest)  Time elapsed: 2.823 sec
testNoCopySearchRow(org.eclipse.tracecompass.tmf.ui.swtbot.tests.viewers.events.CopyToClipboardTest)  Time elapsed: 3.912 sec
testCopySingleSelection(org.eclipse.tracecompass.tmf.ui.swtbot.tests.viewers.events.CopyToClipboardTest)  Time elapsed: 3.16 sec
testCopyMultipleSelection(org.eclipse.tracecompass.tmf.ui.swtbot.tests.viewers.events.CopyToClipboardTest)  Time elapsed: 3.229 sec
testMultiHighlightMessage(org.eclipse.tracecompass.tmf.ui.swtbot.tests.viewers.events.FilterColorEditorTest)  Time elapsed: 7.581 sec
testSwitchToFilter(org.eclipse.tracecompass.tmf.ui.swtbot.tests.viewers.events.FilterColorEditorTest)  Time elapsed: 9.52 sec
testHighlight(org.eclipse.tracecompass.tmf.ui.swtbot.tests.viewers.events.FilterColorEditorTest)  Time elapsed: 8.492 sec
testPreference(org.eclipse.tracecompass.tmf.ui.swtbot.tests.viewers.events.FilterColorEditorTest)  Time elapsed: 7.501 sec
testTimestampFilter(org.eclipse.tracecompass.tmf.ui.swtbot.tests.viewers.events.FilterViewerTest)  Time elapsed: 3.827 sec  <<< ERROR!
org.eclipse.swt.SWTException: Failed to execute runnable (org.eclipse.swtbot.swt.finder.exceptions.WidgetNotFoundException: Could not find menu: TRACETYPE)
	at org.eclipse.swt.SWT.error(SWT.java:4491)
	at org.eclipse.swt.SWT.error(SWT.java:4406)
	at org.eclipse.swt.widgets.Synchronizer.syncExec(Synchronizer.java:208)
	at org.eclipse.ui.internal.UISynchronizer.syncExec(UISynchronizer.java:145)
	at org.eclipse.swt.widgets.Display.syncExec(Display.java:4633)
	at org.eclipse.swtbot.swt.finder.finders.UIThreadRunnable.run(UIThreadRunnable.java:76)
	at org.eclipse.swtbot.swt.finder.finders.UIThreadRunnable.syncExec(UIThreadRunnable.java:142)
	at org.eclipse.swtbot.swt.finder.finders.UIThreadRunnable.syncExec(UIThreadRunnable.java:125)
	at org.eclipse.swtbot.swt.finder.finders.ContextMenuHelper.contextMenu(ContextMenuHelper.java:42)
	at org.eclipse.swtbot.swt.finder.widgets.SWTBotTreeItem.contextMenu(SWTBotTreeItem.java:558)
	at org.eclipse.tracecompass.tmf.ui.swtbot.tests.viewers.events.FilterViewerTest.testTimestampFilter(FilterViewerTest.java:166)
Caused by: org.eclipse.swtbot.swt.finder.exceptions.WidgetNotFoundException: Could not find menu: TRACETYPE
	at org.eclipse.swtbot.swt.finder.finders.ContextMenuHelper$1.run(ContextMenuHelper.java:63)
	at org.eclipse.swtbot.swt.finder.finders.ContextMenuHelper$1.run(ContextMenuHelper.java:1)
	at org.eclipse.swtbot.swt.finder.finders.UIThreadRunnable$2.doRun(UIThreadRunnable.java:140)
	at org.eclipse.swtbot.swt.finder.finders.UIThreadRunnable$1.run(UIThreadRunnable.java:89)
	at org.eclipse.swt.widgets.RunnableLock.run(RunnableLock.java:35)
	at org.eclipse.swt.widgets.Synchronizer.runAsyncMessages(Synchronizer.java:135)
	at org.eclipse.swt.widgets.Display.runAsyncMessages(Display.java:3794)
	at org.eclipse.swt.widgets.Display.readAndDispatch(Display.java:3433)
	at org.eclipse.e4.ui.internal.workbench.swt.PartRenderingEngine$4.run(PartRenderingEngine.java:1127)
	at org.eclipse.core.databinding.observable.Realm.runWithDefault(Realm.java:337)
	at org.eclipse.e4.ui.internal.workbench.swt.PartRenderingEngine.run(PartRenderingEngine.java:1018)
	at org.eclipse.e4.ui.internal.workbench.E4Workbench.createAndRunUI(E4Workbench.java:156)
	at org.eclipse.ui.internal.Workbench$5.run(Workbench.java:654)
	at org.eclipse.core.databinding.observable.Realm.runWithDefault(Realm.java:337)
	at org.eclipse.ui.internal.Workbench.createAndRunWorkbench(Workbench.java:598)
	at org.eclipse.ui.PlatformUI.createAndRunWorkbench(PlatformUI.java:150)
	at org.eclipse.ui.internal.ide.application.IDEApplication.start(IDEApplication.java:139)
	at org.eclipse.tycho.surefire.osgibooter.UITestApplication.runApplication(UITestApplication.java:31)
	at org.eclipse.tycho.surefire.osgibooter.AbstractUITestApplication.run(AbstractUITestApplication.java:120)
	at org.eclipse.tycho.surefire.osgibooter.UITestApplication.start(UITestApplication.java:37)
	at org.eclipse.equinox.internal.app.EclipseAppHandle.run(EclipseAppHandle.java:196)
	at org.eclipse.core.runtime.internal.adaptor.EclipseAppLauncher.runApplication(EclipseAppLauncher.java:134)
	at org.eclipse.core.runtime.internal.adaptor.EclipseAppLauncher.start(EclipseAppLauncher.java:104)
	at org.eclipse.core.runtime.adaptor.EclipseStarter.run(EclipseStarter.java:380)
	at org.eclipse.core.runtime.adaptor.EclipseStarter.run(EclipseStarter.java:235)
	at sun.reflect.NativeMethodAccessorImpl.invoke0(Native Method)
	at sun.reflect.NativeMethodAccessorImpl.invoke(NativeMethodAccessorImpl.java:57)
	at sun.reflect.DelegatingMethodAccessorImpl.invoke(DelegatingMethodAccessorImpl.java:43)
	at java.lang.reflect.Method.invoke(Method.java:606)
	at org.eclipse.equinox.launcher.Main.invokeFramework(Main.java:669)
	at org.eclipse.equinox.launcher.Main.basicRun(Main.java:608)
	at org.eclipse.equinox.launcher.Main.run(Main.java:1515)
	at org.eclipse.equinox.launcher.Main.main(Main.java:1488)

testField01(org.eclipse.tracecompass.tmf.ui.swtbot.tests.viewers.events.FilterViewerTest)  Time elapsed: 3.412 sec  <<< ERROR!
org.eclipse.swt.SWTException: Failed to execute runnable (org.eclipse.swtbot.swt.finder.exceptions.WidgetNotFoundException: Could not find menu: TRACETYPE)
	at org.eclipse.swt.SWT.error(SWT.java:4491)
	at org.eclipse.swt.SWT.error(SWT.java:4406)
	at org.eclipse.swt.widgets.Synchronizer.syncExec(Synchronizer.java:208)
	at org.eclipse.ui.internal.UISynchronizer.syncExec(UISynchronizer.java:145)
	at org.eclipse.swt.widgets.Display.syncExec(Display.java:4633)
	at org.eclipse.swtbot.swt.finder.finders.UIThreadRunnable.run(UIThreadRunnable.java:76)
	at org.eclipse.swtbot.swt.finder.finders.UIThreadRunnable.syncExec(UIThreadRunnable.java:142)
	at org.eclipse.swtbot.swt.finder.finders.UIThreadRunnable.syncExec(UIThreadRunnable.java:125)
	at org.eclipse.swtbot.swt.finder.finders.ContextMenuHelper.contextMenu(ContextMenuHelper.java:42)
	at org.eclipse.swtbot.swt.finder.widgets.SWTBotTreeItem.contextMenu(SWTBotTreeItem.java:558)
	at org.eclipse.tracecompass.tmf.ui.swtbot.tests.viewers.events.FilterViewerTest.testField01(FilterViewerTest.java:283)
Caused by: org.eclipse.swtbot.swt.finder.exceptions.WidgetNotFoundException: Could not find menu: TRACETYPE
	at org.eclipse.swtbot.swt.finder.finders.ContextMenuHelper$1.run(ContextMenuHelper.java:63)
	at org.eclipse.swtbot.swt.finder.finders.ContextMenuHelper$1.run(ContextMenuHelper.java:1)
	at org.eclipse.swtbot.swt.finder.finders.UIThreadRunnable$2.doRun(UIThreadRunnable.java:140)
	at org.eclipse.swtbot.swt.finder.finders.UIThreadRunnable$1.run(UIThreadRunnable.java:89)
	at org.eclipse.swt.widgets.RunnableLock.run(RunnableLock.java:35)
	at org.eclipse.swt.widgets.Synchronizer.runAsyncMessages(Synchronizer.java:135)
	at org.eclipse.swt.widgets.Display.runAsyncMessages(Display.java:3794)
	at org.eclipse.swt.widgets.Display.readAndDispatch(Display.java:3433)
	at org.eclipse.e4.ui.internal.workbench.swt.PartRenderingEngine$4.run(PartRenderingEngine.java:1127)
	at org.eclipse.core.databinding.observable.Realm.runWithDefault(Realm.java:337)
	at org.eclipse.e4.ui.internal.workbench.swt.PartRenderingEngine.run(PartRenderingEngine.java:1018)
	at org.eclipse.e4.ui.internal.workbench.E4Workbench.createAndRunUI(E4Workbench.java:156)
	at org.eclipse.ui.internal.Workbench$5.run(Workbench.java:654)
	at org.eclipse.core.databinding.observable.Realm.runWithDefault(Realm.java:337)
	at org.eclipse.ui.internal.Workbench.createAndRunWorkbench(Workbench.java:598)
	at org.eclipse.ui.PlatformUI.createAndRunWorkbench(PlatformUI.java:150)
	at org.eclipse.ui.internal.ide.application.IDEApplication.start(IDEApplication.java:139)
	at org.eclipse.tycho.surefire.osgibooter.UITestApplication.runApplication(UITestApplication.java:31)
	at org.eclipse.tycho.surefire.osgibooter.AbstractUITestApplication.run(AbstractUITestApplication.java:120)
	at org.eclipse.tycho.surefire.osgibooter.UITestApplication.start(UITestApplication.java:37)
	at org.eclipse.equinox.internal.app.EclipseAppHandle.run(EclipseAppHandle.java:196)
	at org.eclipse.core.runtime.internal.adaptor.EclipseAppLauncher.runApplication(EclipseAppLauncher.java:134)
	at org.eclipse.core.runtime.internal.adaptor.EclipseAppLauncher.start(EclipseAppLauncher.java:104)
	at org.eclipse.core.runtime.adaptor.EclipseStarter.run(EclipseStarter.java:380)
	at org.eclipse.core.runtime.adaptor.EclipseStarter.run(EclipseStarter.java:235)
	at sun.reflect.NativeMethodAccessorImpl.invoke0(Native Method)
	at sun.reflect.NativeMethodAccessorImpl.invoke(NativeMethodAccessorImpl.java:57)
	at sun.reflect.DelegatingMethodAccessorImpl.invoke(DelegatingMethodAccessorImpl.java:43)
	at java.lang.reflect.Method.invoke(Method.java:606)
	at org.eclipse.equinox.launcher.Main.invokeFramework(Main.java:669)
	at org.eclipse.equinox.launcher.Main.basicRun(Main.java:608)
	at org.eclipse.equinox.launcher.Main.run(Main.java:1515)
	at org.eclipse.equinox.launcher.Main.main(Main.java:1488)

testTimestampEqualsOr(org.eclipse.tracecompass.tmf.ui.swtbot.tests.viewers.events.FilterViewerTest)  Time elapsed: 2.885 sec  <<< ERROR!
org.eclipse.swt.SWTException: Failed to execute runnable (org.eclipse.swtbot.swt.finder.exceptions.WidgetNotFoundException: Could not find menu: TRACETYPE)
	at org.eclipse.swt.SWT.error(SWT.java:4491)
	at org.eclipse.swt.SWT.error(SWT.java:4406)
	at org.eclipse.swt.widgets.Synchronizer.syncExec(Synchronizer.java:208)
	at org.eclipse.ui.internal.UISynchronizer.syncExec(UISynchronizer.java:145)
	at org.eclipse.swt.widgets.Display.syncExec(Display.java:4633)
	at org.eclipse.swtbot.swt.finder.finders.UIThreadRunnable.run(UIThreadRunnable.java:76)
	at org.eclipse.swtbot.swt.finder.finders.UIThreadRunnable.syncExec(UIThreadRunnable.java:142)
	at org.eclipse.swtbot.swt.finder.finders.UIThreadRunnable.syncExec(UIThreadRunnable.java:125)
	at org.eclipse.swtbot.swt.finder.finders.ContextMenuHelper.contextMenu(ContextMenuHelper.java:42)
	at org.eclipse.swtbot.swt.finder.widgets.SWTBotTreeItem.contextMenu(SWTBotTreeItem.java:558)
	at org.eclipse.tracecompass.tmf.ui.swtbot.tests.viewers.events.FilterViewerTest.testTimestampEqualsOr(FilterViewerTest.java:216)
Caused by: org.eclipse.swtbot.swt.finder.exceptions.WidgetNotFoundException: Could not find menu: TRACETYPE
	at org.eclipse.swtbot.swt.finder.finders.ContextMenuHelper$1.run(ContextMenuHelper.java:63)
	at org.eclipse.swtbot.swt.finder.finders.ContextMenuHelper$1.run(ContextMenuHelper.java:1)
	at org.eclipse.swtbot.swt.finder.finders.UIThreadRunnable$2.doRun(UIThreadRunnable.java:140)
	at org.eclipse.swtbot.swt.finder.finders.UIThreadRunnable$1.run(UIThreadRunnable.java:89)
	at org.eclipse.swt.widgets.RunnableLock.run(RunnableLock.java:35)
	at org.eclipse.swt.widgets.Synchronizer.runAsyncMessages(Synchronizer.java:135)
	at org.eclipse.swt.widgets.Display.runAsyncMessages(Display.java:3794)
	at org.eclipse.swt.widgets.Display.readAndDispatch(Display.java:3433)
	at org.eclipse.e4.ui.internal.workbench.swt.PartRenderingEngine$4.run(PartRenderingEngine.java:1127)
	at org.eclipse.core.databinding.observable.Realm.runWithDefault(Realm.java:337)
	at org.eclipse.e4.ui.internal.workbench.swt.PartRenderingEngine.run(PartRenderingEngine.java:1018)
	at org.eclipse.e4.ui.internal.workbench.E4Workbench.createAndRunUI(E4Workbench.java:156)
	at org.eclipse.ui.internal.Workbench$5.run(Workbench.java:654)
	at org.eclipse.core.databinding.observable.Realm.runWithDefault(Realm.java:337)
	at org.eclipse.ui.internal.Workbench.createAndRunWorkbench(Workbench.java:598)
	at org.eclipse.ui.PlatformUI.createAndRunWorkbench(PlatformUI.java:150)
	at org.eclipse.ui.internal.ide.application.IDEApplication.start(IDEApplication.java:139)
	at org.eclipse.tycho.surefire.osgibooter.UITestApplication.runApplication(UITestApplication.java:31)
	at org.eclipse.tycho.surefire.osgibooter.AbstractUITestApplication.run(AbstractUITestApplication.java:120)
	at org.eclipse.tycho.surefire.osgibooter.UITestApplication.start(UITestApplication.java:37)
	at org.eclipse.equinox.internal.app.EclipseAppHandle.run(EclipseAppHandle.java:196)
	at org.eclipse.core.runtime.internal.adaptor.EclipseAppLauncher.runApplication(EclipseAppLauncher.java:134)
	at org.eclipse.core.runtime.internal.adaptor.EclipseAppLauncher.start(EclipseAppLauncher.java:104)
	at org.eclipse.core.runtime.adaptor.EclipseStarter.run(EclipseStarter.java:380)
	at org.eclipse.core.runtime.adaptor.EclipseStarter.run(EclipseStarter.java:235)
	at sun.reflect.NativeMethodAccessorImpl.invoke0(Native Method)
	at sun.reflect.NativeMethodAccessorImpl.invoke(NativeMethodAccessorImpl.java:57)
	at sun.reflect.DelegatingMethodAccessorImpl.invoke(DelegatingMethodAccessorImpl.java:43)
	at java.lang.reflect.Method.invoke(Method.java:606)
	at org.eclipse.equinox.launcher.Main.invokeFramework(Main.java:669)
	at org.eclipse.equinox.launcher.Main.basicRun(Main.java:608)
	at org.eclipse.equinox.launcher.Main.run(Main.java:1515)
	at org.eclipse.equinox.launcher.Main.main(Main.java:1488)

testChangeFont(org.eclipse.tracecompass.tmf.ui.swtbot.tests.viewers.events.FontEventEditorTest)  Time elapsed: 9.632 sec
testReorder(org.eclipse.tracecompass.tmf.ui.swtbot.tests.viewers.events.MovableColumnEventsEditorTest)  Time elapsed: 11.802 sec
testSDView(org.eclipse.tracecompass.tmf.ui.swtbot.tests.viewers.events.SDViewTest)  Time elapsed: 5.656 sec
testOffsetting(org.eclipse.tracecompass.tmf.ui.swtbot.tests.viewers.events.TestTraceOffsetting)  Time elapsed: 10.18 sec
testOverlappingTimechartMove(org.eclipse.tracecompass.tmf.ui.swtbot.tests.viewers.events.TmfAlignTimeAxisTest)  Time elapsed: 5.195 sec
testNotOverlappingCallstackMove(org.eclipse.tracecompass.tmf.ui.swtbot.tests.viewers.events.TmfAlignTimeAxisTest)  Time elapsed: 5.181 sec
testMoveHistogramCallstackFollows(org.eclipse.tracecompass.tmf.ui.swtbot.tests.viewers.events.TmfAlignTimeAxisTest)  Time elapsed: 5.187 sec
testOverlappingHistogramMove(org.eclipse.tracecompass.tmf.ui.swtbot.tests.viewers.events.TmfAlignTimeAxisTest)  Time elapsed: 5.201 sec
testNotOverlappingHistogramMove(org.eclipse.tracecompass.tmf.ui.swtbot.tests.viewers.events.TmfAlignTimeAxisTest)  Time elapsed: 5.169 sec
testMoveCallstackHistogramFollows(org.eclipse.tracecompass.tmf.ui.swtbot.tests.viewers.events.TmfAlignTimeAxisTest)  Time elapsed: 5.149 sec
testGzipImport(org.eclipse.tracecompass.tmf.ui.swtbot.tests.wizards.StandardImportGzipTraceTest)  Time elapsed: 5.717 sec
test(org.eclipse.tracecompass.tmf.ctf.ui.swtbot.tests.ImportAndReadSmokeTest)  Time elapsed: 12.322 sec
testImportFromDirectory(org.eclipse.tracecompass.tmf.ctf.ui.swtbot.tests.StandardImportAndReadSmokeTest)  Time elapsed: 7.462 sec
testExtractArchivesFromArchive(org.eclipse.tracecompass.tmf.ctf.ui.swtbot.tests.StandardImportAndReadSmokeTest)  Time elapsed: 17.462 sec
testImportFromDirectoryLinksPreserveFolder(org.eclipse.tracecompass.tmf.ctf.ui.swtbot.tests.StandardImportAndReadSmokeTest)  Time elapsed: 7.382 sec
testExtractArchivesFromArchivePreserveFolder(org.eclipse.tracecompass.tmf.ctf.ui.swtbot.tests.StandardImportAndReadSmokeTest)  Time elapsed: 17.763 sec
testExtractArchivesFromDirectory(org.eclipse.tracecompass.tmf.ctf.ui.swtbot.tests.StandardImportAndReadSmokeTest)  Time elapsed: 12.281 sec
testImportFromArchive(org.eclipse.tracecompass.tmf.ctf.ui.swtbot.tests.StandardImportAndReadSmokeTest)  Time elapsed: 12.754 sec
testExtractArchivesFromDirectoryLinksPreserveStruture(org.eclipse.tracecompass.tmf.ctf.ui.swtbot.tests.StandardImportAndReadSmokeTest)  Time elapsed: 12.823 sec
testEmptyDirectory(org.eclipse.tracecompass.tmf.ctf.ui.swtbot.tests.StandardImportAndReadSmokeTest)  Time elapsed: 6.127 sec
testEmptyArchive(org.eclipse.tracecompass.tmf.ctf.ui.swtbot.tests.StandardImportAndReadSmokeTest)  Time elapsed: 9.02 sec
testNestedEmptyArchive(org.eclipse.tracecompass.tmf.ctf.ui.swtbot.tests.StandardImportAndReadSmokeTest)  Time elapsed: 12.629 sec
testImportFromArchiveOverwrite(org.eclipse.tracecompass.tmf.ctf.ui.swtbot.tests.StandardImportAndReadSmokeTest)  Time elapsed: 15.502 sec
testDirectoryWithEmptyArchive(org.eclipse.tracecompass.tmf.ctf.ui.swtbot.tests.StandardImportAndReadSmokeTest)  Time elapsed: 8.663 sec
testImportFromDirectoryPreserveFolder(org.eclipse.tracecompass.tmf.ctf.ui.swtbot.tests.StandardImportAndReadSmokeTest)  Time elapsed: 7.391 sec
testImportFromDirectoryLinks(org.eclipse.tracecompass.tmf.ctf.ui.swtbot.tests.StandardImportAndReadSmokeTest)  Time elapsed: 7.64 sec
testImportFromDirectoryOverwrite(org.eclipse.tracecompass.tmf.ctf.ui.swtbot.tests.StandardImportAndReadSmokeTest)  Time elapsed: 15.124 sec
testExtractArchivesFromDirectoryLinks(org.eclipse.tracecompass.tmf.ctf.ui.swtbot.tests.StandardImportAndReadSmokeTest)  Time elapsed: 12.863 sec
testImportFromArchivePreserveFolder(org.eclipse.tracecompass.tmf.ctf.ui.swtbot.tests.StandardImportAndReadSmokeTest)  Time elapsed: 8.513 sec
testOpen[0: ../../ctf/org.eclipse.tracecompass.ctf.core.tests/traces/ctf-testsuite/tests/1.8/regression/metadata/fail/struct-align-negative](org.eclipse.tracecompass.tmf.ctf.ui.swtbot.tests.TestInvalidCtfTrace)  Time elapsed: 4.629 sec
testOpen[1: ../../ctf/org.eclipse.tracecompass.ctf.core.tests/traces/ctf-testsuite/tests/1.8/regression/metadata/fail/array-size-identifier](org.eclipse.tracecompass.tmf.ctf.ui.swtbot.tests.TestInvalidCtfTrace)  Time elapsed: 4.608 sec
testOpen[2: ../../ctf/org.eclipse.tracecompass.ctf.core.tests/traces/ctf-testsuite/tests/1.8/regression/metadata/fail/struct-align-huge](org.eclipse.tracecompass.tmf.ctf.ui.swtbot.tests.TestInvalidCtfTrace)  Time elapsed: 4.502 sec
testOpen[3: ../../ctf/org.eclipse.tracecompass.ctf.core.tests/traces/ctf-testsuite/tests/1.8/regression/metadata/fail/integer-signed-as-string](org.eclipse.tracecompass.tmf.ctf.ui.swtbot.tests.TestInvalidCtfTrace)  Time elapsed: 4.549 sec
testOpen[4: ../../ctf/org.eclipse.tracecompass.ctf.core.tests/traces/ctf-testsuite/tests/1.8/regression/metadata/fail/array-size-keyword](org.eclipse.tracecompass.tmf.ctf.ui.swtbot.tests.TestInvalidCtfTrace)  Time elapsed: 4.397 sec
testOpen[5: ../../ctf/org.eclipse.tracecompass.ctf.core.tests/traces/ctf-testsuite/tests/1.8/regression/metadata/fail/integer-range](org.eclipse.tracecompass.tmf.ctf.ui.swtbot.tests.TestInvalidCtfTrace)  Time elapsed: 4.945 sec
testOpen[6: ../../ctf/org.eclipse.tracecompass.ctf.core.tests/traces/ctf-testsuite/tests/1.8/regression/metadata/fail/integer-signed-invalid](org.eclipse.tracecompass.tmf.ctf.ui.swtbot.tests.TestInvalidCtfTrace)  Time elapsed: 4.38 sec
testOpen[7: ../../ctf/org.eclipse.tracecompass.ctf.core.tests/traces/ctf-testsuite/tests/1.8/regression/metadata/fail/struct-align-string](org.eclipse.tracecompass.tmf.ctf.ui.swtbot.tests.TestInvalidCtfTrace)  Time elapsed: 5.018 sec
testOpen[8: ../../ctf/org.eclipse.tracecompass.ctf.core.tests/traces/ctf-testsuite/tests/1.8/regression/metadata/fail/array-size-type-field](org.eclipse.tracecompass.tmf.ctf.ui.swtbot.tests.TestInvalidCtfTrace)  Time elapsed: 4.792 sec
testOpen[9: ../../ctf/org.eclipse.tracecompass.ctf.core.tests/traces/ctf-testsuite/tests/1.8/regression/metadata/fail/struct-duplicate-struct-name](org.eclipse.tracecompass.tmf.ctf.ui.swtbot.tests.TestInvalidCtfTrace)  Time elapsed: 5.21 sec
testOpen[10: ../../ctf/org.eclipse.tracecompass.ctf.core.tests/traces/ctf-testsuite/tests/1.8/regression/metadata/fail/integer-encoding-invalid](org.eclipse.tracecompass.tmf.ctf.ui.swtbot.tests.TestInvalidCtfTrace)  Time elapsed: 4.807 sec
testOpen[11: ../../ctf/org.eclipse.tracecompass.ctf.core.tests/traces/ctf-testsuite/tests/1.8/regression/metadata/fail/integer-size-as-string](org.eclipse.tracecompass.tmf.ctf.ui.swtbot.tests.TestInvalidCtfTrace)  Time elapsed: 4.642 sec
testOpen[12: ../../ctf/org.eclipse.tracecompass.ctf.core.tests/traces/ctf-testsuite/tests/1.8/regression/metadata/fail/array-size-type](org.eclipse.tracecompass.tmf.ctf.ui.swtbot.tests.TestInvalidCtfTrace)  Time elapsed: 5.662 sec
testOpen[13: ../../ctf/org.eclipse.tracecompass.ctf.core.tests/traces/ctf-testsuite/tests/1.8/regression/metadata/fail/array-size-not-present](org.eclipse.tracecompass.tmf.ctf.ui.swtbot.tests.TestInvalidCtfTrace)  Time elapsed: 5.642 sec
testOpen[14: ../../ctf/org.eclipse.tracecompass.ctf.core.tests/traces/ctf-testsuite/tests/1.8/regression/metadata/fail/struct-duplicate-field-name](org.eclipse.tracecompass.tmf.ctf.ui.swtbot.tests.TestInvalidCtfTrace)  Time elapsed: 4.496 sec
testOpen[15: ../../ctf/org.eclipse.tracecompass.ctf.core.tests/traces/ctf-testsuite/tests/1.8/regression/metadata/fail/array-size-string](org.eclipse.tracecompass.tmf.ctf.ui.swtbot.tests.TestInvalidCtfTrace)  Time elapsed: 4.707 sec
testOpen[16: ../../ctf/org.eclipse.tracecompass.ctf.core.tests/traces/ctf-testsuite/tests/1.8/regression/metadata/fail/integer-size-missing](org.eclipse.tracecompass.tmf.ctf.ui.swtbot.tests.TestInvalidCtfTrace)  Time elapsed: 4.609 sec
testOpen[17: ../../ctf/org.eclipse.tracecompass.ctf.core.tests/traces/ctf-testsuite/tests/1.8/regression/metadata/fail/integer-negative-bit-size](org.eclipse.tracecompass.tmf.ctf.ui.swtbot.tests.TestInvalidCtfTrace)  Time elapsed: 4.707 sec
testOpen[18: ../../ctf/org.eclipse.tracecompass.ctf.core.tests/traces/ctf-testsuite/tests/1.8/regression/metadata/fail/struct-align-enum](org.eclipse.tracecompass.tmf.ctf.ui.swtbot.tests.TestInvalidCtfTrace)  Time elapsed: 4.837 sec
testOpen[19: ../../ctf/org.eclipse.tracecompass.ctf.core.tests/traces/ctf-testsuite/tests/1.8/regression/metadata/fail/integer-encoding-as-string](org.eclipse.tracecompass.tmf.ctf.ui.swtbot.tests.TestInvalidCtfTrace)  Time elapsed: 4.943 sec
testOpen[20: ../../ctf/org.eclipse.tracecompass.ctf.core.tests/traces/ctf-testsuite/tests/1.8/regression/metadata/fail/struct-align-zero](org.eclipse.tracecompass.tmf.ctf.ui.swtbot.tests.TestInvalidCtfTrace)  Time elapsed: 5.124 sec
testOpen[21: ../../ctf/org.eclipse.tracecompass.ctf.core.tests/traces/ctf-testsuite/tests/1.8/regression/metadata/fail/array-redefinition](org.eclipse.tracecompass.tmf.ctf.ui.swtbot.tests.TestInvalidCtfTrace)  Time elapsed: 4.156 sec
testOpen[22: ../../ctf/org.eclipse.tracecompass.ctf.core.tests/traces/ctf-testsuite/tests/1.8/regression/metadata/fail/array-size-negative](org.eclipse.tracecompass.tmf.ctf.ui.swtbot.tests.TestInvalidCtfTrace)  Time elapsed: 5.004 sec
testOpen[23: ../../ctf/org.eclipse.tracecompass.ctf.core.tests/traces/ctf-testsuite/tests/1.8/regression/metadata/fail/struct-field-name-keyword](org.eclipse.tracecompass.tmf.ctf.ui.swtbot.tests.TestInvalidCtfTrace)  Time elapsed: 4.784 sec
test(org.eclipse.tracecompass.tmf.pcap.ui.swtbot.tests.ImportAndReadPcapTest)  Time elapsed: 26.028 sec
testPerspectiveComplete(org.eclipse.tracecompass.tmf.pcap.ui.swtbot.tests.NetworkPerspectiveChecker)  Time elapsed: 0.001 sec
testPerspectiveForViews(org.eclipse.tracecompass.tmf.pcap.ui.swtbot.tests.NetworkPerspectiveChecker)  Time elapsed: 0.085 sec
org.eclipse.tracecompass.tmf.remote.ui.swtbot.tests.fetch.FetchRemoteTracesTest(junit.framework.TestSuite)  Time elapsed: 0.086 sec  <<< ERROR!
java.lang.NoClassDefFoundError: Could not initialize class org.eclipse.tracecompass.tmf.remote.ui.swtbot.tests.fetch.FetchRemoteTracesTest
	at sun.reflect.GeneratedMethodAccessor261.invoke(Unknown Source)
	at sun.reflect.DelegatingMethodAccessorImpl.invoke(DelegatingMethodAccessorImpl.java:43)
	at java.lang.reflect.Method.invoke(Method.java:606)
	at org.junit.runners.model.FrameworkMethod$1.runReflectiveCall(FrameworkMethod.java:50)
	at org.junit.internal.runners.model.ReflectiveCallable.run(ReflectiveCallable.java:12)
	at org.junit.runners.model.FrameworkMethod.invokeExplosively(FrameworkMethod.java:47)
	at org.junit.internal.runners.statements.RunBefores.evaluate(RunBefores.java:24)
	at org.junit.runners.ParentRunner.run(ParentRunner.java:363)
	at org.eclipse.swtbot.swt.finder.junit.SWTBotJunit4ClassRunner.run(SWTBotJunit4ClassRunner.java:54)
	at org.junit.runners.Suite.runChild(Suite.java:128)
	at org.junit.runners.Suite.runChild(Suite.java:27)
	at org.junit.runners.ParentRunner$3.run(ParentRunner.java:290)
	at org.junit.runners.ParentRunner$1.schedule(ParentRunner.java:71)
	at org.junit.runners.ParentRunner.runChildren(ParentRunner.java:288)
	at org.junit.runners.ParentRunner.access$000(ParentRunner.java:58)
	at org.junit.runners.ParentRunner$2.evaluate(ParentRunner.java:268)
	at org.junit.runners.ParentRunner.run(ParentRunner.java:363)
	at org.junit.runners.Suite.runChild(Suite.java:128)
	at org.junit.runners.Suite.runChild(Suite.java:27)
	at org.junit.runners.ParentRunner$3.run(ParentRunner.java:290)
	at org.junit.runners.ParentRunner$1.schedule(ParentRunner.java:71)
	at org.junit.runners.ParentRunner.runChildren(ParentRunner.java:288)
	at org.junit.runners.ParentRunner.access$000(ParentRunner.java:58)
	at org.junit.runners.ParentRunner$2.evaluate(ParentRunner.java:268)
	at org.junit.runners.ParentRunner.run(ParentRunner.java:363)
	at junit.framework.JUnit4TestAdapter.run(JUnit4TestAdapter.java:38)
	at junit.framework.TestSuite.runTest(TestSuite.java:252)
	at junit.framework.TestSuite.run(TestSuite.java:247)

testPerspectiveComplete(org.eclipse.tracecompass.lttng2.kernel.ui.swtbot.tests.KernelPerspectiveChecker)  Time elapsed: 0.615 sec
testPerspectiveForViews(org.eclipse.tracecompass.lttng2.kernel.ui.swtbot.tests.KernelPerspectiveChecker)  Time elapsed: 0.001 sec
test(org.eclipse.tracecompass.lttng2.kernel.ui.swtbot.tests.ImportAndReadKernelSmokeTest)  Time elapsed: 15.524 sec
testToolBarFollowCPUForwardBackward(org.eclipse.tracecompass.lttng2.kernel.ui.swtbot.tests.ControlFlowViewTest)  Time elapsed: 20.137 sec
testKeyboardLeftRight(org.eclipse.tracecompass.lttng2.kernel.ui.swtbot.tests.ControlFlowViewTest)  Time elapsed: 15.154 sec
testToolBarSelectNextPreviousEvent(org.eclipse.tracecompass.lttng2.kernel.ui.swtbot.tests.ControlFlowViewTest)  Time elapsed: 16.186 sec
testOpenAndCloseConcurrency(org.eclipse.tracecompass.lttng2.kernel.ui.swtbot.tests.OpenTraceStressTest)  Time elapsed: 45.463 sec
testNew(org.eclipse.tracecompass.tmf.ui.swtbot.tests.parsers.custom.TestCustomTxtWizard)  Time elapsed: 8.569 sec
testEdit(org.eclipse.tracecompass.tmf.ui.swtbot.tests.parsers.custom.TestCustomTxtWizard)  Time elapsed: 12.621 sec
testNew(org.eclipse.tracecompass.tmf.ui.swtbot.tests.parsers.custom.TestCustomXmlWizard)  Time elapsed: 9.517 sec
testPerspectiveComplete(org.eclipse.tracecompass.tmf.ui.swtbot.tests.perspectives.TracingPerspectiveChecker)  Time elapsed: 0.001 sec  <<< FAILURE!
java.lang.AssertionError: view org.eclipse.linuxtools.tmf.ui.tmfUml2SDSyncView is present
	at org.junit.Assert.fail(Assert.java:88)
	at org.junit.Assert.assertTrue(Assert.java:41)
	at org.eclipse.tracecompass.tmf.ui.swtbot.tests.shared.AbstractPerspectiveChecker.testPerspectiveComplete(AbstractPerspectiveChecker.java:118)
	at sun.reflect.GeneratedMethodAccessor156.invoke(Unknown Source)
	at sun.reflect.DelegatingMethodAccessorImpl.invoke(DelegatingMethodAccessorImpl.java:43)
	at java.lang.reflect.Method.invoke(Method.java:606)
	at org.junit.runners.model.FrameworkMethod$1.runReflectiveCall(FrameworkMethod.java:50)
	at org.junit.internal.runners.model.ReflectiveCallable.run(ReflectiveCallable.java:12)
	at org.junit.runners.model.FrameworkMethod.invokeExplosively(FrameworkMethod.java:47)
	at org.junit.internal.runners.statements.InvokeMethod.evaluate(InvokeMethod.java:17)
	at org.junit.internal.runners.statements.RunBefores.evaluate(RunBefores.java:26)
	at org.junit.runners.ParentRunner.runLeaf(ParentRunner.java:325)
	at org.junit.runners.BlockJUnit4ClassRunner.runChild(BlockJUnit4ClassRunner.java:78)
	at org.junit.runners.BlockJUnit4ClassRunner.runChild(BlockJUnit4ClassRunner.java:57)
	at org.junit.runners.ParentRunner$3.run(ParentRunner.java:290)
	at org.junit.runners.ParentRunner$1.schedule(ParentRunner.java:71)
	at org.junit.runners.ParentRunner.runChildren(ParentRunner.java:288)
	at org.junit.runners.ParentRunner.access$000(ParentRunner.java:58)
	at org.junit.runners.ParentRunner$2.evaluate(ParentRunner.java:268)
	at org.junit.internal.runners.statements.RunBefores.evaluate(RunBefores.java:26)
	at org.junit.internal.runners.statements.RunAfters.evaluate(RunAfters.java:27)
	at org.junit.runners.ParentRunner.run(ParentRunner.java:363)
	at org.eclipse.swtbot.swt.finder.junit.SWTBotJunit4ClassRunner.run(SWTBotJunit4ClassRunner.java:54)
	at org.junit.runners.Suite.runChild(Suite.java:128)
	at org.junit.runners.Suite.runChild(Suite.java:27)
	at org.junit.runners.ParentRunner$3.run(ParentRunner.java:290)
	at org.junit.runners.ParentRunner$1.schedule(ParentRunner.java:71)
	at org.junit.runners.ParentRunner.runChildren(ParentRunner.java:288)
	at org.junit.runners.ParentRunner.access$000(ParentRunner.java:58)
	at org.junit.runners.ParentRunner$2.evaluate(ParentRunner.java:268)
	at org.junit.runners.ParentRunner.run(ParentRunner.java:363)
	at org.junit.runners.Suite.runChild(Suite.java:128)
	at org.junit.runners.Suite.runChild(Suite.java:27)
	at org.junit.runners.ParentRunner$3.run(ParentRunner.java:290)
	at org.junit.runners.ParentRunner$1.schedule(ParentRunner.java:71)
	at org.junit.runners.ParentRunner.runChildren(ParentRunner.java:288)
	at org.junit.runners.ParentRunner.access$000(ParentRunner.java:58)
	at org.junit.runners.ParentRunner$2.evaluate(ParentRunner.java:268)
	at org.junit.runners.ParentRunner.run(ParentRunner.java:363)
	at junit.framework.JUnit4TestAdapter.run(JUnit4TestAdapter.java:38)
	at junit.framework.TestSuite.runTest(TestSuite.java:252)
	at junit.framework.TestSuite.run(TestSuite.java:247)
	at org.junit.internal.runners.JUnit38ClassRunner.run(JUnit38ClassRunner.java:86)
	at org.apache.maven.surefire.junit4.JUnit4Provider.execute(JUnit4Provider.java:264)
	at org.apache.maven.surefire.junit4.JUnit4Provider.executeTestSet(JUnit4Provider.java:153)
	at org.apache.maven.surefire.junit4.JUnit4Provider.invoke(JUnit4Provider.java:124)
	at sun.reflect.NativeMethodAccessorImpl.invoke0(Native Method)
	at sun.reflect.NativeMethodAccessorImpl.invoke(NativeMethodAccessorImpl.java:57)
	at sun.reflect.DelegatingMethodAccessorImpl.invoke(DelegatingMethodAccessorImpl.java:43)
	at java.lang.reflect.Method.invoke(Method.java:606)
	at org.apache.maven.surefire.util.ReflectionUtils.invokeMethodWithArray2(ReflectionUtils.java:208)
	at org.apache.maven.surefire.booter.ProviderFactory$ProviderProxy.invoke(ProviderFactory.java:156)
	at org.apache.maven.surefire.booter.ProviderFactory.invokeProvider(ProviderFactory.java:82)
	at org.eclipse.tycho.surefire.osgibooter.OsgiSurefireBooter.run(OsgiSurefireBooter.java:91)
	at org.eclipse.tycho.surefire.osgibooter.AbstractUITestApplication.runTests(AbstractUITestApplication.java:44)
	at org.eclipse.e4.ui.internal.workbench.swt.E4Testable$1.run(E4Testable.java:73)
	at java.lang.Thread.run(Thread.java:745)

testPerspectiveForViews(org.eclipse.tracecompass.tmf.ui.swtbot.tests.perspectives.TracingPerspectiveChecker)  Time elapsed: 0.002 sec
test(org.eclipse.tracecompass.tmf.ui.swtbot.tests.viewers.events.CallsiteEventsInTableTest)  Time elapsed: 8.998 sec
test(org.eclipse.tracecompass.tmf.ui.swtbot.tests.viewers.events.CollapseEventsInTableTest)  Time elapsed: 7.662 sec
testYellow(org.eclipse.tracecompass.tmf.ui.swtbot.tests.viewers.events.ColorsViewTest)  Time elapsed: 7.638 sec
testToggleColumns(org.eclipse.tracecompass.tmf.ui.swtbot.tests.viewers.events.ColumnHeaderMenuTest)  Time elapsed: 3.088 sec
testShowAll(org.eclipse.tracecompass.tmf.ui.swtbot.tests.viewers.events.ColumnHeaderMenuTest)  Time elapsed: 2.931 sec
testNoCopySearchRow(org.eclipse.tracecompass.tmf.ui.swtbot.tests.viewers.events.CopyToClipboardTest)  Time elapsed: 4.217 sec
testCopySingleSelection(org.eclipse.tracecompass.tmf.ui.swtbot.tests.viewers.events.CopyToClipboardTest)  Time elapsed: 3.749 sec
testCopyMultipleSelection(org.eclipse.tracecompass.tmf.ui.swtbot.tests.viewers.events.CopyToClipboardTest)  Time elapsed: 3.262 sec
testMultiHighlightMessage(org.eclipse.tracecompass.tmf.ui.swtbot.tests.viewers.events.FilterColorEditorTest)  Time elapsed: 7.759 sec
testSwitchToFilter(org.eclipse.tracecompass.tmf.ui.swtbot.tests.viewers.events.FilterColorEditorTest)  Time elapsed: 8.136 sec
testHighlight(org.eclipse.tracecompass.tmf.ui.swtbot.tests.viewers.events.FilterColorEditorTest)  Time elapsed: 8.312 sec
testPreference(org.eclipse.tracecompass.tmf.ui.swtbot.tests.viewers.events.FilterColorEditorTest)  Time elapsed: 8.018 sec
testTimestampFilter(org.eclipse.tracecompass.tmf.ui.swtbot.tests.viewers.events.FilterViewerTest)  Time elapsed: 4.061 sec  <<< ERROR!
org.eclipse.swt.SWTException: Failed to execute runnable (org.eclipse.swtbot.swt.finder.exceptions.WidgetNotFoundException: Could not find menu: TRACETYPE)
	at org.eclipse.swt.SWT.error(SWT.java:4491)
	at org.eclipse.swt.SWT.error(SWT.java:4406)
	at org.eclipse.swt.widgets.Synchronizer.syncExec(Synchronizer.java:208)
	at org.eclipse.ui.internal.UISynchronizer.syncExec(UISynchronizer.java:145)
	at org.eclipse.swt.widgets.Display.syncExec(Display.java:4633)
	at org.eclipse.swtbot.swt.finder.finders.UIThreadRunnable.run(UIThreadRunnable.java:76)
	at org.eclipse.swtbot.swt.finder.finders.UIThreadRunnable.syncExec(UIThreadRunnable.java:142)
	at org.eclipse.swtbot.swt.finder.finders.UIThreadRunnable.syncExec(UIThreadRunnable.java:125)
	at org.eclipse.swtbot.swt.finder.finders.ContextMenuHelper.contextMenu(ContextMenuHelper.java:42)
	at org.eclipse.swtbot.swt.finder.widgets.SWTBotTreeItem.contextMenu(SWTBotTreeItem.java:558)
	at org.eclipse.tracecompass.tmf.ui.swtbot.tests.viewers.events.FilterViewerTest.testTimestampFilter(FilterViewerTest.java:166)
Caused by: org.eclipse.swtbot.swt.finder.exceptions.WidgetNotFoundException: Could not find menu: TRACETYPE
	at org.eclipse.swtbot.swt.finder.finders.ContextMenuHelper$1.run(ContextMenuHelper.java:63)
	at org.eclipse.swtbot.swt.finder.finders.ContextMenuHelper$1.run(ContextMenuHelper.java:1)
	at org.eclipse.swtbot.swt.finder.finders.UIThreadRunnable$2.doRun(UIThreadRunnable.java:140)
	at org.eclipse.swtbot.swt.finder.finders.UIThreadRunnable$1.run(UIThreadRunnable.java:89)
	at org.eclipse.swt.widgets.RunnableLock.run(RunnableLock.java:35)
	at org.eclipse.swt.widgets.Synchronizer.runAsyncMessages(Synchronizer.java:135)
	at org.eclipse.swt.widgets.Display.runAsyncMessages(Display.java:3794)
	at org.eclipse.swt.widgets.Display.readAndDispatch(Display.java:3433)
	at org.eclipse.e4.ui.internal.workbench.swt.PartRenderingEngine$4.run(PartRenderingEngine.java:1127)
	at org.eclipse.core.databinding.observable.Realm.runWithDefault(Realm.java:337)
	at org.eclipse.e4.ui.internal.workbench.swt.PartRenderingEngine.run(PartRenderingEngine.java:1018)
	at org.eclipse.e4.ui.internal.workbench.E4Workbench.createAndRunUI(E4Workbench.java:156)
	at org.eclipse.ui.internal.Workbench$5.run(Workbench.java:654)
	at org.eclipse.core.databinding.observable.Realm.runWithDefault(Realm.java:337)
	at org.eclipse.ui.internal.Workbench.createAndRunWorkbench(Workbench.java:598)
	at org.eclipse.ui.PlatformUI.createAndRunWorkbench(PlatformUI.java:150)
	at org.eclipse.ui.internal.ide.application.IDEApplication.start(IDEApplication.java:139)
	at org.eclipse.tycho.surefire.osgibooter.UITestApplication.runApplication(UITestApplication.java:31)
	at org.eclipse.tycho.surefire.osgibooter.AbstractUITestApplication.run(AbstractUITestApplication.java:120)
	at org.eclipse.tycho.surefire.osgibooter.UITestApplication.start(UITestApplication.java:37)
	at org.eclipse.equinox.internal.app.EclipseAppHandle.run(EclipseAppHandle.java:196)
	at org.eclipse.core.runtime.internal.adaptor.EclipseAppLauncher.runApplication(EclipseAppLauncher.java:134)
	at org.eclipse.core.runtime.internal.adaptor.EclipseAppLauncher.start(EclipseAppLauncher.java:104)
	at org.eclipse.core.runtime.adaptor.EclipseStarter.run(EclipseStarter.java:380)
	at org.eclipse.core.runtime.adaptor.EclipseStarter.run(EclipseStarter.java:235)
	at sun.reflect.NativeMethodAccessorImpl.invoke0(Native Method)
	at sun.reflect.NativeMethodAccessorImpl.invoke(NativeMethodAccessorImpl.java:57)
	at sun.reflect.DelegatingMethodAccessorImpl.invoke(DelegatingMethodAccessorImpl.java:43)
	at java.lang.reflect.Method.invoke(Method.java:606)
	at org.eclipse.equinox.launcher.Main.invokeFramework(Main.java:669)
	at org.eclipse.equinox.launcher.Main.basicRun(Main.java:608)
	at org.eclipse.equinox.launcher.Main.run(Main.java:1515)
	at org.eclipse.equinox.launcher.Main.main(Main.java:1488)

testField01(org.eclipse.tracecompass.tmf.ui.swtbot.tests.viewers.events.FilterViewerTest)  Time elapsed: 3.375 sec  <<< ERROR!
org.eclipse.swt.SWTException: Failed to execute runnable (org.eclipse.swtbot.swt.finder.exceptions.WidgetNotFoundException: Could not find menu: TRACETYPE)
	at org.eclipse.swt.SWT.error(SWT.java:4491)
	at org.eclipse.swt.SWT.error(SWT.java:4406)
	at org.eclipse.swt.widgets.Synchronizer.syncExec(Synchronizer.java:208)
	at org.eclipse.ui.internal.UISynchronizer.syncExec(UISynchronizer.java:145)
	at org.eclipse.swt.widgets.Display.syncExec(Display.java:4633)
	at org.eclipse.swtbot.swt.finder.finders.UIThreadRunnable.run(UIThreadRunnable.java:76)
	at org.eclipse.swtbot.swt.finder.finders.UIThreadRunnable.syncExec(UIThreadRunnable.java:142)
	at org.eclipse.swtbot.swt.finder.finders.UIThreadRunnable.syncExec(UIThreadRunnable.java:125)
	at org.eclipse.swtbot.swt.finder.finders.ContextMenuHelper.contextMenu(ContextMenuHelper.java:42)
	at org.eclipse.swtbot.swt.finder.widgets.SWTBotTreeItem.contextMenu(SWTBotTreeItem.java:558)
	at org.eclipse.tracecompass.tmf.ui.swtbot.tests.viewers.events.FilterViewerTest.testField01(FilterViewerTest.java:283)
Caused by: org.eclipse.swtbot.swt.finder.exceptions.WidgetNotFoundException: Could not find menu: TRACETYPE
	at org.eclipse.swtbot.swt.finder.finders.ContextMenuHelper$1.run(ContextMenuHelper.java:63)
	at org.eclipse.swtbot.swt.finder.finders.ContextMenuHelper$1.run(ContextMenuHelper.java:1)
	at org.eclipse.swtbot.swt.finder.finders.UIThreadRunnable$2.doRun(UIThreadRunnable.java:140)
	at org.eclipse.swtbot.swt.finder.finders.UIThreadRunnable$1.run(UIThreadRunnable.java:89)
	at org.eclipse.swt.widgets.RunnableLock.run(RunnableLock.java:35)
	at org.eclipse.swt.widgets.Synchronizer.runAsyncMessages(Synchronizer.java:135)
	at org.eclipse.swt.widgets.Display.runAsyncMessages(Display.java:3794)
	at org.eclipse.swt.widgets.Display.readAndDispatch(Display.java:3433)
	at org.eclipse.e4.ui.internal.workbench.swt.PartRenderingEngine$4.run(PartRenderingEngine.java:1127)
	at org.eclipse.core.databinding.observable.Realm.runWithDefault(Realm.java:337)
	at org.eclipse.e4.ui.internal.workbench.swt.PartRenderingEngine.run(PartRenderingEngine.java:1018)
	at org.eclipse.e4.ui.internal.workbench.E4Workbench.createAndRunUI(E4Workbench.java:156)
	at org.eclipse.ui.internal.Workbench$5.run(Workbench.java:654)
	at org.eclipse.core.databinding.observable.Realm.runWithDefault(Realm.java:337)
	at org.eclipse.ui.internal.Workbench.createAndRunWorkbench(Workbench.java:598)
	at org.eclipse.ui.PlatformUI.createAndRunWorkbench(PlatformUI.java:150)
	at org.eclipse.ui.internal.ide.application.IDEApplication.start(IDEApplication.java:139)
	at org.eclipse.tycho.surefire.osgibooter.UITestApplication.runApplication(UITestApplication.java:31)
	at org.eclipse.tycho.surefire.osgibooter.AbstractUITestApplication.run(AbstractUITestApplication.java:120)
	at org.eclipse.tycho.surefire.osgibooter.UITestApplication.start(UITestApplication.java:37)
	at org.eclipse.equinox.internal.app.EclipseAppHandle.run(EclipseAppHandle.java:196)
	at org.eclipse.core.runtime.internal.adaptor.EclipseAppLauncher.runApplication(EclipseAppLauncher.java:134)
	at org.eclipse.core.runtime.internal.adaptor.EclipseAppLauncher.start(EclipseAppLauncher.java:104)
	at org.eclipse.core.runtime.adaptor.EclipseStarter.run(EclipseStarter.java:380)
	at org.eclipse.core.runtime.adaptor.EclipseStarter.run(EclipseStarter.java:235)
	at sun.reflect.NativeMethodAccessorImpl.invoke0(Native Method)
	at sun.reflect.NativeMethodAccessorImpl.invoke(NativeMethodAccessorImpl.java:57)
	at sun.reflect.DelegatingMethodAccessorImpl.invoke(DelegatingMethodAccessorImpl.java:43)
	at java.lang.reflect.Method.invoke(Method.java:606)
	at org.eclipse.equinox.launcher.Main.invokeFramework(Main.java:669)
	at org.eclipse.equinox.launcher.Main.basicRun(Main.java:608)
	at org.eclipse.equinox.launcher.Main.run(Main.java:1515)
	at org.eclipse.equinox.launcher.Main.main(Main.java:1488)

testTimestampEqualsOr(org.eclipse.tracecompass.tmf.ui.swtbot.tests.viewers.events.FilterViewerTest)  Time elapsed: 3.166 sec  <<< ERROR!
org.eclipse.swt.SWTException: Failed to execute runnable (org.eclipse.swtbot.swt.finder.exceptions.WidgetNotFoundException: Could not find menu: TRACETYPE)
	at org.eclipse.swt.SWT.error(SWT.java:4491)
	at org.eclipse.swt.SWT.error(SWT.java:4406)
	at org.eclipse.swt.widgets.Synchronizer.syncExec(Synchronizer.java:208)
	at org.eclipse.ui.internal.UISynchronizer.syncExec(UISynchronizer.java:145)
	at org.eclipse.swt.widgets.Display.syncExec(Display.java:4633)
	at org.eclipse.swtbot.swt.finder.finders.UIThreadRunnable.run(UIThreadRunnable.java:76)
	at org.eclipse.swtbot.swt.finder.finders.UIThreadRunnable.syncExec(UIThreadRunnable.java:142)
	at org.eclipse.swtbot.swt.finder.finders.UIThreadRunnable.syncExec(UIThreadRunnable.java:125)
	at org.eclipse.swtbot.swt.finder.finders.ContextMenuHelper.contextMenu(ContextMenuHelper.java:42)
	at org.eclipse.swtbot.swt.finder.widgets.SWTBotTreeItem.contextMenu(SWTBotTreeItem.java:558)
	at org.eclipse.tracecompass.tmf.ui.swtbot.tests.viewers.events.FilterViewerTest.testTimestampEqualsOr(FilterViewerTest.java:216)
Caused by: org.eclipse.swtbot.swt.finder.exceptions.WidgetNotFoundException: Could not find menu: TRACETYPE
	at org.eclipse.swtbot.swt.finder.finders.ContextMenuHelper$1.run(ContextMenuHelper.java:63)
	at org.eclipse.swtbot.swt.finder.finders.ContextMenuHelper$1.run(ContextMenuHelper.java:1)
	at org.eclipse.swtbot.swt.finder.finders.UIThreadRunnable$2.doRun(UIThreadRunnable.java:140)
	at org.eclipse.swtbot.swt.finder.finders.UIThreadRunnable$1.run(UIThreadRunnable.java:89)
	at org.eclipse.swt.widgets.RunnableLock.run(RunnableLock.java:35)
	at org.eclipse.swt.widgets.Synchronizer.runAsyncMessages(Synchronizer.java:135)
	at org.eclipse.swt.widgets.Display.runAsyncMessages(Display.java:3794)
	at org.eclipse.swt.widgets.Display.readAndDispatch(Display.java:3433)
	at org.eclipse.e4.ui.internal.workbench.swt.PartRenderingEngine$4.run(PartRenderingEngine.java:1127)
	at org.eclipse.core.databinding.observable.Realm.runWithDefault(Realm.java:337)
	at org.eclipse.e4.ui.internal.workbench.swt.PartRenderingEngine.run(PartRenderingEngine.java:1018)
	at org.eclipse.e4.ui.internal.workbench.E4Workbench.createAndRunUI(E4Workbench.java:156)
	at org.eclipse.ui.internal.Workbench$5.run(Workbench.java:654)
	at org.eclipse.core.databinding.observable.Realm.runWithDefault(Realm.java:337)
	at org.eclipse.ui.internal.Workbench.createAndRunWorkbench(Workbench.java:598)
	at org.eclipse.ui.PlatformUI.createAndRunWorkbench(PlatformUI.java:150)
	at org.eclipse.ui.internal.ide.application.IDEApplication.start(IDEApplication.java:139)
	at org.eclipse.tycho.surefire.osgibooter.UITestApplication.runApplication(UITestApplication.java:31)
	at org.eclipse.tycho.surefire.osgibooter.AbstractUITestApplication.run(AbstractUITestApplication.java:120)
	at org.eclipse.tycho.surefire.osgibooter.UITestApplication.start(UITestApplication.java:37)
	at org.eclipse.equinox.internal.app.EclipseAppHandle.run(EclipseAppHandle.java:196)
	at org.eclipse.core.runtime.internal.adaptor.EclipseAppLauncher.runApplication(EclipseAppLauncher.java:134)
	at org.eclipse.core.runtime.internal.adaptor.EclipseAppLauncher.start(EclipseAppLauncher.java:104)
	at org.eclipse.core.runtime.adaptor.EclipseStarter.run(EclipseStarter.java:380)
	at org.eclipse.core.runtime.adaptor.EclipseStarter.run(EclipseStarter.java:235)
	at sun.reflect.NativeMethodAccessorImpl.invoke0(Native Method)
	at sun.reflect.NativeMethodAccessorImpl.invoke(NativeMethodAccessorImpl.java:57)
	at sun.reflect.DelegatingMethodAccessorImpl.invoke(DelegatingMethodAccessorImpl.java:43)
	at java.lang.reflect.Method.invoke(Method.java:606)
	at org.eclipse.equinox.launcher.Main.invokeFramework(Main.java:669)
	at org.eclipse.equinox.launcher.Main.basicRun(Main.java:608)
	at org.eclipse.equinox.launcher.Main.run(Main.java:1515)
	at org.eclipse.equinox.launcher.Main.main(Main.java:1488)

testChangeFont(org.eclipse.tracecompass.tmf.ui.swtbot.tests.viewers.events.FontEventEditorTest)  Time elapsed: 8.693 sec
testReorder(org.eclipse.tracecompass.tmf.ui.swtbot.tests.viewers.events.MovableColumnEventsEditorTest)  Time elapsed: 11.758 sec
testSDView(org.eclipse.tracecompass.tmf.ui.swtbot.tests.viewers.events.SDViewTest)  Time elapsed: 6.099 sec
testOffsetting(org.eclipse.tracecompass.tmf.ui.swtbot.tests.viewers.events.TestTraceOffsetting)  Time elapsed: 11.129 sec
testOverlappingTimechartMove(org.eclipse.tracecompass.tmf.ui.swtbot.tests.viewers.events.TmfAlignTimeAxisTest)  Time elapsed: 5.292 sec
testNotOverlappingCallstackMove(org.eclipse.tracecompass.tmf.ui.swtbot.tests.viewers.events.TmfAlignTimeAxisTest)  Time elapsed: 5.213 sec
testMoveHistogramCallstackFollows(org.eclipse.tracecompass.tmf.ui.swtbot.tests.viewers.events.TmfAlignTimeAxisTest)  Time elapsed: 5.234 sec
testOverlappingHistogramMove(org.eclipse.tracecompass.tmf.ui.swtbot.tests.viewers.events.TmfAlignTimeAxisTest)  Time elapsed: 5.19 sec
testNotOverlappingHistogramMove(org.eclipse.tracecompass.tmf.ui.swtbot.tests.viewers.events.TmfAlignTimeAxisTest)  Time elapsed: 5.296 sec
testMoveCallstackHistogramFollows(org.eclipse.tracecompass.tmf.ui.swtbot.tests.viewers.events.TmfAlignTimeAxisTest)  Time elapsed: 5.211 sec
testGzipImport(org.eclipse.tracecompass.tmf.ui.swtbot.tests.wizards.StandardImportGzipTraceTest)  Time elapsed: 6.213 sec
test(org.eclipse.tracecompass.tmf.ctf.ui.swtbot.tests.ImportAndReadSmokeTest)  Time elapsed: 12.097 sec
testImportFromDirectory(org.eclipse.tracecompass.tmf.ctf.ui.swtbot.tests.StandardImportAndReadSmokeTest)  Time elapsed: 7.66 sec
testExtractArchivesFromArchive(org.eclipse.tracecompass.tmf.ctf.ui.swtbot.tests.StandardImportAndReadSmokeTest)  Time elapsed: 15.952 sec
testImportFromDirectoryLinksPreserveFolder(org.eclipse.tracecompass.tmf.ctf.ui.swtbot.tests.StandardImportAndReadSmokeTest)  Time elapsed: 7.99 sec
testExtractArchivesFromArchivePreserveFolder(org.eclipse.tracecompass.tmf.ctf.ui.swtbot.tests.StandardImportAndReadSmokeTest)  Time elapsed: 17.152 sec
testExtractArchivesFromDirectory(org.eclipse.tracecompass.tmf.ctf.ui.swtbot.tests.StandardImportAndReadSmokeTest)  Time elapsed: 11.972 sec
testImportFromArchive(org.eclipse.tracecompass.tmf.ctf.ui.swtbot.tests.StandardImportAndReadSmokeTest)  Time elapsed: 12.713 sec
testExtractArchivesFromDirectoryLinksPreserveStruture(org.eclipse.tracecompass.tmf.ctf.ui.swtbot.tests.StandardImportAndReadSmokeTest)  Time elapsed: 13.195 sec
testEmptyDirectory(org.eclipse.tracecompass.tmf.ctf.ui.swtbot.tests.StandardImportAndReadSmokeTest)  Time elapsed: 5.665 sec
testEmptyArchive(org.eclipse.tracecompass.tmf.ctf.ui.swtbot.tests.StandardImportAndReadSmokeTest)  Time elapsed: 9.814 sec
testNestedEmptyArchive(org.eclipse.tracecompass.tmf.ctf.ui.swtbot.tests.StandardImportAndReadSmokeTest)  Time elapsed: 12.653 sec
testImportFromArchiveOverwrite(org.eclipse.tracecompass.tmf.ctf.ui.swtbot.tests.StandardImportAndReadSmokeTest)  Time elapsed: 16.247 sec
testDirectoryWithEmptyArchive(org.eclipse.tracecompass.tmf.ctf.ui.swtbot.tests.StandardImportAndReadSmokeTest)  Time elapsed: 9.116 sec
testImportFromDirectoryPreserveFolder(org.eclipse.tracecompass.tmf.ctf.ui.swtbot.tests.StandardImportAndReadSmokeTest)  Time elapsed: 7.896 sec
testImportFromDirectoryLinks(org.eclipse.tracecompass.tmf.ctf.ui.swtbot.tests.StandardImportAndReadSmokeTest)  Time elapsed: 7.298 sec
testImportFromDirectoryOverwrite(org.eclipse.tracecompass.tmf.ctf.ui.swtbot.tests.StandardImportAndReadSmokeTest)  Time elapsed: 15.14 sec
testExtractArchivesFromDirectoryLinks(org.eclipse.tracecompass.tmf.ctf.ui.swtbot.tests.StandardImportAndReadSmokeTest)  Time elapsed: 12.303 sec
testImportFromArchivePreserveFolder(org.eclipse.tracecompass.tmf.ctf.ui.swtbot.tests.StandardImportAndReadSmokeTest)  Time elapsed: 8.389 sec
testOpen[0: ../../ctf/org.eclipse.tracecompass.ctf.core.tests/traces/ctf-testsuite/tests/1.8/regression/metadata/fail/struct-align-negative](org.eclipse.tracecompass.tmf.ctf.ui.swtbot.tests.TestInvalidCtfTrace)  Time elapsed: 4.635 sec
testOpen[1: ../../ctf/org.eclipse.tracecompass.ctf.core.tests/traces/ctf-testsuite/tests/1.8/regression/metadata/fail/array-size-identifier](org.eclipse.tracecompass.tmf.ctf.ui.swtbot.tests.TestInvalidCtfTrace)  Time elapsed: 4.751 sec
testOpen[2: ../../ctf/org.eclipse.tracecompass.ctf.core.tests/traces/ctf-testsuite/tests/1.8/regression/metadata/fail/struct-align-huge](org.eclipse.tracecompass.tmf.ctf.ui.swtbot.tests.TestInvalidCtfTrace)  Time elapsed: 4.932 sec
testOpen[3: ../../ctf/org.eclipse.tracecompass.ctf.core.tests/traces/ctf-testsuite/tests/1.8/regression/metadata/fail/integer-signed-as-string](org.eclipse.tracecompass.tmf.ctf.ui.swtbot.tests.TestInvalidCtfTrace)  Time elapsed: 5.19 sec
testOpen[4: ../../ctf/org.eclipse.tracecompass.ctf.core.tests/traces/ctf-testsuite/tests/1.8/regression/metadata/fail/array-size-keyword](org.eclipse.tracecompass.tmf.ctf.ui.swtbot.tests.TestInvalidCtfTrace)  Time elapsed: 4.851 sec
testOpen[5: ../../ctf/org.eclipse.tracecompass.ctf.core.tests/traces/ctf-testsuite/tests/1.8/regression/metadata/fail/integer-range](org.eclipse.tracecompass.tmf.ctf.ui.swtbot.tests.TestInvalidCtfTrace)  Time elapsed: 5.063 sec
testOpen[6: ../../ctf/org.eclipse.tracecompass.ctf.core.tests/traces/ctf-testsuite/tests/1.8/regression/metadata/fail/integer-signed-invalid](org.eclipse.tracecompass.tmf.ctf.ui.swtbot.tests.TestInvalidCtfTrace)  Time elapsed: 5.03 sec
testOpen[7: ../../ctf/org.eclipse.tracecompass.ctf.core.tests/traces/ctf-testsuite/tests/1.8/regression/metadata/fail/struct-align-string](org.eclipse.tracecompass.tmf.ctf.ui.swtbot.tests.TestInvalidCtfTrace)  Time elapsed: 4.938 sec
testOpen[8: ../../ctf/org.eclipse.tracecompass.ctf.core.tests/traces/ctf-testsuite/tests/1.8/regression/metadata/fail/array-size-type-field](org.eclipse.tracecompass.tmf.ctf.ui.swtbot.tests.TestInvalidCtfTrace)  Time elapsed: 4.966 sec
testOpen[9: ../../ctf/org.eclipse.tracecompass.ctf.core.tests/traces/ctf-testsuite/tests/1.8/regression/metadata/fail/struct-duplicate-struct-name](org.eclipse.tracecompass.tmf.ctf.ui.swtbot.tests.TestInvalidCtfTrace)  Time elapsed: 4.753 sec
testOpen[10: ../../ctf/org.eclipse.tracecompass.ctf.core.tests/traces/ctf-testsuite/tests/1.8/regression/metadata/fail/integer-encoding-invalid](org.eclipse.tracecompass.tmf.ctf.ui.swtbot.tests.TestInvalidCtfTrace)  Time elapsed: 4.812 sec
testOpen[11: ../../ctf/org.eclipse.tracecompass.ctf.core.tests/traces/ctf-testsuite/tests/1.8/regression/metadata/fail/integer-size-as-string](org.eclipse.tracecompass.tmf.ctf.ui.swtbot.tests.TestInvalidCtfTrace)  Time elapsed: 5.066 sec
testOpen[12: ../../ctf/org.eclipse.tracecompass.ctf.core.tests/traces/ctf-testsuite/tests/1.8/regression/metadata/fail/array-size-type](org.eclipse.tracecompass.tmf.ctf.ui.swtbot.tests.TestInvalidCtfTrace)  Time elapsed: 4.938 sec
testOpen[13: ../../ctf/org.eclipse.tracecompass.ctf.core.tests/traces/ctf-testsuite/tests/1.8/regression/metadata/fail/array-size-not-present](org.eclipse.tracecompass.tmf.ctf.ui.swtbot.tests.TestInvalidCtfTrace)  Time elapsed: 4.954 sec
testOpen[14: ../../ctf/org.eclipse.tracecompass.ctf.core.tests/traces/ctf-testsuite/tests/1.8/regression/metadata/fail/struct-duplicate-field-name](org.eclipse.tracecompass.tmf.ctf.ui.swtbot.tests.TestInvalidCtfTrace)  Time elapsed: 4.644 sec
testOpen[15: ../../ctf/org.eclipse.tracecompass.ctf.core.tests/traces/ctf-testsuite/tests/1.8/regression/metadata/fail/array-size-string](org.eclipse.tracecompass.tmf.ctf.ui.swtbot.tests.TestInvalidCtfTrace)  Time elapsed: 4.903 sec
testOpen[16: ../../ctf/org.eclipse.tracecompass.ctf.core.tests/traces/ctf-testsuite/tests/1.8/regression/metadata/fail/integer-size-missing](org.eclipse.tracecompass.tmf.ctf.ui.swtbot.tests.TestInvalidCtfTrace)  Time elapsed: 4.979 sec
testOpen[17: ../../ctf/org.eclipse.tracecompass.ctf.core.tests/traces/ctf-testsuite/tests/1.8/regression/metadata/fail/integer-negative-bit-size](org.eclipse.tracecompass.tmf.ctf.ui.swtbot.tests.TestInvalidCtfTrace)  Time elapsed: 4.6 sec
testOpen[18: ../../ctf/org.eclipse.tracecompass.ctf.core.tests/traces/ctf-testsuite/tests/1.8/regression/metadata/fail/struct-align-enum](org.eclipse.tracecompass.tmf.ctf.ui.swtbot.tests.TestInvalidCtfTrace)  Time elapsed: 5.075 sec
testOpen[19: ../../ctf/org.eclipse.tracecompass.ctf.core.tests/traces/ctf-testsuite/tests/1.8/regression/metadata/fail/integer-encoding-as-string](org.eclipse.tracecompass.tmf.ctf.ui.swtbot.tests.TestInvalidCtfTrace)  Time elapsed: 4.736 sec
testOpen[20: ../../ctf/org.eclipse.tracecompass.ctf.core.tests/traces/ctf-testsuite/tests/1.8/regression/metadata/fail/struct-align-zero](org.eclipse.tracecompass.tmf.ctf.ui.swtbot.tests.TestInvalidCtfTrace)  Time elapsed: 4.43 sec
testOpen[21: ../../ctf/org.eclipse.tracecompass.ctf.core.tests/traces/ctf-testsuite/tests/1.8/regression/metadata/fail/array-redefinition](org.eclipse.tracecompass.tmf.ctf.ui.swtbot.tests.TestInvalidCtfTrace)  Time elapsed: 4.914 sec
testOpen[22: ../../ctf/org.eclipse.tracecompass.ctf.core.tests/traces/ctf-testsuite/tests/1.8/regression/metadata/fail/array-size-negative](org.eclipse.tracecompass.tmf.ctf.ui.swtbot.tests.TestInvalidCtfTrace)  Time elapsed: 4.843 sec
testOpen[23: ../../ctf/org.eclipse.tracecompass.ctf.core.tests/traces/ctf-testsuite/tests/1.8/regression/metadata/fail/struct-field-name-keyword](org.eclipse.tracecompass.tmf.ctf.ui.swtbot.tests.TestInvalidCtfTrace)  Time elapsed: 4.531 sec
test(org.eclipse.tracecompass.tmf.pcap.ui.swtbot.tests.ImportAndReadPcapTest)  Time elapsed: 27.633 sec
testPerspectiveComplete(org.eclipse.tracecompass.tmf.pcap.ui.swtbot.tests.NetworkPerspectiveChecker)  Time elapsed: 0 sec
testPerspectiveForViews(org.eclipse.tracecompass.tmf.pcap.ui.swtbot.tests.NetworkPerspectiveChecker)  Time elapsed: 0.037 sec
org.eclipse.tracecompass.tmf.remote.ui.swtbot.tests.fetch.FetchRemoteTracesTest(junit.framework.TestSuite)  Time elapsed: 0.037 sec  <<< ERROR!
java.lang.NoClassDefFoundError: Could not initialize class org.eclipse.tracecompass.tmf.remote.ui.swtbot.tests.fetch.FetchRemoteTracesTest
	at sun.reflect.GeneratedMethodAccessor261.invoke(Unknown Source)
	at sun.reflect.DelegatingMethodAccessorImpl.invoke(DelegatingMethodAccessorImpl.java:43)
	at java.lang.reflect.Method.invoke(Method.java:606)
	at org.junit.runners.model.FrameworkMethod$1.runReflectiveCall(FrameworkMethod.java:50)
	at org.junit.internal.runners.model.ReflectiveCallable.run(ReflectiveCallable.java:12)
	at org.junit.runners.model.FrameworkMethod.invokeExplosively(FrameworkMethod.java:47)
	at org.junit.internal.runners.statements.RunBefores.evaluate(RunBefores.java:24)
	at org.junit.runners.ParentRunner.run(ParentRunner.java:363)
	at org.eclipse.swtbot.swt.finder.junit.SWTBotJunit4ClassRunner.run(SWTBotJunit4ClassRunner.java:54)
	at org.junit.runners.Suite.runChild(Suite.java:128)
	at org.junit.runners.Suite.runChild(Suite.java:27)
	at org.junit.runners.ParentRunner$3.run(ParentRunner.java:290)
	at org.junit.runners.ParentRunner$1.schedule(ParentRunner.java:71)
	at org.junit.runners.ParentRunner.runChildren(ParentRunner.java:288)
	at org.junit.runners.ParentRunner.access$000(ParentRunner.java:58)
	at org.junit.runners.ParentRunner$2.evaluate(ParentRunner.java:268)
	at org.junit.runners.ParentRunner.run(ParentRunner.java:363)
	at org.junit.runners.Suite.runChild(Suite.java:128)
	at org.junit.runners.Suite.runChild(Suite.java:27)
	at org.junit.runners.ParentRunner$3.run(ParentRunner.java:290)
	at org.junit.runners.ParentRunner$1.schedule(ParentRunner.java:71)
	at org.junit.runners.ParentRunner.runChildren(ParentRunner.java:288)
	at org.junit.runners.ParentRunner.access$000(ParentRunner.java:58)
	at org.junit.runners.ParentRunner$2.evaluate(ParentRunner.java:268)
	at org.junit.runners.ParentRunner.run(ParentRunner.java:363)
	at junit.framework.JUnit4TestAdapter.run(JUnit4TestAdapter.java:38)
	at junit.framework.TestSuite.runTest(TestSuite.java:252)
	at junit.framework.TestSuite.run(TestSuite.java:247)

testPerspectiveComplete(org.eclipse.tracecompass.lttng2.kernel.ui.swtbot.tests.KernelPerspectiveChecker)  Time elapsed: 0.622 sec
testPerspectiveForViews(org.eclipse.tracecompass.lttng2.kernel.ui.swtbot.tests.KernelPerspectiveChecker)  Time elapsed: 0.003 sec
test(org.eclipse.tracecompass.lttng2.kernel.ui.swtbot.tests.ImportAndReadKernelSmokeTest)  Time elapsed: 15.383 sec
testToolBarFollowCPUForwardBackward(org.eclipse.tracecompass.lttng2.kernel.ui.swtbot.tests.ControlFlowViewTest)  Time elapsed: 21.908 sec
testKeyboardLeftRight(org.eclipse.tracecompass.lttng2.kernel.ui.swtbot.tests.ControlFlowViewTest)  Time elapsed: 15.834 sec
testToolBarSelectNextPreviousEvent(org.eclipse.tracecompass.lttng2.kernel.ui.swtbot.tests.ControlFlowViewTest)  Time elapsed: 17.566 sec
testOpenAndCloseConcurrency(org.eclipse.tracecompass.lttng2.kernel.ui.swtbot.tests.OpenTraceStressTest)  Time elapsed: 53.899 sec
testNew(org.eclipse.tracecompass.tmf.ui.swtbot.tests.parsers.custom.TestCustomTxtWizard)  Time elapsed: 8.966 sec
testEdit(org.eclipse.tracecompass.tmf.ui.swtbot.tests.parsers.custom.TestCustomTxtWizard)  Time elapsed: 10.606 sec
testNew(org.eclipse.tracecompass.tmf.ui.swtbot.tests.parsers.custom.TestCustomXmlWizard)  Time elapsed: 8.239 sec
testPerspectiveComplete(org.eclipse.tracecompass.tmf.ui.swtbot.tests.perspectives.TracingPerspectiveChecker)  Time elapsed: 0.001 sec  <<< FAILURE!
java.lang.AssertionError: view org.eclipse.linuxtools.tmf.ui.tmfUml2SDSyncView is present
	at org.junit.Assert.fail(Assert.java:88)
	at org.junit.Assert.assertTrue(Assert.java:41)
	at org.eclipse.tracecompass.tmf.ui.swtbot.tests.shared.AbstractPerspectiveChecker.testPerspectiveComplete(AbstractPerspectiveChecker.java:118)
	at sun.reflect.GeneratedMethodAccessor156.invoke(Unknown Source)
	at sun.reflect.DelegatingMethodAccessorImpl.invoke(DelegatingMethodAccessorImpl.java:43)
	at java.lang.reflect.Method.invoke(Method.java:606)
	at org.junit.runners.model.FrameworkMethod$1.runReflectiveCall(FrameworkMethod.java:50)
	at org.junit.internal.runners.model.ReflectiveCallable.run(ReflectiveCallable.java:12)
	at org.junit.runners.model.FrameworkMethod.invokeExplosively(FrameworkMethod.java:47)
	at org.junit.internal.runners.statements.InvokeMethod.evaluate(InvokeMethod.java:17)
	at org.junit.internal.runners.statements.RunBefores.evaluate(RunBefores.java:26)
	at org.junit.runners.ParentRunner.runLeaf(ParentRunner.java:325)
	at org.junit.runners.BlockJUnit4ClassRunner.runChild(BlockJUnit4ClassRunner.java:78)
	at org.junit.runners.BlockJUnit4ClassRunner.runChild(BlockJUnit4ClassRunner.java:57)
	at org.junit.runners.ParentRunner$3.run(ParentRunner.java:290)
	at org.junit.runners.ParentRunner$1.schedule(ParentRunner.java:71)
	at org.junit.runners.ParentRunner.runChildren(ParentRunner.java:288)
	at org.junit.runners.ParentRunner.access$000(ParentRunner.java:58)
	at org.junit.runners.ParentRunner$2.evaluate(ParentRunner.java:268)
	at org.junit.internal.runners.statements.RunBefores.evaluate(RunBefores.java:26)
	at org.junit.internal.runners.statements.RunAfters.evaluate(RunAfters.java:27)
	at org.junit.runners.ParentRunner.run(ParentRunner.java:363)
	at org.eclipse.swtbot.swt.finder.junit.SWTBotJunit4ClassRunner.run(SWTBotJunit4ClassRunner.java:54)
	at org.junit.runners.Suite.runChild(Suite.java:128)
	at org.junit.runners.Suite.runChild(Suite.java:27)
	at org.junit.runners.ParentRunner$3.run(ParentRunner.java:290)
	at org.junit.runners.ParentRunner$1.schedule(ParentRunner.java:71)
	at org.junit.runners.ParentRunner.runChildren(ParentRunner.java:288)
	at org.junit.runners.ParentRunner.access$000(ParentRunner.java:58)
	at org.junit.runners.ParentRunner$2.evaluate(ParentRunner.java:268)
	at org.junit.runners.ParentRunner.run(ParentRunner.java:363)
	at org.junit.runners.Suite.runChild(Suite.java:128)
	at org.junit.runners.Suite.runChild(Suite.java:27)
	at org.junit.runners.ParentRunner$3.run(ParentRunner.java:290)
	at org.junit.runners.ParentRunner$1.schedule(ParentRunner.java:71)
	at org.junit.runners.ParentRunner.runChildren(ParentRunner.java:288)
	at org.junit.runners.ParentRunner.access$000(ParentRunner.java:58)
	at org.junit.runners.ParentRunner$2.evaluate(ParentRunner.java:268)
	at org.junit.runners.ParentRunner.run(ParentRunner.java:363)
	at junit.framework.JUnit4TestAdapter.run(JUnit4TestAdapter.java:38)
	at junit.framework.TestSuite.runTest(TestSuite.java:252)
	at junit.framework.TestSuite.run(TestSuite.java:247)
	at org.junit.internal.runners.JUnit38ClassRunner.run(JUnit38ClassRunner.java:86)
	at org.apache.maven.surefire.junit4.JUnit4Provider.execute(JUnit4Provider.java:264)
	at org.apache.maven.surefire.junit4.JUnit4Provider.executeTestSet(JUnit4Provider.java:153)
	at org.apache.maven.surefire.junit4.JUnit4Provider.invoke(JUnit4Provider.java:124)
	at sun.reflect.NativeMethodAccessorImpl.invoke0(Native Method)
	at sun.reflect.NativeMethodAccessorImpl.invoke(NativeMethodAccessorImpl.java:57)
	at sun.reflect.DelegatingMethodAccessorImpl.invoke(DelegatingMethodAccessorImpl.java:43)
	at java.lang.reflect.Method.invoke(Method.java:606)
	at org.apache.maven.surefire.util.ReflectionUtils.invokeMethodWithArray2(ReflectionUtils.java:208)
	at org.apache.maven.surefire.booter.ProviderFactory$ProviderProxy.invoke(ProviderFactory.java:156)
	at org.apache.maven.surefire.booter.ProviderFactory.invokeProvider(ProviderFactory.java:82)
	at org.eclipse.tycho.surefire.osgibooter.OsgiSurefireBooter.run(OsgiSurefireBooter.java:91)
	at org.eclipse.tycho.surefire.osgibooter.AbstractUITestApplication.runTests(AbstractUITestApplication.java:44)
	at org.eclipse.e4.ui.internal.workbench.swt.E4Testable$1.run(E4Testable.java:73)
	at java.lang.Thread.run(Thread.java:745)

testPerspectiveForViews(org.eclipse.tracecompass.tmf.ui.swtbot.tests.perspectives.TracingPerspectiveChecker)  Time elapsed: 0.001 sec
test(org.eclipse.tracecompass.tmf.ui.swtbot.tests.viewers.events.CallsiteEventsInTableTest)  Time elapsed: 8.181 sec
test(org.eclipse.tracecompass.tmf.ui.swtbot.tests.viewers.events.CollapseEventsInTableTest)  Time elapsed: 9.444 sec
testYellow(org.eclipse.tracecompass.tmf.ui.swtbot.tests.viewers.events.ColorsViewTest)  Time elapsed: 8.422 sec
testToggleColumns(org.eclipse.tracecompass.tmf.ui.swtbot.tests.viewers.events.ColumnHeaderMenuTest)  Time elapsed: 3.112 sec
testShowAll(org.eclipse.tracecompass.tmf.ui.swtbot.tests.viewers.events.ColumnHeaderMenuTest)  Time elapsed: 2.942 sec
testNoCopySearchRow(org.eclipse.tracecompass.tmf.ui.swtbot.tests.viewers.events.CopyToClipboardTest)  Time elapsed: 4.064 sec
testCopySingleSelection(org.eclipse.tracecompass.tmf.ui.swtbot.tests.viewers.events.CopyToClipboardTest)  Time elapsed: 3.353 sec
testCopyMultipleSelection(org.eclipse.tracecompass.tmf.ui.swtbot.tests.viewers.events.CopyToClipboardTest)  Time elapsed: 3.59 sec
testMultiHighlightMessage(org.eclipse.tracecompass.tmf.ui.swtbot.tests.viewers.events.FilterColorEditorTest)  Time elapsed: 8.835 sec
testSwitchToFilter(org.eclipse.tracecompass.tmf.ui.swtbot.tests.viewers.events.FilterColorEditorTest)  Time elapsed: 9.737 sec
testHighlight(org.eclipse.tracecompass.tmf.ui.swtbot.tests.viewers.events.FilterColorEditorTest)  Time elapsed: 7.653 sec
testPreference(org.eclipse.tracecompass.tmf.ui.swtbot.tests.viewers.events.FilterColorEditorTest)  Time elapsed: 8.878 sec
testTimestampFilter(org.eclipse.tracecompass.tmf.ui.swtbot.tests.viewers.events.FilterViewerTest)  Time elapsed: 3.185 sec  <<< ERROR!
org.eclipse.swt.SWTException: Failed to execute runnable (org.eclipse.swtbot.swt.finder.exceptions.WidgetNotFoundException: Could not find menu: TRACETYPE)
	at org.eclipse.swt.SWT.error(SWT.java:4491)
	at org.eclipse.swt.SWT.error(SWT.java:4406)
	at org.eclipse.swt.widgets.Synchronizer.syncExec(Synchronizer.java:208)
	at org.eclipse.ui.internal.UISynchronizer.syncExec(UISynchronizer.java:145)
	at org.eclipse.swt.widgets.Display.syncExec(Display.java:4633)
	at org.eclipse.swtbot.swt.finder.finders.UIThreadRunnable.run(UIThreadRunnable.java:76)
	at org.eclipse.swtbot.swt.finder.finders.UIThreadRunnable.syncExec(UIThreadRunnable.java:142)
	at org.eclipse.swtbot.swt.finder.finders.UIThreadRunnable.syncExec(UIThreadRunnable.java:125)
	at org.eclipse.swtbot.swt.finder.finders.ContextMenuHelper.contextMenu(ContextMenuHelper.java:42)
	at org.eclipse.swtbot.swt.finder.widgets.SWTBotTreeItem.contextMenu(SWTBotTreeItem.java:558)
	at org.eclipse.tracecompass.tmf.ui.swtbot.tests.viewers.events.FilterViewerTest.testTimestampFilter(FilterViewerTest.java:166)
Caused by: org.eclipse.swtbot.swt.finder.exceptions.WidgetNotFoundException: Could not find menu: TRACETYPE
	at org.eclipse.swtbot.swt.finder.finders.ContextMenuHelper$1.run(ContextMenuHelper.java:63)
	at org.eclipse.swtbot.swt.finder.finders.ContextMenuHelper$1.run(ContextMenuHelper.java:1)
	at org.eclipse.swtbot.swt.finder.finders.UIThreadRunnable$2.doRun(UIThreadRunnable.java:140)
	at org.eclipse.swtbot.swt.finder.finders.UIThreadRunnable$1.run(UIThreadRunnable.java:89)
	at org.eclipse.swt.widgets.RunnableLock.run(RunnableLock.java:35)
	at org.eclipse.swt.widgets.Synchronizer.runAsyncMessages(Synchronizer.java:135)
	at org.eclipse.swt.widgets.Display.runAsyncMessages(Display.java:3794)
	at org.eclipse.swt.widgets.Display.readAndDispatch(Display.java:3433)
	at org.eclipse.e4.ui.internal.workbench.swt.PartRenderingEngine$4.run(PartRenderingEngine.java:1127)
	at org.eclipse.core.databinding.observable.Realm.runWithDefault(Realm.java:337)
	at org.eclipse.e4.ui.internal.workbench.swt.PartRenderingEngine.run(PartRenderingEngine.java:1018)
	at org.eclipse.e4.ui.internal.workbench.E4Workbench.createAndRunUI(E4Workbench.java:156)
	at org.eclipse.ui.internal.Workbench$5.run(Workbench.java:654)
	at org.eclipse.core.databinding.observable.Realm.runWithDefault(Realm.java:337)
	at org.eclipse.ui.internal.Workbench.createAndRunWorkbench(Workbench.java:598)
	at org.eclipse.ui.PlatformUI.createAndRunWorkbench(PlatformUI.java:150)
	at org.eclipse.ui.internal.ide.application.IDEApplication.start(IDEApplication.java:139)
	at org.eclipse.tycho.surefire.osgibooter.UITestApplication.runApplication(UITestApplication.java:31)
	at org.eclipse.tycho.surefire.osgibooter.AbstractUITestApplication.run(AbstractUITestApplication.java:120)
	at org.eclipse.tycho.surefire.osgibooter.UITestApplication.start(UITestApplication.java:37)
	at org.eclipse.equinox.internal.app.EclipseAppHandle.run(EclipseAppHandle.java:196)
	at org.eclipse.core.runtime.internal.adaptor.EclipseAppLauncher.runApplication(EclipseAppLauncher.java:134)
	at org.eclipse.core.runtime.internal.adaptor.EclipseAppLauncher.start(EclipseAppLauncher.java:104)
	at org.eclipse.core.runtime.adaptor.EclipseStarter.run(EclipseStarter.java:380)
	at org.eclipse.core.runtime.adaptor.EclipseStarter.run(EclipseStarter.java:235)
	at sun.reflect.NativeMethodAccessorImpl.invoke0(Native Method)
	at sun.reflect.NativeMethodAccessorImpl.invoke(NativeMethodAccessorImpl.java:57)
	at sun.reflect.DelegatingMethodAccessorImpl.invoke(DelegatingMethodAccessorImpl.java:43)
	at java.lang.reflect.Method.invoke(Method.java:606)
	at org.eclipse.equinox.launcher.Main.invokeFramework(Main.java:669)
	at org.eclipse.equinox.launcher.Main.basicRun(Main.java:608)
	at org.eclipse.equinox.launcher.Main.run(Main.java:1515)
	at org.eclipse.equinox.launcher.Main.main(Main.java:1488)

testField01(org.eclipse.tracecompass.tmf.ui.swtbot.tests.viewers.events.FilterViewerTest)  Time elapsed: 3.628 sec  <<< ERROR!
org.eclipse.swt.SWTException: Failed to execute runnable (org.eclipse.swtbot.swt.finder.exceptions.WidgetNotFoundException: Could not find menu: TRACETYPE)
	at org.eclipse.swt.SWT.error(SWT.java:4491)
	at org.eclipse.swt.SWT.error(SWT.java:4406)
	at org.eclipse.swt.widgets.Synchronizer.syncExec(Synchronizer.java:208)
	at org.eclipse.ui.internal.UISynchronizer.syncExec(UISynchronizer.java:145)
	at org.eclipse.swt.widgets.Display.syncExec(Display.java:4633)
	at org.eclipse.swtbot.swt.finder.finders.UIThreadRunnable.run(UIThreadRunnable.java:76)
	at org.eclipse.swtbot.swt.finder.finders.UIThreadRunnable.syncExec(UIThreadRunnable.java:142)
	at org.eclipse.swtbot.swt.finder.finders.UIThreadRunnable.syncExec(UIThreadRunnable.java:125)
	at org.eclipse.swtbot.swt.finder.finders.ContextMenuHelper.contextMenu(ContextMenuHelper.java:42)
	at org.eclipse.swtbot.swt.finder.widgets.SWTBotTreeItem.contextMenu(SWTBotTreeItem.java:558)
	at org.eclipse.tracecompass.tmf.ui.swtbot.tests.viewers.events.FilterViewerTest.testField01(FilterViewerTest.java:283)
Caused by: org.eclipse.swtbot.swt.finder.exceptions.WidgetNotFoundException: Could not find menu: TRACETYPE
	at org.eclipse.swtbot.swt.finder.finders.ContextMenuHelper$1.run(ContextMenuHelper.java:63)
	at org.eclipse.swtbot.swt.finder.finders.ContextMenuHelper$1.run(ContextMenuHelper.java:1)
	at org.eclipse.swtbot.swt.finder.finders.UIThreadRunnable$2.doRun(UIThreadRunnable.java:140)
	at org.eclipse.swtbot.swt.finder.finders.UIThreadRunnable$1.run(UIThreadRunnable.java:89)
	at org.eclipse.swt.widgets.RunnableLock.run(RunnableLock.java:35)
	at org.eclipse.swt.widgets.Synchronizer.runAsyncMessages(Synchronizer.java:135)
	at org.eclipse.swt.widgets.Display.runAsyncMessages(Display.java:3794)
	at org.eclipse.swt.widgets.Display.readAndDispatch(Display.java:3433)
	at org.eclipse.e4.ui.internal.workbench.swt.PartRenderingEngine$4.run(PartRenderingEngine.java:1127)
	at org.eclipse.core.databinding.observable.Realm.runWithDefault(Realm.java:337)
	at org.eclipse.e4.ui.internal.workbench.swt.PartRenderingEngine.run(PartRenderingEngine.java:1018)
	at org.eclipse.e4.ui.internal.workbench.E4Workbench.createAndRunUI(E4Workbench.java:156)
	at org.eclipse.ui.internal.Workbench$5.run(Workbench.java:654)
	at org.eclipse.core.databinding.observable.Realm.runWithDefault(Realm.java:337)
	at org.eclipse.ui.internal.Workbench.createAndRunWorkbench(Workbench.java:598)
	at org.eclipse.ui.PlatformUI.createAndRunWorkbench(PlatformUI.java:150)
	at org.eclipse.ui.internal.ide.application.IDEApplication.start(IDEApplication.java:139)
	at org.eclipse.tycho.surefire.osgibooter.UITestApplication.runApplication(UITestApplication.java:31)
	at org.eclipse.tycho.surefire.osgibooter.AbstractUITestApplication.run(AbstractUITestApplication.java:120)
	at org.eclipse.tycho.surefire.osgibooter.UITestApplication.start(UITestApplication.java:37)
	at org.eclipse.equinox.internal.app.EclipseAppHandle.run(EclipseAppHandle.java:196)
	at org.eclipse.core.runtime.internal.adaptor.EclipseAppLauncher.runApplication(EclipseAppLauncher.java:134)
	at org.eclipse.core.runtime.internal.adaptor.EclipseAppLauncher.start(EclipseAppLauncher.java:104)
	at org.eclipse.core.runtime.adaptor.EclipseStarter.run(EclipseStarter.java:380)
	at org.eclipse.core.runtime.adaptor.EclipseStarter.run(EclipseStarter.java:235)
	at sun.reflect.NativeMethodAccessorImpl.invoke0(Native Method)
	at sun.reflect.NativeMethodAccessorImpl.invoke(NativeMethodAccessorImpl.java:57)
	at sun.reflect.DelegatingMethodAccessorImpl.invoke(DelegatingMethodAccessorImpl.java:43)
	at java.lang.reflect.Method.invoke(Method.java:606)
	at org.eclipse.equinox.launcher.Main.invokeFramework(Main.java:669)
	at org.eclipse.equinox.launcher.Main.basicRun(Main.java:608)
	at org.eclipse.equinox.launcher.Main.run(Main.java:1515)
	at org.eclipse.equinox.launcher.Main.main(Main.java:1488)

testTimestampEqualsOr(org.eclipse.tracecompass.tmf.ui.swtbot.tests.viewers.events.FilterViewerTest)  Time elapsed: 3.172 sec  <<< ERROR!
org.eclipse.swt.SWTException: Failed to execute runnable (org.eclipse.swtbot.swt.finder.exceptions.WidgetNotFoundException: Could not find menu: TRACETYPE)
	at org.eclipse.swt.SWT.error(SWT.java:4491)
	at org.eclipse.swt.SWT.error(SWT.java:4406)
	at org.eclipse.swt.widgets.Synchronizer.syncExec(Synchronizer.java:208)
	at org.eclipse.ui.internal.UISynchronizer.syncExec(UISynchronizer.java:145)
	at org.eclipse.swt.widgets.Display.syncExec(Display.java:4633)
	at org.eclipse.swtbot.swt.finder.finders.UIThreadRunnable.run(UIThreadRunnable.java:76)
	at org.eclipse.swtbot.swt.finder.finders.UIThreadRunnable.syncExec(UIThreadRunnable.java:142)
	at org.eclipse.swtbot.swt.finder.finders.UIThreadRunnable.syncExec(UIThreadRunnable.java:125)
	at org.eclipse.swtbot.swt.finder.finders.ContextMenuHelper.contextMenu(ContextMenuHelper.java:42)
	at org.eclipse.swtbot.swt.finder.widgets.SWTBotTreeItem.contextMenu(SWTBotTreeItem.java:558)
	at org.eclipse.tracecompass.tmf.ui.swtbot.tests.viewers.events.FilterViewerTest.testTimestampEqualsOr(FilterViewerTest.java:216)
Caused by: org.eclipse.swtbot.swt.finder.exceptions.WidgetNotFoundException: Could not find menu: TRACETYPE
	at org.eclipse.swtbot.swt.finder.finders.ContextMenuHelper$1.run(ContextMenuHelper.java:63)
	at org.eclipse.swtbot.swt.finder.finders.ContextMenuHelper$1.run(ContextMenuHelper.java:1)
	at org.eclipse.swtbot.swt.finder.finders.UIThreadRunnable$2.doRun(UIThreadRunnable.java:140)
	at org.eclipse.swtbot.swt.finder.finders.UIThreadRunnable$1.run(UIThreadRunnable.java:89)
	at org.eclipse.swt.widgets.RunnableLock.run(RunnableLock.java:35)
	at org.eclipse.swt.widgets.Synchronizer.runAsyncMessages(Synchronizer.java:135)
	at org.eclipse.swt.widgets.Display.runAsyncMessages(Display.java:3794)
	at org.eclipse.swt.widgets.Display.readAndDispatch(Display.java:3433)
	at org.eclipse.e4.ui.internal.workbench.swt.PartRenderingEngine$4.run(PartRenderingEngine.java:1127)
	at org.eclipse.core.databinding.observable.Realm.runWithDefault(Realm.java:337)
	at org.eclipse.e4.ui.internal.workbench.swt.PartRenderingEngine.run(PartRenderingEngine.java:1018)
	at org.eclipse.e4.ui.internal.workbench.E4Workbench.createAndRunUI(E4Workbench.java:156)
	at org.eclipse.ui.internal.Workbench$5.run(Workbench.java:654)
	at org.eclipse.core.databinding.observable.Realm.runWithDefault(Realm.java:337)
	at org.eclipse.ui.internal.Workbench.createAndRunWorkbench(Workbench.java:598)
	at org.eclipse.ui.PlatformUI.createAndRunWorkbench(PlatformUI.java:150)
	at org.eclipse.ui.internal.ide.application.IDEApplication.start(IDEApplication.java:139)
	at org.eclipse.tycho.surefire.osgibooter.UITestApplication.runApplication(UITestApplication.java:31)
	at org.eclipse.tycho.surefire.osgibooter.AbstractUITestApplication.run(AbstractUITestApplication.java:120)
	at org.eclipse.tycho.surefire.osgibooter.UITestApplication.start(UITestApplication.java:37)
	at org.eclipse.equinox.internal.app.EclipseAppHandle.run(EclipseAppHandle.java:196)
	at org.eclipse.core.runtime.internal.adaptor.EclipseAppLauncher.runApplication(EclipseAppLauncher.java:134)
	at org.eclipse.core.runtime.internal.adaptor.EclipseAppLauncher.start(EclipseAppLauncher.java:104)
	at org.eclipse.core.runtime.adaptor.EclipseStarter.run(EclipseStarter.java:380)
	at org.eclipse.core.runtime.adaptor.EclipseStarter.run(EclipseStarter.java:235)
	at sun.reflect.NativeMethodAccessorImpl.invoke0(Native Method)
	at sun.reflect.NativeMethodAccessorImpl.invoke(NativeMethodAccessorImpl.java:57)
	at sun.reflect.DelegatingMethodAccessorImpl.invoke(DelegatingMethodAccessorImpl.java:43)
	at java.lang.reflect.Method.invoke(Method.java:606)
	at org.eclipse.equinox.launcher.Main.invokeFramework(Main.java:669)
	at org.eclipse.equinox.launcher.Main.basicRun(Main.java:608)
	at org.eclipse.equinox.launcher.Main.run(Main.java:1515)
	at org.eclipse.equinox.launcher.Main.main(Main.java:1488)

testChangeFont(org.eclipse.tracecompass.tmf.ui.swtbot.tests.viewers.events.FontEventEditorTest)  Time elapsed: 9.658 sec
testReorder(org.eclipse.tracecompass.tmf.ui.swtbot.tests.viewers.events.MovableColumnEventsEditorTest)  Time elapsed: 12.201 sec
testSDView(org.eclipse.tracecompass.tmf.ui.swtbot.tests.viewers.events.SDViewTest)  Time elapsed: 5.795 sec
testOffsetting(org.eclipse.tracecompass.tmf.ui.swtbot.tests.viewers.events.TestTraceOffsetting)  Time elapsed: 11.217 sec
testOverlappingTimechartMove(org.eclipse.tracecompass.tmf.ui.swtbot.tests.viewers.events.TmfAlignTimeAxisTest)  Time elapsed: 5.342 sec
testNotOverlappingCallstackMove(org.eclipse.tracecompass.tmf.ui.swtbot.tests.viewers.events.TmfAlignTimeAxisTest)  Time elapsed: 5.237 sec
testMoveHistogramCallstackFollows(org.eclipse.tracecompass.tmf.ui.swtbot.tests.viewers.events.TmfAlignTimeAxisTest)  Time elapsed: 5.317 sec
testOverlappingHistogramMove(org.eclipse.tracecompass.tmf.ui.swtbot.tests.viewers.events.TmfAlignTimeAxisTest)  Time elapsed: 5.242 sec
testNotOverlappingHistogramMove(org.eclipse.tracecompass.tmf.ui.swtbot.tests.viewers.events.TmfAlignTimeAxisTest)  Time elapsed: 5.214 sec
testMoveCallstackHistogramFollows(org.eclipse.tracecompass.tmf.ui.swtbot.tests.viewers.events.TmfAlignTimeAxisTest)  Time elapsed: 5.246 sec
testGzipImport(org.eclipse.tracecompass.tmf.ui.swtbot.tests.wizards.StandardImportGzipTraceTest)  Time elapsed: 6.365 sec
test(org.eclipse.tracecompass.tmf.ctf.ui.swtbot.tests.ImportAndReadSmokeTest)  Time elapsed: 12.836 sec
testImportFromDirectory(org.eclipse.tracecompass.tmf.ctf.ui.swtbot.tests.StandardImportAndReadSmokeTest)  Time elapsed: 7.272 sec
testExtractArchivesFromArchive(org.eclipse.tracecompass.tmf.ctf.ui.swtbot.tests.StandardImportAndReadSmokeTest)  Time elapsed: 17.268 sec
testImportFromDirectoryLinksPreserveFolder(org.eclipse.tracecompass.tmf.ctf.ui.swtbot.tests.StandardImportAndReadSmokeTest)  Time elapsed: 7.965 sec
testExtractArchivesFromArchivePreserveFolder(org.eclipse.tracecompass.tmf.ctf.ui.swtbot.tests.StandardImportAndReadSmokeTest)  Time elapsed: 17.912 sec
testExtractArchivesFromDirectory(org.eclipse.tracecompass.tmf.ctf.ui.swtbot.tests.StandardImportAndReadSmokeTest)  Time elapsed: 12.893 sec
testImportFromArchive(org.eclipse.tracecompass.tmf.ctf.ui.swtbot.tests.StandardImportAndReadSmokeTest)  Time elapsed: 12.868 sec
testExtractArchivesFromDirectoryLinksPreserveStruture(org.eclipse.tracecompass.tmf.ctf.ui.swtbot.tests.StandardImportAndReadSmokeTest)  Time elapsed: 13.298 sec
testEmptyDirectory(org.eclipse.tracecompass.tmf.ctf.ui.swtbot.tests.StandardImportAndReadSmokeTest)  Time elapsed: 5.897 sec
testEmptyArchive(org.eclipse.tracecompass.tmf.ctf.ui.swtbot.tests.StandardImportAndReadSmokeTest)  Time elapsed: 10.036 sec
testNestedEmptyArchive(org.eclipse.tracecompass.tmf.ctf.ui.swtbot.tests.StandardImportAndReadSmokeTest)  Time elapsed: 12.519 sec
testImportFromArchiveOverwrite(org.eclipse.tracecompass.tmf.ctf.ui.swtbot.tests.StandardImportAndReadSmokeTest)  Time elapsed: 15.446 sec
testDirectoryWithEmptyArchive(org.eclipse.tracecompass.tmf.ctf.ui.swtbot.tests.StandardImportAndReadSmokeTest)  Time elapsed: 9.346 sec
testImportFromDirectoryPreserveFolder(org.eclipse.tracecompass.tmf.ctf.ui.swtbot.tests.StandardImportAndReadSmokeTest)  Time elapsed: 7.334 sec
testImportFromDirectoryLinks(org.eclipse.tracecompass.tmf.ctf.ui.swtbot.tests.StandardImportAndReadSmokeTest)  Time elapsed: 7.137 sec
testImportFromDirectoryOverwrite(org.eclipse.tracecompass.tmf.ctf.ui.swtbot.tests.StandardImportAndReadSmokeTest)  Time elapsed: 15.621 sec
testExtractArchivesFromDirectoryLinks(org.eclipse.tracecompass.tmf.ctf.ui.swtbot.tests.StandardImportAndReadSmokeTest)  Time elapsed: 13.632 sec
testImportFromArchivePreserveFolder(org.eclipse.tracecompass.tmf.ctf.ui.swtbot.tests.StandardImportAndReadSmokeTest)  Time elapsed: 7.611 sec
testOpen[0: ../../ctf/org.eclipse.tracecompass.ctf.core.tests/traces/ctf-testsuite/tests/1.8/regression/metadata/fail/struct-align-negative](org.eclipse.tracecompass.tmf.ctf.ui.swtbot.tests.TestInvalidCtfTrace)  Time elapsed: 5.109 sec
testOpen[1: ../../ctf/org.eclipse.tracecompass.ctf.core.tests/traces/ctf-testsuite/tests/1.8/regression/metadata/fail/array-size-identifier](org.eclipse.tracecompass.tmf.ctf.ui.swtbot.tests.TestInvalidCtfTrace)  Time elapsed: 5.209 sec
testOpen[2: ../../ctf/org.eclipse.tracecompass.ctf.core.tests/traces/ctf-testsuite/tests/1.8/regression/metadata/fail/struct-align-huge](org.eclipse.tracecompass.tmf.ctf.ui.swtbot.tests.TestInvalidCtfTrace)  Time elapsed: 4.878 sec
testOpen[3: ../../ctf/org.eclipse.tracecompass.ctf.core.tests/traces/ctf-testsuite/tests/1.8/regression/metadata/fail/integer-signed-as-string](org.eclipse.tracecompass.tmf.ctf.ui.swtbot.tests.TestInvalidCtfTrace)  Time elapsed: 4.96 sec
testOpen[4: ../../ctf/org.eclipse.tracecompass.ctf.core.tests/traces/ctf-testsuite/tests/1.8/regression/metadata/fail/array-size-keyword](org.eclipse.tracecompass.tmf.ctf.ui.swtbot.tests.TestInvalidCtfTrace)  Time elapsed: 5.211 sec
testOpen[5: ../../ctf/org.eclipse.tracecompass.ctf.core.tests/traces/ctf-testsuite/tests/1.8/regression/metadata/fail/integer-range](org.eclipse.tracecompass.tmf.ctf.ui.swtbot.tests.TestInvalidCtfTrace)  Time elapsed: 4.808 sec
testOpen[6: ../../ctf/org.eclipse.tracecompass.ctf.core.tests/traces/ctf-testsuite/tests/1.8/regression/metadata/fail/integer-signed-invalid](org.eclipse.tracecompass.tmf.ctf.ui.swtbot.tests.TestInvalidCtfTrace)  Time elapsed: 4.925 sec
testOpen[7: ../../ctf/org.eclipse.tracecompass.ctf.core.tests/traces/ctf-testsuite/tests/1.8/regression/metadata/fail/struct-align-string](org.eclipse.tracecompass.tmf.ctf.ui.swtbot.tests.TestInvalidCtfTrace)  Time elapsed: 4.712 sec
testOpen[8: ../../ctf/org.eclipse.tracecompass.ctf.core.tests/traces/ctf-testsuite/tests/1.8/regression/metadata/fail/array-size-type-field](org.eclipse.tracecompass.tmf.ctf.ui.swtbot.tests.TestInvalidCtfTrace)  Time elapsed: 4.917 sec
testOpen[9: ../../ctf/org.eclipse.tracecompass.ctf.core.tests/traces/ctf-testsuite/tests/1.8/regression/metadata/fail/struct-duplicate-struct-name](org.eclipse.tracecompass.tmf.ctf.ui.swtbot.tests.TestInvalidCtfTrace)  Time elapsed: 5.044 sec
testOpen[10: ../../ctf/org.eclipse.tracecompass.ctf.core.tests/traces/ctf-testsuite/tests/1.8/regression/metadata/fail/integer-encoding-invalid](org.eclipse.tracecompass.tmf.ctf.ui.swtbot.tests.TestInvalidCtfTrace)  Time elapsed: 5.234 sec
testOpen[11: ../../ctf/org.eclipse.tracecompass.ctf.core.tests/traces/ctf-testsuite/tests/1.8/regression/metadata/fail/integer-size-as-string](org.eclipse.tracecompass.tmf.ctf.ui.swtbot.tests.TestInvalidCtfTrace)  Time elapsed: 5.121 sec
testOpen[12: ../../ctf/org.eclipse.tracecompass.ctf.core.tests/traces/ctf-testsuite/tests/1.8/regression/metadata/fail/array-size-type](org.eclipse.tracecompass.tmf.ctf.ui.swtbot.tests.TestInvalidCtfTrace)  Time elapsed: 5.059 sec
testOpen[13: ../../ctf/org.eclipse.tracecompass.ctf.core.tests/traces/ctf-testsuite/tests/1.8/regression/metadata/fail/array-size-not-present](org.eclipse.tracecompass.tmf.ctf.ui.swtbot.tests.TestInvalidCtfTrace)  Time elapsed: 4.996 sec
testOpen[14: ../../ctf/org.eclipse.tracecompass.ctf.core.tests/traces/ctf-testsuite/tests/1.8/regression/metadata/fail/struct-duplicate-field-name](org.eclipse.tracecompass.tmf.ctf.ui.swtbot.tests.TestInvalidCtfTrace)  Time elapsed: 5.416 sec
testOpen[15: ../../ctf/org.eclipse.tracecompass.ctf.core.tests/traces/ctf-testsuite/tests/1.8/regression/metadata/fail/array-size-string](org.eclipse.tracecompass.tmf.ctf.ui.swtbot.tests.TestInvalidCtfTrace)  Time elapsed: 5.21 sec
testOpen[16: ../../ctf/org.eclipse.tracecompass.ctf.core.tests/traces/ctf-testsuite/tests/1.8/regression/metadata/fail/integer-size-missing](org.eclipse.tracecompass.tmf.ctf.ui.swtbot.tests.TestInvalidCtfTrace)  Time elapsed: 4.989 sec
testOpen[17: ../../ctf/org.eclipse.tracecompass.ctf.core.tests/traces/ctf-testsuite/tests/1.8/regression/metadata/fail/integer-negative-bit-size](org.eclipse.tracecompass.tmf.ctf.ui.swtbot.tests.TestInvalidCtfTrace)  Time elapsed: 5.12 sec
testOpen[18: ../../ctf/org.eclipse.tracecompass.ctf.core.tests/traces/ctf-testsuite/tests/1.8/regression/metadata/fail/struct-align-enum](org.eclipse.tracecompass.tmf.ctf.ui.swtbot.tests.TestInvalidCtfTrace)  Time elapsed: 4.678 sec
testOpen[19: ../../ctf/org.eclipse.tracecompass.ctf.core.tests/traces/ctf-testsuite/tests/1.8/regression/metadata/fail/integer-encoding-as-string](org.eclipse.tracecompass.tmf.ctf.ui.swtbot.tests.TestInvalidCtfTrace)  Time elapsed: 4.941 sec
testOpen[20: ../../ctf/org.eclipse.tracecompass.ctf.core.tests/traces/ctf-testsuite/tests/1.8/regression/metadata/fail/struct-align-zero](org.eclipse.tracecompass.tmf.ctf.ui.swtbot.tests.TestInvalidCtfTrace)  Time elapsed: 5.004 sec
testOpen[21: ../../ctf/org.eclipse.tracecompass.ctf.core.tests/traces/ctf-testsuite/tests/1.8/regression/metadata/fail/array-redefinition](org.eclipse.tracecompass.tmf.ctf.ui.swtbot.tests.TestInvalidCtfTrace)  Time elapsed: 5.042 sec
testOpen[22: ../../ctf/org.eclipse.tracecompass.ctf.core.tests/traces/ctf-testsuite/tests/1.8/regression/metadata/fail/array-size-negative](org.eclipse.tracecompass.tmf.ctf.ui.swtbot.tests.TestInvalidCtfTrace)  Time elapsed: 5.005 sec
testOpen[23: ../../ctf/org.eclipse.tracecompass.ctf.core.tests/traces/ctf-testsuite/tests/1.8/regression/metadata/fail/struct-field-name-keyword](org.eclipse.tracecompass.tmf.ctf.ui.swtbot.tests.TestInvalidCtfTrace)  Time elapsed: 5.14 sec
test(org.eclipse.tracecompass.tmf.pcap.ui.swtbot.tests.ImportAndReadPcapTest)  Time elapsed: 27.649 sec
testPerspectiveComplete(org.eclipse.tracecompass.tmf.pcap.ui.swtbot.tests.NetworkPerspectiveChecker)  Time elapsed: 0.001 sec
testPerspectiveForViews(org.eclipse.tracecompass.tmf.pcap.ui.swtbot.tests.NetworkPerspectiveChecker)  Time elapsed: 0.101 sec
org.eclipse.tracecompass.tmf.remote.ui.swtbot.tests.fetch.FetchRemoteTracesTest(junit.framework.TestSuite)  Time elapsed: 0.101 sec  <<< ERROR!
java.lang.NoClassDefFoundError: Could not initialize class org.eclipse.tracecompass.tmf.remote.ui.swtbot.tests.fetch.FetchRemoteTracesTest
	at sun.reflect.GeneratedMethodAccessor261.invoke(Unknown Source)
	at sun.reflect.DelegatingMethodAccessorImpl.invoke(DelegatingMethodAccessorImpl.java:43)
	at java.lang.reflect.Method.invoke(Method.java:606)
	at org.junit.runners.model.FrameworkMethod$1.runReflectiveCall(FrameworkMethod.java:50)
	at org.junit.internal.runners.model.ReflectiveCallable.run(ReflectiveCallable.java:12)
	at org.junit.runners.model.FrameworkMethod.invokeExplosively(FrameworkMethod.java:47)
	at org.junit.internal.runners.statements.RunBefores.evaluate(RunBefores.java:24)
	at org.junit.runners.ParentRunner.run(ParentRunner.java:363)
	at org.eclipse.swtbot.swt.finder.junit.SWTBotJunit4ClassRunner.run(SWTBotJunit4ClassRunner.java:54)
	at org.junit.runners.Suite.runChild(Suite.java:128)
	at org.junit.runners.Suite.runChild(Suite.java:27)
	at org.junit.runners.ParentRunner$3.run(ParentRunner.java:290)
	at org.junit.runners.ParentRunner$1.schedule(ParentRunner.java:71)
	at org.junit.runners.ParentRunner.runChildren(ParentRunner.java:288)
	at org.junit.runners.ParentRunner.access$000(ParentRunner.java:58)
	at org.junit.runners.ParentRunner$2.evaluate(ParentRunner.java:268)
	at org.junit.runners.ParentRunner.run(ParentRunner.java:363)
	at org.junit.runners.Suite.runChild(Suite.java:128)
	at org.junit.runners.Suite.runChild(Suite.java:27)
	at org.junit.runners.ParentRunner$3.run(ParentRunner.java:290)
	at org.junit.runners.ParentRunner$1.schedule(ParentRunner.java:71)
	at org.junit.runners.ParentRunner.runChildren(ParentRunner.java:288)
	at org.junit.runners.ParentRunner.access$000(ParentRunner.java:58)
	at org.junit.runners.ParentRunner$2.evaluate(ParentRunner.java:268)
	at org.junit.runners.ParentRunner.run(ParentRunner.java:363)
	at junit.framework.JUnit4TestAdapter.run(JUnit4TestAdapter.java:38)
	at junit.framework.TestSuite.runTest(TestSuite.java:252)
	at junit.framework.TestSuite.run(TestSuite.java:247)

testPerspectiveComplete(org.eclipse.tracecompass.lttng2.kernel.ui.swtbot.tests.KernelPerspectiveChecker)  Time elapsed: 0.647 sec
testPerspectiveForViews(org.eclipse.tracecompass.lttng2.kernel.ui.swtbot.tests.KernelPerspectiveChecker)  Time elapsed: 0.034 sec
test(org.eclipse.tracecompass.lttng2.kernel.ui.swtbot.tests.ImportAndReadKernelSmokeTest)  Time elapsed: 14.691 sec
testToolBarFollowCPUForwardBackward(org.eclipse.tracecompass.lttng2.kernel.ui.swtbot.tests.ControlFlowViewTest)  Time elapsed: 20.337 sec
testKeyboardLeftRight(org.eclipse.tracecompass.lttng2.kernel.ui.swtbot.tests.ControlFlowViewTest)  Time elapsed: 15.532 sec
testToolBarSelectNextPreviousEvent(org.eclipse.tracecompass.lttng2.kernel.ui.swtbot.tests.ControlFlowViewTest)  Time elapsed: 16.764 sec
testOpenAndCloseConcurrency(org.eclipse.tracecompass.lttng2.kernel.ui.swtbot.tests.OpenTraceStressTest)  Time elapsed: 48.991 sec
testNew(org.eclipse.tracecompass.tmf.ui.swtbot.tests.parsers.custom.TestCustomTxtWizard)  Time elapsed: 9.672 sec
testEdit(org.eclipse.tracecompass.tmf.ui.swtbot.tests.parsers.custom.TestCustomTxtWizard)  Time elapsed: 9.703 sec
testNew(org.eclipse.tracecompass.tmf.ui.swtbot.tests.parsers.custom.TestCustomXmlWizard)  Time elapsed: 9.178 sec
testPerspectiveComplete(org.eclipse.tracecompass.tmf.ui.swtbot.tests.perspectives.TracingPerspectiveChecker)  Time elapsed: 0.001 sec  <<< FAILURE!
java.lang.AssertionError: view org.eclipse.linuxtools.tmf.ui.tmfUml2SDSyncView is present
	at org.junit.Assert.fail(Assert.java:88)
	at org.junit.Assert.assertTrue(Assert.java:41)
	at org.eclipse.tracecompass.tmf.ui.swtbot.tests.shared.AbstractPerspectiveChecker.testPerspectiveComplete(AbstractPerspectiveChecker.java:118)
	at sun.reflect.GeneratedMethodAccessor156.invoke(Unknown Source)
	at sun.reflect.DelegatingMethodAccessorImpl.invoke(DelegatingMethodAccessorImpl.java:43)
	at java.lang.reflect.Method.invoke(Method.java:606)
	at org.junit.runners.model.FrameworkMethod$1.runReflectiveCall(FrameworkMethod.java:50)
	at org.junit.internal.runners.model.ReflectiveCallable.run(ReflectiveCallable.java:12)
	at org.junit.runners.model.FrameworkMethod.invokeExplosively(FrameworkMethod.java:47)
	at org.junit.internal.runners.statements.InvokeMethod.evaluate(InvokeMethod.java:17)
	at org.junit.internal.runners.statements.RunBefores.evaluate(RunBefores.java:26)
	at org.junit.runners.ParentRunner.runLeaf(ParentRunner.java:325)
	at org.junit.runners.BlockJUnit4ClassRunner.runChild(BlockJUnit4ClassRunner.java:78)
	at org.junit.runners.BlockJUnit4ClassRunner.runChild(BlockJUnit4ClassRunner.java:57)
	at org.junit.runners.ParentRunner$3.run(ParentRunner.java:290)
	at org.junit.runners.ParentRunner$1.schedule(ParentRunner.java:71)
	at org.junit.runners.ParentRunner.runChildren(ParentRunner.java:288)
	at org.junit.runners.ParentRunner.access$000(ParentRunner.java:58)
	at org.junit.runners.ParentRunner$2.evaluate(ParentRunner.java:268)
	at org.junit.internal.runners.statements.RunBefores.evaluate(RunBefores.java:26)
	at org.junit.internal.runners.statements.RunAfters.evaluate(RunAfters.java:27)
	at org.junit.runners.ParentRunner.run(ParentRunner.java:363)
	at org.eclipse.swtbot.swt.finder.junit.SWTBotJunit4ClassRunner.run(SWTBotJunit4ClassRunner.java:54)
	at org.junit.runners.Suite.runChild(Suite.java:128)
	at org.junit.runners.Suite.runChild(Suite.java:27)
	at org.junit.runners.ParentRunner$3.run(ParentRunner.java:290)
	at org.junit.runners.ParentRunner$1.schedule(ParentRunner.java:71)
	at org.junit.runners.ParentRunner.runChildren(ParentRunner.java:288)
	at org.junit.runners.ParentRunner.access$000(ParentRunner.java:58)
	at org.junit.runners.ParentRunner$2.evaluate(ParentRunner.java:268)
	at org.junit.runners.ParentRunner.run(ParentRunner.java:363)
	at org.junit.runners.Suite.runChild(Suite.java:128)
	at org.junit.runners.Suite.runChild(Suite.java:27)
	at org.junit.runners.ParentRunner$3.run(ParentRunner.java:290)
	at org.junit.runners.ParentRunner$1.schedule(ParentRunner.java:71)
	at org.junit.runners.ParentRunner.runChildren(ParentRunner.java:288)
	at org.junit.runners.ParentRunner.access$000(ParentRunner.java:58)
	at org.junit.runners.ParentRunner$2.evaluate(ParentRunner.java:268)
	at org.junit.runners.ParentRunner.run(ParentRunner.java:363)
	at junit.framework.JUnit4TestAdapter.run(JUnit4TestAdapter.java:38)
	at junit.framework.TestSuite.runTest(TestSuite.java:252)
	at junit.framework.TestSuite.run(TestSuite.java:247)
	at org.junit.internal.runners.JUnit38ClassRunner.run(JUnit38ClassRunner.java:86)
	at org.apache.maven.surefire.junit4.JUnit4Provider.execute(JUnit4Provider.java:264)
	at org.apache.maven.surefire.junit4.JUnit4Provider.executeTestSet(JUnit4Provider.java:153)
	at org.apache.maven.surefire.junit4.JUnit4Provider.invoke(JUnit4Provider.java:124)
	at sun.reflect.NativeMethodAccessorImpl.invoke0(Native Method)
	at sun.reflect.NativeMethodAccessorImpl.invoke(NativeMethodAccessorImpl.java:57)
	at sun.reflect.DelegatingMethodAccessorImpl.invoke(DelegatingMethodAccessorImpl.java:43)
	at java.lang.reflect.Method.invoke(Method.java:606)
	at org.apache.maven.surefire.util.ReflectionUtils.invokeMethodWithArray2(ReflectionUtils.java:208)
	at org.apache.maven.surefire.booter.ProviderFactory$ProviderProxy.invoke(ProviderFactory.java:156)
	at org.apache.maven.surefire.booter.ProviderFactory.invokeProvider(ProviderFactory.java:82)
	at org.eclipse.tycho.surefire.osgibooter.OsgiSurefireBooter.run(OsgiSurefireBooter.java:91)
	at org.eclipse.tycho.surefire.osgibooter.AbstractUITestApplication.runTests(AbstractUITestApplication.java:44)
	at org.eclipse.e4.ui.internal.workbench.swt.E4Testable$1.run(E4Testable.java:73)
	at java.lang.Thread.run(Thread.java:745)

testPerspectiveForViews(org.eclipse.tracecompass.tmf.ui.swtbot.tests.perspectives.TracingPerspectiveChecker)  Time elapsed: 0.002 sec
test(org.eclipse.tracecompass.tmf.ui.swtbot.tests.viewers.events.CallsiteEventsInTableTest)  Time elapsed: 9.166 sec
test(org.eclipse.tracecompass.tmf.ui.swtbot.tests.viewers.events.CollapseEventsInTableTest)  Time elapsed: 10.545 sec
testYellow(org.eclipse.tracecompass.tmf.ui.swtbot.tests.viewers.events.ColorsViewTest)  Time elapsed: 7.959 sec
testToggleColumns(org.eclipse.tracecompass.tmf.ui.swtbot.tests.viewers.events.ColumnHeaderMenuTest)  Time elapsed: 2.932 sec
testShowAll(org.eclipse.tracecompass.tmf.ui.swtbot.tests.viewers.events.ColumnHeaderMenuTest)  Time elapsed: 3.017 sec
testNoCopySearchRow(org.eclipse.tracecompass.tmf.ui.swtbot.tests.viewers.events.CopyToClipboardTest)  Time elapsed: 4.056 sec
testCopySingleSelection(org.eclipse.tracecompass.tmf.ui.swtbot.tests.viewers.events.CopyToClipboardTest)  Time elapsed: 2.889 sec
testCopyMultipleSelection(org.eclipse.tracecompass.tmf.ui.swtbot.tests.viewers.events.CopyToClipboardTest)  Time elapsed: 3.007 sec
testMultiHighlightMessage(org.eclipse.tracecompass.tmf.ui.swtbot.tests.viewers.events.FilterColorEditorTest)  Time elapsed: 10.783 sec
testSwitchToFilter(org.eclipse.tracecompass.tmf.ui.swtbot.tests.viewers.events.FilterColorEditorTest)  Time elapsed: 11.047 sec
testHighlight(org.eclipse.tracecompass.tmf.ui.swtbot.tests.viewers.events.FilterColorEditorTest)  Time elapsed: 9.927 sec
testPreference(org.eclipse.tracecompass.tmf.ui.swtbot.tests.viewers.events.FilterColorEditorTest)  Time elapsed: 7.833 sec
testTimestampFilter(org.eclipse.tracecompass.tmf.ui.swtbot.tests.viewers.events.FilterViewerTest)  Time elapsed: 3.734 sec  <<< ERROR!
org.eclipse.swt.SWTException: Failed to execute runnable (org.eclipse.swtbot.swt.finder.exceptions.WidgetNotFoundException: Could not find menu: TRACETYPE)
	at org.eclipse.swt.SWT.error(SWT.java:4491)
	at org.eclipse.swt.SWT.error(SWT.java:4406)
	at org.eclipse.swt.widgets.Synchronizer.syncExec(Synchronizer.java:208)
	at org.eclipse.ui.internal.UISynchronizer.syncExec(UISynchronizer.java:145)
	at org.eclipse.swt.widgets.Display.syncExec(Display.java:4633)
	at org.eclipse.swtbot.swt.finder.finders.UIThreadRunnable.run(UIThreadRunnable.java:76)
	at org.eclipse.swtbot.swt.finder.finders.UIThreadRunnable.syncExec(UIThreadRunnable.java:142)
	at org.eclipse.swtbot.swt.finder.finders.UIThreadRunnable.syncExec(UIThreadRunnable.java:125)
	at org.eclipse.swtbot.swt.finder.finders.ContextMenuHelper.contextMenu(ContextMenuHelper.java:42)
	at org.eclipse.swtbot.swt.finder.widgets.SWTBotTreeItem.contextMenu(SWTBotTreeItem.java:558)
	at org.eclipse.tracecompass.tmf.ui.swtbot.tests.viewers.events.FilterViewerTest.testTimestampFilter(FilterViewerTest.java:166)
Caused by: org.eclipse.swtbot.swt.finder.exceptions.WidgetNotFoundException: Could not find menu: TRACETYPE
	at org.eclipse.swtbot.swt.finder.finders.ContextMenuHelper$1.run(ContextMenuHelper.java:63)
	at org.eclipse.swtbot.swt.finder.finders.ContextMenuHelper$1.run(ContextMenuHelper.java:1)
	at org.eclipse.swtbot.swt.finder.finders.UIThreadRunnable$2.doRun(UIThreadRunnable.java:140)
	at org.eclipse.swtbot.swt.finder.finders.UIThreadRunnable$1.run(UIThreadRunnable.java:89)
	at org.eclipse.swt.widgets.RunnableLock.run(RunnableLock.java:35)
	at org.eclipse.swt.widgets.Synchronizer.runAsyncMessages(Synchronizer.java:135)
	at org.eclipse.swt.widgets.Display.runAsyncMessages(Display.java:3794)
	at org.eclipse.swt.widgets.Display.readAndDispatch(Display.java:3433)
	at org.eclipse.e4.ui.internal.workbench.swt.PartRenderingEngine$4.run(PartRenderingEngine.java:1127)
	at org.eclipse.core.databinding.observable.Realm.runWithDefault(Realm.java:337)
	at org.eclipse.e4.ui.internal.workbench.swt.PartRenderingEngine.run(PartRenderingEngine.java:1018)
	at org.eclipse.e4.ui.internal.workbench.E4Workbench.createAndRunUI(E4Workbench.java:156)
	at org.eclipse.ui.internal.Workbench$5.run(Workbench.java:654)
	at org.eclipse.core.databinding.observable.Realm.runWithDefault(Realm.java:337)
	at org.eclipse.ui.internal.Workbench.createAndRunWorkbench(Workbench.java:598)
	at org.eclipse.ui.PlatformUI.createAndRunWorkbench(PlatformUI.java:150)
	at org.eclipse.ui.internal.ide.application.IDEApplication.start(IDEApplication.java:139)
	at org.eclipse.tycho.surefire.osgibooter.UITestApplication.runApplication(UITestApplication.java:31)
	at org.eclipse.tycho.surefire.osgibooter.AbstractUITestApplication.run(AbstractUITestApplication.java:120)
	at org.eclipse.tycho.surefire.osgibooter.UITestApplication.start(UITestApplication.java:37)
	at org.eclipse.equinox.internal.app.EclipseAppHandle.run(EclipseAppHandle.java:196)
	at org.eclipse.core.runtime.internal.adaptor.EclipseAppLauncher.runApplication(EclipseAppLauncher.java:134)
	at org.eclipse.core.runtime.internal.adaptor.EclipseAppLauncher.start(EclipseAppLauncher.java:104)
	at org.eclipse.core.runtime.adaptor.EclipseStarter.run(EclipseStarter.java:380)
	at org.eclipse.core.runtime.adaptor.EclipseStarter.run(EclipseStarter.java:235)
	at sun.reflect.NativeMethodAccessorImpl.invoke0(Native Method)
	at sun.reflect.NativeMethodAccessorImpl.invoke(NativeMethodAccessorImpl.java:57)
	at sun.reflect.DelegatingMethodAccessorImpl.invoke(DelegatingMethodAccessorImpl.java:43)
	at java.lang.reflect.Method.invoke(Method.java:606)
	at org.eclipse.equinox.launcher.Main.invokeFramework(Main.java:669)
	at org.eclipse.equinox.launcher.Main.basicRun(Main.java:608)
	at org.eclipse.equinox.launcher.Main.run(Main.java:1515)
	at org.eclipse.equinox.launcher.Main.main(Main.java:1488)

testField01(org.eclipse.tracecompass.tmf.ui.swtbot.tests.viewers.events.FilterViewerTest)  Time elapsed: 3.087 sec  <<< ERROR!
org.eclipse.swt.SWTException: Failed to execute runnable (org.eclipse.swtbot.swt.finder.exceptions.WidgetNotFoundException: Could not find menu: TRACETYPE)
	at org.eclipse.swt.SWT.error(SWT.java:4491)
	at org.eclipse.swt.SWT.error(SWT.java:4406)
	at org.eclipse.swt.widgets.Synchronizer.syncExec(Synchronizer.java:208)
	at org.eclipse.ui.internal.UISynchronizer.syncExec(UISynchronizer.java:145)
	at org.eclipse.swt.widgets.Display.syncExec(Display.java:4633)
	at org.eclipse.swtbot.swt.finder.finders.UIThreadRunnable.run(UIThreadRunnable.java:76)
	at org.eclipse.swtbot.swt.finder.finders.UIThreadRunnable.syncExec(UIThreadRunnable.java:142)
	at org.eclipse.swtbot.swt.finder.finders.UIThreadRunnable.syncExec(UIThreadRunnable.java:125)
	at org.eclipse.swtbot.swt.finder.finders.ContextMenuHelper.contextMenu(ContextMenuHelper.java:42)
	at org.eclipse.swtbot.swt.finder.widgets.SWTBotTreeItem.contextMenu(SWTBotTreeItem.java:558)
	at org.eclipse.tracecompass.tmf.ui.swtbot.tests.viewers.events.FilterViewerTest.testField01(FilterViewerTest.java:283)
Caused by: org.eclipse.swtbot.swt.finder.exceptions.WidgetNotFoundException: Could not find menu: TRACETYPE
	at org.eclipse.swtbot.swt.finder.finders.ContextMenuHelper$1.run(ContextMenuHelper.java:63)
	at org.eclipse.swtbot.swt.finder.finders.ContextMenuHelper$1.run(ContextMenuHelper.java:1)
	at org.eclipse.swtbot.swt.finder.finders.UIThreadRunnable$2.doRun(UIThreadRunnable.java:140)
	at org.eclipse.swtbot.swt.finder.finders.UIThreadRunnable$1.run(UIThreadRunnable.java:89)
	at org.eclipse.swt.widgets.RunnableLock.run(RunnableLock.java:35)
	at org.eclipse.swt.widgets.Synchronizer.runAsyncMessages(Synchronizer.java:135)
	at org.eclipse.swt.widgets.Display.runAsyncMessages(Display.java:3794)
	at org.eclipse.swt.widgets.Display.readAndDispatch(Display.java:3433)
	at org.eclipse.e4.ui.internal.workbench.swt.PartRenderingEngine$4.run(PartRenderingEngine.java:1127)
	at org.eclipse.core.databinding.observable.Realm.runWithDefault(Realm.java:337)
	at org.eclipse.e4.ui.internal.workbench.swt.PartRenderingEngine.run(PartRenderingEngine.java:1018)
	at org.eclipse.e4.ui.internal.workbench.E4Workbench.createAndRunUI(E4Workbench.java:156)
	at org.eclipse.ui.internal.Workbench$5.run(Workbench.java:654)
	at org.eclipse.core.databinding.observable.Realm.runWithDefault(Realm.java:337)
	at org.eclipse.ui.internal.Workbench.createAndRunWorkbench(Workbench.java:598)
	at org.eclipse.ui.PlatformUI.createAndRunWorkbench(PlatformUI.java:150)
	at org.eclipse.ui.internal.ide.application.IDEApplication.start(IDEApplication.java:139)
	at org.eclipse.tycho.surefire.osgibooter.UITestApplication.runApplication(UITestApplication.java:31)
	at org.eclipse.tycho.surefire.osgibooter.AbstractUITestApplication.run(AbstractUITestApplication.java:120)
	at org.eclipse.tycho.surefire.osgibooter.UITestApplication.start(UITestApplication.java:37)
	at org.eclipse.equinox.internal.app.EclipseAppHandle.run(EclipseAppHandle.java:196)
	at org.eclipse.core.runtime.internal.adaptor.EclipseAppLauncher.runApplication(EclipseAppLauncher.java:134)
	at org.eclipse.core.runtime.internal.adaptor.EclipseAppLauncher.start(EclipseAppLauncher.java:104)
	at org.eclipse.core.runtime.adaptor.EclipseStarter.run(EclipseStarter.java:380)
	at org.eclipse.core.runtime.adaptor.EclipseStarter.run(EclipseStarter.java:235)
	at sun.reflect.NativeMethodAccessorImpl.invoke0(Native Method)
	at sun.reflect.NativeMethodAccessorImpl.invoke(NativeMethodAccessorImpl.java:57)
	at sun.reflect.DelegatingMethodAccessorImpl.invoke(DelegatingMethodAccessorImpl.java:43)
	at java.lang.reflect.Method.invoke(Method.java:606)
	at org.eclipse.equinox.launcher.Main.invokeFramework(Main.java:669)
	at org.eclipse.equinox.launcher.Main.basicRun(Main.java:608)
	at org.eclipse.equinox.launcher.Main.run(Main.java:1515)
	at org.eclipse.equinox.launcher.Main.main(Main.java:1488)

testTimestampEqualsOr(org.eclipse.tracecompass.tmf.ui.swtbot.tests.viewers.events.FilterViewerTest)  Time elapsed: 3.184 sec  <<< ERROR!
org.eclipse.swt.SWTException: Failed to execute runnable (org.eclipse.swtbot.swt.finder.exceptions.WidgetNotFoundException: Could not find menu: TRACETYPE)
	at org.eclipse.swt.SWT.error(SWT.java:4491)
	at org.eclipse.swt.SWT.error(SWT.java:4406)
	at org.eclipse.swt.widgets.Synchronizer.syncExec(Synchronizer.java:208)
	at org.eclipse.ui.internal.UISynchronizer.syncExec(UISynchronizer.java:145)
	at org.eclipse.swt.widgets.Display.syncExec(Display.java:4633)
	at org.eclipse.swtbot.swt.finder.finders.UIThreadRunnable.run(UIThreadRunnable.java:76)
	at org.eclipse.swtbot.swt.finder.finders.UIThreadRunnable.syncExec(UIThreadRunnable.java:142)
	at org.eclipse.swtbot.swt.finder.finders.UIThreadRunnable.syncExec(UIThreadRunnable.java:125)
	at org.eclipse.swtbot.swt.finder.finders.ContextMenuHelper.contextMenu(ContextMenuHelper.java:42)
	at org.eclipse.swtbot.swt.finder.widgets.SWTBotTreeItem.contextMenu(SWTBotTreeItem.java:558)
	at org.eclipse.tracecompass.tmf.ui.swtbot.tests.viewers.events.FilterViewerTest.testTimestampEqualsOr(FilterViewerTest.java:216)
Caused by: org.eclipse.swtbot.swt.finder.exceptions.WidgetNotFoundException: Could not find menu: TRACETYPE
	at org.eclipse.swtbot.swt.finder.finders.ContextMenuHelper$1.run(ContextMenuHelper.java:63)
	at org.eclipse.swtbot.swt.finder.finders.ContextMenuHelper$1.run(ContextMenuHelper.java:1)
	at org.eclipse.swtbot.swt.finder.finders.UIThreadRunnable$2.doRun(UIThreadRunnable.java:140)
	at org.eclipse.swtbot.swt.finder.finders.UIThreadRunnable$1.run(UIThreadRunnable.java:89)
	at org.eclipse.swt.widgets.RunnableLock.run(RunnableLock.java:35)
	at org.eclipse.swt.widgets.Synchronizer.runAsyncMessages(Synchronizer.java:135)
	at org.eclipse.swt.widgets.Display.runAsyncMessages(Display.java:3794)
	at org.eclipse.swt.widgets.Display.readAndDispatch(Display.java:3433)
	at org.eclipse.e4.ui.internal.workbench.swt.PartRenderingEngine$4.run(PartRenderingEngine.java:1127)
	at org.eclipse.core.databinding.observable.Realm.runWithDefault(Realm.java:337)
	at org.eclipse.e4.ui.internal.workbench.swt.PartRenderingEngine.run(PartRenderingEngine.java:1018)
	at org.eclipse.e4.ui.internal.workbench.E4Workbench.createAndRunUI(E4Workbench.java:156)
	at org.eclipse.ui.internal.Workbench$5.run(Workbench.java:654)
	at org.eclipse.core.databinding.observable.Realm.runWithDefault(Realm.java:337)
	at org.eclipse.ui.internal.Workbench.createAndRunWorkbench(Workbench.java:598)
	at org.eclipse.ui.PlatformUI.createAndRunWorkbench(PlatformUI.java:150)
	at org.eclipse.ui.internal.ide.application.IDEApplication.start(IDEApplication.java:139)
	at org.eclipse.tycho.surefire.osgibooter.UITestApplication.runApplication(UITestApplication.java:31)
	at org.eclipse.tycho.surefire.osgibooter.AbstractUITestApplication.run(AbstractUITestApplication.java:120)
	at org.eclipse.tycho.surefire.osgibooter.UITestApplication.start(UITestApplication.java:37)
	at org.eclipse.equinox.internal.app.EclipseAppHandle.run(EclipseAppHandle.java:196)
	at org.eclipse.core.runtime.internal.adaptor.EclipseAppLauncher.runApplication(EclipseAppLauncher.java:134)
	at org.eclipse.core.runtime.internal.adaptor.EclipseAppLauncher.start(EclipseAppLauncher.java:104)
	at org.eclipse.core.runtime.adaptor.EclipseStarter.run(EclipseStarter.java:380)
	at org.eclipse.core.runtime.adaptor.EclipseStarter.run(EclipseStarter.java:235)
	at sun.reflect.NativeMethodAccessorImpl.invoke0(Native Method)
	at sun.reflect.NativeMethodAccessorImpl.invoke(NativeMethodAccessorImpl.java:57)
	at sun.reflect.DelegatingMethodAccessorImpl.invoke(DelegatingMethodAccessorImpl.java:43)
	at java.lang.reflect.Method.invoke(Method.java:606)
	at org.eclipse.equinox.launcher.Main.invokeFramework(Main.java:669)
	at org.eclipse.equinox.launcher.Main.basicRun(Main.java:608)
	at org.eclipse.equinox.launcher.Main.run(Main.java:1515)
	at org.eclipse.equinox.launcher.Main.main(Main.java:1488)

testChangeFont(org.eclipse.tracecompass.tmf.ui.swtbot.tests.viewers.events.FontEventEditorTest)  Time elapsed: 10.696 sec
testReorder(org.eclipse.tracecompass.tmf.ui.swtbot.tests.viewers.events.MovableColumnEventsEditorTest)  Time elapsed: 12.214 sec
testSDView(org.eclipse.tracecompass.tmf.ui.swtbot.tests.viewers.events.SDViewTest)  Time elapsed: 5.983 sec
testOffsetting(org.eclipse.tracecompass.tmf.ui.swtbot.tests.viewers.events.TestTraceOffsetting)  Time elapsed: 11.115 sec
testOverlappingTimechartMove(org.eclipse.tracecompass.tmf.ui.swtbot.tests.viewers.events.TmfAlignTimeAxisTest)  Time elapsed: 5.29 sec
testNotOverlappingCallstackMove(org.eclipse.tracecompass.tmf.ui.swtbot.tests.viewers.events.TmfAlignTimeAxisTest)  Time elapsed: 5.354 sec
testMoveHistogramCallstackFollows(org.eclipse.tracecompass.tmf.ui.swtbot.tests.viewers.events.TmfAlignTimeAxisTest)  Time elapsed: 5.253 sec
testOverlappingHistogramMove(org.eclipse.tracecompass.tmf.ui.swtbot.tests.viewers.events.TmfAlignTimeAxisTest)  Time elapsed: 5.236 sec
testNotOverlappingHistogramMove(org.eclipse.tracecompass.tmf.ui.swtbot.tests.viewers.events.TmfAlignTimeAxisTest)  Time elapsed: 5.238 sec
testMoveCallstackHistogramFollows(org.eclipse.tracecompass.tmf.ui.swtbot.tests.viewers.events.TmfAlignTimeAxisTest)  Time elapsed: 5.276 sec
testGzipImport(org.eclipse.tracecompass.tmf.ui.swtbot.tests.wizards.StandardImportGzipTraceTest)  Time elapsed: 6.551 sec
test(org.eclipse.tracecompass.tmf.ctf.ui.swtbot.tests.ImportAndReadSmokeTest)  Time elapsed: 11.902 sec
testImportFromDirectory(org.eclipse.tracecompass.tmf.ctf.ui.swtbot.tests.StandardImportAndReadSmokeTest)  Time elapsed: 7.867 sec
testExtractArchivesFromArchive(org.eclipse.tracecompass.tmf.ctf.ui.swtbot.tests.StandardImportAndReadSmokeTest)  Time elapsed: 17.636 sec
testImportFromDirectoryLinksPreserveFolder(org.eclipse.tracecompass.tmf.ctf.ui.swtbot.tests.StandardImportAndReadSmokeTest)  Time elapsed: 7.66 sec
testExtractArchivesFromArchivePreserveFolder(org.eclipse.tracecompass.tmf.ctf.ui.swtbot.tests.StandardImportAndReadSmokeTest)  Time elapsed: 18.012 sec
testExtractArchivesFromDirectory(org.eclipse.tracecompass.tmf.ctf.ui.swtbot.tests.StandardImportAndReadSmokeTest)  Time elapsed: 13.321 sec
testImportFromArchive(org.eclipse.tracecompass.tmf.ctf.ui.swtbot.tests.StandardImportAndReadSmokeTest)  Time elapsed: 13.007 sec
testExtractArchivesFromDirectoryLinksPreserveStruture(org.eclipse.tracecompass.tmf.ctf.ui.swtbot.tests.StandardImportAndReadSmokeTest)  Time elapsed: 13.592 sec
testEmptyDirectory(org.eclipse.tracecompass.tmf.ctf.ui.swtbot.tests.StandardImportAndReadSmokeTest)  Time elapsed: 5.968 sec
testEmptyArchive(org.eclipse.tracecompass.tmf.ctf.ui.swtbot.tests.StandardImportAndReadSmokeTest)  Time elapsed: 8.545 sec
testNestedEmptyArchive(org.eclipse.tracecompass.tmf.ctf.ui.swtbot.tests.StandardImportAndReadSmokeTest)  Time elapsed: 11.282 sec
testImportFromArchiveOverwrite(org.eclipse.tracecompass.tmf.ctf.ui.swtbot.tests.StandardImportAndReadSmokeTest)  Time elapsed: 17.014 sec
testDirectoryWithEmptyArchive(org.eclipse.tracecompass.tmf.ctf.ui.swtbot.tests.StandardImportAndReadSmokeTest)  Time elapsed: 9.303 sec
testImportFromDirectoryPreserveFolder(org.eclipse.tracecompass.tmf.ctf.ui.swtbot.tests.StandardImportAndReadSmokeTest)  Time elapsed: 7.331 sec
testImportFromDirectoryLinks(org.eclipse.tracecompass.tmf.ctf.ui.swtbot.tests.StandardImportAndReadSmokeTest)  Time elapsed: 6.498 sec
testImportFromDirectoryOverwrite(org.eclipse.tracecompass.tmf.ctf.ui.swtbot.tests.StandardImportAndReadSmokeTest)  Time elapsed: 14.086 sec
testExtractArchivesFromDirectoryLinks(org.eclipse.tracecompass.tmf.ctf.ui.swtbot.tests.StandardImportAndReadSmokeTest)  Time elapsed: 11.838 sec
testImportFromArchivePreserveFolder(org.eclipse.tracecompass.tmf.ctf.ui.swtbot.tests.StandardImportAndReadSmokeTest)  Time elapsed: 7.237 sec
testOpen[0: ../../ctf/org.eclipse.tracecompass.ctf.core.tests/traces/ctf-testsuite/tests/1.8/regression/metadata/fail/struct-align-negative](org.eclipse.tracecompass.tmf.ctf.ui.swtbot.tests.TestInvalidCtfTrace)  Time elapsed: 4.897 sec
testOpen[1: ../../ctf/org.eclipse.tracecompass.ctf.core.tests/traces/ctf-testsuite/tests/1.8/regression/metadata/fail/array-size-identifier](org.eclipse.tracecompass.tmf.ctf.ui.swtbot.tests.TestInvalidCtfTrace)  Time elapsed: 4.884 sec
testOpen[2: ../../ctf/org.eclipse.tracecompass.ctf.core.tests/traces/ctf-testsuite/tests/1.8/regression/metadata/fail/struct-align-huge](org.eclipse.tracecompass.tmf.ctf.ui.swtbot.tests.TestInvalidCtfTrace)  Time elapsed: 4.656 sec
testOpen[3: ../../ctf/org.eclipse.tracecompass.ctf.core.tests/traces/ctf-testsuite/tests/1.8/regression/metadata/fail/integer-signed-as-string](org.eclipse.tracecompass.tmf.ctf.ui.swtbot.tests.TestInvalidCtfTrace)  Time elapsed: 4.413 sec
testOpen[4: ../../ctf/org.eclipse.tracecompass.ctf.core.tests/traces/ctf-testsuite/tests/1.8/regression/metadata/fail/array-size-keyword](org.eclipse.tracecompass.tmf.ctf.ui.swtbot.tests.TestInvalidCtfTrace)  Time elapsed: 5.033 sec
testOpen[5: ../../ctf/org.eclipse.tracecompass.ctf.core.tests/traces/ctf-testsuite/tests/1.8/regression/metadata/fail/integer-range](org.eclipse.tracecompass.tmf.ctf.ui.swtbot.tests.TestInvalidCtfTrace)  Time elapsed: 4.981 sec
testOpen[6: ../../ctf/org.eclipse.tracecompass.ctf.core.tests/traces/ctf-testsuite/tests/1.8/regression/metadata/fail/integer-signed-invalid](org.eclipse.tracecompass.tmf.ctf.ui.swtbot.tests.TestInvalidCtfTrace)  Time elapsed: 5.347 sec
testOpen[7: ../../ctf/org.eclipse.tracecompass.ctf.core.tests/traces/ctf-testsuite/tests/1.8/regression/metadata/fail/struct-align-string](org.eclipse.tracecompass.tmf.ctf.ui.swtbot.tests.TestInvalidCtfTrace)  Time elapsed: 4.718 sec
testOpen[8: ../../ctf/org.eclipse.tracecompass.ctf.core.tests/traces/ctf-testsuite/tests/1.8/regression/metadata/fail/array-size-type-field](org.eclipse.tracecompass.tmf.ctf.ui.swtbot.tests.TestInvalidCtfTrace)  Time elapsed: 4.813 sec
testOpen[9: ../../ctf/org.eclipse.tracecompass.ctf.core.tests/traces/ctf-testsuite/tests/1.8/regression/metadata/fail/struct-duplicate-struct-name](org.eclipse.tracecompass.tmf.ctf.ui.swtbot.tests.TestInvalidCtfTrace)  Time elapsed: 5.108 sec
testOpen[10: ../../ctf/org.eclipse.tracecompass.ctf.core.tests/traces/ctf-testsuite/tests/1.8/regression/metadata/fail/integer-encoding-invalid](org.eclipse.tracecompass.tmf.ctf.ui.swtbot.tests.TestInvalidCtfTrace)  Time elapsed: 5.154 sec
testOpen[11: ../../ctf/org.eclipse.tracecompass.ctf.core.tests/traces/ctf-testsuite/tests/1.8/regression/metadata/fail/integer-size-as-string](org.eclipse.tracecompass.tmf.ctf.ui.swtbot.tests.TestInvalidCtfTrace)  Time elapsed: 4.905 sec
testOpen[12: ../../ctf/org.eclipse.tracecompass.ctf.core.tests/traces/ctf-testsuite/tests/1.8/regression/metadata/fail/array-size-type](org.eclipse.tracecompass.tmf.ctf.ui.swtbot.tests.TestInvalidCtfTrace)  Time elapsed: 5.504 sec
testOpen[13: ../../ctf/org.eclipse.tracecompass.ctf.core.tests/traces/ctf-testsuite/tests/1.8/regression/metadata/fail/array-size-not-present](org.eclipse.tracecompass.tmf.ctf.ui.swtbot.tests.TestInvalidCtfTrace)  Time elapsed: 5.416 sec
testOpen[14: ../../ctf/org.eclipse.tracecompass.ctf.core.tests/traces/ctf-testsuite/tests/1.8/regression/metadata/fail/struct-duplicate-field-name](org.eclipse.tracecompass.tmf.ctf.ui.swtbot.tests.TestInvalidCtfTrace)  Time elapsed: 5.371 sec
testOpen[15: ../../ctf/org.eclipse.tracecompass.ctf.core.tests/traces/ctf-testsuite/tests/1.8/regression/metadata/fail/array-size-string](org.eclipse.tracecompass.tmf.ctf.ui.swtbot.tests.TestInvalidCtfTrace)  Time elapsed: 4.965 sec
testOpen[16: ../../ctf/org.eclipse.tracecompass.ctf.core.tests/traces/ctf-testsuite/tests/1.8/regression/metadata/fail/integer-size-missing](org.eclipse.tracecompass.tmf.ctf.ui.swtbot.tests.TestInvalidCtfTrace)  Time elapsed: 4.944 sec
testOpen[17: ../../ctf/org.eclipse.tracecompass.ctf.core.tests/traces/ctf-testsuite/tests/1.8/regression/metadata/fail/integer-negative-bit-size](org.eclipse.tracecompass.tmf.ctf.ui.swtbot.tests.TestInvalidCtfTrace)  Time elapsed: 4.68 sec
testOpen[18: ../../ctf/org.eclipse.tracecompass.ctf.core.tests/traces/ctf-testsuite/tests/1.8/regression/metadata/fail/struct-align-enum](org.eclipse.tracecompass.tmf.ctf.ui.swtbot.tests.TestInvalidCtfTrace)  Time elapsed: 5.255 sec
testOpen[19: ../../ctf/org.eclipse.tracecompass.ctf.core.tests/traces/ctf-testsuite/tests/1.8/regression/metadata/fail/integer-encoding-as-string](org.eclipse.tracecompass.tmf.ctf.ui.swtbot.tests.TestInvalidCtfTrace)  Time elapsed: 5.283 sec
testOpen[20: ../../ctf/org.eclipse.tracecompass.ctf.core.tests/traces/ctf-testsuite/tests/1.8/regression/metadata/fail/struct-align-zero](org.eclipse.tracecompass.tmf.ctf.ui.swtbot.tests.TestInvalidCtfTrace)  Time elapsed: 5.192 sec
testOpen[21: ../../ctf/org.eclipse.tracecompass.ctf.core.tests/traces/ctf-testsuite/tests/1.8/regression/metadata/fail/array-redefinition](org.eclipse.tracecompass.tmf.ctf.ui.swtbot.tests.TestInvalidCtfTrace)  Time elapsed: 4.704 sec
testOpen[22: ../../ctf/org.eclipse.tracecompass.ctf.core.tests/traces/ctf-testsuite/tests/1.8/regression/metadata/fail/array-size-negative](org.eclipse.tracecompass.tmf.ctf.ui.swtbot.tests.TestInvalidCtfTrace)  Time elapsed: 5.199 sec
testOpen[23: ../../ctf/org.eclipse.tracecompass.ctf.core.tests/traces/ctf-testsuite/tests/1.8/regression/metadata/fail/struct-field-name-keyword](org.eclipse.tracecompass.tmf.ctf.ui.swtbot.tests.TestInvalidCtfTrace)  Time elapsed: 4.658 sec
test(org.eclipse.tracecompass.tmf.pcap.ui.swtbot.tests.ImportAndReadPcapTest)  Time elapsed: 27.767 sec
testPerspectiveComplete(org.eclipse.tracecompass.tmf.pcap.ui.swtbot.tests.NetworkPerspectiveChecker)  Time elapsed: 0 sec
testPerspectiveForViews(org.eclipse.tracecompass.tmf.pcap.ui.swtbot.tests.NetworkPerspectiveChecker)  Time elapsed: 0.011 sec
org.eclipse.tracecompass.tmf.remote.ui.swtbot.tests.fetch.FetchRemoteTracesTest(junit.framework.TestSuite)  Time elapsed: 0.011 sec  <<< ERROR!
java.lang.NoClassDefFoundError: Could not initialize class org.eclipse.tracecompass.tmf.remote.ui.swtbot.tests.fetch.FetchRemoteTracesTest
	at sun.reflect.GeneratedMethodAccessor261.invoke(Unknown Source)
	at sun.reflect.DelegatingMethodAccessorImpl.invoke(DelegatingMethodAccessorImpl.java:43)
	at java.lang.reflect.Method.invoke(Method.java:606)
	at org.junit.runners.model.FrameworkMethod$1.runReflectiveCall(FrameworkMethod.java:50)
	at org.junit.internal.runners.model.ReflectiveCallable.run(ReflectiveCallable.java:12)
	at org.junit.runners.model.FrameworkMethod.invokeExplosively(FrameworkMethod.java:47)
	at org.junit.internal.runners.statements.RunBefores.evaluate(RunBefores.java:24)
	at org.junit.runners.ParentRunner.run(ParentRunner.java:363)
	at org.eclipse.swtbot.swt.finder.junit.SWTBotJunit4ClassRunner.run(SWTBotJunit4ClassRunner.java:54)
	at org.junit.runners.Suite.runChild(Suite.java:128)
	at org.junit.runners.Suite.runChild(Suite.java:27)
	at org.junit.runners.ParentRunner$3.run(ParentRunner.java:290)
	at org.junit.runners.ParentRunner$1.schedule(ParentRunner.java:71)
	at org.junit.runners.ParentRunner.runChildren(ParentRunner.java:288)
	at org.junit.runners.ParentRunner.access$000(ParentRunner.java:58)
	at org.junit.runners.ParentRunner$2.evaluate(ParentRunner.java:268)
	at org.junit.runners.ParentRunner.run(ParentRunner.java:363)
	at org.junit.runners.Suite.runChild(Suite.java:128)
	at org.junit.runners.Suite.runChild(Suite.java:27)
	at org.junit.runners.ParentRunner$3.run(ParentRunner.java:290)
	at org.junit.runners.ParentRunner$1.schedule(ParentRunner.java:71)
	at org.junit.runners.ParentRunner.runChildren(ParentRunner.java:288)
	at org.junit.runners.ParentRunner.access$000(ParentRunner.java:58)
	at org.junit.runners.ParentRunner$2.evaluate(ParentRunner.java:268)
	at org.junit.runners.ParentRunner.run(ParentRunner.java:363)
	at junit.framework.JUnit4TestAdapter.run(JUnit4TestAdapter.java:38)
	at junit.framework.TestSuite.runTest(TestSuite.java:252)
	at junit.framework.TestSuite.run(TestSuite.java:247)

testPerspectiveComplete(org.eclipse.tracecompass.lttng2.kernel.ui.swtbot.tests.KernelPerspectiveChecker)  Time elapsed: 0.749 sec
testPerspectiveForViews(org.eclipse.tracecompass.lttng2.kernel.ui.swtbot.tests.KernelPerspectiveChecker)  Time elapsed: 0.002 sec
test(org.eclipse.tracecompass.lttng2.kernel.ui.swtbot.tests.ImportAndReadKernelSmokeTest)  Time elapsed: 22.893 sec
testToolBarFollowCPUForwardBackward(org.eclipse.tracecompass.lttng2.kernel.ui.swtbot.tests.ControlFlowViewTest)  Time elapsed: 25.856 sec
testKeyboardLeftRight(org.eclipse.tracecompass.lttng2.kernel.ui.swtbot.tests.ControlFlowViewTest)  Time elapsed: 15.776 sec
testToolBarSelectNextPreviousEvent(org.eclipse.tracecompass.lttng2.kernel.ui.swtbot.tests.ControlFlowViewTest)  Time elapsed: 18.058 sec
testOpenAndCloseConcurrency(org.eclipse.tracecompass.lttng2.kernel.ui.swtbot.tests.OpenTraceStressTest)  Time elapsed: 48.805 sec

Results :

Failed tests: 
  TracingPerspectiveChecker>AbstractPerspectiveChecker.testPerspectiveComplete:118 view org.eclipse.linuxtools.tmf.ui.tmfUml2SDSyncView is present
  TracingPerspectiveChecker>AbstractPerspectiveChecker.testPerspectiveComplete:118 view org.eclipse.linuxtools.tmf.ui.tmfUml2SDSyncView is present
  TracingPerspectiveChecker>AbstractPerspectiveChecker.testPerspectiveComplete:118 view org.eclipse.linuxtools.tmf.ui.tmfUml2SDSyncView is present
  TracingPerspectiveChecker>AbstractPerspectiveChecker.testPerspectiveComplete:118 view org.eclipse.linuxtools.tmf.ui.tmfUml2SDSyncView is present
  TracingPerspectiveChecker>AbstractPerspectiveChecker.testPerspectiveComplete:118 view org.eclipse.linuxtools.tmf.ui.tmfUml2SDSyncView is present
  TracingPerspectiveChecker>AbstractPerspectiveChecker.testPerspectiveComplete:118 view org.eclipse.linuxtools.tmf.ui.tmfUml2SDSyncView is present
  TracingPerspectiveChecker>AbstractPerspectiveChecker.testPerspectiveComplete:118 view org.eclipse.linuxtools.tmf.ui.tmfUml2SDSyncView is present
  TracingPerspectiveChecker>AbstractPerspectiveChecker.testPerspectiveComplete:118 view org.eclipse.linuxtools.tmf.ui.tmfUml2SDSyncView is present
  TracingPerspectiveChecker>AbstractPerspectiveChecker.testPerspectiveComplete:118 view org.eclipse.linuxtools.tmf.ui.tmfUml2SDSyncView is present
  TracingPerspectiveChecker>AbstractPerspectiveChecker.testPerspectiveComplete:118 view org.eclipse.linuxtools.tmf.ui.tmfUml2SDSyncView is present
  TracingPerspectiveChecker>AbstractPerspectiveChecker.testPerspectiveComplete:118 view org.eclipse.linuxtools.tmf.ui.tmfUml2SDSyncView is present
  TracingPerspectiveChecker>AbstractPerspectiveChecker.testPerspectiveComplete:118 view org.eclipse.linuxtools.tmf.ui.tmfUml2SDSyncView is present
  TracingPerspectiveChecker>AbstractPerspectiveChecker.testPerspectiveComplete:118 view org.eclipse.linuxtools.tmf.ui.tmfUml2SDSyncView is present
  TracingPerspectiveChecker>AbstractPerspectiveChecker.testPerspectiveComplete:118 view org.eclipse.linuxtools.tmf.ui.tmfUml2SDSyncView is present
  TracingPerspectiveChecker>AbstractPerspectiveChecker.testPerspectiveComplete:118 view org.eclipse.linuxtools.tmf.ui.tmfUml2SDSyncView is present
  TracingPerspectiveChecker>AbstractPerspectiveChecker.testPerspectiveComplete:118 view org.eclipse.linuxtools.tmf.ui.tmfUml2SDSyncView is present
  TracingPerspectiveChecker>AbstractPerspectiveChecker.testPerspectiveComplete:118 view org.eclipse.linuxtools.tmf.ui.tmfUml2SDSyncView is present
  TracingPerspectiveChecker>AbstractPerspectiveChecker.testPerspectiveComplete:118 view org.eclipse.linuxtools.tmf.ui.tmfUml2SDSyncView is present
  TracingPerspectiveChecker>AbstractPerspectiveChecker.testPerspectiveComplete:118 view org.eclipse.linuxtools.tmf.ui.tmfUml2SDSyncView is present

Tests in error: 
  TestSuite.org.eclipse.tracecompass.tmf.remote.ui.swtbot.tests.fetch.FetchRemoteTracesTest » ExceptionInInitializer
  FilterViewerTest.testTimestampFilter:166 » SWT Failed to execute runnable (org...
  FilterViewerTest.testField01:283 » SWT Failed to execute runnable (org.eclipse...
  FilterViewerTest.testTimestampEqualsOr:216 » SWT Failed to execute runnable (o...
  TestSuite.org.eclipse.tracecompass.tmf.remote.ui.swtbot.tests.fetch.FetchRemoteTracesTest » NoClassDefFound
  FilterViewerTest.testTimestampFilter:166 » SWT Failed to execute runnable (org...
  FilterViewerTest.testField01:283 » SWT Failed to execute runnable (org.eclipse...
  FilterViewerTest.testTimestampEqualsOr:216 » SWT Failed to execute runnable (o...
  TestSuite.org.eclipse.tracecompass.tmf.remote.ui.swtbot.tests.fetch.FetchRemoteTracesTest » NoClassDefFound
  FilterViewerTest.testTimestampFilter:166 » SWT Failed to execute runnable (org...
  FilterViewerTest.testField01:283 » SWT Failed to execute runnable (org.eclipse...
  FilterViewerTest.testTimestampEqualsOr:216 » SWT Failed to execute runnable (o...
  TestSuite.org.eclipse.tracecompass.tmf.remote.ui.swtbot.tests.fetch.FetchRemoteTracesTest » NoClassDefFound
  CopyToClipboardTest.testNoCopySearchRow »  Unexpected exception, expected<org....
  FilterViewerTest.testTimestampFilter:166 » SWT Failed to execute runnable (org...
  FilterViewerTest.testField01:283 » SWT Failed to execute runnable (org.eclipse...
  FilterViewerTest.testTimestampEqualsOr:216 » SWT Failed to execute runnable (o...
  TestSuite.org.eclipse.tracecompass.tmf.remote.ui.swtbot.tests.fetch.FetchRemoteTracesTest » NoClassDefFound
  FilterViewerTest.testTimestampFilter:166 » SWT Failed to execute runnable (org...
  FilterViewerTest.testField01:283 » SWT Failed to execute runnable (org.eclipse...
  FilterViewerTest.testTimestampEqualsOr:216 » SWT Failed to execute runnable (o...
  TestSuite.org.eclipse.tracecompass.tmf.remote.ui.swtbot.tests.fetch.FetchRemoteTracesTest » NoClassDefFound
  FilterViewerTest.testTimestampFilter:166 » SWT Failed to execute runnable (org...
  FilterViewerTest.testField01:283 » SWT Failed to execute runnable (org.eclipse...
  FilterViewerTest.testTimestampEqualsOr:216 » SWT Failed to execute runnable (o...
  TestSuite.org.eclipse.tracecompass.tmf.remote.ui.swtbot.tests.fetch.FetchRemoteTracesTest » NoClassDefFound
  FilterViewerTest.testTimestampFilter:166 » SWT Failed to execute runnable (org...
  FilterViewerTest.testField01:283 » SWT Failed to execute runnable (org.eclipse...
  FilterViewerTest.testTimestampEqualsOr:216 » SWT Failed to execute runnable (o...
  TestSuite.org.eclipse.tracecompass.tmf.remote.ui.swtbot.tests.fetch.FetchRemoteTracesTest » NoClassDefFound
  FilterViewerTest.testTimestampFilter:166 » SWT Failed to execute runnable (org...
  FilterViewerTest.testField01:283 » SWT Failed to execute runnable (org.eclipse...
  FilterViewerTest.testTimestampEqualsOr:216 » SWT Failed to execute runnable (o...
  TestSuite.org.eclipse.tracecompass.tmf.remote.ui.swtbot.tests.fetch.FetchRemoteTracesTest » NoClassDefFound
  FilterViewerTest.testTimestampFilter:166 » SWT Failed to execute runnable (org...
  FilterViewerTest.testField01:283 » SWT Failed to execute runnable (org.eclipse...
  FilterViewerTest.testTimestampEqualsOr:216 » SWT Failed to execute runnable (o...
  TestSuite.org.eclipse.tracecompass.tmf.remote.ui.swtbot.tests.fetch.FetchRemoteTracesTest » NoClassDefFound
  FilterViewerTest.testTimestampFilter:166 » SWT Failed to execute runnable (org...
  FilterViewerTest.testField01:283 » SWT Failed to execute runnable (org.eclipse...
  FilterViewerTest.testTimestampEqualsOr:216 » SWT Failed to execute runnable (o...
  TestSuite.org.eclipse.tracecompass.tmf.remote.ui.swtbot.tests.fetch.FetchRemoteTracesTest » NoClassDefFound
  FilterViewerTest.testTimestampFilter:166 » SWT Failed to execute runnable (org...
  FilterViewerTest.testField01:283 » SWT Failed to execute runnable (org.eclipse...
  FilterViewerTest.testTimestampEqualsOr:216 » SWT Failed to execute runnable (o...
  TestSuite.org.eclipse.tracecompass.tmf.remote.ui.swtbot.tests.fetch.FetchRemoteTracesTest » NoClassDefFound
  FilterViewerTest.testTimestampFilter:166 » SWT Failed to execute runnable (org...
  FilterViewerTest.testField01:283 » SWT Failed to execute runnable (org.eclipse...
  FilterViewerTest.testTimestampEqualsOr:216 » SWT Failed to execute runnable (o...
  TestSuite.org.eclipse.tracecompass.tmf.remote.ui.swtbot.tests.fetch.FetchRemoteTracesTest » NoClassDefFound
  FilterViewerTest.testTimestampFilter:166 » SWT Failed to execute runnable (org...
  FilterViewerTest.testField01:283 » SWT Failed to execute runnable (org.eclipse...
  FilterViewerTest.testTimestampEqualsOr:216 » SWT Failed to execute runnable (o...
  TestSuite.org.eclipse.tracecompass.tmf.remote.ui.swtbot.tests.fetch.FetchRemoteTracesTest » NoClassDefFound
  FilterViewerTest.testTimestampFilter:166 » SWT Failed to execute runnable (org...
  FilterViewerTest.testField01:283 » SWT Failed to execute runnable (org.eclipse...
  FilterViewerTest.testTimestampEqualsOr:216 » SWT Failed to execute runnable (o...
  TestSuite.org.eclipse.tracecompass.tmf.remote.ui.swtbot.tests.fetch.FetchRemoteTracesTest » NoClassDefFound
  FilterViewerTest.testTimestampFilter:166 » SWT Failed to execute runnable (org...
  FilterViewerTest.testField01:283 » SWT Failed to execute runnable (org.eclipse...
  FilterViewerTest.testTimestampEqualsOr:216 » SWT Failed to execute runnable (o...
  TestSuite.org.eclipse.tracecompass.tmf.remote.ui.swtbot.tests.fetch.FetchRemoteTracesTest » NoClassDefFound
  FilterViewerTest.testTimestampFilter:166 » SWT Failed to execute runnable (org...
  FilterViewerTest.testField01:283 » SWT Failed to execute runnable (org.eclipse...
  FilterViewerTest.testTimestampEqualsOr:216 » SWT Failed to execute runnable (o...
  TestSuite.org.eclipse.tracecompass.tmf.remote.ui.swtbot.tests.fetch.FetchRemoteTracesTest » NoClassDefFound
  FilterViewerTest.testTimestampFilter:166 » SWT Failed to execute runnable (org...
  FilterViewerTest.testField01:283 » SWT Failed to execute runnable (org.eclipse...
  FilterViewerTest.testTimestampEqualsOr:216 » SWT Failed to execute runnable (o...
  TestSuite.org.eclipse.tracecompass.tmf.remote.ui.swtbot.tests.fetch.FetchRemoteTracesTest » NoClassDefFound
  FilterViewerTest.testTimestampFilter:166 » SWT Failed to execute runnable (org...
  FilterViewerTest.testField01:283 » SWT Failed to execute runnable (org.eclipse...
  FilterViewerTest.testTimestampEqualsOr:216 » SWT Failed to execute runnable (o...
  TestSuite.org.eclipse.tracecompass.tmf.remote.ui.swtbot.tests.fetch.FetchRemoteTracesTest » NoClassDefFound
  FilterViewerTest.testTimestampFilter:166 » SWT Failed to execute runnable (org...
  FilterViewerTest.testField01:283 » SWT Failed to execute runnable (org.eclipse...
  FilterViewerTest.testTimestampEqualsOr:216 » SWT Failed to execute runnable (o...
  TestSuite.org.eclipse.tracecompass.tmf.remote.ui.swtbot.tests.fetch.FetchRemoteTracesTest » NoClassDefFound

Tests run: 1680, Failures: 19, Errors: 78, Skipped: 0

[INFO] ------------------------------------------------------------------------
[INFO] Reactor Summary:
[INFO] 
[INFO] Trace Compass Parent .............................. SUCCESS [1.464s]
[INFO] race Compass Common Utilities Parent .............. SUCCESS [0.055s]
[INFO] Trace Compass Common Utilities Core Plug-in ....... SUCCESS [2.465s]
[INFO] Trace Compass State System Parent ................. SUCCESS [0.062s]
[INFO] Trace Compass State System Core Plug-in ........... SUCCESS [1.504s]
[INFO] Trace Compass TMF Parent .......................... SUCCESS [0.058s]
[INFO] Trace Compass TMF Core Plug-in .................... SUCCESS [4.017s]
[INFO] Trace Compass Tracetype-agnostic Analyses Parent .. SUCCESS [0.059s]
[INFO] Trace Compass Linux Kernel Analysis Core Plug-in .. SUCCESS [0.609s]
[INFO] Trace Compass CTF Support Parent .................. SUCCESS [0.053s]
[INFO] Trace Compass CTF Parser Plug-in .................. SUCCESS [3.137s]
[INFO] Trace Compass CTF Core Plug-in .................... SUCCESS [0.912s]
[INFO] CTF support for TMF Core Plug-in .................. SUCCESS [0.456s]
[INFO] Trace Compass CTF Core Tests Plug-in .............. SUCCESS [36.605s]
[INFO] Trace Compass TMF Core Tests Plug-in .............. SUCCESS [3:45.324s]
[INFO] CTF Support for TMF Core Tests Plug-in ............ SUCCESS [2:54.223s]
[INFO] Trace Compass Linux Kernel Analysis Core Tests Plug-in  SUCCESS [40.472s]
[INFO] Trace Compass TMF UI Plug-in ...................... SUCCESS [7.398s]
[INFO] Trace Compass Linux Kernel Analysis UI Plug-in .... SUCCESS [0.632s]
[INFO] Trace Compass BTF Support Parent .................. SUCCESS [0.058s]
[INFO] Best Trace Format Plug-in ......................... SUCCESS [0.415s]
[INFO] Trace Compass Documentation ....................... SUCCESS [0.057s]
[INFO] Trace Compass Developer Guide ..................... SUCCESS [8.286s]
[INFO] Trace Compass TMF Xml Analysis Core Plug-in ....... SUCCESS [0.866s]
[INFO] Trace Compass TMF Xml Analysis Ui Plug-in ......... SUCCESS [1.216s]
[INFO] Trace Compass TMF (Tracing and Monitoring Framework) Feature  SUCCESS [0.335s]
[INFO] Best Trace Format UI Plug-in ...................... SUCCESS [0.405s]
[INFO] Trace Compass BTF (Best Trace Format) Feature ..... SUCCESS [0.180s]
[INFO] Best Trace Format Tests Plug-in ................... SUCCESS [9.974s]
[INFO] Trace Compass Common Utilities Core Tests Plug-in . SUCCESS [8.998s]
[INFO] Trace Compass CTF (Common Trace Format) Feature ... SUCCESS [0.113s]
[INFO] Trace Compass CTF Parser Tests Plug-in ............ SUCCESS [8.479s]
[INFO] CTF support for TMF Feature ....................... SUCCESS [0.152s]
[INFO] Trace Compass TMF UI SWTBot Tests Plug-in ......... SUCCESS [3:06.517s]
[INFO] CTF Support for TMF SWTBot Tests Plug-in .......... SUCCESS [3:25.669s]
[INFO] Trace Compass User Guide .......................... SUCCESS [7.865s]
[INFO] Trace Compass GDB Tracepoint Analysis User Guide .. SUCCESS [5.238s]
[INFO] Trace Compass RCP User Guide ...................... SUCCESS [4.632s]
[INFO] Trace Compass Pcap User Guide ..................... SUCCESS [5.029s]
[INFO] Trace Compass Examples Plug-in .................... SUCCESS [0.404s]
[INFO] Trace Compass GDB Tracepoint Analysis Parent ...... SUCCESS [0.056s]
[INFO] Trace Compass GDB Tracepoint Analysis Core Plug-in  SUCCESS [0.614s]
[INFO] Trace Compass GDB Tracepoint Analysis UI Plug-in .. SUCCESS [0.504s]
[INFO] Trace Compass GDB Tracepoint Analysis Feature ..... SUCCESS [0.173s]
[INFO] Trace Compass GDB Tracepoint Analysis Core Tests Plug-in  SUCCESS [8.094s]
[INFO] Trace Compass GDB Tracepoint Analysis UI Tests Plug-in  SUCCESS [9.070s]
[INFO] Trace Compass LTTng Support Parent ................ SUCCESS [0.053s]
[INFO] Trace Compass LTTng Control Core Plug-in .......... SUCCESS [0.664s]
[INFO] Trace Compass TMF Remote Core Plug-in ............. SUCCESS [0.432s]
[INFO] Trace Compass TMF Remote UI Plug-in ............... SUCCESS [0.722s]
[INFO] Trace Compass LTTng Control UI Plug-in ............ SUCCESS [1.962s]
[INFO] Trace Compass LTTng (Linux Tracing Toolkit) Feature  SUCCESS [0.199s]
[INFO] Trace Compass LTTng Control Core Tests Plug-in .... SUCCESS [9.921s]
[INFO] Trace Compass TMF Remote Core Tests Plug-in ....... SUCCESS [8.353s]
[INFO] Trace Compass LTTng Control UI Tests Plug-in ...... SUCCESS [53.580s]
[INFO] Trace Compass LTTng Kernel Analysis Core Plug-in .. SUCCESS [0.748s]
[INFO] Trace Compass LTTng Kernel Analysis UI Plug-in .... SUCCESS [0.549s]
[INFO] Trace Compass LTTng Kernel Analysis Feature ....... SUCCESS [0.201s]
[INFO] Trace Compass LTTng Kernel Analysis Core Tests Plug-in  SUCCESS [1:05.371s]
[INFO] Trace Compass LTTng Kernel UI SWTBot Tests Plug-in  SUCCESS [1:43.482s]
[INFO] Trace Compass LTTng Userspace Tracer Analysis Core Plug-in  SUCCESS [0.458s]
[INFO] Trace Compass LTTng Userspace Tracer Analysis UI Plug-in  SUCCESS [0.431s]
[INFO] Trace Compass LTTng Userspace Tracer Analysis Feature  SUCCESS [0.156s]
[INFO] Trace Compass LTTng Userspace Tracer Analysis Core Test Plug-in  SUCCESS [33.334s]
[INFO] Trace Compass LTTng Userspace Tracer Analysis UI Tests Plug-in  SUCCESS [15.784s]
[INFO] Trace Compass Pcap Format Support Parent .......... SUCCESS [0.053s]
[INFO] Trace Compass Pcap Parser Core Plug-in ............ SUCCESS [0.555s]
[INFO] Trace Compass Pcap Parser Core Tests Plug-in ...... SUCCESS [14.575s]
[INFO] Pcap support for TMF Core Plug-in ................. SUCCESS [0.768s]
[INFO] Pcap support for TMF UI Plug-in ................... SUCCESS [0.635s]
[INFO] Trace Compass Pcap Analysis Feature ............... SUCCESS [0.400s]
[INFO] Pcap Support for TMF Core Tests Plug-in ........... SUCCESS [11.056s]
[INFO] Pcap Support for TMF SWTBot Tests Plug-in ......... SUCCESS [35.942s]
[INFO] Trace Compass RCP Parent .......................... SUCCESS [0.052s]
[INFO] Trace Compass RCP Branding plug-in ................ SUCCESS [0.278s]
[INFO] Trace Compass RCP Branding Feature ................ SUCCESS [0.128s]
[INFO] Trace Compass RCP UI Plug-in ...................... SUCCESS [0.491s]
[INFO] Trace Compass RCP Feature ......................... SUCCESS [0.201s]
[INFO] Trace Compass RCP Product ......................... SUCCESS [1:25.051s]
[INFO] Trace Compass State System Core Tests Plug-in ..... SUCCESS [8.696s]
[INFO] Trace Compass TMF UI Tests Plug-in ................ SUCCESS [2:43.538s]
[INFO] Trace Compass TMF Xml Analysis Core Tests Plug-in . SUCCESS [21.101s]
[INFO] Trace Compass TMF Xml Analysis UI Tests Plug-in ... SUCCESS [14.124s]
[INFO] Trace Compass TMF Remote UI Tests Plug-in ......... SUCCESS [14.778s]
[INFO] Trace Compass TMF Remote UI SWTBot Tests Plug-in .. SUCCESS [57.748s]
[INFO] Trace Compass Release Engineering Parent .......... SUCCESS [0.051s]
[INFO] Trace Compass All Tests ........................... FAILURE [3:13:57.771s]
[INFO] Trace Compass Testing Feature ..................... SKIPPED
[INFO] Trace Compass TMF Remote Feature .................. SKIPPED
[INFO] Trace Compass Repository .......................... SKIPPED
[INFO] Trace Compass Target Platform ..................... SKIPPED
[INFO] Trace Compass Segment Store DB Core Plug-in ....... SKIPPED
[INFO] Trace Compass Segment Store DB Core Tests Plug-in . SKIPPED
[INFO] ------------------------------------------------------------------------
[INFO] BUILD FAILURE
[INFO] ------------------------------------------------------------------------
[INFO] Total time: 3:43:04.644s
[INFO] Finished at: Wed Jul 15 18:02:04 EDT 2015
[INFO] Final Memory: 243M/9605M
[INFO] ------------------------------------------------------------------------
[INFO] o.h.m.e.h.MavenExecutionResultHandler - Build failed with exception(s)
[INFO] o.h.m.e.h.MavenExecutionResultHandler - [1] org.apache.maven.lifecycle.LifecycleExecutionException: Failed to execute goal org.eclipse.tycho:tycho-surefire-plugin:0.23.0:test (default-test) on project org.eclipse.tracecompass.alltests: There are test failures.

Please refer to /jobs/genie.tracecompass/tracecompass-swtbot-stress-tests/workspace/releng/org.eclipse.tracecompass.alltests/target/surefire-reports for the individual test results.
[DEBUG] Closing connection to remote
[ERROR] Failed to execute goal org.eclipse.tycho:tycho-surefire-plugin:0.23.0:test (default-test) on project org.eclipse.tracecompass.alltests: There are test failures.
[ERROR] 
[ERROR] Please refer to /jobs/genie.tracecompass/tracecompass-swtbot-stress-tests/workspace/releng/org.eclipse.tracecompass.alltests/target/surefire-reports for the individual test results.
[ERROR] -> [Help 1]
[ERROR] 
[ERROR] To see the full stack trace of the errors, re-run Maven with the -e switch.
[ERROR] Re-run Maven using the -X switch to enable full debug logging.
[ERROR] 
[ERROR] For more information about the errors and possible solutions, please read the following articles:
[ERROR] [Help 1] http://cwiki.apache.org/confluence/display/MAVEN/MojoFailureException
[ERROR] 
[ERROR] After correcting the problems, you can resume the build with the command
[ERROR]   mvn <goals> -rf :org.eclipse.tracecompass.alltests
[DEBUG] Waiting for process to finish
[DEBUG] Result: 1
Terminating xvnc.
Recording test results
Finished: FAILURE