FailedConsole Output

Skipping 24,851 KB.. Full Log
erProxy.invoke(ProviderFactory.java:156)
	at org.apache.maven.surefire.booter.ProviderFactory.invokeProvider(ProviderFactory.java:82)
	at org.eclipse.tycho.surefire.osgibooter.OsgiSurefireBooter.run(OsgiSurefireBooter.java:91)
	at org.eclipse.tycho.surefire.osgibooter.AbstractUITestApplication.runTests(AbstractUITestApplication.java:44)
	at org.eclipse.e4.ui.internal.workbench.swt.E4Testable$1.run(E4Testable.java:73)
	at java.lang.Thread.run(Thread.java:745)

testPerspectiveComplete(org.eclipse.tracecompass.lttng2.kernel.ui.swtbot.tests.KernelPerspectiveChecker)  Time elapsed: 0.565 sec
testPerspectiveForViews(org.eclipse.tracecompass.lttng2.kernel.ui.swtbot.tests.KernelPerspectiveChecker)  Time elapsed: 0.001 sec
test(org.eclipse.tracecompass.lttng2.kernel.ui.swtbot.tests.ImportAndReadKernelSmokeTest)  Time elapsed: 17.232 sec
testToolBarFollowCPUForwardBackward(org.eclipse.tracecompass.lttng2.kernel.ui.swtbot.tests.ControlFlowViewTest)  Time elapsed: 18.781 sec
testKeyboardLeftRight(org.eclipse.tracecompass.lttng2.kernel.ui.swtbot.tests.ControlFlowViewTest)  Time elapsed: 18.231 sec
testToolBarSelectNextPreviousEvent(org.eclipse.tracecompass.lttng2.kernel.ui.swtbot.tests.ControlFlowViewTest)  Time elapsed: 16.252 sec
testOpenAndCloseConcurrency(org.eclipse.tracecompass.lttng2.kernel.ui.swtbot.tests.OpenTraceStressTest)  Time elapsed: 55.529 sec
testNew(org.eclipse.tracecompass.tmf.ui.swtbot.tests.parsers.custom.TestCustomTxtWizard)  Time elapsed: 8.188 sec
testEdit(org.eclipse.tracecompass.tmf.ui.swtbot.tests.parsers.custom.TestCustomTxtWizard)  Time elapsed: 7.675 sec
testNew(org.eclipse.tracecompass.tmf.ui.swtbot.tests.parsers.custom.TestCustomXmlWizard)  Time elapsed: 8.073 sec
testPerspectiveComplete(org.eclipse.tracecompass.tmf.ui.swtbot.tests.perspectives.TracingPerspectiveChecker)  Time elapsed: 0 sec  <<< FAILURE!
java.lang.AssertionError: view org.eclipse.swtbot.eclipse.finder.widgets.SWTBotView@5e47992c is present
	at org.junit.Assert.fail(Assert.java:88)
	at org.junit.Assert.assertTrue(Assert.java:41)
	at org.eclipse.tracecompass.tmf.ui.swtbot.tests.shared.AbstractPerspectiveChecker.testPerspectiveComplete(AbstractPerspectiveChecker.java:118)
	at sun.reflect.GeneratedMethodAccessor156.invoke(Unknown Source)
	at sun.reflect.DelegatingMethodAccessorImpl.invoke(DelegatingMethodAccessorImpl.java:43)
	at java.lang.reflect.Method.invoke(Method.java:606)
	at org.junit.runners.model.FrameworkMethod$1.runReflectiveCall(FrameworkMethod.java:50)
	at org.junit.internal.runners.model.ReflectiveCallable.run(ReflectiveCallable.java:12)
	at org.junit.runners.model.FrameworkMethod.invokeExplosively(FrameworkMethod.java:47)
	at org.junit.internal.runners.statements.InvokeMethod.evaluate(InvokeMethod.java:17)
	at org.junit.internal.runners.statements.RunBefores.evaluate(RunBefores.java:26)
	at org.junit.runners.ParentRunner.runLeaf(ParentRunner.java:325)
	at org.junit.runners.BlockJUnit4ClassRunner.runChild(BlockJUnit4ClassRunner.java:78)
	at org.junit.runners.BlockJUnit4ClassRunner.runChild(BlockJUnit4ClassRunner.java:57)
	at org.junit.runners.ParentRunner$3.run(ParentRunner.java:290)
	at org.junit.runners.ParentRunner$1.schedule(ParentRunner.java:71)
	at org.junit.runners.ParentRunner.runChildren(ParentRunner.java:288)
	at org.junit.runners.ParentRunner.access$000(ParentRunner.java:58)
	at org.junit.runners.ParentRunner$2.evaluate(ParentRunner.java:268)
	at org.junit.internal.runners.statements.RunBefores.evaluate(RunBefores.java:26)
	at org.junit.internal.runners.statements.RunAfters.evaluate(RunAfters.java:27)
	at org.junit.runners.ParentRunner.run(ParentRunner.java:363)
	at org.eclipse.swtbot.swt.finder.junit.SWTBotJunit4ClassRunner.run(SWTBotJunit4ClassRunner.java:54)
	at org.junit.runners.Suite.runChild(Suite.java:128)
	at org.junit.runners.Suite.runChild(Suite.java:27)
	at org.junit.runners.ParentRunner$3.run(ParentRunner.java:290)
	at org.junit.runners.ParentRunner$1.schedule(ParentRunner.java:71)
	at org.junit.runners.ParentRunner.runChildren(ParentRunner.java:288)
	at org.junit.runners.ParentRunner.access$000(ParentRunner.java:58)
	at org.junit.runners.ParentRunner$2.evaluate(ParentRunner.java:268)
	at org.junit.runners.ParentRunner.run(ParentRunner.java:363)
	at org.junit.runners.Suite.runChild(Suite.java:128)
	at org.junit.runners.Suite.runChild(Suite.java:27)
	at org.junit.runners.ParentRunner$3.run(ParentRunner.java:290)
	at org.junit.runners.ParentRunner$1.schedule(ParentRunner.java:71)
	at org.junit.runners.ParentRunner.runChildren(ParentRunner.java:288)
	at org.junit.runners.ParentRunner.access$000(ParentRunner.java:58)
	at org.junit.runners.ParentRunner$2.evaluate(ParentRunner.java:268)
	at org.junit.runners.ParentRunner.run(ParentRunner.java:363)
	at org.junit.runners.Suite.runChild(Suite.java:128)
	at org.junit.runners.Suite.runChild(Suite.java:27)
	at org.junit.runners.ParentRunner$3.run(ParentRunner.java:290)
	at org.junit.runners.ParentRunner$1.schedule(ParentRunner.java:71)
	at org.junit.runners.ParentRunner.runChildren(ParentRunner.java:288)
	at org.junit.runners.ParentRunner.access$000(ParentRunner.java:58)
	at org.junit.runners.ParentRunner$2.evaluate(ParentRunner.java:268)
	at org.junit.runners.ParentRunner.run(ParentRunner.java:363)
	at org.apache.maven.surefire.junit4.JUnit4Provider.execute(JUnit4Provider.java:264)
	at org.apache.maven.surefire.junit4.JUnit4Provider.executeTestSet(JUnit4Provider.java:153)
	at org.apache.maven.surefire.junit4.JUnit4Provider.invoke(JUnit4Provider.java:124)
	at sun.reflect.NativeMethodAccessorImpl.invoke0(Native Method)
	at sun.reflect.NativeMethodAccessorImpl.invoke(NativeMethodAccessorImpl.java:57)
	at sun.reflect.DelegatingMethodAccessorImpl.invoke(DelegatingMethodAccessorImpl.java:43)
	at java.lang.reflect.Method.invoke(Method.java:606)
	at org.apache.maven.surefire.util.ReflectionUtils.invokeMethodWithArray2(ReflectionUtils.java:208)
	at org.apache.maven.surefire.booter.ProviderFactory$ProviderProxy.invoke(ProviderFactory.java:156)
	at org.apache.maven.surefire.booter.ProviderFactory.invokeProvider(ProviderFactory.java:82)
	at org.eclipse.tycho.surefire.osgibooter.OsgiSurefireBooter.run(OsgiSurefireBooter.java:91)
	at org.eclipse.tycho.surefire.osgibooter.AbstractUITestApplication.runTests(AbstractUITestApplication.java:44)
	at org.eclipse.e4.ui.internal.workbench.swt.E4Testable$1.run(E4Testable.java:73)
	at java.lang.Thread.run(Thread.java:745)

testPerspectiveForViews(org.eclipse.tracecompass.tmf.ui.swtbot.tests.perspectives.TracingPerspectiveChecker)  Time elapsed: 0.002 sec
test(org.eclipse.tracecompass.tmf.ui.swtbot.tests.viewers.events.CallsiteEventsInTableTest)  Time elapsed: 7.798 sec
test(org.eclipse.tracecompass.tmf.ui.swtbot.tests.viewers.events.CollapseEventsInTableTest)  Time elapsed: 8.667 sec
testYellow(org.eclipse.tracecompass.tmf.ui.swtbot.tests.viewers.events.ColorsViewTest)  Time elapsed: 7.124 sec
testToggleColumns(org.eclipse.tracecompass.tmf.ui.swtbot.tests.viewers.events.ColumnHeaderMenuTest)  Time elapsed: 3.479 sec
testShowAll(org.eclipse.tracecompass.tmf.ui.swtbot.tests.viewers.events.ColumnHeaderMenuTest)  Time elapsed: 3.078 sec
testNoCopySearchRow(org.eclipse.tracecompass.tmf.ui.swtbot.tests.viewers.events.CopyToClipboardTest)  Time elapsed: 4.084 sec
testCopySingleSelection(org.eclipse.tracecompass.tmf.ui.swtbot.tests.viewers.events.CopyToClipboardTest)  Time elapsed: 3.268 sec
testCopyMultipleSelection(org.eclipse.tracecompass.tmf.ui.swtbot.tests.viewers.events.CopyToClipboardTest)  Time elapsed: 3.198 sec
testMultiHighlightMessage(org.eclipse.tracecompass.tmf.ui.swtbot.tests.viewers.events.FilterColorEditorTest)  Time elapsed: 8.267 sec
testSwitchToFilter(org.eclipse.tracecompass.tmf.ui.swtbot.tests.viewers.events.FilterColorEditorTest)  Time elapsed: 8.267 sec
testHighlight(org.eclipse.tracecompass.tmf.ui.swtbot.tests.viewers.events.FilterColorEditorTest)  Time elapsed: 8.021 sec
testPreference(org.eclipse.tracecompass.tmf.ui.swtbot.tests.viewers.events.FilterColorEditorTest)  Time elapsed: 7.094 sec
testTimestampFilter(org.eclipse.tracecompass.tmf.ui.swtbot.tests.viewers.events.FilterViewerTest)  Time elapsed: 3.723 sec  <<< ERROR!
org.eclipse.swt.SWTException: Failed to execute runnable (org.eclipse.swtbot.swt.finder.exceptions.WidgetNotFoundException: Could not find menu: TRACETYPE)
	at org.eclipse.swt.SWT.error(SWT.java:4491)
	at org.eclipse.swt.SWT.error(SWT.java:4406)
	at org.eclipse.swt.widgets.Synchronizer.syncExec(Synchronizer.java:208)
	at org.eclipse.ui.internal.UISynchronizer.syncExec(UISynchronizer.java:145)
	at org.eclipse.swt.widgets.Display.syncExec(Display.java:4633)
	at org.eclipse.swtbot.swt.finder.finders.UIThreadRunnable.run(UIThreadRunnable.java:76)
	at org.eclipse.swtbot.swt.finder.finders.UIThreadRunnable.syncExec(UIThreadRunnable.java:142)
	at org.eclipse.swtbot.swt.finder.finders.UIThreadRunnable.syncExec(UIThreadRunnable.java:125)
	at org.eclipse.swtbot.swt.finder.finders.ContextMenuHelper.contextMenu(ContextMenuHelper.java:42)
	at org.eclipse.swtbot.swt.finder.widgets.SWTBotTreeItem.contextMenu(SWTBotTreeItem.java:558)
	at org.eclipse.tracecompass.tmf.ui.swtbot.tests.viewers.events.FilterViewerTest.testTimestampFilter(FilterViewerTest.java:165)
Caused by: org.eclipse.swtbot.swt.finder.exceptions.WidgetNotFoundException: Could not find menu: TRACETYPE
	at org.eclipse.swtbot.swt.finder.finders.ContextMenuHelper$1.run(ContextMenuHelper.java:63)
	at org.eclipse.swtbot.swt.finder.finders.ContextMenuHelper$1.run(ContextMenuHelper.java:1)
	at org.eclipse.swtbot.swt.finder.finders.UIThreadRunnable$2.doRun(UIThreadRunnable.java:140)
	at org.eclipse.swtbot.swt.finder.finders.UIThreadRunnable$1.run(UIThreadRunnable.java:89)
	at org.eclipse.swt.widgets.RunnableLock.run(RunnableLock.java:35)
	at org.eclipse.swt.widgets.Synchronizer.runAsyncMessages(Synchronizer.java:135)
	at org.eclipse.swt.widgets.Display.runAsyncMessages(Display.java:3794)
	at org.eclipse.swt.widgets.Display.readAndDispatch(Display.java:3433)
	at org.eclipse.e4.ui.internal.workbench.swt.PartRenderingEngine$4.run(PartRenderingEngine.java:1127)
	at org.eclipse.core.databinding.observable.Realm.runWithDefault(Realm.java:337)
	at org.eclipse.e4.ui.internal.workbench.swt.PartRenderingEngine.run(PartRenderingEngine.java:1018)
	at org.eclipse.e4.ui.internal.workbench.E4Workbench.createAndRunUI(E4Workbench.java:156)
	at org.eclipse.ui.internal.Workbench$5.run(Workbench.java:654)
	at org.eclipse.core.databinding.observable.Realm.runWithDefault(Realm.java:337)
	at org.eclipse.ui.internal.Workbench.createAndRunWorkbench(Workbench.java:598)
	at org.eclipse.ui.PlatformUI.createAndRunWorkbench(PlatformUI.java:150)
	at org.eclipse.ui.internal.ide.application.IDEApplication.start(IDEApplication.java:139)
	at org.eclipse.tycho.surefire.osgibooter.UITestApplication.runApplication(UITestApplication.java:31)
	at org.eclipse.tycho.surefire.osgibooter.AbstractUITestApplication.run(AbstractUITestApplication.java:120)
	at org.eclipse.tycho.surefire.osgibooter.UITestApplication.start(UITestApplication.java:37)
	at org.eclipse.equinox.internal.app.EclipseAppHandle.run(EclipseAppHandle.java:196)
	at org.eclipse.core.runtime.internal.adaptor.EclipseAppLauncher.runApplication(EclipseAppLauncher.java:134)
	at org.eclipse.core.runtime.internal.adaptor.EclipseAppLauncher.start(EclipseAppLauncher.java:104)
	at org.eclipse.core.runtime.adaptor.EclipseStarter.run(EclipseStarter.java:380)
	at org.eclipse.core.runtime.adaptor.EclipseStarter.run(EclipseStarter.java:235)
	at sun.reflect.NativeMethodAccessorImpl.invoke0(Native Method)
	at sun.reflect.NativeMethodAccessorImpl.invoke(NativeMethodAccessorImpl.java:57)
	at sun.reflect.DelegatingMethodAccessorImpl.invoke(DelegatingMethodAccessorImpl.java:43)
	at java.lang.reflect.Method.invoke(Method.java:606)
	at org.eclipse.equinox.launcher.Main.invokeFramework(Main.java:669)
	at org.eclipse.equinox.launcher.Main.basicRun(Main.java:608)
	at org.eclipse.equinox.launcher.Main.run(Main.java:1515)
	at org.eclipse.equinox.launcher.Main.main(Main.java:1488)

testField01(org.eclipse.tracecompass.tmf.ui.swtbot.tests.viewers.events.FilterViewerTest)  Time elapsed: 3.127 sec  <<< ERROR!
org.eclipse.swt.SWTException: Failed to execute runnable (org.eclipse.swtbot.swt.finder.exceptions.WidgetNotFoundException: Could not find menu: TRACETYPE)
	at org.eclipse.swt.SWT.error(SWT.java:4491)
	at org.eclipse.swt.SWT.error(SWT.java:4406)
	at org.eclipse.swt.widgets.Synchronizer.syncExec(Synchronizer.java:208)
	at org.eclipse.ui.internal.UISynchronizer.syncExec(UISynchronizer.java:145)
	at org.eclipse.swt.widgets.Display.syncExec(Display.java:4633)
	at org.eclipse.swtbot.swt.finder.finders.UIThreadRunnable.run(UIThreadRunnable.java:76)
	at org.eclipse.swtbot.swt.finder.finders.UIThreadRunnable.syncExec(UIThreadRunnable.java:142)
	at org.eclipse.swtbot.swt.finder.finders.UIThreadRunnable.syncExec(UIThreadRunnable.java:125)
	at org.eclipse.swtbot.swt.finder.finders.ContextMenuHelper.contextMenu(ContextMenuHelper.java:42)
	at org.eclipse.swtbot.swt.finder.widgets.SWTBotTreeItem.contextMenu(SWTBotTreeItem.java:558)
	at org.eclipse.tracecompass.tmf.ui.swtbot.tests.viewers.events.FilterViewerTest.testField01(FilterViewerTest.java:282)
Caused by: org.eclipse.swtbot.swt.finder.exceptions.WidgetNotFoundException: Could not find menu: TRACETYPE
	at org.eclipse.swtbot.swt.finder.finders.ContextMenuHelper$1.run(ContextMenuHelper.java:63)
	at org.eclipse.swtbot.swt.finder.finders.ContextMenuHelper$1.run(ContextMenuHelper.java:1)
	at org.eclipse.swtbot.swt.finder.finders.UIThreadRunnable$2.doRun(UIThreadRunnable.java:140)
	at org.eclipse.swtbot.swt.finder.finders.UIThreadRunnable$1.run(UIThreadRunnable.java:89)
	at org.eclipse.swt.widgets.RunnableLock.run(RunnableLock.java:35)
	at org.eclipse.swt.widgets.Synchronizer.runAsyncMessages(Synchronizer.java:135)
	at org.eclipse.swt.widgets.Display.runAsyncMessages(Display.java:3794)
	at org.eclipse.swt.widgets.Display.readAndDispatch(Display.java:3433)
	at org.eclipse.e4.ui.internal.workbench.swt.PartRenderingEngine$4.run(PartRenderingEngine.java:1127)
	at org.eclipse.core.databinding.observable.Realm.runWithDefault(Realm.java:337)
	at org.eclipse.e4.ui.internal.workbench.swt.PartRenderingEngine.run(PartRenderingEngine.java:1018)
	at org.eclipse.e4.ui.internal.workbench.E4Workbench.createAndRunUI(E4Workbench.java:156)
	at org.eclipse.ui.internal.Workbench$5.run(Workbench.java:654)
	at org.eclipse.core.databinding.observable.Realm.runWithDefault(Realm.java:337)
	at org.eclipse.ui.internal.Workbench.createAndRunWorkbench(Workbench.java:598)
	at org.eclipse.ui.PlatformUI.createAndRunWorkbench(PlatformUI.java:150)
	at org.eclipse.ui.internal.ide.application.IDEApplication.start(IDEApplication.java:139)
	at org.eclipse.tycho.surefire.osgibooter.UITestApplication.runApplication(UITestApplication.java:31)
	at org.eclipse.tycho.surefire.osgibooter.AbstractUITestApplication.run(AbstractUITestApplication.java:120)
	at org.eclipse.tycho.surefire.osgibooter.UITestApplication.start(UITestApplication.java:37)
	at org.eclipse.equinox.internal.app.EclipseAppHandle.run(EclipseAppHandle.java:196)
	at org.eclipse.core.runtime.internal.adaptor.EclipseAppLauncher.runApplication(EclipseAppLauncher.java:134)
	at org.eclipse.core.runtime.internal.adaptor.EclipseAppLauncher.start(EclipseAppLauncher.java:104)
	at org.eclipse.core.runtime.adaptor.EclipseStarter.run(EclipseStarter.java:380)
	at org.eclipse.core.runtime.adaptor.EclipseStarter.run(EclipseStarter.java:235)
	at sun.reflect.NativeMethodAccessorImpl.invoke0(Native Method)
	at sun.reflect.NativeMethodAccessorImpl.invoke(NativeMethodAccessorImpl.java:57)
	at sun.reflect.DelegatingMethodAccessorImpl.invoke(DelegatingMethodAccessorImpl.java:43)
	at java.lang.reflect.Method.invoke(Method.java:606)
	at org.eclipse.equinox.launcher.Main.invokeFramework(Main.java:669)
	at org.eclipse.equinox.launcher.Main.basicRun(Main.java:608)
	at org.eclipse.equinox.launcher.Main.run(Main.java:1515)
	at org.eclipse.equinox.launcher.Main.main(Main.java:1488)

testTimestampEqualsOr(org.eclipse.tracecompass.tmf.ui.swtbot.tests.viewers.events.FilterViewerTest)  Time elapsed: 3.024 sec  <<< ERROR!
org.eclipse.swt.SWTException: Failed to execute runnable (org.eclipse.swtbot.swt.finder.exceptions.WidgetNotFoundException: Could not find menu: TRACETYPE)
	at org.eclipse.swt.SWT.error(SWT.java:4491)
	at org.eclipse.swt.SWT.error(SWT.java:4406)
	at org.eclipse.swt.widgets.Synchronizer.syncExec(Synchronizer.java:208)
	at org.eclipse.ui.internal.UISynchronizer.syncExec(UISynchronizer.java:145)
	at org.eclipse.swt.widgets.Display.syncExec(Display.java:4633)
	at org.eclipse.swtbot.swt.finder.finders.UIThreadRunnable.run(UIThreadRunnable.java:76)
	at org.eclipse.swtbot.swt.finder.finders.UIThreadRunnable.syncExec(UIThreadRunnable.java:142)
	at org.eclipse.swtbot.swt.finder.finders.UIThreadRunnable.syncExec(UIThreadRunnable.java:125)
	at org.eclipse.swtbot.swt.finder.finders.ContextMenuHelper.contextMenu(ContextMenuHelper.java:42)
	at org.eclipse.swtbot.swt.finder.widgets.SWTBotTreeItem.contextMenu(SWTBotTreeItem.java:558)
	at org.eclipse.tracecompass.tmf.ui.swtbot.tests.viewers.events.FilterViewerTest.testTimestampEqualsOr(FilterViewerTest.java:215)
Caused by: org.eclipse.swtbot.swt.finder.exceptions.WidgetNotFoundException: Could not find menu: TRACETYPE
	at org.eclipse.swtbot.swt.finder.finders.ContextMenuHelper$1.run(ContextMenuHelper.java:63)
	at org.eclipse.swtbot.swt.finder.finders.ContextMenuHelper$1.run(ContextMenuHelper.java:1)
	at org.eclipse.swtbot.swt.finder.finders.UIThreadRunnable$2.doRun(UIThreadRunnable.java:140)
	at org.eclipse.swtbot.swt.finder.finders.UIThreadRunnable$1.run(UIThreadRunnable.java:89)
	at org.eclipse.swt.widgets.RunnableLock.run(RunnableLock.java:35)
	at org.eclipse.swt.widgets.Synchronizer.runAsyncMessages(Synchronizer.java:135)
	at org.eclipse.swt.widgets.Display.runAsyncMessages(Display.java:3794)
	at org.eclipse.swt.widgets.Display.readAndDispatch(Display.java:3433)
	at org.eclipse.e4.ui.internal.workbench.swt.PartRenderingEngine$4.run(PartRenderingEngine.java:1127)
	at org.eclipse.core.databinding.observable.Realm.runWithDefault(Realm.java:337)
	at org.eclipse.e4.ui.internal.workbench.swt.PartRenderingEngine.run(PartRenderingEngine.java:1018)
	at org.eclipse.e4.ui.internal.workbench.E4Workbench.createAndRunUI(E4Workbench.java:156)
	at org.eclipse.ui.internal.Workbench$5.run(Workbench.java:654)
	at org.eclipse.core.databinding.observable.Realm.runWithDefault(Realm.java:337)
	at org.eclipse.ui.internal.Workbench.createAndRunWorkbench(Workbench.java:598)
	at org.eclipse.ui.PlatformUI.createAndRunWorkbench(PlatformUI.java:150)
	at org.eclipse.ui.internal.ide.application.IDEApplication.start(IDEApplication.java:139)
	at org.eclipse.tycho.surefire.osgibooter.UITestApplication.runApplication(UITestApplication.java:31)
	at org.eclipse.tycho.surefire.osgibooter.AbstractUITestApplication.run(AbstractUITestApplication.java:120)
	at org.eclipse.tycho.surefire.osgibooter.UITestApplication.start(UITestApplication.java:37)
	at org.eclipse.equinox.internal.app.EclipseAppHandle.run(EclipseAppHandle.java:196)
	at org.eclipse.core.runtime.internal.adaptor.EclipseAppLauncher.runApplication(EclipseAppLauncher.java:134)
	at org.eclipse.core.runtime.internal.adaptor.EclipseAppLauncher.start(EclipseAppLauncher.java:104)
	at org.eclipse.core.runtime.adaptor.EclipseStarter.run(EclipseStarter.java:380)
	at org.eclipse.core.runtime.adaptor.EclipseStarter.run(EclipseStarter.java:235)
	at sun.reflect.NativeMethodAccessorImpl.invoke0(Native Method)
	at sun.reflect.NativeMethodAccessorImpl.invoke(NativeMethodAccessorImpl.java:57)
	at sun.reflect.DelegatingMethodAccessorImpl.invoke(DelegatingMethodAccessorImpl.java:43)
	at java.lang.reflect.Method.invoke(Method.java:606)
	at org.eclipse.equinox.launcher.Main.invokeFramework(Main.java:669)
	at org.eclipse.equinox.launcher.Main.basicRun(Main.java:608)
	at org.eclipse.equinox.launcher.Main.run(Main.java:1515)
	at org.eclipse.equinox.launcher.Main.main(Main.java:1488)

testChangeFont(org.eclipse.tracecompass.tmf.ui.swtbot.tests.viewers.events.FontEventEditorTest)  Time elapsed: 9.802 sec
testReorder(org.eclipse.tracecompass.tmf.ui.swtbot.tests.viewers.events.MovableColumnEventsEditorTest)  Time elapsed: 11.876 sec
testSDView(org.eclipse.tracecompass.tmf.ui.swtbot.tests.viewers.events.SDViewTest)  Time elapsed: 5.143 sec
testOffsetting(org.eclipse.tracecompass.tmf.ui.swtbot.tests.viewers.events.TestTraceOffsetting)  Time elapsed: 9.87 sec
testOverlappingTimechartMove(org.eclipse.tracecompass.tmf.ui.swtbot.tests.viewers.events.TmfAlignTimeAxisTest)  Time elapsed: 5.207 sec
testNotOverlappingCallstackMove(org.eclipse.tracecompass.tmf.ui.swtbot.tests.viewers.events.TmfAlignTimeAxisTest)  Time elapsed: 5.228 sec
testMoveHistogramCallstackFollows(org.eclipse.tracecompass.tmf.ui.swtbot.tests.viewers.events.TmfAlignTimeAxisTest)  Time elapsed: 5.224 sec
testOverlappingHistogramMove(org.eclipse.tracecompass.tmf.ui.swtbot.tests.viewers.events.TmfAlignTimeAxisTest)  Time elapsed: 5.3 sec
testNotOverlappingHistogramMove(org.eclipse.tracecompass.tmf.ui.swtbot.tests.viewers.events.TmfAlignTimeAxisTest)  Time elapsed: 5.235 sec
testMoveCallstackHistogramFollows(org.eclipse.tracecompass.tmf.ui.swtbot.tests.viewers.events.TmfAlignTimeAxisTest)  Time elapsed: 5.221 sec
testGzipImport(org.eclipse.tracecompass.tmf.ui.swtbot.tests.wizards.StandardImportGzipTraceTest)  Time elapsed: 6.138 sec
test(org.eclipse.tracecompass.tmf.ctf.ui.swtbot.tests.ImportAndReadSmokeTest)  Time elapsed: 13.406 sec
testImportFromDirectory(org.eclipse.tracecompass.tmf.ctf.ui.swtbot.tests.StandardImportAndReadSmokeTest)  Time elapsed: 7.578 sec
testExtractArchivesFromArchive(org.eclipse.tracecompass.tmf.ctf.ui.swtbot.tests.StandardImportAndReadSmokeTest)  Time elapsed: 18.482 sec
testImportFromDirectoryLinksPreserveFolder(org.eclipse.tracecompass.tmf.ctf.ui.swtbot.tests.StandardImportAndReadSmokeTest)  Time elapsed: 6.467 sec
testExtractArchivesFromArchivePreserveFolder(org.eclipse.tracecompass.tmf.ctf.ui.swtbot.tests.StandardImportAndReadSmokeTest)  Time elapsed: 18.647 sec
testExtractArchivesFromDirectory(org.eclipse.tracecompass.tmf.ctf.ui.swtbot.tests.StandardImportAndReadSmokeTest)  Time elapsed: 13.487 sec
testImportFromArchive(org.eclipse.tracecompass.tmf.ctf.ui.swtbot.tests.StandardImportAndReadSmokeTest)  Time elapsed: 13.67 sec
testExtractArchivesFromDirectoryLinksPreserveStruture(org.eclipse.tracecompass.tmf.ctf.ui.swtbot.tests.StandardImportAndReadSmokeTest)  Time elapsed: 14.486 sec
testEmptyDirectory(org.eclipse.tracecompass.tmf.ctf.ui.swtbot.tests.StandardImportAndReadSmokeTest)  Time elapsed: 5.96 sec
testEmptyArchive(org.eclipse.tracecompass.tmf.ctf.ui.swtbot.tests.StandardImportAndReadSmokeTest)  Time elapsed: 9.433 sec
testNestedEmptyArchive(org.eclipse.tracecompass.tmf.ctf.ui.swtbot.tests.StandardImportAndReadSmokeTest)  Time elapsed: 12.525 sec
testImportFromArchiveOverwrite(org.eclipse.tracecompass.tmf.ctf.ui.swtbot.tests.StandardImportAndReadSmokeTest)  Time elapsed: 15.296 sec
testDirectoryWithEmptyArchive(org.eclipse.tracecompass.tmf.ctf.ui.swtbot.tests.StandardImportAndReadSmokeTest)  Time elapsed: 8.812 sec
testImportFromDirectoryPreserveFolder(org.eclipse.tracecompass.tmf.ctf.ui.swtbot.tests.StandardImportAndReadSmokeTest)  Time elapsed: 8.119 sec
testImportFromDirectoryLinks(org.eclipse.tracecompass.tmf.ctf.ui.swtbot.tests.StandardImportAndReadSmokeTest)  Time elapsed: 7.163 sec
testImportFromDirectoryOverwrite(org.eclipse.tracecompass.tmf.ctf.ui.swtbot.tests.StandardImportAndReadSmokeTest)  Time elapsed: 15.003 sec
testExtractArchivesFromDirectoryLinks(org.eclipse.tracecompass.tmf.ctf.ui.swtbot.tests.StandardImportAndReadSmokeTest)  Time elapsed: 12.904 sec
testImportFromArchivePreserveFolder(org.eclipse.tracecompass.tmf.ctf.ui.swtbot.tests.StandardImportAndReadSmokeTest)  Time elapsed: 7.596 sec
testOpen[0: ../../ctf/org.eclipse.tracecompass.ctf.core.tests/traces/ctf-testsuite/tests/1.8/regression/metadata/fail/struct-align-negative](org.eclipse.tracecompass.tmf.ctf.ui.swtbot.tests.TestInvalidCtfTrace)  Time elapsed: 5.061 sec
testOpen[1: ../../ctf/org.eclipse.tracecompass.ctf.core.tests/traces/ctf-testsuite/tests/1.8/regression/metadata/fail/array-size-identifier](org.eclipse.tracecompass.tmf.ctf.ui.swtbot.tests.TestInvalidCtfTrace)  Time elapsed: 4.956 sec
testOpen[2: ../../ctf/org.eclipse.tracecompass.ctf.core.tests/traces/ctf-testsuite/tests/1.8/regression/metadata/fail/struct-align-huge](org.eclipse.tracecompass.tmf.ctf.ui.swtbot.tests.TestInvalidCtfTrace)  Time elapsed: 4.974 sec
testOpen[3: ../../ctf/org.eclipse.tracecompass.ctf.core.tests/traces/ctf-testsuite/tests/1.8/regression/metadata/fail/integer-signed-as-string](org.eclipse.tracecompass.tmf.ctf.ui.swtbot.tests.TestInvalidCtfTrace)  Time elapsed: 4.773 sec
testOpen[4: ../../ctf/org.eclipse.tracecompass.ctf.core.tests/traces/ctf-testsuite/tests/1.8/regression/metadata/fail/array-size-keyword](org.eclipse.tracecompass.tmf.ctf.ui.swtbot.tests.TestInvalidCtfTrace)  Time elapsed: 4.545 sec
testOpen[5: ../../ctf/org.eclipse.tracecompass.ctf.core.tests/traces/ctf-testsuite/tests/1.8/regression/metadata/fail/integer-range](org.eclipse.tracecompass.tmf.ctf.ui.swtbot.tests.TestInvalidCtfTrace)  Time elapsed: 5.147 sec
testOpen[6: ../../ctf/org.eclipse.tracecompass.ctf.core.tests/traces/ctf-testsuite/tests/1.8/regression/metadata/fail/integer-signed-invalid](org.eclipse.tracecompass.tmf.ctf.ui.swtbot.tests.TestInvalidCtfTrace)  Time elapsed: 4.699 sec
testOpen[7: ../../ctf/org.eclipse.tracecompass.ctf.core.tests/traces/ctf-testsuite/tests/1.8/regression/metadata/fail/struct-align-string](org.eclipse.tracecompass.tmf.ctf.ui.swtbot.tests.TestInvalidCtfTrace)  Time elapsed: 4.55 sec
testOpen[8: ../../ctf/org.eclipse.tracecompass.ctf.core.tests/traces/ctf-testsuite/tests/1.8/regression/metadata/fail/array-size-type-field](org.eclipse.tracecompass.tmf.ctf.ui.swtbot.tests.TestInvalidCtfTrace)  Time elapsed: 4.642 sec
testOpen[9: ../../ctf/org.eclipse.tracecompass.ctf.core.tests/traces/ctf-testsuite/tests/1.8/regression/metadata/fail/struct-duplicate-struct-name](org.eclipse.tracecompass.tmf.ctf.ui.swtbot.tests.TestInvalidCtfTrace)  Time elapsed: 4.786 sec
testOpen[10: ../../ctf/org.eclipse.tracecompass.ctf.core.tests/traces/ctf-testsuite/tests/1.8/regression/metadata/fail/integer-encoding-invalid](org.eclipse.tracecompass.tmf.ctf.ui.swtbot.tests.TestInvalidCtfTrace)  Time elapsed: 4.696 sec
testOpen[11: ../../ctf/org.eclipse.tracecompass.ctf.core.tests/traces/ctf-testsuite/tests/1.8/regression/metadata/fail/integer-size-as-string](org.eclipse.tracecompass.tmf.ctf.ui.swtbot.tests.TestInvalidCtfTrace)  Time elapsed: 4.666 sec
testOpen[12: ../../ctf/org.eclipse.tracecompass.ctf.core.tests/traces/ctf-testsuite/tests/1.8/regression/metadata/fail/array-size-type](org.eclipse.tracecompass.tmf.ctf.ui.swtbot.tests.TestInvalidCtfTrace)  Time elapsed: 4.575 sec
testOpen[13: ../../ctf/org.eclipse.tracecompass.ctf.core.tests/traces/ctf-testsuite/tests/1.8/regression/metadata/fail/array-size-not-present](org.eclipse.tracecompass.tmf.ctf.ui.swtbot.tests.TestInvalidCtfTrace)  Time elapsed: 4.672 sec
testOpen[14: ../../ctf/org.eclipse.tracecompass.ctf.core.tests/traces/ctf-testsuite/tests/1.8/regression/metadata/fail/struct-duplicate-field-name](org.eclipse.tracecompass.tmf.ctf.ui.swtbot.tests.TestInvalidCtfTrace)  Time elapsed: 5.093 sec
testOpen[15: ../../ctf/org.eclipse.tracecompass.ctf.core.tests/traces/ctf-testsuite/tests/1.8/regression/metadata/fail/array-size-string](org.eclipse.tracecompass.tmf.ctf.ui.swtbot.tests.TestInvalidCtfTrace)  Time elapsed: 5.071 sec
testOpen[16: ../../ctf/org.eclipse.tracecompass.ctf.core.tests/traces/ctf-testsuite/tests/1.8/regression/metadata/fail/integer-size-missing](org.eclipse.tracecompass.tmf.ctf.ui.swtbot.tests.TestInvalidCtfTrace)  Time elapsed: 4.675 sec
testOpen[17: ../../ctf/org.eclipse.tracecompass.ctf.core.tests/traces/ctf-testsuite/tests/1.8/regression/metadata/fail/integer-negative-bit-size](org.eclipse.tracecompass.tmf.ctf.ui.swtbot.tests.TestInvalidCtfTrace)  Time elapsed: 4.697 sec
testOpen[18: ../../ctf/org.eclipse.tracecompass.ctf.core.tests/traces/ctf-testsuite/tests/1.8/regression/metadata/fail/struct-align-enum](org.eclipse.tracecompass.tmf.ctf.ui.swtbot.tests.TestInvalidCtfTrace)  Time elapsed: 4.85 sec
testOpen[19: ../../ctf/org.eclipse.tracecompass.ctf.core.tests/traces/ctf-testsuite/tests/1.8/regression/metadata/fail/integer-encoding-as-string](org.eclipse.tracecompass.tmf.ctf.ui.swtbot.tests.TestInvalidCtfTrace)  Time elapsed: 5.094 sec
testOpen[20: ../../ctf/org.eclipse.tracecompass.ctf.core.tests/traces/ctf-testsuite/tests/1.8/regression/metadata/fail/struct-align-zero](org.eclipse.tracecompass.tmf.ctf.ui.swtbot.tests.TestInvalidCtfTrace)  Time elapsed: 4.497 sec
testOpen[21: ../../ctf/org.eclipse.tracecompass.ctf.core.tests/traces/ctf-testsuite/tests/1.8/regression/metadata/fail/array-redefinition](org.eclipse.tracecompass.tmf.ctf.ui.swtbot.tests.TestInvalidCtfTrace)  Time elapsed: 4.587 sec
testOpen[22: ../../ctf/org.eclipse.tracecompass.ctf.core.tests/traces/ctf-testsuite/tests/1.8/regression/metadata/fail/array-size-negative](org.eclipse.tracecompass.tmf.ctf.ui.swtbot.tests.TestInvalidCtfTrace)  Time elapsed: 4.7 sec
testOpen[23: ../../ctf/org.eclipse.tracecompass.ctf.core.tests/traces/ctf-testsuite/tests/1.8/regression/metadata/fail/struct-field-name-keyword](org.eclipse.tracecompass.tmf.ctf.ui.swtbot.tests.TestInvalidCtfTrace)  Time elapsed: 4.513 sec
test(org.eclipse.tracecompass.tmf.pcap.ui.swtbot.tests.ImportAndReadPcapTest)  Time elapsed: 26.467 sec
testPerspectiveComplete(org.eclipse.tracecompass.tmf.pcap.ui.swtbot.tests.NetworkPerspectiveChecker)  Time elapsed: 0.001 sec
testPerspectiveForViews(org.eclipse.tracecompass.tmf.pcap.ui.swtbot.tests.NetworkPerspectiveChecker)  Time elapsed: 0.052 sec
org.eclipse.tracecompass.tmf.remote.ui.swtbot.tests.fetch.FetchRemoteTracesTest  Time elapsed: 0.053 sec  <<< ERROR!
java.lang.NoClassDefFoundError: Could not initialize class org.eclipse.tracecompass.tmf.remote.ui.swtbot.tests.fetch.FetchRemoteTracesTest
	at sun.reflect.GeneratedMethodAccessor262.invoke(Unknown Source)
	at sun.reflect.DelegatingMethodAccessorImpl.invoke(DelegatingMethodAccessorImpl.java:43)
	at java.lang.reflect.Method.invoke(Method.java:606)
	at org.junit.runners.model.FrameworkMethod$1.runReflectiveCall(FrameworkMethod.java:50)
	at org.junit.internal.runners.model.ReflectiveCallable.run(ReflectiveCallable.java:12)
	at org.junit.runners.model.FrameworkMethod.invokeExplosively(FrameworkMethod.java:47)
	at org.junit.internal.runners.statements.RunBefores.evaluate(RunBefores.java:24)
	at org.junit.runners.ParentRunner.run(ParentRunner.java:363)
	at org.eclipse.swtbot.swt.finder.junit.SWTBotJunit4ClassRunner.run(SWTBotJunit4ClassRunner.java:54)
	at org.junit.runners.Suite.runChild(Suite.java:128)
	at org.junit.runners.Suite.runChild(Suite.java:27)
	at org.junit.runners.ParentRunner$3.run(ParentRunner.java:290)
	at org.junit.runners.ParentRunner$1.schedule(ParentRunner.java:71)
	at org.junit.runners.ParentRunner.runChildren(ParentRunner.java:288)
	at org.junit.runners.ParentRunner.access$000(ParentRunner.java:58)
	at org.junit.runners.ParentRunner$2.evaluate(ParentRunner.java:268)
	at org.junit.runners.ParentRunner.run(ParentRunner.java:363)
	at org.junit.runners.Suite.runChild(Suite.java:128)
	at org.junit.runners.Suite.runChild(Suite.java:27)
	at org.junit.runners.ParentRunner$3.run(ParentRunner.java:290)
	at org.junit.runners.ParentRunner$1.schedule(ParentRunner.java:71)
	at org.junit.runners.ParentRunner.runChildren(ParentRunner.java:288)
	at org.junit.runners.ParentRunner.access$000(ParentRunner.java:58)
	at org.junit.runners.ParentRunner$2.evaluate(ParentRunner.java:268)
	at org.junit.runners.ParentRunner.run(ParentRunner.java:363)
	at org.junit.runners.Suite.runChild(Suite.java:128)
	at org.junit.runners.Suite.runChild(Suite.java:27)
	at org.junit.runners.ParentRunner$3.run(ParentRunner.java:290)
	at org.junit.runners.ParentRunner$1.schedule(ParentRunner.java:71)
	at org.junit.runners.ParentRunner.runChildren(ParentRunner.java:288)
	at org.junit.runners.ParentRunner.access$000(ParentRunner.java:58)
	at org.junit.runners.ParentRunner$2.evaluate(ParentRunner.java:268)
	at org.junit.runners.ParentRunner.run(ParentRunner.java:363)
	at org.apache.maven.surefire.junit4.JUnit4Provider.execute(JUnit4Provider.java:264)
	at org.apache.maven.surefire.junit4.JUnit4Provider.executeTestSet(JUnit4Provider.java:153)
	at org.apache.maven.surefire.junit4.JUnit4Provider.invoke(JUnit4Provider.java:124)
	at sun.reflect.NativeMethodAccessorImpl.invoke0(Native Method)
	at sun.reflect.NativeMethodAccessorImpl.invoke(NativeMethodAccessorImpl.java:57)
	at sun.reflect.DelegatingMethodAccessorImpl.invoke(DelegatingMethodAccessorImpl.java:43)
	at java.lang.reflect.Method.invoke(Method.java:606)
	at org.apache.maven.surefire.util.ReflectionUtils.invokeMethodWithArray2(ReflectionUtils.java:208)
	at org.apache.maven.surefire.booter.ProviderFactory$ProviderProxy.invoke(ProviderFactory.java:156)
	at org.apache.maven.surefire.booter.ProviderFactory.invokeProvider(ProviderFactory.java:82)
	at org.eclipse.tycho.surefire.osgibooter.OsgiSurefireBooter.run(OsgiSurefireBooter.java:91)
	at org.eclipse.tycho.surefire.osgibooter.AbstractUITestApplication.runTests(AbstractUITestApplication.java:44)
	at org.eclipse.e4.ui.internal.workbench.swt.E4Testable$1.run(E4Testable.java:73)
	at java.lang.Thread.run(Thread.java:745)

testPerspectiveComplete(org.eclipse.tracecompass.lttng2.kernel.ui.swtbot.tests.KernelPerspectiveChecker)  Time elapsed: 0.589 sec
testPerspectiveForViews(org.eclipse.tracecompass.lttng2.kernel.ui.swtbot.tests.KernelPerspectiveChecker)  Time elapsed: 0.033 sec
test(org.eclipse.tracecompass.lttng2.kernel.ui.swtbot.tests.ImportAndReadKernelSmokeTest)  Time elapsed: 16.628 sec
testToolBarFollowCPUForwardBackward(org.eclipse.tracecompass.lttng2.kernel.ui.swtbot.tests.ControlFlowViewTest)  Time elapsed: 21.957 sec
testKeyboardLeftRight(org.eclipse.tracecompass.lttng2.kernel.ui.swtbot.tests.ControlFlowViewTest)  Time elapsed: 15.005 sec
testToolBarSelectNextPreviousEvent(org.eclipse.tracecompass.lttng2.kernel.ui.swtbot.tests.ControlFlowViewTest)  Time elapsed: 18.769 sec
testOpenAndCloseConcurrency(org.eclipse.tracecompass.lttng2.kernel.ui.swtbot.tests.OpenTraceStressTest)  Time elapsed: 46.781 sec
testNew(org.eclipse.tracecompass.tmf.ui.swtbot.tests.parsers.custom.TestCustomTxtWizard)  Time elapsed: 8.473 sec
testEdit(org.eclipse.tracecompass.tmf.ui.swtbot.tests.parsers.custom.TestCustomTxtWizard)  Time elapsed: 8.582 sec
testNew(org.eclipse.tracecompass.tmf.ui.swtbot.tests.parsers.custom.TestCustomXmlWizard)  Time elapsed: 8.178 sec
testPerspectiveComplete(org.eclipse.tracecompass.tmf.ui.swtbot.tests.perspectives.TracingPerspectiveChecker)  Time elapsed: 0.001 sec  <<< FAILURE!
java.lang.AssertionError: view org.eclipse.swtbot.eclipse.finder.widgets.SWTBotView@173730c4 is present
	at org.junit.Assert.fail(Assert.java:88)
	at org.junit.Assert.assertTrue(Assert.java:41)
	at org.eclipse.tracecompass.tmf.ui.swtbot.tests.shared.AbstractPerspectiveChecker.testPerspectiveComplete(AbstractPerspectiveChecker.java:118)
	at sun.reflect.GeneratedMethodAccessor156.invoke(Unknown Source)
	at sun.reflect.DelegatingMethodAccessorImpl.invoke(DelegatingMethodAccessorImpl.java:43)
	at java.lang.reflect.Method.invoke(Method.java:606)
	at org.junit.runners.model.FrameworkMethod$1.runReflectiveCall(FrameworkMethod.java:50)
	at org.junit.internal.runners.model.ReflectiveCallable.run(ReflectiveCallable.java:12)
	at org.junit.runners.model.FrameworkMethod.invokeExplosively(FrameworkMethod.java:47)
	at org.junit.internal.runners.statements.InvokeMethod.evaluate(InvokeMethod.java:17)
	at org.junit.internal.runners.statements.RunBefores.evaluate(RunBefores.java:26)
	at org.junit.runners.ParentRunner.runLeaf(ParentRunner.java:325)
	at org.junit.runners.BlockJUnit4ClassRunner.runChild(BlockJUnit4ClassRunner.java:78)
	at org.junit.runners.BlockJUnit4ClassRunner.runChild(BlockJUnit4ClassRunner.java:57)
	at org.junit.runners.ParentRunner$3.run(ParentRunner.java:290)
	at org.junit.runners.ParentRunner$1.schedule(ParentRunner.java:71)
	at org.junit.runners.ParentRunner.runChildren(ParentRunner.java:288)
	at org.junit.runners.ParentRunner.access$000(ParentRunner.java:58)
	at org.junit.runners.ParentRunner$2.evaluate(ParentRunner.java:268)
	at org.junit.internal.runners.statements.RunBefores.evaluate(RunBefores.java:26)
	at org.junit.internal.runners.statements.RunAfters.evaluate(RunAfters.java:27)
	at org.junit.runners.ParentRunner.run(ParentRunner.java:363)
	at org.eclipse.swtbot.swt.finder.junit.SWTBotJunit4ClassRunner.run(SWTBotJunit4ClassRunner.java:54)
	at org.junit.runners.Suite.runChild(Suite.java:128)
	at org.junit.runners.Suite.runChild(Suite.java:27)
	at org.junit.runners.ParentRunner$3.run(ParentRunner.java:290)
	at org.junit.runners.ParentRunner$1.schedule(ParentRunner.java:71)
	at org.junit.runners.ParentRunner.runChildren(ParentRunner.java:288)
	at org.junit.runners.ParentRunner.access$000(ParentRunner.java:58)
	at org.junit.runners.ParentRunner$2.evaluate(ParentRunner.java:268)
	at org.junit.runners.ParentRunner.run(ParentRunner.java:363)
	at org.junit.runners.Suite.runChild(Suite.java:128)
	at org.junit.runners.Suite.runChild(Suite.java:27)
	at org.junit.runners.ParentRunner$3.run(ParentRunner.java:290)
	at org.junit.runners.ParentRunner$1.schedule(ParentRunner.java:71)
	at org.junit.runners.ParentRunner.runChildren(ParentRunner.java:288)
	at org.junit.runners.ParentRunner.access$000(ParentRunner.java:58)
	at org.junit.runners.ParentRunner$2.evaluate(ParentRunner.java:268)
	at org.junit.runners.ParentRunner.run(ParentRunner.java:363)
	at org.junit.runners.Suite.runChild(Suite.java:128)
	at org.junit.runners.Suite.runChild(Suite.java:27)
	at org.junit.runners.ParentRunner$3.run(ParentRunner.java:290)
	at org.junit.runners.ParentRunner$1.schedule(ParentRunner.java:71)
	at org.junit.runners.ParentRunner.runChildren(ParentRunner.java:288)
	at org.junit.runners.ParentRunner.access$000(ParentRunner.java:58)
	at org.junit.runners.ParentRunner$2.evaluate(ParentRunner.java:268)
	at org.junit.runners.ParentRunner.run(ParentRunner.java:363)
	at org.apache.maven.surefire.junit4.JUnit4Provider.execute(JUnit4Provider.java:264)
	at org.apache.maven.surefire.junit4.JUnit4Provider.executeTestSet(JUnit4Provider.java:153)
	at org.apache.maven.surefire.junit4.JUnit4Provider.invoke(JUnit4Provider.java:124)
	at sun.reflect.NativeMethodAccessorImpl.invoke0(Native Method)
	at sun.reflect.NativeMethodAccessorImpl.invoke(NativeMethodAccessorImpl.java:57)
	at sun.reflect.DelegatingMethodAccessorImpl.invoke(DelegatingMethodAccessorImpl.java:43)
	at java.lang.reflect.Method.invoke(Method.java:606)
	at org.apache.maven.surefire.util.ReflectionUtils.invokeMethodWithArray2(ReflectionUtils.java:208)
	at org.apache.maven.surefire.booter.ProviderFactory$ProviderProxy.invoke(ProviderFactory.java:156)
	at org.apache.maven.surefire.booter.ProviderFactory.invokeProvider(ProviderFactory.java:82)
	at org.eclipse.tycho.surefire.osgibooter.OsgiSurefireBooter.run(OsgiSurefireBooter.java:91)
	at org.eclipse.tycho.surefire.osgibooter.AbstractUITestApplication.runTests(AbstractUITestApplication.java:44)
	at org.eclipse.e4.ui.internal.workbench.swt.E4Testable$1.run(E4Testable.java:73)
	at java.lang.Thread.run(Thread.java:745)

testPerspectiveForViews(org.eclipse.tracecompass.tmf.ui.swtbot.tests.perspectives.TracingPerspectiveChecker)  Time elapsed: 0.001 sec
test(org.eclipse.tracecompass.tmf.ui.swtbot.tests.viewers.events.CallsiteEventsInTableTest)  Time elapsed: 8.116 sec
test(org.eclipse.tracecompass.tmf.ui.swtbot.tests.viewers.events.CollapseEventsInTableTest)  Time elapsed: 9.463 sec
testYellow(org.eclipse.tracecompass.tmf.ui.swtbot.tests.viewers.events.ColorsViewTest)  Time elapsed: 7.535 sec
testToggleColumns(org.eclipse.tracecompass.tmf.ui.swtbot.tests.viewers.events.ColumnHeaderMenuTest)  Time elapsed: 4.029 sec
testShowAll(org.eclipse.tracecompass.tmf.ui.swtbot.tests.viewers.events.ColumnHeaderMenuTest)  Time elapsed: 3.12 sec
testNoCopySearchRow(org.eclipse.tracecompass.tmf.ui.swtbot.tests.viewers.events.CopyToClipboardTest)  Time elapsed: 3.981 sec
testCopySingleSelection(org.eclipse.tracecompass.tmf.ui.swtbot.tests.viewers.events.CopyToClipboardTest)  Time elapsed: 3.187 sec
testCopyMultipleSelection(org.eclipse.tracecompass.tmf.ui.swtbot.tests.viewers.events.CopyToClipboardTest)  Time elapsed: 2.881 sec
testMultiHighlightMessage(org.eclipse.tracecompass.tmf.ui.swtbot.tests.viewers.events.FilterColorEditorTest)  Time elapsed: 7.406 sec
testSwitchToFilter(org.eclipse.tracecompass.tmf.ui.swtbot.tests.viewers.events.FilterColorEditorTest)  Time elapsed: 8.317 sec
testHighlight(org.eclipse.tracecompass.tmf.ui.swtbot.tests.viewers.events.FilterColorEditorTest)  Time elapsed: 8.609 sec
testPreference(org.eclipse.tracecompass.tmf.ui.swtbot.tests.viewers.events.FilterColorEditorTest)  Time elapsed: 7.856 sec
testTimestampFilter(org.eclipse.tracecompass.tmf.ui.swtbot.tests.viewers.events.FilterViewerTest)  Time elapsed: 3.517 sec  <<< ERROR!
org.eclipse.swt.SWTException: Failed to execute runnable (org.eclipse.swtbot.swt.finder.exceptions.WidgetNotFoundException: Could not find menu: TRACETYPE)
	at org.eclipse.swt.SWT.error(SWT.java:4491)
	at org.eclipse.swt.SWT.error(SWT.java:4406)
	at org.eclipse.swt.widgets.Synchronizer.syncExec(Synchronizer.java:208)
	at org.eclipse.ui.internal.UISynchronizer.syncExec(UISynchronizer.java:145)
	at org.eclipse.swt.widgets.Display.syncExec(Display.java:4633)
	at org.eclipse.swtbot.swt.finder.finders.UIThreadRunnable.run(UIThreadRunnable.java:76)
	at org.eclipse.swtbot.swt.finder.finders.UIThreadRunnable.syncExec(UIThreadRunnable.java:142)
	at org.eclipse.swtbot.swt.finder.finders.UIThreadRunnable.syncExec(UIThreadRunnable.java:125)
	at org.eclipse.swtbot.swt.finder.finders.ContextMenuHelper.contextMenu(ContextMenuHelper.java:42)
	at org.eclipse.swtbot.swt.finder.widgets.SWTBotTreeItem.contextMenu(SWTBotTreeItem.java:558)
	at org.eclipse.tracecompass.tmf.ui.swtbot.tests.viewers.events.FilterViewerTest.testTimestampFilter(FilterViewerTest.java:165)
Caused by: org.eclipse.swtbot.swt.finder.exceptions.WidgetNotFoundException: Could not find menu: TRACETYPE
	at org.eclipse.swtbot.swt.finder.finders.ContextMenuHelper$1.run(ContextMenuHelper.java:63)
	at org.eclipse.swtbot.swt.finder.finders.ContextMenuHelper$1.run(ContextMenuHelper.java:1)
	at org.eclipse.swtbot.swt.finder.finders.UIThreadRunnable$2.doRun(UIThreadRunnable.java:140)
	at org.eclipse.swtbot.swt.finder.finders.UIThreadRunnable$1.run(UIThreadRunnable.java:89)
	at org.eclipse.swt.widgets.RunnableLock.run(RunnableLock.java:35)
	at org.eclipse.swt.widgets.Synchronizer.runAsyncMessages(Synchronizer.java:135)
	at org.eclipse.swt.widgets.Display.runAsyncMessages(Display.java:3794)
	at org.eclipse.swt.widgets.Display.readAndDispatch(Display.java:3433)
	at org.eclipse.e4.ui.internal.workbench.swt.PartRenderingEngine$4.run(PartRenderingEngine.java:1127)
	at org.eclipse.core.databinding.observable.Realm.runWithDefault(Realm.java:337)
	at org.eclipse.e4.ui.internal.workbench.swt.PartRenderingEngine.run(PartRenderingEngine.java:1018)
	at org.eclipse.e4.ui.internal.workbench.E4Workbench.createAndRunUI(E4Workbench.java:156)
	at org.eclipse.ui.internal.Workbench$5.run(Workbench.java:654)
	at org.eclipse.core.databinding.observable.Realm.runWithDefault(Realm.java:337)
	at org.eclipse.ui.internal.Workbench.createAndRunWorkbench(Workbench.java:598)
	at org.eclipse.ui.PlatformUI.createAndRunWorkbench(PlatformUI.java:150)
	at org.eclipse.ui.internal.ide.application.IDEApplication.start(IDEApplication.java:139)
	at org.eclipse.tycho.surefire.osgibooter.UITestApplication.runApplication(UITestApplication.java:31)
	at org.eclipse.tycho.surefire.osgibooter.AbstractUITestApplication.run(AbstractUITestApplication.java:120)
	at org.eclipse.tycho.surefire.osgibooter.UITestApplication.start(UITestApplication.java:37)
	at org.eclipse.equinox.internal.app.EclipseAppHandle.run(EclipseAppHandle.java:196)
	at org.eclipse.core.runtime.internal.adaptor.EclipseAppLauncher.runApplication(EclipseAppLauncher.java:134)
	at org.eclipse.core.runtime.internal.adaptor.EclipseAppLauncher.start(EclipseAppLauncher.java:104)
	at org.eclipse.core.runtime.adaptor.EclipseStarter.run(EclipseStarter.java:380)
	at org.eclipse.core.runtime.adaptor.EclipseStarter.run(EclipseStarter.java:235)
	at sun.reflect.NativeMethodAccessorImpl.invoke0(Native Method)
	at sun.reflect.NativeMethodAccessorImpl.invoke(NativeMethodAccessorImpl.java:57)
	at sun.reflect.DelegatingMethodAccessorImpl.invoke(DelegatingMethodAccessorImpl.java:43)
	at java.lang.reflect.Method.invoke(Method.java:606)
	at org.eclipse.equinox.launcher.Main.invokeFramework(Main.java:669)
	at org.eclipse.equinox.launcher.Main.basicRun(Main.java:608)
	at org.eclipse.equinox.launcher.Main.run(Main.java:1515)
	at org.eclipse.equinox.launcher.Main.main(Main.java:1488)

testField01(org.eclipse.tracecompass.tmf.ui.swtbot.tests.viewers.events.FilterViewerTest)  Time elapsed: 3.309 sec  <<< ERROR!
org.eclipse.swt.SWTException: Failed to execute runnable (org.eclipse.swtbot.swt.finder.exceptions.WidgetNotFoundException: Could not find menu: TRACETYPE)
	at org.eclipse.swt.SWT.error(SWT.java:4491)
	at org.eclipse.swt.SWT.error(SWT.java:4406)
	at org.eclipse.swt.widgets.Synchronizer.syncExec(Synchronizer.java:208)
	at org.eclipse.ui.internal.UISynchronizer.syncExec(UISynchronizer.java:145)
	at org.eclipse.swt.widgets.Display.syncExec(Display.java:4633)
	at org.eclipse.swtbot.swt.finder.finders.UIThreadRunnable.run(UIThreadRunnable.java:76)
	at org.eclipse.swtbot.swt.finder.finders.UIThreadRunnable.syncExec(UIThreadRunnable.java:142)
	at org.eclipse.swtbot.swt.finder.finders.UIThreadRunnable.syncExec(UIThreadRunnable.java:125)
	at org.eclipse.swtbot.swt.finder.finders.ContextMenuHelper.contextMenu(ContextMenuHelper.java:42)
	at org.eclipse.swtbot.swt.finder.widgets.SWTBotTreeItem.contextMenu(SWTBotTreeItem.java:558)
	at org.eclipse.tracecompass.tmf.ui.swtbot.tests.viewers.events.FilterViewerTest.testField01(FilterViewerTest.java:282)
Caused by: org.eclipse.swtbot.swt.finder.exceptions.WidgetNotFoundException: Could not find menu: TRACETYPE
	at org.eclipse.swtbot.swt.finder.finders.ContextMenuHelper$1.run(ContextMenuHelper.java:63)
	at org.eclipse.swtbot.swt.finder.finders.ContextMenuHelper$1.run(ContextMenuHelper.java:1)
	at org.eclipse.swtbot.swt.finder.finders.UIThreadRunnable$2.doRun(UIThreadRunnable.java:140)
	at org.eclipse.swtbot.swt.finder.finders.UIThreadRunnable$1.run(UIThreadRunnable.java:89)
	at org.eclipse.swt.widgets.RunnableLock.run(RunnableLock.java:35)
	at org.eclipse.swt.widgets.Synchronizer.runAsyncMessages(Synchronizer.java:135)
	at org.eclipse.swt.widgets.Display.runAsyncMessages(Display.java:3794)
	at org.eclipse.swt.widgets.Display.readAndDispatch(Display.java:3433)
	at org.eclipse.e4.ui.internal.workbench.swt.PartRenderingEngine$4.run(PartRenderingEngine.java:1127)
	at org.eclipse.core.databinding.observable.Realm.runWithDefault(Realm.java:337)
	at org.eclipse.e4.ui.internal.workbench.swt.PartRenderingEngine.run(PartRenderingEngine.java:1018)
	at org.eclipse.e4.ui.internal.workbench.E4Workbench.createAndRunUI(E4Workbench.java:156)
	at org.eclipse.ui.internal.Workbench$5.run(Workbench.java:654)
	at org.eclipse.core.databinding.observable.Realm.runWithDefault(Realm.java:337)
	at org.eclipse.ui.internal.Workbench.createAndRunWorkbench(Workbench.java:598)
	at org.eclipse.ui.PlatformUI.createAndRunWorkbench(PlatformUI.java:150)
	at org.eclipse.ui.internal.ide.application.IDEApplication.start(IDEApplication.java:139)
	at org.eclipse.tycho.surefire.osgibooter.UITestApplication.runApplication(UITestApplication.java:31)
	at org.eclipse.tycho.surefire.osgibooter.AbstractUITestApplication.run(AbstractUITestApplication.java:120)
	at org.eclipse.tycho.surefire.osgibooter.UITestApplication.start(UITestApplication.java:37)
	at org.eclipse.equinox.internal.app.EclipseAppHandle.run(EclipseAppHandle.java:196)
	at org.eclipse.core.runtime.internal.adaptor.EclipseAppLauncher.runApplication(EclipseAppLauncher.java:134)
	at org.eclipse.core.runtime.internal.adaptor.EclipseAppLauncher.start(EclipseAppLauncher.java:104)
	at org.eclipse.core.runtime.adaptor.EclipseStarter.run(EclipseStarter.java:380)
	at org.eclipse.core.runtime.adaptor.EclipseStarter.run(EclipseStarter.java:235)
	at sun.reflect.NativeMethodAccessorImpl.invoke0(Native Method)
	at sun.reflect.NativeMethodAccessorImpl.invoke(NativeMethodAccessorImpl.java:57)
	at sun.reflect.DelegatingMethodAccessorImpl.invoke(DelegatingMethodAccessorImpl.java:43)
	at java.lang.reflect.Method.invoke(Method.java:606)
	at org.eclipse.equinox.launcher.Main.invokeFramework(Main.java:669)
	at org.eclipse.equinox.launcher.Main.basicRun(Main.java:608)
	at org.eclipse.equinox.launcher.Main.run(Main.java:1515)
	at org.eclipse.equinox.launcher.Main.main(Main.java:1488)

testTimestampEqualsOr(org.eclipse.tracecompass.tmf.ui.swtbot.tests.viewers.events.FilterViewerTest)  Time elapsed: 3.235 sec  <<< ERROR!
org.eclipse.swt.SWTException: Failed to execute runnable (org.eclipse.swtbot.swt.finder.exceptions.WidgetNotFoundException: Could not find menu: TRACETYPE)
	at org.eclipse.swt.SWT.error(SWT.java:4491)
	at org.eclipse.swt.SWT.error(SWT.java:4406)
	at org.eclipse.swt.widgets.Synchronizer.syncExec(Synchronizer.java:208)
	at org.eclipse.ui.internal.UISynchronizer.syncExec(UISynchronizer.java:145)
	at org.eclipse.swt.widgets.Display.syncExec(Display.java:4633)
	at org.eclipse.swtbot.swt.finder.finders.UIThreadRunnable.run(UIThreadRunnable.java:76)
	at org.eclipse.swtbot.swt.finder.finders.UIThreadRunnable.syncExec(UIThreadRunnable.java:142)
	at org.eclipse.swtbot.swt.finder.finders.UIThreadRunnable.syncExec(UIThreadRunnable.java:125)
	at org.eclipse.swtbot.swt.finder.finders.ContextMenuHelper.contextMenu(ContextMenuHelper.java:42)
	at org.eclipse.swtbot.swt.finder.widgets.SWTBotTreeItem.contextMenu(SWTBotTreeItem.java:558)
	at org.eclipse.tracecompass.tmf.ui.swtbot.tests.viewers.events.FilterViewerTest.testTimestampEqualsOr(FilterViewerTest.java:215)
Caused by: org.eclipse.swtbot.swt.finder.exceptions.WidgetNotFoundException: Could not find menu: TRACETYPE
	at org.eclipse.swtbot.swt.finder.finders.ContextMenuHelper$1.run(ContextMenuHelper.java:63)
	at org.eclipse.swtbot.swt.finder.finders.ContextMenuHelper$1.run(ContextMenuHelper.java:1)
	at org.eclipse.swtbot.swt.finder.finders.UIThreadRunnable$2.doRun(UIThreadRunnable.java:140)
	at org.eclipse.swtbot.swt.finder.finders.UIThreadRunnable$1.run(UIThreadRunnable.java:89)
	at org.eclipse.swt.widgets.RunnableLock.run(RunnableLock.java:35)
	at org.eclipse.swt.widgets.Synchronizer.runAsyncMessages(Synchronizer.java:135)
	at org.eclipse.swt.widgets.Display.runAsyncMessages(Display.java:3794)
	at org.eclipse.swt.widgets.Display.readAndDispatch(Display.java:3433)
	at org.eclipse.e4.ui.internal.workbench.swt.PartRenderingEngine$4.run(PartRenderingEngine.java:1127)
	at org.eclipse.core.databinding.observable.Realm.runWithDefault(Realm.java:337)
	at org.eclipse.e4.ui.internal.workbench.swt.PartRenderingEngine.run(PartRenderingEngine.java:1018)
	at org.eclipse.e4.ui.internal.workbench.E4Workbench.createAndRunUI(E4Workbench.java:156)
	at org.eclipse.ui.internal.Workbench$5.run(Workbench.java:654)
	at org.eclipse.core.databinding.observable.Realm.runWithDefault(Realm.java:337)
	at org.eclipse.ui.internal.Workbench.createAndRunWorkbench(Workbench.java:598)
	at org.eclipse.ui.PlatformUI.createAndRunWorkbench(PlatformUI.java:150)
	at org.eclipse.ui.internal.ide.application.IDEApplication.start(IDEApplication.java:139)
	at org.eclipse.tycho.surefire.osgibooter.UITestApplication.runApplication(UITestApplication.java:31)
	at org.eclipse.tycho.surefire.osgibooter.AbstractUITestApplication.run(AbstractUITestApplication.java:120)
	at org.eclipse.tycho.surefire.osgibooter.UITestApplication.start(UITestApplication.java:37)
	at org.eclipse.equinox.internal.app.EclipseAppHandle.run(EclipseAppHandle.java:196)
	at org.eclipse.core.runtime.internal.adaptor.EclipseAppLauncher.runApplication(EclipseAppLauncher.java:134)
	at org.eclipse.core.runtime.internal.adaptor.EclipseAppLauncher.start(EclipseAppLauncher.java:104)
	at org.eclipse.core.runtime.adaptor.EclipseStarter.run(EclipseStarter.java:380)
	at org.eclipse.core.runtime.adaptor.EclipseStarter.run(EclipseStarter.java:235)
	at sun.reflect.NativeMethodAccessorImpl.invoke0(Native Method)
	at sun.reflect.NativeMethodAccessorImpl.invoke(NativeMethodAccessorImpl.java:57)
	at sun.reflect.DelegatingMethodAccessorImpl.invoke(DelegatingMethodAccessorImpl.java:43)
	at java.lang.reflect.Method.invoke(Method.java:606)
	at org.eclipse.equinox.launcher.Main.invokeFramework(Main.java:669)
	at org.eclipse.equinox.launcher.Main.basicRun(Main.java:608)
	at org.eclipse.equinox.launcher.Main.run(Main.java:1515)
	at org.eclipse.equinox.launcher.Main.main(Main.java:1488)

testChangeFont(org.eclipse.tracecompass.tmf.ui.swtbot.tests.viewers.events.FontEventEditorTest)  Time elapsed: 10.017 sec
testReorder(org.eclipse.tracecompass.tmf.ui.swtbot.tests.viewers.events.MovableColumnEventsEditorTest)  Time elapsed: 12.305 sec
testSDView(org.eclipse.tracecompass.tmf.ui.swtbot.tests.viewers.events.SDViewTest)  Time elapsed: 5.693 sec
testOffsetting(org.eclipse.tracecompass.tmf.ui.swtbot.tests.viewers.events.TestTraceOffsetting)  Time elapsed: 10.945 sec
testOverlappingTimechartMove(org.eclipse.tracecompass.tmf.ui.swtbot.tests.viewers.events.TmfAlignTimeAxisTest)  Time elapsed: 5.514 sec
testNotOverlappingCallstackMove(org.eclipse.tracecompass.tmf.ui.swtbot.tests.viewers.events.TmfAlignTimeAxisTest)  Time elapsed: 5.329 sec
testMoveHistogramCallstackFollows(org.eclipse.tracecompass.tmf.ui.swtbot.tests.viewers.events.TmfAlignTimeAxisTest)  Time elapsed: 5.237 sec
testOverlappingHistogramMove(org.eclipse.tracecompass.tmf.ui.swtbot.tests.viewers.events.TmfAlignTimeAxisTest)  Time elapsed: 5.4 sec
testNotOverlappingHistogramMove(org.eclipse.tracecompass.tmf.ui.swtbot.tests.viewers.events.TmfAlignTimeAxisTest)  Time elapsed: 5.205 sec
testMoveCallstackHistogramFollows(org.eclipse.tracecompass.tmf.ui.swtbot.tests.viewers.events.TmfAlignTimeAxisTest)  Time elapsed: 5.288 sec
testGzipImport(org.eclipse.tracecompass.tmf.ui.swtbot.tests.wizards.StandardImportGzipTraceTest)  Time elapsed: 6.436 sec
test(org.eclipse.tracecompass.tmf.ctf.ui.swtbot.tests.ImportAndReadSmokeTest)  Time elapsed: 12.657 sec
testImportFromDirectory(org.eclipse.tracecompass.tmf.ctf.ui.swtbot.tests.StandardImportAndReadSmokeTest)  Time elapsed: 8.233 sec
testExtractArchivesFromArchive(org.eclipse.tracecompass.tmf.ctf.ui.swtbot.tests.StandardImportAndReadSmokeTest)  Time elapsed: 18.93 sec
testImportFromDirectoryLinksPreserveFolder(org.eclipse.tracecompass.tmf.ctf.ui.swtbot.tests.StandardImportAndReadSmokeTest)  Time elapsed: 7.733 sec
testExtractArchivesFromArchivePreserveFolder(org.eclipse.tracecompass.tmf.ctf.ui.swtbot.tests.StandardImportAndReadSmokeTest)  Time elapsed: 18.274 sec
testExtractArchivesFromDirectory(org.eclipse.tracecompass.tmf.ctf.ui.swtbot.tests.StandardImportAndReadSmokeTest)  Time elapsed: 14.618 sec
testImportFromArchive(org.eclipse.tracecompass.tmf.ctf.ui.swtbot.tests.StandardImportAndReadSmokeTest)  Time elapsed: 13.395 sec
testExtractArchivesFromDirectoryLinksPreserveStruture(org.eclipse.tracecompass.tmf.ctf.ui.swtbot.tests.StandardImportAndReadSmokeTest)  Time elapsed: 14.397 sec
testEmptyDirectory(org.eclipse.tracecompass.tmf.ctf.ui.swtbot.tests.StandardImportAndReadSmokeTest)  Time elapsed: 6.286 sec
testEmptyArchive(org.eclipse.tracecompass.tmf.ctf.ui.swtbot.tests.StandardImportAndReadSmokeTest)  Time elapsed: 10.2 sec
testNestedEmptyArchive(org.eclipse.tracecompass.tmf.ctf.ui.swtbot.tests.StandardImportAndReadSmokeTest)  Time elapsed: 13.889 sec
testImportFromArchiveOverwrite(org.eclipse.tracecompass.tmf.ctf.ui.swtbot.tests.StandardImportAndReadSmokeTest)  Time elapsed: 15.476 sec
testDirectoryWithEmptyArchive(org.eclipse.tracecompass.tmf.ctf.ui.swtbot.tests.StandardImportAndReadSmokeTest)  Time elapsed: 9.338 sec
testImportFromDirectoryPreserveFolder(org.eclipse.tracecompass.tmf.ctf.ui.swtbot.tests.StandardImportAndReadSmokeTest)  Time elapsed: 8.844 sec
testImportFromDirectoryLinks(org.eclipse.tracecompass.tmf.ctf.ui.swtbot.tests.StandardImportAndReadSmokeTest)  Time elapsed: 7.973 sec
testImportFromDirectoryOverwrite(org.eclipse.tracecompass.tmf.ctf.ui.swtbot.tests.StandardImportAndReadSmokeTest)  Time elapsed: 16.007 sec
testExtractArchivesFromDirectoryLinks(org.eclipse.tracecompass.tmf.ctf.ui.swtbot.tests.StandardImportAndReadSmokeTest)  Time elapsed: 14.457 sec
testImportFromArchivePreserveFolder(org.eclipse.tracecompass.tmf.ctf.ui.swtbot.tests.StandardImportAndReadSmokeTest)  Time elapsed: 8.17 sec
testOpen[0: ../../ctf/org.eclipse.tracecompass.ctf.core.tests/traces/ctf-testsuite/tests/1.8/regression/metadata/fail/struct-align-negative](org.eclipse.tracecompass.tmf.ctf.ui.swtbot.tests.TestInvalidCtfTrace)  Time elapsed: 4.981 sec
testOpen[1: ../../ctf/org.eclipse.tracecompass.ctf.core.tests/traces/ctf-testsuite/tests/1.8/regression/metadata/fail/array-size-identifier](org.eclipse.tracecompass.tmf.ctf.ui.swtbot.tests.TestInvalidCtfTrace)  Time elapsed: 4.786 sec
testOpen[2: ../../ctf/org.eclipse.tracecompass.ctf.core.tests/traces/ctf-testsuite/tests/1.8/regression/metadata/fail/struct-align-huge](org.eclipse.tracecompass.tmf.ctf.ui.swtbot.tests.TestInvalidCtfTrace)  Time elapsed: 5.175 sec
testOpen[3: ../../ctf/org.eclipse.tracecompass.ctf.core.tests/traces/ctf-testsuite/tests/1.8/regression/metadata/fail/integer-signed-as-string](org.eclipse.tracecompass.tmf.ctf.ui.swtbot.tests.TestInvalidCtfTrace)  Time elapsed: 4.992 sec
testOpen[4: ../../ctf/org.eclipse.tracecompass.ctf.core.tests/traces/ctf-testsuite/tests/1.8/regression/metadata/fail/array-size-keyword](org.eclipse.tracecompass.tmf.ctf.ui.swtbot.tests.TestInvalidCtfTrace)  Time elapsed: 4.742 sec
testOpen[5: ../../ctf/org.eclipse.tracecompass.ctf.core.tests/traces/ctf-testsuite/tests/1.8/regression/metadata/fail/integer-range](org.eclipse.tracecompass.tmf.ctf.ui.swtbot.tests.TestInvalidCtfTrace)  Time elapsed: 5.452 sec
testOpen[6: ../../ctf/org.eclipse.tracecompass.ctf.core.tests/traces/ctf-testsuite/tests/1.8/regression/metadata/fail/integer-signed-invalid](org.eclipse.tracecompass.tmf.ctf.ui.swtbot.tests.TestInvalidCtfTrace)  Time elapsed: 4.851 sec
testOpen[7: ../../ctf/org.eclipse.tracecompass.ctf.core.tests/traces/ctf-testsuite/tests/1.8/regression/metadata/fail/struct-align-string](org.eclipse.tracecompass.tmf.ctf.ui.swtbot.tests.TestInvalidCtfTrace)  Time elapsed: 4.937 sec
testOpen[8: ../../ctf/org.eclipse.tracecompass.ctf.core.tests/traces/ctf-testsuite/tests/1.8/regression/metadata/fail/array-size-type-field](org.eclipse.tracecompass.tmf.ctf.ui.swtbot.tests.TestInvalidCtfTrace)  Time elapsed: 4.745 sec
testOpen[9: ../../ctf/org.eclipse.tracecompass.ctf.core.tests/traces/ctf-testsuite/tests/1.8/regression/metadata/fail/struct-duplicate-struct-name](org.eclipse.tracecompass.tmf.ctf.ui.swtbot.tests.TestInvalidCtfTrace)  Time elapsed: 4.699 sec
testOpen[10: ../../ctf/org.eclipse.tracecompass.ctf.core.tests/traces/ctf-testsuite/tests/1.8/regression/metadata/fail/integer-encoding-invalid](org.eclipse.tracecompass.tmf.ctf.ui.swtbot.tests.TestInvalidCtfTrace)  Time elapsed: 4.936 sec
testOpen[11: ../../ctf/org.eclipse.tracecompass.ctf.core.tests/traces/ctf-testsuite/tests/1.8/regression/metadata/fail/integer-size-as-string](org.eclipse.tracecompass.tmf.ctf.ui.swtbot.tests.TestInvalidCtfTrace)  Time elapsed: 4.566 sec
testOpen[12: ../../ctf/org.eclipse.tracecompass.ctf.core.tests/traces/ctf-testsuite/tests/1.8/regression/metadata/fail/array-size-type](org.eclipse.tracecompass.tmf.ctf.ui.swtbot.tests.TestInvalidCtfTrace)  Time elapsed: 4.912 sec
testOpen[13: ../../ctf/org.eclipse.tracecompass.ctf.core.tests/traces/ctf-testsuite/tests/1.8/regression/metadata/fail/array-size-not-present](org.eclipse.tracecompass.tmf.ctf.ui.swtbot.tests.TestInvalidCtfTrace)  Time elapsed: 4.671 sec
testOpen[14: ../../ctf/org.eclipse.tracecompass.ctf.core.tests/traces/ctf-testsuite/tests/1.8/regression/metadata/fail/struct-duplicate-field-name](org.eclipse.tracecompass.tmf.ctf.ui.swtbot.tests.TestInvalidCtfTrace)  Time elapsed: 4.655 sec
testOpen[15: ../../ctf/org.eclipse.tracecompass.ctf.core.tests/traces/ctf-testsuite/tests/1.8/regression/metadata/fail/array-size-string](org.eclipse.tracecompass.tmf.ctf.ui.swtbot.tests.TestInvalidCtfTrace)  Time elapsed: 4.663 sec
testOpen[16: ../../ctf/org.eclipse.tracecompass.ctf.core.tests/traces/ctf-testsuite/tests/1.8/regression/metadata/fail/integer-size-missing](org.eclipse.tracecompass.tmf.ctf.ui.swtbot.tests.TestInvalidCtfTrace)  Time elapsed: 5.131 sec
testOpen[17: ../../ctf/org.eclipse.tracecompass.ctf.core.tests/traces/ctf-testsuite/tests/1.8/regression/metadata/fail/integer-negative-bit-size](org.eclipse.tracecompass.tmf.ctf.ui.swtbot.tests.TestInvalidCtfTrace)  Time elapsed: 4.76 sec
testOpen[18: ../../ctf/org.eclipse.tracecompass.ctf.core.tests/traces/ctf-testsuite/tests/1.8/regression/metadata/fail/struct-align-enum](org.eclipse.tracecompass.tmf.ctf.ui.swtbot.tests.TestInvalidCtfTrace)  Time elapsed: 4.884 sec
testOpen[19: ../../ctf/org.eclipse.tracecompass.ctf.core.tests/traces/ctf-testsuite/tests/1.8/regression/metadata/fail/integer-encoding-as-string](org.eclipse.tracecompass.tmf.ctf.ui.swtbot.tests.TestInvalidCtfTrace)  Time elapsed: 4.85 sec
testOpen[20: ../../ctf/org.eclipse.tracecompass.ctf.core.tests/traces/ctf-testsuite/tests/1.8/regression/metadata/fail/struct-align-zero](org.eclipse.tracecompass.tmf.ctf.ui.swtbot.tests.TestInvalidCtfTrace)  Time elapsed: 5.166 sec
testOpen[21: ../../ctf/org.eclipse.tracecompass.ctf.core.tests/traces/ctf-testsuite/tests/1.8/regression/metadata/fail/array-redefinition](org.eclipse.tracecompass.tmf.ctf.ui.swtbot.tests.TestInvalidCtfTrace)  Time elapsed: 4.837 sec
testOpen[22: ../../ctf/org.eclipse.tracecompass.ctf.core.tests/traces/ctf-testsuite/tests/1.8/regression/metadata/fail/array-size-negative](org.eclipse.tracecompass.tmf.ctf.ui.swtbot.tests.TestInvalidCtfTrace)  Time elapsed: 4.816 sec
testOpen[23: ../../ctf/org.eclipse.tracecompass.ctf.core.tests/traces/ctf-testsuite/tests/1.8/regression/metadata/fail/struct-field-name-keyword](org.eclipse.tracecompass.tmf.ctf.ui.swtbot.tests.TestInvalidCtfTrace)  Time elapsed: 5.147 sec
test(org.eclipse.tracecompass.tmf.pcap.ui.swtbot.tests.ImportAndReadPcapTest)  Time elapsed: 29.289 sec
testPerspectiveComplete(org.eclipse.tracecompass.tmf.pcap.ui.swtbot.tests.NetworkPerspectiveChecker)  Time elapsed: 0.1 sec
testPerspectiveForViews(org.eclipse.tracecompass.tmf.pcap.ui.swtbot.tests.NetworkPerspectiveChecker)  Time elapsed: 0.126 sec
org.eclipse.tracecompass.tmf.remote.ui.swtbot.tests.fetch.FetchRemoteTracesTest  Time elapsed: 0.126 sec  <<< ERROR!
java.lang.NoClassDefFoundError: Could not initialize class org.eclipse.tracecompass.tmf.remote.ui.swtbot.tests.fetch.FetchRemoteTracesTest
	at sun.reflect.GeneratedMethodAccessor262.invoke(Unknown Source)
	at sun.reflect.DelegatingMethodAccessorImpl.invoke(DelegatingMethodAccessorImpl.java:43)
	at java.lang.reflect.Method.invoke(Method.java:606)
	at org.junit.runners.model.FrameworkMethod$1.runReflectiveCall(FrameworkMethod.java:50)
	at org.junit.internal.runners.model.ReflectiveCallable.run(ReflectiveCallable.java:12)
	at org.junit.runners.model.FrameworkMethod.invokeExplosively(FrameworkMethod.java:47)
	at org.junit.internal.runners.statements.RunBefores.evaluate(RunBefores.java:24)
	at org.junit.runners.ParentRunner.run(ParentRunner.java:363)
	at org.eclipse.swtbot.swt.finder.junit.SWTBotJunit4ClassRunner.run(SWTBotJunit4ClassRunner.java:54)
	at org.junit.runners.Suite.runChild(Suite.java:128)
	at org.junit.runners.Suite.runChild(Suite.java:27)
	at org.junit.runners.ParentRunner$3.run(ParentRunner.java:290)
	at org.junit.runners.ParentRunner$1.schedule(ParentRunner.java:71)
	at org.junit.runners.ParentRunner.runChildren(ParentRunner.java:288)
	at org.junit.runners.ParentRunner.access$000(ParentRunner.java:58)
	at org.junit.runners.ParentRunner$2.evaluate(ParentRunner.java:268)
	at org.junit.runners.ParentRunner.run(ParentRunner.java:363)
	at org.junit.runners.Suite.runChild(Suite.java:128)
	at org.junit.runners.Suite.runChild(Suite.java:27)
	at org.junit.runners.ParentRunner$3.run(ParentRunner.java:290)
	at org.junit.runners.ParentRunner$1.schedule(ParentRunner.java:71)
	at org.junit.runners.ParentRunner.runChildren(ParentRunner.java:288)
	at org.junit.runners.ParentRunner.access$000(ParentRunner.java:58)
	at org.junit.runners.ParentRunner$2.evaluate(ParentRunner.java:268)
	at org.junit.runners.ParentRunner.run(ParentRunner.java:363)
	at org.junit.runners.Suite.runChild(Suite.java:128)
	at org.junit.runners.Suite.runChild(Suite.java:27)
	at org.junit.runners.ParentRunner$3.run(ParentRunner.java:290)
	at org.junit.runners.ParentRunner$1.schedule(ParentRunner.java:71)
	at org.junit.runners.ParentRunner.runChildren(ParentRunner.java:288)
	at org.junit.runners.ParentRunner.access$000(ParentRunner.java:58)
	at org.junit.runners.ParentRunner$2.evaluate(ParentRunner.java:268)
	at org.junit.runners.ParentRunner.run(ParentRunner.java:363)
	at org.apache.maven.surefire.junit4.JUnit4Provider.execute(JUnit4Provider.java:264)
	at org.apache.maven.surefire.junit4.JUnit4Provider.executeTestSet(JUnit4Provider.java:153)
	at org.apache.maven.surefire.junit4.JUnit4Provider.invoke(JUnit4Provider.java:124)
	at sun.reflect.NativeMethodAccessorImpl.invoke0(Native Method)
	at sun.reflect.NativeMethodAccessorImpl.invoke(NativeMethodAccessorImpl.java:57)
	at sun.reflect.DelegatingMethodAccessorImpl.invoke(DelegatingMethodAccessorImpl.java:43)
	at java.lang.reflect.Method.invoke(Method.java:606)
	at org.apache.maven.surefire.util.ReflectionUtils.invokeMethodWithArray2(ReflectionUtils.java:208)
	at org.apache.maven.surefire.booter.ProviderFactory$ProviderProxy.invoke(ProviderFactory.java:156)
	at org.apache.maven.surefire.booter.ProviderFactory.invokeProvider(ProviderFactory.java:82)
	at org.eclipse.tycho.surefire.osgibooter.OsgiSurefireBooter.run(OsgiSurefireBooter.java:91)
	at org.eclipse.tycho.surefire.osgibooter.AbstractUITestApplication.runTests(AbstractUITestApplication.java:44)
	at org.eclipse.e4.ui.internal.workbench.swt.E4Testable$1.run(E4Testable.java:73)
	at java.lang.Thread.run(Thread.java:745)

testPerspectiveComplete(org.eclipse.tracecompass.lttng2.kernel.ui.swtbot.tests.KernelPerspectiveChecker)  Time elapsed: 0.557 sec
testPerspectiveForViews(org.eclipse.tracecompass.lttng2.kernel.ui.swtbot.tests.KernelPerspectiveChecker)  Time elapsed: 0.133 sec
test(org.eclipse.tracecompass.lttng2.kernel.ui.swtbot.tests.ImportAndReadKernelSmokeTest)  Time elapsed: 17.38 sec
testToolBarFollowCPUForwardBackward(org.eclipse.tracecompass.lttng2.kernel.ui.swtbot.tests.ControlFlowViewTest)  Time elapsed: 22.742 sec
testKeyboardLeftRight(org.eclipse.tracecompass.lttng2.kernel.ui.swtbot.tests.ControlFlowViewTest)  Time elapsed: 17.112 sec
testToolBarSelectNextPreviousEvent(org.eclipse.tracecompass.lttng2.kernel.ui.swtbot.tests.ControlFlowViewTest)  Time elapsed: 17.48 sec
testOpenAndCloseConcurrency(org.eclipse.tracecompass.lttng2.kernel.ui.swtbot.tests.OpenTraceStressTest)  Time elapsed: 50.34 sec
testNew(org.eclipse.tracecompass.tmf.ui.swtbot.tests.parsers.custom.TestCustomTxtWizard)  Time elapsed: 9.404 sec
testEdit(org.eclipse.tracecompass.tmf.ui.swtbot.tests.parsers.custom.TestCustomTxtWizard)  Time elapsed: 9.318 sec
testNew(org.eclipse.tracecompass.tmf.ui.swtbot.tests.parsers.custom.TestCustomXmlWizard)  Time elapsed: 8.356 sec
testPerspectiveComplete(org.eclipse.tracecompass.tmf.ui.swtbot.tests.perspectives.TracingPerspectiveChecker)  Time elapsed: 0.001 sec  <<< FAILURE!
java.lang.AssertionError: view org.eclipse.swtbot.eclipse.finder.widgets.SWTBotView@3b4217d is present
	at org.junit.Assert.fail(Assert.java:88)
	at org.junit.Assert.assertTrue(Assert.java:41)
	at org.eclipse.tracecompass.tmf.ui.swtbot.tests.shared.AbstractPerspectiveChecker.testPerspectiveComplete(AbstractPerspectiveChecker.java:118)
	at sun.reflect.GeneratedMethodAccessor156.invoke(Unknown Source)
	at sun.reflect.DelegatingMethodAccessorImpl.invoke(DelegatingMethodAccessorImpl.java:43)
	at java.lang.reflect.Method.invoke(Method.java:606)
	at org.junit.runners.model.FrameworkMethod$1.runReflectiveCall(FrameworkMethod.java:50)
	at org.junit.internal.runners.model.ReflectiveCallable.run(ReflectiveCallable.java:12)
	at org.junit.runners.model.FrameworkMethod.invokeExplosively(FrameworkMethod.java:47)
	at org.junit.internal.runners.statements.InvokeMethod.evaluate(InvokeMethod.java:17)
	at org.junit.internal.runners.statements.RunBefores.evaluate(RunBefores.java:26)
	at org.junit.runners.ParentRunner.runLeaf(ParentRunner.java:325)
	at org.junit.runners.BlockJUnit4ClassRunner.runChild(BlockJUnit4ClassRunner.java:78)
	at org.junit.runners.BlockJUnit4ClassRunner.runChild(BlockJUnit4ClassRunner.java:57)
	at org.junit.runners.ParentRunner$3.run(ParentRunner.java:290)
	at org.junit.runners.ParentRunner$1.schedule(ParentRunner.java:71)
	at org.junit.runners.ParentRunner.runChildren(ParentRunner.java:288)
	at org.junit.runners.ParentRunner.access$000(ParentRunner.java:58)
	at org.junit.runners.ParentRunner$2.evaluate(ParentRunner.java:268)
	at org.junit.internal.runners.statements.RunBefores.evaluate(RunBefores.java:26)
	at org.junit.internal.runners.statements.RunAfters.evaluate(RunAfters.java:27)
	at org.junit.runners.ParentRunner.run(ParentRunner.java:363)
	at org.eclipse.swtbot.swt.finder.junit.SWTBotJunit4ClassRunner.run(SWTBotJunit4ClassRunner.java:54)
	at org.junit.runners.Suite.runChild(Suite.java:128)
	at org.junit.runners.Suite.runChild(Suite.java:27)
	at org.junit.runners.ParentRunner$3.run(ParentRunner.java:290)
	at org.junit.runners.ParentRunner$1.schedule(ParentRunner.java:71)
	at org.junit.runners.ParentRunner.runChildren(ParentRunner.java:288)
	at org.junit.runners.ParentRunner.access$000(ParentRunner.java:58)
	at org.junit.runners.ParentRunner$2.evaluate(ParentRunner.java:268)
	at org.junit.runners.ParentRunner.run(ParentRunner.java:363)
	at org.junit.runners.Suite.runChild(Suite.java:128)
	at org.junit.runners.Suite.runChild(Suite.java:27)
	at org.junit.runners.ParentRunner$3.run(ParentRunner.java:290)
	at org.junit.runners.ParentRunner$1.schedule(ParentRunner.java:71)
	at org.junit.runners.ParentRunner.runChildren(ParentRunner.java:288)
	at org.junit.runners.ParentRunner.access$000(ParentRunner.java:58)
	at org.junit.runners.ParentRunner$2.evaluate(ParentRunner.java:268)
	at org.junit.runners.ParentRunner.run(ParentRunner.java:363)
	at org.junit.runners.Suite.runChild(Suite.java:128)
	at org.junit.runners.Suite.runChild(Suite.java:27)
	at org.junit.runners.ParentRunner$3.run(ParentRunner.java:290)
	at org.junit.runners.ParentRunner$1.schedule(ParentRunner.java:71)
	at org.junit.runners.ParentRunner.runChildren(ParentRunner.java:288)
	at org.junit.runners.ParentRunner.access$000(ParentRunner.java:58)
	at org.junit.runners.ParentRunner$2.evaluate(ParentRunner.java:268)
	at org.junit.runners.ParentRunner.run(ParentRunner.java:363)
	at org.apache.maven.surefire.junit4.JUnit4Provider.execute(JUnit4Provider.java:264)
	at org.apache.maven.surefire.junit4.JUnit4Provider.executeTestSet(JUnit4Provider.java:153)
	at org.apache.maven.surefire.junit4.JUnit4Provider.invoke(JUnit4Provider.java:124)
	at sun.reflect.NativeMethodAccessorImpl.invoke0(Native Method)
	at sun.reflect.NativeMethodAccessorImpl.invoke(NativeMethodAccessorImpl.java:57)
	at sun.reflect.DelegatingMethodAccessorImpl.invoke(DelegatingMethodAccessorImpl.java:43)
	at java.lang.reflect.Method.invoke(Method.java:606)
	at org.apache.maven.surefire.util.ReflectionUtils.invokeMethodWithArray2(ReflectionUtils.java:208)
	at org.apache.maven.surefire.booter.ProviderFactory$ProviderProxy.invoke(ProviderFactory.java:156)
	at org.apache.maven.surefire.booter.ProviderFactory.invokeProvider(ProviderFactory.java:82)
	at org.eclipse.tycho.surefire.osgibooter.OsgiSurefireBooter.run(OsgiSurefireBooter.java:91)
	at org.eclipse.tycho.surefire.osgibooter.AbstractUITestApplication.runTests(AbstractUITestApplication.java:44)
	at org.eclipse.e4.ui.internal.workbench.swt.E4Testable$1.run(E4Testable.java:73)
	at java.lang.Thread.run(Thread.java:745)

testPerspectiveForViews(org.eclipse.tracecompass.tmf.ui.swtbot.tests.perspectives.TracingPerspectiveChecker)  Time elapsed: 0.002 sec
test(org.eclipse.tracecompass.tmf.ui.swtbot.tests.viewers.events.CallsiteEventsInTableTest)  Time elapsed: 8.077 sec
test(org.eclipse.tracecompass.tmf.ui.swtbot.tests.viewers.events.CollapseEventsInTableTest)  Time elapsed: 9.442 sec
testYellow(org.eclipse.tracecompass.tmf.ui.swtbot.tests.viewers.events.ColorsViewTest)  Time elapsed: 7.575 sec
testToggleColumns(org.eclipse.tracecompass.tmf.ui.swtbot.tests.viewers.events.ColumnHeaderMenuTest)  Time elapsed: 3.496 sec
testShowAll(org.eclipse.tracecompass.tmf.ui.swtbot.tests.viewers.events.ColumnHeaderMenuTest)  Time elapsed: 3.002 sec
testNoCopySearchRow(org.eclipse.tracecompass.tmf.ui.swtbot.tests.viewers.events.CopyToClipboardTest)  Time elapsed: 3.797 sec
testCopySingleSelection(org.eclipse.tracecompass.tmf.ui.swtbot.tests.viewers.events.CopyToClipboardTest)  Time elapsed: 3.079 sec
testCopyMultipleSelection(org.eclipse.tracecompass.tmf.ui.swtbot.tests.viewers.events.CopyToClipboardTest)  Time elapsed: 3.257 sec
testMultiHighlightMessage(org.eclipse.tracecompass.tmf.ui.swtbot.tests.viewers.events.FilterColorEditorTest)  Time elapsed: 7.871 sec
testSwitchToFilter(org.eclipse.tracecompass.tmf.ui.swtbot.tests.viewers.events.FilterColorEditorTest)  Time elapsed: 8.11 sec
testHighlight(org.eclipse.tracecompass.tmf.ui.swtbot.tests.viewers.events.FilterColorEditorTest)  Time elapsed: 8.219 sec
testPreference(org.eclipse.tracecompass.tmf.ui.swtbot.tests.viewers.events.FilterColorEditorTest)  Time elapsed: 8.159 sec
testTimestampFilter(org.eclipse.tracecompass.tmf.ui.swtbot.tests.viewers.events.FilterViewerTest)  Time elapsed: 3.5 sec  <<< ERROR!
org.eclipse.swt.SWTException: Failed to execute runnable (org.eclipse.swtbot.swt.finder.exceptions.WidgetNotFoundException: Could not find menu: TRACETYPE)
	at org.eclipse.swt.SWT.error(SWT.java:4491)
	at org.eclipse.swt.SWT.error(SWT.java:4406)
	at org.eclipse.swt.widgets.Synchronizer.syncExec(Synchronizer.java:208)
	at org.eclipse.ui.internal.UISynchronizer.syncExec(UISynchronizer.java:145)
	at org.eclipse.swt.widgets.Display.syncExec(Display.java:4633)
	at org.eclipse.swtbot.swt.finder.finders.UIThreadRunnable.run(UIThreadRunnable.java:76)
	at org.eclipse.swtbot.swt.finder.finders.UIThreadRunnable.syncExec(UIThreadRunnable.java:142)
	at org.eclipse.swtbot.swt.finder.finders.UIThreadRunnable.syncExec(UIThreadRunnable.java:125)
	at org.eclipse.swtbot.swt.finder.finders.ContextMenuHelper.contextMenu(ContextMenuHelper.java:42)
	at org.eclipse.swtbot.swt.finder.widgets.SWTBotTreeItem.contextMenu(SWTBotTreeItem.java:558)
	at org.eclipse.tracecompass.tmf.ui.swtbot.tests.viewers.events.FilterViewerTest.testTimestampFilter(FilterViewerTest.java:165)
Caused by: org.eclipse.swtbot.swt.finder.exceptions.WidgetNotFoundException: Could not find menu: TRACETYPE
	at org.eclipse.swtbot.swt.finder.finders.ContextMenuHelper$1.run(ContextMenuHelper.java:63)
	at org.eclipse.swtbot.swt.finder.finders.ContextMenuHelper$1.run(ContextMenuHelper.java:1)
	at org.eclipse.swtbot.swt.finder.finders.UIThreadRunnable$2.doRun(UIThreadRunnable.java:140)
	at org.eclipse.swtbot.swt.finder.finders.UIThreadRunnable$1.run(UIThreadRunnable.java:89)
	at org.eclipse.swt.widgets.RunnableLock.run(RunnableLock.java:35)
	at org.eclipse.swt.widgets.Synchronizer.runAsyncMessages(Synchronizer.java:135)
	at org.eclipse.swt.widgets.Display.runAsyncMessages(Display.java:3794)
	at org.eclipse.swt.widgets.Display.readAndDispatch(Display.java:3433)
	at org.eclipse.e4.ui.internal.workbench.swt.PartRenderingEngine$4.run(PartRenderingEngine.java:1127)
	at org.eclipse.core.databinding.observable.Realm.runWithDefault(Realm.java:337)
	at org.eclipse.e4.ui.internal.workbench.swt.PartRenderingEngine.run(PartRenderingEngine.java:1018)
	at org.eclipse.e4.ui.internal.workbench.E4Workbench.createAndRunUI(E4Workbench.java:156)
	at org.eclipse.ui.internal.Workbench$5.run(Workbench.java:654)
	at org.eclipse.core.databinding.observable.Realm.runWithDefault(Realm.java:337)
	at org.eclipse.ui.internal.Workbench.createAndRunWorkbench(Workbench.java:598)
	at org.eclipse.ui.PlatformUI.createAndRunWorkbench(PlatformUI.java:150)
	at org.eclipse.ui.internal.ide.application.IDEApplication.start(IDEApplication.java:139)
	at org.eclipse.tycho.surefire.osgibooter.UITestApplication.runApplication(UITestApplication.java:31)
	at org.eclipse.tycho.surefire.osgibooter.AbstractUITestApplication.run(AbstractUITestApplication.java:120)
	at org.eclipse.tycho.surefire.osgibooter.UITestApplication.start(UITestApplication.java:37)
	at org.eclipse.equinox.internal.app.EclipseAppHandle.run(EclipseAppHandle.java:196)
	at org.eclipse.core.runtime.internal.adaptor.EclipseAppLauncher.runApplication(EclipseAppLauncher.java:134)
	at org.eclipse.core.runtime.internal.adaptor.EclipseAppLauncher.start(EclipseAppLauncher.java:104)
	at org.eclipse.core.runtime.adaptor.EclipseStarter.run(EclipseStarter.java:380)
	at org.eclipse.core.runtime.adaptor.EclipseStarter.run(EclipseStarter.java:235)
	at sun.reflect.NativeMethodAccessorImpl.invoke0(Native Method)
	at sun.reflect.NativeMethodAccessorImpl.invoke(NativeMethodAccessorImpl.java:57)
	at sun.reflect.DelegatingMethodAccessorImpl.invoke(DelegatingMethodAccessorImpl.java:43)
	at java.lang.reflect.Method.invoke(Method.java:606)
	at org.eclipse.equinox.launcher.Main.invokeFramework(Main.java:669)
	at org.eclipse.equinox.launcher.Main.basicRun(Main.java:608)
	at org.eclipse.equinox.launcher.Main.run(Main.java:1515)
	at org.eclipse.equinox.launcher.Main.main(Main.java:1488)

testField01(org.eclipse.tracecompass.tmf.ui.swtbot.tests.viewers.events.FilterViewerTest)  Time elapsed: 3.332 sec  <<< ERROR!
org.eclipse.swt.SWTException: Failed to execute runnable (org.eclipse.swtbot.swt.finder.exceptions.WidgetNotFoundException: Could not find menu: TRACETYPE)
	at org.eclipse.swt.SWT.error(SWT.java:4491)
	at org.eclipse.swt.SWT.error(SWT.java:4406)
	at org.eclipse.swt.widgets.Synchronizer.syncExec(Synchronizer.java:208)
	at org.eclipse.ui.internal.UISynchronizer.syncExec(UISynchronizer.java:145)
	at org.eclipse.swt.widgets.Display.syncExec(Display.java:4633)
	at org.eclipse.swtbot.swt.finder.finders.UIThreadRunnable.run(UIThreadRunnable.java:76)
	at org.eclipse.swtbot.swt.finder.finders.UIThreadRunnable.syncExec(UIThreadRunnable.java:142)
	at org.eclipse.swtbot.swt.finder.finders.UIThreadRunnable.syncExec(UIThreadRunnable.java:125)
	at org.eclipse.swtbot.swt.finder.finders.ContextMenuHelper.contextMenu(ContextMenuHelper.java:42)
	at org.eclipse.swtbot.swt.finder.widgets.SWTBotTreeItem.contextMenu(SWTBotTreeItem.java:558)
	at org.eclipse.tracecompass.tmf.ui.swtbot.tests.viewers.events.FilterViewerTest.testField01(FilterViewerTest.java:282)
Caused by: org.eclipse.swtbot.swt.finder.exceptions.WidgetNotFoundException: Could not find menu: TRACETYPE
	at org.eclipse.swtbot.swt.finder.finders.ContextMenuHelper$1.run(ContextMenuHelper.java:63)
	at org.eclipse.swtbot.swt.finder.finders.ContextMenuHelper$1.run(ContextMenuHelper.java:1)
	at org.eclipse.swtbot.swt.finder.finders.UIThreadRunnable$2.doRun(UIThreadRunnable.java:140)
	at org.eclipse.swtbot.swt.finder.finders.UIThreadRunnable$1.run(UIThreadRunnable.java:89)
	at org.eclipse.swt.widgets.RunnableLock.run(RunnableLock.java:35)
	at org.eclipse.swt.widgets.Synchronizer.runAsyncMessages(Synchronizer.java:135)
	at org.eclipse.swt.widgets.Display.runAsyncMessages(Display.java:3794)
	at org.eclipse.swt.widgets.Display.readAndDispatch(Display.java:3433)
	at org.eclipse.e4.ui.internal.workbench.swt.PartRenderingEngine$4.run(PartRenderingEngine.java:1127)
	at org.eclipse.core.databinding.observable.Realm.runWithDefault(Realm.java:337)
	at org.eclipse.e4.ui.internal.workbench.swt.PartRenderingEngine.run(PartRenderingEngine.java:1018)
	at org.eclipse.e4.ui.internal.workbench.E4Workbench.createAndRunUI(E4Workbench.java:156)
	at org.eclipse.ui.internal.Workbench$5.run(Workbench.java:654)
	at org.eclipse.core.databinding.observable.Realm.runWithDefault(Realm.java:337)
	at org.eclipse.ui.internal.Workbench.createAndRunWorkbench(Workbench.java:598)
	at org.eclipse.ui.PlatformUI.createAndRunWorkbench(PlatformUI.java:150)
	at org.eclipse.ui.internal.ide.application.IDEApplication.start(IDEApplication.java:139)
	at org.eclipse.tycho.surefire.osgibooter.UITestApplication.runApplication(UITestApplication.java:31)
	at org.eclipse.tycho.surefire.osgibooter.AbstractUITestApplication.run(AbstractUITestApplication.java:120)
	at org.eclipse.tycho.surefire.osgibooter.UITestApplication.start(UITestApplication.java:37)
	at org.eclipse.equinox.internal.app.EclipseAppHandle.run(EclipseAppHandle.java:196)
	at org.eclipse.core.runtime.internal.adaptor.EclipseAppLauncher.runApplication(EclipseAppLauncher.java:134)
	at org.eclipse.core.runtime.internal.adaptor.EclipseAppLauncher.start(EclipseAppLauncher.java:104)
	at org.eclipse.core.runtime.adaptor.EclipseStarter.run(EclipseStarter.java:380)
	at org.eclipse.core.runtime.adaptor.EclipseStarter.run(EclipseStarter.java:235)
	at sun.reflect.NativeMethodAccessorImpl.invoke0(Native Method)
	at sun.reflect.NativeMethodAccessorImpl.invoke(NativeMethodAccessorImpl.java:57)
	at sun.reflect.DelegatingMethodAccessorImpl.invoke(DelegatingMethodAccessorImpl.java:43)
	at java.lang.reflect.Method.invoke(Method.java:606)
	at org.eclipse.equinox.launcher.Main.invokeFramework(Main.java:669)
	at org.eclipse.equinox.launcher.Main.basicRun(Main.java:608)
	at org.eclipse.equinox.launcher.Main.run(Main.java:1515)
	at org.eclipse.equinox.launcher.Main.main(Main.java:1488)

testTimestampEqualsOr(org.eclipse.tracecompass.tmf.ui.swtbot.tests.viewers.events.FilterViewerTest)  Time elapsed: 3.243 sec  <<< ERROR!
org.eclipse.swt.SWTException: Failed to execute runnable (org.eclipse.swtbot.swt.finder.exceptions.WidgetNotFoundException: Could not find menu: TRACETYPE)
	at org.eclipse.swt.SWT.error(SWT.java:4491)
	at org.eclipse.swt.SWT.error(SWT.java:4406)
	at org.eclipse.swt.widgets.Synchronizer.syncExec(Synchronizer.java:208)
	at org.eclipse.ui.internal.UISynchronizer.syncExec(UISynchronizer.java:145)
	at org.eclipse.swt.widgets.Display.syncExec(Display.java:4633)
	at org.eclipse.swtbot.swt.finder.finders.UIThreadRunnable.run(UIThreadRunnable.java:76)
	at org.eclipse.swtbot.swt.finder.finders.UIThreadRunnable.syncExec(UIThreadRunnable.java:142)
	at org.eclipse.swtbot.swt.finder.finders.UIThreadRunnable.syncExec(UIThreadRunnable.java:125)
	at org.eclipse.swtbot.swt.finder.finders.ContextMenuHelper.contextMenu(ContextMenuHelper.java:42)
	at org.eclipse.swtbot.swt.finder.widgets.SWTBotTreeItem.contextMenu(SWTBotTreeItem.java:558)
	at org.eclipse.tracecompass.tmf.ui.swtbot.tests.viewers.events.FilterViewerTest.testTimestampEqualsOr(FilterViewerTest.java:215)
Caused by: org.eclipse.swtbot.swt.finder.exceptions.WidgetNotFoundException: Could not find menu: TRACETYPE
	at org.eclipse.swtbot.swt.finder.finders.ContextMenuHelper$1.run(ContextMenuHelper.java:63)
	at org.eclipse.swtbot.swt.finder.finders.ContextMenuHelper$1.run(ContextMenuHelper.java:1)
	at org.eclipse.swtbot.swt.finder.finders.UIThreadRunnable$2.doRun(UIThreadRunnable.java:140)
	at org.eclipse.swtbot.swt.finder.finders.UIThreadRunnable$1.run(UIThreadRunnable.java:89)
	at org.eclipse.swt.widgets.RunnableLock.run(RunnableLock.java:35)
	at org.eclipse.swt.widgets.Synchronizer.runAsyncMessages(Synchronizer.java:135)
	at org.eclipse.swt.widgets.Display.runAsyncMessages(Display.java:3794)
	at org.eclipse.swt.widgets.Display.readAndDispatch(Display.java:3433)
	at org.eclipse.e4.ui.internal.workbench.swt.PartRenderingEngine$4.run(PartRenderingEngine.java:1127)
	at org.eclipse.core.databinding.observable.Realm.runWithDefault(Realm.java:337)
	at org.eclipse.e4.ui.internal.workbench.swt.PartRenderingEngine.run(PartRenderingEngine.java:1018)
	at org.eclipse.e4.ui.internal.workbench.E4Workbench.createAndRunUI(E4Workbench.java:156)
	at org.eclipse.ui.internal.Workbench$5.run(Workbench.java:654)
	at org.eclipse.core.databinding.observable.Realm.runWithDefault(Realm.java:337)
	at org.eclipse.ui.internal.Workbench.createAndRunWorkbench(Workbench.java:598)
	at org.eclipse.ui.PlatformUI.createAndRunWorkbench(PlatformUI.java:150)
	at org.eclipse.ui.internal.ide.application.IDEApplication.start(IDEApplication.java:139)
	at org.eclipse.tycho.surefire.osgibooter.UITestApplication.runApplication(UITestApplication.java:31)
	at org.eclipse.tycho.surefire.osgibooter.AbstractUITestApplication.run(AbstractUITestApplication.java:120)
	at org.eclipse.tycho.surefire.osgibooter.UITestApplication.start(UITestApplication.java:37)
	at org.eclipse.equinox.internal.app.EclipseAppHandle.run(EclipseAppHandle.java:196)
	at org.eclipse.core.runtime.internal.adaptor.EclipseAppLauncher.runApplication(EclipseAppLauncher.java:134)
	at org.eclipse.core.runtime.internal.adaptor.EclipseAppLauncher.start(EclipseAppLauncher.java:104)
	at org.eclipse.core.runtime.adaptor.EclipseStarter.run(EclipseStarter.java:380)
	at org.eclipse.core.runtime.adaptor.EclipseStarter.run(EclipseStarter.java:235)
	at sun.reflect.NativeMethodAccessorImpl.invoke0(Native Method)
	at sun.reflect.NativeMethodAccessorImpl.invoke(NativeMethodAccessorImpl.java:57)
	at sun.reflect.DelegatingMethodAccessorImpl.invoke(DelegatingMethodAccessorImpl.java:43)
	at java.lang.reflect.Method.invoke(Method.java:606)
	at org.eclipse.equinox.launcher.Main.invokeFramework(Main.java:669)
	at org.eclipse.equinox.launcher.Main.basicRun(Main.java:608)
	at org.eclipse.equinox.launcher.Main.run(Main.java:1515)
	at org.eclipse.equinox.launcher.Main.main(Main.java:1488)

testChangeFont(org.eclipse.tracecompass.tmf.ui.swtbot.tests.viewers.events.FontEventEditorTest)  Time elapsed: 9.178 sec
testReorder(org.eclipse.tracecompass.tmf.ui.swtbot.tests.viewers.events.MovableColumnEventsEditorTest)  Time elapsed: 11.93 sec
testSDView(org.eclipse.tracecompass.tmf.ui.swtbot.tests.viewers.events.SDViewTest)  Time elapsed: 5.442 sec
testOffsetting(org.eclipse.tracecompass.tmf.ui.swtbot.tests.viewers.events.TestTraceOffsetting)  Time elapsed: 10.666 sec
testOverlappingTimechartMove(org.eclipse.tracecompass.tmf.ui.swtbot.tests.viewers.events.TmfAlignTimeAxisTest)  Time elapsed: 5.308 sec
testNotOverlappingCallstackMove(org.eclipse.tracecompass.tmf.ui.swtbot.tests.viewers.events.TmfAlignTimeAxisTest)  Time elapsed: 5.232 sec
testMoveHistogramCallstackFollows(org.eclipse.tracecompass.tmf.ui.swtbot.tests.viewers.events.TmfAlignTimeAxisTest)  Time elapsed: 5.253 sec
testOverlappingHistogramMove(org.eclipse.tracecompass.tmf.ui.swtbot.tests.viewers.events.TmfAlignTimeAxisTest)  Time elapsed: 5.431 sec
testNotOverlappingHistogramMove(org.eclipse.tracecompass.tmf.ui.swtbot.tests.viewers.events.TmfAlignTimeAxisTest)  Time elapsed: 5.246 sec
testMoveCallstackHistogramFollows(org.eclipse.tracecompass.tmf.ui.swtbot.tests.viewers.events.TmfAlignTimeAxisTest)  Time elapsed: 5.258 sec
testGzipImport(org.eclipse.tracecompass.tmf.ui.swtbot.tests.wizards.StandardImportGzipTraceTest)  Time elapsed: 6.327 sec
test(org.eclipse.tracecompass.tmf.ctf.ui.swtbot.tests.ImportAndReadSmokeTest)  Time elapsed: 12.666 sec
testImportFromDirectory(org.eclipse.tracecompass.tmf.ctf.ui.swtbot.tests.StandardImportAndReadSmokeTest)  Time elapsed: 7.898 sec
testExtractArchivesFromArchive(org.eclipse.tracecompass.tmf.ctf.ui.swtbot.tests.StandardImportAndReadSmokeTest)  Time elapsed: 18.986 sec
testImportFromDirectoryLinksPreserveFolder(org.eclipse.tracecompass.tmf.ctf.ui.swtbot.tests.StandardImportAndReadSmokeTest)  Time elapsed: 8.538 sec
testExtractArchivesFromArchivePreserveFolder(org.eclipse.tracecompass.tmf.ctf.ui.swtbot.tests.StandardImportAndReadSmokeTest)  Time elapsed: 19.88 sec
testExtractArchivesFromDirectory(org.eclipse.tracecompass.tmf.ctf.ui.swtbot.tests.StandardImportAndReadSmokeTest)  Time elapsed: 15.203 sec
testImportFromArchive(org.eclipse.tracecompass.tmf.ctf.ui.swtbot.tests.StandardImportAndReadSmokeTest)  Time elapsed: 12.776 sec
testExtractArchivesFromDirectoryLinksPreserveStruture(org.eclipse.tracecompass.tmf.ctf.ui.swtbot.tests.StandardImportAndReadSmokeTest)  Time elapsed: 13.796 sec
testEmptyDirectory(org.eclipse.tracecompass.tmf.ctf.ui.swtbot.tests.StandardImportAndReadSmokeTest)  Time elapsed: 6.181 sec
testEmptyArchive(org.eclipse.tracecompass.tmf.ctf.ui.swtbot.tests.StandardImportAndReadSmokeTest)  Time elapsed: 10.057 sec
testNestedEmptyArchive(org.eclipse.tracecompass.tmf.ctf.ui.swtbot.tests.StandardImportAndReadSmokeTest)  Time elapsed: 13.287 sec
testImportFromArchiveOverwrite(org.eclipse.tracecompass.tmf.ctf.ui.swtbot.tests.StandardImportAndReadSmokeTest)  Time elapsed: 16.881 sec
testDirectoryWithEmptyArchive(org.eclipse.tracecompass.tmf.ctf.ui.swtbot.tests.StandardImportAndReadSmokeTest)  Time elapsed: 9.656 sec
testImportFromDirectoryPreserveFolder(org.eclipse.tracecompass.tmf.ctf.ui.swtbot.tests.StandardImportAndReadSmokeTest)  Time elapsed: 8.672 sec
testImportFromDirectoryLinks(org.eclipse.tracecompass.tmf.ctf.ui.swtbot.tests.StandardImportAndReadSmokeTest)  Time elapsed: 7.721 sec
testImportFromDirectoryOverwrite(org.eclipse.tracecompass.tmf.ctf.ui.swtbot.tests.StandardImportAndReadSmokeTest)  Time elapsed: 15.672 sec
testExtractArchivesFromDirectoryLinks(org.eclipse.tracecompass.tmf.ctf.ui.swtbot.tests.StandardImportAndReadSmokeTest)  Time elapsed: 13.18 sec
testImportFromArchivePreserveFolder(org.eclipse.tracecompass.tmf.ctf.ui.swtbot.tests.StandardImportAndReadSmokeTest)  Time elapsed: 8.472 sec
testOpen[0: ../../ctf/org.eclipse.tracecompass.ctf.core.tests/traces/ctf-testsuite/tests/1.8/regression/metadata/fail/struct-align-negative](org.eclipse.tracecompass.tmf.ctf.ui.swtbot.tests.TestInvalidCtfTrace)  Time elapsed: 5.307 sec
testOpen[1: ../../ctf/org.eclipse.tracecompass.ctf.core.tests/traces/ctf-testsuite/tests/1.8/regression/metadata/fail/array-size-identifier](org.eclipse.tracecompass.tmf.ctf.ui.swtbot.tests.TestInvalidCtfTrace)  Time elapsed: 5.227 sec
testOpen[2: ../../ctf/org.eclipse.tracecompass.ctf.core.tests/traces/ctf-testsuite/tests/1.8/regression/metadata/fail/struct-align-huge](org.eclipse.tracecompass.tmf.ctf.ui.swtbot.tests.TestInvalidCtfTrace)  Time elapsed: 5.07 sec
testOpen[3: ../../ctf/org.eclipse.tracecompass.ctf.core.tests/traces/ctf-testsuite/tests/1.8/regression/metadata/fail/integer-signed-as-string](org.eclipse.tracecompass.tmf.ctf.ui.swtbot.tests.TestInvalidCtfTrace)  Time elapsed: 4.938 sec
testOpen[4: ../../ctf/org.eclipse.tracecompass.ctf.core.tests/traces/ctf-testsuite/tests/1.8/regression/metadata/fail/array-size-keyword](org.eclipse.tracecompass.tmf.ctf.ui.swtbot.tests.TestInvalidCtfTrace)  Time elapsed: 4.845 sec
testOpen[5: ../../ctf/org.eclipse.tracecompass.ctf.core.tests/traces/ctf-testsuite/tests/1.8/regression/metadata/fail/integer-range](org.eclipse.tracecompass.tmf.ctf.ui.swtbot.tests.TestInvalidCtfTrace)  Time elapsed: 5.186 sec
testOpen[6: ../../ctf/org.eclipse.tracecompass.ctf.core.tests/traces/ctf-testsuite/tests/1.8/regression/metadata/fail/integer-signed-invalid](org.eclipse.tracecompass.tmf.ctf.ui.swtbot.tests.TestInvalidCtfTrace)  Time elapsed: 5.157 sec
testOpen[7: ../../ctf/org.eclipse.tracecompass.ctf.core.tests/traces/ctf-testsuite/tests/1.8/regression/metadata/fail/struct-align-string](org.eclipse.tracecompass.tmf.ctf.ui.swtbot.tests.TestInvalidCtfTrace)  Time elapsed: 4.887 sec
testOpen[8: ../../ctf/org.eclipse.tracecompass.ctf.core.tests/traces/ctf-testsuite/tests/1.8/regression/metadata/fail/array-size-type-field](org.eclipse.tracecompass.tmf.ctf.ui.swtbot.tests.TestInvalidCtfTrace)  Time elapsed: 4.954 sec
testOpen[9: ../../ctf/org.eclipse.tracecompass.ctf.core.tests/traces/ctf-testsuite/tests/1.8/regression/metadata/fail/struct-duplicate-struct-name](org.eclipse.tracecompass.tmf.ctf.ui.swtbot.tests.TestInvalidCtfTrace)  Time elapsed: 4.849 sec
testOpen[10: ../../ctf/org.eclipse.tracecompass.ctf.core.tests/traces/ctf-testsuite/tests/1.8/regression/metadata/fail/integer-encoding-invalid](org.eclipse.tracecompass.tmf.ctf.ui.swtbot.tests.TestInvalidCtfTrace)  Time elapsed: 4.834 sec
testOpen[11: ../../ctf/org.eclipse.tracecompass.ctf.core.tests/traces/ctf-testsuite/tests/1.8/regression/metadata/fail/integer-size-as-string](org.eclipse.tracecompass.tmf.ctf.ui.swtbot.tests.TestInvalidCtfTrace)  Time elapsed: 4.629 sec
testOpen[12: ../../ctf/org.eclipse.tracecompass.ctf.core.tests/traces/ctf-testsuite/tests/1.8/regression/metadata/fail/array-size-type](org.eclipse.tracecompass.tmf.ctf.ui.swtbot.tests.TestInvalidCtfTrace)  Time elapsed: 4.902 sec
testOpen[13: ../../ctf/org.eclipse.tracecompass.ctf.core.tests/traces/ctf-testsuite/tests/1.8/regression/metadata/fail/array-size-not-present](org.eclipse.tracecompass.tmf.ctf.ui.swtbot.tests.TestInvalidCtfTrace)  Time elapsed: 4.9 sec
testOpen[14: ../../ctf/org.eclipse.tracecompass.ctf.core.tests/traces/ctf-testsuite/tests/1.8/regression/metadata/fail/struct-duplicate-field-name](org.eclipse.tracecompass.tmf.ctf.ui.swtbot.tests.TestInvalidCtfTrace)  Time elapsed: 5.184 sec
testOpen[15: ../../ctf/org.eclipse.tracecompass.ctf.core.tests/traces/ctf-testsuite/tests/1.8/regression/metadata/fail/array-size-string](org.eclipse.tracecompass.tmf.ctf.ui.swtbot.tests.TestInvalidCtfTrace)  Time elapsed: 5.059 sec
testOpen[16: ../../ctf/org.eclipse.tracecompass.ctf.core.tests/traces/ctf-testsuite/tests/1.8/regression/metadata/fail/integer-size-missing](org.eclipse.tracecompass.tmf.ctf.ui.swtbot.tests.TestInvalidCtfTrace)  Time elapsed: 4.862 sec
testOpen[17: ../../ctf/org.eclipse.tracecompass.ctf.core.tests/traces/ctf-testsuite/tests/1.8/regression/metadata/fail/integer-negative-bit-size](org.eclipse.tracecompass.tmf.ctf.ui.swtbot.tests.TestInvalidCtfTrace)  Time elapsed: 5.071 sec
testOpen[18: ../../ctf/org.eclipse.tracecompass.ctf.core.tests/traces/ctf-testsuite/tests/1.8/regression/metadata/fail/struct-align-enum](org.eclipse.tracecompass.tmf.ctf.ui.swtbot.tests.TestInvalidCtfTrace)  Time elapsed: 5.263 sec
testOpen[19: ../../ctf/org.eclipse.tracecompass.ctf.core.tests/traces/ctf-testsuite/tests/1.8/regression/metadata/fail/integer-encoding-as-string](org.eclipse.tracecompass.tmf.ctf.ui.swtbot.tests.TestInvalidCtfTrace)  Time elapsed: 5.004 sec
testOpen[20: ../../ctf/org.eclipse.tracecompass.ctf.core.tests/traces/ctf-testsuite/tests/1.8/regression/metadata/fail/struct-align-zero](org.eclipse.tracecompass.tmf.ctf.ui.swtbot.tests.TestInvalidCtfTrace)  Time elapsed: 5.394 sec
testOpen[21: ../../ctf/org.eclipse.tracecompass.ctf.core.tests/traces/ctf-testsuite/tests/1.8/regression/metadata/fail/array-redefinition](org.eclipse.tracecompass.tmf.ctf.ui.swtbot.tests.TestInvalidCtfTrace)  Time elapsed: 5.135 sec
testOpen[22: ../../ctf/org.eclipse.tracecompass.ctf.core.tests/traces/ctf-testsuite/tests/1.8/regression/metadata/fail/array-size-negative](org.eclipse.tracecompass.tmf.ctf.ui.swtbot.tests.TestInvalidCtfTrace)  Time elapsed: 4.787 sec
testOpen[23: ../../ctf/org.eclipse.tracecompass.ctf.core.tests/traces/ctf-testsuite/tests/1.8/regression/metadata/fail/struct-field-name-keyword](org.eclipse.tracecompass.tmf.ctf.ui.swtbot.tests.TestInvalidCtfTrace)  Time elapsed: 5.354 sec
test(org.eclipse.tracecompass.tmf.pcap.ui.swtbot.tests.ImportAndReadPcapTest)  Time elapsed: 29.49 sec
testPerspectiveComplete(org.eclipse.tracecompass.tmf.pcap.ui.swtbot.tests.NetworkPerspectiveChecker)  Time elapsed: 0.001 sec
testPerspectiveForViews(org.eclipse.tracecompass.tmf.pcap.ui.swtbot.tests.NetworkPerspectiveChecker)  Time elapsed: 0.008 sec
org.eclipse.tracecompass.tmf.remote.ui.swtbot.tests.fetch.FetchRemoteTracesTest  Time elapsed: 0.009 sec  <<< ERROR!
java.lang.NoClassDefFoundError: Could not initialize class org.eclipse.tracecompass.tmf.remote.ui.swtbot.tests.fetch.FetchRemoteTracesTest
	at sun.reflect.GeneratedMethodAccessor262.invoke(Unknown Source)
	at sun.reflect.DelegatingMethodAccessorImpl.invoke(DelegatingMethodAccessorImpl.java:43)
	at java.lang.reflect.Method.invoke(Method.java:606)
	at org.junit.runners.model.FrameworkMethod$1.runReflectiveCall(FrameworkMethod.java:50)
	at org.junit.internal.runners.model.ReflectiveCallable.run(ReflectiveCallable.java:12)
	at org.junit.runners.model.FrameworkMethod.invokeExplosively(FrameworkMethod.java:47)
	at org.junit.internal.runners.statements.RunBefores.evaluate(RunBefores.java:24)
	at org.junit.runners.ParentRunner.run(ParentRunner.java:363)
	at org.eclipse.swtbot.swt.finder.junit.SWTBotJunit4ClassRunner.run(SWTBotJunit4ClassRunner.java:54)
	at org.junit.runners.Suite.runChild(Suite.java:128)
	at org.junit.runners.Suite.runChild(Suite.java:27)
	at org.junit.runners.ParentRunner$3.run(ParentRunner.java:290)
	at org.junit.runners.ParentRunner$1.schedule(ParentRunner.java:71)
	at org.junit.runners.ParentRunner.runChildren(ParentRunner.java:288)
	at org.junit.runners.ParentRunner.access$000(ParentRunner.java:58)
	at org.junit.runners.ParentRunner$2.evaluate(ParentRunner.java:268)
	at org.junit.runners.ParentRunner.run(ParentRunner.java:363)
	at org.junit.runners.Suite.runChild(Suite.java:128)
	at org.junit.runners.Suite.runChild(Suite.java:27)
	at org.junit.runners.ParentRunner$3.run(ParentRunner.java:290)
	at org.junit.runners.ParentRunner$1.schedule(ParentRunner.java:71)
	at org.junit.runners.ParentRunner.runChildren(ParentRunner.java:288)
	at org.junit.runners.ParentRunner.access$000(ParentRunner.java:58)
	at org.junit.runners.ParentRunner$2.evaluate(ParentRunner.java:268)
	at org.junit.runners.ParentRunner.run(ParentRunner.java:363)
	at org.junit.runners.Suite.runChild(Suite.java:128)
	at org.junit.runners.Suite.runChild(Suite.java:27)
	at org.junit.runners.ParentRunner$3.run(ParentRunner.java:290)
	at org.junit.runners.ParentRunner$1.schedule(ParentRunner.java:71)
	at org.junit.runners.ParentRunner.runChildren(ParentRunner.java:288)
	at org.junit.runners.ParentRunner.access$000(ParentRunner.java:58)
	at org.junit.runners.ParentRunner$2.evaluate(ParentRunner.java:268)
	at org.junit.runners.ParentRunner.run(ParentRunner.java:363)
	at org.apache.maven.surefire.junit4.JUnit4Provider.execute(JUnit4Provider.java:264)
	at org.apache.maven.surefire.junit4.JUnit4Provider.executeTestSet(JUnit4Provider.java:153)
	at org.apache.maven.surefire.junit4.JUnit4Provider.invoke(JUnit4Provider.java:124)
	at sun.reflect.NativeMethodAccessorImpl.invoke0(Native Method)
	at sun.reflect.NativeMethodAccessorImpl.invoke(NativeMethodAccessorImpl.java:57)
	at sun.reflect.DelegatingMethodAccessorImpl.invoke(DelegatingMethodAccessorImpl.java:43)
	at java.lang.reflect.Method.invoke(Method.java:606)
	at org.apache.maven.surefire.util.ReflectionUtils.invokeMethodWithArray2(ReflectionUtils.java:208)
	at org.apache.maven.surefire.booter.ProviderFactory$ProviderProxy.invoke(ProviderFactory.java:156)
	at org.apache.maven.surefire.booter.ProviderFactory.invokeProvider(ProviderFactory.java:82)
	at org.eclipse.tycho.surefire.osgibooter.OsgiSurefireBooter.run(OsgiSurefireBooter.java:91)
	at org.eclipse.tycho.surefire.osgibooter.AbstractUITestApplication.runTests(AbstractUITestApplication.java:44)
	at org.eclipse.e4.ui.internal.workbench.swt.E4Testable$1.run(E4Testable.java:73)
	at java.lang.Thread.run(Thread.java:745)

testPerspectiveComplete(org.eclipse.tracecompass.lttng2.kernel.ui.swtbot.tests.KernelPerspectiveChecker)  Time elapsed: 0.571 sec
testPerspectiveForViews(org.eclipse.tracecompass.lttng2.kernel.ui.swtbot.tests.KernelPerspectiveChecker)  Time elapsed: 0.003 sec
test(org.eclipse.tracecompass.lttng2.kernel.ui.swtbot.tests.ImportAndReadKernelSmokeTest)  Time elapsed: 27.636 sec
testToolBarFollowCPUForwardBackward(org.eclipse.tracecompass.lttng2.kernel.ui.swtbot.tests.ControlFlowViewTest)  Time elapsed: 25.907 sec
testKeyboardLeftRight(org.eclipse.tracecompass.lttng2.kernel.ui.swtbot.tests.ControlFlowViewTest)  Time elapsed: 17.571 sec
testToolBarSelectNextPreviousEvent(org.eclipse.tracecompass.lttng2.kernel.ui.swtbot.tests.ControlFlowViewTest)  Time elapsed: 19.269 sec
testOpenAndCloseConcurrency(org.eclipse.tracecompass.lttng2.kernel.ui.swtbot.tests.OpenTraceStressTest)  Time elapsed: 55.04 sec
testNew(org.eclipse.tracecompass.tmf.ui.swtbot.tests.parsers.custom.TestCustomTxtWizard)  Time elapsed: 10.232 sec
testEdit(org.eclipse.tracecompass.tmf.ui.swtbot.tests.parsers.custom.TestCustomTxtWizard)  Time elapsed: 9.945 sec
testNew(org.eclipse.tracecompass.tmf.ui.swtbot.tests.parsers.custom.TestCustomXmlWizard)  Time elapsed: 8.914 sec
testPerspectiveComplete(org.eclipse.tracecompass.tmf.ui.swtbot.tests.perspectives.TracingPerspectiveChecker)  Time elapsed: 0.001 sec  <<< FAILURE!
java.lang.AssertionError: view org.eclipse.swtbot.eclipse.finder.widgets.SWTBotView@612832a5 is present
	at org.junit.Assert.fail(Assert.java:88)
	at org.junit.Assert.assertTrue(Assert.java:41)
	at org.eclipse.tracecompass.tmf.ui.swtbot.tests.shared.AbstractPerspectiveChecker.testPerspectiveComplete(AbstractPerspectiveChecker.java:118)
	at sun.reflect.GeneratedMethodAccessor156.invoke(Unknown Source)
	at sun.reflect.DelegatingMethodAccessorImpl.invoke(DelegatingMethodAccessorImpl.java:43)
	at java.lang.reflect.Method.invoke(Method.java:606)
	at org.junit.runners.model.FrameworkMethod$1.runReflectiveCall(FrameworkMethod.java:50)
	at org.junit.internal.runners.model.ReflectiveCallable.run(ReflectiveCallable.java:12)
	at org.junit.runners.model.FrameworkMethod.invokeExplosively(FrameworkMethod.java:47)
	at org.junit.internal.runners.statements.InvokeMethod.evaluate(InvokeMethod.java:17)
	at org.junit.internal.runners.statements.RunBefores.evaluate(RunBefores.java:26)
	at org.junit.runners.ParentRunner.runLeaf(ParentRunner.java:325)
	at org.junit.runners.BlockJUnit4ClassRunner.runChild(BlockJUnit4ClassRunner.java:78)
	at org.junit.runners.BlockJUnit4ClassRunner.runChild(BlockJUnit4ClassRunner.java:57)
	at org.junit.runners.ParentRunner$3.run(ParentRunner.java:290)
	at org.junit.runners.ParentRunner$1.schedule(ParentRunner.java:71)
	at org.junit.runners.ParentRunner.runChildren(ParentRunner.java:288)
	at org.junit.runners.ParentRunner.access$000(ParentRunner.java:58)
	at org.junit.runners.ParentRunner$2.evaluate(ParentRunner.java:268)
	at org.junit.internal.runners.statements.RunBefores.evaluate(RunBefores.java:26)
	at org.junit.internal.runners.statements.RunAfters.evaluate(RunAfters.java:27)
	at org.junit.runners.ParentRunner.run(ParentRunner.java:363)
	at org.eclipse.swtbot.swt.finder.junit.SWTBotJunit4ClassRunner.run(SWTBotJunit4ClassRunner.java:54)
	at org.junit.runners.Suite.runChild(Suite.java:128)
	at org.junit.runners.Suite.runChild(Suite.java:27)
	at org.junit.runners.ParentRunner$3.run(ParentRunner.java:290)
	at org.junit.runners.ParentRunner$1.schedule(ParentRunner.java:71)
	at org.junit.runners.ParentRunner.runChildren(ParentRunner.java:288)
	at org.junit.runners.ParentRunner.access$000(ParentRunner.java:58)
	at org.junit.runners.ParentRunner$2.evaluate(ParentRunner.java:268)
	at org.junit.runners.ParentRunner.run(ParentRunner.java:363)
	at org.junit.runners.Suite.runChild(Suite.java:128)
	at org.junit.runners.Suite.runChild(Suite.java:27)
	at org.junit.runners.ParentRunner$3.run(ParentRunner.java:290)
	at org.junit.runners.ParentRunner$1.schedule(ParentRunner.java:71)
	at org.junit.runners.ParentRunner.runChildren(ParentRunner.java:288)
	at org.junit.runners.ParentRunner.access$000(ParentRunner.java:58)
	at org.junit.runners.ParentRunner$2.evaluate(ParentRunner.java:268)
	at org.junit.runners.ParentRunner.run(ParentRunner.java:363)
	at org.junit.runners.Suite.runChild(Suite.java:128)
	at org.junit.runners.Suite.runChild(Suite.java:27)
	at org.junit.runners.ParentRunner$3.run(ParentRunner.java:290)
	at org.junit.runners.ParentRunner$1.schedule(ParentRunner.java:71)
	at org.junit.runners.ParentRunner.runChildren(ParentRunner.java:288)
	at org.junit.runners.ParentRunner.access$000(ParentRunner.java:58)
	at org.junit.runners.ParentRunner$2.evaluate(ParentRunner.java:268)
	at org.junit.runners.ParentRunner.run(ParentRunner.java:363)
	at org.apache.maven.surefire.junit4.JUnit4Provider.execute(JUnit4Provider.java:264)
	at org.apache.maven.surefire.junit4.JUnit4Provider.executeTestSet(JUnit4Provider.java:153)
	at org.apache.maven.surefire.junit4.JUnit4Provider.invoke(JUnit4Provider.java:124)
	at sun.reflect.NativeMethodAccessorImpl.invoke0(Native Method)
	at sun.reflect.NativeMethodAccessorImpl.invoke(NativeMethodAccessorImpl.java:57)
	at sun.reflect.DelegatingMethodAccessorImpl.invoke(DelegatingMethodAccessorImpl.java:43)
	at java.lang.reflect.Method.invoke(Method.java:606)
	at org.apache.maven.surefire.util.ReflectionUtils.invokeMethodWithArray2(ReflectionUtils.java:208)
	at org.apache.maven.surefire.booter.ProviderFactory$ProviderProxy.invoke(ProviderFactory.java:156)
	at org.apache.maven.surefire.booter.ProviderFactory.invokeProvider(ProviderFactory.java:82)
	at org.eclipse.tycho.surefire.osgibooter.OsgiSurefireBooter.run(OsgiSurefireBooter.java:91)
	at org.eclipse.tycho.surefire.osgibooter.AbstractUITestApplication.runTests(AbstractUITestApplication.java:44)
	at org.eclipse.e4.ui.internal.workbench.swt.E4Testable$1.run(E4Testable.java:73)
	at java.lang.Thread.run(Thread.java:745)

testPerspectiveForViews(org.eclipse.tracecompass.tmf.ui.swtbot.tests.perspectives.TracingPerspectiveChecker)  Time elapsed: 0.001 sec
test(org.eclipse.tracecompass.tmf.ui.swtbot.tests.viewers.events.CallsiteEventsInTableTest)  Time elapsed: 8.619 sec
test(org.eclipse.tracecompass.tmf.ui.swtbot.tests.viewers.events.CollapseEventsInTableTest)  Time elapsed: 9.825 sec
testYellow(org.eclipse.tracecompass.tmf.ui.swtbot.tests.viewers.events.ColorsViewTest)  Time elapsed: 8.016 sec
testToggleColumns(org.eclipse.tracecompass.tmf.ui.swtbot.tests.viewers.events.ColumnHeaderMenuTest)  Time elapsed: 3.239 sec
testShowAll(org.eclipse.tracecompass.tmf.ui.swtbot.tests.viewers.events.ColumnHeaderMenuTest)  Time elapsed: 3.007 sec
testNoCopySearchRow(org.eclipse.tracecompass.tmf.ui.swtbot.tests.viewers.events.CopyToClipboardTest)  Time elapsed: 3.794 sec
testCopySingleSelection(org.eclipse.tracecompass.tmf.ui.swtbot.tests.viewers.events.CopyToClipboardTest)  Time elapsed: 3.276 sec
testCopyMultipleSelection(org.eclipse.tracecompass.tmf.ui.swtbot.tests.viewers.events.CopyToClipboardTest)  Time elapsed: 3.472 sec
testMultiHighlightMessage(org.eclipse.tracecompass.tmf.ui.swtbot.tests.viewers.events.FilterColorEditorTest)  Time elapsed: 8.281 sec
testSwitchToFilter(org.eclipse.tracecompass.tmf.ui.swtbot.tests.viewers.events.FilterColorEditorTest)  Time elapsed: 8.458 sec
testHighlight(org.eclipse.tracecompass.tmf.ui.swtbot.tests.viewers.events.FilterColorEditorTest)  Time elapsed: 8.139 sec
testPreference(org.eclipse.tracecompass.tmf.ui.swtbot.tests.viewers.events.FilterColorEditorTest)  Time elapsed: 8.126 sec
testTimestampFilter(org.eclipse.tracecompass.tmf.ui.swtbot.tests.viewers.events.FilterViewerTest)  Time elapsed: 3.633 sec  <<< ERROR!
org.eclipse.swt.SWTException: Failed to execute runnable (org.eclipse.swtbot.swt.finder.exceptions.WidgetNotFoundException: Could not find menu: TRACETYPE)
	at org.eclipse.swt.SWT.error(SWT.java:4491)
	at org.eclipse.swt.SWT.error(SWT.java:4406)
	at org.eclipse.swt.widgets.Synchronizer.syncExec(Synchronizer.java:208)
	at org.eclipse.ui.internal.UISynchronizer.syncExec(UISynchronizer.java:145)
	at org.eclipse.swt.widgets.Display.syncExec(Display.java:4633)
	at org.eclipse.swtbot.swt.finder.finders.UIThreadRunnable.run(UIThreadRunnable.java:76)
	at org.eclipse.swtbot.swt.finder.finders.UIThreadRunnable.syncExec(UIThreadRunnable.java:142)
	at org.eclipse.swtbot.swt.finder.finders.UIThreadRunnable.syncExec(UIThreadRunnable.java:125)
	at org.eclipse.swtbot.swt.finder.finders.ContextMenuHelper.contextMenu(ContextMenuHelper.java:42)
	at org.eclipse.swtbot.swt.finder.widgets.SWTBotTreeItem.contextMenu(SWTBotTreeItem.java:558)
	at org.eclipse.tracecompass.tmf.ui.swtbot.tests.viewers.events.FilterViewerTest.testTimestampFilter(FilterViewerTest.java:165)
Caused by: org.eclipse.swtbot.swt.finder.exceptions.WidgetNotFoundException: Could not find menu: TRACETYPE
	at org.eclipse.swtbot.swt.finder.finders.ContextMenuHelper$1.run(ContextMenuHelper.java:63)
	at org.eclipse.swtbot.swt.finder.finders.ContextMenuHelper$1.run(ContextMenuHelper.java:1)
	at org.eclipse.swtbot.swt.finder.finders.UIThreadRunnable$2.doRun(UIThreadRunnable.java:140)
	at org.eclipse.swtbot.swt.finder.finders.UIThreadRunnable$1.run(UIThreadRunnable.java:89)
	at org.eclipse.swt.widgets.RunnableLock.run(RunnableLock.java:35)
	at org.eclipse.swt.widgets.Synchronizer.runAsyncMessages(Synchronizer.java:135)
	at org.eclipse.swt.widgets.Display.runAsyncMessages(Display.java:3794)
	at org.eclipse.swt.widgets.Display.readAndDispatch(Display.java:3433)
	at org.eclipse.e4.ui.internal.workbench.swt.PartRenderingEngine$4.run(PartRenderingEngine.java:1127)
	at org.eclipse.core.databinding.observable.Realm.runWithDefault(Realm.java:337)
	at org.eclipse.e4.ui.internal.workbench.swt.PartRenderingEngine.run(PartRenderingEngine.java:1018)
	at org.eclipse.e4.ui.internal.workbench.E4Workbench.createAndRunUI(E4Workbench.java:156)
	at org.eclipse.ui.internal.Workbench$5.run(Workbench.java:654)
	at org.eclipse.core.databinding.observable.Realm.runWithDefault(Realm.java:337)
	at org.eclipse.ui.internal.Workbench.createAndRunWorkbench(Workbench.java:598)
	at org.eclipse.ui.PlatformUI.createAndRunWorkbench(PlatformUI.java:150)
	at org.eclipse.ui.internal.ide.application.IDEApplication.start(IDEApplication.java:139)
	at org.eclipse.tycho.surefire.osgibooter.UITestApplication.runApplication(UITestApplication.java:31)
	at org.eclipse.tycho.surefire.osgibooter.AbstractUITestApplication.run(AbstractUITestApplication.java:120)
	at org.eclipse.tycho.surefire.osgibooter.UITestApplication.start(UITestApplication.java:37)
	at org.eclipse.equinox.internal.app.EclipseAppHandle.run(EclipseAppHandle.java:196)
	at org.eclipse.core.runtime.internal.adaptor.EclipseAppLauncher.runApplication(EclipseAppLauncher.java:134)
	at org.eclipse.core.runtime.internal.adaptor.EclipseAppLauncher.start(EclipseAppLauncher.java:104)
	at org.eclipse.core.runtime.adaptor.EclipseStarter.run(EclipseStarter.java:380)
	at org.eclipse.core.runtime.adaptor.EclipseStarter.run(EclipseStarter.java:235)
	at sun.reflect.NativeMethodAccessorImpl.invoke0(Native Method)
	at sun.reflect.NativeMethodAccessorImpl.invoke(NativeMethodAccessorImpl.java:57)
	at sun.reflect.DelegatingMethodAccessorImpl.invoke(DelegatingMethodAccessorImpl.java:43)
	at java.lang.reflect.Method.invoke(Method.java:606)
	at org.eclipse.equinox.launcher.Main.invokeFramework(Main.java:669)
	at org.eclipse.equinox.launcher.Main.basicRun(Main.java:608)
	at org.eclipse.equinox.launcher.Main.run(Main.java:1515)
	at org.eclipse.equinox.launcher.Main.main(Main.java:1488)

testField01(org.eclipse.tracecompass.tmf.ui.swtbot.tests.viewers.events.FilterViewerTest)  Time elapsed: 3.704 sec  <<< ERROR!
org.eclipse.swt.SWTException: Failed to execute runnable (org.eclipse.swtbot.swt.finder.exceptions.WidgetNotFoundException: Could not find menu: TRACETYPE)
	at org.eclipse.swt.SWT.error(SWT.java:4491)
	at org.eclipse.swt.SWT.error(SWT.java:4406)
	at org.eclipse.swt.widgets.Synchronizer.syncExec(Synchronizer.java:208)
	at org.eclipse.ui.internal.UISynchronizer.syncExec(UISynchronizer.java:145)
	at org.eclipse.swt.widgets.Display.syncExec(Display.java:4633)
	at org.eclipse.swtbot.swt.finder.finders.UIThreadRunnable.run(UIThreadRunnable.java:76)
	at org.eclipse.swtbot.swt.finder.finders.UIThreadRunnable.syncExec(UIThreadRunnable.java:142)
	at org.eclipse.swtbot.swt.finder.finders.UIThreadRunnable.syncExec(UIThreadRunnable.java:125)
	at org.eclipse.swtbot.swt.finder.finders.ContextMenuHelper.contextMenu(ContextMenuHelper.java:42)
	at org.eclipse.swtbot.swt.finder.widgets.SWTBotTreeItem.contextMenu(SWTBotTreeItem.java:558)
	at org.eclipse.tracecompass.tmf.ui.swtbot.tests.viewers.events.FilterViewerTest.testField01(FilterViewerTest.java:282)
Caused by: org.eclipse.swtbot.swt.finder.exceptions.WidgetNotFoundException: Could not find menu: TRACETYPE
	at org.eclipse.swtbot.swt.finder.finders.ContextMenuHelper$1.run(ContextMenuHelper.java:63)
	at org.eclipse.swtbot.swt.finder.finders.ContextMenuHelper$1.run(ContextMenuHelper.java:1)
	at org.eclipse.swtbot.swt.finder.finders.UIThreadRunnable$2.doRun(UIThreadRunnable.java:140)
	at org.eclipse.swtbot.swt.finder.finders.UIThreadRunnable$1.run(UIThreadRunnable.java:89)
	at org.eclipse.swt.widgets.RunnableLock.run(RunnableLock.java:35)
	at org.eclipse.swt.widgets.Synchronizer.runAsyncMessages(Synchronizer.java:135)
	at org.eclipse.swt.widgets.Display.runAsyncMessages(Display.java:3794)
	at org.eclipse.swt.widgets.Display.readAndDispatch(Display.java:3433)
	at org.eclipse.e4.ui.internal.workbench.swt.PartRenderingEngine$4.run(PartRenderingEngine.java:1127)
	at org.eclipse.core.databinding.observable.Realm.runWithDefault(Realm.java:337)
	at org.eclipse.e4.ui.internal.workbench.swt.PartRenderingEngine.run(PartRenderingEngine.java:1018)
	at org.eclipse.e4.ui.internal.workbench.E4Workbench.createAndRunUI(E4Workbench.java:156)
	at org.eclipse.ui.internal.Workbench$5.run(Workbench.java:654)
	at org.eclipse.core.databinding.observable.Realm.runWithDefault(Realm.java:337)
	at org.eclipse.ui.internal.Workbench.createAndRunWorkbench(Workbench.java:598)
	at org.eclipse.ui.PlatformUI.createAndRunWorkbench(PlatformUI.java:150)
	at org.eclipse.ui.internal.ide.application.IDEApplication.start(IDEApplication.java:139)
	at org.eclipse.tycho.surefire.osgibooter.UITestApplication.runApplication(UITestApplication.java:31)
	at org.eclipse.tycho.surefire.osgibooter.AbstractUITestApplication.run(AbstractUITestApplication.java:120)
	at org.eclipse.tycho.surefire.osgibooter.UITestApplication.start(UITestApplication.java:37)
	at org.eclipse.equinox.internal.app.EclipseAppHandle.run(EclipseAppHandle.java:196)
	at org.eclipse.core.runtime.internal.adaptor.EclipseAppLauncher.runApplication(EclipseAppLauncher.java:134)
	at org.eclipse.core.runtime.internal.adaptor.EclipseAppLauncher.start(EclipseAppLauncher.java:104)
	at org.eclipse.core.runtime.adaptor.EclipseStarter.run(EclipseStarter.java:380)
	at org.eclipse.core.runtime.adaptor.EclipseStarter.run(EclipseStarter.java:235)
	at sun.reflect.NativeMethodAccessorImpl.invoke0(Native Method)
	at sun.reflect.NativeMethodAccessorImpl.invoke(NativeMethodAccessorImpl.java:57)
	at sun.reflect.DelegatingMethodAccessorImpl.invoke(DelegatingMethodAccessorImpl.java:43)
	at java.lang.reflect.Method.invoke(Method.java:606)
	at org.eclipse.equinox.launcher.Main.invokeFramework(Main.java:669)
	at org.eclipse.equinox.launcher.Main.basicRun(Main.java:608)
	at org.eclipse.equinox.launcher.Main.run(Main.java:1515)
	at org.eclipse.equinox.launcher.Main.main(Main.java:1488)

testTimestampEqualsOr(org.eclipse.tracecompass.tmf.ui.swtbot.tests.viewers.events.FilterViewerTest)  Time elapsed: 3.043 sec  <<< ERROR!
org.eclipse.swt.SWTException: Failed to execute runnable (org.eclipse.swtbot.swt.finder.exceptions.WidgetNotFoundException: Could not find menu: TRACETYPE)
	at org.eclipse.swt.SWT.error(SWT.java:4491)
	at org.eclipse.swt.SWT.error(SWT.java:4406)
	at org.eclipse.swt.widgets.Synchronizer.syncExec(Synchronizer.java:208)
	at org.eclipse.ui.internal.UISynchronizer.syncExec(UISynchronizer.java:145)
	at org.eclipse.swt.widgets.Display.syncExec(Display.java:4633)
	at org.eclipse.swtbot.swt.finder.finders.UIThreadRunnable.run(UIThreadRunnable.java:76)
	at org.eclipse.swtbot.swt.finder.finders.UIThreadRunnable.syncExec(UIThreadRunnable.java:142)
	at org.eclipse.swtbot.swt.finder.finders.UIThreadRunnable.syncExec(UIThreadRunnable.java:125)
	at org.eclipse.swtbot.swt.finder.finders.ContextMenuHelper.contextMenu(ContextMenuHelper.java:42)
	at org.eclipse.swtbot.swt.finder.widgets.SWTBotTreeItem.contextMenu(SWTBotTreeItem.java:558)
	at org.eclipse.tracecompass.tmf.ui.swtbot.tests.viewers.events.FilterViewerTest.testTimestampEqualsOr(FilterViewerTest.java:215)
Caused by: org.eclipse.swtbot.swt.finder.exceptions.WidgetNotFoundException: Could not find menu: TRACETYPE
	at org.eclipse.swtbot.swt.finder.finders.ContextMenuHelper$1.run(ContextMenuHelper.java:63)
	at org.eclipse.swtbot.swt.finder.finders.ContextMenuHelper$1.run(ContextMenuHelper.java:1)
	at org.eclipse.swtbot.swt.finder.finders.UIThreadRunnable$2.doRun(UIThreadRunnable.java:140)
	at org.eclipse.swtbot.swt.finder.finders.UIThreadRunnable$1.run(UIThreadRunnable.java:89)
	at org.eclipse.swt.widgets.RunnableLock.run(RunnableLock.java:35)
	at org.eclipse.swt.widgets.Synchronizer.runAsyncMessages(Synchronizer.java:135)
	at org.eclipse.swt.widgets.Display.runAsyncMessages(Display.java:3794)
	at org.eclipse.swt.widgets.Display.readAndDispatch(Display.java:3433)
	at org.eclipse.e4.ui.internal.workbench.swt.PartRenderingEngine$4.run(PartRenderingEngine.java:1127)
	at org.eclipse.core.databinding.observable.Realm.runWithDefault(Realm.java:337)
	at org.eclipse.e4.ui.internal.workbench.swt.PartRenderingEngine.run(PartRenderingEngine.java:1018)
	at org.eclipse.e4.ui.internal.workbench.E4Workbench.createAndRunUI(E4Workbench.java:156)
	at org.eclipse.ui.internal.Workbench$5.run(Workbench.java:654)
	at org.eclipse.core.databinding.observable.Realm.runWithDefault(Realm.java:337)
	at org.eclipse.ui.internal.Workbench.createAndRunWorkbench(Workbench.java:598)
	at org.eclipse.ui.PlatformUI.createAndRunWorkbench(PlatformUI.java:150)
	at org.eclipse.ui.internal.ide.application.IDEApplication.start(IDEApplication.java:139)
	at org.eclipse.tycho.surefire.osgibooter.UITestApplication.runApplication(UITestApplication.java:31)
	at org.eclipse.tycho.surefire.osgibooter.AbstractUITestApplication.run(AbstractUITestApplication.java:120)
	at org.eclipse.tycho.surefire.osgibooter.UITestApplication.start(UITestApplication.java:37)
	at org.eclipse.equinox.internal.app.EclipseAppHandle.run(EclipseAppHandle.java:196)
	at org.eclipse.core.runtime.internal.adaptor.EclipseAppLauncher.runApplication(EclipseAppLauncher.java:134)
	at org.eclipse.core.runtime.internal.adaptor.EclipseAppLauncher.start(EclipseAppLauncher.java:104)
	at org.eclipse.core.runtime.adaptor.EclipseStarter.run(EclipseStarter.java:380)
	at org.eclipse.core.runtime.adaptor.EclipseStarter.run(EclipseStarter.java:235)
	at sun.reflect.NativeMethodAccessorImpl.invoke0(Native Method)
	at sun.reflect.NativeMethodAccessorImpl.invoke(NativeMethodAccessorImpl.java:57)
	at sun.reflect.DelegatingMethodAccessorImpl.invoke(DelegatingMethodAccessorImpl.java:43)
	at java.lang.reflect.Method.invoke(Method.java:606)
	at org.eclipse.equinox.launcher.Main.invokeFramework(Main.java:669)
	at org.eclipse.equinox.launcher.Main.basicRun(Main.java:608)
	at org.eclipse.equinox.launcher.Main.run(Main.java:1515)
	at org.eclipse.equinox.launcher.Main.main(Main.java:1488)

testChangeFont(org.eclipse.tracecompass.tmf.ui.swtbot.tests.viewers.events.FontEventEditorTest)  Time elapsed: 9.576 sec
testReorder(org.eclipse.tracecompass.tmf.ui.swtbot.tests.viewers.events.MovableColumnEventsEditorTest)  Time elapsed: 12.393 sec
testSDView(org.eclipse.tracecompass.tmf.ui.swtbot.tests.viewers.events.SDViewTest)  Time elapsed: 6.117 sec
testOffsetting(org.eclipse.tracecompass.tmf.ui.swtbot.tests.viewers.events.TestTraceOffsetting)  Time elapsed: 11.109 sec
testOverlappingTimechartMove(org.eclipse.tracecompass.tmf.ui.swtbot.tests.viewers.events.TmfAlignTimeAxisTest)  Time elapsed: 5.248 sec
testNotOverlappingCallstackMove(org.eclipse.tracecompass.tmf.ui.swtbot.tests.viewers.events.TmfAlignTimeAxisTest)  Time elapsed: 5.335 sec
testMoveHistogramCallstackFollows(org.eclipse.tracecompass.tmf.ui.swtbot.tests.viewers.events.TmfAlignTimeAxisTest)  Time elapsed: 5.309 sec
testOverlappingHistogramMove(org.eclipse.tracecompass.tmf.ui.swtbot.tests.viewers.events.TmfAlignTimeAxisTest)  Time elapsed: 5.378 sec
testNotOverlappingHistogramMove(org.eclipse.tracecompass.tmf.ui.swtbot.tests.viewers.events.TmfAlignTimeAxisTest)  Time elapsed: 5.227 sec
testMoveCallstackHistogramFollows(org.eclipse.tracecompass.tmf.ui.swtbot.tests.viewers.events.TmfAlignTimeAxisTest)  Time elapsed: 5.259 sec
testGzipImport(org.eclipse.tracecompass.tmf.ui.swtbot.tests.wizards.StandardImportGzipTraceTest)  Time elapsed: 6.74 sec
test(org.eclipse.tracecompass.tmf.ctf.ui.swtbot.tests.ImportAndReadSmokeTest)  Time elapsed: 13.167 sec
testImportFromDirectory(org.eclipse.tracecompass.tmf.ctf.ui.swtbot.tests.StandardImportAndReadSmokeTest)  Time elapsed: 7.773 sec
testExtractArchivesFromArchive(org.eclipse.tracecompass.tmf.ctf.ui.swtbot.tests.StandardImportAndReadSmokeTest)  Time elapsed: 18.353 sec
testImportFromDirectoryLinksPreserveFolder(org.eclipse.tracecompass.tmf.ctf.ui.swtbot.tests.StandardImportAndReadSmokeTest)  Time elapsed: 8.028 sec
testExtractArchivesFromArchivePreserveFolder(org.eclipse.tracecompass.tmf.ctf.ui.swtbot.tests.StandardImportAndReadSmokeTest)  Time elapsed: 19.183 sec
testExtractArchivesFromDirectory(org.eclipse.tracecompass.tmf.ctf.ui.swtbot.tests.StandardImportAndReadSmokeTest)  Time elapsed: 14.087 sec
testImportFromArchive(org.eclipse.tracecompass.tmf.ctf.ui.swtbot.tests.StandardImportAndReadSmokeTest)  Time elapsed: 14.433 sec
testExtractArchivesFromDirectoryLinksPreserveStruture(org.eclipse.tracecompass.tmf.ctf.ui.swtbot.tests.StandardImportAndReadSmokeTest)  Time elapsed: 14.182 sec
testEmptyDirectory(org.eclipse.tracecompass.tmf.ctf.ui.swtbot.tests.StandardImportAndReadSmokeTest)  Time elapsed: 6.038 sec
testEmptyArchive(org.eclipse.tracecompass.tmf.ctf.ui.swtbot.tests.StandardImportAndReadSmokeTest)  Time elapsed: 9.644 sec
testNestedEmptyArchive(org.eclipse.tracecompass.tmf.ctf.ui.swtbot.tests.StandardImportAndReadSmokeTest)  Time elapsed: 14.213 sec
testImportFromArchiveOverwrite(org.eclipse.tracecompass.tmf.ctf.ui.swtbot.tests.StandardImportAndReadSmokeTest)  Time elapsed: 16.381 sec
testDirectoryWithEmptyArchive(org.eclipse.tracecompass.tmf.ctf.ui.swtbot.tests.StandardImportAndReadSmokeTest)  Time elapsed: 10.309 sec
testImportFromDirectoryPreserveFolder(org.eclipse.tracecompass.tmf.ctf.ui.swtbot.tests.StandardImportAndReadSmokeTest)  Time elapsed: 8.597 sec
testImportFromDirectoryLinks(org.eclipse.tracecompass.tmf.ctf.ui.swtbot.tests.StandardImportAndReadSmokeTest)  Time elapsed: 8.424 sec
testImportFromDirectoryOverwrite(org.eclipse.tracecompass.tmf.ctf.ui.swtbot.tests.StandardImportAndReadSmokeTest)  Time elapsed: 17.508 sec
testExtractArchivesFromDirectoryLinks(org.eclipse.tracecompass.tmf.ctf.ui.swtbot.tests.StandardImportAndReadSmokeTest)  Time elapsed: 14.531 sec
testImportFromArchivePreserveFolder(org.eclipse.tracecompass.tmf.ctf.ui.swtbot.tests.StandardImportAndReadSmokeTest)  Time elapsed: 8.58 sec
testOpen[0: ../../ctf/org.eclipse.tracecompass.ctf.core.tests/traces/ctf-testsuite/tests/1.8/regression/metadata/fail/struct-align-negative](org.eclipse.tracecompass.tmf.ctf.ui.swtbot.tests.TestInvalidCtfTrace)  Time elapsed: 5.231 sec
testOpen[1: ../../ctf/org.eclipse.tracecompass.ctf.core.tests/traces/ctf-testsuite/tests/1.8/regression/metadata/fail/array-size-identifier](org.eclipse.tracecompass.tmf.ctf.ui.swtbot.tests.TestInvalidCtfTrace)  Time elapsed: 5.163 sec
testOpen[2: ../../ctf/org.eclipse.tracecompass.ctf.core.tests/traces/ctf-testsuite/tests/1.8/regression/metadata/fail/struct-align-huge](org.eclipse.tracecompass.tmf.ctf.ui.swtbot.tests.TestInvalidCtfTrace)  Time elapsed: 5.363 sec
testOpen[3: ../../ctf/org.eclipse.tracecompass.ctf.core.tests/traces/ctf-testsuite/tests/1.8/regression/metadata/fail/integer-signed-as-string](org.eclipse.tracecompass.tmf.ctf.ui.swtbot.tests.TestInvalidCtfTrace)  Time elapsed: 5.246 sec
testOpen[4: ../../ctf/org.eclipse.tracecompass.ctf.core.tests/traces/ctf-testsuite/tests/1.8/regression/metadata/fail/array-size-keyword](org.eclipse.tracecompass.tmf.ctf.ui.swtbot.tests.TestInvalidCtfTrace)  Time elapsed: 5.535 sec
testOpen[5: ../../ctf/org.eclipse.tracecompass.ctf.core.tests/traces/ctf-testsuite/tests/1.8/regression/metadata/fail/integer-range](org.eclipse.tracecompass.tmf.ctf.ui.swtbot.tests.TestInvalidCtfTrace)  Time elapsed: 5.516 sec
testOpen[6: ../../ctf/org.eclipse.tracecompass.ctf.core.tests/traces/ctf-testsuite/tests/1.8/regression/metadata/fail/integer-signed-invalid](org.eclipse.tracecompass.tmf.ctf.ui.swtbot.tests.TestInvalidCtfTrace)  Time elapsed: 5.45 sec
testOpen[7: ../../ctf/org.eclipse.tracecompass.ctf.core.tests/traces/ctf-testsuite/tests/1.8/regression/metadata/fail/struct-align-string](org.eclipse.tracecompass.tmf.ctf.ui.swtbot.tests.TestInvalidCtfTrace)  Time elapsed: 5.537 sec
testOpen[8: ../../ctf/org.eclipse.tracecompass.ctf.core.tests/traces/ctf-testsuite/tests/1.8/regression/metadata/fail/array-size-type-field](org.eclipse.tracecompass.tmf.ctf.ui.swtbot.tests.TestInvalidCtfTrace)  Time elapsed: 5.08 sec
testOpen[9: ../../ctf/org.eclipse.tracecompass.ctf.core.tests/traces/ctf-testsuite/tests/1.8/regression/metadata/fail/struct-duplicate-struct-name](org.eclipse.tracecompass.tmf.ctf.ui.swtbot.tests.TestInvalidCtfTrace)  Time elapsed: 4.881 sec
testOpen[10: ../../ctf/org.eclipse.tracecompass.ctf.core.tests/traces/ctf-testsuite/tests/1.8/regression/metadata/fail/integer-encoding-invalid](org.eclipse.tracecompass.tmf.ctf.ui.swtbot.tests.TestInvalidCtfTrace)  Time elapsed: 4.992 sec
testOpen[11: ../../ctf/org.eclipse.tracecompass.ctf.core.tests/traces/ctf-testsuite/tests/1.8/regression/metadata/fail/integer-size-as-string](org.eclipse.tracecompass.tmf.ctf.ui.swtbot.tests.TestInvalidCtfTrace)  Time elapsed: 4.991 sec
testOpen[12: ../../ctf/org.eclipse.tracecompass.ctf.core.tests/traces/ctf-testsuite/tests/1.8/regression/metadata/fail/array-size-type](org.eclipse.tracecompass.tmf.ctf.ui.swtbot.tests.TestInvalidCtfTrace)  Time elapsed: 5.562 sec
testOpen[13: ../../ctf/org.eclipse.tracecompass.ctf.core.tests/traces/ctf-testsuite/tests/1.8/regression/metadata/fail/array-size-not-present](org.eclipse.tracecompass.tmf.ctf.ui.swtbot.tests.TestInvalidCtfTrace)  Time elapsed: 5.097 sec
testOpen[14: ../../ctf/org.eclipse.tracecompass.ctf.core.tests/traces/ctf-testsuite/tests/1.8/regression/metadata/fail/struct-duplicate-field-name](org.eclipse.tracecompass.tmf.ctf.ui.swtbot.tests.TestInvalidCtfTrace)  Time elapsed: 5.188 sec
testOpen[15: ../../ctf/org.eclipse.tracecompass.ctf.core.tests/traces/ctf-testsuite/tests/1.8/regression/metadata/fail/array-size-string](org.eclipse.tracecompass.tmf.ctf.ui.swtbot.tests.TestInvalidCtfTrace)  Time elapsed: 5.3 sec
testOpen[16: ../../ctf/org.eclipse.tracecompass.ctf.core.tests/traces/ctf-testsuite/tests/1.8/regression/metadata/fail/integer-size-missing](org.eclipse.tracecompass.tmf.ctf.ui.swtbot.tests.TestInvalidCtfTrace)  Time elapsed: 5.106 sec
testOpen[17: ../../ctf/org.eclipse.tracecompass.ctf.core.tests/traces/ctf-testsuite/tests/1.8/regression/metadata/fail/integer-negative-bit-size](org.eclipse.tracecompass.tmf.ctf.ui.swtbot.tests.TestInvalidCtfTrace)  Time elapsed: 5.279 sec
testOpen[18: ../../ctf/org.eclipse.tracecompass.ctf.core.tests/traces/ctf-testsuite/tests/1.8/regression/metadata/fail/struct-align-enum](org.eclipse.tracecompass.tmf.ctf.ui.swtbot.tests.TestInvalidCtfTrace)  Time elapsed: 5.147 sec
testOpen[19: ../../ctf/org.eclipse.tracecompass.ctf.core.tests/traces/ctf-testsuite/tests/1.8/regression/metadata/fail/integer-encoding-as-string](org.eclipse.tracecompass.tmf.ctf.ui.swtbot.tests.TestInvalidCtfTrace)  Time elapsed: 5.109 sec
testOpen[20: ../../ctf/org.eclipse.tracecompass.ctf.core.tests/traces/ctf-testsuite/tests/1.8/regression/metadata/fail/struct-align-zero](org.eclipse.tracecompass.tmf.ctf.ui.swtbot.tests.TestInvalidCtfTrace)  Time elapsed: 4.914 sec
testOpen[21: ../../ctf/org.eclipse.tracecompass.ctf.core.tests/traces/ctf-testsuite/tests/1.8/regression/metadata/fail/array-redefinition](org.eclipse.tracecompass.tmf.ctf.ui.swtbot.tests.TestInvalidCtfTrace)  Time elapsed: 4.962 sec
testOpen[22: ../../ctf/org.eclipse.tracecompass.ctf.core.tests/traces/ctf-testsuite/tests/1.8/regression/metadata/fail/array-size-negative](org.eclipse.tracecompass.tmf.ctf.ui.swtbot.tests.TestInvalidCtfTrace)  Time elapsed: 4.823 sec
testOpen[23: ../../ctf/org.eclipse.tracecompass.ctf.core.tests/traces/ctf-testsuite/tests/1.8/regression/metadata/fail/struct-field-name-keyword](org.eclipse.tracecompass.tmf.ctf.ui.swtbot.tests.TestInvalidCtfTrace)  Time elapsed: 5.722 sec
test(org.eclipse.tracecompass.tmf.pcap.ui.swtbot.tests.ImportAndReadPcapTest)  Time elapsed: 26.734 sec
testPerspectiveComplete(org.eclipse.tracecompass.tmf.pcap.ui.swtbot.tests.NetworkPerspectiveChecker)  Time elapsed: 0 sec
testPerspectiveForViews(org.eclipse.tracecompass.tmf.pcap.ui.swtbot.tests.NetworkPerspectiveChecker)  Time elapsed: 0.022 sec
org.eclipse.tracecompass.tmf.remote.ui.swtbot.tests.fetch.FetchRemoteTracesTest  Time elapsed: 0.022 sec  <<< ERROR!
java.lang.NoClassDefFoundError: Could not initialize class org.eclipse.tracecompass.tmf.remote.ui.swtbot.tests.fetch.FetchRemoteTracesTest
	at sun.reflect.GeneratedMethodAccessor262.invoke(Unknown Source)
	at sun.reflect.DelegatingMethodAccessorImpl.invoke(DelegatingMethodAccessorImpl.java:43)
	at java.lang.reflect.Method.invoke(Method.java:606)
	at org.junit.runners.model.FrameworkMethod$1.runReflectiveCall(FrameworkMethod.java:50)
	at org.junit.internal.runners.model.ReflectiveCallable.run(ReflectiveCallable.java:12)
	at org.junit.runners.model.FrameworkMethod.invokeExplosively(FrameworkMethod.java:47)
	at org.junit.internal.runners.statements.RunBefores.evaluate(RunBefores.java:24)
	at org.junit.runners.ParentRunner.run(ParentRunner.java:363)
	at org.eclipse.swtbot.swt.finder.junit.SWTBotJunit4ClassRunner.run(SWTBotJunit4ClassRunner.java:54)
	at org.junit.runners.Suite.runChild(Suite.java:128)
	at org.junit.runners.Suite.runChild(Suite.java:27)
	at org.junit.runners.ParentRunner$3.run(ParentRunner.java:290)
	at org.junit.runners.ParentRunner$1.schedule(ParentRunner.java:71)
	at org.junit.runners.ParentRunner.runChildren(ParentRunner.java:288)
	at org.junit.runners.ParentRunner.access$000(ParentRunner.java:58)
	at org.junit.runners.ParentRunner$2.evaluate(ParentRunner.java:268)
	at org.junit.runners.ParentRunner.run(ParentRunner.java:363)
	at org.junit.runners.Suite.runChild(Suite.java:128)
	at org.junit.runners.Suite.runChild(Suite.java:27)
	at org.junit.runners.ParentRunner$3.run(ParentRunner.java:290)
	at org.junit.runners.ParentRunner$1.schedule(ParentRunner.java:71)
	at org.junit.runners.ParentRunner.runChildren(ParentRunner.java:288)
	at org.junit.runners.ParentRunner.access$000(ParentRunner.java:58)
	at org.junit.runners.ParentRunner$2.evaluate(ParentRunner.java:268)
	at org.junit.runners.ParentRunner.run(ParentRunner.java:363)
	at org.junit.runners.Suite.runChild(Suite.java:128)
	at org.junit.runners.Suite.runChild(Suite.java:27)
	at org.junit.runners.ParentRunner$3.run(ParentRunner.java:290)
	at org.junit.runners.ParentRunner$1.schedule(ParentRunner.java:71)
	at org.junit.runners.ParentRunner.runChildren(ParentRunner.java:288)
	at org.junit.runners.ParentRunner.access$000(ParentRunner.java:58)
	at org.junit.runners.ParentRunner$2.evaluate(ParentRunner.java:268)
	at org.junit.runners.ParentRunner.run(ParentRunner.java:363)
	at org.apache.maven.surefire.junit4.JUnit4Provider.execute(JUnit4Provider.java:264)
	at org.apache.maven.surefire.junit4.JUnit4Provider.executeTestSet(JUnit4Provider.java:153)
	at org.apache.maven.surefire.junit4.JUnit4Provider.invoke(JUnit4Provider.java:124)
	at sun.reflect.NativeMethodAccessorImpl.invoke0(Native Method)
	at sun.reflect.NativeMethodAccessorImpl.invoke(NativeMethodAccessorImpl.java:57)
	at sun.reflect.DelegatingMethodAccessorImpl.invoke(DelegatingMethodAccessorImpl.java:43)
	at java.lang.reflect.Method.invoke(Method.java:606)
	at org.apache.maven.surefire.util.ReflectionUtils.invokeMethodWithArray2(ReflectionUtils.java:208)
	at org.apache.maven.surefire.booter.ProviderFactory$ProviderProxy.invoke(ProviderFactory.java:156)
	at org.apache.maven.surefire.booter.ProviderFactory.invokeProvider(ProviderFactory.java:82)
	at org.eclipse.tycho.surefire.osgibooter.OsgiSurefireBooter.run(OsgiSurefireBooter.java:91)
	at org.eclipse.tycho.surefire.osgibooter.AbstractUITestApplication.runTests(AbstractUITestApplication.java:44)
	at org.eclipse.e4.ui.internal.workbench.swt.E4Testable$1.run(E4Testable.java:73)
	at java.lang.Thread.run(Thread.java:745)

testPerspectiveComplete(org.eclipse.tracecompass.lttng2.kernel.ui.swtbot.tests.KernelPerspectiveChecker)  Time elapsed: 0.678 sec
testPerspectiveForViews(org.eclipse.tracecompass.lttng2.kernel.ui.swtbot.tests.KernelPerspectiveChecker)  Time elapsed: 0.035 sec
test(org.eclipse.tracecompass.lttng2.kernel.ui.swtbot.tests.ImportAndReadKernelSmokeTest)  Time elapsed: 45.785 sec
testToolBarFollowCPUForwardBackward(org.eclipse.tracecompass.lttng2.kernel.ui.swtbot.tests.ControlFlowViewTest)  Time elapsed: 20.259 sec
testKeyboardLeftRight(org.eclipse.tracecompass.lttng2.kernel.ui.swtbot.tests.ControlFlowViewTest)  Time elapsed: 16.992 sec
testToolBarSelectNextPreviousEvent(org.eclipse.tracecompass.lttng2.kernel.ui.swtbot.tests.ControlFlowViewTest)  Time elapsed: 20.651 sec
testOpenAndCloseConcurrency(org.eclipse.tracecompass.lttng2.kernel.ui.swtbot.tests.OpenTraceStressTest)  Time elapsed: 60.061 sec

Results :

Failed tests: 
  TracingPerspectiveChecker>AbstractPerspectiveChecker.testPerspectiveComplete:118 view org.eclipse.swtbot.eclipse.finder.widgets.SWTBotView@32a12d58 is present
  TracingPerspectiveChecker>AbstractPerspectiveChecker.testPerspectiveComplete:118 view org.eclipse.swtbot.eclipse.finder.widgets.SWTBotView@46c84d31 is present
  TracingPerspectiveChecker>AbstractPerspectiveChecker.testPerspectiveComplete:118 view org.eclipse.swtbot.eclipse.finder.widgets.SWTBotView@3a916a28 is present
  TracingPerspectiveChecker>AbstractPerspectiveChecker.testPerspectiveComplete:118 view org.eclipse.swtbot.eclipse.finder.widgets.SWTBotView@2d3ac04a is present
  TracingPerspectiveChecker>AbstractPerspectiveChecker.testPerspectiveComplete:118 view org.eclipse.swtbot.eclipse.finder.widgets.SWTBotView@7a12c64c is present
  TracingPerspectiveChecker>AbstractPerspectiveChecker.testPerspectiveComplete:118 view org.eclipse.swtbot.eclipse.finder.widgets.SWTBotView@19009e74 is present
  TracingPerspectiveChecker>AbstractPerspectiveChecker.testPerspectiveComplete:118 view org.eclipse.swtbot.eclipse.finder.widgets.SWTBotView@da42201 is present
  TracingPerspectiveChecker>AbstractPerspectiveChecker.testPerspectiveComplete:118 view org.eclipse.swtbot.eclipse.finder.widgets.SWTBotView@7b691340 is present
  TracingPerspectiveChecker>AbstractPerspectiveChecker.testPerspectiveComplete:118 view org.eclipse.swtbot.eclipse.finder.widgets.SWTBotView@54d0bf8f is present
  TracingPerspectiveChecker>AbstractPerspectiveChecker.testPerspectiveComplete:118 view org.eclipse.swtbot.eclipse.finder.widgets.SWTBotView@103f0f16 is present
  TracingPerspectiveChecker>AbstractPerspectiveChecker.testPerspectiveComplete:118 view org.eclipse.swtbot.eclipse.finder.widgets.SWTBotView@48c8f328 is present
  TracingPerspectiveChecker>AbstractPerspectiveChecker.testPerspectiveComplete:118 view org.eclipse.swtbot.eclipse.finder.widgets.SWTBotView@24692b3b is present
  TracingPerspectiveChecker>AbstractPerspectiveChecker.testPerspectiveComplete:118 view org.eclipse.swtbot.eclipse.finder.widgets.SWTBotView@6745762 is present
  TracingPerspectiveChecker>AbstractPerspectiveChecker.testPerspectiveComplete:118 view org.eclipse.swtbot.eclipse.finder.widgets.SWTBotView@4701f111 is present
  TracingPerspectiveChecker>AbstractPerspectiveChecker.testPerspectiveComplete:118 view org.eclipse.swtbot.eclipse.finder.widgets.SWTBotView@2f4d057 is present
  TracingPerspectiveChecker>AbstractPerspectiveChecker.testPerspectiveComplete:118 view org.eclipse.swtbot.eclipse.finder.widgets.SWTBotView@5e47992c is present
  TracingPerspectiveChecker>AbstractPerspectiveChecker.testPerspectiveComplete:118 view org.eclipse.swtbot.eclipse.finder.widgets.SWTBotView@173730c4 is present
  TracingPerspectiveChecker>AbstractPerspectiveChecker.testPerspectiveComplete:118 view org.eclipse.swtbot.eclipse.finder.widgets.SWTBotView@3b4217d is present
  TracingPerspectiveChecker>AbstractPerspectiveChecker.testPerspectiveComplete:118 view org.eclipse.swtbot.eclipse.finder.widgets.SWTBotView@612832a5 is present

Tests in error: 
  null
  FilterViewerTest.testTimestampFilter:165 » SWT Failed to execute runnable (org...
  FilterViewerTest.testField01:282 » SWT Failed to execute runnable (org.eclipse...
  FilterViewerTest.testTimestampEqualsOr:215 » SWT Failed to execute runnable (o...
  Could not initialize class org.eclipse.tracecompass.tmf.remote.ui.swtbot.tests.fetch.FetchRemoteTracesTest
  FilterViewerTest.testTimestampFilter:165 » SWT Failed to execute runnable (org...
  FilterViewerTest.testField01:282 » SWT Failed to execute runnable (org.eclipse...
  FilterViewerTest.testTimestampEqualsOr:215 » SWT Failed to execute runnable (o...
  Could not initialize class org.eclipse.tracecompass.tmf.remote.ui.swtbot.tests.fetch.FetchRemoteTracesTest
  FilterViewerTest.testTimestampFilter:165 » SWT Failed to execute runnable (org...
  FilterViewerTest.testField01:282 » SWT Failed to execute runnable (org.eclipse...
  FilterViewerTest.testTimestampEqualsOr:215 » SWT Failed to execute runnable (o...
  Could not initialize class org.eclipse.tracecompass.tmf.remote.ui.swtbot.tests.fetch.FetchRemoteTracesTest
  FilterViewerTest.testTimestampFilter:165 » SWT Failed to execute runnable (org...
  FilterViewerTest.testField01:282 » SWT Failed to execute runnable (org.eclipse...
  FilterViewerTest.testTimestampEqualsOr:215 » SWT Failed to execute runnable (o...
  Could not initialize class org.eclipse.tracecompass.tmf.remote.ui.swtbot.tests.fetch.FetchRemoteTracesTest
  FilterViewerTest.testTimestampFilter:165 » SWT Failed to execute runnable (org...
  FilterViewerTest.testField01:282 » SWT Failed to execute runnable (org.eclipse...
  FilterViewerTest.testTimestampEqualsOr:215 » SWT Failed to execute runnable (o...
  Could not initialize class org.eclipse.tracecompass.tmf.remote.ui.swtbot.tests.fetch.FetchRemoteTracesTest
  FilterViewerTest.testTimestampFilter:165 » SWT Failed to execute runnable (org...
  FilterViewerTest.testField01:282 » SWT Failed to execute runnable (org.eclipse...
  FilterViewerTest.testTimestampEqualsOr:215 » SWT Failed to execute runnable (o...
  Could not initialize class org.eclipse.tracecompass.tmf.remote.ui.swtbot.tests.fetch.FetchRemoteTracesTest
  FilterViewerTest.testTimestampFilter:165 » SWT Failed to execute runnable (org...
  FilterViewerTest.testField01:282 » SWT Failed to execute runnable (org.eclipse...
  FilterViewerTest.testTimestampEqualsOr:215 » SWT Failed to execute runnable (o...
  Could not initialize class org.eclipse.tracecompass.tmf.remote.ui.swtbot.tests.fetch.FetchRemoteTracesTest
  FilterViewerTest.testTimestampFilter:165 » SWT Failed to execute runnable (org...
  FilterViewerTest.testField01:282 » SWT Failed to execute runnable (org.eclipse...
  FilterViewerTest.testTimestampEqualsOr:215 » SWT Failed to execute runnable (o...
  Could not initialize class org.eclipse.tracecompass.tmf.remote.ui.swtbot.tests.fetch.FetchRemoteTracesTest
  CopyToClipboardTest.testNoCopySearchRow »  Unexpected exception, expected<org....
  FilterViewerTest.testTimestampFilter:165 » SWT Failed to execute runnable (org...
  FilterViewerTest.testField01:282 » SWT Failed to execute runnable (org.eclipse...
  FilterViewerTest.testTimestampEqualsOr:215 » SWT Failed to execute runnable (o...
  Could not initialize class org.eclipse.tracecompass.tmf.remote.ui.swtbot.tests.fetch.FetchRemoteTracesTest
  FilterViewerTest.testTimestampFilter:165 » SWT Failed to execute runnable (org...
  FilterViewerTest.testField01:282 » SWT Failed to execute runnable (org.eclipse...
  FilterViewerTest.testTimestampEqualsOr:215 » SWT Failed to execute runnable (o...
  Could not initialize class org.eclipse.tracecompass.tmf.remote.ui.swtbot.tests.fetch.FetchRemoteTracesTest
  FilterViewerTest.testTimestampFilter:165 » SWT Failed to execute runnable (org...
  FilterViewerTest.testField01:282 » SWT Failed to execute runnable (org.eclipse...
  FilterViewerTest.testTimestampEqualsOr:215 » SWT Failed to execute runnable (o...
  Could not initialize class org.eclipse.tracecompass.tmf.remote.ui.swtbot.tests.fetch.FetchRemoteTracesTest
  FilterViewerTest.testTimestampFilter:165 » SWT Failed to execute runnable (org...
  FilterViewerTest.testField01:282 » SWT Failed to execute runnable (org.eclipse...
  FilterViewerTest.testTimestampEqualsOr:215 » SWT Failed to execute runnable (o...
  Could not initialize class org.eclipse.tracecompass.tmf.remote.ui.swtbot.tests.fetch.FetchRemoteTracesTest
  FilterViewerTest.testTimestampFilter:165 » SWT Failed to execute runnable (org...
  FilterViewerTest.testField01:282 » SWT Failed to execute runnable (org.eclipse...
  FilterViewerTest.testTimestampEqualsOr:215 » SWT Failed to execute runnable (o...
  Could not initialize class org.eclipse.tracecompass.tmf.remote.ui.swtbot.tests.fetch.FetchRemoteTracesTest
  FilterViewerTest.testTimestampFilter:165 » SWT Failed to execute runnable (org...
  FilterViewerTest.testField01:282 » SWT Failed to execute runnable (org.eclipse...
  FilterViewerTest.testTimestampEqualsOr:215 » SWT Failed to execute runnable (o...
  Could not initialize class org.eclipse.tracecompass.tmf.remote.ui.swtbot.tests.fetch.FetchRemoteTracesTest
  FilterViewerTest.testTimestampFilter:165 » SWT Failed to execute runnable (org...
  FilterViewerTest.testField01:282 » SWT Failed to execute runnable (org.eclipse...
  FilterViewerTest.testTimestampEqualsOr:215 » SWT Failed to execute runnable (o...
  Could not initialize class org.eclipse.tracecompass.tmf.remote.ui.swtbot.tests.fetch.FetchRemoteTracesTest
  FilterViewerTest.testTimestampFilter:165 » SWT Failed to execute runnable (org...
  FilterViewerTest.testField01:282 » SWT Failed to execute runnable (org.eclipse...
  FilterViewerTest.testTimestampEqualsOr:215 » SWT Failed to execute runnable (o...
  Could not initialize class org.eclipse.tracecompass.tmf.remote.ui.swtbot.tests.fetch.FetchRemoteTracesTest
  FilterViewerTest.testTimestampFilter:165 » SWT Failed to execute runnable (org...
  FilterViewerTest.testField01:282 » SWT Failed to execute runnable (org.eclipse...
  FilterViewerTest.testTimestampEqualsOr:215 » SWT Failed to execute runnable (o...
  Could not initialize class org.eclipse.tracecompass.tmf.remote.ui.swtbot.tests.fetch.FetchRemoteTracesTest
  FilterViewerTest.testTimestampFilter:165 » SWT Failed to execute runnable (org...
  FilterViewerTest.testField01:282 » SWT Failed to execute runnable (org.eclipse...
  FilterViewerTest.testTimestampEqualsOr:215 » SWT Failed to execute runnable (o...
  Could not initialize class org.eclipse.tracecompass.tmf.remote.ui.swtbot.tests.fetch.FetchRemoteTracesTest
  FilterViewerTest.testTimestampFilter:165 » SWT Failed to execute runnable (org...
  FilterViewerTest.testField01:282 » SWT Failed to execute runnable (org.eclipse...
  FilterViewerTest.testTimestampEqualsOr:215 » SWT Failed to execute runnable (o...
  Could not initialize class org.eclipse.tracecompass.tmf.remote.ui.swtbot.tests.fetch.FetchRemoteTracesTest

Tests run: 1680, Failures: 19, Errors: 78, Skipped: 0

[INFO] ------------------------------------------------------------------------
[INFO] Reactor Summary:
[INFO] 
[INFO] Trace Compass Parent .............................. SUCCESS [0.948s]
[INFO] race Compass Common Utilities Parent .............. SUCCESS [0.059s]
[INFO] Trace Compass Common Utilities Core Plug-in ....... SUCCESS [1.984s]
[INFO] Trace Compass State System Parent ................. SUCCESS [0.051s]
[INFO] Trace Compass State System Core Plug-in ........... SUCCESS [1.370s]
[INFO] Trace Compass TMF Parent .......................... SUCCESS [0.051s]
[INFO] Trace Compass TMF Core Plug-in .................... SUCCESS [4.476s]
[INFO] Trace Compass Tracetype-agnostic Analyses Parent .. SUCCESS [0.050s]
[INFO] Trace Compass Linux Kernel Analysis Core Plug-in .. SUCCESS [0.672s]
[INFO] Trace Compass CTF Support Parent .................. SUCCESS [0.057s]
[INFO] Trace Compass CTF Parser Plug-in .................. SUCCESS [3.201s]
[INFO] Trace Compass CTF Core Plug-in .................... SUCCESS [0.905s]
[INFO] CTF support for TMF Core Plug-in .................. SUCCESS [0.438s]
[INFO] Trace Compass CTF Core Tests Plug-in .............. SUCCESS [34.299s]
[INFO] Trace Compass TMF Core Tests Plug-in .............. SUCCESS [3:46.123s]
[INFO] CTF Support for TMF Core Tests Plug-in ............ SUCCESS [2:52.612s]
[INFO] Trace Compass Linux Kernel Analysis Core Tests Plug-in  SUCCESS [38.972s]
[INFO] Trace Compass TMF UI Plug-in ...................... SUCCESS [7.477s]
[INFO] Trace Compass Linux Kernel Analysis UI Plug-in .... SUCCESS [0.625s]
[INFO] Trace Compass BTF Support Parent .................. SUCCESS [0.057s]
[INFO] Best Trace Format Plug-in ......................... SUCCESS [0.405s]
[INFO] Trace Compass Documentation ....................... SUCCESS [0.049s]
[INFO] Trace Compass Developer Guide ..................... SUCCESS [7.605s]
[INFO] Trace Compass TMF Xml Analysis Core Plug-in ....... SUCCESS [0.513s]
[INFO] Trace Compass TMF Xml Analysis Ui Plug-in ......... SUCCESS [0.883s]
[INFO] Trace Compass TMF (Tracing and Monitoring Framework) Feature  SUCCESS [0.254s]
[INFO] Best Trace Format UI Plug-in ...................... SUCCESS [0.331s]
[INFO] Trace Compass BTF (Best Trace Format) Feature ..... SUCCESS [0.159s]
[INFO] Best Trace Format Tests Plug-in ................... SUCCESS [10.098s]
[INFO] Trace Compass Common Utilities Core Tests Plug-in . SUCCESS [8.052s]
[INFO] Trace Compass CTF (Common Trace Format) Feature ... SUCCESS [0.106s]
[INFO] Trace Compass CTF Parser Tests Plug-in ............ SUCCESS [7.817s]
[INFO] CTF support for TMF Feature ....................... SUCCESS [0.146s]
[INFO] Trace Compass TMF UI SWTBot Tests Plug-in ......... SUCCESS [2:58.661s]
[INFO] CTF Support for TMF SWTBot Tests Plug-in .......... SUCCESS [3:51.112s]
[INFO] Trace Compass User Guide .......................... SUCCESS [7.437s]
[INFO] Trace Compass GDB Tracepoint Analysis User Guide .. SUCCESS [5.647s]
[INFO] Trace Compass RCP User Guide ...................... SUCCESS [5.338s]
[INFO] Trace Compass Pcap User Guide ..................... SUCCESS [5.868s]
[INFO] Trace Compass Examples Plug-in .................... SUCCESS [0.437s]
[INFO] Trace Compass GDB Tracepoint Analysis Parent ...... SUCCESS [0.072s]
[INFO] Trace Compass GDB Tracepoint Analysis Core Plug-in  SUCCESS [0.551s]
[INFO] Trace Compass GDB Tracepoint Analysis UI Plug-in .. SUCCESS [0.484s]
[INFO] Trace Compass GDB Tracepoint Analysis Feature ..... SUCCESS [0.190s]
[INFO] Trace Compass GDB Tracepoint Analysis Core Tests Plug-in  SUCCESS [8.973s]
[INFO] Trace Compass GDB Tracepoint Analysis UI Tests Plug-in  SUCCESS [9.726s]
[INFO] Trace Compass LTTng Support Parent ................ SUCCESS [0.059s]
[INFO] Trace Compass LTTng Control Core Plug-in .......... SUCCESS [0.685s]
[INFO] Trace Compass TMF Remote Core Plug-in ............. SUCCESS [0.485s]
[INFO] Trace Compass TMF Remote UI Plug-in ............... SUCCESS [2.400s]
[INFO] Trace Compass LTTng Control UI Plug-in ............ SUCCESS [2.690s]
[INFO] Trace Compass LTTng (Linux Tracing Toolkit) Feature  SUCCESS [0.217s]
[INFO] Trace Compass LTTng Control Core Tests Plug-in .... SUCCESS [10.671s]
[INFO] Trace Compass TMF Remote Core Tests Plug-in ....... SUCCESS [8.621s]
[INFO] Trace Compass LTTng Control UI Tests Plug-in ...... SUCCESS [55.969s]
[INFO] Trace Compass LTTng Kernel Analysis Core Plug-in .. SUCCESS [0.582s]
[INFO] Trace Compass LTTng Kernel Analysis UI Plug-in .... SUCCESS [0.488s]
[INFO] Trace Compass LTTng Kernel Analysis Feature ....... SUCCESS [0.205s]
[INFO] Trace Compass LTTng Kernel Analysis Core Tests Plug-in  SUCCESS [1:01.941s]
[INFO] Trace Compass LTTng Kernel UI SWTBot Tests Plug-in  SUCCESS [1:44.311s]
[INFO] Trace Compass LTTng Userspace Tracer Analysis Core Plug-in  SUCCESS [0.429s]
[INFO] Trace Compass LTTng Userspace Tracer Analysis UI Plug-in  SUCCESS [0.462s]
[INFO] Trace Compass LTTng Userspace Tracer Analysis Feature  SUCCESS [0.170s]
[INFO] Trace Compass LTTng Userspace Tracer Analysis Core Test Plug-in  SUCCESS [33.566s]
[INFO] Trace Compass LTTng Userspace Tracer Analysis UI Tests Plug-in  SUCCESS [15.589s]
[INFO] Trace Compass Pcap Format Support Parent .......... SUCCESS [0.060s]
[INFO] Trace Compass Pcap Parser Core Plug-in ............ SUCCESS [0.527s]
[INFO] Trace Compass Pcap Parser Core Tests Plug-in ...... SUCCESS [17.064s]
[INFO] Pcap support for TMF Core Plug-in ................. SUCCESS [0.729s]
[INFO] Pcap support for TMF UI Plug-in ................... SUCCESS [0.540s]
[INFO] Trace Compass Pcap Analysis Feature ............... SUCCESS [0.171s]
[INFO] Pcap Support for TMF Core Tests Plug-in ........... SUCCESS [16.898s]
[INFO] Pcap Support for TMF SWTBot Tests Plug-in ......... SUCCESS [38.271s]
[INFO] Trace Compass RCP Parent .......................... SUCCESS [0.064s]
[INFO] Trace Compass RCP Branding plug-in ................ SUCCESS [0.234s]
[INFO] Trace Compass RCP Branding Feature ................ SUCCESS [0.108s]
[INFO] Trace Compass RCP UI Plug-in ...................... SUCCESS [0.459s]
[INFO] Trace Compass RCP Feature ......................... SUCCESS [0.237s]
[INFO] Trace Compass RCP Product ......................... SUCCESS [57.514s]
[INFO] Trace Compass State System Core Tests Plug-in ..... SUCCESS [14.898s]
[INFO] Trace Compass TMF UI Tests Plug-in ................ SUCCESS [2:44.886s]
[INFO] Trace Compass TMF Xml Analysis Core Tests Plug-in . SUCCESS [22.092s]
[INFO] Trace Compass TMF Xml Analysis UI Tests Plug-in ... SUCCESS [14.624s]
[INFO] Trace Compass TMF Remote UI Tests Plug-in ......... SUCCESS [17.883s]
[INFO] Trace Compass TMF Remote UI SWTBot Tests Plug-in .. SUCCESS [47.937s]
[INFO] Trace Compass Release Engineering Parent .......... SUCCESS [0.061s]
[INFO] Trace Compass All Tests ........................... FAILURE [3:21:30.439s]
[INFO] Trace Compass Testing Feature ..................... SKIPPED
[INFO] Trace Compass TMF Remote Feature .................. SKIPPED
[INFO] Trace Compass Repository .......................... SKIPPED
[INFO] Trace Compass Target Platform ..................... SKIPPED
[INFO] Trace Compass Segment Store DB Core Plug-in ....... SKIPPED
[INFO] Trace Compass Segment Store DB Core Tests Plug-in . SKIPPED
[INFO] ------------------------------------------------------------------------
[INFO] BUILD FAILURE
[INFO] ------------------------------------------------------------------------
[INFO] Total time: 3:50:33.035s
[INFO] Finished at: Mon Jul 13 17:34:53 EDT 2015
[INFO] Final Memory: 294M/8631M
[INFO] ------------------------------------------------------------------------
[INFO] o.h.m.e.h.MavenExecutionResultHandler - Build failed with exception(s)
[INFO] o.h.m.e.h.MavenExecutionResultHandler - [1] org.apache.maven.lifecycle.LifecycleExecutionException: Failed to execute goal org.eclipse.tycho:tycho-surefire-plugin:0.23.0:test (default-test) on project org.eclipse.tracecompass.alltests: There are test failures.

Please refer to /jobs/genie.tracecompass/tracecompass-swtbot-stress-tests/workspace/releng/org.eclipse.tracecompass.alltests/target/surefire-reports for the individual test results.
[DEBUG] Closing connection to remote
[ERROR] Failed to execute goal org.eclipse.tycho:tycho-surefire-plugin:0.23.0:test (default-test) on project org.eclipse.tracecompass.alltests: There are test failures.
[ERROR] 
[ERROR] Please refer to /jobs/genie.tracecompass/tracecompass-swtbot-stress-tests/workspace/releng/org.eclipse.tracecompass.alltests/target/surefire-reports for the individual test results.
[ERROR] -> [Help 1]
[ERROR] 
[ERROR] To see the full stack trace of the errors, re-run Maven with the -e switch.
[ERROR] Re-run Maven using the -X switch to enable full debug logging.
[ERROR] 
[ERROR] For more information about the errors and possible solutions, please read the following articles:
[ERROR] [Help 1] http://cwiki.apache.org/confluence/display/MAVEN/MojoFailureException
[ERROR] 
[ERROR] After correcting the problems, you can resume the build with the command
[ERROR]   mvn <goals> -rf :org.eclipse.tracecompass.alltests
[DEBUG] Waiting for process to finish
[DEBUG] Result: 1
Terminating xvnc.
Recording test results
Finished: FAILURE