UnstableConsole Output

Skipping 25,356 KB.. Full Log
TestInvalidCtfTrace)  Time elapsed: 4.619 sec
testOpen[12: ../../ctf/org.eclipse.tracecompass.ctf.core.tests/traces/ctf-testsuite/tests/1.8/regression/metadata/fail/array-size-type](org.eclipse.tracecompass.tmf.ctf.ui.swtbot.tests.TestInvalidCtfTrace)  Time elapsed: 4.853 sec
testOpen[13: ../../ctf/org.eclipse.tracecompass.ctf.core.tests/traces/ctf-testsuite/tests/1.8/regression/metadata/fail/array-size-not-present](org.eclipse.tracecompass.tmf.ctf.ui.swtbot.tests.TestInvalidCtfTrace)  Time elapsed: 4.469 sec
testOpen[14: ../../ctf/org.eclipse.tracecompass.ctf.core.tests/traces/ctf-testsuite/tests/1.8/regression/metadata/fail/struct-duplicate-field-name](org.eclipse.tracecompass.tmf.ctf.ui.swtbot.tests.TestInvalidCtfTrace)  Time elapsed: 4.849 sec
testOpen[15: ../../ctf/org.eclipse.tracecompass.ctf.core.tests/traces/ctf-testsuite/tests/1.8/regression/metadata/fail/array-size-string](org.eclipse.tracecompass.tmf.ctf.ui.swtbot.tests.TestInvalidCtfTrace)  Time elapsed: 4.861 sec
testOpen[16: ../../ctf/org.eclipse.tracecompass.ctf.core.tests/traces/ctf-testsuite/tests/1.8/regression/metadata/fail/integer-size-missing](org.eclipse.tracecompass.tmf.ctf.ui.swtbot.tests.TestInvalidCtfTrace)  Time elapsed: 4.757 sec
testOpen[17: ../../ctf/org.eclipse.tracecompass.ctf.core.tests/traces/ctf-testsuite/tests/1.8/regression/metadata/fail/integer-negative-bit-size](org.eclipse.tracecompass.tmf.ctf.ui.swtbot.tests.TestInvalidCtfTrace)  Time elapsed: 5.145 sec
testOpen[18: ../../ctf/org.eclipse.tracecompass.ctf.core.tests/traces/ctf-testsuite/tests/1.8/regression/metadata/fail/struct-align-enum](org.eclipse.tracecompass.tmf.ctf.ui.swtbot.tests.TestInvalidCtfTrace)  Time elapsed: 4.743 sec
testOpen[19: ../../ctf/org.eclipse.tracecompass.ctf.core.tests/traces/ctf-testsuite/tests/1.8/regression/metadata/fail/integer-encoding-as-string](org.eclipse.tracecompass.tmf.ctf.ui.swtbot.tests.TestInvalidCtfTrace)  Time elapsed: 4.584 sec
testOpen[20: ../../ctf/org.eclipse.tracecompass.ctf.core.tests/traces/ctf-testsuite/tests/1.8/regression/metadata/fail/struct-align-zero](org.eclipse.tracecompass.tmf.ctf.ui.swtbot.tests.TestInvalidCtfTrace)  Time elapsed: 4.775 sec
testOpen[21: ../../ctf/org.eclipse.tracecompass.ctf.core.tests/traces/ctf-testsuite/tests/1.8/regression/metadata/fail/array-redefinition](org.eclipse.tracecompass.tmf.ctf.ui.swtbot.tests.TestInvalidCtfTrace)  Time elapsed: 5.177 sec
testOpen[22: ../../ctf/org.eclipse.tracecompass.ctf.core.tests/traces/ctf-testsuite/tests/1.8/regression/metadata/fail/array-size-negative](org.eclipse.tracecompass.tmf.ctf.ui.swtbot.tests.TestInvalidCtfTrace)  Time elapsed: 4.459 sec
testOpen[23: ../../ctf/org.eclipse.tracecompass.ctf.core.tests/traces/ctf-testsuite/tests/1.8/regression/metadata/fail/struct-field-name-keyword](org.eclipse.tracecompass.tmf.ctf.ui.swtbot.tests.TestInvalidCtfTrace)  Time elapsed: 4.575 sec
test(org.eclipse.tracecompass.tmf.pcap.ui.swtbot.tests.ImportAndReadPcapTest)  Time elapsed: 28.838 sec
testPerspectiveComplete(org.eclipse.tracecompass.tmf.pcap.ui.swtbot.tests.NetworkPerspectiveChecker)  Time elapsed: 0.001 sec
testPerspectiveForViews(org.eclipse.tracecompass.tmf.pcap.ui.swtbot.tests.NetworkPerspectiveChecker)  Time elapsed: 0.013 sec
org.eclipse.tracecompass.tmf.remote.ui.swtbot.tests.fetch.FetchRemoteTracesTest  Time elapsed: 0.013 sec  <<< ERROR!
java.lang.NoClassDefFoundError: Could not initialize class org.eclipse.tracecompass.tmf.remote.ui.swtbot.tests.fetch.FetchRemoteTracesTest
	at sun.reflect.GeneratedMethodAccessor264.invoke(Unknown Source)
	at sun.reflect.DelegatingMethodAccessorImpl.invoke(DelegatingMethodAccessorImpl.java:43)
	at java.lang.reflect.Method.invoke(Method.java:606)
	at org.junit.runners.model.FrameworkMethod$1.runReflectiveCall(FrameworkMethod.java:50)
	at org.junit.internal.runners.model.ReflectiveCallable.run(ReflectiveCallable.java:12)
	at org.junit.runners.model.FrameworkMethod.invokeExplosively(FrameworkMethod.java:47)
	at org.junit.internal.runners.statements.RunBefores.evaluate(RunBefores.java:24)
	at org.junit.runners.ParentRunner.run(ParentRunner.java:363)
	at org.eclipse.swtbot.swt.finder.junit.SWTBotJunit4ClassRunner.run(SWTBotJunit4ClassRunner.java:54)
	at org.junit.runners.Suite.runChild(Suite.java:128)
	at org.junit.runners.Suite.runChild(Suite.java:27)
	at org.junit.runners.ParentRunner$3.run(ParentRunner.java:290)
	at org.junit.runners.ParentRunner$1.schedule(ParentRunner.java:71)
	at org.junit.runners.ParentRunner.runChildren(ParentRunner.java:288)
	at org.junit.runners.ParentRunner.access$000(ParentRunner.java:58)
	at org.junit.runners.ParentRunner$2.evaluate(ParentRunner.java:268)
	at org.junit.runners.ParentRunner.run(ParentRunner.java:363)
	at org.junit.runners.Suite.runChild(Suite.java:128)
	at org.junit.runners.Suite.runChild(Suite.java:27)
	at org.junit.runners.ParentRunner$3.run(ParentRunner.java:290)
	at org.junit.runners.ParentRunner$1.schedule(ParentRunner.java:71)
	at org.junit.runners.ParentRunner.runChildren(ParentRunner.java:288)
	at org.junit.runners.ParentRunner.access$000(ParentRunner.java:58)
	at org.junit.runners.ParentRunner$2.evaluate(ParentRunner.java:268)
	at org.junit.runners.ParentRunner.run(ParentRunner.java:363)
	at org.junit.runners.Suite.runChild(Suite.java:128)
	at org.junit.runners.Suite.runChild(Suite.java:27)
	at org.junit.runners.ParentRunner$3.run(ParentRunner.java:290)
	at org.junit.runners.ParentRunner$1.schedule(ParentRunner.java:71)
	at org.junit.runners.ParentRunner.runChildren(ParentRunner.java:288)
	at org.junit.runners.ParentRunner.access$000(ParentRunner.java:58)
	at org.junit.runners.ParentRunner$2.evaluate(ParentRunner.java:268)
	at org.junit.runners.ParentRunner.run(ParentRunner.java:363)
	at org.apache.maven.surefire.junit4.JUnit4Provider.execute(JUnit4Provider.java:264)
	at org.apache.maven.surefire.junit4.JUnit4Provider.executeTestSet(JUnit4Provider.java:153)
	at org.apache.maven.surefire.junit4.JUnit4Provider.invoke(JUnit4Provider.java:124)
	at sun.reflect.NativeMethodAccessorImpl.invoke0(Native Method)
	at sun.reflect.NativeMethodAccessorImpl.invoke(NativeMethodAccessorImpl.java:57)
	at sun.reflect.DelegatingMethodAccessorImpl.invoke(DelegatingMethodAccessorImpl.java:43)
	at java.lang.reflect.Method.invoke(Method.java:606)
	at org.apache.maven.surefire.util.ReflectionUtils.invokeMethodWithArray2(ReflectionUtils.java:208)
	at org.apache.maven.surefire.booter.ProviderFactory$ProviderProxy.invoke(ProviderFactory.java:156)
	at org.apache.maven.surefire.booter.ProviderFactory.invokeProvider(ProviderFactory.java:82)
	at org.eclipse.tycho.surefire.osgibooter.OsgiSurefireBooter.run(OsgiSurefireBooter.java:91)
	at org.eclipse.tycho.surefire.osgibooter.AbstractUITestApplication.runTests(AbstractUITestApplication.java:44)
	at org.eclipse.e4.ui.internal.workbench.swt.E4Testable$1.run(E4Testable.java:73)
	at java.lang.Thread.run(Thread.java:745)

testPerspectiveComplete(org.eclipse.tracecompass.lttng2.kernel.ui.swtbot.tests.KernelPerspectiveChecker)  Time elapsed: 0.571 sec
testPerspectiveForViews(org.eclipse.tracecompass.lttng2.kernel.ui.swtbot.tests.KernelPerspectiveChecker)  Time elapsed: 0.023 sec
test(org.eclipse.tracecompass.lttng2.kernel.ui.swtbot.tests.ImportAndReadKernelSmokeTest)  Time elapsed: 18.197 sec
testToolBarFollowCPUForwardBackward(org.eclipse.tracecompass.lttng2.kernel.ui.swtbot.tests.ControlFlowViewTest)  Time elapsed: 21.434 sec
testKeyboardLeftRight(org.eclipse.tracecompass.lttng2.kernel.ui.swtbot.tests.ControlFlowViewTest)  Time elapsed: 17.847 sec
testToolBarSelectNextPreviousEvent(org.eclipse.tracecompass.lttng2.kernel.ui.swtbot.tests.ControlFlowViewTest)  Time elapsed: 15.841 sec
testOpenAndCloseConcurrency(org.eclipse.tracecompass.lttng2.kernel.ui.swtbot.tests.OpenTraceStressTest)  Time elapsed: 51.877 sec
testNew(org.eclipse.tracecompass.tmf.ui.swtbot.tests.parsers.custom.TestCustomTxtWizard)  Time elapsed: 8.512 sec
testEdit(org.eclipse.tracecompass.tmf.ui.swtbot.tests.parsers.custom.TestCustomTxtWizard)  Time elapsed: 9.604 sec
testNew(org.eclipse.tracecompass.tmf.ui.swtbot.tests.parsers.custom.TestCustomXmlWizard)  Time elapsed: 8.04 sec
testPerspectiveComplete(org.eclipse.tracecompass.tmf.ui.swtbot.tests.perspectives.TracingPerspectiveChecker)  Time elapsed: 0.001 sec  <<< FAILURE!
java.lang.AssertionError: view org.eclipse.swtbot.eclipse.finder.widgets.SWTBotView@37ead70f is present
	at org.junit.Assert.fail(Assert.java:88)
	at org.junit.Assert.assertTrue(Assert.java:41)
	at org.eclipse.tracecompass.tmf.ui.swtbot.tests.shared.AbstractPerspectiveChecker.testPerspectiveComplete(AbstractPerspectiveChecker.java:118)
	at sun.reflect.GeneratedMethodAccessor157.invoke(Unknown Source)
	at sun.reflect.DelegatingMethodAccessorImpl.invoke(DelegatingMethodAccessorImpl.java:43)
	at java.lang.reflect.Method.invoke(Method.java:606)
	at org.junit.runners.model.FrameworkMethod$1.runReflectiveCall(FrameworkMethod.java:50)
	at org.junit.internal.runners.model.ReflectiveCallable.run(ReflectiveCallable.java:12)
	at org.junit.runners.model.FrameworkMethod.invokeExplosively(FrameworkMethod.java:47)
	at org.junit.internal.runners.statements.InvokeMethod.evaluate(InvokeMethod.java:17)
	at org.junit.internal.runners.statements.RunBefores.evaluate(RunBefores.java:26)
	at org.junit.runners.ParentRunner.runLeaf(ParentRunner.java:325)
	at org.junit.runners.BlockJUnit4ClassRunner.runChild(BlockJUnit4ClassRunner.java:78)
	at org.junit.runners.BlockJUnit4ClassRunner.runChild(BlockJUnit4ClassRunner.java:57)
	at org.junit.runners.ParentRunner$3.run(ParentRunner.java:290)
	at org.junit.runners.ParentRunner$1.schedule(ParentRunner.java:71)
	at org.junit.runners.ParentRunner.runChildren(ParentRunner.java:288)
	at org.junit.runners.ParentRunner.access$000(ParentRunner.java:58)
	at org.junit.runners.ParentRunner$2.evaluate(ParentRunner.java:268)
	at org.junit.internal.runners.statements.RunBefores.evaluate(RunBefores.java:26)
	at org.junit.internal.runners.statements.RunAfters.evaluate(RunAfters.java:27)
	at org.junit.runners.ParentRunner.run(ParentRunner.java:363)
	at org.eclipse.swtbot.swt.finder.junit.SWTBotJunit4ClassRunner.run(SWTBotJunit4ClassRunner.java:54)
	at org.junit.runners.Suite.runChild(Suite.java:128)
	at org.junit.runners.Suite.runChild(Suite.java:27)
	at org.junit.runners.ParentRunner$3.run(ParentRunner.java:290)
	at org.junit.runners.ParentRunner$1.schedule(ParentRunner.java:71)
	at org.junit.runners.ParentRunner.runChildren(ParentRunner.java:288)
	at org.junit.runners.ParentRunner.access$000(ParentRunner.java:58)
	at org.junit.runners.ParentRunner$2.evaluate(ParentRunner.java:268)
	at org.junit.runners.ParentRunner.run(ParentRunner.java:363)
	at org.junit.runners.Suite.runChild(Suite.java:128)
	at org.junit.runners.Suite.runChild(Suite.java:27)
	at org.junit.runners.ParentRunner$3.run(ParentRunner.java:290)
	at org.junit.runners.ParentRunner$1.schedule(ParentRunner.java:71)
	at org.junit.runners.ParentRunner.runChildren(ParentRunner.java:288)
	at org.junit.runners.ParentRunner.access$000(ParentRunner.java:58)
	at org.junit.runners.ParentRunner$2.evaluate(ParentRunner.java:268)
	at org.junit.runners.ParentRunner.run(ParentRunner.java:363)
	at org.junit.runners.Suite.runChild(Suite.java:128)
	at org.junit.runners.Suite.runChild(Suite.java:27)
	at org.junit.runners.ParentRunner$3.run(ParentRunner.java:290)
	at org.junit.runners.ParentRunner$1.schedule(ParentRunner.java:71)
	at org.junit.runners.ParentRunner.runChildren(ParentRunner.java:288)
	at org.junit.runners.ParentRunner.access$000(ParentRunner.java:58)
	at org.junit.runners.ParentRunner$2.evaluate(ParentRunner.java:268)
	at org.junit.runners.ParentRunner.run(ParentRunner.java:363)
	at org.apache.maven.surefire.junit4.JUnit4Provider.execute(JUnit4Provider.java:264)
	at org.apache.maven.surefire.junit4.JUnit4Provider.executeTestSet(JUnit4Provider.java:153)
	at org.apache.maven.surefire.junit4.JUnit4Provider.invoke(JUnit4Provider.java:124)
	at sun.reflect.NativeMethodAccessorImpl.invoke0(Native Method)
	at sun.reflect.NativeMethodAccessorImpl.invoke(NativeMethodAccessorImpl.java:57)
	at sun.reflect.DelegatingMethodAccessorImpl.invoke(DelegatingMethodAccessorImpl.java:43)
	at java.lang.reflect.Method.invoke(Method.java:606)
	at org.apache.maven.surefire.util.ReflectionUtils.invokeMethodWithArray2(ReflectionUtils.java:208)
	at org.apache.maven.surefire.booter.ProviderFactory$ProviderProxy.invoke(ProviderFactory.java:156)
	at org.apache.maven.surefire.booter.ProviderFactory.invokeProvider(ProviderFactory.java:82)
	at org.eclipse.tycho.surefire.osgibooter.OsgiSurefireBooter.run(OsgiSurefireBooter.java:91)
	at org.eclipse.tycho.surefire.osgibooter.AbstractUITestApplication.runTests(AbstractUITestApplication.java:44)
	at org.eclipse.e4.ui.internal.workbench.swt.E4Testable$1.run(E4Testable.java:73)
	at java.lang.Thread.run(Thread.java:745)

testPerspectiveForViews(org.eclipse.tracecompass.tmf.ui.swtbot.tests.perspectives.TracingPerspectiveChecker)  Time elapsed: 0.002 sec
test(org.eclipse.tracecompass.tmf.ui.swtbot.tests.viewers.events.CallsiteEventsInTableTest)  Time elapsed: 8.99 sec
test(org.eclipse.tracecompass.tmf.ui.swtbot.tests.viewers.events.CollapseEventsInTableTest)  Time elapsed: 9.667 sec
testYellow(org.eclipse.tracecompass.tmf.ui.swtbot.tests.viewers.events.ColorsViewTest)  Time elapsed: 8.179 sec
testToggleColumns(org.eclipse.tracecompass.tmf.ui.swtbot.tests.viewers.events.ColumnHeaderMenuTest)  Time elapsed: 3.175 sec
testShowAll(org.eclipse.tracecompass.tmf.ui.swtbot.tests.viewers.events.ColumnHeaderMenuTest)  Time elapsed: 3.018 sec
testNoCopySearchRow(org.eclipse.tracecompass.tmf.ui.swtbot.tests.viewers.events.CopyToClipboardTest)  Time elapsed: 4.179 sec
testCopySingleSelection(org.eclipse.tracecompass.tmf.ui.swtbot.tests.viewers.events.CopyToClipboardTest)  Time elapsed: 3.258 sec
testCopyMultipleSelection(org.eclipse.tracecompass.tmf.ui.swtbot.tests.viewers.events.CopyToClipboardTest)  Time elapsed: 2.883 sec
testMultiHighlightMessage(org.eclipse.tracecompass.tmf.ui.swtbot.tests.viewers.events.FilterColorEditorTest)  Time elapsed: 7.477 sec
testSwitchToFilter(org.eclipse.tracecompass.tmf.ui.swtbot.tests.viewers.events.FilterColorEditorTest)  Time elapsed: 8.867 sec
testHighlight(org.eclipse.tracecompass.tmf.ui.swtbot.tests.viewers.events.FilterColorEditorTest)  Time elapsed: 7.575 sec
testPreference(org.eclipse.tracecompass.tmf.ui.swtbot.tests.viewers.events.FilterColorEditorTest)  Time elapsed: 8.407 sec
testTimestampFilter(org.eclipse.tracecompass.tmf.ui.swtbot.tests.viewers.events.FilterViewerTest)  Time elapsed: 3.215 sec  <<< ERROR!
org.eclipse.swt.SWTException: Failed to execute runnable (org.eclipse.swtbot.swt.finder.exceptions.WidgetNotFoundException: Could not find menu: TRACETYPE)
	at org.eclipse.swt.SWT.error(SWT.java:4491)
	at org.eclipse.swt.SWT.error(SWT.java:4406)
	at org.eclipse.swt.widgets.Synchronizer.syncExec(Synchronizer.java:208)
	at org.eclipse.ui.internal.UISynchronizer.syncExec(UISynchronizer.java:145)
	at org.eclipse.swt.widgets.Display.syncExec(Display.java:4633)
	at org.eclipse.swtbot.swt.finder.finders.UIThreadRunnable.run(UIThreadRunnable.java:76)
	at org.eclipse.swtbot.swt.finder.finders.UIThreadRunnable.syncExec(UIThreadRunnable.java:142)
	at org.eclipse.swtbot.swt.finder.finders.UIThreadRunnable.syncExec(UIThreadRunnable.java:125)
	at org.eclipse.swtbot.swt.finder.finders.ContextMenuHelper.contextMenu(ContextMenuHelper.java:42)
	at org.eclipse.swtbot.swt.finder.widgets.SWTBotTreeItem.contextMenu(SWTBotTreeItem.java:558)
	at org.eclipse.tracecompass.tmf.ui.swtbot.tests.viewers.events.FilterViewerTest.testTimestampFilter(FilterViewerTest.java:165)
Caused by: org.eclipse.swtbot.swt.finder.exceptions.WidgetNotFoundException: Could not find menu: TRACETYPE
	at org.eclipse.swtbot.swt.finder.finders.ContextMenuHelper$1.run(ContextMenuHelper.java:63)
	at org.eclipse.swtbot.swt.finder.finders.ContextMenuHelper$1.run(ContextMenuHelper.java:1)
	at org.eclipse.swtbot.swt.finder.finders.UIThreadRunnable$2.doRun(UIThreadRunnable.java:140)
	at org.eclipse.swtbot.swt.finder.finders.UIThreadRunnable$1.run(UIThreadRunnable.java:89)
	at org.eclipse.swt.widgets.RunnableLock.run(RunnableLock.java:35)
	at org.eclipse.swt.widgets.Synchronizer.runAsyncMessages(Synchronizer.java:135)
	at org.eclipse.swt.widgets.Display.runAsyncMessages(Display.java:3794)
	at org.eclipse.swt.widgets.Display.readAndDispatch(Display.java:3433)
	at org.eclipse.e4.ui.internal.workbench.swt.PartRenderingEngine$4.run(PartRenderingEngine.java:1127)
	at org.eclipse.core.databinding.observable.Realm.runWithDefault(Realm.java:337)
	at org.eclipse.e4.ui.internal.workbench.swt.PartRenderingEngine.run(PartRenderingEngine.java:1018)
	at org.eclipse.e4.ui.internal.workbench.E4Workbench.createAndRunUI(E4Workbench.java:156)
	at org.eclipse.ui.internal.Workbench$5.run(Workbench.java:654)
	at org.eclipse.core.databinding.observable.Realm.runWithDefault(Realm.java:337)
	at org.eclipse.ui.internal.Workbench.createAndRunWorkbench(Workbench.java:598)
	at org.eclipse.ui.PlatformUI.createAndRunWorkbench(PlatformUI.java:150)
	at org.eclipse.ui.internal.ide.application.IDEApplication.start(IDEApplication.java:139)
	at org.eclipse.tycho.surefire.osgibooter.UITestApplication.runApplication(UITestApplication.java:31)
	at org.eclipse.tycho.surefire.osgibooter.AbstractUITestApplication.run(AbstractUITestApplication.java:120)
	at org.eclipse.tycho.surefire.osgibooter.UITestApplication.start(UITestApplication.java:37)
	at org.eclipse.equinox.internal.app.EclipseAppHandle.run(EclipseAppHandle.java:196)
	at org.eclipse.core.runtime.internal.adaptor.EclipseAppLauncher.runApplication(EclipseAppLauncher.java:134)
	at org.eclipse.core.runtime.internal.adaptor.EclipseAppLauncher.start(EclipseAppLauncher.java:104)
	at org.eclipse.core.runtime.adaptor.EclipseStarter.run(EclipseStarter.java:380)
	at org.eclipse.core.runtime.adaptor.EclipseStarter.run(EclipseStarter.java:235)
	at sun.reflect.NativeMethodAccessorImpl.invoke0(Native Method)
	at sun.reflect.NativeMethodAccessorImpl.invoke(NativeMethodAccessorImpl.java:57)
	at sun.reflect.DelegatingMethodAccessorImpl.invoke(DelegatingMethodAccessorImpl.java:43)
	at java.lang.reflect.Method.invoke(Method.java:606)
	at org.eclipse.equinox.launcher.Main.invokeFramework(Main.java:669)
	at org.eclipse.equinox.launcher.Main.basicRun(Main.java:608)
	at org.eclipse.equinox.launcher.Main.run(Main.java:1515)
	at org.eclipse.equinox.launcher.Main.main(Main.java:1488)

testField01(org.eclipse.tracecompass.tmf.ui.swtbot.tests.viewers.events.FilterViewerTest)  Time elapsed: 3.63 sec  <<< ERROR!
org.eclipse.swt.SWTException: Failed to execute runnable (org.eclipse.swtbot.swt.finder.exceptions.WidgetNotFoundException: Could not find menu: TRACETYPE)
	at org.eclipse.swt.SWT.error(SWT.java:4491)
	at org.eclipse.swt.SWT.error(SWT.java:4406)
	at org.eclipse.swt.widgets.Synchronizer.syncExec(Synchronizer.java:208)
	at org.eclipse.ui.internal.UISynchronizer.syncExec(UISynchronizer.java:145)
	at org.eclipse.swt.widgets.Display.syncExec(Display.java:4633)
	at org.eclipse.swtbot.swt.finder.finders.UIThreadRunnable.run(UIThreadRunnable.java:76)
	at org.eclipse.swtbot.swt.finder.finders.UIThreadRunnable.syncExec(UIThreadRunnable.java:142)
	at org.eclipse.swtbot.swt.finder.finders.UIThreadRunnable.syncExec(UIThreadRunnable.java:125)
	at org.eclipse.swtbot.swt.finder.finders.ContextMenuHelper.contextMenu(ContextMenuHelper.java:42)
	at org.eclipse.swtbot.swt.finder.widgets.SWTBotTreeItem.contextMenu(SWTBotTreeItem.java:558)
	at org.eclipse.tracecompass.tmf.ui.swtbot.tests.viewers.events.FilterViewerTest.testField01(FilterViewerTest.java:282)
Caused by: org.eclipse.swtbot.swt.finder.exceptions.WidgetNotFoundException: Could not find menu: TRACETYPE
	at org.eclipse.swtbot.swt.finder.finders.ContextMenuHelper$1.run(ContextMenuHelper.java:63)
	at org.eclipse.swtbot.swt.finder.finders.ContextMenuHelper$1.run(ContextMenuHelper.java:1)
	at org.eclipse.swtbot.swt.finder.finders.UIThreadRunnable$2.doRun(UIThreadRunnable.java:140)
	at org.eclipse.swtbot.swt.finder.finders.UIThreadRunnable$1.run(UIThreadRunnable.java:89)
	at org.eclipse.swt.widgets.RunnableLock.run(RunnableLock.java:35)
	at org.eclipse.swt.widgets.Synchronizer.runAsyncMessages(Synchronizer.java:135)
	at org.eclipse.swt.widgets.Display.runAsyncMessages(Display.java:3794)
	at org.eclipse.swt.widgets.Display.readAndDispatch(Display.java:3433)
	at org.eclipse.e4.ui.internal.workbench.swt.PartRenderingEngine$4.run(PartRenderingEngine.java:1127)
	at org.eclipse.core.databinding.observable.Realm.runWithDefault(Realm.java:337)
	at org.eclipse.e4.ui.internal.workbench.swt.PartRenderingEngine.run(PartRenderingEngine.java:1018)
	at org.eclipse.e4.ui.internal.workbench.E4Workbench.createAndRunUI(E4Workbench.java:156)
	at org.eclipse.ui.internal.Workbench$5.run(Workbench.java:654)
	at org.eclipse.core.databinding.observable.Realm.runWithDefault(Realm.java:337)
	at org.eclipse.ui.internal.Workbench.createAndRunWorkbench(Workbench.java:598)
	at org.eclipse.ui.PlatformUI.createAndRunWorkbench(PlatformUI.java:150)
	at org.eclipse.ui.internal.ide.application.IDEApplication.start(IDEApplication.java:139)
	at org.eclipse.tycho.surefire.osgibooter.UITestApplication.runApplication(UITestApplication.java:31)
	at org.eclipse.tycho.surefire.osgibooter.AbstractUITestApplication.run(AbstractUITestApplication.java:120)
	at org.eclipse.tycho.surefire.osgibooter.UITestApplication.start(UITestApplication.java:37)
	at org.eclipse.equinox.internal.app.EclipseAppHandle.run(EclipseAppHandle.java:196)
	at org.eclipse.core.runtime.internal.adaptor.EclipseAppLauncher.runApplication(EclipseAppLauncher.java:134)
	at org.eclipse.core.runtime.internal.adaptor.EclipseAppLauncher.start(EclipseAppLauncher.java:104)
	at org.eclipse.core.runtime.adaptor.EclipseStarter.run(EclipseStarter.java:380)
	at org.eclipse.core.runtime.adaptor.EclipseStarter.run(EclipseStarter.java:235)
	at sun.reflect.NativeMethodAccessorImpl.invoke0(Native Method)
	at sun.reflect.NativeMethodAccessorImpl.invoke(NativeMethodAccessorImpl.java:57)
	at sun.reflect.DelegatingMethodAccessorImpl.invoke(DelegatingMethodAccessorImpl.java:43)
	at java.lang.reflect.Method.invoke(Method.java:606)
	at org.eclipse.equinox.launcher.Main.invokeFramework(Main.java:669)
	at org.eclipse.equinox.launcher.Main.basicRun(Main.java:608)
	at org.eclipse.equinox.launcher.Main.run(Main.java:1515)
	at org.eclipse.equinox.launcher.Main.main(Main.java:1488)

testTimestampEqualsOr(org.eclipse.tracecompass.tmf.ui.swtbot.tests.viewers.events.FilterViewerTest)  Time elapsed: 3.323 sec  <<< ERROR!
org.eclipse.swt.SWTException: Failed to execute runnable (org.eclipse.swtbot.swt.finder.exceptions.WidgetNotFoundException: Could not find menu: TRACETYPE)
	at org.eclipse.swt.SWT.error(SWT.java:4491)
	at org.eclipse.swt.SWT.error(SWT.java:4406)
	at org.eclipse.swt.widgets.Synchronizer.syncExec(Synchronizer.java:208)
	at org.eclipse.ui.internal.UISynchronizer.syncExec(UISynchronizer.java:145)
	at org.eclipse.swt.widgets.Display.syncExec(Display.java:4633)
	at org.eclipse.swtbot.swt.finder.finders.UIThreadRunnable.run(UIThreadRunnable.java:76)
	at org.eclipse.swtbot.swt.finder.finders.UIThreadRunnable.syncExec(UIThreadRunnable.java:142)
	at org.eclipse.swtbot.swt.finder.finders.UIThreadRunnable.syncExec(UIThreadRunnable.java:125)
	at org.eclipse.swtbot.swt.finder.finders.ContextMenuHelper.contextMenu(ContextMenuHelper.java:42)
	at org.eclipse.swtbot.swt.finder.widgets.SWTBotTreeItem.contextMenu(SWTBotTreeItem.java:558)
	at org.eclipse.tracecompass.tmf.ui.swtbot.tests.viewers.events.FilterViewerTest.testTimestampEqualsOr(FilterViewerTest.java:215)
Caused by: org.eclipse.swtbot.swt.finder.exceptions.WidgetNotFoundException: Could not find menu: TRACETYPE
	at org.eclipse.swtbot.swt.finder.finders.ContextMenuHelper$1.run(ContextMenuHelper.java:63)
	at org.eclipse.swtbot.swt.finder.finders.ContextMenuHelper$1.run(ContextMenuHelper.java:1)
	at org.eclipse.swtbot.swt.finder.finders.UIThreadRunnable$2.doRun(UIThreadRunnable.java:140)
	at org.eclipse.swtbot.swt.finder.finders.UIThreadRunnable$1.run(UIThreadRunnable.java:89)
	at org.eclipse.swt.widgets.RunnableLock.run(RunnableLock.java:35)
	at org.eclipse.swt.widgets.Synchronizer.runAsyncMessages(Synchronizer.java:135)
	at org.eclipse.swt.widgets.Display.runAsyncMessages(Display.java:3794)
	at org.eclipse.swt.widgets.Display.readAndDispatch(Display.java:3433)
	at org.eclipse.e4.ui.internal.workbench.swt.PartRenderingEngine$4.run(PartRenderingEngine.java:1127)
	at org.eclipse.core.databinding.observable.Realm.runWithDefault(Realm.java:337)
	at org.eclipse.e4.ui.internal.workbench.swt.PartRenderingEngine.run(PartRenderingEngine.java:1018)
	at org.eclipse.e4.ui.internal.workbench.E4Workbench.createAndRunUI(E4Workbench.java:156)
	at org.eclipse.ui.internal.Workbench$5.run(Workbench.java:654)
	at org.eclipse.core.databinding.observable.Realm.runWithDefault(Realm.java:337)
	at org.eclipse.ui.internal.Workbench.createAndRunWorkbench(Workbench.java:598)
	at org.eclipse.ui.PlatformUI.createAndRunWorkbench(PlatformUI.java:150)
	at org.eclipse.ui.internal.ide.application.IDEApplication.start(IDEApplication.java:139)
	at org.eclipse.tycho.surefire.osgibooter.UITestApplication.runApplication(UITestApplication.java:31)
	at org.eclipse.tycho.surefire.osgibooter.AbstractUITestApplication.run(AbstractUITestApplication.java:120)
	at org.eclipse.tycho.surefire.osgibooter.UITestApplication.start(UITestApplication.java:37)
	at org.eclipse.equinox.internal.app.EclipseAppHandle.run(EclipseAppHandle.java:196)
	at org.eclipse.core.runtime.internal.adaptor.EclipseAppLauncher.runApplication(EclipseAppLauncher.java:134)
	at org.eclipse.core.runtime.internal.adaptor.EclipseAppLauncher.start(EclipseAppLauncher.java:104)
	at org.eclipse.core.runtime.adaptor.EclipseStarter.run(EclipseStarter.java:380)
	at org.eclipse.core.runtime.adaptor.EclipseStarter.run(EclipseStarter.java:235)
	at sun.reflect.NativeMethodAccessorImpl.invoke0(Native Method)
	at sun.reflect.NativeMethodAccessorImpl.invoke(NativeMethodAccessorImpl.java:57)
	at sun.reflect.DelegatingMethodAccessorImpl.invoke(DelegatingMethodAccessorImpl.java:43)
	at java.lang.reflect.Method.invoke(Method.java:606)
	at org.eclipse.equinox.launcher.Main.invokeFramework(Main.java:669)
	at org.eclipse.equinox.launcher.Main.basicRun(Main.java:608)
	at org.eclipse.equinox.launcher.Main.run(Main.java:1515)
	at org.eclipse.equinox.launcher.Main.main(Main.java:1488)

testChangeFont(org.eclipse.tracecompass.tmf.ui.swtbot.tests.viewers.events.FontEventEditorTest)  Time elapsed: 11.487 sec
testReorder(org.eclipse.tracecompass.tmf.ui.swtbot.tests.viewers.events.MovableColumnEventsEditorTest)  Time elapsed: 12.262 sec
testSDView(org.eclipse.tracecompass.tmf.ui.swtbot.tests.viewers.events.SDViewTest)  Time elapsed: 5.486 sec
testOffsetting(org.eclipse.tracecompass.tmf.ui.swtbot.tests.viewers.events.TestTraceOffsetting)  Time elapsed: 10.257 sec
testOverlappingTimechartMove(org.eclipse.tracecompass.tmf.ui.swtbot.tests.viewers.events.TmfAlignTimeAxisTest)  Time elapsed: 5.296 sec
testNotOverlappingCallstackMove(org.eclipse.tracecompass.tmf.ui.swtbot.tests.viewers.events.TmfAlignTimeAxisTest)  Time elapsed: 5.391 sec
testMoveHistogramCallstackFollows(org.eclipse.tracecompass.tmf.ui.swtbot.tests.viewers.events.TmfAlignTimeAxisTest)  Time elapsed: 5.284 sec
testOverlappingHistogramMove(org.eclipse.tracecompass.tmf.ui.swtbot.tests.viewers.events.TmfAlignTimeAxisTest)  Time elapsed: 5.278 sec
testNotOverlappingHistogramMove(org.eclipse.tracecompass.tmf.ui.swtbot.tests.viewers.events.TmfAlignTimeAxisTest)  Time elapsed: 5.28 sec
testMoveCallstackHistogramFollows(org.eclipse.tracecompass.tmf.ui.swtbot.tests.viewers.events.TmfAlignTimeAxisTest)  Time elapsed: 5.343 sec
testGzipImport(org.eclipse.tracecompass.tmf.ui.swtbot.tests.wizards.StandardImportGzipTraceTest)  Time elapsed: 6.125 sec
test(org.eclipse.tracecompass.tmf.ctf.ui.swtbot.tests.ImportAndReadSmokeTest)  Time elapsed: 12.472 sec
testImportFromDirectory(org.eclipse.tracecompass.tmf.ctf.ui.swtbot.tests.StandardImportAndReadSmokeTest)  Time elapsed: 7.949 sec
testExtractArchivesFromArchive(org.eclipse.tracecompass.tmf.ctf.ui.swtbot.tests.StandardImportAndReadSmokeTest)  Time elapsed: 17.506 sec
testImportFromDirectoryLinksPreserveFolder(org.eclipse.tracecompass.tmf.ctf.ui.swtbot.tests.StandardImportAndReadSmokeTest)  Time elapsed: 7.594 sec
testExtractArchivesFromArchivePreserveFolder(org.eclipse.tracecompass.tmf.ctf.ui.swtbot.tests.StandardImportAndReadSmokeTest)  Time elapsed: 17.994 sec
testExtractArchivesFromDirectory(org.eclipse.tracecompass.tmf.ctf.ui.swtbot.tests.StandardImportAndReadSmokeTest)  Time elapsed: 14.066 sec
testImportFromArchive(org.eclipse.tracecompass.tmf.ctf.ui.swtbot.tests.StandardImportAndReadSmokeTest)  Time elapsed: 12.939 sec
testExtractArchivesFromDirectoryLinksPreserveStruture(org.eclipse.tracecompass.tmf.ctf.ui.swtbot.tests.StandardImportAndReadSmokeTest)  Time elapsed: 12.998 sec
testEmptyDirectory(org.eclipse.tracecompass.tmf.ctf.ui.swtbot.tests.StandardImportAndReadSmokeTest)  Time elapsed: 5.9 sec
testEmptyArchive(org.eclipse.tracecompass.tmf.ctf.ui.swtbot.tests.StandardImportAndReadSmokeTest)  Time elapsed: 9.966 sec
testNestedEmptyArchive(org.eclipse.tracecompass.tmf.ctf.ui.swtbot.tests.StandardImportAndReadSmokeTest)  Time elapsed: 13.008 sec
testImportFromArchiveOverwrite(org.eclipse.tracecompass.tmf.ctf.ui.swtbot.tests.StandardImportAndReadSmokeTest)  Time elapsed: 15.078 sec
testDirectoryWithEmptyArchive(org.eclipse.tracecompass.tmf.ctf.ui.swtbot.tests.StandardImportAndReadSmokeTest)  Time elapsed: 9.609 sec
testImportFromDirectoryPreserveFolder(org.eclipse.tracecompass.tmf.ctf.ui.swtbot.tests.StandardImportAndReadSmokeTest)  Time elapsed: 8.466 sec
testImportFromDirectoryLinks(org.eclipse.tracecompass.tmf.ctf.ui.swtbot.tests.StandardImportAndReadSmokeTest)  Time elapsed: 8.257 sec
testImportFromDirectoryOverwrite(org.eclipse.tracecompass.tmf.ctf.ui.swtbot.tests.StandardImportAndReadSmokeTest)  Time elapsed: 15.958 sec
testExtractArchivesFromDirectoryLinks(org.eclipse.tracecompass.tmf.ctf.ui.swtbot.tests.StandardImportAndReadSmokeTest)  Time elapsed: 13.318 sec
testImportFromArchivePreserveFolder(org.eclipse.tracecompass.tmf.ctf.ui.swtbot.tests.StandardImportAndReadSmokeTest)  Time elapsed: 8.226 sec
testOpen[0: ../../ctf/org.eclipse.tracecompass.ctf.core.tests/traces/ctf-testsuite/tests/1.8/regression/metadata/fail/struct-align-negative](org.eclipse.tracecompass.tmf.ctf.ui.swtbot.tests.TestInvalidCtfTrace)  Time elapsed: 5.244 sec
testOpen[1: ../../ctf/org.eclipse.tracecompass.ctf.core.tests/traces/ctf-testsuite/tests/1.8/regression/metadata/fail/array-size-identifier](org.eclipse.tracecompass.tmf.ctf.ui.swtbot.tests.TestInvalidCtfTrace)  Time elapsed: 4.694 sec
testOpen[2: ../../ctf/org.eclipse.tracecompass.ctf.core.tests/traces/ctf-testsuite/tests/1.8/regression/metadata/fail/struct-align-huge](org.eclipse.tracecompass.tmf.ctf.ui.swtbot.tests.TestInvalidCtfTrace)  Time elapsed: 4.804 sec
testOpen[3: ../../ctf/org.eclipse.tracecompass.ctf.core.tests/traces/ctf-testsuite/tests/1.8/regression/metadata/fail/integer-signed-as-string](org.eclipse.tracecompass.tmf.ctf.ui.swtbot.tests.TestInvalidCtfTrace)  Time elapsed: 5.031 sec
testOpen[4: ../../ctf/org.eclipse.tracecompass.ctf.core.tests/traces/ctf-testsuite/tests/1.8/regression/metadata/fail/array-size-keyword](org.eclipse.tracecompass.tmf.ctf.ui.swtbot.tests.TestInvalidCtfTrace)  Time elapsed: 4.936 sec
testOpen[5: ../../ctf/org.eclipse.tracecompass.ctf.core.tests/traces/ctf-testsuite/tests/1.8/regression/metadata/fail/integer-range](org.eclipse.tracecompass.tmf.ctf.ui.swtbot.tests.TestInvalidCtfTrace)  Time elapsed: 4.995 sec
testOpen[6: ../../ctf/org.eclipse.tracecompass.ctf.core.tests/traces/ctf-testsuite/tests/1.8/regression/metadata/fail/integer-signed-invalid](org.eclipse.tracecompass.tmf.ctf.ui.swtbot.tests.TestInvalidCtfTrace)  Time elapsed: 6.564 sec
testOpen[7: ../../ctf/org.eclipse.tracecompass.ctf.core.tests/traces/ctf-testsuite/tests/1.8/regression/metadata/fail/struct-align-string](org.eclipse.tracecompass.tmf.ctf.ui.swtbot.tests.TestInvalidCtfTrace)  Time elapsed: 4.695 sec
testOpen[8: ../../ctf/org.eclipse.tracecompass.ctf.core.tests/traces/ctf-testsuite/tests/1.8/regression/metadata/fail/array-size-type-field](org.eclipse.tracecompass.tmf.ctf.ui.swtbot.tests.TestInvalidCtfTrace)  Time elapsed: 4.586 sec
testOpen[9: ../../ctf/org.eclipse.tracecompass.ctf.core.tests/traces/ctf-testsuite/tests/1.8/regression/metadata/fail/struct-duplicate-struct-name](org.eclipse.tracecompass.tmf.ctf.ui.swtbot.tests.TestInvalidCtfTrace)  Time elapsed: 4.904 sec
testOpen[10: ../../ctf/org.eclipse.tracecompass.ctf.core.tests/traces/ctf-testsuite/tests/1.8/regression/metadata/fail/integer-encoding-invalid](org.eclipse.tracecompass.tmf.ctf.ui.swtbot.tests.TestInvalidCtfTrace)  Time elapsed: 4.465 sec
testOpen[11: ../../ctf/org.eclipse.tracecompass.ctf.core.tests/traces/ctf-testsuite/tests/1.8/regression/metadata/fail/integer-size-as-string](org.eclipse.tracecompass.tmf.ctf.ui.swtbot.tests.TestInvalidCtfTrace)  Time elapsed: 4.476 sec
testOpen[12: ../../ctf/org.eclipse.tracecompass.ctf.core.tests/traces/ctf-testsuite/tests/1.8/regression/metadata/fail/array-size-type](org.eclipse.tracecompass.tmf.ctf.ui.swtbot.tests.TestInvalidCtfTrace)  Time elapsed: 4.655 sec
testOpen[13: ../../ctf/org.eclipse.tracecompass.ctf.core.tests/traces/ctf-testsuite/tests/1.8/regression/metadata/fail/array-size-not-present](org.eclipse.tracecompass.tmf.ctf.ui.swtbot.tests.TestInvalidCtfTrace)  Time elapsed: 5.004 sec
testOpen[14: ../../ctf/org.eclipse.tracecompass.ctf.core.tests/traces/ctf-testsuite/tests/1.8/regression/metadata/fail/struct-duplicate-field-name](org.eclipse.tracecompass.tmf.ctf.ui.swtbot.tests.TestInvalidCtfTrace)  Time elapsed: 5.276 sec
testOpen[15: ../../ctf/org.eclipse.tracecompass.ctf.core.tests/traces/ctf-testsuite/tests/1.8/regression/metadata/fail/array-size-string](org.eclipse.tracecompass.tmf.ctf.ui.swtbot.tests.TestInvalidCtfTrace)  Time elapsed: 4.8 sec
testOpen[16: ../../ctf/org.eclipse.tracecompass.ctf.core.tests/traces/ctf-testsuite/tests/1.8/regression/metadata/fail/integer-size-missing](org.eclipse.tracecompass.tmf.ctf.ui.swtbot.tests.TestInvalidCtfTrace)  Time elapsed: 5.727 sec
testOpen[17: ../../ctf/org.eclipse.tracecompass.ctf.core.tests/traces/ctf-testsuite/tests/1.8/regression/metadata/fail/integer-negative-bit-size](org.eclipse.tracecompass.tmf.ctf.ui.swtbot.tests.TestInvalidCtfTrace)  Time elapsed: 4.996 sec
testOpen[18: ../../ctf/org.eclipse.tracecompass.ctf.core.tests/traces/ctf-testsuite/tests/1.8/regression/metadata/fail/struct-align-enum](org.eclipse.tracecompass.tmf.ctf.ui.swtbot.tests.TestInvalidCtfTrace)  Time elapsed: 5.208 sec
testOpen[19: ../../ctf/org.eclipse.tracecompass.ctf.core.tests/traces/ctf-testsuite/tests/1.8/regression/metadata/fail/integer-encoding-as-string](org.eclipse.tracecompass.tmf.ctf.ui.swtbot.tests.TestInvalidCtfTrace)  Time elapsed: 5.015 sec
testOpen[20: ../../ctf/org.eclipse.tracecompass.ctf.core.tests/traces/ctf-testsuite/tests/1.8/regression/metadata/fail/struct-align-zero](org.eclipse.tracecompass.tmf.ctf.ui.swtbot.tests.TestInvalidCtfTrace)  Time elapsed: 5.136 sec
testOpen[21: ../../ctf/org.eclipse.tracecompass.ctf.core.tests/traces/ctf-testsuite/tests/1.8/regression/metadata/fail/array-redefinition](org.eclipse.tracecompass.tmf.ctf.ui.swtbot.tests.TestInvalidCtfTrace)  Time elapsed: 5.164 sec
testOpen[22: ../../ctf/org.eclipse.tracecompass.ctf.core.tests/traces/ctf-testsuite/tests/1.8/regression/metadata/fail/array-size-negative](org.eclipse.tracecompass.tmf.ctf.ui.swtbot.tests.TestInvalidCtfTrace)  Time elapsed: 5.532 sec
testOpen[23: ../../ctf/org.eclipse.tracecompass.ctf.core.tests/traces/ctf-testsuite/tests/1.8/regression/metadata/fail/struct-field-name-keyword](org.eclipse.tracecompass.tmf.ctf.ui.swtbot.tests.TestInvalidCtfTrace)  Time elapsed: 5.416 sec
test(org.eclipse.tracecompass.tmf.pcap.ui.swtbot.tests.ImportAndReadPcapTest)  Time elapsed: 28.428 sec
testPerspectiveComplete(org.eclipse.tracecompass.tmf.pcap.ui.swtbot.tests.NetworkPerspectiveChecker)  Time elapsed: 0.001 sec
testPerspectiveForViews(org.eclipse.tracecompass.tmf.pcap.ui.swtbot.tests.NetworkPerspectiveChecker)  Time elapsed: 0.009 sec
org.eclipse.tracecompass.tmf.remote.ui.swtbot.tests.fetch.FetchRemoteTracesTest  Time elapsed: 0.01 sec  <<< ERROR!
java.lang.NoClassDefFoundError: Could not initialize class org.eclipse.tracecompass.tmf.remote.ui.swtbot.tests.fetch.FetchRemoteTracesTest
	at sun.reflect.GeneratedMethodAccessor264.invoke(Unknown Source)
	at sun.reflect.DelegatingMethodAccessorImpl.invoke(DelegatingMethodAccessorImpl.java:43)
	at java.lang.reflect.Method.invoke(Method.java:606)
	at org.junit.runners.model.FrameworkMethod$1.runReflectiveCall(FrameworkMethod.java:50)
	at org.junit.internal.runners.model.ReflectiveCallable.run(ReflectiveCallable.java:12)
	at org.junit.runners.model.FrameworkMethod.invokeExplosively(FrameworkMethod.java:47)
	at org.junit.internal.runners.statements.RunBefores.evaluate(RunBefores.java:24)
	at org.junit.runners.ParentRunner.run(ParentRunner.java:363)
	at org.eclipse.swtbot.swt.finder.junit.SWTBotJunit4ClassRunner.run(SWTBotJunit4ClassRunner.java:54)
	at org.junit.runners.Suite.runChild(Suite.java:128)
	at org.junit.runners.Suite.runChild(Suite.java:27)
	at org.junit.runners.ParentRunner$3.run(ParentRunner.java:290)
	at org.junit.runners.ParentRunner$1.schedule(ParentRunner.java:71)
	at org.junit.runners.ParentRunner.runChildren(ParentRunner.java:288)
	at org.junit.runners.ParentRunner.access$000(ParentRunner.java:58)
	at org.junit.runners.ParentRunner$2.evaluate(ParentRunner.java:268)
	at org.junit.runners.ParentRunner.run(ParentRunner.java:363)
	at org.junit.runners.Suite.runChild(Suite.java:128)
	at org.junit.runners.Suite.runChild(Suite.java:27)
	at org.junit.runners.ParentRunner$3.run(ParentRunner.java:290)
	at org.junit.runners.ParentRunner$1.schedule(ParentRunner.java:71)
	at org.junit.runners.ParentRunner.runChildren(ParentRunner.java:288)
	at org.junit.runners.ParentRunner.access$000(ParentRunner.java:58)
	at org.junit.runners.ParentRunner$2.evaluate(ParentRunner.java:268)
	at org.junit.runners.ParentRunner.run(ParentRunner.java:363)
	at org.junit.runners.Suite.runChild(Suite.java:128)
	at org.junit.runners.Suite.runChild(Suite.java:27)
	at org.junit.runners.ParentRunner$3.run(ParentRunner.java:290)
	at org.junit.runners.ParentRunner$1.schedule(ParentRunner.java:71)
	at org.junit.runners.ParentRunner.runChildren(ParentRunner.java:288)
	at org.junit.runners.ParentRunner.access$000(ParentRunner.java:58)
	at org.junit.runners.ParentRunner$2.evaluate(ParentRunner.java:268)
	at org.junit.runners.ParentRunner.run(ParentRunner.java:363)
	at org.apache.maven.surefire.junit4.JUnit4Provider.execute(JUnit4Provider.java:264)
	at org.apache.maven.surefire.junit4.JUnit4Provider.executeTestSet(JUnit4Provider.java:153)
	at org.apache.maven.surefire.junit4.JUnit4Provider.invoke(JUnit4Provider.java:124)
	at sun.reflect.NativeMethodAccessorImpl.invoke0(Native Method)
	at sun.reflect.NativeMethodAccessorImpl.invoke(NativeMethodAccessorImpl.java:57)
	at sun.reflect.DelegatingMethodAccessorImpl.invoke(DelegatingMethodAccessorImpl.java:43)
	at java.lang.reflect.Method.invoke(Method.java:606)
	at org.apache.maven.surefire.util.ReflectionUtils.invokeMethodWithArray2(ReflectionUtils.java:208)
	at org.apache.maven.surefire.booter.ProviderFactory$ProviderProxy.invoke(ProviderFactory.java:156)
	at org.apache.maven.surefire.booter.ProviderFactory.invokeProvider(ProviderFactory.java:82)
	at org.eclipse.tycho.surefire.osgibooter.OsgiSurefireBooter.run(OsgiSurefireBooter.java:91)
	at org.eclipse.tycho.surefire.osgibooter.AbstractUITestApplication.runTests(AbstractUITestApplication.java:44)
	at org.eclipse.e4.ui.internal.workbench.swt.E4Testable$1.run(E4Testable.java:73)
	at java.lang.Thread.run(Thread.java:745)

testPerspectiveComplete(org.eclipse.tracecompass.lttng2.kernel.ui.swtbot.tests.KernelPerspectiveChecker)  Time elapsed: 0.607 sec
testPerspectiveForViews(org.eclipse.tracecompass.lttng2.kernel.ui.swtbot.tests.KernelPerspectiveChecker)  Time elapsed: 0.001 sec
test(org.eclipse.tracecompass.lttng2.kernel.ui.swtbot.tests.ImportAndReadKernelSmokeTest)  Time elapsed: 19.014 sec
testToolBarFollowCPUForwardBackward(org.eclipse.tracecompass.lttng2.kernel.ui.swtbot.tests.ControlFlowViewTest)  Time elapsed: 18.189 sec
testKeyboardLeftRight(org.eclipse.tracecompass.lttng2.kernel.ui.swtbot.tests.ControlFlowViewTest)  Time elapsed: 14.708 sec
testToolBarSelectNextPreviousEvent(org.eclipse.tracecompass.lttng2.kernel.ui.swtbot.tests.ControlFlowViewTest)  Time elapsed: 16.581 sec
testOpenAndCloseConcurrency(org.eclipse.tracecompass.lttng2.kernel.ui.swtbot.tests.OpenTraceStressTest)  Time elapsed: 53.889 sec
testNew(org.eclipse.tracecompass.tmf.ui.swtbot.tests.parsers.custom.TestCustomTxtWizard)  Time elapsed: 8.412 sec
testEdit(org.eclipse.tracecompass.tmf.ui.swtbot.tests.parsers.custom.TestCustomTxtWizard)  Time elapsed: 9.493 sec
testNew(org.eclipse.tracecompass.tmf.ui.swtbot.tests.parsers.custom.TestCustomXmlWizard)  Time elapsed: 8.56 sec
testPerspectiveComplete(org.eclipse.tracecompass.tmf.ui.swtbot.tests.perspectives.TracingPerspectiveChecker)  Time elapsed: 0.001 sec  <<< FAILURE!
java.lang.AssertionError: view org.eclipse.swtbot.eclipse.finder.widgets.SWTBotView@3967bc5b is present
	at org.junit.Assert.fail(Assert.java:88)
	at org.junit.Assert.assertTrue(Assert.java:41)
	at org.eclipse.tracecompass.tmf.ui.swtbot.tests.shared.AbstractPerspectiveChecker.testPerspectiveComplete(AbstractPerspectiveChecker.java:118)
	at sun.reflect.GeneratedMethodAccessor157.invoke(Unknown Source)
	at sun.reflect.DelegatingMethodAccessorImpl.invoke(DelegatingMethodAccessorImpl.java:43)
	at java.lang.reflect.Method.invoke(Method.java:606)
	at org.junit.runners.model.FrameworkMethod$1.runReflectiveCall(FrameworkMethod.java:50)
	at org.junit.internal.runners.model.ReflectiveCallable.run(ReflectiveCallable.java:12)
	at org.junit.runners.model.FrameworkMethod.invokeExplosively(FrameworkMethod.java:47)
	at org.junit.internal.runners.statements.InvokeMethod.evaluate(InvokeMethod.java:17)
	at org.junit.internal.runners.statements.RunBefores.evaluate(RunBefores.java:26)
	at org.junit.runners.ParentRunner.runLeaf(ParentRunner.java:325)
	at org.junit.runners.BlockJUnit4ClassRunner.runChild(BlockJUnit4ClassRunner.java:78)
	at org.junit.runners.BlockJUnit4ClassRunner.runChild(BlockJUnit4ClassRunner.java:57)
	at org.junit.runners.ParentRunner$3.run(ParentRunner.java:290)
	at org.junit.runners.ParentRunner$1.schedule(ParentRunner.java:71)
	at org.junit.runners.ParentRunner.runChildren(ParentRunner.java:288)
	at org.junit.runners.ParentRunner.access$000(ParentRunner.java:58)
	at org.junit.runners.ParentRunner$2.evaluate(ParentRunner.java:268)
	at org.junit.internal.runners.statements.RunBefores.evaluate(RunBefores.java:26)
	at org.junit.internal.runners.statements.RunAfters.evaluate(RunAfters.java:27)
	at org.junit.runners.ParentRunner.run(ParentRunner.java:363)
	at org.eclipse.swtbot.swt.finder.junit.SWTBotJunit4ClassRunner.run(SWTBotJunit4ClassRunner.java:54)
	at org.junit.runners.Suite.runChild(Suite.java:128)
	at org.junit.runners.Suite.runChild(Suite.java:27)
	at org.junit.runners.ParentRunner$3.run(ParentRunner.java:290)
	at org.junit.runners.ParentRunner$1.schedule(ParentRunner.java:71)
	at org.junit.runners.ParentRunner.runChildren(ParentRunner.java:288)
	at org.junit.runners.ParentRunner.access$000(ParentRunner.java:58)
	at org.junit.runners.ParentRunner$2.evaluate(ParentRunner.java:268)
	at org.junit.runners.ParentRunner.run(ParentRunner.java:363)
	at org.junit.runners.Suite.runChild(Suite.java:128)
	at org.junit.runners.Suite.runChild(Suite.java:27)
	at org.junit.runners.ParentRunner$3.run(ParentRunner.java:290)
	at org.junit.runners.ParentRunner$1.schedule(ParentRunner.java:71)
	at org.junit.runners.ParentRunner.runChildren(ParentRunner.java:288)
	at org.junit.runners.ParentRunner.access$000(ParentRunner.java:58)
	at org.junit.runners.ParentRunner$2.evaluate(ParentRunner.java:268)
	at org.junit.runners.ParentRunner.run(ParentRunner.java:363)
	at org.junit.runners.Suite.runChild(Suite.java:128)
	at org.junit.runners.Suite.runChild(Suite.java:27)
	at org.junit.runners.ParentRunner$3.run(ParentRunner.java:290)
	at org.junit.runners.ParentRunner$1.schedule(ParentRunner.java:71)
	at org.junit.runners.ParentRunner.runChildren(ParentRunner.java:288)
	at org.junit.runners.ParentRunner.access$000(ParentRunner.java:58)
	at org.junit.runners.ParentRunner$2.evaluate(ParentRunner.java:268)
	at org.junit.runners.ParentRunner.run(ParentRunner.java:363)
	at org.apache.maven.surefire.junit4.JUnit4Provider.execute(JUnit4Provider.java:264)
	at org.apache.maven.surefire.junit4.JUnit4Provider.executeTestSet(JUnit4Provider.java:153)
	at org.apache.maven.surefire.junit4.JUnit4Provider.invoke(JUnit4Provider.java:124)
	at sun.reflect.NativeMethodAccessorImpl.invoke0(Native Method)
	at sun.reflect.NativeMethodAccessorImpl.invoke(NativeMethodAccessorImpl.java:57)
	at sun.reflect.DelegatingMethodAccessorImpl.invoke(DelegatingMethodAccessorImpl.java:43)
	at java.lang.reflect.Method.invoke(Method.java:606)
	at org.apache.maven.surefire.util.ReflectionUtils.invokeMethodWithArray2(ReflectionUtils.java:208)
	at org.apache.maven.surefire.booter.ProviderFactory$ProviderProxy.invoke(ProviderFactory.java:156)
	at org.apache.maven.surefire.booter.ProviderFactory.invokeProvider(ProviderFactory.java:82)
	at org.eclipse.tycho.surefire.osgibooter.OsgiSurefireBooter.run(OsgiSurefireBooter.java:91)
	at org.eclipse.tycho.surefire.osgibooter.AbstractUITestApplication.runTests(AbstractUITestApplication.java:44)
	at org.eclipse.e4.ui.internal.workbench.swt.E4Testable$1.run(E4Testable.java:73)
	at java.lang.Thread.run(Thread.java:745)

testPerspectiveForViews(org.eclipse.tracecompass.tmf.ui.swtbot.tests.perspectives.TracingPerspectiveChecker)  Time elapsed: 0.001 sec
test(org.eclipse.tracecompass.tmf.ui.swtbot.tests.viewers.events.CallsiteEventsInTableTest)  Time elapsed: 8.264 sec
test(org.eclipse.tracecompass.tmf.ui.swtbot.tests.viewers.events.CollapseEventsInTableTest)  Time elapsed: 9.144 sec
testYellow(org.eclipse.tracecompass.tmf.ui.swtbot.tests.viewers.events.ColorsViewTest)  Time elapsed: 8.66 sec
testToggleColumns(org.eclipse.tracecompass.tmf.ui.swtbot.tests.viewers.events.ColumnHeaderMenuTest)  Time elapsed: 3.161 sec
testShowAll(org.eclipse.tracecompass.tmf.ui.swtbot.tests.viewers.events.ColumnHeaderMenuTest)  Time elapsed: 2.82 sec
testNoCopySearchRow(org.eclipse.tracecompass.tmf.ui.swtbot.tests.viewers.events.CopyToClipboardTest)  Time elapsed: 4.385 sec
testCopySingleSelection(org.eclipse.tracecompass.tmf.ui.swtbot.tests.viewers.events.CopyToClipboardTest)  Time elapsed: 2.893 sec
testCopyMultipleSelection(org.eclipse.tracecompass.tmf.ui.swtbot.tests.viewers.events.CopyToClipboardTest)  Time elapsed: 3.258 sec
testMultiHighlightMessage(org.eclipse.tracecompass.tmf.ui.swtbot.tests.viewers.events.FilterColorEditorTest)  Time elapsed: 8.262 sec
testSwitchToFilter(org.eclipse.tracecompass.tmf.ui.swtbot.tests.viewers.events.FilterColorEditorTest)  Time elapsed: 7.778 sec
testHighlight(org.eclipse.tracecompass.tmf.ui.swtbot.tests.viewers.events.FilterColorEditorTest)  Time elapsed: 7.676 sec
testPreference(org.eclipse.tracecompass.tmf.ui.swtbot.tests.viewers.events.FilterColorEditorTest)  Time elapsed: 7.935 sec
testTimestampFilter(org.eclipse.tracecompass.tmf.ui.swtbot.tests.viewers.events.FilterViewerTest)  Time elapsed: 3.277 sec  <<< ERROR!
org.eclipse.swt.SWTException: Failed to execute runnable (org.eclipse.swtbot.swt.finder.exceptions.WidgetNotFoundException: Could not find menu: TRACETYPE)
	at org.eclipse.swt.SWT.error(SWT.java:4491)
	at org.eclipse.swt.SWT.error(SWT.java:4406)
	at org.eclipse.swt.widgets.Synchronizer.syncExec(Synchronizer.java:208)
	at org.eclipse.ui.internal.UISynchronizer.syncExec(UISynchronizer.java:145)
	at org.eclipse.swt.widgets.Display.syncExec(Display.java:4633)
	at org.eclipse.swtbot.swt.finder.finders.UIThreadRunnable.run(UIThreadRunnable.java:76)
	at org.eclipse.swtbot.swt.finder.finders.UIThreadRunnable.syncExec(UIThreadRunnable.java:142)
	at org.eclipse.swtbot.swt.finder.finders.UIThreadRunnable.syncExec(UIThreadRunnable.java:125)
	at org.eclipse.swtbot.swt.finder.finders.ContextMenuHelper.contextMenu(ContextMenuHelper.java:42)
	at org.eclipse.swtbot.swt.finder.widgets.SWTBotTreeItem.contextMenu(SWTBotTreeItem.java:558)
	at org.eclipse.tracecompass.tmf.ui.swtbot.tests.viewers.events.FilterViewerTest.testTimestampFilter(FilterViewerTest.java:165)
Caused by: org.eclipse.swtbot.swt.finder.exceptions.WidgetNotFoundException: Could not find menu: TRACETYPE
	at org.eclipse.swtbot.swt.finder.finders.ContextMenuHelper$1.run(ContextMenuHelper.java:63)
	at org.eclipse.swtbot.swt.finder.finders.ContextMenuHelper$1.run(ContextMenuHelper.java:1)
	at org.eclipse.swtbot.swt.finder.finders.UIThreadRunnable$2.doRun(UIThreadRunnable.java:140)
	at org.eclipse.swtbot.swt.finder.finders.UIThreadRunnable$1.run(UIThreadRunnable.java:89)
	at org.eclipse.swt.widgets.RunnableLock.run(RunnableLock.java:35)
	at org.eclipse.swt.widgets.Synchronizer.runAsyncMessages(Synchronizer.java:135)
	at org.eclipse.swt.widgets.Display.runAsyncMessages(Display.java:3794)
	at org.eclipse.swt.widgets.Display.readAndDispatch(Display.java:3433)
	at org.eclipse.e4.ui.internal.workbench.swt.PartRenderingEngine$4.run(PartRenderingEngine.java:1127)
	at org.eclipse.core.databinding.observable.Realm.runWithDefault(Realm.java:337)
	at org.eclipse.e4.ui.internal.workbench.swt.PartRenderingEngine.run(PartRenderingEngine.java:1018)
	at org.eclipse.e4.ui.internal.workbench.E4Workbench.createAndRunUI(E4Workbench.java:156)
	at org.eclipse.ui.internal.Workbench$5.run(Workbench.java:654)
	at org.eclipse.core.databinding.observable.Realm.runWithDefault(Realm.java:337)
	at org.eclipse.ui.internal.Workbench.createAndRunWorkbench(Workbench.java:598)
	at org.eclipse.ui.PlatformUI.createAndRunWorkbench(PlatformUI.java:150)
	at org.eclipse.ui.internal.ide.application.IDEApplication.start(IDEApplication.java:139)
	at org.eclipse.tycho.surefire.osgibooter.UITestApplication.runApplication(UITestApplication.java:31)
	at org.eclipse.tycho.surefire.osgibooter.AbstractUITestApplication.run(AbstractUITestApplication.java:120)
	at org.eclipse.tycho.surefire.osgibooter.UITestApplication.start(UITestApplication.java:37)
	at org.eclipse.equinox.internal.app.EclipseAppHandle.run(EclipseAppHandle.java:196)
	at org.eclipse.core.runtime.internal.adaptor.EclipseAppLauncher.runApplication(EclipseAppLauncher.java:134)
	at org.eclipse.core.runtime.internal.adaptor.EclipseAppLauncher.start(EclipseAppLauncher.java:104)
	at org.eclipse.core.runtime.adaptor.EclipseStarter.run(EclipseStarter.java:380)
	at org.eclipse.core.runtime.adaptor.EclipseStarter.run(EclipseStarter.java:235)
	at sun.reflect.NativeMethodAccessorImpl.invoke0(Native Method)
	at sun.reflect.NativeMethodAccessorImpl.invoke(NativeMethodAccessorImpl.java:57)
	at sun.reflect.DelegatingMethodAccessorImpl.invoke(DelegatingMethodAccessorImpl.java:43)
	at java.lang.reflect.Method.invoke(Method.java:606)
	at org.eclipse.equinox.launcher.Main.invokeFramework(Main.java:669)
	at org.eclipse.equinox.launcher.Main.basicRun(Main.java:608)
	at org.eclipse.equinox.launcher.Main.run(Main.java:1515)
	at org.eclipse.equinox.launcher.Main.main(Main.java:1488)

testField01(org.eclipse.tracecompass.tmf.ui.swtbot.tests.viewers.events.FilterViewerTest)  Time elapsed: 3.181 sec  <<< ERROR!
org.eclipse.swt.SWTException: Failed to execute runnable (org.eclipse.swtbot.swt.finder.exceptions.WidgetNotFoundException: Could not find menu: TRACETYPE)
	at org.eclipse.swt.SWT.error(SWT.java:4491)
	at org.eclipse.swt.SWT.error(SWT.java:4406)
	at org.eclipse.swt.widgets.Synchronizer.syncExec(Synchronizer.java:208)
	at org.eclipse.ui.internal.UISynchronizer.syncExec(UISynchronizer.java:145)
	at org.eclipse.swt.widgets.Display.syncExec(Display.java:4633)
	at org.eclipse.swtbot.swt.finder.finders.UIThreadRunnable.run(UIThreadRunnable.java:76)
	at org.eclipse.swtbot.swt.finder.finders.UIThreadRunnable.syncExec(UIThreadRunnable.java:142)
	at org.eclipse.swtbot.swt.finder.finders.UIThreadRunnable.syncExec(UIThreadRunnable.java:125)
	at org.eclipse.swtbot.swt.finder.finders.ContextMenuHelper.contextMenu(ContextMenuHelper.java:42)
	at org.eclipse.swtbot.swt.finder.widgets.SWTBotTreeItem.contextMenu(SWTBotTreeItem.java:558)
	at org.eclipse.tracecompass.tmf.ui.swtbot.tests.viewers.events.FilterViewerTest.testField01(FilterViewerTest.java:282)
Caused by: org.eclipse.swtbot.swt.finder.exceptions.WidgetNotFoundException: Could not find menu: TRACETYPE
	at org.eclipse.swtbot.swt.finder.finders.ContextMenuHelper$1.run(ContextMenuHelper.java:63)
	at org.eclipse.swtbot.swt.finder.finders.ContextMenuHelper$1.run(ContextMenuHelper.java:1)
	at org.eclipse.swtbot.swt.finder.finders.UIThreadRunnable$2.doRun(UIThreadRunnable.java:140)
	at org.eclipse.swtbot.swt.finder.finders.UIThreadRunnable$1.run(UIThreadRunnable.java:89)
	at org.eclipse.swt.widgets.RunnableLock.run(RunnableLock.java:35)
	at org.eclipse.swt.widgets.Synchronizer.runAsyncMessages(Synchronizer.java:135)
	at org.eclipse.swt.widgets.Display.runAsyncMessages(Display.java:3794)
	at org.eclipse.swt.widgets.Display.readAndDispatch(Display.java:3433)
	at org.eclipse.e4.ui.internal.workbench.swt.PartRenderingEngine$4.run(PartRenderingEngine.java:1127)
	at org.eclipse.core.databinding.observable.Realm.runWithDefault(Realm.java:337)
	at org.eclipse.e4.ui.internal.workbench.swt.PartRenderingEngine.run(PartRenderingEngine.java:1018)
	at org.eclipse.e4.ui.internal.workbench.E4Workbench.createAndRunUI(E4Workbench.java:156)
	at org.eclipse.ui.internal.Workbench$5.run(Workbench.java:654)
	at org.eclipse.core.databinding.observable.Realm.runWithDefault(Realm.java:337)
	at org.eclipse.ui.internal.Workbench.createAndRunWorkbench(Workbench.java:598)
	at org.eclipse.ui.PlatformUI.createAndRunWorkbench(PlatformUI.java:150)
	at org.eclipse.ui.internal.ide.application.IDEApplication.start(IDEApplication.java:139)
	at org.eclipse.tycho.surefire.osgibooter.UITestApplication.runApplication(UITestApplication.java:31)
	at org.eclipse.tycho.surefire.osgibooter.AbstractUITestApplication.run(AbstractUITestApplication.java:120)
	at org.eclipse.tycho.surefire.osgibooter.UITestApplication.start(UITestApplication.java:37)
	at org.eclipse.equinox.internal.app.EclipseAppHandle.run(EclipseAppHandle.java:196)
	at org.eclipse.core.runtime.internal.adaptor.EclipseAppLauncher.runApplication(EclipseAppLauncher.java:134)
	at org.eclipse.core.runtime.internal.adaptor.EclipseAppLauncher.start(EclipseAppLauncher.java:104)
	at org.eclipse.core.runtime.adaptor.EclipseStarter.run(EclipseStarter.java:380)
	at org.eclipse.core.runtime.adaptor.EclipseStarter.run(EclipseStarter.java:235)
	at sun.reflect.NativeMethodAccessorImpl.invoke0(Native Method)
	at sun.reflect.NativeMethodAccessorImpl.invoke(NativeMethodAccessorImpl.java:57)
	at sun.reflect.DelegatingMethodAccessorImpl.invoke(DelegatingMethodAccessorImpl.java:43)
	at java.lang.reflect.Method.invoke(Method.java:606)
	at org.eclipse.equinox.launcher.Main.invokeFramework(Main.java:669)
	at org.eclipse.equinox.launcher.Main.basicRun(Main.java:608)
	at org.eclipse.equinox.launcher.Main.run(Main.java:1515)
	at org.eclipse.equinox.launcher.Main.main(Main.java:1488)

testTimestampEqualsOr(org.eclipse.tracecompass.tmf.ui.swtbot.tests.viewers.events.FilterViewerTest)  Time elapsed: 2.73 sec  <<< ERROR!
org.eclipse.swt.SWTException: Failed to execute runnable (org.eclipse.swtbot.swt.finder.exceptions.WidgetNotFoundException: Could not find menu: TRACETYPE)
	at org.eclipse.swt.SWT.error(SWT.java:4491)
	at org.eclipse.swt.SWT.error(SWT.java:4406)
	at org.eclipse.swt.widgets.Synchronizer.syncExec(Synchronizer.java:208)
	at org.eclipse.ui.internal.UISynchronizer.syncExec(UISynchronizer.java:145)
	at org.eclipse.swt.widgets.Display.syncExec(Display.java:4633)
	at org.eclipse.swtbot.swt.finder.finders.UIThreadRunnable.run(UIThreadRunnable.java:76)
	at org.eclipse.swtbot.swt.finder.finders.UIThreadRunnable.syncExec(UIThreadRunnable.java:142)
	at org.eclipse.swtbot.swt.finder.finders.UIThreadRunnable.syncExec(UIThreadRunnable.java:125)
	at org.eclipse.swtbot.swt.finder.finders.ContextMenuHelper.contextMenu(ContextMenuHelper.java:42)
	at org.eclipse.swtbot.swt.finder.widgets.SWTBotTreeItem.contextMenu(SWTBotTreeItem.java:558)
	at org.eclipse.tracecompass.tmf.ui.swtbot.tests.viewers.events.FilterViewerTest.testTimestampEqualsOr(FilterViewerTest.java:215)
Caused by: org.eclipse.swtbot.swt.finder.exceptions.WidgetNotFoundException: Could not find menu: TRACETYPE
	at org.eclipse.swtbot.swt.finder.finders.ContextMenuHelper$1.run(ContextMenuHelper.java:63)
	at org.eclipse.swtbot.swt.finder.finders.ContextMenuHelper$1.run(ContextMenuHelper.java:1)
	at org.eclipse.swtbot.swt.finder.finders.UIThreadRunnable$2.doRun(UIThreadRunnable.java:140)
	at org.eclipse.swtbot.swt.finder.finders.UIThreadRunnable$1.run(UIThreadRunnable.java:89)
	at org.eclipse.swt.widgets.RunnableLock.run(RunnableLock.java:35)
	at org.eclipse.swt.widgets.Synchronizer.runAsyncMessages(Synchronizer.java:135)
	at org.eclipse.swt.widgets.Display.runAsyncMessages(Display.java:3794)
	at org.eclipse.swt.widgets.Display.readAndDispatch(Display.java:3433)
	at org.eclipse.e4.ui.internal.workbench.swt.PartRenderingEngine$4.run(PartRenderingEngine.java:1127)
	at org.eclipse.core.databinding.observable.Realm.runWithDefault(Realm.java:337)
	at org.eclipse.e4.ui.internal.workbench.swt.PartRenderingEngine.run(PartRenderingEngine.java:1018)
	at org.eclipse.e4.ui.internal.workbench.E4Workbench.createAndRunUI(E4Workbench.java:156)
	at org.eclipse.ui.internal.Workbench$5.run(Workbench.java:654)
	at org.eclipse.core.databinding.observable.Realm.runWithDefault(Realm.java:337)
	at org.eclipse.ui.internal.Workbench.createAndRunWorkbench(Workbench.java:598)
	at org.eclipse.ui.PlatformUI.createAndRunWorkbench(PlatformUI.java:150)
	at org.eclipse.ui.internal.ide.application.IDEApplication.start(IDEApplication.java:139)
	at org.eclipse.tycho.surefire.osgibooter.UITestApplication.runApplication(UITestApplication.java:31)
	at org.eclipse.tycho.surefire.osgibooter.AbstractUITestApplication.run(AbstractUITestApplication.java:120)
	at org.eclipse.tycho.surefire.osgibooter.UITestApplication.start(UITestApplication.java:37)
	at org.eclipse.equinox.internal.app.EclipseAppHandle.run(EclipseAppHandle.java:196)
	at org.eclipse.core.runtime.internal.adaptor.EclipseAppLauncher.runApplication(EclipseAppLauncher.java:134)
	at org.eclipse.core.runtime.internal.adaptor.EclipseAppLauncher.start(EclipseAppLauncher.java:104)
	at org.eclipse.core.runtime.adaptor.EclipseStarter.run(EclipseStarter.java:380)
	at org.eclipse.core.runtime.adaptor.EclipseStarter.run(EclipseStarter.java:235)
	at sun.reflect.NativeMethodAccessorImpl.invoke0(Native Method)
	at sun.reflect.NativeMethodAccessorImpl.invoke(NativeMethodAccessorImpl.java:57)
	at sun.reflect.DelegatingMethodAccessorImpl.invoke(DelegatingMethodAccessorImpl.java:43)
	at java.lang.reflect.Method.invoke(Method.java:606)
	at org.eclipse.equinox.launcher.Main.invokeFramework(Main.java:669)
	at org.eclipse.equinox.launcher.Main.basicRun(Main.java:608)
	at org.eclipse.equinox.launcher.Main.run(Main.java:1515)
	at org.eclipse.equinox.launcher.Main.main(Main.java:1488)

testChangeFont(org.eclipse.tracecompass.tmf.ui.swtbot.tests.viewers.events.FontEventEditorTest)  Time elapsed: 10.783 sec
testReorder(org.eclipse.tracecompass.tmf.ui.swtbot.tests.viewers.events.MovableColumnEventsEditorTest)  Time elapsed: 12.104 sec
testSDView(org.eclipse.tracecompass.tmf.ui.swtbot.tests.viewers.events.SDViewTest)  Time elapsed: 5.242 sec
testOffsetting(org.eclipse.tracecompass.tmf.ui.swtbot.tests.viewers.events.TestTraceOffsetting)  Time elapsed: 11.203 sec
testOverlappingTimechartMove(org.eclipse.tracecompass.tmf.ui.swtbot.tests.viewers.events.TmfAlignTimeAxisTest)  Time elapsed: 5.292 sec
testNotOverlappingCallstackMove(org.eclipse.tracecompass.tmf.ui.swtbot.tests.viewers.events.TmfAlignTimeAxisTest)  Time elapsed: 5.432 sec
testMoveHistogramCallstackFollows(org.eclipse.tracecompass.tmf.ui.swtbot.tests.viewers.events.TmfAlignTimeAxisTest)  Time elapsed: 5.321 sec
testOverlappingHistogramMove(org.eclipse.tracecompass.tmf.ui.swtbot.tests.viewers.events.TmfAlignTimeAxisTest)  Time elapsed: 5.242 sec
testNotOverlappingHistogramMove(org.eclipse.tracecompass.tmf.ui.swtbot.tests.viewers.events.TmfAlignTimeAxisTest)  Time elapsed: 5.238 sec
testMoveCallstackHistogramFollows(org.eclipse.tracecompass.tmf.ui.swtbot.tests.viewers.events.TmfAlignTimeAxisTest)  Time elapsed: 5.227 sec
testGzipImport(org.eclipse.tracecompass.tmf.ui.swtbot.tests.wizards.StandardImportGzipTraceTest)  Time elapsed: 6.246 sec
test(org.eclipse.tracecompass.tmf.ctf.ui.swtbot.tests.ImportAndReadSmokeTest)  Time elapsed: 12.615 sec
testImportFromDirectory(org.eclipse.tracecompass.tmf.ctf.ui.swtbot.tests.StandardImportAndReadSmokeTest)  Time elapsed: 7.288 sec
testExtractArchivesFromArchive(org.eclipse.tracecompass.tmf.ctf.ui.swtbot.tests.StandardImportAndReadSmokeTest)  Time elapsed: 17.787 sec
testImportFromDirectoryLinksPreserveFolder(org.eclipse.tracecompass.tmf.ctf.ui.swtbot.tests.StandardImportAndReadSmokeTest)  Time elapsed: 8.151 sec
testExtractArchivesFromArchivePreserveFolder(org.eclipse.tracecompass.tmf.ctf.ui.swtbot.tests.StandardImportAndReadSmokeTest)  Time elapsed: 18.72 sec
testExtractArchivesFromDirectory(org.eclipse.tracecompass.tmf.ctf.ui.swtbot.tests.StandardImportAndReadSmokeTest)  Time elapsed: 14.04 sec
testImportFromArchive(org.eclipse.tracecompass.tmf.ctf.ui.swtbot.tests.StandardImportAndReadSmokeTest)  Time elapsed: 12.368 sec
testExtractArchivesFromDirectoryLinksPreserveStruture(org.eclipse.tracecompass.tmf.ctf.ui.swtbot.tests.StandardImportAndReadSmokeTest)  Time elapsed: 13.877 sec
testEmptyDirectory(org.eclipse.tracecompass.tmf.ctf.ui.swtbot.tests.StandardImportAndReadSmokeTest)  Time elapsed: 6.274 sec
testEmptyArchive(org.eclipse.tracecompass.tmf.ctf.ui.swtbot.tests.StandardImportAndReadSmokeTest)  Time elapsed: 10.328 sec
testNestedEmptyArchive(org.eclipse.tracecompass.tmf.ctf.ui.swtbot.tests.StandardImportAndReadSmokeTest)  Time elapsed: 13.699 sec
testImportFromArchiveOverwrite(org.eclipse.tracecompass.tmf.ctf.ui.swtbot.tests.StandardImportAndReadSmokeTest)  Time elapsed: 16.051 sec
testDirectoryWithEmptyArchive(org.eclipse.tracecompass.tmf.ctf.ui.swtbot.tests.StandardImportAndReadSmokeTest)  Time elapsed: 9.381 sec
testImportFromDirectoryPreserveFolder(org.eclipse.tracecompass.tmf.ctf.ui.swtbot.tests.StandardImportAndReadSmokeTest)  Time elapsed: 8.278 sec
testImportFromDirectoryLinks(org.eclipse.tracecompass.tmf.ctf.ui.swtbot.tests.StandardImportAndReadSmokeTest)  Time elapsed: 7.004 sec
testImportFromDirectoryOverwrite(org.eclipse.tracecompass.tmf.ctf.ui.swtbot.tests.StandardImportAndReadSmokeTest)  Time elapsed: 15.149 sec
testExtractArchivesFromDirectoryLinks(org.eclipse.tracecompass.tmf.ctf.ui.swtbot.tests.StandardImportAndReadSmokeTest)  Time elapsed: 13.19 sec
testImportFromArchivePreserveFolder(org.eclipse.tracecompass.tmf.ctf.ui.swtbot.tests.StandardImportAndReadSmokeTest)  Time elapsed: 8.176 sec
testOpen[0: ../../ctf/org.eclipse.tracecompass.ctf.core.tests/traces/ctf-testsuite/tests/1.8/regression/metadata/fail/struct-align-negative](org.eclipse.tracecompass.tmf.ctf.ui.swtbot.tests.TestInvalidCtfTrace)  Time elapsed: 4.505 sec
testOpen[1: ../../ctf/org.eclipse.tracecompass.ctf.core.tests/traces/ctf-testsuite/tests/1.8/regression/metadata/fail/array-size-identifier](org.eclipse.tracecompass.tmf.ctf.ui.swtbot.tests.TestInvalidCtfTrace)  Time elapsed: 5.124 sec
testOpen[2: ../../ctf/org.eclipse.tracecompass.ctf.core.tests/traces/ctf-testsuite/tests/1.8/regression/metadata/fail/struct-align-huge](org.eclipse.tracecompass.tmf.ctf.ui.swtbot.tests.TestInvalidCtfTrace)  Time elapsed: 4.829 sec
testOpen[3: ../../ctf/org.eclipse.tracecompass.ctf.core.tests/traces/ctf-testsuite/tests/1.8/regression/metadata/fail/integer-signed-as-string](org.eclipse.tracecompass.tmf.ctf.ui.swtbot.tests.TestInvalidCtfTrace)  Time elapsed: 4.769 sec
testOpen[4: ../../ctf/org.eclipse.tracecompass.ctf.core.tests/traces/ctf-testsuite/tests/1.8/regression/metadata/fail/array-size-keyword](org.eclipse.tracecompass.tmf.ctf.ui.swtbot.tests.TestInvalidCtfTrace)  Time elapsed: 5.153 sec
testOpen[5: ../../ctf/org.eclipse.tracecompass.ctf.core.tests/traces/ctf-testsuite/tests/1.8/regression/metadata/fail/integer-range](org.eclipse.tracecompass.tmf.ctf.ui.swtbot.tests.TestInvalidCtfTrace)  Time elapsed: 5.159 sec
testOpen[6: ../../ctf/org.eclipse.tracecompass.ctf.core.tests/traces/ctf-testsuite/tests/1.8/regression/metadata/fail/integer-signed-invalid](org.eclipse.tracecompass.tmf.ctf.ui.swtbot.tests.TestInvalidCtfTrace)  Time elapsed: 4.736 sec
testOpen[7: ../../ctf/org.eclipse.tracecompass.ctf.core.tests/traces/ctf-testsuite/tests/1.8/regression/metadata/fail/struct-align-string](org.eclipse.tracecompass.tmf.ctf.ui.swtbot.tests.TestInvalidCtfTrace)  Time elapsed: 4.934 sec
testOpen[8: ../../ctf/org.eclipse.tracecompass.ctf.core.tests/traces/ctf-testsuite/tests/1.8/regression/metadata/fail/array-size-type-field](org.eclipse.tracecompass.tmf.ctf.ui.swtbot.tests.TestInvalidCtfTrace)  Time elapsed: 4.878 sec
testOpen[9: ../../ctf/org.eclipse.tracecompass.ctf.core.tests/traces/ctf-testsuite/tests/1.8/regression/metadata/fail/struct-duplicate-struct-name](org.eclipse.tracecompass.tmf.ctf.ui.swtbot.tests.TestInvalidCtfTrace)  Time elapsed: 5.113 sec
testOpen[10: ../../ctf/org.eclipse.tracecompass.ctf.core.tests/traces/ctf-testsuite/tests/1.8/regression/metadata/fail/integer-encoding-invalid](org.eclipse.tracecompass.tmf.ctf.ui.swtbot.tests.TestInvalidCtfTrace)  Time elapsed: 4.863 sec
testOpen[11: ../../ctf/org.eclipse.tracecompass.ctf.core.tests/traces/ctf-testsuite/tests/1.8/regression/metadata/fail/integer-size-as-string](org.eclipse.tracecompass.tmf.ctf.ui.swtbot.tests.TestInvalidCtfTrace)  Time elapsed: 4.996 sec
testOpen[12: ../../ctf/org.eclipse.tracecompass.ctf.core.tests/traces/ctf-testsuite/tests/1.8/regression/metadata/fail/array-size-type](org.eclipse.tracecompass.tmf.ctf.ui.swtbot.tests.TestInvalidCtfTrace)  Time elapsed: 5.106 sec
testOpen[13: ../../ctf/org.eclipse.tracecompass.ctf.core.tests/traces/ctf-testsuite/tests/1.8/regression/metadata/fail/array-size-not-present](org.eclipse.tracecompass.tmf.ctf.ui.swtbot.tests.TestInvalidCtfTrace)  Time elapsed: 5.124 sec
testOpen[14: ../../ctf/org.eclipse.tracecompass.ctf.core.tests/traces/ctf-testsuite/tests/1.8/regression/metadata/fail/struct-duplicate-field-name](org.eclipse.tracecompass.tmf.ctf.ui.swtbot.tests.TestInvalidCtfTrace)  Time elapsed: 5.118 sec
testOpen[15: ../../ctf/org.eclipse.tracecompass.ctf.core.tests/traces/ctf-testsuite/tests/1.8/regression/metadata/fail/array-size-string](org.eclipse.tracecompass.tmf.ctf.ui.swtbot.tests.TestInvalidCtfTrace)  Time elapsed: 5.037 sec
testOpen[16: ../../ctf/org.eclipse.tracecompass.ctf.core.tests/traces/ctf-testsuite/tests/1.8/regression/metadata/fail/integer-size-missing](org.eclipse.tracecompass.tmf.ctf.ui.swtbot.tests.TestInvalidCtfTrace)  Time elapsed: 4.843 sec
testOpen[17: ../../ctf/org.eclipse.tracecompass.ctf.core.tests/traces/ctf-testsuite/tests/1.8/regression/metadata/fail/integer-negative-bit-size](org.eclipse.tracecompass.tmf.ctf.ui.swtbot.tests.TestInvalidCtfTrace)  Time elapsed: 5.316 sec
testOpen[18: ../../ctf/org.eclipse.tracecompass.ctf.core.tests/traces/ctf-testsuite/tests/1.8/regression/metadata/fail/struct-align-enum](org.eclipse.tracecompass.tmf.ctf.ui.swtbot.tests.TestInvalidCtfTrace)  Time elapsed: 5.796 sec
testOpen[19: ../../ctf/org.eclipse.tracecompass.ctf.core.tests/traces/ctf-testsuite/tests/1.8/regression/metadata/fail/integer-encoding-as-string](org.eclipse.tracecompass.tmf.ctf.ui.swtbot.tests.TestInvalidCtfTrace)  Time elapsed: 5.053 sec
testOpen[20: ../../ctf/org.eclipse.tracecompass.ctf.core.tests/traces/ctf-testsuite/tests/1.8/regression/metadata/fail/struct-align-zero](org.eclipse.tracecompass.tmf.ctf.ui.swtbot.tests.TestInvalidCtfTrace)  Time elapsed: 4.901 sec
testOpen[21: ../../ctf/org.eclipse.tracecompass.ctf.core.tests/traces/ctf-testsuite/tests/1.8/regression/metadata/fail/array-redefinition](org.eclipse.tracecompass.tmf.ctf.ui.swtbot.tests.TestInvalidCtfTrace)  Time elapsed: 5.057 sec
testOpen[22: ../../ctf/org.eclipse.tracecompass.ctf.core.tests/traces/ctf-testsuite/tests/1.8/regression/metadata/fail/array-size-negative](org.eclipse.tracecompass.tmf.ctf.ui.swtbot.tests.TestInvalidCtfTrace)  Time elapsed: 5.125 sec
testOpen[23: ../../ctf/org.eclipse.tracecompass.ctf.core.tests/traces/ctf-testsuite/tests/1.8/regression/metadata/fail/struct-field-name-keyword](org.eclipse.tracecompass.tmf.ctf.ui.swtbot.tests.TestInvalidCtfTrace)  Time elapsed: 5.163 sec
test(org.eclipse.tracecompass.tmf.pcap.ui.swtbot.tests.ImportAndReadPcapTest)  Time elapsed: 29.032 sec
testPerspectiveComplete(org.eclipse.tracecompass.tmf.pcap.ui.swtbot.tests.NetworkPerspectiveChecker)  Time elapsed: 0.001 sec
testPerspectiveForViews(org.eclipse.tracecompass.tmf.pcap.ui.swtbot.tests.NetworkPerspectiveChecker)  Time elapsed: 0.001 sec
org.eclipse.tracecompass.tmf.remote.ui.swtbot.tests.fetch.FetchRemoteTracesTest  Time elapsed: 0.001 sec  <<< ERROR!
java.lang.NoClassDefFoundError: Could not initialize class org.eclipse.tracecompass.tmf.remote.ui.swtbot.tests.fetch.FetchRemoteTracesTest
	at sun.reflect.GeneratedMethodAccessor264.invoke(Unknown Source)
	at sun.reflect.DelegatingMethodAccessorImpl.invoke(DelegatingMethodAccessorImpl.java:43)
	at java.lang.reflect.Method.invoke(Method.java:606)
	at org.junit.runners.model.FrameworkMethod$1.runReflectiveCall(FrameworkMethod.java:50)
	at org.junit.internal.runners.model.ReflectiveCallable.run(ReflectiveCallable.java:12)
	at org.junit.runners.model.FrameworkMethod.invokeExplosively(FrameworkMethod.java:47)
	at org.junit.internal.runners.statements.RunBefores.evaluate(RunBefores.java:24)
	at org.junit.runners.ParentRunner.run(ParentRunner.java:363)
	at org.eclipse.swtbot.swt.finder.junit.SWTBotJunit4ClassRunner.run(SWTBotJunit4ClassRunner.java:54)
	at org.junit.runners.Suite.runChild(Suite.java:128)
	at org.junit.runners.Suite.runChild(Suite.java:27)
	at org.junit.runners.ParentRunner$3.run(ParentRunner.java:290)
	at org.junit.runners.ParentRunner$1.schedule(ParentRunner.java:71)
	at org.junit.runners.ParentRunner.runChildren(ParentRunner.java:288)
	at org.junit.runners.ParentRunner.access$000(ParentRunner.java:58)
	at org.junit.runners.ParentRunner$2.evaluate(ParentRunner.java:268)
	at org.junit.runners.ParentRunner.run(ParentRunner.java:363)
	at org.junit.runners.Suite.runChild(Suite.java:128)
	at org.junit.runners.Suite.runChild(Suite.java:27)
	at org.junit.runners.ParentRunner$3.run(ParentRunner.java:290)
	at org.junit.runners.ParentRunner$1.schedule(ParentRunner.java:71)
	at org.junit.runners.ParentRunner.runChildren(ParentRunner.java:288)
	at org.junit.runners.ParentRunner.access$000(ParentRunner.java:58)
	at org.junit.runners.ParentRunner$2.evaluate(ParentRunner.java:268)
	at org.junit.runners.ParentRunner.run(ParentRunner.java:363)
	at org.junit.runners.Suite.runChild(Suite.java:128)
	at org.junit.runners.Suite.runChild(Suite.java:27)
	at org.junit.runners.ParentRunner$3.run(ParentRunner.java:290)
	at org.junit.runners.ParentRunner$1.schedule(ParentRunner.java:71)
	at org.junit.runners.ParentRunner.runChildren(ParentRunner.java:288)
	at org.junit.runners.ParentRunner.access$000(ParentRunner.java:58)
	at org.junit.runners.ParentRunner$2.evaluate(ParentRunner.java:268)
	at org.junit.runners.ParentRunner.run(ParentRunner.java:363)
	at org.apache.maven.surefire.junit4.JUnit4Provider.execute(JUnit4Provider.java:264)
	at org.apache.maven.surefire.junit4.JUnit4Provider.executeTestSet(JUnit4Provider.java:153)
	at org.apache.maven.surefire.junit4.JUnit4Provider.invoke(JUnit4Provider.java:124)
	at sun.reflect.NativeMethodAccessorImpl.invoke0(Native Method)
	at sun.reflect.NativeMethodAccessorImpl.invoke(NativeMethodAccessorImpl.java:57)
	at sun.reflect.DelegatingMethodAccessorImpl.invoke(DelegatingMethodAccessorImpl.java:43)
	at java.lang.reflect.Method.invoke(Method.java:606)
	at org.apache.maven.surefire.util.ReflectionUtils.invokeMethodWithArray2(ReflectionUtils.java:208)
	at org.apache.maven.surefire.booter.ProviderFactory$ProviderProxy.invoke(ProviderFactory.java:156)
	at org.apache.maven.surefire.booter.ProviderFactory.invokeProvider(ProviderFactory.java:82)
	at org.eclipse.tycho.surefire.osgibooter.OsgiSurefireBooter.run(OsgiSurefireBooter.java:91)
	at org.eclipse.tycho.surefire.osgibooter.AbstractUITestApplication.runTests(AbstractUITestApplication.java:44)
	at org.eclipse.e4.ui.internal.workbench.swt.E4Testable$1.run(E4Testable.java:73)
	at java.lang.Thread.run(Thread.java:745)

testPerspectiveComplete(org.eclipse.tracecompass.lttng2.kernel.ui.swtbot.tests.KernelPerspectiveChecker)  Time elapsed: 0.61 sec
testPerspectiveForViews(org.eclipse.tracecompass.lttng2.kernel.ui.swtbot.tests.KernelPerspectiveChecker)  Time elapsed: 0.002 sec
test(org.eclipse.tracecompass.lttng2.kernel.ui.swtbot.tests.ImportAndReadKernelSmokeTest)  Time elapsed: 22.236 sec
testToolBarFollowCPUForwardBackward(org.eclipse.tracecompass.lttng2.kernel.ui.swtbot.tests.ControlFlowViewTest)  Time elapsed: 16.607 sec
testKeyboardLeftRight(org.eclipse.tracecompass.lttng2.kernel.ui.swtbot.tests.ControlFlowViewTest)  Time elapsed: 16.288 sec
testToolBarSelectNextPreviousEvent(org.eclipse.tracecompass.lttng2.kernel.ui.swtbot.tests.ControlFlowViewTest)  Time elapsed: 20.454 sec
testOpenAndCloseConcurrency(org.eclipse.tracecompass.lttng2.kernel.ui.swtbot.tests.OpenTraceStressTest)  Time elapsed: 47.935 sec
testNew(org.eclipse.tracecompass.tmf.ui.swtbot.tests.parsers.custom.TestCustomTxtWizard)  Time elapsed: 9.227 sec
testEdit(org.eclipse.tracecompass.tmf.ui.swtbot.tests.parsers.custom.TestCustomTxtWizard)  Time elapsed: 10.278 sec
testNew(org.eclipse.tracecompass.tmf.ui.swtbot.tests.parsers.custom.TestCustomXmlWizard)  Time elapsed: 9.318 sec
testPerspectiveComplete(org.eclipse.tracecompass.tmf.ui.swtbot.tests.perspectives.TracingPerspectiveChecker)  Time elapsed: 0.002 sec  <<< FAILURE!
java.lang.AssertionError: view org.eclipse.swtbot.eclipse.finder.widgets.SWTBotView@5667c776 is present
	at org.junit.Assert.fail(Assert.java:88)
	at org.junit.Assert.assertTrue(Assert.java:41)
	at org.eclipse.tracecompass.tmf.ui.swtbot.tests.shared.AbstractPerspectiveChecker.testPerspectiveComplete(AbstractPerspectiveChecker.java:118)
	at sun.reflect.GeneratedMethodAccessor157.invoke(Unknown Source)
	at sun.reflect.DelegatingMethodAccessorImpl.invoke(DelegatingMethodAccessorImpl.java:43)
	at java.lang.reflect.Method.invoke(Method.java:606)
	at org.junit.runners.model.FrameworkMethod$1.runReflectiveCall(FrameworkMethod.java:50)
	at org.junit.internal.runners.model.ReflectiveCallable.run(ReflectiveCallable.java:12)
	at org.junit.runners.model.FrameworkMethod.invokeExplosively(FrameworkMethod.java:47)
	at org.junit.internal.runners.statements.InvokeMethod.evaluate(InvokeMethod.java:17)
	at org.junit.internal.runners.statements.RunBefores.evaluate(RunBefores.java:26)
	at org.junit.runners.ParentRunner.runLeaf(ParentRunner.java:325)
	at org.junit.runners.BlockJUnit4ClassRunner.runChild(BlockJUnit4ClassRunner.java:78)
	at org.junit.runners.BlockJUnit4ClassRunner.runChild(BlockJUnit4ClassRunner.java:57)
	at org.junit.runners.ParentRunner$3.run(ParentRunner.java:290)
	at org.junit.runners.ParentRunner$1.schedule(ParentRunner.java:71)
	at org.junit.runners.ParentRunner.runChildren(ParentRunner.java:288)
	at org.junit.runners.ParentRunner.access$000(ParentRunner.java:58)
	at org.junit.runners.ParentRunner$2.evaluate(ParentRunner.java:268)
	at org.junit.internal.runners.statements.RunBefores.evaluate(RunBefores.java:26)
	at org.junit.internal.runners.statements.RunAfters.evaluate(RunAfters.java:27)
	at org.junit.runners.ParentRunner.run(ParentRunner.java:363)
	at org.eclipse.swtbot.swt.finder.junit.SWTBotJunit4ClassRunner.run(SWTBotJunit4ClassRunner.java:54)
	at org.junit.runners.Suite.runChild(Suite.java:128)
	at org.junit.runners.Suite.runChild(Suite.java:27)
	at org.junit.runners.ParentRunner$3.run(ParentRunner.java:290)
	at org.junit.runners.ParentRunner$1.schedule(ParentRunner.java:71)
	at org.junit.runners.ParentRunner.runChildren(ParentRunner.java:288)
	at org.junit.runners.ParentRunner.access$000(ParentRunner.java:58)
	at org.junit.runners.ParentRunner$2.evaluate(ParentRunner.java:268)
	at org.junit.runners.ParentRunner.run(ParentRunner.java:363)
	at org.junit.runners.Suite.runChild(Suite.java:128)
	at org.junit.runners.Suite.runChild(Suite.java:27)
	at org.junit.runners.ParentRunner$3.run(ParentRunner.java:290)
	at org.junit.runners.ParentRunner$1.schedule(ParentRunner.java:71)
	at org.junit.runners.ParentRunner.runChildren(ParentRunner.java:288)
	at org.junit.runners.ParentRunner.access$000(ParentRunner.java:58)
	at org.junit.runners.ParentRunner$2.evaluate(ParentRunner.java:268)
	at org.junit.runners.ParentRunner.run(ParentRunner.java:363)
	at org.junit.runners.Suite.runChild(Suite.java:128)
	at org.junit.runners.Suite.runChild(Suite.java:27)
	at org.junit.runners.ParentRunner$3.run(ParentRunner.java:290)
	at org.junit.runners.ParentRunner$1.schedule(ParentRunner.java:71)
	at org.junit.runners.ParentRunner.runChildren(ParentRunner.java:288)
	at org.junit.runners.ParentRunner.access$000(ParentRunner.java:58)
	at org.junit.runners.ParentRunner$2.evaluate(ParentRunner.java:268)
	at org.junit.runners.ParentRunner.run(ParentRunner.java:363)
	at org.apache.maven.surefire.junit4.JUnit4Provider.execute(JUnit4Provider.java:264)
	at org.apache.maven.surefire.junit4.JUnit4Provider.executeTestSet(JUnit4Provider.java:153)
	at org.apache.maven.surefire.junit4.JUnit4Provider.invoke(JUnit4Provider.java:124)
	at sun.reflect.NativeMethodAccessorImpl.invoke0(Native Method)
	at sun.reflect.NativeMethodAccessorImpl.invoke(NativeMethodAccessorImpl.java:57)
	at sun.reflect.DelegatingMethodAccessorImpl.invoke(DelegatingMethodAccessorImpl.java:43)
	at java.lang.reflect.Method.invoke(Method.java:606)
	at org.apache.maven.surefire.util.ReflectionUtils.invokeMethodWithArray2(ReflectionUtils.java:208)
	at org.apache.maven.surefire.booter.ProviderFactory$ProviderProxy.invoke(ProviderFactory.java:156)
	at org.apache.maven.surefire.booter.ProviderFactory.invokeProvider(ProviderFactory.java:82)
	at org.eclipse.tycho.surefire.osgibooter.OsgiSurefireBooter.run(OsgiSurefireBooter.java:91)
	at org.eclipse.tycho.surefire.osgibooter.AbstractUITestApplication.runTests(AbstractUITestApplication.java:44)
	at org.eclipse.e4.ui.internal.workbench.swt.E4Testable$1.run(E4Testable.java:73)
	at java.lang.Thread.run(Thread.java:745)

testPerspectiveForViews(org.eclipse.tracecompass.tmf.ui.swtbot.tests.perspectives.TracingPerspectiveChecker)  Time elapsed: 0.001 sec
test(org.eclipse.tracecompass.tmf.ui.swtbot.tests.viewers.events.CallsiteEventsInTableTest)  Time elapsed: 8.735 sec
test(org.eclipse.tracecompass.tmf.ui.swtbot.tests.viewers.events.CollapseEventsInTableTest)  Time elapsed: 9.697 sec
testYellow(org.eclipse.tracecompass.tmf.ui.swtbot.tests.viewers.events.ColorsViewTest)  Time elapsed: 7.793 sec
testToggleColumns(org.eclipse.tracecompass.tmf.ui.swtbot.tests.viewers.events.ColumnHeaderMenuTest)  Time elapsed: 3.069 sec
testShowAll(org.eclipse.tracecompass.tmf.ui.swtbot.tests.viewers.events.ColumnHeaderMenuTest)  Time elapsed: 3.013 sec
testNoCopySearchRow(org.eclipse.tracecompass.tmf.ui.swtbot.tests.viewers.events.CopyToClipboardTest)  Time elapsed: 3.781 sec
testCopySingleSelection(org.eclipse.tracecompass.tmf.ui.swtbot.tests.viewers.events.CopyToClipboardTest)  Time elapsed: 3.191 sec
testCopyMultipleSelection(org.eclipse.tracecompass.tmf.ui.swtbot.tests.viewers.events.CopyToClipboardTest)  Time elapsed: 2.798 sec
testMultiHighlightMessage(org.eclipse.tracecompass.tmf.ui.swtbot.tests.viewers.events.FilterColorEditorTest)  Time elapsed: 8.258 sec
testSwitchToFilter(org.eclipse.tracecompass.tmf.ui.swtbot.tests.viewers.events.FilterColorEditorTest)  Time elapsed: 7.942 sec
testHighlight(org.eclipse.tracecompass.tmf.ui.swtbot.tests.viewers.events.FilterColorEditorTest)  Time elapsed: 9.48 sec
testPreference(org.eclipse.tracecompass.tmf.ui.swtbot.tests.viewers.events.FilterColorEditorTest)  Time elapsed: 10.666 sec
testTimestampFilter(org.eclipse.tracecompass.tmf.ui.swtbot.tests.viewers.events.FilterViewerTest)  Time elapsed: 4.215 sec  <<< ERROR!
org.eclipse.swt.SWTException: Failed to execute runnable (org.eclipse.swtbot.swt.finder.exceptions.WidgetNotFoundException: Could not find menu: TRACETYPE)
	at org.eclipse.swt.SWT.error(SWT.java:4491)
	at org.eclipse.swt.SWT.error(SWT.java:4406)
	at org.eclipse.swt.widgets.Synchronizer.syncExec(Synchronizer.java:208)
	at org.eclipse.ui.internal.UISynchronizer.syncExec(UISynchronizer.java:145)
	at org.eclipse.swt.widgets.Display.syncExec(Display.java:4633)
	at org.eclipse.swtbot.swt.finder.finders.UIThreadRunnable.run(UIThreadRunnable.java:76)
	at org.eclipse.swtbot.swt.finder.finders.UIThreadRunnable.syncExec(UIThreadRunnable.java:142)
	at org.eclipse.swtbot.swt.finder.finders.UIThreadRunnable.syncExec(UIThreadRunnable.java:125)
	at org.eclipse.swtbot.swt.finder.finders.ContextMenuHelper.contextMenu(ContextMenuHelper.java:42)
	at org.eclipse.swtbot.swt.finder.widgets.SWTBotTreeItem.contextMenu(SWTBotTreeItem.java:558)
	at org.eclipse.tracecompass.tmf.ui.swtbot.tests.viewers.events.FilterViewerTest.testTimestampFilter(FilterViewerTest.java:165)
Caused by: org.eclipse.swtbot.swt.finder.exceptions.WidgetNotFoundException: Could not find menu: TRACETYPE
	at org.eclipse.swtbot.swt.finder.finders.ContextMenuHelper$1.run(ContextMenuHelper.java:63)
	at org.eclipse.swtbot.swt.finder.finders.ContextMenuHelper$1.run(ContextMenuHelper.java:1)
	at org.eclipse.swtbot.swt.finder.finders.UIThreadRunnable$2.doRun(UIThreadRunnable.java:140)
	at org.eclipse.swtbot.swt.finder.finders.UIThreadRunnable$1.run(UIThreadRunnable.java:89)
	at org.eclipse.swt.widgets.RunnableLock.run(RunnableLock.java:35)
	at org.eclipse.swt.widgets.Synchronizer.runAsyncMessages(Synchronizer.java:135)
	at org.eclipse.swt.widgets.Display.runAsyncMessages(Display.java:3794)
	at org.eclipse.swt.widgets.Display.readAndDispatch(Display.java:3433)
	at org.eclipse.e4.ui.internal.workbench.swt.PartRenderingEngine$4.run(PartRenderingEngine.java:1127)
	at org.eclipse.core.databinding.observable.Realm.runWithDefault(Realm.java:337)
	at org.eclipse.e4.ui.internal.workbench.swt.PartRenderingEngine.run(PartRenderingEngine.java:1018)
	at org.eclipse.e4.ui.internal.workbench.E4Workbench.createAndRunUI(E4Workbench.java:156)
	at org.eclipse.ui.internal.Workbench$5.run(Workbench.java:654)
	at org.eclipse.core.databinding.observable.Realm.runWithDefault(Realm.java:337)
	at org.eclipse.ui.internal.Workbench.createAndRunWorkbench(Workbench.java:598)
	at org.eclipse.ui.PlatformUI.createAndRunWorkbench(PlatformUI.java:150)
	at org.eclipse.ui.internal.ide.application.IDEApplication.start(IDEApplication.java:139)
	at org.eclipse.tycho.surefire.osgibooter.UITestApplication.runApplication(UITestApplication.java:31)
	at org.eclipse.tycho.surefire.osgibooter.AbstractUITestApplication.run(AbstractUITestApplication.java:120)
	at org.eclipse.tycho.surefire.osgibooter.UITestApplication.start(UITestApplication.java:37)
	at org.eclipse.equinox.internal.app.EclipseAppHandle.run(EclipseAppHandle.java:196)
	at org.eclipse.core.runtime.internal.adaptor.EclipseAppLauncher.runApplication(EclipseAppLauncher.java:134)
	at org.eclipse.core.runtime.internal.adaptor.EclipseAppLauncher.start(EclipseAppLauncher.java:104)
	at org.eclipse.core.runtime.adaptor.EclipseStarter.run(EclipseStarter.java:380)
	at org.eclipse.core.runtime.adaptor.EclipseStarter.run(EclipseStarter.java:235)
	at sun.reflect.NativeMethodAccessorImpl.invoke0(Native Method)
	at sun.reflect.NativeMethodAccessorImpl.invoke(NativeMethodAccessorImpl.java:57)
	at sun.reflect.DelegatingMethodAccessorImpl.invoke(DelegatingMethodAccessorImpl.java:43)
	at java.lang.reflect.Method.invoke(Method.java:606)
	at org.eclipse.equinox.launcher.Main.invokeFramework(Main.java:669)
	at org.eclipse.equinox.launcher.Main.basicRun(Main.java:608)
	at org.eclipse.equinox.launcher.Main.run(Main.java:1515)
	at org.eclipse.equinox.launcher.Main.main(Main.java:1488)

testField01(org.eclipse.tracecompass.tmf.ui.swtbot.tests.viewers.events.FilterViewerTest)  Time elapsed: 3.156 sec  <<< ERROR!
org.eclipse.swt.SWTException: Failed to execute runnable (org.eclipse.swtbot.swt.finder.exceptions.WidgetNotFoundException: Could not find menu: TRACETYPE)
	at org.eclipse.swt.SWT.error(SWT.java:4491)
	at org.eclipse.swt.SWT.error(SWT.java:4406)
	at org.eclipse.swt.widgets.Synchronizer.syncExec(Synchronizer.java:208)
	at org.eclipse.ui.internal.UISynchronizer.syncExec(UISynchronizer.java:145)
	at org.eclipse.swt.widgets.Display.syncExec(Display.java:4633)
	at org.eclipse.swtbot.swt.finder.finders.UIThreadRunnable.run(UIThreadRunnable.java:76)
	at org.eclipse.swtbot.swt.finder.finders.UIThreadRunnable.syncExec(UIThreadRunnable.java:142)
	at org.eclipse.swtbot.swt.finder.finders.UIThreadRunnable.syncExec(UIThreadRunnable.java:125)
	at org.eclipse.swtbot.swt.finder.finders.ContextMenuHelper.contextMenu(ContextMenuHelper.java:42)
	at org.eclipse.swtbot.swt.finder.widgets.SWTBotTreeItem.contextMenu(SWTBotTreeItem.java:558)
	at org.eclipse.tracecompass.tmf.ui.swtbot.tests.viewers.events.FilterViewerTest.testField01(FilterViewerTest.java:282)
Caused by: org.eclipse.swtbot.swt.finder.exceptions.WidgetNotFoundException: Could not find menu: TRACETYPE
	at org.eclipse.swtbot.swt.finder.finders.ContextMenuHelper$1.run(ContextMenuHelper.java:63)
	at org.eclipse.swtbot.swt.finder.finders.ContextMenuHelper$1.run(ContextMenuHelper.java:1)
	at org.eclipse.swtbot.swt.finder.finders.UIThreadRunnable$2.doRun(UIThreadRunnable.java:140)
	at org.eclipse.swtbot.swt.finder.finders.UIThreadRunnable$1.run(UIThreadRunnable.java:89)
	at org.eclipse.swt.widgets.RunnableLock.run(RunnableLock.java:35)
	at org.eclipse.swt.widgets.Synchronizer.runAsyncMessages(Synchronizer.java:135)
	at org.eclipse.swt.widgets.Display.runAsyncMessages(Display.java:3794)
	at org.eclipse.swt.widgets.Display.readAndDispatch(Display.java:3433)
	at org.eclipse.e4.ui.internal.workbench.swt.PartRenderingEngine$4.run(PartRenderingEngine.java:1127)
	at org.eclipse.core.databinding.observable.Realm.runWithDefault(Realm.java:337)
	at org.eclipse.e4.ui.internal.workbench.swt.PartRenderingEngine.run(PartRenderingEngine.java:1018)
	at org.eclipse.e4.ui.internal.workbench.E4Workbench.createAndRunUI(E4Workbench.java:156)
	at org.eclipse.ui.internal.Workbench$5.run(Workbench.java:654)
	at org.eclipse.core.databinding.observable.Realm.runWithDefault(Realm.java:337)
	at org.eclipse.ui.internal.Workbench.createAndRunWorkbench(Workbench.java:598)
	at org.eclipse.ui.PlatformUI.createAndRunWorkbench(PlatformUI.java:150)
	at org.eclipse.ui.internal.ide.application.IDEApplication.start(IDEApplication.java:139)
	at org.eclipse.tycho.surefire.osgibooter.UITestApplication.runApplication(UITestApplication.java:31)
	at org.eclipse.tycho.surefire.osgibooter.AbstractUITestApplication.run(AbstractUITestApplication.java:120)
	at org.eclipse.tycho.surefire.osgibooter.UITestApplication.start(UITestApplication.java:37)
	at org.eclipse.equinox.internal.app.EclipseAppHandle.run(EclipseAppHandle.java:196)
	at org.eclipse.core.runtime.internal.adaptor.EclipseAppLauncher.runApplication(EclipseAppLauncher.java:134)
	at org.eclipse.core.runtime.internal.adaptor.EclipseAppLauncher.start(EclipseAppLauncher.java:104)
	at org.eclipse.core.runtime.adaptor.EclipseStarter.run(EclipseStarter.java:380)
	at org.eclipse.core.runtime.adaptor.EclipseStarter.run(EclipseStarter.java:235)
	at sun.reflect.NativeMethodAccessorImpl.invoke0(Native Method)
	at sun.reflect.NativeMethodAccessorImpl.invoke(NativeMethodAccessorImpl.java:57)
	at sun.reflect.DelegatingMethodAccessorImpl.invoke(DelegatingMethodAccessorImpl.java:43)
	at java.lang.reflect.Method.invoke(Method.java:606)
	at org.eclipse.equinox.launcher.Main.invokeFramework(Main.java:669)
	at org.eclipse.equinox.launcher.Main.basicRun(Main.java:608)
	at org.eclipse.equinox.launcher.Main.run(Main.java:1515)
	at org.eclipse.equinox.launcher.Main.main(Main.java:1488)

testTimestampEqualsOr(org.eclipse.tracecompass.tmf.ui.swtbot.tests.viewers.events.FilterViewerTest)  Time elapsed: 3.863 sec  <<< ERROR!
org.eclipse.swt.SWTException: Failed to execute runnable (org.eclipse.swtbot.swt.finder.exceptions.WidgetNotFoundException: Could not find menu: TRACETYPE)
	at org.eclipse.swt.SWT.error(SWT.java:4491)
	at org.eclipse.swt.SWT.error(SWT.java:4406)
	at org.eclipse.swt.widgets.Synchronizer.syncExec(Synchronizer.java:208)
	at org.eclipse.ui.internal.UISynchronizer.syncExec(UISynchronizer.java:145)
	at org.eclipse.swt.widgets.Display.syncExec(Display.java:4633)
	at org.eclipse.swtbot.swt.finder.finders.UIThreadRunnable.run(UIThreadRunnable.java:76)
	at org.eclipse.swtbot.swt.finder.finders.UIThreadRunnable.syncExec(UIThreadRunnable.java:142)
	at org.eclipse.swtbot.swt.finder.finders.UIThreadRunnable.syncExec(UIThreadRunnable.java:125)
	at org.eclipse.swtbot.swt.finder.finders.ContextMenuHelper.contextMenu(ContextMenuHelper.java:42)
	at org.eclipse.swtbot.swt.finder.widgets.SWTBotTreeItem.contextMenu(SWTBotTreeItem.java:558)
	at org.eclipse.tracecompass.tmf.ui.swtbot.tests.viewers.events.FilterViewerTest.testTimestampEqualsOr(FilterViewerTest.java:215)
Caused by: org.eclipse.swtbot.swt.finder.exceptions.WidgetNotFoundException: Could not find menu: TRACETYPE
	at org.eclipse.swtbot.swt.finder.finders.ContextMenuHelper$1.run(ContextMenuHelper.java:63)
	at org.eclipse.swtbot.swt.finder.finders.ContextMenuHelper$1.run(ContextMenuHelper.java:1)
	at org.eclipse.swtbot.swt.finder.finders.UIThreadRunnable$2.doRun(UIThreadRunnable.java:140)
	at org.eclipse.swtbot.swt.finder.finders.UIThreadRunnable$1.run(UIThreadRunnable.java:89)
	at org.eclipse.swt.widgets.RunnableLock.run(RunnableLock.java:35)
	at org.eclipse.swt.widgets.Synchronizer.runAsyncMessages(Synchronizer.java:135)
	at org.eclipse.swt.widgets.Display.runAsyncMessages(Display.java:3794)
	at org.eclipse.swt.widgets.Display.readAndDispatch(Display.java:3433)
	at org.eclipse.e4.ui.internal.workbench.swt.PartRenderingEngine$4.run(PartRenderingEngine.java:1127)
	at org.eclipse.core.databinding.observable.Realm.runWithDefault(Realm.java:337)
	at org.eclipse.e4.ui.internal.workbench.swt.PartRenderingEngine.run(PartRenderingEngine.java:1018)
	at org.eclipse.e4.ui.internal.workbench.E4Workbench.createAndRunUI(E4Workbench.java:156)
	at org.eclipse.ui.internal.Workbench$5.run(Workbench.java:654)
	at org.eclipse.core.databinding.observable.Realm.runWithDefault(Realm.java:337)
	at org.eclipse.ui.internal.Workbench.createAndRunWorkbench(Workbench.java:598)
	at org.eclipse.ui.PlatformUI.createAndRunWorkbench(PlatformUI.java:150)
	at org.eclipse.ui.internal.ide.application.IDEApplication.start(IDEApplication.java:139)
	at org.eclipse.tycho.surefire.osgibooter.UITestApplication.runApplication(UITestApplication.java:31)
	at org.eclipse.tycho.surefire.osgibooter.AbstractUITestApplication.run(AbstractUITestApplication.java:120)
	at org.eclipse.tycho.surefire.osgibooter.UITestApplication.start(UITestApplication.java:37)
	at org.eclipse.equinox.internal.app.EclipseAppHandle.run(EclipseAppHandle.java:196)
	at org.eclipse.core.runtime.internal.adaptor.EclipseAppLauncher.runApplication(EclipseAppLauncher.java:134)
	at org.eclipse.core.runtime.internal.adaptor.EclipseAppLauncher.start(EclipseAppLauncher.java:104)
	at org.eclipse.core.runtime.adaptor.EclipseStarter.run(EclipseStarter.java:380)
	at org.eclipse.core.runtime.adaptor.EclipseStarter.run(EclipseStarter.java:235)
	at sun.reflect.NativeMethodAccessorImpl.invoke0(Native Method)
	at sun.reflect.NativeMethodAccessorImpl.invoke(NativeMethodAccessorImpl.java:57)
	at sun.reflect.DelegatingMethodAccessorImpl.invoke(DelegatingMethodAccessorImpl.java:43)
	at java.lang.reflect.Method.invoke(Method.java:606)
	at org.eclipse.equinox.launcher.Main.invokeFramework(Main.java:669)
	at org.eclipse.equinox.launcher.Main.basicRun(Main.java:608)
	at org.eclipse.equinox.launcher.Main.run(Main.java:1515)
	at org.eclipse.equinox.launcher.Main.main(Main.java:1488)

testChangeFont(org.eclipse.tracecompass.tmf.ui.swtbot.tests.viewers.events.FontEventEditorTest)  Time elapsed: 10.896 sec
testReorder(org.eclipse.tracecompass.tmf.ui.swtbot.tests.viewers.events.MovableColumnEventsEditorTest)  Time elapsed: 12.446 sec
testSDView(org.eclipse.tracecompass.tmf.ui.swtbot.tests.viewers.events.SDViewTest)  Time elapsed: 5.803 sec
testOffsetting(org.eclipse.tracecompass.tmf.ui.swtbot.tests.viewers.events.TestTraceOffsetting)  Time elapsed: 11.437 sec
testOverlappingTimechartMove(org.eclipse.tracecompass.tmf.ui.swtbot.tests.viewers.events.TmfAlignTimeAxisTest)  Time elapsed: 5.261 sec
testNotOverlappingCallstackMove(org.eclipse.tracecompass.tmf.ui.swtbot.tests.viewers.events.TmfAlignTimeAxisTest)  Time elapsed: 5.251 sec
testMoveHistogramCallstackFollows(org.eclipse.tracecompass.tmf.ui.swtbot.tests.viewers.events.TmfAlignTimeAxisTest)  Time elapsed: 5.242 sec
testOverlappingHistogramMove(org.eclipse.tracecompass.tmf.ui.swtbot.tests.viewers.events.TmfAlignTimeAxisTest)  Time elapsed: 5.204 sec
testNotOverlappingHistogramMove(org.eclipse.tracecompass.tmf.ui.swtbot.tests.viewers.events.TmfAlignTimeAxisTest)  Time elapsed: 5.268 sec
testMoveCallstackHistogramFollows(org.eclipse.tracecompass.tmf.ui.swtbot.tests.viewers.events.TmfAlignTimeAxisTest)  Time elapsed: 5.29 sec
testGzipImport(org.eclipse.tracecompass.tmf.ui.swtbot.tests.wizards.StandardImportGzipTraceTest)  Time elapsed: 6.683 sec
test(org.eclipse.tracecompass.tmf.ctf.ui.swtbot.tests.ImportAndReadSmokeTest)  Time elapsed: 13.131 sec
testImportFromDirectory(org.eclipse.tracecompass.tmf.ctf.ui.swtbot.tests.StandardImportAndReadSmokeTest)  Time elapsed: 7.779 sec
testExtractArchivesFromArchive(org.eclipse.tracecompass.tmf.ctf.ui.swtbot.tests.StandardImportAndReadSmokeTest)  Time elapsed: 17.268 sec
testImportFromDirectoryLinksPreserveFolder(org.eclipse.tracecompass.tmf.ctf.ui.swtbot.tests.StandardImportAndReadSmokeTest)  Time elapsed: 8.175 sec
testExtractArchivesFromArchivePreserveFolder(org.eclipse.tracecompass.tmf.ctf.ui.swtbot.tests.StandardImportAndReadSmokeTest)  Time elapsed: 18.686 sec
testExtractArchivesFromDirectory(org.eclipse.tracecompass.tmf.ctf.ui.swtbot.tests.StandardImportAndReadSmokeTest)  Time elapsed: 13.514 sec
testImportFromArchive(org.eclipse.tracecompass.tmf.ctf.ui.swtbot.tests.StandardImportAndReadSmokeTest)  Time elapsed: 14.109 sec
testExtractArchivesFromDirectoryLinksPreserveStruture(org.eclipse.tracecompass.tmf.ctf.ui.swtbot.tests.StandardImportAndReadSmokeTest)  Time elapsed: 13.132 sec
testEmptyDirectory(org.eclipse.tracecompass.tmf.ctf.ui.swtbot.tests.StandardImportAndReadSmokeTest)  Time elapsed: 5.562 sec
testEmptyArchive(org.eclipse.tracecompass.tmf.ctf.ui.swtbot.tests.StandardImportAndReadSmokeTest)  Time elapsed: 9.719 sec
testNestedEmptyArchive(org.eclipse.tracecompass.tmf.ctf.ui.swtbot.tests.StandardImportAndReadSmokeTest)  Time elapsed: 13.441 sec
testImportFromArchiveOverwrite(org.eclipse.tracecompass.tmf.ctf.ui.swtbot.tests.StandardImportAndReadSmokeTest)  Time elapsed: 15.013 sec
testDirectoryWithEmptyArchive(org.eclipse.tracecompass.tmf.ctf.ui.swtbot.tests.StandardImportAndReadSmokeTest)  Time elapsed: 10.106 sec
testImportFromDirectoryPreserveFolder(org.eclipse.tracecompass.tmf.ctf.ui.swtbot.tests.StandardImportAndReadSmokeTest)  Time elapsed: 8.76 sec
testImportFromDirectoryLinks(org.eclipse.tracecompass.tmf.ctf.ui.swtbot.tests.StandardImportAndReadSmokeTest)  Time elapsed: 7.145 sec
testImportFromDirectoryOverwrite(org.eclipse.tracecompass.tmf.ctf.ui.swtbot.tests.StandardImportAndReadSmokeTest)  Time elapsed: 14.574 sec
testExtractArchivesFromDirectoryLinks(org.eclipse.tracecompass.tmf.ctf.ui.swtbot.tests.StandardImportAndReadSmokeTest)  Time elapsed: 12.836 sec
testImportFromArchivePreserveFolder(org.eclipse.tracecompass.tmf.ctf.ui.swtbot.tests.StandardImportAndReadSmokeTest)  Time elapsed: 7.132 sec
testOpen[0: ../../ctf/org.eclipse.tracecompass.ctf.core.tests/traces/ctf-testsuite/tests/1.8/regression/metadata/fail/struct-align-negative](org.eclipse.tracecompass.tmf.ctf.ui.swtbot.tests.TestInvalidCtfTrace)  Time elapsed: 5.329 sec
testOpen[1: ../../ctf/org.eclipse.tracecompass.ctf.core.tests/traces/ctf-testsuite/tests/1.8/regression/metadata/fail/array-size-identifier](org.eclipse.tracecompass.tmf.ctf.ui.swtbot.tests.TestInvalidCtfTrace)  Time elapsed: 4.924 sec
testOpen[2: ../../ctf/org.eclipse.tracecompass.ctf.core.tests/traces/ctf-testsuite/tests/1.8/regression/metadata/fail/struct-align-huge](org.eclipse.tracecompass.tmf.ctf.ui.swtbot.tests.TestInvalidCtfTrace)  Time elapsed: 5.427 sec
testOpen[3: ../../ctf/org.eclipse.tracecompass.ctf.core.tests/traces/ctf-testsuite/tests/1.8/regression/metadata/fail/integer-signed-as-string](org.eclipse.tracecompass.tmf.ctf.ui.swtbot.tests.TestInvalidCtfTrace)  Time elapsed: 5.189 sec
testOpen[4: ../../ctf/org.eclipse.tracecompass.ctf.core.tests/traces/ctf-testsuite/tests/1.8/regression/metadata/fail/array-size-keyword](org.eclipse.tracecompass.tmf.ctf.ui.swtbot.tests.TestInvalidCtfTrace)  Time elapsed: 5.398 sec
testOpen[5: ../../ctf/org.eclipse.tracecompass.ctf.core.tests/traces/ctf-testsuite/tests/1.8/regression/metadata/fail/integer-range](org.eclipse.tracecompass.tmf.ctf.ui.swtbot.tests.TestInvalidCtfTrace)  Time elapsed: 5.599 sec
testOpen[6: ../../ctf/org.eclipse.tracecompass.ctf.core.tests/traces/ctf-testsuite/tests/1.8/regression/metadata/fail/integer-signed-invalid](org.eclipse.tracecompass.tmf.ctf.ui.swtbot.tests.TestInvalidCtfTrace)  Time elapsed: 5.314 sec
testOpen[7: ../../ctf/org.eclipse.tracecompass.ctf.core.tests/traces/ctf-testsuite/tests/1.8/regression/metadata/fail/struct-align-string](org.eclipse.tracecompass.tmf.ctf.ui.swtbot.tests.TestInvalidCtfTrace)  Time elapsed: 5.828 sec
testOpen[8: ../../ctf/org.eclipse.tracecompass.ctf.core.tests/traces/ctf-testsuite/tests/1.8/regression/metadata/fail/array-size-type-field](org.eclipse.tracecompass.tmf.ctf.ui.swtbot.tests.TestInvalidCtfTrace)  Time elapsed: 5.369 sec
testOpen[9: ../../ctf/org.eclipse.tracecompass.ctf.core.tests/traces/ctf-testsuite/tests/1.8/regression/metadata/fail/struct-duplicate-struct-name](org.eclipse.tracecompass.tmf.ctf.ui.swtbot.tests.TestInvalidCtfTrace)  Time elapsed: 4.86 sec
testOpen[10: ../../ctf/org.eclipse.tracecompass.ctf.core.tests/traces/ctf-testsuite/tests/1.8/regression/metadata/fail/integer-encoding-invalid](org.eclipse.tracecompass.tmf.ctf.ui.swtbot.tests.TestInvalidCtfTrace)  Time elapsed: 5.448 sec
testOpen[11: ../../ctf/org.eclipse.tracecompass.ctf.core.tests/traces/ctf-testsuite/tests/1.8/regression/metadata/fail/integer-size-as-string](org.eclipse.tracecompass.tmf.ctf.ui.swtbot.tests.TestInvalidCtfTrace)  Time elapsed: 4.774 sec
testOpen[12: ../../ctf/org.eclipse.tracecompass.ctf.core.tests/traces/ctf-testsuite/tests/1.8/regression/metadata/fail/array-size-type](org.eclipse.tracecompass.tmf.ctf.ui.swtbot.tests.TestInvalidCtfTrace)  Time elapsed: 4.9 sec
testOpen[13: ../../ctf/org.eclipse.tracecompass.ctf.core.tests/traces/ctf-testsuite/tests/1.8/regression/metadata/fail/array-size-not-present](org.eclipse.tracecompass.tmf.ctf.ui.swtbot.tests.TestInvalidCtfTrace)  Time elapsed: 5.18 sec
testOpen[14: ../../ctf/org.eclipse.tracecompass.ctf.core.tests/traces/ctf-testsuite/tests/1.8/regression/metadata/fail/struct-duplicate-field-name](org.eclipse.tracecompass.tmf.ctf.ui.swtbot.tests.TestInvalidCtfTrace)  Time elapsed: 5.359 sec
testOpen[15: ../../ctf/org.eclipse.tracecompass.ctf.core.tests/traces/ctf-testsuite/tests/1.8/regression/metadata/fail/array-size-string](org.eclipse.tracecompass.tmf.ctf.ui.swtbot.tests.TestInvalidCtfTrace)  Time elapsed: 5.018 sec
testOpen[16: ../../ctf/org.eclipse.tracecompass.ctf.core.tests/traces/ctf-testsuite/tests/1.8/regression/metadata/fail/integer-size-missing](org.eclipse.tracecompass.tmf.ctf.ui.swtbot.tests.TestInvalidCtfTrace)  Time elapsed: 5.182 sec
testOpen[17: ../../ctf/org.eclipse.tracecompass.ctf.core.tests/traces/ctf-testsuite/tests/1.8/regression/metadata/fail/integer-negative-bit-size](org.eclipse.tracecompass.tmf.ctf.ui.swtbot.tests.TestInvalidCtfTrace)  Time elapsed: 5.933 sec
testOpen[18: ../../ctf/org.eclipse.tracecompass.ctf.core.tests/traces/ctf-testsuite/tests/1.8/regression/metadata/fail/struct-align-enum](org.eclipse.tracecompass.tmf.ctf.ui.swtbot.tests.TestInvalidCtfTrace)  Time elapsed: 4.876 sec
testOpen[19: ../../ctf/org.eclipse.tracecompass.ctf.core.tests/traces/ctf-testsuite/tests/1.8/regression/metadata/fail/integer-encoding-as-string](org.eclipse.tracecompass.tmf.ctf.ui.swtbot.tests.TestInvalidCtfTrace)  Time elapsed: 5.363 sec
testOpen[20: ../../ctf/org.eclipse.tracecompass.ctf.core.tests/traces/ctf-testsuite/tests/1.8/regression/metadata/fail/struct-align-zero](org.eclipse.tracecompass.tmf.ctf.ui.swtbot.tests.TestInvalidCtfTrace)  Time elapsed: 5.144 sec
testOpen[21: ../../ctf/org.eclipse.tracecompass.ctf.core.tests/traces/ctf-testsuite/tests/1.8/regression/metadata/fail/array-redefinition](org.eclipse.tracecompass.tmf.ctf.ui.swtbot.tests.TestInvalidCtfTrace)  Time elapsed: 4.929 sec
testOpen[22: ../../ctf/org.eclipse.tracecompass.ctf.core.tests/traces/ctf-testsuite/tests/1.8/regression/metadata/fail/array-size-negative](org.eclipse.tracecompass.tmf.ctf.ui.swtbot.tests.TestInvalidCtfTrace)  Time elapsed: 4.557 sec
testOpen[23: ../../ctf/org.eclipse.tracecompass.ctf.core.tests/traces/ctf-testsuite/tests/1.8/regression/metadata/fail/struct-field-name-keyword](org.eclipse.tracecompass.tmf.ctf.ui.swtbot.tests.TestInvalidCtfTrace)  Time elapsed: 4.635 sec
test(org.eclipse.tracecompass.tmf.pcap.ui.swtbot.tests.ImportAndReadPcapTest)  Time elapsed: 26.392 sec
testPerspectiveComplete(org.eclipse.tracecompass.tmf.pcap.ui.swtbot.tests.NetworkPerspectiveChecker)  Time elapsed: 0 sec
testPerspectiveForViews(org.eclipse.tracecompass.tmf.pcap.ui.swtbot.tests.NetworkPerspectiveChecker)  Time elapsed: 0.085 sec
org.eclipse.tracecompass.tmf.remote.ui.swtbot.tests.fetch.FetchRemoteTracesTest  Time elapsed: 0.085 sec  <<< ERROR!
java.lang.NoClassDefFoundError: Could not initialize class org.eclipse.tracecompass.tmf.remote.ui.swtbot.tests.fetch.FetchRemoteTracesTest
	at sun.reflect.GeneratedMethodAccessor264.invoke(Unknown Source)
	at sun.reflect.DelegatingMethodAccessorImpl.invoke(DelegatingMethodAccessorImpl.java:43)
	at java.lang.reflect.Method.invoke(Method.java:606)
	at org.junit.runners.model.FrameworkMethod$1.runReflectiveCall(FrameworkMethod.java:50)
	at org.junit.internal.runners.model.ReflectiveCallable.run(ReflectiveCallable.java:12)
	at org.junit.runners.model.FrameworkMethod.invokeExplosively(FrameworkMethod.java:47)
	at org.junit.internal.runners.statements.RunBefores.evaluate(RunBefores.java:24)
	at org.junit.runners.ParentRunner.run(ParentRunner.java:363)
	at org.eclipse.swtbot.swt.finder.junit.SWTBotJunit4ClassRunner.run(SWTBotJunit4ClassRunner.java:54)
	at org.junit.runners.Suite.runChild(Suite.java:128)
	at org.junit.runners.Suite.runChild(Suite.java:27)
	at org.junit.runners.ParentRunner$3.run(ParentRunner.java:290)
	at org.junit.runners.ParentRunner$1.schedule(ParentRunner.java:71)
	at org.junit.runners.ParentRunner.runChildren(ParentRunner.java:288)
	at org.junit.runners.ParentRunner.access$000(ParentRunner.java:58)
	at org.junit.runners.ParentRunner$2.evaluate(ParentRunner.java:268)
	at org.junit.runners.ParentRunner.run(ParentRunner.java:363)
	at org.junit.runners.Suite.runChild(Suite.java:128)
	at org.junit.runners.Suite.runChild(Suite.java:27)
	at org.junit.runners.ParentRunner$3.run(ParentRunner.java:290)
	at org.junit.runners.ParentRunner$1.schedule(ParentRunner.java:71)
	at org.junit.runners.ParentRunner.runChildren(ParentRunner.java:288)
	at org.junit.runners.ParentRunner.access$000(ParentRunner.java:58)
	at org.junit.runners.ParentRunner$2.evaluate(ParentRunner.java:268)
	at org.junit.runners.ParentRunner.run(ParentRunner.java:363)
	at org.junit.runners.Suite.runChild(Suite.java:128)
	at org.junit.runners.Suite.runChild(Suite.java:27)
	at org.junit.runners.ParentRunner$3.run(ParentRunner.java:290)
	at org.junit.runners.ParentRunner$1.schedule(ParentRunner.java:71)
	at org.junit.runners.ParentRunner.runChildren(ParentRunner.java:288)
	at org.junit.runners.ParentRunner.access$000(ParentRunner.java:58)
	at org.junit.runners.ParentRunner$2.evaluate(ParentRunner.java:268)
	at org.junit.runners.ParentRunner.run(ParentRunner.java:363)
	at org.apache.maven.surefire.junit4.JUnit4Provider.execute(JUnit4Provider.java:264)
	at org.apache.maven.surefire.junit4.JUnit4Provider.executeTestSet(JUnit4Provider.java:153)
	at org.apache.maven.surefire.junit4.JUnit4Provider.invoke(JUnit4Provider.java:124)
	at sun.reflect.NativeMethodAccessorImpl.invoke0(Native Method)
	at sun.reflect.NativeMethodAccessorImpl.invoke(NativeMethodAccessorImpl.java:57)
	at sun.reflect.DelegatingMethodAccessorImpl.invoke(DelegatingMethodAccessorImpl.java:43)
	at java.lang.reflect.Method.invoke(Method.java:606)
	at org.apache.maven.surefire.util.ReflectionUtils.invokeMethodWithArray2(ReflectionUtils.java:208)
	at org.apache.maven.surefire.booter.ProviderFactory$ProviderProxy.invoke(ProviderFactory.java:156)
	at org.apache.maven.surefire.booter.ProviderFactory.invokeProvider(ProviderFactory.java:82)
	at org.eclipse.tycho.surefire.osgibooter.OsgiSurefireBooter.run(OsgiSurefireBooter.java:91)
	at org.eclipse.tycho.surefire.osgibooter.AbstractUITestApplication.runTests(AbstractUITestApplication.java:44)
	at org.eclipse.e4.ui.internal.workbench.swt.E4Testable$1.run(E4Testable.java:73)
	at java.lang.Thread.run(Thread.java:745)

testPerspectiveComplete(org.eclipse.tracecompass.lttng2.kernel.ui.swtbot.tests.KernelPerspectiveChecker)  Time elapsed: 0.504 sec
testPerspectiveForViews(org.eclipse.tracecompass.lttng2.kernel.ui.swtbot.tests.KernelPerspectiveChecker)  Time elapsed: 0.019 sec
test(org.eclipse.tracecompass.lttng2.kernel.ui.swtbot.tests.ImportAndReadKernelSmokeTest)  Time elapsed: 15.701 sec
testToolBarFollowCPUForwardBackward(org.eclipse.tracecompass.lttng2.kernel.ui.swtbot.tests.ControlFlowViewTest)  Time elapsed: 20.147 sec
testKeyboardLeftRight(org.eclipse.tracecompass.lttng2.kernel.ui.swtbot.tests.ControlFlowViewTest)  Time elapsed: 15.801 sec
testToolBarSelectNextPreviousEvent(org.eclipse.tracecompass.lttng2.kernel.ui.swtbot.tests.ControlFlowViewTest)  Time elapsed: 16.371 sec
testOpenAndCloseConcurrency(org.eclipse.tracecompass.lttng2.kernel.ui.swtbot.tests.OpenTraceStressTest)  Time elapsed: 73.845 sec

Results :

Failed tests: 
  TracingPerspectiveChecker>AbstractPerspectiveChecker.testPerspectiveComplete:118 view org.eclipse.swtbot.eclipse.finder.widgets.SWTBotView@6e73845b is present
  TracingPerspectiveChecker>AbstractPerspectiveChecker.testPerspectiveComplete:118 view org.eclipse.swtbot.eclipse.finder.widgets.SWTBotView@33d5de60 is present
  TracingPerspectiveChecker>AbstractPerspectiveChecker.testPerspectiveComplete:118 view org.eclipse.swtbot.eclipse.finder.widgets.SWTBotView@3a7ee9f6 is present
  TracingPerspectiveChecker>AbstractPerspectiveChecker.testPerspectiveComplete:118 view org.eclipse.swtbot.eclipse.finder.widgets.SWTBotView@460791f1 is present
  TracingPerspectiveChecker>AbstractPerspectiveChecker.testPerspectiveComplete:118 view org.eclipse.swtbot.eclipse.finder.widgets.SWTBotView@6e5ee9a9 is present
  TracingPerspectiveChecker>AbstractPerspectiveChecker.testPerspectiveComplete:118 view org.eclipse.swtbot.eclipse.finder.widgets.SWTBotView@3845c5f4 is present
  TracingPerspectiveChecker>AbstractPerspectiveChecker.testPerspectiveComplete:118 view org.eclipse.swtbot.eclipse.finder.widgets.SWTBotView@52b41abb is present
  TracingPerspectiveChecker>AbstractPerspectiveChecker.testPerspectiveComplete:118 view org.eclipse.swtbot.eclipse.finder.widgets.SWTBotView@174b3500 is present
  TracingPerspectiveChecker>AbstractPerspectiveChecker.testPerspectiveComplete:118 view org.eclipse.swtbot.eclipse.finder.widgets.SWTBotView@36474ed2 is present
  TracingPerspectiveChecker>AbstractPerspectiveChecker.testPerspectiveComplete:118 view org.eclipse.swtbot.eclipse.finder.widgets.SWTBotView@37569f7b is present
  TracingPerspectiveChecker>AbstractPerspectiveChecker.testPerspectiveComplete:118 view org.eclipse.swtbot.eclipse.finder.widgets.SWTBotView@4d9d20c is present
  TracingPerspectiveChecker>AbstractPerspectiveChecker.testPerspectiveComplete:118 view org.eclipse.swtbot.eclipse.finder.widgets.SWTBotView@98f28d5 is present
  TracingPerspectiveChecker>AbstractPerspectiveChecker.testPerspectiveComplete:118 view org.eclipse.swtbot.eclipse.finder.widgets.SWTBotView@20102118 is present
  TracingPerspectiveChecker>AbstractPerspectiveChecker.testPerspectiveComplete:118 view org.eclipse.swtbot.eclipse.finder.widgets.SWTBotView@2ebe73dc is present
  TracingPerspectiveChecker>AbstractPerspectiveChecker.testPerspectiveComplete:118 view org.eclipse.swtbot.eclipse.finder.widgets.SWTBotView@7f6d771d is present
  TracingPerspectiveChecker>AbstractPerspectiveChecker.testPerspectiveComplete:118 view org.eclipse.swtbot.eclipse.finder.widgets.SWTBotView@2043aba5 is present
  TracingPerspectiveChecker>AbstractPerspectiveChecker.testPerspectiveComplete:118 view org.eclipse.swtbot.eclipse.finder.widgets.SWTBotView@37ead70f is present
  TracingPerspectiveChecker>AbstractPerspectiveChecker.testPerspectiveComplete:118 view org.eclipse.swtbot.eclipse.finder.widgets.SWTBotView@3967bc5b is present
  TracingPerspectiveChecker>AbstractPerspectiveChecker.testPerspectiveComplete:118 view org.eclipse.swtbot.eclipse.finder.widgets.SWTBotView@5667c776 is present

Tests in error: 
  null
  FilterViewerTest.testTimestampFilter:165 » SWT Failed to execute runnable (org...
  FilterViewerTest.testField01:282 » SWT Failed to execute runnable (org.eclipse...
  FilterViewerTest.testTimestampEqualsOr:215 » SWT Failed to execute runnable (o...
  Could not initialize class org.eclipse.tracecompass.tmf.remote.ui.swtbot.tests.fetch.FetchRemoteTracesTest
  FilterViewerTest.testTimestampFilter:165 » SWT Failed to execute runnable (org...
  FilterViewerTest.testField01:282 » SWT Failed to execute runnable (org.eclipse...
  FilterViewerTest.testTimestampEqualsOr:215 » SWT Failed to execute runnable (o...
  Could not initialize class org.eclipse.tracecompass.tmf.remote.ui.swtbot.tests.fetch.FetchRemoteTracesTest
  FilterViewerTest.testTimestampFilter:165 » SWT Failed to execute runnable (org...
  FilterViewerTest.testField01:282 » SWT Failed to execute runnable (org.eclipse...
  FilterViewerTest.testTimestampEqualsOr:215 » SWT Failed to execute runnable (o...
  Could not initialize class org.eclipse.tracecompass.tmf.remote.ui.swtbot.tests.fetch.FetchRemoteTracesTest
  FilterViewerTest.testTimestampFilter:165 » SWT Failed to execute runnable (org...
  FilterViewerTest.testField01:282 » SWT Failed to execute runnable (org.eclipse...
  FilterViewerTest.testTimestampEqualsOr:215 » SWT Failed to execute runnable (o...
  Could not initialize class org.eclipse.tracecompass.tmf.remote.ui.swtbot.tests.fetch.FetchRemoteTracesTest
  FilterViewerTest.testTimestampFilter:165 » SWT Failed to execute runnable (org...
  FilterViewerTest.testField01:282 » SWT Failed to execute runnable (org.eclipse...
  FilterViewerTest.testTimestampEqualsOr:215 » SWT Failed to execute runnable (o...
  Could not initialize class org.eclipse.tracecompass.tmf.remote.ui.swtbot.tests.fetch.FetchRemoteTracesTest
  FilterViewerTest.testTimestampFilter:165 » SWT Failed to execute runnable (org...
  FilterViewerTest.testField01:282 » SWT Failed to execute runnable (org.eclipse...
  FilterViewerTest.testTimestampEqualsOr:215 » SWT Failed to execute runnable (o...
  Could not initialize class org.eclipse.tracecompass.tmf.remote.ui.swtbot.tests.fetch.FetchRemoteTracesTest
  FilterViewerTest.testTimestampFilter:165 » SWT Failed to execute runnable (org...
  FilterViewerTest.testField01:282 » SWT Failed to execute runnable (org.eclipse...
  FilterViewerTest.testTimestampEqualsOr:215 » SWT Failed to execute runnable (o...
  Could not initialize class org.eclipse.tracecompass.tmf.remote.ui.swtbot.tests.fetch.FetchRemoteTracesTest
  FilterViewerTest.testTimestampFilter:165 » SWT Failed to execute runnable (org...
  FilterViewerTest.testField01:282 » SWT Failed to execute runnable (org.eclipse...
  FilterViewerTest.testTimestampEqualsOr:215 » SWT Failed to execute runnable (o...
  Could not initialize class org.eclipse.tracecompass.tmf.remote.ui.swtbot.tests.fetch.FetchRemoteTracesTest
  FilterViewerTest.testTimestampFilter:165 » SWT Failed to execute runnable (org...
  FilterViewerTest.testField01:282 » SWT Failed to execute runnable (org.eclipse...
  FilterViewerTest.testTimestampEqualsOr:215 » SWT Failed to execute runnable (o...
  Could not initialize class org.eclipse.tracecompass.tmf.remote.ui.swtbot.tests.fetch.FetchRemoteTracesTest
  FilterViewerTest.testTimestampFilter:165 » SWT Failed to execute runnable (org...
  FilterViewerTest.testField01:282 » SWT Failed to execute runnable (org.eclipse...
  FilterViewerTest.testTimestampEqualsOr:215 » SWT Failed to execute runnable (o...
  Could not initialize class org.eclipse.tracecompass.tmf.remote.ui.swtbot.tests.fetch.FetchRemoteTracesTest
  FilterViewerTest.testTimestampFilter:165 » SWT Failed to execute runnable (org...
  FilterViewerTest.testField01:282 » SWT Failed to execute runnable (org.eclipse...
  FilterViewerTest.testTimestampEqualsOr:215 » SWT Failed to execute runnable (o...
  Could not initialize class org.eclipse.tracecompass.tmf.remote.ui.swtbot.tests.fetch.FetchRemoteTracesTest
  FilterViewerTest.testTimestampFilter:165 » SWT Failed to execute runnable (org...
  FilterViewerTest.testField01:282 » SWT Failed to execute runnable (org.eclipse...
  FilterViewerTest.testTimestampEqualsOr:215 » SWT Failed to execute runnable (o...
  Could not initialize class org.eclipse.tracecompass.tmf.remote.ui.swtbot.tests.fetch.FetchRemoteTracesTest
  FilterViewerTest.testTimestampFilter:165 » SWT Failed to execute runnable (org...
  FilterViewerTest.testField01:282 » SWT Failed to execute runnable (org.eclipse...
  FilterViewerTest.testTimestampEqualsOr:215 » SWT Failed to execute runnable (o...
  Could not initialize class org.eclipse.tracecompass.tmf.remote.ui.swtbot.tests.fetch.FetchRemoteTracesTest
  FilterViewerTest.testTimestampFilter:165 » SWT Failed to execute runnable (org...
  FilterViewerTest.testField01:282 » SWT Failed to execute runnable (org.eclipse...
  FilterViewerTest.testTimestampEqualsOr:215 » SWT Failed to execute runnable (o...
  Could not initialize class org.eclipse.tracecompass.tmf.remote.ui.swtbot.tests.fetch.FetchRemoteTracesTest
  FilterViewerTest.testTimestampFilter:165 » SWT Failed to execute runnable (org...
  FilterViewerTest.testField01:282 » SWT Failed to execute runnable (org.eclipse...
  FilterViewerTest.testTimestampEqualsOr:215 » SWT Failed to execute runnable (o...
  Could not initialize class org.eclipse.tracecompass.tmf.remote.ui.swtbot.tests.fetch.FetchRemoteTracesTest
  FilterViewerTest.testTimestampFilter:165 » SWT Failed to execute runnable (org...
  FilterViewerTest.testField01:282 » SWT Failed to execute runnable (org.eclipse...
  FilterViewerTest.testTimestampEqualsOr:215 » SWT Failed to execute runnable (o...
  Could not initialize class org.eclipse.tracecompass.tmf.remote.ui.swtbot.tests.fetch.FetchRemoteTracesTest
  FilterViewerTest.testTimestampFilter:165 » SWT Failed to execute runnable (org...
  FilterViewerTest.testField01:282 » SWT Failed to execute runnable (org.eclipse...
  FilterViewerTest.testTimestampEqualsOr:215 » SWT Failed to execute runnable (o...
  Could not initialize class org.eclipse.tracecompass.tmf.remote.ui.swtbot.tests.fetch.FetchRemoteTracesTest
  FilterViewerTest.testTimestampFilter:165 » SWT Failed to execute runnable (org...
  FilterViewerTest.testField01:282 » SWT Failed to execute runnable (org.eclipse...
  FilterViewerTest.testTimestampEqualsOr:215 » SWT Failed to execute runnable (o...
  Could not initialize class org.eclipse.tracecompass.tmf.remote.ui.swtbot.tests.fetch.FetchRemoteTracesTest
  FilterViewerTest.testTimestampFilter:165 » SWT Failed to execute runnable (org...
  FilterViewerTest.testField01:282 » SWT Failed to execute runnable (org.eclipse...
  FilterViewerTest.testTimestampEqualsOr:215 » SWT Failed to execute runnable (o...
  Could not initialize class org.eclipse.tracecompass.tmf.remote.ui.swtbot.tests.fetch.FetchRemoteTracesTest

Tests run: 1680, Failures: 19, Errors: 77, Skipped: 0

[ERROR] There are test failures.

Please refer to /jobs/genie.tracecompass/tracecompass-swtbot-stress-tests/workspace/releng/org.eclipse.tracecompass.alltests/target/surefire-reports for the individual test results.
[INFO] 
[INFO] --- jacoco-maven-plugin:0.7.4.201502262128:report (post-test) @ org.eclipse.tracecompass.alltests ---
[INFO] Analyzed bundle 'Trace Compass All Tests' with 7 classes
[INFO]                                                                         
[INFO] ------------------------------------------------------------------------
[INFO] Building Trace Compass Testing Feature 1.0.0-SNAPSHOT
[INFO] ------------------------------------------------------------------------
[INFO] 
[INFO] --- maven-clean-plugin:2.6.1:clean (default-clean) @ org.eclipse.tracecompass.testing ---
[INFO] Deleting /jobs/genie.tracecompass/tracecompass-swtbot-stress-tests/workspace/releng/org.eclipse.tracecompass.testing/target
[INFO] 
[INFO] --- tycho-packaging-plugin:0.23.0:build-qualifier-aggregator (default-build-qualifier-aggregator) @ org.eclipse.tracecompass.testing ---
[INFO] The project's OSGi version is 1.0.0.201507120427
[INFO] 
[INFO] --- tycho-packaging-plugin:0.23.0:validate-id (default-validate-id) @ org.eclipse.tracecompass.testing ---
[INFO] 
[INFO] --- tycho-packaging-plugin:0.23.0:validate-version (default-validate-version) @ org.eclipse.tracecompass.testing ---
[INFO] 
[INFO] --- jacoco-maven-plugin:0.7.4.201502262128:prepare-agent (pre-test) @ org.eclipse.tracecompass.testing ---
[INFO] argLine set to -javaagent:/home/hudson/genie.tracecompass/.hudson/jobs/tracecompass-swtbot-stress-tests/workspace/.maven/repo/org/jacoco/org.jacoco.agent/0.7.4.201502262128/org.jacoco.agent-0.7.4.201502262128-runtime.jar=destfile=/jobs/genie.tracecompass/tracecompass-swtbot-stress-tests/workspace/releng/org.eclipse.tracecompass.testing/../../target/jacoco.exec,append=true,includes=org.eclipse.tracecompass.*
[INFO] 
[INFO] --- tycho-source-plugin:0.23.0:plugin-source (plugin-source) @ org.eclipse.tracecompass.testing ---
[INFO] 
[INFO] --- target-platform-configuration:0.23.0:target-platform (default-target-platform) @ org.eclipse.tracecompass.testing ---
[INFO] 
[INFO] --- tycho-packaging-plugin:0.23.0:package-feature (default-package-feature) @ org.eclipse.tracecompass.testing ---
[INFO] Building jar: /jobs/genie.tracecompass/tracecompass-swtbot-stress-tests/workspace/releng/org.eclipse.tracecompass.testing/target/org.eclipse.tracecompass.testing-1.0.0-SNAPSHOT.jar
[INFO] 
[INFO] --- tycho-p2-plugin:0.23.0:p2-metadata-default (default-p2-metadata-default) @ org.eclipse.tracecompass.testing ---
[INFO] 
[INFO] --- tycho-p2-plugin:0.23.0:feature-p2-metadata (default-feature-p2-metadata) @ org.eclipse.tracecompass.testing ---
[INFO] 
[INFO] --- tycho-source-feature-plugin:0.23.0:source-feature (source-feature) @ org.eclipse.tracecompass.testing ---
[INFO] Building jar: /jobs/genie.tracecompass/tracecompass-swtbot-stress-tests/workspace/releng/org.eclipse.tracecompass.testing/target/org.eclipse.tracecompass.testing-1.0.0-SNAPSHOT-sources-feature.jar
[INFO] 
[INFO] --- tycho-pack200b-plugin:0.23.0:pack (pack200-pack) @ org.eclipse.tracecompass.testing ---
[INFO] 
[INFO] --- tycho-p2-plugin:0.23.0:p2-metadata (p2-metadata) @ org.eclipse.tracecompass.testing ---
[INFO] 
[INFO] --- tycho-p2-plugin:0.23.0:p2-metadata (attached-p2-metadata) @ org.eclipse.tracecompass.testing ---
[WARNING] Artifact org.eclipse.tracecompass:org.eclipse.tracecompass.testing:xml:p2metadata:1.0.0-SNAPSHOT already attached to project, ignoring duplicate
[WARNING] Artifact org.eclipse.tracecompass:org.eclipse.tracecompass.testing:xml:p2artifacts:1.0.0-SNAPSHOT already attached to project, ignoring duplicate
[INFO] 
[INFO] --- jacoco-maven-plugin:0.7.4.201502262128:report (post-test) @ org.eclipse.tracecompass.testing ---
[INFO] Skipping JaCoCo execution due to missing classes directory:/jobs/genie.tracecompass/tracecompass-swtbot-stress-tests/workspace/releng/org.eclipse.tracecompass.testing/target/classes
[INFO]                                                                         
[INFO] ------------------------------------------------------------------------
[INFO] Building Trace Compass TMF Remote Feature 1.0.0-SNAPSHOT
[INFO] ------------------------------------------------------------------------
[INFO] 
[INFO] --- maven-clean-plugin:2.6.1:clean (default-clean) @ org.eclipse.tracecompass.tmf.remote ---
[INFO] Deleting /jobs/genie.tracecompass/tracecompass-swtbot-stress-tests/workspace/tmf/org.eclipse.tracecompass.tmf.remote/target
[INFO] 
[INFO] --- tycho-packaging-plugin:0.23.0:build-qualifier-aggregator (default-build-qualifier-aggregator) @ org.eclipse.tracecompass.tmf.remote ---
[INFO] The project's OSGi version is 1.0.0.201507120427
[INFO] 
[INFO] --- tycho-packaging-plugin:0.23.0:validate-id (default-validate-id) @ org.eclipse.tracecompass.tmf.remote ---
[INFO] 
[INFO] --- tycho-packaging-plugin:0.23.0:validate-version (default-validate-version) @ org.eclipse.tracecompass.tmf.remote ---
[INFO] 
[INFO] --- jacoco-maven-plugin:0.7.4.201502262128:prepare-agent (pre-test) @ org.eclipse.tracecompass.tmf.remote ---
[INFO] argLine set to -javaagent:/home/hudson/genie.tracecompass/.hudson/jobs/tracecompass-swtbot-stress-tests/workspace/.maven/repo/org/jacoco/org.jacoco.agent/0.7.4.201502262128/org.jacoco.agent-0.7.4.201502262128-runtime.jar=destfile=/jobs/genie.tracecompass/tracecompass-swtbot-stress-tests/workspace/tmf/org.eclipse.tracecompass.tmf.remote/../../target/jacoco.exec,append=true,includes=org.eclipse.tracecompass.*
[INFO] 
[INFO] --- tycho-source-plugin:0.23.0:plugin-source (plugin-source) @ org.eclipse.tracecompass.tmf.remote ---
[INFO] 
[INFO] --- target-platform-configuration:0.23.0:target-platform (default-target-platform) @ org.eclipse.tracecompass.tmf.remote ---
[INFO] 
[INFO] --- tycho-packaging-plugin:0.23.0:package-feature (default-package-feature) @ org.eclipse.tracecompass.tmf.remote ---
[INFO] Building jar: /jobs/genie.tracecompass/tracecompass-swtbot-stress-tests/workspace/tmf/org.eclipse.tracecompass.tmf.remote/target/org.eclipse.tracecompass.tmf.remote-1.0.0-SNAPSHOT.jar
[INFO] 
[INFO] --- tycho-p2-plugin:0.23.0:p2-metadata-default (default-p2-metadata-default) @ org.eclipse.tracecompass.tmf.remote ---
[INFO] 
[INFO] --- tycho-p2-plugin:0.23.0:feature-p2-metadata (default-feature-p2-metadata) @ org.eclipse.tracecompass.tmf.remote ---
[INFO] 
[INFO] --- tycho-source-feature-plugin:0.23.0:source-feature (source-feature) @ org.eclipse.tracecompass.tmf.remote ---
[INFO] Building jar: /jobs/genie.tracecompass/tracecompass-swtbot-stress-tests/workspace/tmf/org.eclipse.tracecompass.tmf.remote/target/org.eclipse.tracecompass.tmf.remote-1.0.0-SNAPSHOT-sources-feature.jar
[INFO] 
[INFO] --- tycho-pack200b-plugin:0.23.0:pack (pack200-pack) @ org.eclipse.tracecompass.tmf.remote ---
[INFO] 
[INFO] --- tycho-p2-plugin:0.23.0:p2-metadata (p2-metadata) @ org.eclipse.tracecompass.tmf.remote ---
[INFO] 
[INFO] --- tycho-p2-plugin:0.23.0:p2-metadata (attached-p2-metadata) @ org.eclipse.tracecompass.tmf.remote ---
[WARNING] Artifact org.eclipse.tracecompass:org.eclipse.tracecompass.tmf.remote:xml:p2metadata:1.0.0-SNAPSHOT already attached to project, ignoring duplicate
[WARNING] Artifact org.eclipse.tracecompass:org.eclipse.tracecompass.tmf.remote:xml:p2artifacts:1.0.0-SNAPSHOT already attached to project, ignoring duplicate
[INFO] 
[INFO] --- jacoco-maven-plugin:0.7.4.201502262128:report (post-test) @ org.eclipse.tracecompass.tmf.remote ---
[INFO] Skipping JaCoCo execution due to missing classes directory:/jobs/genie.tracecompass/tracecompass-swtbot-stress-tests/workspace/tmf/org.eclipse.tracecompass.tmf.remote/target/classes
[INFO]                                                                         
[INFO] ------------------------------------------------------------------------
[INFO] Building Trace Compass Repository 2.0.0-SNAPSHOT
[INFO] ------------------------------------------------------------------------
[INFO] 
[INFO] --- maven-clean-plugin:2.6.1:clean (default-clean) @ org.eclipse.tracecompass.releng-site ---
[INFO] 
[INFO] --- tycho-packaging-plugin:0.23.0:build-qualifier-aggregator (default-build-qualifier-aggregator) @ org.eclipse.tracecompass.releng-site ---
[INFO] The project's OSGi version is 2.0.0.201507120427
[INFO] 
[INFO] --- maven-clean-plugin:2.6.1:clean (default-clean-1) @ org.eclipse.tracecompass.releng-site ---
[INFO] 
[INFO] --- jacoco-maven-plugin:0.7.4.201502262128:prepare-agent (pre-test) @ org.eclipse.tracecompass.releng-site ---
[INFO] argLine set to -javaagent:/home/hudson/genie.tracecompass/.hudson/jobs/tracecompass-swtbot-stress-tests/workspace/.maven/repo/org/jacoco/org.jacoco.agent/0.7.4.201502262128/org.jacoco.agent-0.7.4.201502262128-runtime.jar=destfile=/jobs/genie.tracecompass/tracecompass-swtbot-stress-tests/workspace/releng/org.eclipse.tracecompass.releng-site/../../target/jacoco.exec,append=true,includes=org.eclipse.tracecompass.*
[INFO] 
[INFO] --- maven-resources-plugin:2.7:resources (default-resources) @ org.eclipse.tracecompass.releng-site ---
[INFO] Using 'UTF-8' encoding to copy filtered resources.
[INFO] skip non existing resourceDirectory /jobs/genie.tracecompass/tracecompass-swtbot-stress-tests/workspace/releng/org.eclipse.tracecompass.releng-site/src/main/resources
[INFO] 
[INFO] --- tycho-source-plugin:0.23.0:plugin-source (plugin-source) @ org.eclipse.tracecompass.releng-site ---
[INFO] 
[INFO] --- target-platform-configuration:0.23.0:target-platform (default-target-platform) @ org.eclipse.tracecompass.releng-site ---
[INFO] 
[INFO] --- tycho-p2-publisher-plugin:0.23.0:publish-products (default-publish-products) @ org.eclipse.tracecompass.releng-site ---
[INFO] 
[INFO] --- tycho-p2-publisher-plugin:0.23.0:publish-categories (default-publish-categories) @ org.eclipse.tracecompass.releng-site ---
[INFO] 
[INFO] --- tycho-p2-publisher-plugin:0.23.0:attach-artifacts (default-attach-artifacts) @ org.eclipse.tracecompass.releng-site ---
[INFO] 
[INFO] --- tycho-p2-repository-plugin:0.23.0:assemble-repository (default-assemble-repository) @ org.eclipse.tracecompass.releng-site ---
[INFO] 
[INFO] --- tycho-p2-repository-plugin:0.23.0:archive-repository (default-archive-repository) @ org.eclipse.tracecompass.releng-site ---
[INFO] Building zip: /jobs/genie.tracecompass/tracecompass-swtbot-stress-tests/workspace/releng/org.eclipse.tracecompass.releng-site/target/org.eclipse.tracecompass.releng-site-2.0.0-SNAPSHOT.zip
[INFO] 
[INFO] --- tycho-source-feature-plugin:0.23.0:source-feature (source-feature) @ org.eclipse.tracecompass.releng-site ---
[INFO] 
[INFO] --- tycho-pack200b-plugin:0.23.0:pack (pack200-pack) @ org.eclipse.tracecompass.releng-site ---
[INFO] 
[INFO] --- tycho-p2-plugin:0.23.0:p2-metadata (p2-metadata) @ org.eclipse.tracecompass.releng-site ---
[INFO] 
[INFO] --- repository-utils:0.22.0:generate-repository-facade (generate-facade) @ org.eclipse.tracecompass.releng-site ---
[INFO] Building zip: /jobs/genie.tracecompass/tracecompass-swtbot-stress-tests/workspace/releng/org.eclipse.tracecompass.releng-site/target/org.eclipse.tracecompass.releng-site-2.0.0-SNAPSHOT.zip
[INFO] 
[INFO] --- jacoco-maven-plugin:0.7.4.201502262128:report (post-test) @ org.eclipse.tracecompass.releng-site ---
[INFO] Skipping JaCoCo execution due to missing classes directory:/jobs/genie.tracecompass/tracecompass-swtbot-stress-tests/workspace/releng/org.eclipse.tracecompass.releng-site/target/classes
[INFO]                                                                         
[INFO] ------------------------------------------------------------------------
[INFO] Building Trace Compass Target Platform 2.0.0
[INFO] ------------------------------------------------------------------------
Downloading: https://repo.eclipse.org/content/groups/releases/org/codehaus/mojo/build-helper-maven-plugin/1.9.1/build-helper-maven-plugin-1.9.1.pom
Downloading: https://repo.eclipse.org/content/repositories/tycho-snapshots/org/codehaus/mojo/build-helper-maven-plugin/1.9.1/build-helper-maven-plugin-1.9.1.pom
Downloading: http://repository.jboss.org/nexus/content/groups/public/org/codehaus/mojo/build-helper-maven-plugin/1.9.1/build-helper-maven-plugin-1.9.1.pom
Downloading: http://repo.maven.apache.org/maven2/org/codehaus/mojo/build-helper-maven-plugin/1.9.1/build-helper-maven-plugin-1.9.1.pom
Downloaded: http://repo.maven.apache.org/maven2/org/codehaus/mojo/build-helper-maven-plugin/1.9.1/build-helper-maven-plugin-1.9.1.pom (7 KB at 26.3 KB/sec)
Downloading: https://repo.eclipse.org/content/groups/releases/org/codehaus/mojo/mojo-parent/33/mojo-parent-33.pom
Downloading: https://repo.eclipse.org/content/repositories/tycho-snapshots/org/codehaus/mojo/mojo-parent/33/mojo-parent-33.pom
Downloading: http://repository.jboss.org/nexus/content/groups/public/org/codehaus/mojo/mojo-parent/33/mojo-parent-33.pom
Downloading: http://repo.maven.apache.org/maven2/org/codehaus/mojo/mojo-parent/33/mojo-parent-33.pom
Downloaded: http://repo.maven.apache.org/maven2/org/codehaus/mojo/mojo-parent/33/mojo-parent-33.pom (26 KB at 185.6 KB/sec)
Downloading: https://repo.eclipse.org/content/groups/releases/org/codehaus/codehaus-parent/4/codehaus-parent-4.pom
Downloading: https://repo.eclipse.org/content/repositories/tycho-snapshots/org/codehaus/codehaus-parent/4/codehaus-parent-4.pom
Downloading: http://repository.jboss.org/nexus/content/groups/public/org/codehaus/codehaus-parent/4/codehaus-parent-4.pom
Downloaded: http://repository.jboss.org/nexus/content/groups/public/org/codehaus/codehaus-parent/4/codehaus-parent-4.pom (5 KB at 14.1 KB/sec)
Downloading: https://repo.eclipse.org/content/groups/releases/org/codehaus/mojo/build-helper-maven-plugin/1.9.1/build-helper-maven-plugin-1.9.1.jar
Downloading: https://repo.eclipse.org/content/repositories/tycho-snapshots/org/codehaus/mojo/build-helper-maven-plugin/1.9.1/build-helper-maven-plugin-1.9.1.jar
Downloading: http://repository.jboss.org/nexus/content/groups/public/org/codehaus/mojo/build-helper-maven-plugin/1.9.1/build-helper-maven-plugin-1.9.1.jar
Downloading: http://repo.maven.apache.org/maven2/org/codehaus/mojo/build-helper-maven-plugin/1.9.1/build-helper-maven-plugin-1.9.1.jar
Downloaded: http://repo.maven.apache.org/maven2/org/codehaus/mojo/build-helper-maven-plugin/1.9.1/build-helper-maven-plugin-1.9.1.jar (47 KB at 285.9 KB/sec)
[INFO] 
[INFO] --- maven-clean-plugin:2.6.1:clean (default-clean) @ org.eclipse.tracecompass.target ---
[INFO] 
[INFO] --- jacoco-maven-plugin:0.7.4.201502262128:prepare-agent (pre-test) @ org.eclipse.tracecompass.target ---
[INFO] argLine set to -javaagent:/home/hudson/genie.tracecompass/.hudson/jobs/tracecompass-swtbot-stress-tests/workspace/.maven/repo/org/jacoco/org.jacoco.agent/0.7.4.201502262128/org.jacoco.agent-0.7.4.201502262128-runtime.jar=destfile=/jobs/genie.tracecompass/tracecompass-swtbot-stress-tests/workspace/releng/org.eclipse.tracecompass.target/../../target/jacoco.exec,append=true,includes=org.eclipse.tracecompass.*
[INFO] 
[INFO] --- tycho-source-plugin:0.23.0:plugin-source (plugin-source) @ org.eclipse.tracecompass.target ---
[INFO] 
[INFO] --- tycho-source-feature-plugin:0.23.0:source-feature (source-feature) @ org.eclipse.tracecompass.target ---
[INFO] 
[INFO] --- tycho-pack200b-plugin:0.23.0:pack (pack200-pack) @ org.eclipse.tracecompass.target ---
[INFO] 
[INFO] --- tycho-p2-plugin:0.23.0:p2-metadata (p2-metadata) @ org.eclipse.tracecompass.target ---
[INFO] 
[INFO] --- build-helper-maven-plugin:1.9.1:attach-artifact (attach-artifacts) @ org.eclipse.tracecompass.target ---
Downloading: https://repo.eclipse.org/content/groups/releases/org/apache/maven/maven-plugin-api/2.0.1/maven-plugin-api-2.0.1.pom
Downloading: https://repo.eclipse.org/content/repositories/tycho-snapshots/org/apache/maven/maven-plugin-api/2.0.1/maven-plugin-api-2.0.1.pom
Downloading: http://repository.jboss.org/nexus/content/groups/public/org/apache/maven/maven-plugin-api/2.0.1/maven-plugin-api-2.0.1.pom
Downloading: http://repo.maven.apache.org/maven2/org/apache/maven/maven-plugin-api/2.0.1/maven-plugin-api-2.0.1.pom
Downloaded: http://repo.maven.apache.org/maven2/org/apache/maven/maven-plugin-api/2.0.1/maven-plugin-api-2.0.1.pom (643 B at 5.8 KB/sec)
Downloading: https://repo.eclipse.org/content/groups/releases/org/apache/maven/maven/2.0.1/maven-2.0.1.pom
Downloading: https://repo.eclipse.org/content/repositories/tycho-snapshots/org/apache/maven/maven/2.0.1/maven-2.0.1.pom
Downloading: http://repository.jboss.org/nexus/content/groups/public/org/apache/maven/maven/2.0.1/maven-2.0.1.pom
Downloading: http://repo.maven.apache.org/maven2/org/apache/maven/maven/2.0.1/maven-2.0.1.pom
Downloaded: http://repo.maven.apache.org/maven2/org/apache/maven/maven/2.0.1/maven-2.0.1.pom (12 KB at 94.4 KB/sec)
Downloading: https://repo.eclipse.org/content/groups/releases/org/beanshell/bsh/2.0b4/bsh-2.0b4.pom
Downloading: https://repo.eclipse.org/content/repositories/tycho-snapshots/org/beanshell/bsh/2.0b4/bsh-2.0b4.pom
Downloading: http://repository.jboss.org/nexus/content/groups/public/org/beanshell/bsh/2.0b4/bsh-2.0b4.pom
Downloading: http://repo.maven.apache.org/maven2/org/beanshell/bsh/2.0b4/bsh-2.0b4.pom
Downloaded: http://repo.maven.apache.org/maven2/org/beanshell/bsh/2.0b4/bsh-2.0b4.pom (2 KB at 10.7 KB/sec)
Downloading: https://repo.eclipse.org/content/groups/releases/org/beanshell/beanshell/2.0b4/beanshell-2.0b4.pom
Downloading: https://repo.eclipse.org/content/repositories/tycho-snapshots/org/beanshell/beanshell/2.0b4/beanshell-2.0b4.pom
Downloading: http://repository.jboss.org/nexus/content/groups/public/org/beanshell/beanshell/2.0b4/beanshell-2.0b4.pom
Downloading: http://repo.maven.apache.org/maven2/org/beanshell/beanshell/2.0b4/beanshell-2.0b4.pom
Downloaded: http://repo.maven.apache.org/maven2/org/beanshell/beanshell/2.0b4/beanshell-2.0b4.pom (2 KB at 11.9 KB/sec)
Downloading: https://repo.eclipse.org/content/groups/releases/org/codehaus/plexus/plexus-utils/1.5.8/plexus-utils-1.5.8.jar
Downloading: https://repo.eclipse.org/content/groups/releases/org/beanshell/bsh/2.0b4/bsh-2.0b4.jar
Downloading: https://repo.eclipse.org/content/repositories/tycho-snapshots/org/codehaus/plexus/plexus-utils/1.5.8/plexus-utils-1.5.8.jar
Downloading: https://repo.eclipse.org/content/repositories/tycho-snapshots/org/beanshell/bsh/2.0b4/bsh-2.0b4.jar
Downloading: http://repository.jboss.org/nexus/content/groups/public/org/codehaus/plexus/plexus-utils/1.5.8/plexus-utils-1.5.8.jar
Downloading: http://repository.jboss.org/nexus/content/groups/public/org/beanshell/bsh/2.0b4/bsh-2.0b4.jar
Downloaded: http://repository.jboss.org/nexus/content/groups/public/org/codehaus/plexus/plexus-utils/1.5.8/plexus-utils-1.5.8.jar (262 KB at 296.9 KB/sec)
Downloading: http://repo.maven.apache.org/maven2/org/beanshell/bsh/2.0b4/bsh-2.0b4.jar
Downloaded: http://repo.maven.apache.org/maven2/org/beanshell/bsh/2.0b4/bsh-2.0b4.jar (276 KB at 917.0 KB/sec)
[INFO] 
[INFO] --- jacoco-maven-plugin:0.7.4.201502262128:report (post-test) @ org.eclipse.tracecompass.target ---
[INFO] Skipping JaCoCo execution due to missing classes directory:/jobs/genie.tracecompass/tracecompass-swtbot-stress-tests/workspace/releng/org.eclipse.tracecompass.target/target/classes
[INFO]                                                                         
[INFO] ------------------------------------------------------------------------
[INFO] Building Trace Compass Segment Store DB Core Plug-in 1.0.0-SNAPSHOT
[INFO] ------------------------------------------------------------------------
[INFO] 
[INFO] --- maven-clean-plugin:2.6.1:clean (default-clean) @ org.eclipse.tracecompass.segmentstore.core ---
[INFO] 
[INFO] --- tycho-packaging-plugin:0.23.0:build-qualifier (default-build-qualifier) @ org.eclipse.tracecompass.segmentstore.core ---
[INFO] The project's OSGi version is 1.0.0.201507120427
[INFO] 
[INFO] --- tycho-packaging-plugin:0.23.0:validate-id (default-validate-id) @ org.eclipse.tracecompass.segmentstore.core ---
[INFO] 
[INFO] --- tycho-packaging-plugin:0.23.0:validate-version (default-validate-version) @ org.eclipse.tracecompass.segmentstore.core ---
[INFO] 
[INFO] --- jacoco-maven-plugin:0.7.4.201502262128:prepare-agent (pre-test) @ org.eclipse.tracecompass.segmentstore.core ---
[INFO] argLine set to -javaagent:/home/hudson/genie.tracecompass/.hudson/jobs/tracecompass-swtbot-stress-tests/workspace/.maven/repo/org/jacoco/org.jacoco.agent/0.7.4.201502262128/org.jacoco.agent-0.7.4.201502262128-runtime.jar=destfile=/jobs/genie.tracecompass/tracecompass-swtbot-stress-tests/workspace/statesystem/org.eclipse.tracecompass.segmentstore.core/../../target/jacoco.exec,append=true,includes=org.eclipse.tracecompass.*
[INFO] 
[INFO] --- maven-resources-plugin:2.7:resources (default-resources) @ org.eclipse.tracecompass.segmentstore.core ---
[INFO] Using 'UTF-8' encoding to copy filtered resources.
[INFO] skip non existing resourceDirectory /jobs/genie.tracecompass/tracecompass-swtbot-stress-tests/workspace/statesystem/org.eclipse.tracecompass.segmentstore.core/src/main/resources
[INFO] 
[INFO] --- tycho-compiler-plugin:0.23.0:compile (default-compile) @ org.eclipse.tracecompass.segmentstore.core ---
[INFO] Compiling 7 source files to /jobs/genie.tracecompass/tracecompass-swtbot-stress-tests/workspace/statesystem/org.eclipse.tracecompass.segmentstore.core/target/classes
[INFO] 
[INFO] --- maven-resources-plugin:2.7:testResources (default-testResources) @ org.eclipse.tracecompass.segmentstore.core ---
[INFO] Using 'UTF-8' encoding to copy filtered resources.
[INFO] skip non existing resourceDirectory /jobs/genie.tracecompass/tracecompass-swtbot-stress-tests/workspace/statesystem/org.eclipse.tracecompass.segmentstore.core/src/test/resources
[INFO] 
[INFO] --- tycho-source-plugin:0.23.0:plugin-source (plugin-source) @ org.eclipse.tracecompass.segmentstore.core ---
[INFO] Building jar: /jobs/genie.tracecompass/tracecompass-swtbot-stress-tests/workspace/statesystem/org.eclipse.tracecompass.segmentstore.core/target/org.eclipse.tracecompass.segmentstore.core-1.0.0-SNAPSHOT-sources.jar
[INFO] 
[INFO] --- target-platform-configuration:0.23.0:target-platform (default-target-platform) @ org.eclipse.tracecompass.segmentstore.core ---
[INFO] 
[INFO] --- tycho-packaging-plugin:0.23.0:package-plugin (default-package-plugin) @ org.eclipse.tracecompass.segmentstore.core ---
[INFO] Building jar: /jobs/genie.tracecompass/tracecompass-swtbot-stress-tests/workspace/statesystem/org.eclipse.tracecompass.segmentstore.core/target/org.eclipse.tracecompass.segmentstore.core-1.0.0-SNAPSHOT.jar
[INFO] 
[INFO] --- tycho-p2-plugin:0.23.0:p2-metadata-default (default-p2-metadata-default) @ org.eclipse.tracecompass.segmentstore.core ---
[INFO] 
[INFO] --- tycho-source-feature-plugin:0.23.0:source-feature (source-feature) @ org.eclipse.tracecompass.segmentstore.core ---
[INFO] 
[INFO] --- tycho-pack200b-plugin:0.23.0:pack (pack200-pack) @ org.eclipse.tracecompass.segmentstore.core ---
[INFO] Pack200 packing jar /jobs/genie.tracecompass/tracecompass-swtbot-stress-tests/workspace/statesystem/org.eclipse.tracecompass.segmentstore.core/target/org.eclipse.tracecompass.segmentstore.core-1.0.0-SNAPSHOT.jar
[INFO] 
[INFO] --- tycho-p2-plugin:0.23.0:p2-metadata (p2-metadata) @ org.eclipse.tracecompass.segmentstore.core ---
[INFO] 
[INFO] --- jacoco-maven-plugin:0.7.4.201502262128:report (post-test) @ org.eclipse.tracecompass.segmentstore.core ---
[INFO] Analyzed bundle 'Trace Compass Segment Store DB Core Plug-in' with 5 classes
[INFO]                                                                         
[INFO] ------------------------------------------------------------------------
[INFO] Building Trace Compass Segment Store DB Core Tests Plug-in 1.0.0-SNAPSHOT
[INFO] ------------------------------------------------------------------------
[INFO] 
[INFO] --- maven-clean-plugin:2.6.1:clean (default-clean) @ org.eclipse.tracecompass.segmentstore.core.tests ---
[INFO] 
[INFO] --- tycho-packaging-plugin:0.23.0:build-qualifier (default-build-qualifier) @ org.eclipse.tracecompass.segmentstore.core.tests ---
[INFO] The project's OSGi version is 1.0.0.201507120427
[INFO] 
[INFO] --- tycho-packaging-plugin:0.23.0:validate-id (default-validate-id) @ org.eclipse.tracecompass.segmentstore.core.tests ---
[INFO] 
[INFO] --- tycho-packaging-plugin:0.23.0:validate-version (default-validate-version) @ org.eclipse.tracecompass.segmentstore.core.tests ---
[INFO] 
[INFO] --- jacoco-maven-plugin:0.7.4.201502262128:prepare-agent (pre-test) @ org.eclipse.tracecompass.segmentstore.core.tests ---
[INFO] tycho.testArgLine set to -javaagent:/home/hudson/genie.tracecompass/.hudson/jobs/tracecompass-swtbot-stress-tests/workspace/.maven/repo/org/jacoco/org.jacoco.agent/0.7.4.201502262128/org.jacoco.agent-0.7.4.201502262128-runtime.jar=destfile=/jobs/genie.tracecompass/tracecompass-swtbot-stress-tests/workspace/statesystem/org.eclipse.tracecompass.segmentstore.core.tests/../../target/jacoco.exec,append=true,includes=org.eclipse.tracecompass.*
[INFO] 
[INFO] --- maven-resources-plugin:2.7:resources (default-resources) @ org.eclipse.tracecompass.segmentstore.core.tests ---
[INFO] Using 'UTF-8' encoding to copy filtered resources.
[INFO] skip non existing resourceDirectory /jobs/genie.tracecompass/tracecompass-swtbot-stress-tests/workspace/statesystem/org.eclipse.tracecompass.segmentstore.core.tests/src/main/resources
[INFO] 
[INFO] --- tycho-compiler-plugin:0.23.0:compile (default-compile) @ org.eclipse.tracecompass.segmentstore.core.tests ---
[INFO] Compiling 1 source file to /jobs/genie.tracecompass/tracecompass-swtbot-stress-tests/workspace/statesystem/org.eclipse.tracecompass.segmentstore.core.tests/target/classes
[INFO] 
[INFO] --- maven-resources-plugin:2.7:testResources (default-testResources) @ org.eclipse.tracecompass.segmentstore.core.tests ---
[INFO] Using 'UTF-8' encoding to copy filtered resources.
[INFO] skip non existing resourceDirectory /jobs/genie.tracecompass/tracecompass-swtbot-stress-tests/workspace/statesystem/org.eclipse.tracecompass.segmentstore.core.tests/src/test/resources
[INFO] 
[INFO] --- tycho-source-plugin:0.23.0:plugin-source (plugin-source) @ org.eclipse.tracecompass.segmentstore.core.tests ---
[INFO] Building jar: /jobs/genie.tracecompass/tracecompass-swtbot-stress-tests/workspace/statesystem/org.eclipse.tracecompass.segmentstore.core.tests/target/org.eclipse.tracecompass.segmentstore.core.tests-1.0.0-SNAPSHOT-sources.jar
[INFO] 
[INFO] --- target-platform-configuration:0.23.0:target-platform (default-target-platform) @ org.eclipse.tracecompass.segmentstore.core.tests ---
[INFO] 
[INFO] --- tycho-packaging-plugin:0.23.0:package-plugin (default-package-plugin) @ org.eclipse.tracecompass.segmentstore.core.tests ---
[INFO] Building jar: /jobs/genie.tracecompass/tracecompass-swtbot-stress-tests/workspace/statesystem/org.eclipse.tracecompass.segmentstore.core.tests/target/org.eclipse.tracecompass.segmentstore.core.tests-1.0.0-SNAPSHOT.jar
[INFO] 
[INFO] --- tycho-p2-plugin:0.23.0:p2-metadata-default (default-p2-metadata-default) @ org.eclipse.tracecompass.segmentstore.core.tests ---
[INFO] 
[INFO] --- tycho-source-feature-plugin:0.23.0:source-feature (source-feature) @ org.eclipse.tracecompass.segmentstore.core.tests ---
[INFO] 
[INFO] --- tycho-pack200b-plugin:0.23.0:pack (pack200-pack) @ org.eclipse.tracecompass.segmentstore.core.tests ---
[INFO] Pack200 packing jar /jobs/genie.tracecompass/tracecompass-swtbot-stress-tests/workspace/statesystem/org.eclipse.tracecompass.segmentstore.core.tests/target/org.eclipse.tracecompass.segmentstore.core.tests-1.0.0-SNAPSHOT.jar
[INFO] 
[INFO] --- tycho-p2-plugin:0.23.0:p2-metadata (p2-metadata) @ org.eclipse.tracecompass.segmentstore.core.tests ---
[INFO] 
[INFO] --- tycho-surefire-plugin:0.23.0:test (default-test) @ org.eclipse.tracecompass.segmentstore.core.tests ---
[INFO] Skipping tests
[INFO] 
[INFO] --- jacoco-maven-plugin:0.7.4.201502262128:report (post-test) @ org.eclipse.tracecompass.segmentstore.core.tests ---
[INFO] Analyzed bundle 'Trace Compass Segment Store DB Core Tests Plug-in' with 1 classes
[INFO] ------------------------------------------------------------------------
[INFO] Reactor Summary:
[INFO] 
[INFO] Trace Compass Parent .............................. SUCCESS [1:28.136s]
[INFO] race Compass Common Utilities Parent .............. SUCCESS [0.056s]
[INFO] Trace Compass Common Utilities Core Plug-in ....... SUCCESS [37.118s]
[INFO] Trace Compass State System Parent ................. SUCCESS [0.057s]
[INFO] Trace Compass State System Core Plug-in ........... SUCCESS [1.620s]
[INFO] Trace Compass TMF Parent .......................... SUCCESS [0.056s]
[INFO] Trace Compass TMF Core Plug-in .................... SUCCESS [4.997s]
[INFO] Trace Compass Tracetype-agnostic Analyses Parent .. SUCCESS [0.055s]
[INFO] Trace Compass Linux Kernel Analysis Core Plug-in .. SUCCESS [0.878s]
[INFO] Trace Compass CTF Support Parent .................. SUCCESS [0.054s]
[INFO] Trace Compass CTF Parser Plug-in .................. SUCCESS [9.206s]
[INFO] Trace Compass CTF Core Plug-in .................... SUCCESS [1.364s]
[INFO] CTF support for TMF Core Plug-in .................. SUCCESS [0.757s]
[INFO] Trace Compass CTF Core Tests Plug-in .............. SUCCESS [48.614s]
[INFO] Trace Compass TMF Core Tests Plug-in .............. SUCCESS [3:59.856s]
[INFO] CTF Support for TMF Core Tests Plug-in ............ SUCCESS [2:57.942s]
[INFO] Trace Compass Linux Kernel Analysis Core Tests Plug-in  SUCCESS [58.150s]
[INFO] Trace Compass TMF UI Plug-in ...................... SUCCESS [7.376s]
[INFO] Trace Compass Linux Kernel Analysis UI Plug-in .... SUCCESS [0.706s]
[INFO] Trace Compass BTF Support Parent .................. SUCCESS [0.055s]
[INFO] Best Trace Format Plug-in ......................... SUCCESS [0.381s]
[INFO] Trace Compass Documentation ....................... SUCCESS [0.060s]
[INFO] Trace Compass Developer Guide ..................... SUCCESS [19.305s]
[INFO] Trace Compass TMF Xml Analysis Core Plug-in ....... SUCCESS [0.554s]
[INFO] Trace Compass TMF Xml Analysis Ui Plug-in ......... SUCCESS [0.596s]
[INFO] Trace Compass TMF (Tracing and Monitoring Framework) Feature  SUCCESS [0.326s]
[INFO] Best Trace Format UI Plug-in ...................... SUCCESS [0.408s]
[INFO] Trace Compass BTF (Best Trace Format) Feature ..... SUCCESS [0.214s]
[INFO] Best Trace Format Tests Plug-in ................... SUCCESS [10.173s]
[INFO] Trace Compass Common Utilities Core Tests Plug-in . SUCCESS [9.313s]
[INFO] Trace Compass CTF (Common Trace Format) Feature ... SUCCESS [0.131s]
[INFO] Trace Compass CTF Parser Tests Plug-in ............ SUCCESS [9.185s]
[INFO] CTF support for TMF Feature ....................... SUCCESS [0.197s]
[INFO] Trace Compass TMF UI SWTBot Tests Plug-in ......... SUCCESS [3:00.023s]
[INFO] CTF Support for TMF SWTBot Tests Plug-in .......... SUCCESS [15:07.850s]
[INFO] Trace Compass User Guide .......................... SUCCESS [8.626s]
[INFO] Trace Compass GDB Tracepoint Analysis User Guide .. SUCCESS [7.512s]
[INFO] Trace Compass RCP User Guide ...................... SUCCESS [5.624s]
[INFO] Trace Compass Pcap User Guide ..................... SUCCESS [5.604s]
[INFO] Trace Compass Examples Plug-in .................... SUCCESS [0.406s]
[INFO] Trace Compass GDB Tracepoint Analysis Parent ...... SUCCESS [0.055s]
[INFO] Trace Compass GDB Tracepoint Analysis Core Plug-in  SUCCESS [0.552s]
[INFO] Trace Compass GDB Tracepoint Analysis UI Plug-in .. SUCCESS [0.479s]
[INFO] Trace Compass GDB Tracepoint Analysis Feature ..... SUCCESS [0.185s]
[INFO] Trace Compass GDB Tracepoint Analysis Core Tests Plug-in  SUCCESS [9.639s]
[INFO] Trace Compass GDB Tracepoint Analysis UI Tests Plug-in  SUCCESS [11.569s]
[INFO] Trace Compass LTTng Support Parent ................ SUCCESS [0.049s]
[INFO] Trace Compass LTTng Control Core Plug-in .......... SUCCESS [0.546s]
[INFO] Trace Compass TMF Remote Core Plug-in ............. SUCCESS [0.460s]
[INFO] Trace Compass TMF Remote UI Plug-in ............... SUCCESS [0.659s]
[INFO] Trace Compass LTTng Control UI Plug-in ............ SUCCESS [1.368s]
[INFO] Trace Compass LTTng (Linux Tracing Toolkit) Feature  SUCCESS [0.187s]
[INFO] Trace Compass LTTng Control Core Tests Plug-in .... SUCCESS [10.041s]
[INFO] Trace Compass TMF Remote Core Tests Plug-in ....... SUCCESS [8.952s]
[INFO] Trace Compass LTTng Control UI Tests Plug-in ...... SUCCESS [55.920s]
[INFO] Trace Compass LTTng Kernel Analysis Core Plug-in .. SUCCESS [0.443s]
[INFO] Trace Compass LTTng Kernel Analysis UI Plug-in .... SUCCESS [0.454s]
[INFO] Trace Compass LTTng Kernel Analysis Feature ....... SUCCESS [0.164s]
[INFO] Trace Compass LTTng Kernel Analysis Core Tests Plug-in  SUCCESS [1:09.096s]
[INFO] Trace Compass LTTng Kernel UI SWTBot Tests Plug-in  SUCCESS [1:45.532s]
[INFO] Trace Compass LTTng Userspace Tracer Analysis Core Plug-in  SUCCESS [0.322s]
[INFO] Trace Compass LTTng Userspace Tracer Analysis UI Plug-in  SUCCESS [0.479s]
[INFO] Trace Compass LTTng Userspace Tracer Analysis Feature  SUCCESS [0.161s]
[INFO] Trace Compass LTTng Userspace Tracer Analysis Core Test Plug-in  SUCCESS [33.651s]
[INFO] Trace Compass LTTng Userspace Tracer Analysis UI Tests Plug-in  SUCCESS [21.664s]
[INFO] Trace Compass Pcap Format Support Parent .......... SUCCESS [0.051s]
[INFO] Trace Compass Pcap Parser Core Plug-in ............ SUCCESS [0.517s]
[INFO] Trace Compass Pcap Parser Core Tests Plug-in ...... SUCCESS [14.827s]
[INFO] Pcap support for TMF Core Plug-in ................. SUCCESS [0.391s]
[INFO] Pcap support for TMF UI Plug-in ................... SUCCESS [0.432s]
[INFO] Trace Compass Pcap Analysis Feature ............... SUCCESS [0.142s]
[INFO] Pcap Support for TMF Core Tests Plug-in ........... SUCCESS [12.081s]
[INFO] Pcap Support for TMF SWTBot Tests Plug-in ......... SUCCESS [37.910s]
[INFO] Trace Compass RCP Parent .......................... SUCCESS [0.051s]
[INFO] Trace Compass RCP Branding plug-in ................ SUCCESS [0.229s]
[INFO] Trace Compass RCP Branding Feature ................ SUCCESS [0.111s]
[INFO] Trace Compass RCP UI Plug-in ...................... SUCCESS [0.537s]
[INFO] Trace Compass RCP Feature ......................... SUCCESS [0.460s]
[INFO] Trace Compass RCP Product ......................... SUCCESS [57.070s]
[INFO] Trace Compass State System Core Tests Plug-in ..... SUCCESS [12.798s]
[INFO] Trace Compass TMF UI Tests Plug-in ................ SUCCESS [2:45.169s]
[INFO] Trace Compass TMF Xml Analysis Core Tests Plug-in . SUCCESS [22.752s]
[INFO] Trace Compass TMF Xml Analysis UI Tests Plug-in ... SUCCESS [15.793s]
[INFO] Trace Compass TMF Remote UI Tests Plug-in ......... SUCCESS [17.399s]
[INFO] Trace Compass TMF Remote UI SWTBot Tests Plug-in .. SUCCESS [56.388s]
[INFO] Trace Compass Release Engineering Parent .......... SUCCESS [0.055s]
[INFO] Trace Compass All Tests ........................... SUCCESS [3:20:56.932s]
[INFO] Trace Compass Testing Feature ..................... SUCCESS [0.205s]
[INFO] Trace Compass TMF Remote Feature .................. SUCCESS [0.133s]
[INFO] Trace Compass Repository .......................... SUCCESS [5.769s]
[INFO] Trace Compass Target Platform ..................... SUCCESS [4.785s]
[INFO] Trace Compass Segment Store DB Core Plug-in ....... SUCCESS [0.319s]
[INFO] Trace Compass Segment Store DB Core Tests Plug-in . SUCCESS [0.331s]
[INFO] ------------------------------------------------------------------------
[INFO] BUILD SUCCESS
[INFO] ------------------------------------------------------------------------
[INFO] Total time: 4:10:42.103s
[INFO] Finished at: Sun Jul 12 04:30:25 EDT 2015
[INFO] Final Memory: 159M/1447M
[INFO] ------------------------------------------------------------------------
[DEBUG] Closing connection to remote
[DEBUG] Waiting for process to finish
[DEBUG] Result: 0
Terminating xvnc.
Recording test results
Finished: UNSTABLE