FailedConsole Output

Skipping 882 KB.. Full Log
S9DRQGQjko+pfwHAD+/lceBAAAADownloaded: https://repo.maven.apache.org/maven2/org/codehaus/plexus/plexus-utils/3.0.24/plexus-utils-3.0.24.pom (5 KB at 155.0 KB/sec)
Downloading: https://repo.eclipse.org/content/groups/releases/org/codehaus/plexus/plexus/4.0/plexus-4.0.pom
Downloading: https://repo.eclipse.org/content/repositories/tycho-snapshots/org/codehaus/plexus/plexus/4.0/plexus-4.0.pom
Downloading: http://repository.jboss.org/nexus/content/groups/public/org/codehaus/plexus/plexus/4.0/plexus-4.0.pom
Downloading: https://repo.eclipse.org/content/repositories/rcptt-snapshots/org/codehaus/plexus/plexus/4.0/plexus-4.0.pom
Downloading: https://repo.eclipse.org/content/repositories/rcptt-releases/org/codehaus/plexus/plexus/4.0/plexus-4.0.pom
Downloading: https://repo.maven.apache.org/maven2/org/codehaus/plexus/plexus/4.0/plexus-4.0.pom
Downloaded: https://repo.maven.apache.org/maven2/org/codehaus/plexus/plexus/4.0/plexus-4.0.pom (21 KB at 617.5 KB/sec)
Downloading: https://repo.eclipse.org/content/groups/releases/org/apache/maven/shared/maven-filtering/3.1.1/maven-filtering-3.1.1.pom
Downloading: https://repo.eclipse.org/content/repositories/tycho-snapshots/org/apache/maven/shared/maven-filtering/3.1.1/maven-filtering-3.1.1.pom
Downloading: http://repository.jboss.org/nexus/content/groups/public/org/apache/maven/shared/maven-filtering/3.1.1/maven-filtering-3.1.1.pom
Downloading: https://repo.eclipse.org/content/repositories/rcptt-snapshots/org/apache/maven/shared/maven-filtering/3.1.1/maven-filtering-3.1.1.pom
Downloading: https://repo.eclipse.org/content/repositories/rcptt-releases/org/apache/maven/shared/maven-filtering/3.1.1/maven-filtering-3.1.1.pom
Downloading: https://repo.maven.apache.org/maven2/org/apache/maven/shared/maven-filtering/3.1.1/maven-filtering-3.1.1.pom
Downloaded: https://repo.maven.apache.org/maven2/org/apache/maven/shared/maven-filtering/3.1.1/maven-filtering-3.1.1.pom (6 KB at 205.5 KB/sec)
Downloading: https://repo.eclipse.org/content/groups/releases/org/apache/maven/shared/maven-shared-components/30/maven-shared-components-30.pom
Downloading: https://repo.eclipse.org/content/repositories/tycho-snapshots/org/apache/maven/shared/maven-shared-components/30/maven-shared-components-30.pom
Downloading: http://repository.jboss.org/nexus/content/groups/public/org/apache/maven/shared/maven-shared-components/30/maven-shared-components-30.pom
Downloading: https://repo.eclipse.org/content/repositories/rcptt-snapshots/org/apache/maven/shared/maven-shared-components/30/maven-shared-components-30.pom
Downloading: https://repo.eclipse.org/content/repositories/rcptt-releases/org/apache/maven/shared/maven-shared-components/30/maven-shared-components-30.pom
Downloading: https://repo.maven.apache.org/maven2/org/apache/maven/shared/maven-shared-components/30/maven-shared-components-30.pom
Downloaded: https://repo.maven.apache.org/maven2/org/apache/maven/shared/maven-shared-components/30/maven-shared-components-30.pom (5 KB at 165.8 KB/sec)
Downloading: https://repo.eclipse.org/content/groups/releases/org/codehaus/plexus/plexus-interpolation/1.22/plexus-interpolation-1.22.pom
Downloading: https://repo.eclipse.org/content/repositories/tycho-snapshots/org/codehaus/plexus/plexus-interpolation/1.22/plexus-interpolation-1.22.pom
Downloading: http://repository.jboss.org/nexus/content/groups/public/org/codehaus/plexus/plexus-interpolation/1.22/plexus-interpolation-1.22.pom
Downloading: https://repo.eclipse.org/content/repositories/rcptt-snapshots/org/codehaus/plexus/plexus-interpolation/1.22/plexus-interpolation-1.22.pom
Downloading: https://repo.eclipse.org/content/repositories/rcptt-releases/org/codehaus/plexus/plexus-interpolation/1.22/plexus-interpolation-1.22.pom
Downloading: https://repo.maven.apache.org/maven2/org/codehaus/plexus/plexus-interpolation/1.22/plexus-interpolation-1.22.pom
Downloaded: https://repo.maven.apache.org/maven2/org/codehaus/plexus/plexus-interpolation/1.22/plexus-interpolation-1.22.pom (2 KB at 55.7 KB/sec)
Downloading: https://repo.eclipse.org/content/groups/releases/org/sonatype/plexus/plexus-build-api/0.0.7/plexus-build-api-0.0.7.pom
Downloading: https://repo.eclipse.org/content/repositories/tycho-snapshots/org/sonatype/plexus/plexus-build-api/0.0.7/plexus-build-api-0.0.7.pom
Downloading: http://repository.jboss.org/nexus/content/groups/public/org/sonatype/plexus/plexus-build-api/0.0.7/plexus-build-api-0.0.7.pom
Downloading: https://repo.eclipse.org/content/repositories/rcptt-snapshots/org/sonatype/plexus/plexus-build-api/0.0.7/plexus-build-api-0.0.7.pom
Downloading: https://repo.eclipse.org/content/repositories/rcptt-releases/org/sonatype/plexus/plexus-build-api/0.0.7/plexus-build-api-0.0.7.pom
Downloading: https://repo.maven.apache.org/maven2/org/sonatype/plexus/plexus-build-api/0.0.7/plexus-build-api-0.0.7.pom
Downloaded: https://repo.maven.apache.org/maven2/org/sonatype/plexus/plexus-build-api/0.0.7/plexus-build-api-0.0.7.pom (4 KB at 120.3 KB/sec)
Downloading: https://repo.eclipse.org/content/groups/releases/commons-io/commons-io/2.5/commons-io-2.5.pom
Downloading: https://repo.eclipse.org/content/repositories/tycho-snapshots/commons-io/commons-io/2.5/commons-io-2.5.pom
Downloading: http://repository.jboss.org/nexus/content/groups/public/commons-io/commons-io/2.5/commons-io-2.5.pom
Downloading: https://repo.eclipse.org/content/repositories/rcptt-snapshots/commons-io/commons-io/2.5/commons-io-2.5.pom
Downloading: https://repo.eclipse.org/content/repositories/rcptt-releases/commons-io/commons-io/2.5/commons-io-2.5.pom
Downloading: https://repo.maven.apache.org/maven2/commons-io/commons-io/2.5/commons-io-2.5.pom
Downloaded: https://repo.maven.apache.org/maven2/commons-io/commons-io/2.5/commons-io-2.5.pom (13 KB at 480.7 KB/sec)
Downloading: https://repo.eclipse.org/content/groups/releases/org/apache/commons/commons-parent/39/commons-parent-39.pom
Downloading: https://repo.eclipse.org/content/repositories/tycho-snapshots/org/apache/commons/commons-parent/39/commons-parent-39.pom
Downloading: http://repository.jboss.org/nexus/content/groups/public/org/apache/commons/commons-parent/39/commons-parent-39.pom
Downloading: https://repo.eclipse.org/content/repositories/rcptt-snapshots/org/apache/commons/commons-parent/39/commons-parent-39.pom
Downloading: https://repo.eclipse.org/content/repositories/rcptt-releases/org/apache/commons/commons-parent/39/commons-parent-39.pom
Downloading: https://repo.maven.apache.org/maven2/org/apache/commons/commons-parent/39/commons-parent-39.pom
Downloaded: https://repo.maven.apache.org/maven2/org/apache/commons/commons-parent/39/commons-parent-39.pom (61 KB at 1834.0 KB/sec)
Downloading: https://repo.eclipse.org/content/groups/releases/org/codehaus/plexus/plexus-interpolation/1.24/plexus-interpolation-1.24.pom
Downloading: https://repo.eclipse.org/content/repositories/tycho-snapshots/org/codehaus/plexus/plexus-interpolation/1.24/plexus-interpolation-1.24.pom
Downloading: http://repository.jboss.org/nexus/content/groups/public/org/codehaus/plexus/plexus-interpolation/1.24/plexus-interpolation-1.24.pom
Downloading: https://repo.eclipse.org/content/repositories/rcptt-snapshots/org/codehaus/plexus/plexus-interpolation/1.24/plexus-interpolation-1.24.pom
Downloading: https://repo.eclipse.org/content/repositories/rcptt-releases/org/codehaus/plexus/plexus-interpolation/1.24/plexus-interpolation-1.24.pom
Downloading: https://repo.maven.apache.org/maven2/org/codehaus/plexus/plexus-interpolation/1.24/plexus-interpolation-1.24.pom
Downloaded: https://repo.maven.apache.org/maven2/org/codehaus/plexus/plexus-interpolation/1.24/plexus-interpolation-1.24.pom (3 KB at 75.3 KB/sec)
Downloading: https://repo.eclipse.org/content/groups/releases/org/codehaus/plexus/plexus-component-annotations/1.6/plexus-component-annotations-1.6.jar
Downloading: https://repo.eclipse.org/content/groups/releases/org/codehaus/plexus/plexus-utils/3.0.24/plexus-utils-3.0.24.jar
Downloading: https://repo.eclipse.org/content/groups/releases/org/apache/maven/shared/maven-filtering/3.1.1/maven-filtering-3.1.1.jar
Downloading: https://repo.eclipse.org/content/groups/releases/org/sonatype/plexus/plexus-build-api/0.0.7/plexus-build-api-0.0.7.jar
Downloading: https://repo.eclipse.org/content/groups/releases/commons-io/commons-io/2.5/commons-io-2.5.jar
Downloading: https://repo.eclipse.org/content/groups/releases/org/codehaus/plexus/plexus-interpolation/1.24/plexus-interpolation-1.24.jar
Downloading: https://repo.eclipse.org/content/repositories/tycho-snapshots/org/codehaus/plexus/plexus-component-annotations/1.6/plexus-component-annotations-1.6.jar
Downloading: https://repo.eclipse.org/content/repositories/tycho-snapshots/org/codehaus/plexus/plexus-utils/3.0.24/plexus-utils-3.0.24.jar
Downloading: https://repo.eclipse.org/content/repositories/tycho-snapshots/org/apache/maven/shared/maven-filtering/3.1.1/maven-filtering-3.1.1.jar
Downloading: https://repo.eclipse.org/content/repositories/tycho-snapshots/org/sonatype/plexus/plexus-build-api/0.0.7/plexus-build-api-0.0.7.jar
Downloading: https://repo.eclipse.org/content/repositories/tycho-snapshots/commons-io/commons-io/2.5/commons-io-2.5.jar
Downloading: https://repo.eclipse.org/content/repositories/tycho-snapshots/org/codehaus/plexus/plexus-interpolation/1.24/plexus-interpolation-1.24.jar
Downloading: http://repository.jboss.org/nexus/content/groups/public/org/codehaus/plexus/plexus-component-annotations/1.6/plexus-component-annotations-1.6.jar
Downloading: http://repository.jboss.org/nexus/content/groups/public/org/codehaus/plexus/plexus-utils/3.0.24/plexus-utils-3.0.24.jar
Downloading: http://repository.jboss.org/nexus/content/groups/public/org/apache/maven/shared/maven-filtering/3.1.1/maven-filtering-3.1.1.jar
Downloading: http://repository.jboss.org/nexus/content/groups/public/org/sonatype/plexus/plexus-build-api/0.0.7/plexus-build-api-0.0.7.jar
Downloading: http://repository.jboss.org/nexus/content/groups/public/commons-io/commons-io/2.5/commons-io-2.5.jar
Downloading: http://repository.jboss.org/nexus/content/groups/public/org/codehaus/plexus/plexus-interpolation/1.24/plexus-interpolation-1.24.jar
Downloading: https://repo.eclipse.org/content/repositories/rcptt-snapshots/org/codehaus/plexus/plexus-component-annotations/1.6/plexus-component-annotations-1.6.jar
Downloading: https://repo.eclipse.org/content/repositories/rcptt-snapshots/org/codehaus/plexus/plexus-utils/3.0.24/plexus-utils-3.0.24.jar
Downloading: https://repo.eclipse.org/content/repositories/rcptt-snapshots/org/apache/maven/shared/maven-filtering/3.1.1/maven-filtering-3.1.1.jar
Downloading: https://repo.eclipse.org/content/repositories/rcptt-snapshots/org/sonatype/plexus/plexus-build-api/0.0.7/plexus-build-api-0.0.7.jar
Downloading: https://repo.eclipse.org/content/repositories/rcptt-snapshots/commons-io/commons-io/2.5/commons-io-2.5.jar
Downloading: https://repo.eclipse.org/content/repositories/rcptt-snapshots/org/codehaus/plexus/plexus-interpolation/1.24/plexus-interpolation-1.24.jar
Downloading: https://repo.eclipse.org/content/repositories/rcptt-releases/org/codehaus/plexus/plexus-component-annotations/1.6/plexus-component-annotations-1.6.jar
Downloading: https://repo.eclipse.org/content/repositories/rcptt-releases/org/codehaus/plexus/plexus-utils/3.0.24/plexus-utils-3.0.24.jar
Downloading: https://repo.eclipse.org/content/repositories/rcptt-releases/org/apache/maven/shared/maven-filtering/3.1.1/maven-filtering-3.1.1.jar
Downloading: https://repo.eclipse.org/content/repositories/rcptt-releases/org/sonatype/plexus/plexus-build-api/0.0.7/plexus-build-api-0.0.7.jar
Downloading: https://repo.eclipse.org/content/repositories/rcptt-releases/commons-io/commons-io/2.5/commons-io-2.5.jar
Downloading: https://repo.eclipse.org/content/repositories/rcptt-releases/org/codehaus/plexus/plexus-interpolation/1.24/plexus-interpolation-1.24.jar
Downloading: https://repo.maven.apache.org/maven2/org/codehaus/plexus/plexus-component-annotations/1.6/plexus-component-annotations-1.6.jar
Downloading: https://repo.maven.apache.org/maven2/org/codehaus/plexus/plexus-utils/3.0.24/plexus-utils-3.0.24.jar
Downloading: https://repo.maven.apache.org/maven2/org/apache/maven/shared/maven-filtering/3.1.1/maven-filtering-3.1.1.jar
Downloading: https://repo.maven.apache.org/maven2/org/sonatype/plexus/plexus-build-api/0.0.7/plexus-build-api-0.0.7.jar
Downloading: https://repo.maven.apache.org/maven2/commons-io/commons-io/2.5/commons-io-2.5.jar
Downloaded: https://repo.maven.apache.org/maven2/org/codehaus/plexus/plexus-component-annotations/1.6/plexus-component-annotations-1.6.jar (5 KB at 143.6 KB/sec)
Downloading: https://repo.maven.apache.org/maven2/org/codehaus/plexus/plexus-interpolation/1.24/plexus-interpolation-1.24.jar
Downloaded: https://repo.maven.apache.org/maven2/org/sonatype/plexus/plexus-build-api/0.0.7/plexus-build-api-0.0.7.jar (9 KB at 295.8 KB/sec)
Downloaded: https://repo.maven.apache.org/maven2/org/apache/maven/shared/maven-filtering/3.1.1/maven-filtering-3.1.1.jar (50 KB at 1600.8 KB/sec)
Downloaded: https://repo.maven.apache.org/maven2/commons-io/commons-io/2.5/commons-io-2.5.jar (204 KB at 4246.0 KB/sec)
Downloaded: https://repo.maven.apache.org/maven2/org/codehaus/plexus/plexus-utils/3.0.24/plexus-utils-3.0.24.jar (242 KB at 4645.3 KB/sec)
Downloaded: https://repo.maven.apache.org/maven2/org/codehaus/plexus/plexus-interpolation/1.24/plexus-interpolation-1.24.jar (78 KB at 1222.7 KB/sec)
[INFO] Using 'UTF-8' encoding to copy filtered resources.
[INFO] skip non existing resourceDirectory /home/hudson/hudson-slave/workspace/tracecompass-stable-release-nightly/common/org.eclipse.tracecompass.common.core/src/main/resources
[INFO] 
[INFO] --- tycho-compiler-plugin:0.26.0:compile (default-compile) @ org.eclipse.tracecompass.common.core ---
Downloading: https://repo.eclipse.org/content/groups/releases/org/apache/maven/maven-compat/3.0/maven-compat-3.0.pom
Downloading: https://repo.eclipse.org/content/repositories/tycho-snapshots/org/apache/maven/maven-compat/3.0/maven-compat-3.0.pom
Downloading: http://repository.jboss.org/nexus/content/groups/public/org/apache/maven/maven-compat/3.0/maven-compat-3.0.pom
Downloading: https://repo.eclipse.org/content/repositories/rcptt-snapshots/org/apache/maven/maven-compat/3.0/maven-compat-3.0.pom
Downloading: https://repo.eclipse.org/content/repositories/rcptt-releases/org/apache/maven/maven-compat/3.0/maven-compat-3.0.pom
Downloading: https://repo.maven.apache.org/maven2/org/apache/maven/maven-compat/3.0/maven-compat-3.0.pom
Downloaded: https://repo.maven.apache.org/maven2/org/apache/maven/maven-compat/3.0/maven-compat-3.0.pom (4 KB at 145.4 KB/sec)
Downloading: https://repo.eclipse.org/content/groups/releases/org/apache/maven/wagon/wagon-provider-api/1.0-beta-6/wagon-provider-api-1.0-beta-6.pom
Downloading: https://repo.eclipse.org/content/repositories/tycho-snapshots/org/apache/maven/wagon/wagon-provider-api/1.0-beta-6/wagon-provider-api-1.0-beta-6.pom
Downloading: http://repository.jboss.org/nexus/content/groups/public/org/apache/maven/wagon/wagon-provider-api/1.0-beta-6/wagon-provider-api-1.0-beta-6.pom
Downloading: https://repo.eclipse.org/content/repositories/rcptt-snapshots/org/apache/maven/wagon/wagon-provider-api/1.0-beta-6/wagon-provider-api-1.0-beta-6.pom
Downloading: https://repo.eclipse.org/content/repositories/rcptt-releases/org/apache/maven/wagon/wagon-provider-api/1.0-beta-6/wagon-provider-api-1.0-beta-6.pom
Downloading: https://repo.maven.apache.org/maven2/org/apache/maven/wagon/wagon-provider-api/1.0-beta-6/wagon-provider-api-1.0-beta-6.pom
Downloaded: https://repo.maven.apache.org/maven2/org/apache/maven/wagon/wagon-provider-api/1.0-beta-6/wagon-provider-api-1.0-beta-6.pom (2 KB at 59.3 KB/sec)
Downloading: https://repo.eclipse.org/content/groups/releases/org/apache/maven/wagon/wagon/1.0-beta-6/wagon-1.0-beta-6.pom
Downloading: https://repo.eclipse.org/content/repositories/tycho-snapshots/org/apache/maven/wagon/wagon/1.0-beta-6/wagon-1.0-beta-6.pom
Downloading: http://repository.jboss.org/nexus/content/groups/public/org/apache/maven/wagon/wagon/1.0-beta-6/wagon-1.0-beta-6.pom
Downloading: https://repo.eclipse.org/content/repositories/rcptt-snapshots/org/apache/maven/wagon/wagon/1.0-beta-6/wagon-1.0-beta-6.pom
Downloading: https://repo.eclipse.org/content/repositories/rcptt-releases/org/apache/maven/wagon/wagon/1.0-beta-6/wagon-1.0-beta-6.pom
Downloading: https://repo.maven.apache.org/maven2/org/apache/maven/wagon/wagon/1.0-beta-6/wagon-1.0-beta-6.pom
Downloaded: https://repo.maven.apache.org/maven2/org/apache/maven/wagon/wagon/1.0-beta-6/wagon-1.0-beta-6.pom (13 KB at 432.0 KB/sec)
Downloading: https://repo.eclipse.org/content/groups/releases/org/codehaus/plexus/plexus-compiler-manager/2.2/plexus-compiler-manager-2.2.pom
Downloading: https://repo.eclipse.org/content/repositories/tycho-snapshots/org/codehaus/plexus/plexus-compiler-manager/2.2/plexus-compiler-manager-2.2.pom
Downloading: http://repository.jboss.org/nexus/content/groups/public/org/codehaus/plexus/plexus-compiler-manager/2.2/plexus-compiler-manager-2.2.pom
Downloading: https://repo.eclipse.org/content/repositories/rcptt-snapshots/org/codehaus/plexus/plexus-compiler-manager/2.2/plexus-compiler-manager-2.2.pom
Downloading: https://repo.eclipse.org/content/repositories/rcptt-releases/org/codehaus/plexus/plexus-compiler-manager/2.2/plexus-compiler-manager-2.2.pom
Downloading: https://repo.maven.apache.org/maven2/org/codehaus/plexus/plexus-compiler-manager/2.2/plexus-compiler-manager-2.2.pom
Downloaded: https://repo.maven.apache.org/maven2/org/codehaus/plexus/plexus-compiler-manager/2.2/plexus-compiler-manager-2.2.pom (690 B at 25.0 KB/sec)
Downloading: https://repo.eclipse.org/content/groups/releases/org/codehaus/plexus/plexus-compiler/2.2/plexus-compiler-2.2.pom
Downloading: https://repo.eclipse.org/content/repositories/tycho-snapshots/org/codehaus/plexus/plexus-compiler/2.2/plexus-compiler-2.2.pom
Downloading: http://repository.jboss.org/nexus/content/groups/public/org/codehaus/plexus/plexus-compiler/2.2/plexus-compiler-2.2.pom
Downloading: https://repo.eclipse.org/content/repositories/rcptt-snapshots/org/codehaus/plexus/plexus-compiler/2.2/plexus-compiler-2.2.pom
Downloading: https://repo.eclipse.org/content/repositories/rcptt-releases/org/codehaus/plexus/plexus-compiler/2.2/plexus-compiler-2.2.pom
Downloading: https://repo.maven.apache.org/maven2/org/codehaus/plexus/plexus-compiler/2.2/plexus-compiler-2.2.pom
Downloaded: https://repo.maven.apache.org/maven2/org/codehaus/plexus/plexus-compiler/2.2/plexus-compiler-2.2.pom (4 KB at 121.7 KB/sec)
Downloading: https://repo.eclipse.org/content/groups/releases/org/codehaus/plexus/plexus-compiler-api/2.2/plexus-compiler-api-2.2.pom
Downloading: https://repo.eclipse.org/content/repositories/tycho-snapshots/org/codehaus/plexus/plexus-compiler-api/2.2/plexus-compiler-api-2.2.pom
Downloading: http://repository.jboss.org/nexus/content/groups/public/org/codehaus/plexus/plexus-compiler-api/2.2/plexus-compiler-api-2.2.pom
Downloading: https://repo.eclipse.org/content/repositories/rcptt-snapshots/org/codehaus/plexus/plexus-compiler-api/2.2/plexus-compiler-api-2.2.pom
Downloading: https://repo.eclipse.org/content/repositories/rcptt-releases/org/codehaus/plexus/plexus-compiler-api/2.2/plexus-compiler-api-2.2.pom
Downloading: https://repo.maven.apache.org/maven2/org/codehaus/plexus/plexus-compiler-api/2.2/plexus-compiler-api-2.2.pom
Downloaded: https://repo.maven.apache.org/maven2/org/codehaus/plexus/plexus-compiler-api/2.2/plexus-compiler-api-2.2.pom (865 B at 30.2 KB/sec)
Downloading: https://repo.eclipse.org/content/groups/releases/org/eclipse/tycho/tycho-compiler-jdt/0.26.0/tycho-compiler-jdt-0.26.0.pom
Downloading: https://repo.eclipse.org/content/repositories/tycho-snapshots/org/eclipse/tycho/tycho-compiler-jdt/0.26.0/tycho-compiler-jdt-0.26.0.pom
Downloading: http://repository.jboss.org/nexus/content/groups/public/org/eclipse/tycho/tycho-compiler-jdt/0.26.0/tycho-compiler-jdt-0.26.0.pom
Downloading: https://repo.eclipse.org/content/repositories/rcptt-snapshots/org/eclipse/tycho/tycho-compiler-jdt/0.26.0/tycho-compiler-jdt-0.26.0.pom
Downloading: https://repo.eclipse.org/content/repositories/rcptt-releases/org/eclipse/tycho/tycho-compiler-jdt/0.26.0/tycho-compiler-jdt-0.26.0.pom
Downloading: https://repo.maven.apache.org/maven2/org/eclipse/tycho/tycho-compiler-jdt/0.26.0/tycho-compiler-jdt-0.26.0.pom
Downloaded: https://repo.maven.apache.org/maven2/org/eclipse/tycho/tycho-compiler-jdt/0.26.0/tycho-compiler-jdt-0.26.0.pom (2 KB at 62.0 KB/sec)
Downloading: https://repo.eclipse.org/content/groups/releases/org/eclipse/tycho/org.eclipse.jdt.core/3.12.0.v20160516-2131/org.eclipse.jdt.core-3.12.0.v20160516-2131.pom
Downloading: https://repo.eclipse.org/content/repositories/tycho-snapshots/org/eclipse/tycho/org.eclipse.jdt.core/3.12.0.v20160516-2131/org.eclipse.jdt.core-3.12.0.v20160516-2131.pom
Downloading: http://repository.jboss.org/nexus/content/groups/public/org/eclipse/tycho/org.eclipse.jdt.core/3.12.0.v20160516-2131/org.eclipse.jdt.core-3.12.0.v20160516-2131.pom
Downloading: https://repo.eclipse.org/content/repositories/rcptt-snapshots/org/eclipse/tycho/org.eclipse.jdt.core/3.12.0.v20160516-2131/org.eclipse.jdt.core-3.12.0.v20160516-2131.pom
Downloading: https://repo.eclipse.org/content/repositories/rcptt-releases/org/eclipse/tycho/org.eclipse.jdt.core/3.12.0.v20160516-2131/org.eclipse.jdt.core-3.12.0.v20160516-2131.pom
Downloading: https://repo.maven.apache.org/maven2/org/eclipse/tycho/org.eclipse.jdt.core/3.12.0.v20160516-2131/org.eclipse.jdt.core-3.12.0.v20160516-2131.pom
Downloaded: https://repo.maven.apache.org/maven2/org/eclipse/tycho/org.eclipse.jdt.core/3.12.0.v20160516-2131/org.eclipse.jdt.core-3.12.0.v20160516-2131.pom (2 KB at 37.6 KB/sec)
Downloading: https://repo.eclipse.org/content/groups/releases/org/eclipse/tycho/org.eclipse.jdt.compiler.apt/1.2.100.v20160418-1457/org.eclipse.jdt.compiler.apt-1.2.100.v20160418-1457.pom
Downloading: https://repo.eclipse.org/content/repositories/tycho-snapshots/org/eclipse/tycho/org.eclipse.jdt.compiler.apt/1.2.100.v20160418-1457/org.eclipse.jdt.compiler.apt-1.2.100.v20160418-1457.pom
Downloading: http://repository.jboss.org/nexus/content/groups/public/org/eclipse/tycho/org.eclipse.jdt.compiler.apt/1.2.100.v20160418-1457/org.eclipse.jdt.compiler.apt-1.2.100.v20160418-1457.pom
Downloading: https://repo.eclipse.org/content/repositories/rcptt-snapshots/org/eclipse/tycho/org.eclipse.jdt.compiler.apt/1.2.100.v20160418-1457/org.eclipse.jdt.compiler.apt-1.2.100.v20160418-1457.pom
Downloading: https://repo.eclipse.org/content/repositories/rcptt-releases/org/eclipse/tycho/org.eclipse.jdt.compiler.apt/1.2.100.v20160418-1457/org.eclipse.jdt.compiler.apt-1.2.100.v20160418-1457.pom
Downloading: https://repo.maven.apache.org/maven2/org/eclipse/tycho/org.eclipse.jdt.compiler.apt/1.2.100.v20160418-1457/org.eclipse.jdt.compiler.apt-1.2.100.v20160418-1457.pom
Downloaded: https://repo.maven.apache.org/maven2/org/eclipse/tycho/org.eclipse.jdt.compiler.apt/1.2.100.v20160418-1457/org.eclipse.jdt.compiler.apt-1.2.100.v20160418-1457.pom (2 KB at 40.0 KB/sec)
Downloading: https://repo.eclipse.org/content/groups/releases/org/apache/maven/maven-compat/3.0/maven-compat-3.0.jar
Downloading: https://repo.eclipse.org/content/groups/releases/org/apache/maven/wagon/wagon-provider-api/1.0-beta-6/wagon-provider-api-1.0-beta-6.jar
Downloading: https://repo.eclipse.org/content/groups/releases/org/codehaus/plexus/plexus-compiler-manager/2.2/plexus-compiler-manager-2.2.jar
Downloading: https://repo.eclipse.org/content/groups/releases/org/codehaus/plexus/plexus-compiler-api/2.2/plexus-compiler-api-2.2.jar
Downloading: https://repo.eclipse.org/content/groups/releases/org/eclipse/tycho/tycho-compiler-jdt/0.26.0/tycho-compiler-jdt-0.26.0.jar
Downloading: https://repo.eclipse.org/content/groups/releases/org/eclipse/tycho/org.eclipse.jdt.core/3.12.0.v20160516-2131/org.eclipse.jdt.core-3.12.0.v20160516-2131.jar
Downloading: https://repo.eclipse.org/content/groups/releases/org/eclipse/tycho/org.eclipse.jdt.compiler.apt/1.2.100.v20160418-1457/org.eclipse.jdt.compiler.apt-1.2.100.v20160418-1457.jar
Downloading: https://repo.eclipse.org/content/repositories/tycho-snapshots/org/apache/maven/maven-compat/3.0/maven-compat-3.0.jar
Downloading: https://repo.eclipse.org/content/repositories/tycho-snapshots/org/apache/maven/wagon/wagon-provider-api/1.0-beta-6/wagon-provider-api-1.0-beta-6.jar
Downloading: https://repo.eclipse.org/content/repositories/tycho-snapshots/org/codehaus/plexus/plexus-compiler-manager/2.2/plexus-compiler-manager-2.2.jar
Downloading: https://repo.eclipse.org/content/repositories/tycho-snapshots/org/codehaus/plexus/plexus-compiler-api/2.2/plexus-compiler-api-2.2.jar
Downloading: https://repo.eclipse.org/content/repositories/tycho-snapshots/org/eclipse/tycho/tycho-compiler-jdt/0.26.0/tycho-compiler-jdt-0.26.0.jar
Downloading: https://repo.eclipse.org/content/repositories/tycho-snapshots/org/eclipse/tycho/org.eclipse.jdt.core/3.12.0.v20160516-2131/org.eclipse.jdt.core-3.12.0.v20160516-2131.jar
Downloading: https://repo.eclipse.org/content/repositories/tycho-snapshots/org/eclipse/tycho/org.eclipse.jdt.compiler.apt/1.2.100.v20160418-1457/org.eclipse.jdt.compiler.apt-1.2.100.v20160418-1457.jar
Downloading: http://repository.jboss.org/nexus/content/groups/public/org/apache/maven/maven-compat/3.0/maven-compat-3.0.jar
Downloading: http://repository.jboss.org/nexus/content/groups/public/org/apache/maven/wagon/wagon-provider-api/1.0-beta-6/wagon-provider-api-1.0-beta-6.jar
Downloading: http://repository.jboss.org/nexus/content/groups/public/org/codehaus/plexus/plexus-compiler-manager/2.2/plexus-compiler-manager-2.2.jar
Downloading: http://repository.jboss.org/nexus/content/groups/public/org/codehaus/plexus/plexus-compiler-api/2.2/plexus-compiler-api-2.2.jar
Downloading: http://repository.jboss.org/nexus/content/groups/public/org/eclipse/tycho/tycho-compiler-jdt/0.26.0/tycho-compiler-jdt-0.26.0.jar
Downloading: http://repository.jboss.org/nexus/content/groups/public/org/eclipse/tycho/org.eclipse.jdt.core/3.12.0.v20160516-2131/org.eclipse.jdt.core-3.12.0.v20160516-2131.jar
Downloading: http://repository.jboss.org/nexus/content/groups/public/org/eclipse/tycho/org.eclipse.jdt.compiler.apt/1.2.100.v20160418-1457/org.eclipse.jdt.compiler.apt-1.2.100.v20160418-1457.jar
Downloading: https://repo.eclipse.org/content/repositories/rcptt-snapshots/org/apache/maven/maven-compat/3.0/maven-compat-3.0.jar
Downloading: https://repo.eclipse.org/content/repositories/rcptt-snapshots/org/apache/maven/wagon/wagon-provider-api/1.0-beta-6/wagon-provider-api-1.0-beta-6.jar
Downloading: https://repo.eclipse.org/content/repositories/rcptt-snapshots/org/codehaus/plexus/plexus-compiler-manager/2.2/plexus-compiler-manager-2.2.jar
Downloading: https://repo.eclipse.org/content/repositories/rcptt-snapshots/org/codehaus/plexus/plexus-compiler-api/2.2/plexus-compiler-api-2.2.jar
Downloading: https://repo.eclipse.org/content/repositories/rcptt-snapshots/org/eclipse/tycho/tycho-compiler-jdt/0.26.0/tycho-compiler-jdt-0.26.0.jar
Downloading: https://repo.eclipse.org/content/repositories/rcptt-snapshots/org/eclipse/tycho/org.eclipse.jdt.core/3.12.0.v20160516-2131/org.eclipse.jdt.core-3.12.0.v20160516-2131.jar
Downloading: https://repo.eclipse.org/content/repositories/rcptt-snapshots/org/eclipse/tycho/org.eclipse.jdt.compiler.apt/1.2.100.v20160418-1457/org.eclipse.jdt.compiler.apt-1.2.100.v20160418-1457.jar
Downloading: https://repo.eclipse.org/content/repositories/rcptt-releases/org/apache/maven/maven-compat/3.0/maven-compat-3.0.jar
Downloading: https://repo.eclipse.org/content/repositories/rcptt-releases/org/apache/maven/wagon/wagon-provider-api/1.0-beta-6/wagon-provider-api-1.0-beta-6.jar
Downloading: https://repo.eclipse.org/content/repositories/rcptt-releases/org/codehaus/plexus/plexus-compiler-manager/2.2/plexus-compiler-manager-2.2.jar
Downloading: https://repo.eclipse.org/content/repositories/rcptt-releases/org/codehaus/plexus/plexus-compiler-api/2.2/plexus-compiler-api-2.2.jar
Downloading: https://repo.eclipse.org/content/repositories/rcptt-releases/org/eclipse/tycho/tycho-compiler-jdt/0.26.0/tycho-compiler-jdt-0.26.0.jar
Downloading: https://repo.eclipse.org/content/repositories/rcptt-releases/org/eclipse/tycho/org.eclipse.jdt.core/3.12.0.v20160516-2131/org.eclipse.jdt.core-3.12.0.v20160516-2131.jar
Downloading: https://repo.eclipse.org/content/repositories/rcptt-releases/org/eclipse/tycho/org.eclipse.jdt.compiler.apt/1.2.100.v20160418-1457/org.eclipse.jdt.compiler.apt-1.2.100.v20160418-1457.jar
Downloading: https://repo.maven.apache.org/maven2/org/apache/maven/maven-compat/3.0/maven-compat-3.0.jar
Downloading: https://repo.maven.apache.org/maven2/org/apache/maven/wagon/wagon-provider-api/1.0-beta-6/wagon-provider-api-1.0-beta-6.jar
Downloading: https://repo.maven.apache.org/maven2/org/codehaus/plexus/plexus-compiler-manager/2.2/plexus-compiler-manager-2.2.jar
Downloading: https://repo.maven.apache.org/maven2/org/codehaus/plexus/plexus-compiler-api/2.2/plexus-compiler-api-2.2.jar
Downloading: https://repo.maven.apache.org/maven2/org/eclipse/tycho/tycho-compiler-jdt/0.26.0/tycho-compiler-jdt-0.26.0.jar
Downloaded: https://repo.maven.apache.org/maven2/org/codehaus/plexus/plexus-compiler-manager/2.2/plexus-compiler-manager-2.2.jar (5 KB at 143.7 KB/sec)
Downloading: https://repo.maven.apache.org/maven2/org/eclipse/tycho/org.eclipse.jdt.core/3.12.0.v20160516-2131/org.eclipse.jdt.core-3.12.0.v20160516-2131.jar
Downloaded: https://repo.maven.apache.org/maven2/org/apache/maven/wagon/wagon-provider-api/1.0-beta-6/wagon-provider-api-1.0-beta-6.jar (52 KB at 1403.8 KB/sec)
Downloading: https://repo.maven.apache.org/maven2/org/eclipse/tycho/org.eclipse.jdt.compiler.apt/1.2.100.v20160418-1457/org.eclipse.jdt.compiler.apt-1.2.100.v20160418-1457.jar
Downloaded: https://repo.maven.apache.org/maven2/org/eclipse/tycho/tycho-compiler-jdt/0.26.0/tycho-compiler-jdt-0.26.0.jar (16 KB at 505.1 KB/sec)
Downloaded: https://repo.maven.apache.org/maven2/org/codehaus/plexus/plexus-compiler-api/2.2/plexus-compiler-api-2.2.jar (25 KB at 677.9 KB/sec)
Downloaded: https://repo.maven.apache.org/maven2/org/apache/maven/maven-compat/3.0/maven-compat-3.0.jar (279 KB at 4416.1 KB/sec)
Downloaded: https://repo.maven.apache.org/maven2/org/eclipse/tycho/org.eclipse.jdt.compiler.apt/1.2.100.v20160418-1457/org.eclipse.jdt.compiler.apt-1.2.100.v20160418-1457.jar (166 KB at 1877.2 KB/sec)
Downloaded: https://repo.maven.apache.org/maven2/org/eclipse/tycho/org.eclipse.jdt.core/3.12.0.v20160516-2131/org.eclipse.jdt.core-3.12.0.v20160516-2131.jar (5684 KB at 15156.3 KB/sec)
[INFO] Compiling 18 source files to /home/hudson/hudson-slave/workspace/tracecompass-stable-release-nightly/common/org.eclipse.tracecompass.common.core/target/classes
[WARNING] /home/hudson/hudson-slave/workspace/tracecompass-stable-release-nightly/common/org.eclipse.tracecompass.common.core/src/org/eclipse/tracecompass/common/core/StreamUtils.java:[93] 
	fGetChildrenFunction.apply(element).flatMap(this::flatten));
	^^^^^^^^^^^^^^^^^^^^^^^^^^^^^^^^^^^
Unsafe interpretation of method return type as '@NonNull' based on the receiver type '@NonNull Function<T,@NonNull Stream<T>>'. Type 'Function<T,R>' doesn't seem to be designed with null type annotations in mind
1 problem (1 warning)
[INFO] 
[INFO] --- maven-resources-plugin:3.0.2:testResources (default-testResources) @ org.eclipse.tracecompass.common.core ---
[INFO] Using 'UTF-8' encoding to copy filtered resources.
[INFO] skip non existing resourceDirectory /home/hudson/hudson-slave/workspace/tracecompass-stable-release-nightly/common/org.eclipse.tracecompass.common.core/src/test/resources
[INFO] 
[INFO] --- tycho-source-plugin:0.26.0:plugin-source (plugin-source) @ org.eclipse.tracecompass.common.core ---
[INFO] Building jar: /home/hudson/hudson-slave/workspace/tracecompass-stable-release-nightly/common/org.eclipse.tracecompass.common.core/target/org.eclipse.tracecompass.common.core-2.2.0-SNAPSHOT-sources.jar
[INFO] 
[INFO] --- target-platform-configuration:0.26.0:target-platform (default-target-platform) @ org.eclipse.tracecompass.common.core ---
[INFO] 
[INFO] --- tycho-packaging-plugin:0.26.0:package-plugin (default-package-plugin) @ org.eclipse.tracecompass.common.core ---
[INFO] Building jar: /home/hudson/hudson-slave/workspace/tracecompass-stable-release-nightly/common/org.eclipse.tracecompass.common.core/target/org.eclipse.tracecompass.common.core-2.2.0-SNAPSHOT.jar
[INFO] 
[INFO] --- tycho-p2-plugin:0.26.0:p2-metadata-default (default-p2-metadata-default) @ org.eclipse.tracecompass.common.core ---
[INFO] 
[INFO] --- tycho-source-feature-plugin:0.26.0:source-feature (source-feature) @ org.eclipse.tracecompass.common.core ---
[INFO] 
[INFO] --- tycho-pack200a-plugin:0.26.0:normalize (pack200-normalize) @ org.eclipse.tracecompass.common.core ---
[INFO] Pack200 normalizing jar /home/hudson/hudson-slave/workspace/tracecompass-stable-release-nightly/common/org.eclipse.tracecompass.common.core/target/org.eclipse.tracecompass.common.core-2.2.0-SNAPSHOT.jar
[INFO] 
[INFO] --- eclipse-jarsigner-plugin:1.1.3:sign (sign) @ org.eclipse.tracecompass.common.core ---
[INFO] Signing jar: /home/hudson/hudson-slave/workspace/tracecompass-stable-release-nightly/common/org.eclipse.tracecompass.common.core/target/org.eclipse.tracecompass.common.core-2.2.0-SNAPSHOT.jar
[WARNING] An exception has been thrown, but the request will be retried
org.apache.http.conn.ConnectTimeoutException: Connect to build.eclipse.org:31338 [build.eclipse.org/198.41.30.203] failed: Connection timed out
	at org.apache.http.impl.conn.DefaultHttpClientConnectionOperator.connect(DefaultHttpClientConnectionOperator.java:149)
	at org.apache.http.impl.conn.PoolingHttpClientConnectionManager.connect(PoolingHttpClientConnectionManager.java:353)
	at org.apache.http.impl.execchain.MainClientExec.establishRoute(MainClientExec.java:380)
	at org.apache.http.impl.execchain.MainClientExec.execute(MainClientExec.java:236)
	at org.apache.http.impl.execchain.ProtocolExec.execute(ProtocolExec.java:184)
	at org.apache.http.impl.execchain.RetryExec.execute(RetryExec.java:88)
	at org.apache.http.impl.execchain.RedirectExec.execute(RedirectExec.java:110)
	at org.apache.http.impl.client.InternalHttpClient.doExecute(InternalHttpClient.java:184)
	at org.apache.http.impl.client.CloseableHttpClient.execute(CloseableHttpClient.java:71)
	at org.apache.http.impl.client.CloseableHttpClient.execute(CloseableHttpClient.java:220)
	at org.apache.http.impl.client.CloseableHttpClient.execute(CloseableHttpClient.java:164)
	at org.apache.http.impl.client.CloseableHttpClient.execute(CloseableHttpClient.java:139)
	at org.eclipse.cbi.maven.http.apache.ApacheHttpClient.send(ApacheHttpClient.java:62)
	at org.eclipse.cbi.maven.http.RetryHttpClient.send(RetryHttpClient.java:54)
	at org.eclipse.cbi.maven.plugins.jarsigner.RemoteJarSigner.doSignJar(RemoteJarSigner.java:59)
	at org.eclipse.cbi.maven.plugins.jarsigner.FilteredJarSigner.sign(FilteredJarSigner.java:44)
	at org.eclipse.cbi.maven.plugins.jarsigner.JarResigner.sign(JarResigner.java:97)
	at org.eclipse.cbi.maven.plugins.jarsigner.RecursiveJarSigner.doSignJarRecursively(RecursiveJarSigner.java:64)
	at org.eclipse.cbi.maven.plugins.jarsigner.RecursiveJarSigner.doSignJar(RecursiveJarSigner.java:41)
	at org.eclipse.cbi.maven.plugins.jarsigner.FilteredJarSigner.sign(FilteredJarSigner.java:44)
	at org.eclipse.cbi.maven.plugins.jarsigner.mojo.SignMojo.signArtifact(SignMojo.java:298)
	at org.eclipse.cbi.maven.plugins.jarsigner.mojo.SignMojo.execute(SignMojo.java:280)
	at org.apache.maven.plugin.DefaultBuildPluginManager.executeMojo(DefaultBuildPluginManager.java:134)
	at org.apache.maven.lifecycle.internal.MojoExecutor.execute(MojoExecutor.java:207)
	at org.apache.maven.lifecycle.internal.MojoExecutor.execute(MojoExecutor.java:153)
	at org.apache.maven.lifecycle.internal.MojoExecutor.execute(MojoExecutor.java:145)
	at org.apache.maven.lifecycle.internal.LifecycleModuleBuilder.buildProject(LifecycleModuleBuilder.java:116)
	at org.apache.maven.lifecycle.internal.LifecycleModuleBuilder.buildProject(LifecycleModuleBuilder.java:80)
	at org.apache.maven.lifecycle.internal.builder.singlethreaded.SingleThreadedBuilder.build(SingleThreadedBuilder.java:51)
	at org.apache.maven.lifecycle.internal.LifecycleStarter.execute(LifecycleStarter.java:128)
	at org.apache.maven.DefaultMaven.doExecute(DefaultMaven.java:307)
	at org.apache.maven.DefaultMaven.doExecute(DefaultMaven.java:193)
	at org.apache.maven.DefaultMaven.execute(DefaultMaven.java:106)
	at org.apache.maven.cli.MavenCli.execute(MavenCli.java:863)
	at org.apache.maven.cli.MavenCli.doMain(MavenCli.java:288)
	at org.apache.maven.cli.MavenCli.main(MavenCli.java:199)
	at sun.reflect.NativeMethodAccessorImpl.invoke0(Native Method)
	at sun.reflect.NativeMethodAccessorImpl.invoke(NativeMethodAccessorImpl.java:62)
	at sun.reflect.DelegatingMethodAccessorImpl.invoke(DelegatingMethodAccessorImpl.java:43)
	at java.lang.reflect.Method.invoke(Method.java:498)
	at org.codehaus.plexus.classworlds.launcher.Launcher.launchEnhanced(Launcher.java:289)
	at org.codehaus.plexus.classworlds.launcher.Launcher.launch(Launcher.java:229)
	at org.codehaus.plexus.classworlds.launcher.Launcher.mainWithExitCode(Launcher.java:415)
	at org.codehaus.plexus.classworlds.launcher.Launcher.main(Launcher.java:356)
Caused by: java.net.ConnectException: Connection timed out
	at java.net.PlainSocketImpl.socketConnect(Native Method)
	at java.net.AbstractPlainSocketImpl.doConnect(AbstractPlainSocketImpl.java:350)
	at java.net.AbstractPlainSocketImpl.connectToAddress(AbstractPlainSocketImpl.java:206)
	at java.net.AbstractPlainSocketImpl.connect(AbstractPlainSocketImpl.java:188)
	at java.net.SocksSocketImpl.connect(SocksSocketImpl.java:392)
	at java.net.Socket.connect(Socket.java:589)
	at org.apache.http.conn.socket.PlainConnectionSocketFactory.connectSocket(PlainConnectionSocketFactory.java:74)
	at org.apache.http.impl.conn.DefaultHttpClientConnectionOperator.connect(DefaultHttpClientConnectionOperator.java:134)
	... 43 more
[WARNING] An exception has been thrown, but the request will be retried
org.apache.http.conn.ConnectTimeoutException: Connect to build.eclipse.org:31338 [build.eclipse.org/198.41.30.203] failed: Connection timed out
	at org.apache.http.impl.conn.DefaultHttpClientConnectionOperator.connect(DefaultHttpClientConnectionOperator.java:149)
	at org.apache.http.impl.conn.PoolingHttpClientConnectionManager.connect(PoolingHttpClientConnectionManager.java:353)
	at org.apache.http.impl.execchain.MainClientExec.establishRoute(MainClientExec.java:380)
	at org.apache.http.impl.execchain.MainClientExec.execute(MainClientExec.java:236)
	at org.apache.http.impl.execchain.ProtocolExec.execute(ProtocolExec.java:184)
	at org.apache.http.impl.execchain.RetryExec.execute(RetryExec.java:88)
	at org.apache.http.impl.execchain.RedirectExec.execute(RedirectExec.java:110)
	at org.apache.http.impl.client.InternalHttpClient.doExecute(InternalHttpClient.java:184)
	at org.apache.http.impl.client.CloseableHttpClient.execute(CloseableHttpClient.java:71)
	at org.apache.http.impl.client.CloseableHttpClient.execute(CloseableHttpClient.java:220)
	at org.apache.http.impl.client.CloseableHttpClient.execute(CloseableHttpClient.java:164)
	at org.apache.http.impl.client.CloseableHttpClient.execute(CloseableHttpClient.java:139)
	at org.eclipse.cbi.maven.http.apache.ApacheHttpClient.send(ApacheHttpClient.java:62)
	at org.eclipse.cbi.maven.http.RetryHttpClient.send(RetryHttpClient.java:54)
	at org.eclipse.cbi.maven.plugins.jarsigner.RemoteJarSigner.doSignJar(RemoteJarSigner.java:59)
	at org.eclipse.cbi.maven.plugins.jarsigner.FilteredJarSigner.sign(FilteredJarSigner.java:44)
	at org.eclipse.cbi.maven.plugins.jarsigner.JarResigner.sign(JarResigner.java:97)
	at org.eclipse.cbi.maven.plugins.jarsigner.RecursiveJarSigner.doSignJarRecursively(RecursiveJarSigner.java:64)
	at org.eclipse.cbi.maven.plugins.jarsigner.RecursiveJarSigner.doSignJar(RecursiveJarSigner.java:41)
	at org.eclipse.cbi.maven.plugins.jarsigner.FilteredJarSigner.sign(FilteredJarSigner.java:44)
	at org.eclipse.cbi.maven.plugins.jarsigner.mojo.SignMojo.signArtifact(SignMojo.java:298)
	at org.eclipse.cbi.maven.plugins.jarsigner.mojo.SignMojo.execute(SignMojo.java:280)
	at org.apache.maven.plugin.DefaultBuildPluginManager.executeMojo(DefaultBuildPluginManager.java:134)
	at org.apache.maven.lifecycle.internal.MojoExecutor.execute(MojoExecutor.java:207)
	at org.apache.maven.lifecycle.internal.MojoExecutor.execute(MojoExecutor.java:153)
	at org.apache.maven.lifecycle.internal.MojoExecutor.execute(MojoExecutor.java:145)
	at org.apache.maven.lifecycle.internal.LifecycleModuleBuilder.buildProject(LifecycleModuleBuilder.java:116)
	at org.apache.maven.lifecycle.internal.LifecycleModuleBuilder.buildProject(LifecycleModuleBuilder.java:80)
	at org.apache.maven.lifecycle.internal.builder.singlethreaded.SingleThreadedBuilder.build(SingleThreadedBuilder.java:51)
	at org.apache.maven.lifecycle.internal.LifecycleStarter.execute(LifecycleStarter.java:128)
	at org.apache.maven.DefaultMaven.doExecute(DefaultMaven.java:307)
	at org.apache.maven.DefaultMaven.doExecute(DefaultMaven.java:193)
	at org.apache.maven.DefaultMaven.execute(DefaultMaven.java:106)
	at org.apache.maven.cli.MavenCli.execute(MavenCli.java:863)
	at org.apache.maven.cli.MavenCli.doMain(MavenCli.java:288)
	at org.apache.maven.cli.MavenCli.main(MavenCli.java:199)
	at sun.reflect.NativeMethodAccessorImpl.invoke0(Native Method)
	at sun.reflect.NativeMethodAccessorImpl.invoke(NativeMethodAccessorImpl.java:62)
	at sun.reflect.DelegatingMethodAccessorImpl.invoke(DelegatingMethodAccessorImpl.java:43)
	at java.lang.reflect.Method.invoke(Method.java:498)
	at org.codehaus.plexus.classworlds.launcher.Launcher.launchEnhanced(Launcher.java:289)
	at org.codehaus.plexus.classworlds.launcher.Launcher.launch(Launcher.java:229)
	at org.codehaus.plexus.classworlds.launcher.Launcher.mainWithExitCode(Launcher.java:415)
	at org.codehaus.plexus.classworlds.launcher.Launcher.main(Launcher.java:356)
Caused by: java.net.ConnectException: Connection timed out
	at java.net.PlainSocketImpl.socketConnect(Native Method)
	at java.net.AbstractPlainSocketImpl.doConnect(AbstractPlainSocketImpl.java:350)
	at java.net.AbstractPlainSocketImpl.connectToAddress(AbstractPlainSocketImpl.java:206)
	at java.net.AbstractPlainSocketImpl.connect(AbstractPlainSocketImpl.java:188)
	at java.net.SocksSocketImpl.connect(SocksSocketImpl.java:392)
	at java.net.Socket.connect(Socket.java:589)
	at org.apache.http.conn.socket.PlainConnectionSocketFactory.connectSocket(PlainConnectionSocketFactory.java:74)
	at org.apache.http.impl.conn.DefaultHttpClientConnectionOperator.connect(DefaultHttpClientConnectionOperator.java:134)
	... 43 more
[WARNING] An exception has been thrown, but the request will be retried
org.apache.http.conn.ConnectTimeoutException: Connect to build.eclipse.org:31338 [build.eclipse.org/198.41.30.203] failed: Connection timed out
	at org.apache.http.impl.conn.DefaultHttpClientConnectionOperator.connect(DefaultHttpClientConnectionOperator.java:149)
	at org.apache.http.impl.conn.PoolingHttpClientConnectionManager.connect(PoolingHttpClientConnectionManager.java:353)
	at org.apache.http.impl.execchain.MainClientExec.establishRoute(MainClientExec.java:380)
	at org.apache.http.impl.execchain.MainClientExec.execute(MainClientExec.java:236)
	at org.apache.http.impl.execchain.ProtocolExec.execute(ProtocolExec.java:184)
	at org.apache.http.impl.execchain.RetryExec.execute(RetryExec.java:88)
	at org.apache.http.impl.execchain.RedirectExec.execute(RedirectExec.java:110)
	at org.apache.http.impl.client.InternalHttpClient.doExecute(InternalHttpClient.java:184)
	at org.apache.http.impl.client.CloseableHttpClient.execute(CloseableHttpClient.java:71)
	at org.apache.http.impl.client.CloseableHttpClient.execute(CloseableHttpClient.java:220)
	at org.apache.http.impl.client.CloseableHttpClient.execute(CloseableHttpClient.java:164)
	at org.apache.http.impl.client.CloseableHttpClient.execute(CloseableHttpClient.java:139)
	at org.eclipse.cbi.maven.http.apache.ApacheHttpClient.send(ApacheHttpClient.java:62)
	at org.eclipse.cbi.maven.http.RetryHttpClient.send(RetryHttpClient.java:54)
	at org.eclipse.cbi.maven.plugins.jarsigner.RemoteJarSigner.doSignJar(RemoteJarSigner.java:59)
	at org.eclipse.cbi.maven.plugins.jarsigner.FilteredJarSigner.sign(FilteredJarSigner.java:44)
	at org.eclipse.cbi.maven.plugins.jarsigner.JarResigner.sign(JarResigner.java:97)
	at org.eclipse.cbi.maven.plugins.jarsigner.RecursiveJarSigner.doSignJarRecursively(RecursiveJarSigner.java:64)
	at org.eclipse.cbi.maven.plugins.jarsigner.RecursiveJarSigner.doSignJar(RecursiveJarSigner.java:41)
	at org.eclipse.cbi.maven.plugins.jarsigner.FilteredJarSigner.sign(FilteredJarSigner.java:44)
	at org.eclipse.cbi.maven.plugins.jarsigner.mojo.SignMojo.signArtifact(SignMojo.java:298)
	at org.eclipse.cbi.maven.plugins.jarsigner.mojo.SignMojo.execute(SignMojo.java:280)
	at org.apache.maven.plugin.DefaultBuildPluginManager.executeMojo(DefaultBuildPluginManager.java:134)
	at org.apache.maven.lifecycle.internal.MojoExecutor.execute(MojoExecutor.java:207)
	at org.apache.maven.lifecycle.internal.MojoExecutor.execute(MojoExecutor.java:153)
	at org.apache.maven.lifecycle.internal.MojoExecutor.execute(MojoExecutor.java:145)
	at org.apache.maven.lifecycle.internal.LifecycleModuleBuilder.buildProject(LifecycleModuleBuilder.java:116)
	at org.apache.maven.lifecycle.internal.LifecycleModuleBuilder.buildProject(LifecycleModuleBuilder.java:80)
	at org.apache.maven.lifecycle.internal.builder.singlethreaded.SingleThreadedBuilder.build(SingleThreadedBuilder.java:51)
	at org.apache.maven.lifecycle.internal.LifecycleStarter.execute(LifecycleStarter.java:128)
	at org.apache.maven.DefaultMaven.doExecute(DefaultMaven.java:307)
	at org.apache.maven.DefaultMaven.doExecute(DefaultMaven.java:193)
	at org.apache.maven.DefaultMaven.execute(DefaultMaven.java:106)
	at org.apache.maven.cli.MavenCli.execute(MavenCli.java:863)
	at org.apache.maven.cli.MavenCli.doMain(MavenCli.java:288)
	at org.apache.maven.cli.MavenCli.main(MavenCli.java:199)
	at sun.reflect.NativeMethodAccessorImpl.invoke0(Native Method)
	at sun.reflect.NativeMethodAccessorImpl.invoke(NativeMethodAccessorImpl.java:62)
	at sun.reflect.DelegatingMethodAccessorImpl.invoke(DelegatingMethodAccessorImpl.java:43)
	at java.lang.reflect.Method.invoke(Method.java:498)
	at org.codehaus.plexus.classworlds.launcher.Launcher.launchEnhanced(Launcher.java:289)
	at org.codehaus.plexus.classworlds.launcher.Launcher.launch(Launcher.java:229)
	at org.codehaus.plexus.classworlds.launcher.Launcher.mainWithExitCode(Launcher.java:415)
	at org.codehaus.plexus.classworlds.launcher.Launcher.main(Launcher.java:356)
Caused by: java.net.ConnectException: Connection timed out
	at java.net.PlainSocketImpl.socketConnect(Native Method)
	at java.net.AbstractPlainSocketImpl.doConnect(AbstractPlainSocketImpl.java:350)
	at java.net.AbstractPlainSocketImpl.connectToAddress(AbstractPlainSocketImpl.java:206)
	at java.net.AbstractPlainSocketImpl.connect(AbstractPlainSocketImpl.java:188)
	at java.net.SocksSocketImpl.connect(SocksSocketImpl.java:392)
	at java.net.Socket.connect(Socket.java:589)
	at org.apache.http.conn.socket.PlainConnectionSocketFactory.connectSocket(PlainConnectionSocketFactory.java:74)
	at org.apache.http.impl.conn.DefaultHttpClientConnectionOperator.connect(DefaultHttpClientConnectionOperator.java:134)
	... 43 more
[INFO] ------------------------------------------------------------------------
[INFO] Reactor Summary:
[INFO] 
[INFO] Trace Compass Parent ............................... SUCCESS [01:50 min]
[INFO] Trace Compass Tracetype-agnostic Analyses Parent ... SUCCESS [  0.211 s]
[INFO] Trace Compass Common Utilities Parent .............. SUCCESS [  0.209 s]
[INFO] org.eclipse.tracecompass.common.core ............... FAILURE [09:24 min]
[INFO] Trace Compass State System Parent .................. SKIPPED
[INFO] org.eclipse.tracecompass.datastore.core ............ SKIPPED
[INFO] org.eclipse.tracecompass.segmentstore.core ......... SKIPPED
[INFO] org.eclipse.tracecompass.statesystem.core .......... SKIPPED
[INFO] Trace Compass TMF Parent ........................... SKIPPED
[INFO] org.eclipse.tracecompass.tmf.core .................. SKIPPED
[INFO] org.eclipse.tracecompass.analysis.graph.core ....... SKIPPED
[INFO] org.eclipse.tracecompass.tmf.core.tests ............ SKIPPED
[INFO] org.eclipse.tracecompass.analysis.graph.core.tests . SKIPPED
[INFO] org.eclipse.tracecompass.analysis.lami.core ........ SKIPPED
[INFO] org.eclipse.tracecompass.analysis.lami.core.tests .. SKIPPED
[INFO] org.eclipse.tracecompass.tmf.ui .................... SKIPPED
[INFO] org.eclipse.tracecompass.analysis.lami.ui .......... SKIPPED
[INFO] org.eclipse.tracecompass.analysis.graph.ui ......... SKIPPED
[INFO] org.eclipse.tracecompass.analysis.timing.core ...... SKIPPED
[INFO] org.eclipse.tracecompass.analysis.os.linux.core .... SKIPPED
[INFO] Trace Compass CTF Support Parent ................... SKIPPED
[INFO] Trace Compass CTF Parser Plug-in ................... SKIPPED
[INFO] org.eclipse.tracecompass.ctf.core .................. SKIPPED
[INFO] org.eclipse.tracecompass.tmf.ctf.core .............. SKIPPED
[INFO] Trace Compass CTF Core Tests Plug-in ............... SKIPPED
[INFO] org.eclipse.tracecompass.tmf.ctf.core.tests ........ SKIPPED
[INFO] org.eclipse.tracecompass.statesystem.core.tests .... SKIPPED
[INFO] org.eclipse.tracecompass.analysis.os.linux.core.tests SKIPPED
[INFO] org.eclipse.tracecompass.analysis.timing.ui ........ SKIPPED
[INFO] org.eclipse.tracecompass.analysis.os.linux.ui ...... SKIPPED
[INFO] org.eclipse.tracecompass.analysis.os.linux.ui.tests  SKIPPED
[INFO] org.eclipse.tracecompass.analysis.timing.core.tests  SKIPPED
[INFO] org.eclipse.tracecompass.tmf.ui.tests .............. SKIPPED
[INFO] org.eclipse.tracecompass.tmf.ui.swtbot.tests ....... SKIPPED
[INFO] org.eclipse.tracecompass.analysis.timing.ui.swtbot.tests SKIPPED
[INFO] org.eclipse.tracecompass.tmf.analysis.xml.core ..... SKIPPED
[INFO] Trace Compass LTTng Support Parent ................. SKIPPED
[INFO] org.eclipse.tracecompass.lttng2.kernel.core ........ SKIPPED
[INFO] org.eclipse.tracecompass.analysis.os.linux.ui.swtbot.tests SKIPPED
[INFO] Trace Compass BTF Support Parent ................... SKIPPED
[INFO] org.eclipse.tracecompass.btf.core .................. SKIPPED
[INFO] Trace Compass Documentation ........................ SKIPPED
[INFO] Trace Compass Developer Guide ...................... SKIPPED
[INFO] org.eclipse.tracecompass.tmf.analysis.xml.ui ....... SKIPPED
[INFO] org.eclipse.tracecompass.tmf.chart.core ............ SKIPPED
[INFO] org.eclipse.tracecompass.tmf.chart.ui .............. SKIPPED
[INFO] org.eclipse.tracecompass.tmf ....................... SKIPPED
[INFO] org.eclipse.tracecompass.btf.ui .................... SKIPPED
[INFO] org.eclipse.tracecompass.btf ....................... SKIPPED
[INFO] org.eclipse.tracecompass.btf.core.tests ............ SKIPPED
[INFO] org.eclipse.tracecompass.common.core.tests ......... SKIPPED
[INFO] org.eclipse.tracecompass.ctf ....................... SKIPPED
[INFO] org.eclipse.tracecompass.ctf.parser.tests .......... SKIPPED
[INFO] org.eclipse.tracecompass.tmf.ctf ................... SKIPPED
[INFO] org.eclipse.tracecompass.tmf.ctf.ui.swtbot.tests ... SKIPPED
[INFO] Trace Compass User Guide ........................... SKIPPED
[INFO] Trace Compass GDB Tracepoint Analysis User Guide ... SKIPPED
[INFO] Trace Compass RCP User Guide ....................... SKIPPED
[INFO] Trace Compass Pcap User Guide ...................... SKIPPED
[INFO] org.eclipse.tracecompass.examples .................. SKIPPED
[INFO] Trace Compass GDB Tracepoint Analysis Parent ....... SKIPPED
[INFO] org.eclipse.tracecompass.gdbtrace.core ............. SKIPPED
[INFO] org.eclipse.tracecompass.gdbtrace.ui ............... SKIPPED
[INFO] org.eclipse.tracecompass.gdbtrace .................. SKIPPED
[INFO] org.eclipse.tracecompass.gdbtrace.core.tests ....... SKIPPED
[INFO] org.eclipse.tracecompass.gdbtrace.ui.tests ......... SKIPPED
[INFO] org.eclipse.tracecompass.lttng2.common.core ........ SKIPPED
[INFO] org.eclipse.tracecompass.lttng2.common.core.tests .. SKIPPED
[INFO] org.eclipse.tracecompass.lttng2.control.core ....... SKIPPED
[INFO] org.eclipse.tracecompass.tmf.remote.core ........... SKIPPED
[INFO] org.eclipse.tracecompass.tmf.remote.ui ............. SKIPPED
[INFO] org.eclipse.tracecompass.lttng2.control.ui ......... SKIPPED
[INFO] org.eclipse.tracecompass.lttng2.control ............ SKIPPED
[INFO] org.eclipse.tracecompass.lttng2.control.core.tests . SKIPPED
[INFO] org.eclipse.tracecompass.tmf.remote.core.tests ..... SKIPPED
[INFO] org.eclipse.tracecompass.lttng2.control.ui.tests ... SKIPPED
[INFO] org.eclipse.tracecompass.lttng2.kernel.ui .......... SKIPPED
[INFO] org.eclipse.tracecompass.lttng2.kernel ............. SKIPPED
[INFO] org.eclipse.tracecompass.lttng2.kernel.core.tests .. SKIPPED
[INFO] org.eclipse.tracecompass.lttng2.ust.core ........... SKIPPED
[INFO] org.eclipse.tracecompass.lttng2.ust.ui ............. SKIPPED
[INFO] org.eclipse.tracecompass.lttng2.ust ................ SKIPPED
[INFO] org.eclipse.tracecompass.lttng2.ust.core.tests ..... SKIPPED
[INFO] org.eclipse.tracecompass.lttng2.ust.ui.tests ....... SKIPPED
[INFO] org.eclipse.tracecompass.lttng2.control.ui.swtbot.tests SKIPPED
[INFO] org.eclipse.tracecompass.lttng2.kernel.ui.swtbot.tests SKIPPED
[INFO] org.eclipse.tracecompass.lttng2.ust.ui.swtbot.tests  SKIPPED
[INFO] Trace Compass Pcap Format Support Parent ........... SKIPPED
[INFO] org.eclipse.tracecompass.pcap.core ................. SKIPPED
[INFO] Trace Compass Pcap Parser Core Tests Plug-in ....... SKIPPED
[INFO] org.eclipse.tracecompass.tmf.pcap.core ............. SKIPPED
[INFO] org.eclipse.tracecompass.tmf.pcap.ui ............... SKIPPED
[INFO] org.eclipse.tracecompass.tmf.pcap .................. SKIPPED
[INFO] org.eclipse.tracecompass.tmf.pcap.core.tests ....... SKIPPED
[INFO] org.eclipse.tracecompass.tmf.pcap.ui.swtbot.tests .. SKIPPED
[INFO] Trace Compass RCP Parent ........................... SKIPPED
[INFO] Trace Compass RCP Branding plug-in ................. SKIPPED
[INFO] Trace Compass RCP Branding Feature ................. SKIPPED
[INFO] org.eclipse.tracecompass.rcp.ui .................... SKIPPED
[INFO] Trace Compass RCP Feature .......................... SKIPPED
[INFO] Trace Compass RCP Product .......................... SKIPPED
[INFO] Trace Compass RCP Product Tests .................... SKIPPED
[INFO] Trace Compass Release Engineering Parent ........... SKIPPED
[INFO] Trace Compass Target Platform ...................... SKIPPED
[INFO] org.eclipse.tracecompass.tmf.analysis.xml.core.tests SKIPPED
[INFO] org.eclipse.tracecompass.tmf.analysis.xml.ui.swtbot.tests SKIPPED
[INFO] org.eclipse.tracecompass.integration.swtbot.tests .. SKIPPED
[INFO] org.eclipse.tracecompass.segmentstore.core.tests ... SKIPPED
[INFO] org.eclipse.tracecompass.tmf.remote.ui.swtbot.tests  SKIPPED
[INFO] org.eclipse.tracecompass.tmf.analysis.xml.ui.tests . SKIPPED
[INFO] org.eclipse.tracecompass.tmf.remote.ui.tests ....... SKIPPED
[INFO] Trace Compass All Tests ............................ SKIPPED
[INFO] org.eclipse.tracecompass.testing ................... SKIPPED
[INFO] org.eclipse.tracecompass.tmf.remote ................ SKIPPED
[INFO] Trace Compass Repository ........................... SKIPPED
[INFO] org.eclipse.tracecompass.datastore.core.tests ...... SKIPPED
[INFO] org.eclipse.tracecompass.tmf.chart.core.tests ...... SKIPPED
[INFO] org.eclipse.tracecompass.tmf.chart.ui.tests ........ SKIPPED
[INFO] ------------------------------------------------------------------------
[INFO] BUILD FAILURE
[INFO] ------------------------------------------------------------------------
[INFO] Total time: 13:03 min
[INFO] Finished at: 2017-02-22T03:17:13+00:00
[INFO] Final Memory: 156M/374M
[INFO] ------------------------------------------------------------------------
[INFO] o.h.m.e.h.MavenExecutionResultHandler - Build failed with exception(s)
[INFO] o.h.m.e.h.MavenExecutionResultHandler - [1] org.apache.maven.lifecycle.LifecycleExecutionException: Failed to execute goal org.eclipse.cbi.maven.plugins:eclipse-jarsigner-plugin:1.1.3:sign (sign) on project org.eclipse.tracecompass.common.core: [Wed Feb 22 03:17:12 UTC 2017] Unable to sign jar '/home/hudson/hudson-slave/workspace/tracecompass-stable-release-nightly/common/org.eclipse.tracecompass.common.core/target/org.eclipse.tracecompass.common.core-2.2.0-SNAPSHOT.jar'
[DEBUG] Closing connection to remote
[ERROR] Failed to execute goal org.eclipse.cbi.maven.plugins:eclipse-jarsigner-plugin:1.1.3:sign (sign) on project org.eclipse.tracecompass.common.core: [Wed Feb 22 03:17:12 UTC 2017] Unable to sign jar '/home/hudson/hudson-slave/workspace/tracecompass-stable-release-nightly/common/org.eclipse.tracecompass.common.core/target/org.eclipse.tracecompass.common.core-2.2.0-SNAPSHOT.jar': Connect to build.eclipse.org:31338 [build.eclipse.org/198.41.30.203] failed: Connection timed out -> [Help 1]
[ERROR] 
[ERROR] To see the full stack trace of the errors, re-run Maven with the -e switch.
[ERROR] Re-run Maven using the -X switch to enable full debug logging.
[ERROR] 
[ERROR] For more information about the errors and possible solutions, please read the following articles:
[ERROR] [Help 1] http://cwiki.apache.org/confluence/display/MAVEN/ConnectException
[ERROR] 
[ERROR] After correcting the problems, you can resume the build with the command
[ERROR]   mvn <goals> -rf :org.eclipse.tracecompass.common.core
[DEBUG] Waiting for process to finish
[DEBUG] Result: 1
Terminating xvnc.
Recording test results
Archiving artifacts
Sending e-mails to: marc-andre.laperle@ericsson.com bernd.hufmann@ericsson.com patrick.tasse@gmail.com matthew.khouzam@ericsson.com Jean-Christian.Kouame@ericsson.com
Finished: FAILURE