FailedConsole Output

Skipping 600 KB.. Full Log
8mha:AAAAdB+LCAAAAAAAAABb85aBtbiIQSOjNKU4P0+vIKc0PTOvWK8kMze1uCQxtyC1SC8ExvbLL0llgABGJgZGLwaB3MycnMzi4My85FTXgvzkjIoiBimoScn5ecX5Oal6zhAaVS9DRQGQjgpY5xgLANcRz5yBAAAAtestGetFieldWithName(org.eclipse.tracecompass.tmf.core.tests.trace.text.TextTraceEventContentTest)  Time elapsed: 0 sec
testGetFieldWithPath(org.eclipse.tracecompass.tmf.core.tests.trace.text.TextTraceEventContentTest)  Time elapsed: 0 sec
testHashCode(org.eclipse.tracecompass.tmf.core.tests.trace.text.TextTraceEventContentTest)  Time elapsed: 0.001 sec
testGetFields(org.eclipse.tracecompass.tmf.core.tests.trace.text.TextTraceEventContentTest)  Time elapsed: 0 sec
testEventTypeInstance(org.eclipse.tracecompass.tmf.core.tests.trace.text.TextTraceEventContentTest)  Time elapsed: 0 sec
testEquals(org.eclipse.tracecompass.tmf.core.tests.trace.text.TextTraceEventContentTest)  Time elapsed: 0.001 sec
testGetFieldValueWithName(org.eclipse.tracecompass.tmf.core.tests.trace.text.TextTraceEventContentTest)  Time elapsed: 0 sec
Running org.eclipse.tracecompass.tmf.core.tests.trace.text.TextTraceTest
Tests run: 6, Failures: 0, Errors: 0, Skipped: 0, Time elapsed: 0.122 sec - in org.eclipse.tracecompass.tmf.core.tests.trace.text.TextTraceTest
testEmptyConstructor(org.eclipse.tracecompass.tmf.core.tests.trace.text.TextTraceTest)  Time elapsed: 0 sec
testValidation(org.eclipse.tracecompass.tmf.core.tests.trace.text.TextTraceTest)  Time elapsed: 0.001 sec
testLocationRatio(org.eclipse.tracecompass.tmf.core.tests.trace.text.TextTraceTest)  Time elapsed: 0.003 sec
testInitTrace(org.eclipse.tracecompass.tmf.core.tests.trace.text.TextTraceTest)  Time elapsed: 0.002 sec
testTraceParsing(org.eclipse.tracecompass.tmf.core.tests.trace.text.TextTraceTest)  Time elapsed: 0.002 sec
testTraceIndexing(org.eclipse.tracecompass.tmf.core.tests.trace.text.TextTraceTest)  Time elapsed: 0 sec
Running org.eclipse.tracecompass.tmf.core.tests.trace.TmfMultiTraceExperimentTest
Tests run: 27, Failures: 0, Errors: 0, Skipped: 0, Time elapsed: 9.34 sec - in org.eclipse.tracecompass.tmf.core.tests.trace.TmfMultiTraceExperimentTest
testGetNextAfterSeekingOnLocation_1(org.eclipse.tracecompass.tmf.core.tests.trace.TmfMultiTraceExperimentTest)  Time elapsed: 0.001 sec
testGetNextAfterSeekingOnLocation_2(org.eclipse.tracecompass.tmf.core.tests.trace.TmfMultiTraceExperimentTest)  Time elapsed: 0.001 sec
testGetNextAfterSeekingOnLocation_3(org.eclipse.tracecompass.tmf.core.tests.trace.TmfMultiTraceExperimentTest)  Time elapsed: 0.01 sec
testGetNextLocation(org.eclipse.tracecompass.tmf.core.tests.trace.TmfMultiTraceExperimentTest)  Time elapsed: 0 sec
testInitialRangeOffset(org.eclipse.tracecompass.tmf.core.tests.trace.TmfMultiTraceExperimentTest)  Time elapsed: 2.493 sec
testProcessRequestForNbEvents(org.eclipse.tracecompass.tmf.core.tests.trace.TmfMultiTraceExperimentTest)  Time elapsed: 0.106 sec
testSeekTimestampOnCacheBoundary(org.eclipse.tracecompass.tmf.core.tests.trace.TmfMultiTraceExperimentTest)  Time elapsed: 0.038 sec
testSeekRankOutOfScope(org.eclipse.tracecompass.tmf.core.tests.trace.TmfMultiTraceExperimentTest)  Time elapsed: 0.019 sec
testProcessRequestForAllEvents(org.eclipse.tracecompass.tmf.core.tests.trace.TmfMultiTraceExperimentTest)  Time elapsed: 0.337 sec
testSeekLocationNotOnCacheBoundary(org.eclipse.tracecompass.tmf.core.tests.trace.TmfMultiTraceExperimentTest)  Time elapsed: 0.064 sec
testSeekLocationOnCacheBoundary(org.eclipse.tracecompass.tmf.core.tests.trace.TmfMultiTraceExperimentTest)  Time elapsed: 0.001 sec
testSeekTimestampNotOnCacheBoundary(org.eclipse.tracecompass.tmf.core.tests.trace.TmfMultiTraceExperimentTest)  Time elapsed: 0.029 sec
testGetNextAfteSeekingOnTS_1(org.eclipse.tracecompass.tmf.core.tests.trace.TmfMultiTraceExperimentTest)  Time elapsed: 0.001 sec
testGetNextAfteSeekingOnTS_2(org.eclipse.tracecompass.tmf.core.tests.trace.TmfMultiTraceExperimentTest)  Time elapsed: 0 sec
testGetNextAfteSeekingOnTS_3(org.eclipse.tracecompass.tmf.core.tests.trace.TmfMultiTraceExperimentTest)  Time elapsed: 0.009 sec
testGetNextEndLocation(org.eclipse.tracecompass.tmf.core.tests.trace.TmfMultiTraceExperimentTest)  Time elapsed: 0.018 sec
testDefaultCurrentTimeValues(org.eclipse.tracecompass.tmf.core.tests.trace.TmfMultiTraceExperimentTest)  Time elapsed: 2.382 sec
testSeekLocationOutOfScope(org.eclipse.tracecompass.tmf.core.tests.trace.TmfMultiTraceExperimentTest)  Time elapsed: 0 sec
testBasicTmfExperimentConstructor(org.eclipse.tracecompass.tmf.core.tests.trace.TmfMultiTraceExperimentTest)  Time elapsed: 0 sec
testGetTimestamp(org.eclipse.tracecompass.tmf.core.tests.trace.TmfMultiTraceExperimentTest)  Time elapsed: 0.067 sec
testCancel(org.eclipse.tracecompass.tmf.core.tests.trace.TmfMultiTraceExperimentTest)  Time elapsed: 0.032 sec
testSeekRankNotOnCacheBoundary(org.eclipse.tracecompass.tmf.core.tests.trace.TmfMultiTraceExperimentTest)  Time elapsed: 0.028 sec
testSeekTimestampOutOfScope(org.eclipse.tracecompass.tmf.core.tests.trace.TmfMultiTraceExperimentTest)  Time elapsed: 0.019 sec
testSeekRankOnCacheBoundary(org.eclipse.tracecompass.tmf.core.tests.trace.TmfMultiTraceExperimentTest)  Time elapsed: 0 sec
testGetNextAfterSeekingOnRank_1(org.eclipse.tracecompass.tmf.core.tests.trace.TmfMultiTraceExperimentTest)  Time elapsed: 0.001 sec
testGetNextAfterSeekingOnRank_2(org.eclipse.tracecompass.tmf.core.tests.trace.TmfMultiTraceExperimentTest)  Time elapsed: 0 sec
testGetNextAfterSeekingOnRank_3(org.eclipse.tracecompass.tmf.core.tests.trace.TmfMultiTraceExperimentTest)  Time elapsed: 0.01 sec
Running org.eclipse.tracecompass.tmf.core.tests.trace.TmfExperimentTest
Tests run: 34, Failures: 0, Errors: 0, Skipped: 0, Time elapsed: 81.723 sec - in org.eclipse.tracecompass.tmf.core.tests.trace.TmfExperimentTest
testGetNextAfterSeekingOnLocation_1(org.eclipse.tracecompass.tmf.core.tests.trace.TmfExperimentTest)  Time elapsed: 2.328 sec
testGetNextAfterSeekingOnLocation_2(org.eclipse.tracecompass.tmf.core.tests.trace.TmfExperimentTest)  Time elapsed: 2.393 sec
testGetNextAfterSeekingOnLocation_3(org.eclipse.tracecompass.tmf.core.tests.trace.TmfExperimentTest)  Time elapsed: 2.351 sec
testGetNextLocation(org.eclipse.tracecompass.tmf.core.tests.trace.TmfExperimentTest)  Time elapsed: 2.365 sec
testProcessRequestForNbEvents(org.eclipse.tracecompass.tmf.core.tests.trace.TmfExperimentTest)  Time elapsed: 2.38 sec
testSeekTimestampOnCacheBoundary(org.eclipse.tracecompass.tmf.core.tests.trace.TmfExperimentTest)  Time elapsed: 2.403 sec
testSeekRankOutOfScope(org.eclipse.tracecompass.tmf.core.tests.trace.TmfExperimentTest)  Time elapsed: 2.365 sec
testProcessRequestForAllEvents(org.eclipse.tracecompass.tmf.core.tests.trace.TmfExperimentTest)  Time elapsed: 2.52 sec
testSeekLocationNotOnCacheBoundary(org.eclipse.tracecompass.tmf.core.tests.trace.TmfExperimentTest)  Time elapsed: 2.373 sec
testSeekLocationOnCacheBoundary(org.eclipse.tracecompass.tmf.core.tests.trace.TmfExperimentTest)  Time elapsed: 2.348 sec
testSimpleTmfExperimentConstructor(org.eclipse.tracecompass.tmf.core.tests.trace.TmfExperimentTest)  Time elapsed: 2.364 sec
testExperimentInitialization(org.eclipse.tracecompass.tmf.core.tests.trace.TmfExperimentTest)  Time elapsed: 3.47 sec
testSeekNoTrace(org.eclipse.tracecompass.tmf.core.tests.trace.TmfExperimentTest)  Time elapsed: 2.331 sec
testSeekTimestampNotOnCacheBoundary(org.eclipse.tracecompass.tmf.core.tests.trace.TmfExperimentTest)  Time elapsed: 2.36 sec
testGetNextAfteSeekingOnTS_1(org.eclipse.tracecompass.tmf.core.tests.trace.TmfExperimentTest)  Time elapsed: 2.353 sec
testGetNextAfteSeekingOnTS_2(org.eclipse.tracecompass.tmf.core.tests.trace.TmfExperimentTest)  Time elapsed: 2.422 sec
testGetNextAfteSeekingOnTS_3(org.eclipse.tracecompass.tmf.core.tests.trace.TmfExperimentTest)  Time elapsed: 2.453 sec
testGetNextEndLocation(org.eclipse.tracecompass.tmf.core.tests.trace.TmfExperimentTest)  Time elapsed: 2.315 sec
testGetLocationRatio(org.eclipse.tracecompass.tmf.core.tests.trace.TmfExperimentTest)  Time elapsed: 2.433 sec
testSeekBadLocation(org.eclipse.tracecompass.tmf.core.tests.trace.TmfExperimentTest)  Time elapsed: 2.302 sec
testSeekLocationOutOfScope(org.eclipse.tracecompass.tmf.core.tests.trace.TmfExperimentTest)  Time elapsed: 2.357 sec
testGetTimestamp(org.eclipse.tracecompass.tmf.core.tests.trace.TmfExperimentTest)  Time elapsed: 2.404 sec
testWithMultiHostClockOffset(org.eclipse.tracecompass.tmf.core.tests.trace.TmfExperimentTest)  Time elapsed: 2.366 sec
testSeekEventOnRatio(org.eclipse.tracecompass.tmf.core.tests.trace.TmfExperimentTest)  Time elapsed: 2.371 sec
testCancel(org.eclipse.tracecompass.tmf.core.tests.trace.TmfExperimentTest)  Time elapsed: 2.374 sec
testSeekRankNotOnCacheBoundary(org.eclipse.tracecompass.tmf.core.tests.trace.TmfExperimentTest)  Time elapsed: 2.407 sec
testSeekTimestampOutOfScope(org.eclipse.tracecompass.tmf.core.tests.trace.TmfExperimentTest)  Time elapsed: 2.34 sec
testNormalTmfExperimentConstructor(org.eclipse.tracecompass.tmf.core.tests.trace.TmfExperimentTest)  Time elapsed: 2.451 sec
testWithSingleHostClockOffset(org.eclipse.tracecompass.tmf.core.tests.trace.TmfExperimentTest)  Time elapsed: 2.343 sec
testSeekRankOnCacheBoundary(org.eclipse.tracecompass.tmf.core.tests.trace.TmfExperimentTest)  Time elapsed: 2.337 sec
testGetNextAfterSeekingOnRank_1(org.eclipse.tracecompass.tmf.core.tests.trace.TmfExperimentTest)  Time elapsed: 2.31 sec
testGetNextAfterSeekingOnRank_2(org.eclipse.tracecompass.tmf.core.tests.trace.TmfExperimentTest)  Time elapsed: 2.37 sec
testGetNextAfterSeekingOnRank_3(org.eclipse.tracecompass.tmf.core.tests.trace.TmfExperimentTest)  Time elapsed: 2.344 sec
testGetAnalysisModules(org.eclipse.tracecompass.tmf.core.tests.trace.TmfExperimentTest)  Time elapsed: 2.312 sec
Running org.eclipse.tracecompass.tmf.core.tests.trace.stub.XmlStubTraceTest
Tests run: 3, Failures: 0, Errors: 0, Skipped: 0, Time elapsed: 1.237 sec - in org.eclipse.tracecompass.tmf.core.tests.trace.stub.XmlStubTraceTest
testAspects(org.eclipse.tracecompass.tmf.core.tests.trace.stub.XmlStubTraceTest)  Time elapsed: 0.088 sec
testValidate(org.eclipse.tracecompass.tmf.core.tests.trace.stub.XmlStubTraceTest)  Time elapsed: 0.031 sec
testDevelopmentTrace(org.eclipse.tracecompass.tmf.core.tests.trace.stub.XmlStubTraceTest)  Time elapsed: 1.117 sec
Running org.eclipse.tracecompass.tmf.core.tests.trace.TmfContextTest
Tests run: 15, Failures: 0, Errors: 0, Skipped: 0, Time elapsed: 0.003 sec - in org.eclipse.tracecompass.tmf.core.tests.trace.TmfContextTest
testTmfContext(org.eclipse.tracecompass.tmf.core.tests.trace.TmfContextTest)  Time elapsed: 0 sec
testIncreaseRank(org.eclipse.tracecompass.tmf.core.tests.trace.TmfContextTest)  Time elapsed: 0 sec
testSetLocation(org.eclipse.tracecompass.tmf.core.tests.trace.TmfContextTest)  Time elapsed: 0 sec
testToString(org.eclipse.tracecompass.tmf.core.tests.trace.TmfContextTest)  Time elapsed: 0 sec
testTmfContextDefault(org.eclipse.tracecompass.tmf.core.tests.trace.TmfContextTest)  Time elapsed: 0 sec
testEqualsNull(org.eclipse.tracecompass.tmf.core.tests.trace.TmfContextTest)  Time elapsed: 0 sec
testTmfContextCopy(org.eclipse.tracecompass.tmf.core.tests.trace.TmfContextTest)  Time elapsed: 0 sec
testNonEquals(org.eclipse.tracecompass.tmf.core.tests.trace.TmfContextTest)  Time elapsed: 0.001 sec
testEqualsSymmetry(org.eclipse.tracecompass.tmf.core.tests.trace.TmfContextTest)  Time elapsed: 0 sec
testTmfContextCopy2(org.eclipse.tracecompass.tmf.core.tests.trace.TmfContextTest)  Time elapsed: 0 sec
testHashCode(org.eclipse.tracecompass.tmf.core.tests.trace.TmfContextTest)  Time elapsed: 0 sec
testEqualsTransivity(org.eclipse.tracecompass.tmf.core.tests.trace.TmfContextTest)  Time elapsed: 0 sec
testEqualsReflexivity(org.eclipse.tracecompass.tmf.core.tests.trace.TmfContextTest)  Time elapsed: 0 sec
testTmfContextNoRank(org.eclipse.tracecompass.tmf.core.tests.trace.TmfContextTest)  Time elapsed: 0 sec
testSetRank(org.eclipse.tracecompass.tmf.core.tests.trace.TmfContextTest)  Time elapsed: 0 sec
Running org.eclipse.tracecompass.tmf.core.tests.parsers.custom.CustomXmlIndexTest
Tests run: 2, Failures: 1, Errors: 0, Skipped: 0, Time elapsed: 7.581 sec <<< FAILURE! - in org.eclipse.tracecompass.tmf.core.tests.parsers.custom.CustomXmlIndexTest
testReopenIndex(org.eclipse.tracecompass.tmf.core.tests.parsers.custom.CustomXmlIndexTest)  Time elapsed: 4.765 sec  <<< FAILURE!
java.lang.AssertionError: null
	at org.junit.Assert.fail(Assert.java:86)
	at org.junit.Assert.assertTrue(Assert.java:41)
	at org.junit.Assert.assertTrue(Assert.java:52)
	at org.eclipse.tracecompass.tmf.core.tests.parsers.custom.AbstractCustomTraceIndexTest.verifyIndexContent(AbstractCustomTraceIndexTest.java:175)
	at org.eclipse.tracecompass.tmf.core.tests.parsers.custom.AbstractCustomTraceIndexTest.testReopenIndex(AbstractCustomTraceIndexTest.java:191)
	at sun.reflect.NativeMethodAccessorImpl.invoke0(Native Method)
	at sun.reflect.NativeMethodAccessorImpl.invoke(NativeMethodAccessorImpl.java:62)
	at sun.reflect.DelegatingMethodAccessorImpl.invoke(DelegatingMethodAccessorImpl.java:43)
	at java.lang.reflect.Method.invoke(Method.java:498)
	at org.junit.runners.model.FrameworkMethod$1.runReflectiveCall(FrameworkMethod.java:50)
	at org.junit.internal.runners.model.ReflectiveCallable.run(ReflectiveCallable.java:12)
	at org.junit.runners.model.FrameworkMethod.invokeExplosively(FrameworkMethod.java:47)
	at org.junit.internal.runners.statements.InvokeMethod.evaluate(InvokeMethod.java:17)
	at org.junit.internal.runners.statements.RunBefores.evaluate(RunBefores.java:26)
	at org.junit.internal.runners.statements.RunAfters.evaluate(RunAfters.java:27)
	at org.junit.runners.ParentRunner.runLeaf(ParentRunner.java:325)
	at org.junit.runners.BlockJUnit4ClassRunner.runChild(BlockJUnit4ClassRunner.java:78)
	at org.junit.runners.BlockJUnit4ClassRunner.runChild(BlockJUnit4ClassRunner.java:57)
	at org.junit.runners.ParentRunner$3.run(ParentRunner.java:290)
	at org.junit.runners.ParentRunner$1.schedule(ParentRunner.java:71)
	at org.junit.runners.ParentRunner.runChildren(ParentRunner.java:288)
	at org.junit.runners.ParentRunner.access$000(ParentRunner.java:58)
	at org.junit.runners.ParentRunner$2.evaluate(ParentRunner.java:268)
	at org.junit.runners.ParentRunner.run(ParentRunner.java:363)
	at org.apache.maven.surefire.junit4.JUnit4Provider.execute(JUnit4Provider.java:264)
	at org.apache.maven.surefire.junit4.JUnit4Provider.executeTestSet(JUnit4Provider.java:153)
	at org.apache.maven.surefire.junit4.JUnit4Provider.invoke(JUnit4Provider.java:124)
	at sun.reflect.NativeMethodAccessorImpl.invoke0(Native Method)
	at sun.reflect.NativeMethodAccessorImpl.invoke(NativeMethodAccessorImpl.java:62)
	at sun.reflect.DelegatingMethodAccessorImpl.invoke(DelegatingMethodAccessorImpl.java:43)
	at java.lang.reflect.Method.invoke(Method.java:498)
	at org.apache.maven.surefire.util.ReflectionUtils.invokeMethodWithArray2(ReflectionUtils.java:208)
	at org.apache.maven.surefire.booter.ProviderFactory$ProviderProxy.invoke(ProviderFactory.java:156)
	at org.apache.maven.surefire.booter.ProviderFactory.invokeProvider(ProviderFactory.java:82)
	at org.eclipse.tycho.surefire.osgibooter.OsgiSurefireBooter.run(OsgiSurefireBooter.java:95)
	at org.eclipse.tycho.surefire.osgibooter.HeadlessTestApplication.run(HeadlessTestApplication.java:21)
	at sun.reflect.NativeMethodAccessorImpl.invoke0(Native Method)
	at sun.reflect.NativeMethodAccessorImpl.invoke(NativeMethodAccessorImpl.java:62)
	at sun.reflect.DelegatingMethodAccessorImpl.invoke(DelegatingMethodAccessorImpl.java:43)
	at java.lang.reflect.Method.invoke(Method.java:498)
	at org.eclipse.equinox.internal.app.EclipseAppContainer.callMethodWithException(EclipseAppContainer.java:587)
	at org.eclipse.equinox.internal.app.EclipseAppHandle.run(EclipseAppHandle.java:198)
	at org.eclipse.core.runtime.internal.adaptor.EclipseAppLauncher.runApplication(EclipseAppLauncher.java:134)
	at org.eclipse.core.runtime.internal.adaptor.EclipseAppLauncher.start(EclipseAppLauncher.java:104)
	at org.eclipse.core.runtime.adaptor.EclipseStarter.run(EclipseStarter.java:388)
	at org.eclipse.core.runtime.adaptor.EclipseStarter.run(EclipseStarter.java:243)
	at sun.reflect.NativeMethodAccessorImpl.invoke0(Native Method)
	at sun.reflect.NativeMethodAccessorImpl.invoke(NativeMethodAccessorImpl.java:62)
	at sun.reflect.DelegatingMethodAccessorImpl.invoke(DelegatingMethodAccessorImpl.java:43)
	at java.lang.reflect.Method.invoke(Method.java:498)
	at org.eclipse.equinox.launcher.Main.invokeFramework(Main.java:673)
	at org.eclipse.equinox.launcher.Main.basicRun(Main.java:610)
	at org.eclipse.equinox.launcher.Main.run(Main.java:1519)
	at org.eclipse.equinox.launcher.Main.main(Main.java:1492)

testTmfTraceIndexing(org.eclipse.tracecompass.tmf.core.tests.parsers.custom.CustomXmlIndexTest)  Time elapsed: 2.814 sec
Running org.eclipse.tracecompass.tmf.core.tests.parsers.custom.CustomTxtExtensionTest
Tests run: 2, Failures: 0, Errors: 0, Skipped: 0, Time elapsed: 0.015 sec - in org.eclipse.tracecompass.tmf.core.tests.parsers.custom.CustomTxtExtensionTest
testValidate(org.eclipse.tracecompass.tmf.core.tests.parsers.custom.CustomTxtExtensionTest)  Time elapsed: 0.014 sec
testTraceTypePresence(org.eclipse.tracecompass.tmf.core.tests.parsers.custom.CustomTxtExtensionTest)  Time elapsed: 0 sec
Running org.eclipse.tracecompass.tmf.core.tests.parsers.custom.CustomXmlTraceValidTest
Tests run: 3, Failures: 0, Errors: 0, Skipped: 0, Time elapsed: 0.012 sec - in org.eclipse.tracecompass.tmf.core.tests.parsers.custom.CustomXmlTraceValidTest
testValid[0: path /jobs/genie.tracecompass/tracecompass-stable-release-nightly/workspace/tmf/org.eclipse.tracecompass.tmf.core.tests/testfiles/xml/valid/001.xml](org.eclipse.tracecompass.tmf.core.tests.parsers.custom.CustomXmlTraceValidTest)  Time elapsed: 0.001 sec
testValid[1: path /jobs/genie.tracecompass/tracecompass-stable-release-nightly/workspace/tmf/org.eclipse.tracecompass.tmf.core.tests/testfiles/xml/valid/002.xml](org.eclipse.tracecompass.tmf.core.tests.parsers.custom.CustomXmlTraceValidTest)  Time elapsed: 0 sec
testValid[2: path /jobs/genie.tracecompass/tracecompass-stable-release-nightly/workspace/tmf/org.eclipse.tracecompass.tmf.core.tests/testfiles/xml/valid/003.xml](org.eclipse.tracecompass.tmf.core.tests.parsers.custom.CustomXmlTraceValidTest)  Time elapsed: 0 sec
Running org.eclipse.tracecompass.tmf.core.tests.parsers.custom.CustomXmlTraceBadlyFormedTest
Tests run: 3, Failures: 0, Errors: 0, Skipped: 0, Time elapsed: 0.003 sec - in org.eclipse.tracecompass.tmf.core.tests.parsers.custom.CustomXmlTraceBadlyFormedTest
testBadlyFormed[0: path /jobs/genie.tracecompass/tracecompass-stable-release-nightly/workspace/tmf/org.eclipse.tracecompass.tmf.core.tests/testfiles/xml/malformed/001.xml](org.eclipse.tracecompass.tmf.core.tests.parsers.custom.CustomXmlTraceBadlyFormedTest)  Time elapsed: 0 sec
testBadlyFormed[1: path /jobs/genie.tracecompass/tracecompass-stable-release-nightly/workspace/tmf/org.eclipse.tracecompass.tmf.core.tests/testfiles/xml/malformed/002.xml](org.eclipse.tracecompass.tmf.core.tests.parsers.custom.CustomXmlTraceBadlyFormedTest)  Time elapsed: 0 sec
testBadlyFormed[2: path /jobs/genie.tracecompass/tracecompass-stable-release-nightly/workspace/tmf/org.eclipse.tracecompass.tmf.core.tests/testfiles/xml/malformed/003.xml](org.eclipse.tracecompass.tmf.core.tests.parsers.custom.CustomXmlTraceBadlyFormedTest)  Time elapsed: 0.001 sec
Running org.eclipse.tracecompass.tmf.core.tests.parsers.custom.CustomXmlExtensionTest
Tests run: 2, Failures: 0, Errors: 0, Skipped: 0, Time elapsed: 0.007 sec - in org.eclipse.tracecompass.tmf.core.tests.parsers.custom.CustomXmlExtensionTest
testValidate(org.eclipse.tracecompass.tmf.core.tests.parsers.custom.CustomXmlExtensionTest)  Time elapsed: 0.006 sec
testTraceTypePresence(org.eclipse.tracecompass.tmf.core.tests.parsers.custom.CustomXmlExtensionTest)  Time elapsed: 0 sec
Running org.eclipse.tracecompass.tmf.core.tests.parsers.custom.CustomXmlTraceInvalidTest
Tests run: 6, Failures: 0, Errors: 0, Skipped: 0, Time elapsed: 0.007 sec - in org.eclipse.tracecompass.tmf.core.tests.parsers.custom.CustomXmlTraceInvalidTest
testInvalid[0: path /jobs/genie.tracecompass/tracecompass-stable-release-nightly/workspace/tmf/org.eclipse.tracecompass.tmf.core.tests/testfiles/xml/invalid/001.xml](org.eclipse.tracecompass.tmf.core.tests.parsers.custom.CustomXmlTraceInvalidTest)  Time elapsed: 0.001 sec
testInvalid[1: path /jobs/genie.tracecompass/tracecompass-stable-release-nightly/workspace/tmf/org.eclipse.tracecompass.tmf.core.tests/testfiles/xml/invalid/002.xml](org.eclipse.tracecompass.tmf.core.tests.parsers.custom.CustomXmlTraceInvalidTest)  Time elapsed: 0.001 sec
testInvalid[2: path /jobs/genie.tracecompass/tracecompass-stable-release-nightly/workspace/tmf/org.eclipse.tracecompass.tmf.core.tests/testfiles/xml/invalid/003.xml](org.eclipse.tracecompass.tmf.core.tests.parsers.custom.CustomXmlTraceInvalidTest)  Time elapsed: 0.001 sec
testInvalid[3: path /jobs/genie.tracecompass/tracecompass-stable-release-nightly/workspace/tmf/org.eclipse.tracecompass.tmf.core.tests/testfiles/xml/invalid/004.xml](org.eclipse.tracecompass.tmf.core.tests.parsers.custom.CustomXmlTraceInvalidTest)  Time elapsed: 0 sec
testInvalid[4: path /jobs/genie.tracecompass/tracecompass-stable-release-nightly/workspace/tmf/org.eclipse.tracecompass.tmf.core.tests/testfiles/xml/invalid/005.xml](org.eclipse.tracecompass.tmf.core.tests.parsers.custom.CustomXmlTraceInvalidTest)  Time elapsed: 0 sec
testInvalid[5: path /jobs/genie.tracecompass/tracecompass-stable-release-nightly/workspace/tmf/org.eclipse.tracecompass.tmf.core.tests/testfiles/xml/invalid/006.xml](org.eclipse.tracecompass.tmf.core.tests.parsers.custom.CustomXmlTraceInvalidTest)  Time elapsed: 0.001 sec
Running org.eclipse.tracecompass.tmf.core.tests.parsers.custom.CustomTxtIndexTest
Tests run: 2, Failures: 0, Errors: 0, Skipped: 0, Time elapsed: 3.978 sec - in org.eclipse.tracecompass.tmf.core.tests.parsers.custom.CustomTxtIndexTest
testReopenIndex(org.eclipse.tracecompass.tmf.core.tests.parsers.custom.CustomTxtIndexTest)  Time elapsed: 2.653 sec
testTmfTraceIndexing(org.eclipse.tracecompass.tmf.core.tests.parsers.custom.CustomTxtIndexTest)  Time elapsed: 1.324 sec
Running org.eclipse.tracecompass.tmf.core.tests.parsers.custom.CustomTxtTraceDataTest
Tests run: 3, Failures: 0, Errors: 0, Skipped: 0, Time elapsed: 0.022 sec - in org.eclipse.tracecompass.tmf.core.tests.parsers.custom.CustomTxtTraceDataTest
testReadingEvents[0: Base parser](org.eclipse.tracecompass.tmf.core.tests.parsers.custom.CustomTxtTraceDataTest)  Time elapsed: 0.008 sec
testReadingEvents[1: Parse with event name](org.eclipse.tracecompass.tmf.core.tests.parsers.custom.CustomTxtTraceDataTest)  Time elapsed: 0.004 sec
testReadingEvents[2: Parse with extra fields](org.eclipse.tracecompass.tmf.core.tests.parsers.custom.CustomTxtTraceDataTest)  Time elapsed: 0.005 sec
Running org.eclipse.tracecompass.tmf.core.tests.parsers.custom.CustomXmlTraceDataTest
Tests run: 3, Failures: 0, Errors: 0, Skipped: 0, Time elapsed: 0.029 sec - in org.eclipse.tracecompass.tmf.core.tests.parsers.custom.CustomXmlTraceDataTest
testReadingEvents[0: Base parser](org.eclipse.tracecompass.tmf.core.tests.parsers.custom.CustomXmlTraceDataTest)  Time elapsed: 0.008 sec
testReadingEvents[1: Parse with event name](org.eclipse.tracecompass.tmf.core.tests.parsers.custom.CustomXmlTraceDataTest)  Time elapsed: 0.007 sec
testReadingEvents[2: Parse with extra fields](org.eclipse.tracecompass.tmf.core.tests.parsers.custom.CustomXmlTraceDataTest)  Time elapsed: 0.008 sec
Running org.eclipse.tracecompass.tmf.core.tests.statesystem.mipmap.TmfMipmapStateProviderTest
Tests run: 11, Failures: 0, Errors: 0, Skipped: 0, Time elapsed: 0.689 sec - in org.eclipse.tracecompass.tmf.core.tests.statesystem.mipmap.TmfMipmapStateProviderTest
testQueryMipAvg(org.eclipse.tracecompass.tmf.core.tests.statesystem.mipmap.TmfMipmapStateProviderTest)  Time elapsed: 0.032 sec
testQueryMipMax(org.eclipse.tracecompass.tmf.core.tests.statesystem.mipmap.TmfMipmapStateProviderTest)  Time elapsed: 0.012 sec
testQueryMipMin(org.eclipse.tracecompass.tmf.core.tests.statesystem.mipmap.TmfMipmapStateProviderTest)  Time elapsed: 0.01 sec
testQuery(org.eclipse.tracecompass.tmf.core.tests.statesystem.mipmap.TmfMipmapStateProviderTest)  Time elapsed: 0.013 sec
testQueryValuesOnClose(org.eclipse.tracecompass.tmf.core.tests.statesystem.mipmap.TmfMipmapStateProviderTest)  Time elapsed: 0 sec
testQueryValuesOnStart(org.eclipse.tracecompass.tmf.core.tests.statesystem.mipmap.TmfMipmapStateProviderTest)  Time elapsed: 0.014 sec
testQueryMipmapRangeAvg(org.eclipse.tracecompass.tmf.core.tests.statesystem.mipmap.TmfMipmapStateProviderTest)  Time elapsed: 0.112 sec
testQueryMipmapRangeMax(org.eclipse.tracecompass.tmf.core.tests.statesystem.mipmap.TmfMipmapStateProviderTest)  Time elapsed: 0.091 sec
testQueryMipmapRangeMin(org.eclipse.tracecompass.tmf.core.tests.statesystem.mipmap.TmfMipmapStateProviderTest)  Time elapsed: 0.078 sec
testMaxLevel(org.eclipse.tracecompass.tmf.core.tests.statesystem.mipmap.TmfMipmapStateProviderTest)  Time elapsed: 0.007 sec
testQueryEventField(org.eclipse.tracecompass.tmf.core.tests.statesystem.mipmap.TmfMipmapStateProviderTest)  Time elapsed: 0.009 sec
Running org.eclipse.tracecompass.tmf.core.tests.statesystem.mipmap.TmfMipmapStateProviderWeightedTest
Tests run: 6, Failures: 0, Errors: 0, Skipped: 0, Time elapsed: 0.21 sec - in org.eclipse.tracecompass.tmf.core.tests.statesystem.mipmap.TmfMipmapStateProviderWeightedTest
testQueryMipmapRangeMinInteger(org.eclipse.tracecompass.tmf.core.tests.statesystem.mipmap.TmfMipmapStateProviderWeightedTest)  Time elapsed: 0.001 sec
testQueryMipmapRangeMaxDouble(org.eclipse.tracecompass.tmf.core.tests.statesystem.mipmap.TmfMipmapStateProviderWeightedTest)  Time elapsed: 0.001 sec
testQueryMipmapRangeAvgDouble(org.eclipse.tracecompass.tmf.core.tests.statesystem.mipmap.TmfMipmapStateProviderWeightedTest)  Time elapsed: 0.001 sec
testQueryMipmapRangeAvgInteger(org.eclipse.tracecompass.tmf.core.tests.statesystem.mipmap.TmfMipmapStateProviderWeightedTest)  Time elapsed: 0.001 sec
testQueryMipmapRangeMinDouble(org.eclipse.tracecompass.tmf.core.tests.statesystem.mipmap.TmfMipmapStateProviderWeightedTest)  Time elapsed: 0 sec
testQueryMipmapRangeMaxInteger(org.eclipse.tracecompass.tmf.core.tests.statesystem.mipmap.TmfMipmapStateProviderWeightedTest)  Time elapsed: 0.001 sec
Running org.eclipse.tracecompass.tmf.core.tests.statesystem.AttributePoolTest
Tests run: 8, Failures: 0, Errors: 0, Skipped: 0, Time elapsed: 0.005 sec - in org.eclipse.tracecompass.tmf.core.tests.statesystem.AttributePoolTest
testSimplePool(org.eclipse.tracecompass.tmf.core.tests.statesystem.AttributePoolTest)  Time elapsed: 0.003 sec
testConstructorBad2(org.eclipse.tracecompass.tmf.core.tests.statesystem.AttributePoolTest)  Time elapsed: 0 sec
testConstructorGood(org.eclipse.tracecompass.tmf.core.tests.statesystem.AttributePoolTest)  Time elapsed: 0 sec
testRecycleWrongQuark(org.eclipse.tracecompass.tmf.core.tests.statesystem.AttributePoolTest)  Time elapsed: 0 sec
testRecycleChildQuark(org.eclipse.tracecompass.tmf.core.tests.statesystem.AttributePoolTest)  Time elapsed: 0 sec
testPoolWithSubTree(org.eclipse.tracecompass.tmf.core.tests.statesystem.AttributePoolTest)  Time elapsed: 0 sec
testConstructorBad(org.eclipse.tracecompass.tmf.core.tests.statesystem.AttributePoolTest)  Time elapsed: 0 sec
testPriorityPool(org.eclipse.tracecompass.tmf.core.tests.statesystem.AttributePoolTest)  Time elapsed: 0.001 sec
Running org.eclipse.tracecompass.tmf.core.tests.statesystem.StateSystemAnalysisModuleTest

!ENTRY org.eclipse.tracecompass.tmf.core 4 0 2017-02-18 05:06:30.073
!MESSAGE An uncaught exception happened on request [TestStateSystemModule$TestStateSystemRequest(367,ITmfEvent,BACKGROUND,TmfTimeRange [fStartTime=19:12:43.145 224 192, fEndTime=19:47:16.854 775 807],0,2147483647,0)]: This exception is desired and part of the test
Tests run: 7, Failures: 0, Errors: 0, Skipped: 1, Time elapsed: 4.496 sec - in org.eclipse.tracecompass.tmf.core.tests.statesystem.StateSystemAnalysisModuleTest
testProperties(org.eclipse.tracecompass.tmf.core.tests.statesystem.StateSystemAnalysisModuleTest)  Time elapsed: 0.023 sec
testIsQueryable(org.eclipse.tracecompass.tmf.core.tests.statesystem.StateSystemAnalysisModuleTest)  Time elapsed: 1.12 sec
testIsQueryableCancel(org.eclipse.tracecompass.tmf.core.tests.statesystem.StateSystemAnalysisModuleTest) skipped
testReReadFullAnalysis(org.eclipse.tracecompass.tmf.core.tests.statesystem.StateSystemAnalysisModuleTest)  Time elapsed: 1.114 sec
testRequestFailure(org.eclipse.tracecompass.tmf.core.tests.statesystem.StateSystemAnalysisModuleTest)  Time elapsed: 1.115 sec
testSsModule(org.eclipse.tracecompass.tmf.core.tests.statesystem.StateSystemAnalysisModuleTest)  Time elapsed: 1.112 sec
testInitialization(org.eclipse.tracecompass.tmf.core.tests.statesystem.StateSystemAnalysisModuleTest)  Time elapsed: 0.009 sec
Running org.eclipse.tracecompass.tmf.core.tests.statesystem.ExperimentStateSystemModuleTest
Tests run: 2, Failures: 0, Errors: 0, Skipped: 0, Time elapsed: 1.326 sec - in org.eclipse.tracecompass.tmf.core.tests.statesystem.ExperimentStateSystemModuleTest
testSsModule(org.eclipse.tracecompass.tmf.core.tests.statesystem.ExperimentStateSystemModuleTest)  Time elapsed: 1.32 sec
testInitialization(org.eclipse.tracecompass.tmf.core.tests.statesystem.ExperimentStateSystemModuleTest)  Time elapsed: 0.004 sec
Running org.eclipse.tracecompass.tmf.core.tests.model.TmfTraceCoreUtilsTest
Tests run: 1, Failures: 0, Errors: 0, Skipped: 0, Time elapsed: 0.002 sec - in org.eclipse.tracecompass.tmf.core.tests.model.TmfTraceCoreUtilsTest
testValidateName(org.eclipse.tracecompass.tmf.core.tests.model.TmfTraceCoreUtilsTest)  Time elapsed: 0.002 sec
Running org.eclipse.tracecompass.tmf.core.tests.component.TmfEventProviderTest
Tests run: 6, Failures: 0, Errors: 0, Skipped: 0, Time elapsed: 7.35 sec - in org.eclipse.tracecompass.tmf.core.tests.component.TmfEventProviderTest
testGetPlainEvents(org.eclipse.tracecompass.tmf.core.tests.component.TmfEventProviderTest)  Time elapsed: 1.221 sec
testGetSyntheticEvents_TimeRange(org.eclipse.tracecompass.tmf.core.tests.component.TmfEventProviderTest)  Time elapsed: 1.303 sec
testGetProviders(org.eclipse.tracecompass.tmf.core.tests.component.TmfEventProviderTest)  Time elapsed: 1.148 sec
testCancelRequests(org.eclipse.tracecompass.tmf.core.tests.component.TmfEventProviderTest)  Time elapsed: 1.219 sec
testGetSyntheticEvents_EqualBlockSizes(org.eclipse.tracecompass.tmf.core.tests.component.TmfEventProviderTest)  Time elapsed: 1.318 sec
testGetProviders2(org.eclipse.tracecompass.tmf.core.tests.component.TmfEventProviderTest)  Time elapsed: 1.139 sec
Running org.eclipse.tracecompass.tmf.core.tests.component.TmfProviderManagerTest
Tests run: 5, Failures: 0, Errors: 0, Skipped: 0, Time elapsed: 0.007 sec - in org.eclipse.tracecompass.tmf.core.tests.component.TmfProviderManagerTest
testGetProvider(org.eclipse.tracecompass.tmf.core.tests.component.TmfProviderManagerTest)  Time elapsed: 0.004 sec
testRegister_0(org.eclipse.tracecompass.tmf.core.tests.component.TmfProviderManagerTest)  Time elapsed: 0 sec
testRegister_Unregister_1(org.eclipse.tracecompass.tmf.core.tests.component.TmfProviderManagerTest)  Time elapsed: 0.001 sec
testRegister_Unregister_2(org.eclipse.tracecompass.tmf.core.tests.component.TmfProviderManagerTest)  Time elapsed: 0 sec
testRegister_Unregister_3(org.eclipse.tracecompass.tmf.core.tests.component.TmfProviderManagerTest)  Time elapsed: 0.001 sec
Running org.eclipse.tracecompass.tmf.core.tests.component.TmfEventProviderCoalescingTest
Tests run: 10, Failures: 0, Errors: 0, Skipped: 0, Time elapsed: 5.802 sec - in org.eclipse.tracecompass.tmf.core.tests.component.TmfEventProviderCoalescingTest
testChildrenFirstCoalescing2(org.eclipse.tracecompass.tmf.core.tests.component.TmfEventProviderCoalescingTest)  Time elapsed: 0.437 sec
testTraceDependencyBackground(org.eclipse.tracecompass.tmf.core.tests.component.TmfEventProviderCoalescingTest)  Time elapsed: 0.361 sec
testChildrenFirstCoalescing(org.eclipse.tracecompass.tmf.core.tests.component.TmfEventProviderCoalescingTest)  Time elapsed: 0.447 sec
testMultipleRequestsCoalescing(org.eclipse.tracecompass.tmf.core.tests.component.TmfEventProviderCoalescingTest)  Time elapsed: 0.396 sec
testChildFirstDependencyBackground(org.eclipse.tracecompass.tmf.core.tests.component.TmfEventProviderCoalescingTest)  Time elapsed: 0.764 sec
testParentDependencyBackground(org.eclipse.tracecompass.tmf.core.tests.component.TmfEventProviderCoalescingTest)  Time elapsed: 0.799 sec
testMixedOrderCoalescing(org.eclipse.tracecompass.tmf.core.tests.component.TmfEventProviderCoalescingTest)  Time elapsed: 0.442 sec
testMixedCoalescing2(org.eclipse.tracecompass.tmf.core.tests.component.TmfEventProviderCoalescingTest)  Time elapsed: 0.401 sec
testParentFirstCoalescing(org.eclipse.tracecompass.tmf.core.tests.component.TmfEventProviderCoalescingTest)  Time elapsed: 0 sec
testTraceDependencyForeground(org.eclipse.tracecompass.tmf.core.tests.component.TmfEventProviderCoalescingTest)  Time elapsed: 0.339 sec
Running org.eclipse.tracecompass.tmf.core.tests.synchronization.TimeOffsetTest
Tests run: 4, Failures: 0, Errors: 0, Skipped: 0, Time elapsed: 4.754 sec - in org.eclipse.tracecompass.tmf.core.tests.synchronization.TimeOffsetTest
testNegativeOffset(org.eclipse.tracecompass.tmf.core.tests.synchronization.TimeOffsetTest)  Time elapsed: 1.226 sec
testPositiveOffset(org.eclipse.tracecompass.tmf.core.tests.synchronization.TimeOffsetTest)  Time elapsed: 1.203 sec
testNoOffset(org.eclipse.tracecompass.tmf.core.tests.synchronization.TimeOffsetTest)  Time elapsed: 1.168 sec
testClearOffset(org.eclipse.tracecompass.tmf.core.tests.synchronization.TimeOffsetTest)  Time elapsed: 1.153 sec
Running org.eclipse.tracecompass.tmf.core.tests.synchronization.TsTransformTest
Tests run: 5, Failures: 0, Errors: 0, Skipped: 0, Time elapsed: 0.004 sec - in org.eclipse.tracecompass.tmf.core.tests.synchronization.TsTransformTest
testComposition(org.eclipse.tracecompass.tmf.core.tests.synchronization.TsTransformTest)  Time elapsed: 0.002 sec
testEqualityConstantTransform(org.eclipse.tracecompass.tmf.core.tests.synchronization.TsTransformTest)  Time elapsed: 0 sec
testLinearTransform(org.eclipse.tracecompass.tmf.core.tests.synchronization.TsTransformTest)  Time elapsed: 0.001 sec
testIdentityTransform(org.eclipse.tracecompass.tmf.core.tests.synchronization.TsTransformTest)  Time elapsed: 0 sec
testEquality(org.eclipse.tracecompass.tmf.core.tests.synchronization.TsTransformTest)  Time elapsed: 0 sec
Running org.eclipse.tracecompass.tmf.core.tests.synchronization.SyncTest
Tests run: 4, Failures: 0, Errors: 0, Skipped: 0, Time elapsed: 0.038 sec - in org.eclipse.tracecompass.tmf.core.tests.synchronization.SyncTest
testOneHull(org.eclipse.tracecompass.tmf.core.tests.synchronization.SyncTest)  Time elapsed: 0.007 sec
testFullyIncrementalSerialization(org.eclipse.tracecompass.tmf.core.tests.synchronization.SyncTest)  Time elapsed: 0.025 sec
testFullyIncremental(org.eclipse.tracecompass.tmf.core.tests.synchronization.SyncTest)  Time elapsed: 0.004 sec
testDisjoint(org.eclipse.tracecompass.tmf.core.tests.synchronization.SyncTest)  Time elapsed: 0.001 sec
Running org.eclipse.tracecompass.tmf.core.tests.synchronization.TsTransformFactoryTest
Tests run: 4, Failures: 0, Errors: 0, Skipped: 0, Time elapsed: 0.002 sec - in org.eclipse.tracecompass.tmf.core.tests.synchronization.TsTransformFactoryTest
transformSlope(org.eclipse.tracecompass.tmf.core.tests.synchronization.TsTransformFactoryTest)  Time elapsed: 0.001 sec
testToString(org.eclipse.tracecompass.tmf.core.tests.synchronization.TsTransformFactoryTest)  Time elapsed: 0 sec
transformIdentity(org.eclipse.tracecompass.tmf.core.tests.synchronization.TsTransformFactoryTest)  Time elapsed: 0 sec
transformOffset(org.eclipse.tracecompass.tmf.core.tests.synchronization.TsTransformFactoryTest)  Time elapsed: 0 sec
Running org.eclipse.tracecompass.tmf.core.tests.synchronization.TsTransformFastTest
Tests run: 12, Failures: 0, Errors: 0, Skipped: 0, Time elapsed: 0.376 sec - in org.eclipse.tracecompass.tmf.core.tests.synchronization.TsTransformFastTest
testFastTransformSlopeAndOffset[Factory=Object](org.eclipse.tracecompass.tmf.core.tests.synchronization.TsTransformFastTest)  Time elapsed: 0.011 sec
testFastTransformSlope[Factory=Object](org.eclipse.tracecompass.tmf.core.tests.synchronization.TsTransformFastTest)  Time elapsed: 0.089 sec
testFastTransformArguments[Factory=Object](org.eclipse.tracecompass.tmf.core.tests.synchronization.TsTransformFastTest)  Time elapsed: 0.001 sec
testFLTRepeatability[Factory=Object](org.eclipse.tracecompass.tmf.core.tests.synchronization.TsTransformFastTest)  Time elapsed: 0 sec
testFastTransformPrecision[Factory=Object](org.eclipse.tracecompass.tmf.core.tests.synchronization.TsTransformFastTest)  Time elapsed: 0.097 sec
testFLTEquivalence[Factory=Object](org.eclipse.tracecompass.tmf.core.tests.synchronization.TsTransformFastTest)  Time elapsed: 0 sec
testFastTransformSlopeAndOffset[Factory=Deserialized](org.eclipse.tracecompass.tmf.core.tests.synchronization.TsTransformFastTest)  Time elapsed: 0.066 sec
testFastTransformSlope[Factory=Deserialized](org.eclipse.tracecompass.tmf.core.tests.synchronization.TsTransformFastTest)  Time elapsed: 0.042 sec
testFastTransformArguments[Factory=Deserialized](org.eclipse.tracecompass.tmf.core.tests.synchronization.TsTransformFastTest)  Time elapsed: 0 sec
testFLTRepeatability[Factory=Deserialized](org.eclipse.tracecompass.tmf.core.tests.synchronization.TsTransformFastTest)  Time elapsed: 0.001 sec
testFastTransformPrecision[Factory=Deserialized](org.eclipse.tracecompass.tmf.core.tests.synchronization.TsTransformFastTest)  Time elapsed: 0.062 sec
testFLTEquivalence[Factory=Deserialized](org.eclipse.tracecompass.tmf.core.tests.synchronization.TsTransformFastTest)  Time elapsed: 0.002 sec
Running org.eclipse.tracecompass.tmf.core.tests.request.TmfEventRequestIntegrationTest

!ENTRY org.eclipse.tracecompass.tmf.core 4 0 2017-02-18 05:06:53.087
!MESSAGE An uncaught exception happened on request [TmfEventRequestIntegrationTest$2(479,ITmfEvent,BACKGROUND,TmfTimeRange [fStartTime=19:12:43.145 224 192, fEndTime=19:47:16.854 775 807],0,2,0)]: null

!ENTRY org.eclipse.tracecompass.tmf.core 4 0 2017-02-18 05:06:54.187
!MESSAGE An uncaught exception happened on request [TmfEventRequestIntegrationTest$1(481,ITmfEvent,BACKGROUND,TmfTimeRange [fStartTime=19:12:43.145 224 192, fEndTime=19:47:16.854 775 807],0,2,0)]: null
Tests run: 2, Failures: 0, Errors: 0, Skipped: 0, Time elapsed: 3.305 sec - in org.eclipse.tracecompass.tmf.core.tests.request.TmfEventRequestIntegrationTest
testRequestException(org.eclipse.tracecompass.tmf.core.tests.request.TmfEventRequestIntegrationTest)  Time elapsed: 1.056 sec
testSingleRequestException(org.eclipse.tracecompass.tmf.core.tests.request.TmfEventRequestIntegrationTest)  Time elapsed: 1.099 sec
Running org.eclipse.tracecompass.tmf.core.tests.request.TmfCoalescedEventRequestTest
Tests run: 13, Failures: 0, Errors: 0, Skipped: 0, Time elapsed: 0.996 sec - in org.eclipse.tracecompass.tmf.core.tests.request.TmfCoalescedEventRequestTest
testIsCompatible(org.eclipse.tracecompass.tmf.core.tests.request.TmfCoalescedEventRequestTest)  Time elapsed: 0 sec
testTmfCoalescedEventRequestIndexNbEventsBlocksize(org.eclipse.tracecompass.tmf.core.tests.request.TmfCoalescedEventRequestTest)  Time elapsed: 0.001 sec
testDone(org.eclipse.tracecompass.tmf.core.tests.request.TmfCoalescedEventRequestTest)  Time elapsed: 0 sec
testFail(org.eclipse.tracecompass.tmf.core.tests.request.TmfCoalescedEventRequestTest)  Time elapsed: 0 sec
testCancelCoalescedRequest(org.eclipse.tracecompass.tmf.core.tests.request.TmfCoalescedEventRequestTest)  Time elapsed: 0.25 sec
testToString(org.eclipse.tracecompass.tmf.core.tests.request.TmfCoalescedEventRequestTest)  Time elapsed: 0 sec
testAddEvent1(org.eclipse.tracecompass.tmf.core.tests.request.TmfCoalescedEventRequestTest)  Time elapsed: 0.001 sec
testAddEvent2(org.eclipse.tracecompass.tmf.core.tests.request.TmfCoalescedEventRequestTest)  Time elapsed: 0 sec
testSingleTimeRequest(org.eclipse.tracecompass.tmf.core.tests.request.TmfCoalescedEventRequestTest)  Time elapsed: 0.103 sec
testIsCompatibleDependency(org.eclipse.tracecompass.tmf.core.tests.request.TmfCoalescedEventRequestTest)  Time elapsed: 0 sec
testCoalescedRequest(org.eclipse.tracecompass.tmf.core.tests.request.TmfCoalescedEventRequestTest)  Time elapsed: 0.64 sec
testCancel(org.eclipse.tracecompass.tmf.core.tests.request.TmfCoalescedEventRequestTest)  Time elapsed: 0 sec
testEquals(org.eclipse.tracecompass.tmf.core.tests.request.TmfCoalescedEventRequestTest)  Time elapsed: 0 sec
Running org.eclipse.tracecompass.tmf.core.tests.request.TmfEventRequestTest
Tests run: 14, Failures: 0, Errors: 0, Skipped: 0, Time elapsed: 0.007 sec - in org.eclipse.tracecompass.tmf.core.tests.request.TmfEventRequestTest
testDone(org.eclipse.tracecompass.tmf.core.tests.request.TmfEventRequestTest)  Time elapsed: 0.001 sec
testFail(org.eclipse.tracecompass.tmf.core.tests.request.TmfEventRequestTest)  Time elapsed: 0 sec
testTmfEventRequestWithDependencyLevel(org.eclipse.tracecompass.tmf.core.tests.request.TmfEventRequestTest)  Time elapsed: 0.001 sec
testToString(org.eclipse.tracecompass.tmf.core.tests.request.TmfEventRequestTest)  Time elapsed: 0 sec
testTmfEventRequestTimeRangeNbRequestedBlocksize(org.eclipse.tracecompass.tmf.core.tests.request.TmfEventRequestTest)  Time elapsed: 0.001 sec
testWaitForStartAfterDone(org.eclipse.tracecompass.tmf.core.tests.request.TmfEventRequestTest)  Time elapsed: 0 sec
testTmfEventRequestTimeRangeNbRequested(org.eclipse.tracecompass.tmf.core.tests.request.TmfEventRequestTest)  Time elapsed: 0 sec
testTmfEventRequestTimeRange(org.eclipse.tracecompass.tmf.core.tests.request.TmfEventRequestTest)  Time elapsed: 0.001 sec
testWaitForStartBeforeStart(org.eclipse.tracecompass.tmf.core.tests.request.TmfEventRequestTest)  Time elapsed: 0 sec
testWaitForStartAfterStart(org.eclipse.tracecompass.tmf.core.tests.request.TmfEventRequestTest)  Time elapsed: 0 sec
testCancel(org.eclipse.tracecompass.tmf.core.tests.request.TmfEventRequestTest)  Time elapsed: 0 sec
testEquals(org.eclipse.tracecompass.tmf.core.tests.request.TmfEventRequestTest)  Time elapsed: 0 sec
testTmfEventRequest(org.eclipse.tracecompass.tmf.core.tests.request.TmfEventRequestTest)  Time elapsed: 0 sec
testWaitForStartAfterCancel(org.eclipse.tracecompass.tmf.core.tests.request.TmfEventRequestTest)  Time elapsed: 0 sec
Running org.eclipse.tracecompass.tmf.core.tests.util.PairTest
Tests run: 8, Failures: 0, Errors: 0, Skipped: 0, Time elapsed: 0.001 sec - in org.eclipse.tracecompass.tmf.core.tests.util.PairTest
testAccessors(org.eclipse.tracecompass.tmf.core.tests.util.PairTest)  Time elapsed: 0 sec
testToString(org.eclipse.tracecompass.tmf.core.tests.util.PairTest)  Time elapsed: 0 sec
testEqualsNull(org.eclipse.tracecompass.tmf.core.tests.util.PairTest)  Time elapsed: 0 sec
testEqualsDifferentObj(org.eclipse.tracecompass.tmf.core.tests.util.PairTest)  Time elapsed: 0.001 sec
testEqualsSymmetry(org.eclipse.tracecompass.tmf.core.tests.util.PairTest)  Time elapsed: 0 sec
testHashCode(org.eclipse.tracecompass.tmf.core.tests.util.PairTest)  Time elapsed: 0 sec
testEqualsTransivity(org.eclipse.tracecompass.tmf.core.tests.util.PairTest)  Time elapsed: 0 sec
testEqualsReflexivity(org.eclipse.tracecompass.tmf.core.tests.util.PairTest)  Time elapsed: 0 sec
Running org.eclipse.tracecompass.tmf.core.tests.TmfCorePluginTest
Tests run: 2, Failures: 0, Errors: 0, Skipped: 0, Time elapsed: 0.001 sec - in org.eclipse.tracecompass.tmf.core.tests.TmfCorePluginTest
testTmfCorePluginId(org.eclipse.tracecompass.tmf.core.tests.TmfCorePluginTest)  Time elapsed: 0 sec
testGetDefault(org.eclipse.tracecompass.tmf.core.tests.TmfCorePluginTest)  Time elapsed: 0 sec
Running org.eclipse.tracecompass.tmf.core.tests.uml2sd.TmfSyncSequenceDiagramEventTest
Tests run: 1, Failures: 0, Errors: 0, Skipped: 0, Time elapsed: 0.002 sec - in org.eclipse.tracecompass.tmf.core.tests.uml2sd.TmfSyncSequenceDiagramEventTest
testTmfSyncSequenceDiagramEvent(org.eclipse.tracecompass.tmf.core.tests.uml2sd.TmfSyncSequenceDiagramEventTest)  Time elapsed: 0.001 sec
Running org.eclipse.tracecompass.tmf.core.tests.uml2sd.TmfAsyncSequenceDiagramEventTest
Tests run: 1, Failures: 0, Errors: 0, Skipped: 0, Time elapsed: 0.001 sec - in org.eclipse.tracecompass.tmf.core.tests.uml2sd.TmfAsyncSequenceDiagramEventTest
testTmfAsyncSequenceDiagramEvent(org.eclipse.tracecompass.tmf.core.tests.uml2sd.TmfAsyncSequenceDiagramEventTest)  Time elapsed: 0 sec
Running org.eclipse.tracecompass.tmf.core.tests.callstack.FunctionNameMapperTest
Tests run: 1, Failures: 0, Errors: 0, Skipped: 0, Time elapsed: 0.003 sec - in org.eclipse.tracecompass.tmf.core.tests.callstack.FunctionNameMapperTest
testNmFile(org.eclipse.tracecompass.tmf.core.tests.callstack.FunctionNameMapperTest)  Time elapsed: 0.003 sec
Running org.eclipse.tracecompass.tmf.core.tests.signal.TmfSignalManagerTest
Tests run: 4, Failures: 0, Errors: 0, Skipped: 0, Time elapsed: 0.012 sec - in org.eclipse.tracecompass.tmf.core.tests.signal.TmfSignalManagerTest
testBroadcastAsync(org.eclipse.tracecompass.tmf.core.tests.signal.TmfSignalManagerTest)  Time elapsed: 0.004 sec
testSendReceive(org.eclipse.tracecompass.tmf.core.tests.signal.TmfSignalManagerTest)  Time elapsed: 0.001 sec
testConcurrentSignals(org.eclipse.tracecompass.tmf.core.tests.signal.TmfSignalManagerTest)  Time elapsed: 0.006 sec
testNestedSignals(org.eclipse.tracecompass.tmf.core.tests.signal.TmfSignalManagerTest)  Time elapsed: 0 sec
Running org.eclipse.tracecompass.tmf.core.tests.signal.TmfSignalThrottlerTest
Tests run: 3, Failures: 0, Errors: 0, Skipped: 0, Time elapsed: 16.006 sec - in org.eclipse.tracecompass.tmf.core.tests.signal.TmfSignalThrottlerTest
testDelay(org.eclipse.tracecompass.tmf.core.tests.signal.TmfSignalThrottlerTest)  Time elapsed: 6.003 sec
testOneChannel(org.eclipse.tracecompass.tmf.core.tests.signal.TmfSignalThrottlerTest)  Time elapsed: 5.001 sec
testMultipleChannels(org.eclipse.tracecompass.tmf.core.tests.signal.TmfSignalThrottlerTest)  Time elapsed: 5.001 sec

Results :

Failed tests: 
  CustomXmlIndexTest>AbstractCustomTraceIndexTest.testReopenIndex:191->AbstractCustomTraceIndexTest.verifyIndexContent:175 null

Tests run: 727, Failures: 1, Errors: 0, Skipped: 1


!ENTRY org.eclipse.core.resources 2 10035 2017-02-18 05:07:11.282
!MESSAGE The workspace will exit with unsaved changes in this session.

!ENTRY org.eclipse.core.jobs 2 2 2017-02-18 05:07:13.143
!MESSAGE Job found still running after platform shutdown.  Jobs should be canceled by the plugin that scheduled them during shutdown: org.eclipse.tracecompass.tmf.core.analysis.TmfAbstractAnalysisModule$1
Job found still running after platform shutdown.  Jobs should be canceled by the plugin that scheduled them during shutdown: org.eclipse.tracecompass.tmf.core.analysis.TmfAbstractAnalysisModule$1
[INFO] ------------------------------------------------------------------------
[INFO] Reactor Summary:
[INFO] 
[INFO] Trace Compass Parent ............................... SUCCESS [  1.996 s]
[INFO] Trace Compass Tracetype-agnostic Analyses Parent ... SUCCESS [  0.017 s]
[INFO] Trace Compass Common Utilities Parent .............. SUCCESS [  0.058 s]
[INFO] org.eclipse.tracecompass.common.core ............... SUCCESS [  5.783 s]
[INFO] Trace Compass State System Parent .................. SUCCESS [  0.056 s]
[INFO] org.eclipse.tracecompass.datastore.core ............ SUCCESS [  3.432 s]
[INFO] org.eclipse.tracecompass.segmentstore.core ......... SUCCESS [  5.656 s]
[INFO] org.eclipse.tracecompass.statesystem.core .......... SUCCESS [  4.734 s]
[INFO] Trace Compass TMF Parent ........................... SUCCESS [  0.067 s]
[INFO] org.eclipse.tracecompass.tmf.core .................. SUCCESS [  8.915 s]
[INFO] org.eclipse.tracecompass.analysis.graph.core ....... SUCCESS [  3.108 s]
[INFO] org.eclipse.tracecompass.tmf.core.tests ............ FAILURE [04:24 min]
[INFO] org.eclipse.tracecompass.analysis.graph.core.tests . SKIPPED
[INFO] org.eclipse.tracecompass.analysis.lami.core ........ SKIPPED
[INFO] org.eclipse.tracecompass.analysis.lami.core.tests .. SKIPPED
[INFO] org.eclipse.tracecompass.tmf.ui .................... SKIPPED
[INFO] org.eclipse.tracecompass.analysis.lami.ui .......... SKIPPED
[INFO] org.eclipse.tracecompass.analysis.graph.ui ......... SKIPPED
[INFO] org.eclipse.tracecompass.analysis.timing.core ...... SKIPPED
[INFO] org.eclipse.tracecompass.analysis.os.linux.core .... SKIPPED
[INFO] Trace Compass CTF Support Parent ................... SKIPPED
[INFO] Trace Compass CTF Parser Plug-in ................... SKIPPED
[INFO] org.eclipse.tracecompass.ctf.core .................. SKIPPED
[INFO] org.eclipse.tracecompass.tmf.ctf.core .............. SKIPPED
[INFO] Trace Compass CTF Core Tests Plug-in ............... SKIPPED
[INFO] org.eclipse.tracecompass.tmf.ctf.core.tests ........ SKIPPED
[INFO] org.eclipse.tracecompass.statesystem.core.tests .... SKIPPED
[INFO] org.eclipse.tracecompass.analysis.os.linux.core.tests SKIPPED
[INFO] org.eclipse.tracecompass.analysis.timing.ui ........ SKIPPED
[INFO] org.eclipse.tracecompass.analysis.os.linux.ui ...... SKIPPED
[INFO] org.eclipse.tracecompass.analysis.os.linux.ui.tests  SKIPPED
[INFO] org.eclipse.tracecompass.analysis.timing.core.tests  SKIPPED
[INFO] org.eclipse.tracecompass.tmf.ui.tests .............. SKIPPED
[INFO] org.eclipse.tracecompass.tmf.ui.swtbot.tests ....... SKIPPED
[INFO] org.eclipse.tracecompass.analysis.timing.ui.swtbot.tests SKIPPED
[INFO] org.eclipse.tracecompass.tmf.analysis.xml.core ..... SKIPPED
[INFO] Trace Compass LTTng Support Parent ................. SKIPPED
[INFO] org.eclipse.tracecompass.lttng2.kernel.core ........ SKIPPED
[INFO] org.eclipse.tracecompass.analysis.os.linux.ui.swtbot.tests SKIPPED
[INFO] Trace Compass BTF Support Parent ................... SKIPPED
[INFO] org.eclipse.tracecompass.btf.core .................. SKIPPED
[INFO] Trace Compass Documentation ........................ SKIPPED
[INFO] Trace Compass Developer Guide ...................... SKIPPED
[INFO] org.eclipse.tracecompass.tmf.analysis.xml.ui ....... SKIPPED
[INFO] org.eclipse.tracecompass.tmf.chart.core ............ SKIPPED
[INFO] org.eclipse.tracecompass.tmf.chart.ui .............. SKIPPED
[INFO] org.eclipse.tracecompass.tmf ....................... SKIPPED
[INFO] org.eclipse.tracecompass.btf.ui .................... SKIPPED
[INFO] org.eclipse.tracecompass.btf ....................... SKIPPED
[INFO] org.eclipse.tracecompass.btf.core.tests ............ SKIPPED
[INFO] org.eclipse.tracecompass.common.core.tests ......... SKIPPED
[INFO] org.eclipse.tracecompass.ctf ....................... SKIPPED
[INFO] org.eclipse.tracecompass.ctf.parser.tests .......... SKIPPED
[INFO] org.eclipse.tracecompass.tmf.ctf ................... SKIPPED
[INFO] org.eclipse.tracecompass.tmf.ctf.ui.swtbot.tests ... SKIPPED
[INFO] Trace Compass User Guide ........................... SKIPPED
[INFO] Trace Compass GDB Tracepoint Analysis User Guide ... SKIPPED
[INFO] Trace Compass RCP User Guide ....................... SKIPPED
[INFO] Trace Compass Pcap User Guide ...................... SKIPPED
[INFO] org.eclipse.tracecompass.examples .................. SKIPPED
[INFO] Trace Compass GDB Tracepoint Analysis Parent ....... SKIPPED
[INFO] org.eclipse.tracecompass.gdbtrace.core ............. SKIPPED
[INFO] org.eclipse.tracecompass.gdbtrace.ui ............... SKIPPED
[INFO] org.eclipse.tracecompass.gdbtrace .................. SKIPPED
[INFO] org.eclipse.tracecompass.gdbtrace.core.tests ....... SKIPPED
[INFO] org.eclipse.tracecompass.gdbtrace.ui.tests ......... SKIPPED
[INFO] org.eclipse.tracecompass.lttng2.common.core ........ SKIPPED
[INFO] org.eclipse.tracecompass.lttng2.common.core.tests .. SKIPPED
[INFO] org.eclipse.tracecompass.lttng2.control.core ....... SKIPPED
[INFO] org.eclipse.tracecompass.tmf.remote.core ........... SKIPPED
[INFO] org.eclipse.tracecompass.tmf.remote.ui ............. SKIPPED
[INFO] org.eclipse.tracecompass.lttng2.control.ui ......... SKIPPED
[INFO] org.eclipse.tracecompass.lttng2.control ............ SKIPPED
[INFO] org.eclipse.tracecompass.lttng2.control.core.tests . SKIPPED
[INFO] org.eclipse.tracecompass.tmf.remote.core.tests ..... SKIPPED
[INFO] org.eclipse.tracecompass.lttng2.control.ui.tests ... SKIPPED
[INFO] org.eclipse.tracecompass.lttng2.kernel.ui .......... SKIPPED
[INFO] org.eclipse.tracecompass.lttng2.kernel ............. SKIPPED
[INFO] org.eclipse.tracecompass.lttng2.kernel.core.tests .. SKIPPED
[INFO] org.eclipse.tracecompass.lttng2.ust.core ........... SKIPPED
[INFO] org.eclipse.tracecompass.lttng2.ust.ui ............. SKIPPED
[INFO] org.eclipse.tracecompass.lttng2.ust ................ SKIPPED
[INFO] org.eclipse.tracecompass.lttng2.ust.core.tests ..... SKIPPED
[INFO] org.eclipse.tracecompass.lttng2.ust.ui.tests ....... SKIPPED
[INFO] org.eclipse.tracecompass.lttng2.control.ui.swtbot.tests SKIPPED
[INFO] org.eclipse.tracecompass.lttng2.kernel.ui.swtbot.tests SKIPPED
[INFO] org.eclipse.tracecompass.lttng2.ust.ui.swtbot.tests  SKIPPED
[INFO] Trace Compass Pcap Format Support Parent ........... SKIPPED
[INFO] org.eclipse.tracecompass.pcap.core ................. SKIPPED
[INFO] Trace Compass Pcap Parser Core Tests Plug-in ....... SKIPPED
[INFO] org.eclipse.tracecompass.tmf.pcap.core ............. SKIPPED
[INFO] org.eclipse.tracecompass.tmf.pcap.ui ............... SKIPPED
[INFO] org.eclipse.tracecompass.tmf.pcap .................. SKIPPED
[INFO] org.eclipse.tracecompass.tmf.pcap.core.tests ....... SKIPPED
[INFO] org.eclipse.tracecompass.tmf.pcap.ui.swtbot.tests .. SKIPPED
[INFO] Trace Compass RCP Parent ........................... SKIPPED
[INFO] Trace Compass RCP Branding plug-in ................. SKIPPED
[INFO] Trace Compass RCP Branding Feature ................. SKIPPED
[INFO] org.eclipse.tracecompass.rcp.ui .................... SKIPPED
[INFO] Trace Compass RCP Feature .......................... SKIPPED
[INFO] Trace Compass RCP Product .......................... SKIPPED
[INFO] Trace Compass RCP Product Tests .................... SKIPPED
[INFO] Trace Compass Release Engineering Parent ........... SKIPPED
[INFO] Trace Compass Target Platform ...................... SKIPPED
[INFO] org.eclipse.tracecompass.tmf.analysis.xml.core.tests SKIPPED
[INFO] org.eclipse.tracecompass.tmf.analysis.xml.ui.swtbot.tests SKIPPED
[INFO] org.eclipse.tracecompass.integration.swtbot.tests .. SKIPPED
[INFO] org.eclipse.tracecompass.segmentstore.core.tests ... SKIPPED
[INFO] org.eclipse.tracecompass.tmf.remote.ui.swtbot.tests  SKIPPED
[INFO] org.eclipse.tracecompass.tmf.analysis.xml.ui.tests . SKIPPED
[INFO] org.eclipse.tracecompass.tmf.remote.ui.tests ....... SKIPPED
[INFO] Trace Compass All Tests ............................ SKIPPED
[INFO] org.eclipse.tracecompass.testing ................... SKIPPED
[INFO] org.eclipse.tracecompass.tmf.remote ................ SKIPPED
[INFO] Trace Compass Repository ........................... SKIPPED
[INFO] org.eclipse.tracecompass.datastore.core.tests ...... SKIPPED
[INFO] org.eclipse.tracecompass.tmf.chart.core.tests ...... SKIPPED
[INFO] org.eclipse.tracecompass.tmf.chart.ui.tests ........ SKIPPED
[INFO] ------------------------------------------------------------------------
[INFO] BUILD FAILURE
[INFO] ------------------------------------------------------------------------
[INFO] Total time: 05:44 min
[INFO] Finished at: 2017-02-18T05:07:13-05:00
[INFO] Final Memory: 191M/4516M
[INFO] ------------------------------------------------------------------------
[INFO] o.h.m.e.h.MavenExecutionResultHandler - Build failed with exception(s)
[INFO] o.h.m.e.h.MavenExecutionResultHandler - [1] org.apache.maven.lifecycle.LifecycleExecutionException: Failed to execute goal org.eclipse.tycho:tycho-surefire-plugin:0.26.0:test (default-test) on project org.eclipse.tracecompass.tmf.core.tests: There are test failures.

Please refer to /jobs/genie.tracecompass/tracecompass-stable-release-nightly/workspace/tmf/org.eclipse.tracecompass.tmf.core.tests/target/surefire-reports for the individual test results.
[DEBUG] Closing connection to remote
[ERROR] Failed to execute goal org.eclipse.tycho:tycho-surefire-plugin:0.26.0:test (default-test) on project org.eclipse.tracecompass.tmf.core.tests: There are test failures.
[ERROR] 
[ERROR] Please refer to /jobs/genie.tracecompass/tracecompass-stable-release-nightly/workspace/tmf/org.eclipse.tracecompass.tmf.core.tests/target/surefire-reports for the individual test results.
[ERROR] -> [Help 1]
[ERROR] 
[ERROR] To see the full stack trace of the errors, re-run Maven with the -e switch.
[ERROR] Re-run Maven using the -X switch to enable full debug logging.
[ERROR] 
[ERROR] For more information about the errors and possible solutions, please read the following articles:
[ERROR] [Help 1] http://cwiki.apache.org/confluence/display/MAVEN/MojoFailureException
[ERROR] 
[ERROR] After correcting the problems, you can resume the build with the command
[ERROR]   mvn <goals> -rf :org.eclipse.tracecompass.tmf.core.tests
[DEBUG] Waiting for process to finish
[DEBUG] Result: 1
Terminating xvnc.
Recording test results
Archiving artifacts
Sending e-mails to: marc-andre.laperle@ericsson.com bernd.hufmann@ericsson.com patrick.tasse@gmail.com matthew.khouzam@ericsson.com Jean-Christian.Kouame@ericsson.com
Finished: FAILURE