Console Output

Skipping 1,782 KB.. Full Log
04:36:54 [2021-09-15T08:36:54.489Z] main:
04:36:54 [2021-09-15T08:36:54.489Z] 
04:36:54 [2021-09-15T08:36:54.489Z] main:
04:36:54 [2021-09-15T08:36:54.489Z] 
04:36:54 [2021-09-15T08:36:54.489Z] resetCSS:
04:36:54 [2021-09-15T08:36:54.489Z]      [echo] Setting default in org.eclipse.tracecompass.tmf.ui.dark.css
04:36:54 [2021-09-15T08:36:54.746Z] 
04:36:54 [2021-09-15T08:36:54.746Z] checkTargetPlatform:
04:36:54 [2021-09-15T08:36:54.746Z]      [echo] Verifying target platform: tracecompass-e4.21
04:36:54 [2021-09-15T08:36:54.746Z] 
04:36:54 [2021-09-15T08:36:54.746Z] fixCSS:
04:36:54 [2021-09-15T08:36:54.746Z]      [echo] Updating org.eclipse.tracecompass.tmf.ui.dark.css
04:36:54 [2021-09-15T08:36:54.746Z] [INFO] Executed tasks
04:36:54 [2021-09-15T08:36:54.746Z] [INFO] 
04:36:54 [2021-09-15T08:36:54.746Z] [INFO] --- maven-resources-plugin:3.0.2:resources (default-resources) @ org.eclipse.tracecompass.tmf.ui ---
04:36:54 [2021-09-15T08:36:54.746Z] [INFO] Using 'UTF-8' encoding to copy filtered resources.
04:36:54 [2021-09-15T08:36:54.746Z] [INFO] skip non existing resourceDirectory /home/jenkins/agent/workspace/tracecompass-stable-release-nightly-new/tmf/org.eclipse.tracecompass.tmf.ui/src/main/resources
04:36:54 [2021-09-15T08:36:54.746Z] [INFO] 
04:36:54 [2021-09-15T08:36:54.746Z] [INFO] --- tycho-compiler-plugin:2.3.0:compile (default-compile) @ org.eclipse.tracecompass.tmf.ui ---
04:36:54 [2021-09-15T08:36:54.746Z] [WARNING] The effective compiler target level 11 is incompatible with the following OSGi execution environments: [JavaSE-1.8 (assumes 1.8)] @ MavenProject: org.eclipse.tracecompass:org.eclipse.tracecompass.tmf.ui:7.1.0-SNAPSHOT @ /home/jenkins/agent/workspace/tracecompass-stable-release-nightly-new/tmf/org.eclipse.tracecompass.tmf.ui/pom.xml
04:36:54 [2021-09-15T08:36:54.746Z] [INFO] Compiling 545 source files to /home/jenkins/agent/workspace/tracecompass-stable-release-nightly-new/tmf/org.eclipse.tracecompass.tmf.ui/target/classes
04:37:01 [2021-09-15T08:37:01.509Z] [INFO] 
04:37:01 [2021-09-15T08:37:01.509Z] [INFO] --- maven-resources-plugin:3.0.2:testResources (default-testResources) @ org.eclipse.tracecompass.tmf.ui ---
04:37:01 [2021-09-15T08:37:01.509Z] [INFO] Using 'UTF-8' encoding to copy filtered resources.
04:37:01 [2021-09-15T08:37:01.509Z] [INFO] skip non existing resourceDirectory /home/jenkins/agent/workspace/tracecompass-stable-release-nightly-new/tmf/org.eclipse.tracecompass.tmf.ui/src/test/resources
04:37:01 [2021-09-15T08:37:01.509Z] [INFO] 
04:37:01 [2021-09-15T08:37:01.509Z] [INFO] --- tycho-source-plugin:2.3.0:plugin-source (plugin-source) @ org.eclipse.tracecompass.tmf.ui ---
04:37:01 [2021-09-15T08:37:01.509Z] [INFO] Building jar: /home/jenkins/agent/workspace/tracecompass-stable-release-nightly-new/tmf/org.eclipse.tracecompass.tmf.ui/target/org.eclipse.tracecompass.tmf.ui-7.1.0-SNAPSHOT-sources.jar
04:37:01 [2021-09-15T08:37:01.509Z] [INFO] 
04:37:01 [2021-09-15T08:37:01.509Z] [INFO] --- target-platform-configuration:2.3.0:target-platform (default-target-platform) @ org.eclipse.tracecompass.tmf.ui ---
04:37:01 [2021-09-15T08:37:01.509Z] [INFO] 
04:37:01 [2021-09-15T08:37:01.509Z] [INFO] --- tycho-packaging-plugin:2.3.0:package-plugin (default-package-plugin) @ org.eclipse.tracecompass.tmf.ui ---
04:37:01 [2021-09-15T08:37:01.509Z] [INFO] Building jar: /home/jenkins/agent/workspace/tracecompass-stable-release-nightly-new/tmf/org.eclipse.tracecompass.tmf.ui/target/org.eclipse.tracecompass.tmf.ui-7.1.0-SNAPSHOT.jar
04:37:01 [2021-09-15T08:37:01.509Z] [INFO] 
04:37:01 [2021-09-15T08:37:01.509Z] [INFO] --- tycho-p2-plugin:2.3.0:p2-metadata-default (default-p2-metadata-default) @ org.eclipse.tracecompass.tmf.ui ---
04:37:01 [2021-09-15T08:37:01.509Z] [INFO] 
04:37:01 [2021-09-15T08:37:01.509Z] [INFO] --- tycho-source-feature-plugin:2.3.0:source-feature (source-feature) @ org.eclipse.tracecompass.tmf.ui ---
04:37:01 [2021-09-15T08:37:01.509Z] [WARNING] Mojo tycho-source-feature-plugin:source-feature is replaced by the tycho-source-plugin:feature-source which offers equivalent and even enhanced functionality
04:37:01 [2021-09-15T08:37:01.509Z] [INFO] 
04:37:01 [2021-09-15T08:37:01.509Z] [INFO] --- tycho-pack200a-plugin:2.3.0:normalize (pack200-normalize) @ org.eclipse.tracecompass.tmf.ui ---
04:37:01 [2021-09-15T08:37:01.509Z] [WARNING] Pack200 actions are deprecated and scheduled for removal.
04:37:01 [2021-09-15T08:37:01.509Z] [INFO] Pack200 normalizing jar /home/jenkins/agent/workspace/tracecompass-stable-release-nightly-new/tmf/org.eclipse.tracecompass.tmf.ui/target/org.eclipse.tracecompass.tmf.ui-7.1.0-SNAPSHOT.jar
04:37:04 [2021-09-15T08:37:04.039Z] [INFO] 
04:37:04 [2021-09-15T08:37:04.039Z] [INFO] --- eclipse-jarsigner-plugin:1.3.1:sign (sign) @ org.eclipse.tracecompass.tmf.ui ---
04:37:05 [2021-09-15T08:37:05.046Z] [INFO] Signing jar: /home/jenkins/agent/workspace/tracecompass-stable-release-nightly-new/tmf/org.eclipse.tracecompass.tmf.ui/target/org.eclipse.tracecompass.tmf.ui-7.1.0-SNAPSHOT.jar
04:37:09 [2021-09-15T08:37:09.234Z] [INFO] Signing jar: /home/jenkins/agent/workspace/tracecompass-stable-release-nightly-new/tmf/org.eclipse.tracecompass.tmf.ui/target/org.eclipse.tracecompass.tmf.ui-7.1.0-SNAPSHOT-sources.jar
04:37:11 [2021-09-15T08:37:11.130Z] [INFO] 
04:37:11 [2021-09-15T08:37:11.130Z] [INFO] --- tycho-pack200b-plugin:2.3.0:pack (pack200-pack) @ org.eclipse.tracecompass.tmf.ui ---
04:37:11 [2021-09-15T08:37:11.130Z] [WARNING] Pack200 actions are deprecated and scheduled for removal.
04:37:11 [2021-09-15T08:37:11.130Z] [INFO] Pack200 packing jar /home/jenkins/agent/workspace/tracecompass-stable-release-nightly-new/tmf/org.eclipse.tracecompass.tmf.ui/target/org.eclipse.tracecompass.tmf.ui-7.1.0-SNAPSHOT.jar
04:37:13 [2021-09-15T08:37:13.031Z] [INFO] 
04:37:13 [2021-09-15T08:37:13.031Z] [INFO] --- tycho-p2-plugin:2.3.0:p2-metadata (p2-metadata) @ org.eclipse.tracecompass.tmf.ui ---
04:37:13 [2021-09-15T08:37:13.289Z] [INFO] 
04:37:13 [2021-09-15T08:37:13.289Z] [INFO] --- maven-antrun-plugin:1.8:run (cleanup-dark-theme-css) @ org.eclipse.tracecompass.tmf.ui ---
04:37:13 [2021-09-15T08:37:13.289Z] [INFO] Executing tasks
04:37:13 [2021-09-15T08:37:13.289Z] 
04:37:13 [2021-09-15T08:37:13.289Z] main:
04:37:13 [2021-09-15T08:37:13.289Z] 
04:37:13 [2021-09-15T08:37:13.289Z] resetCSS:
04:37:13 [2021-09-15T08:37:13.289Z]      [echo] Setting default in org.eclipse.tracecompass.tmf.ui.dark.css
04:37:13 [2021-09-15T08:37:13.289Z] [INFO] Executed tasks
04:37:13 [2021-09-15T08:37:13.289Z] [INFO] 
04:37:13 [2021-09-15T08:37:13.289Z] [INFO] --- maven-install-plugin:2.5.2:install (default-install) @ org.eclipse.tracecompass.tmf.ui ---
04:37:13 [2021-09-15T08:37:13.289Z] [INFO] Installing /home/jenkins/agent/workspace/tracecompass-stable-release-nightly-new/tmf/org.eclipse.tracecompass.tmf.ui/target/org.eclipse.tracecompass.tmf.ui-7.1.0-SNAPSHOT.jar to /home/jenkins/.m2/repository/org/eclipse/tracecompass/org.eclipse.tracecompass.tmf.ui/7.1.0-SNAPSHOT/org.eclipse.tracecompass.tmf.ui-7.1.0-SNAPSHOT.jar
04:37:13 [2021-09-15T08:37:13.289Z] [INFO] Installing /home/jenkins/agent/workspace/tracecompass-stable-release-nightly-new/tmf/org.eclipse.tracecompass.tmf.ui/pom.xml to /home/jenkins/.m2/repository/org/eclipse/tracecompass/org.eclipse.tracecompass.tmf.ui/7.1.0-SNAPSHOT/org.eclipse.tracecompass.tmf.ui-7.1.0-SNAPSHOT.pom
04:37:13 [2021-09-15T08:37:13.289Z] [INFO] Installing /home/jenkins/agent/workspace/tracecompass-stable-release-nightly-new/tmf/org.eclipse.tracecompass.tmf.ui/target/org.eclipse.tracecompass.tmf.ui-7.1.0-SNAPSHOT-sources.jar to /home/jenkins/.m2/repository/org/eclipse/tracecompass/org.eclipse.tracecompass.tmf.ui/7.1.0-SNAPSHOT/org.eclipse.tracecompass.tmf.ui-7.1.0-SNAPSHOT-sources.jar
04:37:13 [2021-09-15T08:37:13.289Z] [INFO] Installing /home/jenkins/agent/workspace/tracecompass-stable-release-nightly-new/tmf/org.eclipse.tracecompass.tmf.ui/target/org.eclipse.tracecompass.tmf.ui-7.1.0-SNAPSHOT.jar.pack.gz to /home/jenkins/.m2/repository/org/eclipse/tracecompass/org.eclipse.tracecompass.tmf.ui/7.1.0-SNAPSHOT/org.eclipse.tracecompass.tmf.ui-7.1.0-SNAPSHOT-pack200.jar.pack.gz
04:37:13 [2021-09-15T08:37:13.289Z] [INFO] Installing /home/jenkins/agent/workspace/tracecompass-stable-release-nightly-new/tmf/org.eclipse.tracecompass.tmf.ui/target/p2content.xml to /home/jenkins/.m2/repository/org/eclipse/tracecompass/org.eclipse.tracecompass.tmf.ui/7.1.0-SNAPSHOT/org.eclipse.tracecompass.tmf.ui-7.1.0-SNAPSHOT-p2metadata.xml
04:37:13 [2021-09-15T08:37:13.289Z] [INFO] Installing /home/jenkins/agent/workspace/tracecompass-stable-release-nightly-new/tmf/org.eclipse.tracecompass.tmf.ui/target/p2artifacts.xml to /home/jenkins/.m2/repository/org/eclipse/tracecompass/org.eclipse.tracecompass.tmf.ui/7.1.0-SNAPSHOT/org.eclipse.tracecompass.tmf.ui-7.1.0-SNAPSHOT-p2artifacts.xml
04:37:13 [2021-09-15T08:37:13.289Z] [INFO] 
04:37:13 [2021-09-15T08:37:13.289Z] [INFO] --- tycho-p2-plugin:2.3.0:update-local-index (default-update-local-index) @ org.eclipse.tracecompass.tmf.ui ---
04:37:13 [2021-09-15T08:37:13.289Z] [INFO] 
04:37:13 [2021-09-15T08:37:13.289Z] [INFO] --< org.eclipse.tracecompass:org.eclipse.tracecompass.analysis.counters.ui >--
04:37:13 [2021-09-15T08:37:13.289Z] [INFO] Building org.eclipse.tracecompass.analysis.counters.ui 2.0.0-SNAPSHOT [23/138]
04:37:13 [2021-09-15T08:37:13.289Z] [INFO] ---------------------------[ eclipse-plugin ]---------------------------
04:37:13 [2021-09-15T08:37:13.289Z] [INFO] 
04:37:13 [2021-09-15T08:37:13.289Z] [INFO] --- maven-clean-plugin:3.0.0:clean (default-clean) @ org.eclipse.tracecompass.analysis.counters.ui ---
04:37:13 [2021-09-15T08:37:13.289Z] [INFO] 
04:37:13 [2021-09-15T08:37:13.289Z] [INFO] --- tycho-packaging-plugin:2.3.0:build-qualifier (default-build-qualifier) @ org.eclipse.tracecompass.analysis.counters.ui ---
04:37:13 [2021-09-15T08:37:13.289Z] [INFO] The project's OSGi version is 2.0.0.202109150814
04:37:13 [2021-09-15T08:37:13.289Z] [INFO] 
04:37:13 [2021-09-15T08:37:13.289Z] [INFO] --- tycho-packaging-plugin:2.3.0:validate-id (default-validate-id) @ org.eclipse.tracecompass.analysis.counters.ui ---
04:37:13 [2021-09-15T08:37:13.289Z] [INFO] 
04:37:13 [2021-09-15T08:37:13.289Z] [INFO] --- tycho-packaging-plugin:2.3.0:validate-version (default-validate-version) @ org.eclipse.tracecompass.analysis.counters.ui ---
04:37:13 [2021-09-15T08:37:13.289Z] [INFO] 
04:37:13 [2021-09-15T08:37:13.289Z] [INFO] --- maven-enforcer-plugin:3.0.0-M3:enforce (enforce-maven-version) @ org.eclipse.tracecompass.analysis.counters.ui ---
04:37:13 [2021-09-15T08:37:13.289Z] [INFO] 
04:37:13 [2021-09-15T08:37:13.289Z] [INFO] --- maven-resources-plugin:3.0.2:resources (default-resources) @ org.eclipse.tracecompass.analysis.counters.ui ---
04:37:13 [2021-09-15T08:37:13.289Z] [INFO] Using 'UTF-8' encoding to copy filtered resources.
04:37:13 [2021-09-15T08:37:13.289Z] [INFO] skip non existing resourceDirectory /home/jenkins/agent/workspace/tracecompass-stable-release-nightly-new/analysis/org.eclipse.tracecompass.analysis.counters.ui/src/main/resources
04:37:13 [2021-09-15T08:37:13.289Z] [INFO] 
04:37:13 [2021-09-15T08:37:13.289Z] [INFO] --- tycho-compiler-plugin:2.3.0:compile (default-compile) @ org.eclipse.tracecompass.analysis.counters.ui ---
04:37:13 [2021-09-15T08:37:13.289Z] [WARNING] The effective compiler target level 11 is incompatible with the following OSGi execution environments: [JavaSE-1.8 (assumes 1.8)] @ MavenProject: org.eclipse.tracecompass:org.eclipse.tracecompass.analysis.counters.ui:2.0.0-SNAPSHOT @ /home/jenkins/agent/workspace/tracecompass-stable-release-nightly-new/analysis/org.eclipse.tracecompass.analysis.counters.ui/.polyglot.build.properties
04:37:13 [2021-09-15T08:37:13.289Z] [INFO] Compiling 5 source files to /home/jenkins/agent/workspace/tracecompass-stable-release-nightly-new/analysis/org.eclipse.tracecompass.analysis.counters.ui/target/classes
04:37:13 [2021-09-15T08:37:13.857Z] [INFO] 
04:37:13 [2021-09-15T08:37:13.857Z] [INFO] --- maven-resources-plugin:3.0.2:testResources (default-testResources) @ org.eclipse.tracecompass.analysis.counters.ui ---
04:37:13 [2021-09-15T08:37:13.857Z] [INFO] Using 'UTF-8' encoding to copy filtered resources.
04:37:13 [2021-09-15T08:37:13.857Z] [INFO] skip non existing resourceDirectory /home/jenkins/agent/workspace/tracecompass-stable-release-nightly-new/analysis/org.eclipse.tracecompass.analysis.counters.ui/src/test/resources
04:37:13 [2021-09-15T08:37:13.857Z] [INFO] 
04:37:13 [2021-09-15T08:37:13.857Z] [INFO] --- tycho-source-plugin:2.3.0:plugin-source (plugin-source) @ org.eclipse.tracecompass.analysis.counters.ui ---
04:37:13 [2021-09-15T08:37:13.857Z] [INFO] Building jar: /home/jenkins/agent/workspace/tracecompass-stable-release-nightly-new/analysis/org.eclipse.tracecompass.analysis.counters.ui/target/org.eclipse.tracecompass.analysis.counters.ui-2.0.0-SNAPSHOT-sources.jar
04:37:13 [2021-09-15T08:37:13.857Z] [INFO] 
04:37:13 [2021-09-15T08:37:13.857Z] [INFO] --- target-platform-configuration:2.3.0:target-platform (default-target-platform) @ org.eclipse.tracecompass.analysis.counters.ui ---
04:37:13 [2021-09-15T08:37:13.857Z] [INFO] 
04:37:13 [2021-09-15T08:37:13.857Z] [INFO] --- tycho-packaging-plugin:2.3.0:package-plugin (default-package-plugin) @ org.eclipse.tracecompass.analysis.counters.ui ---
04:37:13 [2021-09-15T08:37:13.857Z] [INFO] Building jar: /home/jenkins/agent/workspace/tracecompass-stable-release-nightly-new/analysis/org.eclipse.tracecompass.analysis.counters.ui/target/org.eclipse.tracecompass.analysis.counters.ui-2.0.0-SNAPSHOT.jar
04:37:13 [2021-09-15T08:37:13.857Z] [INFO] 
04:37:13 [2021-09-15T08:37:13.857Z] [INFO] --- tycho-p2-plugin:2.3.0:p2-metadata-default (default-p2-metadata-default) @ org.eclipse.tracecompass.analysis.counters.ui ---
04:37:13 [2021-09-15T08:37:13.857Z] [INFO] 
04:37:13 [2021-09-15T08:37:13.857Z] [INFO] --- tycho-source-feature-plugin:2.3.0:source-feature (source-feature) @ org.eclipse.tracecompass.analysis.counters.ui ---
04:37:13 [2021-09-15T08:37:13.857Z] [WARNING] Mojo tycho-source-feature-plugin:source-feature is replaced by the tycho-source-plugin:feature-source which offers equivalent and even enhanced functionality
04:37:13 [2021-09-15T08:37:13.857Z] [INFO] 
04:37:13 [2021-09-15T08:37:13.857Z] [INFO] --- tycho-pack200a-plugin:2.3.0:normalize (pack200-normalize) @ org.eclipse.tracecompass.analysis.counters.ui ---
04:37:13 [2021-09-15T08:37:13.857Z] [WARNING] Pack200 actions are deprecated and scheduled for removal.
04:37:13 [2021-09-15T08:37:13.857Z] [INFO] Pack200 normalizing jar /home/jenkins/agent/workspace/tracecompass-stable-release-nightly-new/analysis/org.eclipse.tracecompass.analysis.counters.ui/target/org.eclipse.tracecompass.analysis.counters.ui-2.0.0-SNAPSHOT.jar
04:37:13 [2021-09-15T08:37:13.857Z] [INFO] 
04:37:13 [2021-09-15T08:37:13.857Z] [INFO] --- eclipse-jarsigner-plugin:1.3.1:sign (sign) @ org.eclipse.tracecompass.analysis.counters.ui ---
04:37:13 [2021-09-15T08:37:13.857Z] [INFO] Signing jar: /home/jenkins/agent/workspace/tracecompass-stable-release-nightly-new/analysis/org.eclipse.tracecompass.analysis.counters.ui/target/org.eclipse.tracecompass.analysis.counters.ui-2.0.0-SNAPSHOT.jar
04:37:15 [2021-09-15T08:37:15.237Z] [INFO] Signing jar: /home/jenkins/agent/workspace/tracecompass-stable-release-nightly-new/analysis/org.eclipse.tracecompass.analysis.counters.ui/target/org.eclipse.tracecompass.analysis.counters.ui-2.0.0-SNAPSHOT-sources.jar
04:37:16 [2021-09-15T08:37:16.010Z] [INFO] 
04:37:16 [2021-09-15T08:37:16.010Z] [INFO] --- tycho-pack200b-plugin:2.3.0:pack (pack200-pack) @ org.eclipse.tracecompass.analysis.counters.ui ---
04:37:16 [2021-09-15T08:37:16.010Z] [WARNING] Pack200 actions are deprecated and scheduled for removal.
04:37:16 [2021-09-15T08:37:16.010Z] [INFO] Pack200 packing jar /home/jenkins/agent/workspace/tracecompass-stable-release-nightly-new/analysis/org.eclipse.tracecompass.analysis.counters.ui/target/org.eclipse.tracecompass.analysis.counters.ui-2.0.0-SNAPSHOT.jar
04:37:16 [2021-09-15T08:37:16.268Z] [INFO] 
04:37:16 [2021-09-15T08:37:16.268Z] [INFO] --- tycho-p2-plugin:2.3.0:p2-metadata (p2-metadata) @ org.eclipse.tracecompass.analysis.counters.ui ---
04:37:16 [2021-09-15T08:37:16.268Z] [INFO] 
04:37:16 [2021-09-15T08:37:16.268Z] [INFO] --- maven-install-plugin:2.5.2:install (default-install) @ org.eclipse.tracecompass.analysis.counters.ui ---
04:37:16 [2021-09-15T08:37:16.268Z] [INFO] Installing /home/jenkins/agent/workspace/tracecompass-stable-release-nightly-new/analysis/org.eclipse.tracecompass.analysis.counters.ui/target/org.eclipse.tracecompass.analysis.counters.ui-2.0.0-SNAPSHOT.jar to /home/jenkins/.m2/repository/org/eclipse/tracecompass/org.eclipse.tracecompass.analysis.counters.ui/2.0.0-SNAPSHOT/org.eclipse.tracecompass.analysis.counters.ui-2.0.0-SNAPSHOT.jar
04:37:16 [2021-09-15T08:37:16.268Z] [INFO] Installing /home/jenkins/agent/workspace/tracecompass-stable-release-nightly-new/analysis/org.eclipse.tracecompass.analysis.counters.ui/.polyglot.build.properties to /home/jenkins/.m2/repository/org/eclipse/tracecompass/org.eclipse.tracecompass.analysis.counters.ui/2.0.0-SNAPSHOT/org.eclipse.tracecompass.analysis.counters.ui-2.0.0-SNAPSHOT.pom
04:37:16 [2021-09-15T08:37:16.268Z] [INFO] Installing /home/jenkins/agent/workspace/tracecompass-stable-release-nightly-new/analysis/org.eclipse.tracecompass.analysis.counters.ui/target/org.eclipse.tracecompass.analysis.counters.ui-2.0.0-SNAPSHOT-sources.jar to /home/jenkins/.m2/repository/org/eclipse/tracecompass/org.eclipse.tracecompass.analysis.counters.ui/2.0.0-SNAPSHOT/org.eclipse.tracecompass.analysis.counters.ui-2.0.0-SNAPSHOT-sources.jar
04:37:16 [2021-09-15T08:37:16.268Z] [INFO] Installing /home/jenkins/agent/workspace/tracecompass-stable-release-nightly-new/analysis/org.eclipse.tracecompass.analysis.counters.ui/target/org.eclipse.tracecompass.analysis.counters.ui-2.0.0-SNAPSHOT.jar.pack.gz to /home/jenkins/.m2/repository/org/eclipse/tracecompass/org.eclipse.tracecompass.analysis.counters.ui/2.0.0-SNAPSHOT/org.eclipse.tracecompass.analysis.counters.ui-2.0.0-SNAPSHOT-pack200.jar.pack.gz
04:37:16 [2021-09-15T08:37:16.268Z] [INFO] Installing /home/jenkins/agent/workspace/tracecompass-stable-release-nightly-new/analysis/org.eclipse.tracecompass.analysis.counters.ui/target/p2content.xml to /home/jenkins/.m2/repository/org/eclipse/tracecompass/org.eclipse.tracecompass.analysis.counters.ui/2.0.0-SNAPSHOT/org.eclipse.tracecompass.analysis.counters.ui-2.0.0-SNAPSHOT-p2metadata.xml
04:37:16 [2021-09-15T08:37:16.268Z] [INFO] Installing /home/jenkins/agent/workspace/tracecompass-stable-release-nightly-new/analysis/org.eclipse.tracecompass.analysis.counters.ui/target/p2artifacts.xml to /home/jenkins/.m2/repository/org/eclipse/tracecompass/org.eclipse.tracecompass.analysis.counters.ui/2.0.0-SNAPSHOT/org.eclipse.tracecompass.analysis.counters.ui-2.0.0-SNAPSHOT-p2artifacts.xml
04:37:16 [2021-09-15T08:37:16.268Z] [INFO] 
04:37:16 [2021-09-15T08:37:16.268Z] [INFO] --- tycho-p2-plugin:2.3.0:update-local-index (default-update-local-index) @ org.eclipse.tracecompass.analysis.counters.ui ---
04:37:16 [2021-09-15T08:37:16.268Z] [INFO] 
04:37:16 [2021-09-15T08:37:16.268Z] [INFO] ---< org.eclipse.tracecompass:org.eclipse.tracecompass.tmf.ui.tests >---
04:37:16 [2021-09-15T08:37:16.268Z] [INFO] Building org.eclipse.tracecompass.tmf.ui.tests 1.0.17-SNAPSHOT  [24/138]
04:37:16 [2021-09-15T08:37:16.268Z] [INFO] ------------------------[ eclipse-test-plugin ]-------------------------
04:37:16 [2021-09-15T08:37:16.268Z] [INFO] 
04:37:16 [2021-09-15T08:37:16.268Z] [INFO] --- maven-clean-plugin:3.0.0:clean (default-clean) @ org.eclipse.tracecompass.tmf.ui.tests ---
04:37:16 [2021-09-15T08:37:16.268Z] [INFO] 
04:37:16 [2021-09-15T08:37:16.268Z] [INFO] --- tycho-packaging-plugin:2.3.0:build-qualifier (default-build-qualifier) @ org.eclipse.tracecompass.tmf.ui.tests ---
04:37:16 [2021-09-15T08:37:16.268Z] [INFO] The project's OSGi version is 1.0.17.202109150814
04:37:16 [2021-09-15T08:37:16.268Z] [INFO] 
04:37:16 [2021-09-15T08:37:16.268Z] [INFO] --- tycho-packaging-plugin:2.3.0:validate-id (default-validate-id) @ org.eclipse.tracecompass.tmf.ui.tests ---
04:37:16 [2021-09-15T08:37:16.268Z] [INFO] 
04:37:16 [2021-09-15T08:37:16.268Z] [INFO] --- tycho-packaging-plugin:2.3.0:validate-version (default-validate-version) @ org.eclipse.tracecompass.tmf.ui.tests ---
04:37:16 [2021-09-15T08:37:16.268Z] [INFO] 
04:37:16 [2021-09-15T08:37:16.268Z] [INFO] --- maven-enforcer-plugin:3.0.0-M3:enforce (enforce-maven-version) @ org.eclipse.tracecompass.tmf.ui.tests ---
04:37:16 [2021-09-15T08:37:16.268Z] [INFO] 
04:37:16 [2021-09-15T08:37:16.268Z] [INFO] --- maven-resources-plugin:3.0.2:resources (default-resources) @ org.eclipse.tracecompass.tmf.ui.tests ---
04:37:16 [2021-09-15T08:37:16.268Z] [INFO] Using 'UTF-8' encoding to copy filtered resources.
04:37:16 [2021-09-15T08:37:16.268Z] [INFO] skip non existing resourceDirectory /home/jenkins/agent/workspace/tracecompass-stable-release-nightly-new/tmf/org.eclipse.tracecompass.tmf.ui.tests/src/main/resources
04:37:16 [2021-09-15T08:37:16.268Z] [INFO] 
04:37:16 [2021-09-15T08:37:16.268Z] [INFO] --- tycho-compiler-plugin:2.3.0:compile (default-compile) @ org.eclipse.tracecompass.tmf.ui.tests ---
04:37:16 [2021-09-15T08:37:16.268Z] [WARNING] The effective compiler target level 11 is incompatible with the following OSGi execution environments: [JavaSE-1.8 (assumes 1.8)] @ MavenProject: org.eclipse.tracecompass:org.eclipse.tracecompass.tmf.ui.tests:1.0.17-SNAPSHOT @ /home/jenkins/agent/workspace/tracecompass-stable-release-nightly-new/tmf/org.eclipse.tracecompass.tmf.ui.tests/pom.xml
04:37:16 [2021-09-15T08:37:16.268Z] [INFO] Compiling 55 source files to /home/jenkins/agent/workspace/tracecompass-stable-release-nightly-new/tmf/org.eclipse.tracecompass.tmf.ui.tests/target/classes
04:37:17 [2021-09-15T08:37:17.200Z] [INFO] 
04:37:17 [2021-09-15T08:37:17.201Z] [INFO] --- maven-resources-plugin:3.0.2:testResources (default-testResources) @ org.eclipse.tracecompass.tmf.ui.tests ---
04:37:17 [2021-09-15T08:37:17.201Z] [INFO] Using 'UTF-8' encoding to copy filtered resources.
04:37:17 [2021-09-15T08:37:17.201Z] [INFO] skip non existing resourceDirectory /home/jenkins/agent/workspace/tracecompass-stable-release-nightly-new/tmf/org.eclipse.tracecompass.tmf.ui.tests/src/test/resources
04:37:17 [2021-09-15T08:37:17.201Z] [INFO] 
04:37:17 [2021-09-15T08:37:17.201Z] [INFO] --- tycho-source-plugin:2.3.0:plugin-source (plugin-source) @ org.eclipse.tracecompass.tmf.ui.tests ---
04:37:17 [2021-09-15T08:37:17.201Z] [INFO] Building jar: /home/jenkins/agent/workspace/tracecompass-stable-release-nightly-new/tmf/org.eclipse.tracecompass.tmf.ui.tests/target/org.eclipse.tracecompass.tmf.ui.tests-1.0.17-SNAPSHOT-sources.jar
04:37:17 [2021-09-15T08:37:17.201Z] [INFO] 
04:37:17 [2021-09-15T08:37:17.201Z] [INFO] --- target-platform-configuration:2.3.0:target-platform (default-target-platform) @ org.eclipse.tracecompass.tmf.ui.tests ---
04:37:17 [2021-09-15T08:37:17.201Z] [INFO] 
04:37:17 [2021-09-15T08:37:17.201Z] [INFO] --- tycho-packaging-plugin:2.3.0:package-plugin (default-package-plugin) @ org.eclipse.tracecompass.tmf.ui.tests ---
04:37:17 [2021-09-15T08:37:17.201Z] [INFO] Building jar: /home/jenkins/agent/workspace/tracecompass-stable-release-nightly-new/tmf/org.eclipse.tracecompass.tmf.ui.tests/target/org.eclipse.tracecompass.tmf.ui.tests-1.0.17-SNAPSHOT.jar
04:37:17 [2021-09-15T08:37:17.458Z] [INFO] 
04:37:17 [2021-09-15T08:37:17.458Z] [INFO] --- tycho-p2-plugin:2.3.0:p2-metadata-default (default-p2-metadata-default) @ org.eclipse.tracecompass.tmf.ui.tests ---
04:37:17 [2021-09-15T08:37:17.458Z] [INFO] 
04:37:17 [2021-09-15T08:37:17.458Z] [INFO] --- tycho-source-feature-plugin:2.3.0:source-feature (source-feature) @ org.eclipse.tracecompass.tmf.ui.tests ---
04:37:17 [2021-09-15T08:37:17.458Z] [WARNING] Mojo tycho-source-feature-plugin:source-feature is replaced by the tycho-source-plugin:feature-source which offers equivalent and even enhanced functionality
04:37:17 [2021-09-15T08:37:17.458Z] [INFO] 
04:37:17 [2021-09-15T08:37:17.458Z] [INFO] --- tycho-pack200a-plugin:2.3.0:normalize (pack200-normalize) @ org.eclipse.tracecompass.tmf.ui.tests ---
04:37:17 [2021-09-15T08:37:17.458Z] [WARNING] Pack200 actions are deprecated and scheduled for removal.
04:37:17 [2021-09-15T08:37:17.458Z] [INFO] Pack200 normalizing jar /home/jenkins/agent/workspace/tracecompass-stable-release-nightly-new/tmf/org.eclipse.tracecompass.tmf.ui.tests/target/org.eclipse.tracecompass.tmf.ui.tests-1.0.17-SNAPSHOT.jar
04:37:18 [2021-09-15T08:37:18.023Z] [INFO] 
04:37:18 [2021-09-15T08:37:18.023Z] [INFO] --- eclipse-jarsigner-plugin:1.3.1:sign (sign) @ org.eclipse.tracecompass.tmf.ui.tests ---
04:37:18 [2021-09-15T08:37:18.280Z] [INFO] Signing jar: /home/jenkins/agent/workspace/tracecompass-stable-release-nightly-new/tmf/org.eclipse.tracecompass.tmf.ui.tests/target/org.eclipse.tracecompass.tmf.ui.tests-1.0.17-SNAPSHOT.jar
04:37:20 [2021-09-15T08:37:20.173Z] [INFO] Signing jar: /home/jenkins/agent/workspace/tracecompass-stable-release-nightly-new/tmf/org.eclipse.tracecompass.tmf.ui.tests/target/org.eclipse.tracecompass.tmf.ui.tests-1.0.17-SNAPSHOT-sources.jar
04:37:22 [2021-09-15T08:37:22.698Z] [INFO] 
04:37:22 [2021-09-15T08:37:22.698Z] [INFO] --- tycho-pack200b-plugin:2.3.0:pack (pack200-pack) @ org.eclipse.tracecompass.tmf.ui.tests ---
04:37:22 [2021-09-15T08:37:22.698Z] [WARNING] Pack200 actions are deprecated and scheduled for removal.
04:37:22 [2021-09-15T08:37:22.698Z] [INFO] Pack200 packing jar /home/jenkins/agent/workspace/tracecompass-stable-release-nightly-new/tmf/org.eclipse.tracecompass.tmf.ui.tests/target/org.eclipse.tracecompass.tmf.ui.tests-1.0.17-SNAPSHOT.jar
04:37:22 [2021-09-15T08:37:22.962Z] [INFO] 
04:37:22 [2021-09-15T08:37:22.962Z] [INFO] --- tycho-p2-plugin:2.3.0:p2-metadata (p2-metadata) @ org.eclipse.tracecompass.tmf.ui.tests ---
04:37:22 [2021-09-15T08:37:22.963Z] [INFO] 
04:37:22 [2021-09-15T08:37:22.963Z] [INFO] --- tycho-surefire-plugin:2.3.0:test (default-test) @ org.eclipse.tracecompass.tmf.ui.tests ---
04:37:23 [2021-09-15T08:37:23.526Z] [INFO] Executing Test Runtime with timeout 0, logs (if any) will be placed at: /home/jenkins/agent/workspace/tracecompass-stable-release-nightly-new/tmf/org.eclipse.tracecompass.tmf.ui.tests/target/work/data/.metadata/.log
04:37:23 [2021-09-15T08:37:23.526Z] [INFO] Command line:
04:37:23 [2021-09-15T08:37:23.526Z] 	[/opt/tools/java/openjdk/jdk-11/11.0.2+9/bin/java, -Dosgi.noShutdown=false, -Dosgi.os=linux, -Dosgi.ws=gtk, -Dosgi.arch=x86_64, -Dorg.eclipse.swt.browser.DefaultType=mozilla, -Xms512m, -Xmx1024m, -Dosgi.clean=true, -jar, /home/jenkins/.m2/repository/p2/osgi/bundle/org.eclipse.equinox.launcher/1.6.300.v20210813-1054/org.eclipse.equinox.launcher-1.6.300.v20210813-1054.jar, -data, /home/jenkins/agent/workspace/tracecompass-stable-release-nightly-new/tmf/org.eclipse.tracecompass.tmf.ui.tests/target/work/data, -install, /home/jenkins/agent/workspace/tracecompass-stable-release-nightly-new/tmf/org.eclipse.tracecompass.tmf.ui.tests/target/work, -configuration, /home/jenkins/agent/workspace/tracecompass-stable-release-nightly-new/tmf/org.eclipse.tracecompass.tmf.ui.tests/target/work/configuration, -application, org.eclipse.tycho.surefire.osgibooter.uitest, -testproperties, /home/jenkins/agent/workspace/tracecompass-stable-release-nightly-new/tmf/org.eclipse.tracecompass.tmf.ui.tests/target/surefire.properties, -product, org.eclipse.platform.ide, -consoleLog]
04:37:23 [2021-09-15T08:37:23.526Z] Picked up _JAVA_OPTIONS: -Duser.home=/home/tracecompass
04:37:27 [2021-09-15T08:37:27.708Z] !SESSION 2021-09-15 08:37:23.485 -----------------------------------------------
04:37:27 [2021-09-15T08:37:27.708Z] eclipse.buildId=unknown
04:37:27 [2021-09-15T08:37:27.708Z] java.version=11.0.2
04:37:27 [2021-09-15T08:37:27.708Z] java.vendor=Oracle Corporation
04:37:27 [2021-09-15T08:37:27.708Z] BootLoader constants: OS=linux, ARCH=x86_64, WS=gtk, NL=en_US
04:37:27 [2021-09-15T08:37:27.708Z] Framework arguments:  -application org.eclipse.tycho.surefire.osgibooter.uitest -testproperties /home/jenkins/agent/workspace/tracecompass-stable-release-nightly-new/tmf/org.eclipse.tracecompass.tmf.ui.tests/target/surefire.properties -product org.eclipse.platform.ide
04:37:27 [2021-09-15T08:37:27.708Z] Command-line arguments:  -data /home/jenkins/agent/workspace/tracecompass-stable-release-nightly-new/tmf/org.eclipse.tracecompass.tmf.ui.tests/target/work/data -application org.eclipse.tycho.surefire.osgibooter.uitest -testproperties /home/jenkins/agent/workspace/tracecompass-stable-release-nightly-new/tmf/org.eclipse.tracecompass.tmf.ui.tests/target/surefire.properties -product org.eclipse.platform.ide -consoleLog
04:37:27 [2021-09-15T08:37:27.708Z] 
04:37:27 [2021-09-15T08:37:27.708Z] !ENTRY org.eclipse.compare.win32 4 0 2021-09-15 08:37:27.300
04:37:27 [2021-09-15T08:37:27.708Z] !MESSAGE FrameworkEvent ERROR
04:37:27 [2021-09-15T08:37:27.708Z] !STACK 0
04:37:27 [2021-09-15T08:37:27.708Z] org.osgi.framework.BundleException: Could not resolve module: org.eclipse.compare.win32 [69]
04:37:27 [2021-09-15T08:37:27.708Z]   Unresolved requirement: Require-Capability: eclipse.platform; filter:="(osgi.os=win32)"
04:37:27 [2021-09-15T08:37:27.708Z] 
04:37:27 [2021-09-15T08:37:27.708Z] 	at org.eclipse.osgi.container.Module.start(Module.java:463)
04:37:27 [2021-09-15T08:37:27.708Z] 	at org.eclipse.osgi.container.ModuleContainer$ContainerStartLevel.lambda$1(ModuleContainer.java:1834)
04:37:27 [2021-09-15T08:37:27.708Z] 	at org.eclipse.osgi.container.ModuleContainer$ContainerStartLevel.incStartLevel(ModuleContainer.java:1829)
04:37:27 [2021-09-15T08:37:27.708Z] 	at org.eclipse.osgi.container.ModuleContainer$ContainerStartLevel.incStartLevel(ModuleContainer.java:1775)
04:37:27 [2021-09-15T08:37:27.708Z] 	at org.eclipse.osgi.container.ModuleContainer$ContainerStartLevel.doContainerStartLevel(ModuleContainer.java:1739)
04:37:27 [2021-09-15T08:37:27.708Z] 	at org.eclipse.osgi.container.ModuleContainer$ContainerStartLevel.dispatchEvent(ModuleContainer.java:1661)
04:37:27 [2021-09-15T08:37:27.708Z] 	at org.eclipse.osgi.container.ModuleContainer$ContainerStartLevel.dispatchEvent(ModuleContainer.java:1)
04:37:27 [2021-09-15T08:37:27.708Z] 	at org.eclipse.osgi.framework.eventmgr.EventManager.dispatchEvent(EventManager.java:228)
04:37:27 [2021-09-15T08:37:27.708Z] 	at org.eclipse.osgi.framework.eventmgr.EventManager$EventThread.run(EventManager.java:339)
04:37:27 [2021-09-15T08:37:27.965Z] 
04:37:27 [2021-09-15T08:37:27.965Z] !ENTRY org.eclipse.ecf.provider.filetransfer.httpclient45.win32 4 0 2021-09-15 08:37:27.768
04:37:27 [2021-09-15T08:37:27.965Z] !MESSAGE FrameworkEvent ERROR
04:37:27 [2021-09-15T08:37:27.965Z] !STACK 0
04:37:27 [2021-09-15T08:37:27.965Z] org.osgi.framework.BundleException: Could not resolve module: org.eclipse.ecf.provider.filetransfer.httpclient45.win32 [141]
04:37:27 [2021-09-15T08:37:27.965Z]   Unresolved requirement: Require-Capability: eclipse.platform; filter:="(osgi.os=win32)"
04:37:27 [2021-09-15T08:37:27.965Z]   Unresolved requirement: Import-Package: org.apache.http.impl.auth.win; version="[4.5.0,5.0.0)"
04:37:27 [2021-09-15T08:37:27.965Z]     -> Export-Package: org.apache.http.impl.auth.win; bundle-symbolic-name="org.apache.httpcomponents.httpclient.win"; bundle-version="4.5.13.v20210128-2225"; version="4.5.13"; x-internal:="true"; uses:="org.apache.http,org.apache.http.auth,org.apache.http.client,org.apache.http.impl.auth,org.apache.http.protocol,org.apache.http.util"
04:37:27 [2021-09-15T08:37:27.965Z]        org.apache.httpcomponents.httpclient.win [38]
04:37:27 [2021-09-15T08:37:27.965Z]          Unresolved requirement: Require-Capability: eclipse.platform; filter:="(osgi.os=win32)"
04:37:27 [2021-09-15T08:37:27.965Z] 
04:37:27 [2021-09-15T08:37:27.965Z] 	at org.eclipse.osgi.container.Module.start(Module.java:463)
04:37:27 [2021-09-15T08:37:27.965Z] 	at org.eclipse.osgi.container.ModuleContainer$ContainerStartLevel.lambda$1(ModuleContainer.java:1834)
04:37:27 [2021-09-15T08:37:27.965Z] 	at org.eclipse.osgi.container.ModuleContainer$ContainerStartLevel.incStartLevel(ModuleContainer.java:1829)
04:37:27 [2021-09-15T08:37:27.965Z] 	at org.eclipse.osgi.container.ModuleContainer$ContainerStartLevel.incStartLevel(ModuleContainer.java:1775)
04:37:27 [2021-09-15T08:37:27.965Z] 	at org.eclipse.osgi.container.ModuleContainer$ContainerStartLevel.doContainerStartLevel(ModuleContainer.java:1739)
04:37:27 [2021-09-15T08:37:27.965Z] 	at org.eclipse.osgi.container.ModuleContainer$ContainerStartLevel.dispatchEvent(ModuleContainer.java:1661)
04:37:27 [2021-09-15T08:37:27.965Z] 	at org.eclipse.osgi.container.ModuleContainer$ContainerStartLevel.dispatchEvent(ModuleContainer.java:1)
04:37:27 [2021-09-15T08:37:27.965Z] 	at org.eclipse.osgi.framework.eventmgr.EventManager.dispatchEvent(EventManager.java:228)
04:37:27 [2021-09-15T08:37:27.965Z] 	at org.eclipse.osgi.framework.eventmgr.EventManager$EventThread.run(EventManager.java:339)
04:37:28 [2021-09-15T08:37:28.530Z] SWT SessionManagerDBus: Failed to connect to org.gnome.SessionManager: Failed to execute child process “dbus-launch” (No such file or directory)
04:37:28 [2021-09-15T08:37:28.530Z] SWT SessionManagerDBus: Failed to connect to org.xfce.SessionManager: Failed to execute child process “dbus-launch” (No such file or directory)
04:37:35 [2021-09-15T08:37:35.086Z] 
04:37:35 [2021-09-15T08:37:35.086Z] !ENTRY org.eclipse.urischeme 4 0 2021-09-15 08:37:34.002
04:37:35 [2021-09-15T08:37:35.086Z] !MESSAGE Cannot run program "xdg-mime": error=2, No such file or directory
04:37:35 [2021-09-15T08:37:35.086Z] !STACK 0
04:37:35 [2021-09-15T08:37:35.086Z] java.io.IOException: Cannot run program "xdg-mime": error=2, No such file or directory
04:37:35 [2021-09-15T08:37:35.086Z] 	at java.base/java.lang.ProcessBuilder.start(ProcessBuilder.java:1128)
04:37:35 [2021-09-15T08:37:35.086Z] 	at java.base/java.lang.ProcessBuilder.start(ProcessBuilder.java:1071)
04:37:35 [2021-09-15T08:37:35.086Z] 	at org.eclipse.urischeme.internal.registration.ProcessExecutor.execute(ProcessExecutor.java:36)
04:37:35 [2021-09-15T08:37:35.086Z] 	at org.eclipse.urischeme.internal.registration.RegistrationLinux.getRegisteredDesktopFileForScheme(RegistrationLinux.java:145)
04:37:35 [2021-09-15T08:37:35.086Z] 	at org.eclipse.urischeme.internal.registration.RegistrationLinux.determineHandlerLocation(RegistrationLinux.java:87)
04:37:35 [2021-09-15T08:37:35.086Z] 	at org.eclipse.urischeme.internal.registration.RegistrationLinux.getSchemesInformation(RegistrationLinux.java:76)
04:37:35 [2021-09-15T08:37:35.086Z] 	at org.eclipse.urischeme.AutoRegisterSchemeHandlersJob.run(AutoRegisterSchemeHandlersJob.java:87)
04:37:35 [2021-09-15T08:37:35.086Z] 	at org.eclipse.core.internal.jobs.Worker.run(Worker.java:63)
04:37:35 [2021-09-15T08:37:35.086Z] Caused by: java.io.IOException: error=2, No such file or directory
04:37:35 [2021-09-15T08:37:35.086Z] 	at java.base/java.lang.ProcessImpl.forkAndExec(Native Method)
04:37:35 [2021-09-15T08:37:35.086Z] 	at java.base/java.lang.ProcessImpl.<init>(ProcessImpl.java:340)
04:37:35 [2021-09-15T08:37:35.086Z] 	at java.base/java.lang.ProcessImpl.start(ProcessImpl.java:271)
04:37:35 [2021-09-15T08:37:35.086Z] 	at java.base/java.lang.ProcessBuilder.start(ProcessBuilder.java:1107)
04:37:35 [2021-09-15T08:37:35.086Z] 	... 7 more
04:37:35 [2021-09-15T08:37:35.651Z] Running org.eclipse.tracecompass.tmf.ui.tests.statistics.TmfBaseColumnDataProviderTest
04:37:35 [2021-09-15T08:37:35.652Z] Tests run: 1, Failures: 0, Errors: 0, Skipped: 0, Time elapsed: 0.021 s - in org.eclipse.tracecompass.tmf.ui.tests.statistics.TmfBaseColumnDataProviderTest
04:37:35 [2021-09-15T08:37:35.652Z] testGetColumnData  Time elapsed: 0.015 s
04:37:35 [2021-09-15T08:37:35.652Z] Running org.eclipse.tracecompass.tmf.ui.tests.statistics.TmfBaseColumnDataTest
04:37:35 [2021-09-15T08:37:35.652Z] Tests run: 7, Failures: 0, Errors: 0, Skipped: 0, Time elapsed: 0.002 s - in org.eclipse.tracecompass.tmf.ui.tests.statistics.TmfBaseColumnDataTest
04:37:35 [2021-09-15T08:37:35.652Z] testGetWidth  Time elapsed: 0.001 s
04:37:35 [2021-09-15T08:37:35.652Z] testGetAlignment  Time elapsed: 0 s
04:37:35 [2021-09-15T08:37:35.652Z] testGetLabelProvider  Time elapsed: 0.001 s
04:37:35 [2021-09-15T08:37:35.652Z] testGetTooltip  Time elapsed: 0 s
04:37:35 [2021-09-15T08:37:35.652Z] testGetComparator  Time elapsed: 0 s
04:37:35 [2021-09-15T08:37:35.652Z] testGetPercentageProvider  Time elapsed: 0 s
04:37:35 [2021-09-15T08:37:35.652Z] testGetHeader  Time elapsed: 0 s
04:37:35 [2021-09-15T08:37:35.652Z] Running org.eclipse.tracecompass.tmf.ui.tests.statistics.TmfStatisticsTreeManagerTest
04:37:35 [2021-09-15T08:37:35.652Z] Tests run: 6, Failures: 0, Errors: 0, Skipped: 0, Time elapsed: 0.001 s - in org.eclipse.tracecompass.tmf.ui.tests.statistics.TmfStatisticsTreeManagerTest
04:37:35 [2021-09-15T08:37:35.652Z] testaddStatsTreeRoot  Time elapsed: 0 s
04:37:35 [2021-09-15T08:37:35.652Z] testGetStatTree  Time elapsed: 0.001 s
04:37:35 [2021-09-15T08:37:35.652Z] testContainsTreeRoot  Time elapsed: 0 s
04:37:35 [2021-09-15T08:37:35.652Z] testRemoveStatTreeRoot  Time elapsed: 0 s
04:37:35 [2021-09-15T08:37:35.652Z] testGetStatTreeRoot  Time elapsed: 0 s
04:37:35 [2021-09-15T08:37:35.652Z] testRemoveAll  Time elapsed: 0 s
04:37:35 [2021-09-15T08:37:35.652Z] Running org.eclipse.tracecompass.tmf.ui.tests.statistics.TmfStatisticsTreeNodeTest
04:37:35 [2021-09-15T08:37:35.652Z] Tests run: 11, Failures: 0, Errors: 0, Skipped: 0, Time elapsed: 0.002 s - in org.eclipse.tracecompass.tmf.ui.tests.statistics.TmfStatisticsTreeNodeTest
04:37:35 [2021-09-15T08:37:35.652Z] testgetName  Time elapsed: 0 s
04:37:35 [2021-09-15T08:37:35.652Z] testGetValue  Time elapsed: 0.001 s
04:37:35 [2021-09-15T08:37:35.652Z] testResetTimeRangeValue  Time elapsed: 0 s
04:37:35 [2021-09-15T08:37:35.652Z] testGetChildren  Time elapsed: 0 s
04:37:35 [2021-09-15T08:37:35.652Z] testReset  Time elapsed: 0 s
04:37:35 [2021-09-15T08:37:35.652Z] testGetPath  Time elapsed: 0 s
04:37:35 [2021-09-15T08:37:35.652Z] testResetGlobalValue  Time elapsed: 0 s
04:37:35 [2021-09-15T08:37:35.652Z] testHasChildren  Time elapsed: 0.001 s
04:37:35 [2021-09-15T08:37:35.652Z] testContainsChild  Time elapsed: 0 s
04:37:35 [2021-09-15T08:37:35.652Z] testGetParent  Time elapsed: 0 s
04:37:35 [2021-09-15T08:37:35.652Z] testGetNbChildren  Time elapsed: 0 s
04:37:35 [2021-09-15T08:37:35.652Z] Running org.eclipse.tracecompass.tmf.ui.tests.statistics.TmfStatisticsTest
04:37:35 [2021-09-15T08:37:35.652Z] Tests run: 4, Failures: 0, Errors: 0, Skipped: 0, Time elapsed: 0.001 s - in org.eclipse.tracecompass.tmf.ui.tests.statistics.TmfStatisticsTest
04:37:35 [2021-09-15T08:37:35.652Z] testResetPartial  Time elapsed: 0 s
04:37:35 [2021-09-15T08:37:35.652Z] testInitialState  Time elapsed: 0 s
04:37:35 [2021-09-15T08:37:35.652Z] testResetTotal  Time elapsed: 0 s
04:37:35 [2021-09-15T08:37:35.652Z] testSetValue  Time elapsed: 0 s
04:37:35 [2021-09-15T08:37:35.652Z] Running org.eclipse.tracecompass.tmf.ui.tests.statistics.TmfTreeContentProviderTest
04:37:35 [2021-09-15T08:37:35.652Z] Tests run: 4, Failures: 0, Errors: 0, Skipped: 0, Time elapsed: 0.001 s - in org.eclipse.tracecompass.tmf.ui.tests.statistics.TmfTreeContentProviderTest
04:37:35 [2021-09-15T08:37:35.652Z] testGetChildren  Time elapsed: 0 s
04:37:35 [2021-09-15T08:37:35.652Z] testHasChildren  Time elapsed: 0 s
04:37:35 [2021-09-15T08:37:35.652Z] testGetParent  Time elapsed: 0 s
04:37:35 [2021-09-15T08:37:35.652Z] testGetElements  Time elapsed: 0 s
04:37:35 [2021-09-15T08:37:35.652Z] Running org.eclipse.tracecompass.tmf.ui.tests.statistics.TmfBaseStatisticsDataTest
04:37:35 [2021-09-15T08:37:35.652Z] Tests run: 6, Failures: 0, Errors: 0, Skipped: 0, Time elapsed: 0.002 s - in org.eclipse.tracecompass.tmf.ui.tests.statistics.TmfBaseStatisticsDataTest
04:37:35 [2021-09-15T08:37:35.652Z] testGet  Time elapsed: 0.001 s
04:37:35 [2021-09-15T08:37:35.652Z] testGetChildren  Time elapsed: 0 s
04:37:35 [2021-09-15T08:37:35.652Z] testReset  Time elapsed: 0 s
04:37:35 [2021-09-15T08:37:35.652Z] testRegisterEvent  Time elapsed: 0 s
04:37:35 [2021-09-15T08:37:35.652Z] testGetParent  Time elapsed: 0 s
04:37:35 [2021-09-15T08:37:35.652Z] testGetOrCreate  Time elapsed: 0.001 s
04:37:35 [2021-09-15T08:37:35.652Z] Running org.eclipse.tracecompass.tmf.ui.tests.actions.HttpTraceImportOperationTest
04:37:36 [2021-09-15T08:37:36.216Z] Tests run: 3, Failures: 3, Errors: 0, Skipped: 0, Time elapsed: 0.6 s <<< FAILURE! - in org.eclipse.tracecompass.tmf.ui.tests.actions.HttpTraceImportOperationTest
04:37:36 [2021-09-15T08:37:36.216Z] testTraceImport  Time elapsed: 0.197 s  <<< FAILURE!
04:37:36 [2021-09-15T08:37:36.216Z] java.lang.AssertionError: expected:<1> but was:<0>
04:37:36 [2021-09-15T08:37:36.216Z] 	at org.junit.Assert.fail(Assert.java:89)
04:37:36 [2021-09-15T08:37:36.216Z] 	at org.junit.Assert.failNotEquals(Assert.java:835)
04:37:36 [2021-09-15T08:37:36.216Z] 	at org.junit.Assert.assertEquals(Assert.java:647)
04:37:36 [2021-09-15T08:37:36.216Z] 	at org.junit.Assert.assertEquals(Assert.java:633)
04:37:36 [2021-09-15T08:37:36.216Z] 	at org.eclipse.tracecompass.tmf.ui.tests.actions.HttpTraceImportOperationTest.validateImport(HttpTraceImportOperationTest.java:143)
04:37:36 [2021-09-15T08:37:36.216Z] 	at org.eclipse.tracecompass.tmf.ui.tests.actions.HttpTraceImportOperationTest.testTraceImport(HttpTraceImportOperationTest.java:101)
04:37:36 [2021-09-15T08:37:36.216Z] 	at java.base/jdk.internal.reflect.NativeMethodAccessorImpl.invoke0(Native Method)
04:37:36 [2021-09-15T08:37:36.216Z] 	at java.base/jdk.internal.reflect.NativeMethodAccessorImpl.invoke(NativeMethodAccessorImpl.java:62)
04:37:36 [2021-09-15T08:37:36.216Z] 	at java.base/jdk.internal.reflect.DelegatingMethodAccessorImpl.invoke(DelegatingMethodAccessorImpl.java:43)
04:37:36 [2021-09-15T08:37:36.216Z] 	at java.base/java.lang.reflect.Method.invoke(Method.java:566)
04:37:36 [2021-09-15T08:37:36.216Z] 	at org.junit.runners.model.FrameworkMethod$1.runReflectiveCall(FrameworkMethod.java:59)
04:37:36 [2021-09-15T08:37:36.216Z] 	at org.junit.internal.runners.model.ReflectiveCallable.run(ReflectiveCallable.java:12)
04:37:36 [2021-09-15T08:37:36.216Z] 	at org.junit.runners.model.FrameworkMethod.invokeExplosively(FrameworkMethod.java:56)
04:37:36 [2021-09-15T08:37:36.216Z] 	at org.junit.internal.runners.statements.InvokeMethod.evaluate(InvokeMethod.java:17)
04:37:36 [2021-09-15T08:37:36.216Z] 	at org.junit.runners.ParentRunner$3.evaluate(ParentRunner.java:306)
04:37:36 [2021-09-15T08:37:36.216Z] 	at org.junit.runners.BlockJUnit4ClassRunner$1.evaluate(BlockJUnit4ClassRunner.java:100)
04:37:36 [2021-09-15T08:37:36.216Z] 	at org.junit.runners.ParentRunner.runLeaf(ParentRunner.java:366)
04:37:36 [2021-09-15T08:37:36.216Z] 	at org.junit.runners.BlockJUnit4ClassRunner.runChild(BlockJUnit4ClassRunner.java:103)
04:37:36 [2021-09-15T08:37:36.216Z] 	at org.junit.runners.BlockJUnit4ClassRunner.runChild(BlockJUnit4ClassRunner.java:63)
04:37:36 [2021-09-15T08:37:36.216Z] 	at org.junit.runners.ParentRunner$4.run(ParentRunner.java:331)
04:37:36 [2021-09-15T08:37:36.216Z] 	at org.junit.runners.ParentRunner$1.schedule(ParentRunner.java:79)
04:37:36 [2021-09-15T08:37:36.216Z] 	at org.junit.runners.ParentRunner.runChildren(ParentRunner.java:329)
04:37:36 [2021-09-15T08:37:36.216Z] 	at org.junit.runners.ParentRunner.access$100(ParentRunner.java:66)
04:37:36 [2021-09-15T08:37:36.216Z] 	at org.junit.runners.ParentRunner$2.evaluate(ParentRunner.java:293)
04:37:36 [2021-09-15T08:37:36.216Z] 	at org.junit.internal.runners.statements.RunBefores.evaluate(RunBefores.java:26)
04:37:36 [2021-09-15T08:37:36.216Z] 	at org.junit.internal.runners.statements.RunAfters.evaluate(RunAfters.java:27)
04:37:36 [2021-09-15T08:37:36.216Z] 	at org.junit.runners.ParentRunner$3.evaluate(ParentRunner.java:306)
04:37:36 [2021-09-15T08:37:36.216Z] 	at org.junit.runners.ParentRunner.run(ParentRunner.java:413)
04:37:36 [2021-09-15T08:37:36.216Z] 	at org.junit.runner.JUnitCore.run(JUnitCore.java:137)
04:37:36 [2021-09-15T08:37:36.216Z] 	at org.junit.runner.JUnitCore.run(JUnitCore.java:115)
04:37:36 [2021-09-15T08:37:36.216Z] 	at org.junit.vintage.engine.execution.RunnerExecutor.execute(RunnerExecutor.java:43)
04:37:36 [2021-09-15T08:37:36.216Z] 	at java.base/java.util.stream.ForEachOps$ForEachOp$OfRef.accept(ForEachOps.java:183)
04:37:36 [2021-09-15T08:37:36.216Z] 	at java.base/java.util.stream.ReferencePipeline$3$1.accept(ReferencePipeline.java:195)
04:37:36 [2021-09-15T08:37:36.216Z] 	at java.base/java.util.Iterator.forEachRemaining(Iterator.java:133)
04:37:36 [2021-09-15T08:37:36.216Z] 	at java.base/java.util.Spliterators$IteratorSpliterator.forEachRemaining(Spliterators.java:1801)
04:37:36 [2021-09-15T08:37:36.216Z] 	at java.base/java.util.stream.AbstractPipeline.copyInto(AbstractPipeline.java:484)
04:37:36 [2021-09-15T08:37:36.216Z] 	at java.base/java.util.stream.AbstractPipeline.wrapAndCopyInto(AbstractPipeline.java:474)
04:37:36 [2021-09-15T08:37:36.216Z] 	at java.base/java.util.stream.ForEachOps$ForEachOp.evaluateSequential(ForEachOps.java:150)
04:37:36 [2021-09-15T08:37:36.216Z] 	at java.base/java.util.stream.ForEachOps$ForEachOp$OfRef.evaluateSequential(ForEachOps.java:173)
04:37:36 [2021-09-15T08:37:36.216Z] 	at java.base/java.util.stream.AbstractPipeline.evaluate(AbstractPipeline.java:234)
04:37:36 [2021-09-15T08:37:36.216Z] 	at java.base/java.util.stream.ReferencePipeline.forEach(ReferencePipeline.java:497)
04:37:36 [2021-09-15T08:37:36.216Z] 	at org.junit.vintage.engine.VintageTestEngine.executeAllChildren(VintageTestEngine.java:82)
04:37:36 [2021-09-15T08:37:36.216Z] 	at org.junit.vintage.engine.VintageTestEngine.execute(VintageTestEngine.java:73)
04:37:36 [2021-09-15T08:37:36.216Z] 	at org.junit.platform.launcher.core.EngineExecutionOrchestrator.execute(EngineExecutionOrchestrator.java:108)
04:37:36 [2021-09-15T08:37:36.216Z] 	at org.junit.platform.launcher.core.EngineExecutionOrchestrator.execute(EngineExecutionOrchestrator.java:88)
04:37:36 [2021-09-15T08:37:36.216Z] 	at org.junit.platform.launcher.core.EngineExecutionOrchestrator.lambda$execute$0(EngineExecutionOrchestrator.java:54)
04:37:36 [2021-09-15T08:37:36.216Z] 	at org.junit.platform.launcher.core.EngineExecutionOrchestrator.withInterceptedStreams(EngineExecutionOrchestrator.java:67)
04:37:36 [2021-09-15T08:37:36.217Z] 	at org.junit.platform.launcher.core.EngineExecutionOrchestrator.execute(EngineExecutionOrchestrator.java:52)
04:37:36 [2021-09-15T08:37:36.217Z] 	at org.junit.platform.launcher.core.DefaultLauncher.execute(DefaultLauncher.java:96)
04:37:36 [2021-09-15T08:37:36.217Z] 	at org.junit.platform.launcher.core.DefaultLauncher.execute(DefaultLauncher.java:75)
04:37:36 [2021-09-15T08:37:36.217Z] 	at org.apache.maven.surefire.junitplatform.JUnitPlatformProvider.invokeAllTests(JUnitPlatformProvider.java:150)
04:37:36 [2021-09-15T08:37:36.217Z] 	at org.apache.maven.surefire.junitplatform.JUnitPlatformProvider.invoke(JUnitPlatformProvider.java:124)
04:37:36 [2021-09-15T08:37:36.217Z] 	at java.base/jdk.internal.reflect.NativeMethodAccessorImpl.invoke0(Native Method)
04:37:36 [2021-09-15T08:37:36.217Z] 	at java.base/jdk.internal.reflect.NativeMethodAccessorImpl.invoke(NativeMethodAccessorImpl.java:62)
04:37:36 [2021-09-15T08:37:36.217Z] 	at java.base/jdk.internal.reflect.DelegatingMethodAccessorImpl.invoke(DelegatingMethodAccessorImpl.java:43)
04:37:36 [2021-09-15T08:37:36.217Z] 	at java.base/java.lang.reflect.Method.invoke(Method.java:566)
04:37:36 [2021-09-15T08:37:36.217Z] 	at org.apache.maven.surefire.util.ReflectionUtils.invokeMethodWithArray2(ReflectionUtils.java:206)
04:37:36 [2021-09-15T08:37:36.217Z] 	at org.apache.maven.surefire.booter.ProviderFactory$ProviderProxy.invoke(ProviderFactory.java:161)
04:37:36 [2021-09-15T08:37:36.217Z] 	at org.apache.maven.surefire.booter.ProviderFactory.invokeProvider(ProviderFactory.java:84)
04:37:36 [2021-09-15T08:37:36.217Z] 	at org.eclipse.tycho.surefire.osgibooter.OsgiSurefireBooter.run(OsgiSurefireBooter.java:116)
04:37:36 [2021-09-15T08:37:36.217Z] 	at org.eclipse.tycho.surefire.osgibooter.AbstractUITestApplication$1.run(AbstractUITestApplication.java:37)
04:37:36 [2021-09-15T08:37:36.217Z] 	at org.eclipse.swt.widgets.RunnableLock.run(RunnableLock.java:40)
04:37:36 [2021-09-15T08:37:36.217Z] 	at org.eclipse.swt.widgets.Synchronizer.runAsyncMessages(Synchronizer.java:185)
04:37:36 [2021-09-15T08:37:36.217Z] 	at org.eclipse.swt.widgets.Display.runAsyncMessages(Display.java:5101)
04:37:36 [2021-09-15T08:37:36.217Z] 	at org.eclipse.swt.widgets.Display.readAndDispatch(Display.java:4579)
04:37:36 [2021-09-15T08:37:36.217Z] 	at org.eclipse.e4.ui.internal.workbench.swt.PartRenderingEngine$5.run(PartRenderingEngine.java:1150)
04:37:36 [2021-09-15T08:37:36.217Z] 	at org.eclipse.core.databinding.observable.Realm.runWithDefault(Realm.java:338)
04:37:36 [2021-09-15T08:37:36.217Z] 	at org.eclipse.e4.ui.internal.workbench.swt.PartRenderingEngine.run(PartRenderingEngine.java:1041)
04:37:36 [2021-09-15T08:37:36.217Z] 	at org.eclipse.e4.ui.internal.workbench.E4Workbench.createAndRunUI(E4Workbench.java:155)
04:37:36 [2021-09-15T08:37:36.217Z] 	at org.eclipse.ui.internal.Workbench.lambda$3(Workbench.java:644)
04:37:36 [2021-09-15T08:37:36.217Z] 	at org.eclipse.core.databinding.observable.Realm.runWithDefault(Realm.java:338)
04:37:36 [2021-09-15T08:37:36.217Z] 	at org.eclipse.ui.internal.Workbench.createAndRunWorkbench(Workbench.java:551)
04:37:36 [2021-09-15T08:37:36.217Z] 	at org.eclipse.ui.PlatformUI.createAndRunWorkbench(PlatformUI.java:156)
04:37:36 [2021-09-15T08:37:36.217Z] 	at org.eclipse.ui.internal.ide.application.IDEApplication.start(IDEApplication.java:152)
04:37:36 [2021-09-15T08:37:36.217Z] 	at org.eclipse.tycho.surefire.osgibooter.UITestApplication.runApplication(UITestApplication.java:29)
04:37:36 [2021-09-15T08:37:36.217Z] 	at org.eclipse.tycho.surefire.osgibooter.AbstractUITestApplication.run(AbstractUITestApplication.java:122)
04:37:36 [2021-09-15T08:37:36.217Z] 	at org.eclipse.tycho.surefire.osgibooter.UITestApplication.start(UITestApplication.java:35)
04:37:36 [2021-09-15T08:37:36.217Z] 	at org.eclipse.equinox.internal.app.EclipseAppHandle.run(EclipseAppHandle.java:203)
04:37:36 [2021-09-15T08:37:36.217Z] 	at org.eclipse.core.runtime.internal.adaptor.EclipseAppLauncher.runApplication(EclipseAppLauncher.java:136)
04:37:36 [2021-09-15T08:37:36.217Z] 	at org.eclipse.core.runtime.internal.adaptor.EclipseAppLauncher.start(EclipseAppLauncher.java:104)
04:37:36 [2021-09-15T08:37:36.217Z] 	at org.eclipse.core.runtime.adaptor.EclipseStarter.run(EclipseStarter.java:401)
04:37:36 [2021-09-15T08:37:36.217Z] 	at org.eclipse.core.runtime.adaptor.EclipseStarter.run(EclipseStarter.java:255)
04:37:36 [2021-09-15T08:37:36.217Z] 	at java.base/jdk.internal.reflect.NativeMethodAccessorImpl.invoke0(Native Method)
04:37:36 [2021-09-15T08:37:36.217Z] 	at java.base/jdk.internal.reflect.NativeMethodAccessorImpl.invoke(NativeMethodAccessorImpl.java:62)
04:37:36 [2021-09-15T08:37:36.217Z] 	at java.base/jdk.internal.reflect.DelegatingMethodAccessorImpl.invoke(DelegatingMethodAccessorImpl.java:43)
04:37:36 [2021-09-15T08:37:36.217Z] 	at java.base/java.lang.reflect.Method.invoke(Method.java:566)
04:37:36 [2021-09-15T08:37:36.217Z] 	at org.eclipse.equinox.launcher.Main.invokeFramework(Main.java:659)
04:37:36 [2021-09-15T08:37:36.217Z] 	at org.eclipse.equinox.launcher.Main.basicRun(Main.java:596)
04:37:36 [2021-09-15T08:37:36.217Z] 	at org.eclipse.equinox.launcher.Main.run(Main.java:1467)
04:37:36 [2021-09-15T08:37:36.217Z] 	at org.eclipse.equinox.launcher.Main.main(Main.java:1440)
04:37:36 [2021-09-15T08:37:36.217Z] 
04:37:36 [2021-09-15T08:37:36.217Z] testMultipleTracesImport  Time elapsed: 0.03 s  <<< FAILURE!
04:37:36 [2021-09-15T08:37:36.217Z] java.lang.AssertionError: expected:<2> but was:<0>
04:37:36 [2021-09-15T08:37:36.217Z] 	at org.junit.Assert.fail(Assert.java:89)
04:37:36 [2021-09-15T08:37:36.217Z] 	at org.junit.Assert.failNotEquals(Assert.java:835)
04:37:36 [2021-09-15T08:37:36.217Z] 	at org.junit.Assert.assertEquals(Assert.java:647)
04:37:36 [2021-09-15T08:37:36.217Z] 	at org.junit.Assert.assertEquals(Assert.java:633)
04:37:36 [2021-09-15T08:37:36.217Z] 	at org.eclipse.tracecompass.tmf.ui.tests.actions.HttpTraceImportOperationTest.validateImport(HttpTraceImportOperationTest.java:143)
04:37:36 [2021-09-15T08:37:36.217Z] 	at org.eclipse.tracecompass.tmf.ui.tests.actions.HttpTraceImportOperationTest.testMultipleTracesImport(HttpTraceImportOperationTest.java:121)
04:37:36 [2021-09-15T08:37:36.217Z] 	at java.base/jdk.internal.reflect.NativeMethodAccessorImpl.invoke0(Native Method)
04:37:36 [2021-09-15T08:37:36.217Z] 	at java.base/jdk.internal.reflect.NativeMethodAccessorImpl.invoke(NativeMethodAccessorImpl.java:62)
04:37:36 [2021-09-15T08:37:36.217Z] 	at java.base/jdk.internal.reflect.DelegatingMethodAccessorImpl.invoke(DelegatingMethodAccessorImpl.java:43)
04:37:36 [2021-09-15T08:37:36.217Z] 	at java.base/java.lang.reflect.Method.invoke(Method.java:566)
04:37:36 [2021-09-15T08:37:36.217Z] 	at org.junit.runners.model.FrameworkMethod$1.runReflectiveCall(FrameworkMethod.java:59)
04:37:36 [2021-09-15T08:37:36.217Z] 	at org.junit.internal.runners.model.ReflectiveCallable.run(ReflectiveCallable.java:12)
04:37:36 [2021-09-15T08:37:36.217Z] 	at org.junit.runners.model.FrameworkMethod.invokeExplosively(FrameworkMethod.java:56)
04:37:36 [2021-09-15T08:37:36.217Z] 	at org.junit.internal.runners.statements.InvokeMethod.evaluate(InvokeMethod.java:17)
04:37:36 [2021-09-15T08:37:36.217Z] 	at org.junit.runners.ParentRunner$3.evaluate(ParentRunner.java:306)
04:37:36 [2021-09-15T08:37:36.217Z] 	at org.junit.runners.BlockJUnit4ClassRunner$1.evaluate(BlockJUnit4ClassRunner.java:100)
04:37:36 [2021-09-15T08:37:36.217Z] 	at org.junit.runners.ParentRunner.runLeaf(ParentRunner.java:366)
04:37:36 [2021-09-15T08:37:36.217Z] 	at org.junit.runners.BlockJUnit4ClassRunner.runChild(BlockJUnit4ClassRunner.java:103)
04:37:36 [2021-09-15T08:37:36.217Z] 	at org.junit.runners.BlockJUnit4ClassRunner.runChild(BlockJUnit4ClassRunner.java:63)
04:37:36 [2021-09-15T08:37:36.217Z] 	at org.junit.runners.ParentRunner$4.run(ParentRunner.java:331)
04:37:36 [2021-09-15T08:37:36.217Z] 	at org.junit.runners.ParentRunner$1.schedule(ParentRunner.java:79)
04:37:36 [2021-09-15T08:37:36.217Z] 	at org.junit.runners.ParentRunner.runChildren(ParentRunner.java:329)
04:37:36 [2021-09-15T08:37:36.217Z] 	at org.junit.runners.ParentRunner.access$100(ParentRunner.java:66)
04:37:36 [2021-09-15T08:37:36.217Z] 	at org.junit.runners.ParentRunner$2.evaluate(ParentRunner.java:293)
04:37:36 [2021-09-15T08:37:36.217Z] 	at org.junit.internal.runners.statements.RunBefores.evaluate(RunBefores.java:26)
04:37:36 [2021-09-15T08:37:36.217Z] 	at org.junit.internal.runners.statements.RunAfters.evaluate(RunAfters.java:27)
04:37:36 [2021-09-15T08:37:36.217Z] 	at org.junit.runners.ParentRunner$3.evaluate(ParentRunner.java:306)
04:37:36 [2021-09-15T08:37:36.217Z] 	at org.junit.runners.ParentRunner.run(ParentRunner.java:413)
04:37:36 [2021-09-15T08:37:36.217Z] 	at org.junit.runner.JUnitCore.run(JUnitCore.java:137)
04:37:36 [2021-09-15T08:37:36.217Z] 	at org.junit.runner.JUnitCore.run(JUnitCore.java:115)
04:37:36 [2021-09-15T08:37:36.217Z] 	at org.junit.vintage.engine.execution.RunnerExecutor.execute(RunnerExecutor.java:43)
04:37:36 [2021-09-15T08:37:36.217Z] 	at java.base/java.util.stream.ForEachOps$ForEachOp$OfRef.accept(ForEachOps.java:183)
04:37:36 [2021-09-15T08:37:36.217Z] 	at java.base/java.util.stream.ReferencePipeline$3$1.accept(ReferencePipeline.java:195)
04:37:36 [2021-09-15T08:37:36.217Z] 	at java.base/java.util.Iterator.forEachRemaining(Iterator.java:133)
04:37:36 [2021-09-15T08:37:36.217Z] 	at java.base/java.util.Spliterators$IteratorSpliterator.forEachRemaining(Spliterators.java:1801)
04:37:36 [2021-09-15T08:37:36.217Z] 	at java.base/java.util.stream.AbstractPipeline.copyInto(AbstractPipeline.java:484)
04:37:36 [2021-09-15T08:37:36.217Z] 	at java.base/java.util.stream.AbstractPipeline.wrapAndCopyInto(AbstractPipeline.java:474)
04:37:36 [2021-09-15T08:37:36.217Z] 	at java.base/java.util.stream.ForEachOps$ForEachOp.evaluateSequential(ForEachOps.java:150)
04:37:36 [2021-09-15T08:37:36.217Z] 	at java.base/java.util.stream.ForEachOps$ForEachOp$OfRef.evaluateSequential(ForEachOps.java:173)
04:37:36 [2021-09-15T08:37:36.217Z] 	at java.base/java.util.stream.AbstractPipeline.evaluate(AbstractPipeline.java:234)
04:37:36 [2021-09-15T08:37:36.217Z] 	at java.base/java.util.stream.ReferencePipeline.forEach(ReferencePipeline.java:497)
04:37:36 [2021-09-15T08:37:36.217Z] 	at org.junit.vintage.engine.VintageTestEngine.executeAllChildren(VintageTestEngine.java:82)
04:37:36 [2021-09-15T08:37:36.217Z] 	at org.junit.vintage.engine.VintageTestEngine.execute(VintageTestEngine.java:73)
04:37:36 [2021-09-15T08:37:36.217Z] 	at org.junit.platform.launcher.core.EngineExecutionOrchestrator.execute(EngineExecutionOrchestrator.java:108)
04:37:36 [2021-09-15T08:37:36.217Z] 	at org.junit.platform.launcher.core.EngineExecutionOrchestrator.execute(EngineExecutionOrchestrator.java:88)
04:37:36 [2021-09-15T08:37:36.217Z] 	at org.junit.platform.launcher.core.EngineExecutionOrchestrator.lambda$execute$0(EngineExecutionOrchestrator.java:54)
04:37:36 [2021-09-15T08:37:36.217Z] 	at org.junit.platform.launcher.core.EngineExecutionOrchestrator.withInterceptedStreams(EngineExecutionOrchestrator.java:67)
04:37:36 [2021-09-15T08:37:36.217Z] 	at org.junit.platform.launcher.core.EngineExecutionOrchestrator.execute(EngineExecutionOrchestrator.java:52)
04:37:36 [2021-09-15T08:37:36.217Z] 	at org.junit.platform.launcher.core.DefaultLauncher.execute(DefaultLauncher.java:96)
04:37:36 [2021-09-15T08:37:36.217Z] 	at org.junit.platform.launcher.core.DefaultLauncher.execute(DefaultLauncher.java:75)
04:37:36 [2021-09-15T08:37:36.217Z] 	at org.apache.maven.surefire.junitplatform.JUnitPlatformProvider.invokeAllTests(JUnitPlatformProvider.java:150)
04:37:36 [2021-09-15T08:37:36.217Z] 	at org.apache.maven.surefire.junitplatform.JUnitPlatformProvider.invoke(JUnitPlatformProvider.java:124)
04:37:36 [2021-09-15T08:37:36.217Z] 	at java.base/jdk.internal.reflect.NativeMethodAccessorImpl.invoke0(Native Method)
04:37:36 [2021-09-15T08:37:36.217Z] 	at java.base/jdk.internal.reflect.NativeMethodAccessorImpl.invoke(NativeMethodAccessorImpl.java:62)
04:37:36 [2021-09-15T08:37:36.217Z] 	at java.base/jdk.internal.reflect.DelegatingMethodAccessorImpl.invoke(DelegatingMethodAccessorImpl.java:43)
04:37:36 [2021-09-15T08:37:36.217Z] 	at java.base/java.lang.reflect.Method.invoke(Method.java:566)
04:37:36 [2021-09-15T08:37:36.217Z] 	at org.apache.maven.surefire.util.ReflectionUtils.invokeMethodWithArray2(ReflectionUtils.java:206)
04:37:36 [2021-09-15T08:37:36.217Z] 	at org.apache.maven.surefire.booter.ProviderFactory$ProviderProxy.invoke(ProviderFactory.java:161)
04:37:36 [2021-09-15T08:37:36.217Z] 	at org.apache.maven.surefire.booter.ProviderFactory.invokeProvider(ProviderFactory.java:84)
04:37:36 [2021-09-15T08:37:36.217Z] 	at org.eclipse.tycho.surefire.osgibooter.OsgiSurefireBooter.run(OsgiSurefireBooter.java:116)
04:37:36 [2021-09-15T08:37:36.217Z] 	at org.eclipse.tycho.surefire.osgibooter.AbstractUITestApplication$1.run(AbstractUITestApplication.java:37)
04:37:36 [2021-09-15T08:37:36.217Z] 	at org.eclipse.swt.widgets.RunnableLock.run(RunnableLock.java:40)
04:37:36 [2021-09-15T08:37:36.217Z] 	at org.eclipse.swt.widgets.Synchronizer.runAsyncMessages(Synchronizer.java:185)
04:37:36 [2021-09-15T08:37:36.217Z] 	at org.eclipse.swt.widgets.Display.runAsyncMessages(Display.java:5101)
04:37:36 [2021-09-15T08:37:36.217Z] 	at org.eclipse.swt.widgets.Display.readAndDispatch(Display.java:4579)
04:37:36 [2021-09-15T08:37:36.217Z] 	at org.eclipse.e4.ui.internal.workbench.swt.PartRenderingEngine$5.run(PartRenderingEngine.java:1150)
04:37:36 [2021-09-15T08:37:36.217Z] 	at org.eclipse.core.databinding.observable.Realm.runWithDefault(Realm.java:338)
04:37:36 [2021-09-15T08:37:36.217Z] 	at org.eclipse.e4.ui.internal.workbench.swt.PartRenderingEngine.run(PartRenderingEngine.java:1041)
04:37:36 [2021-09-15T08:37:36.217Z] 	at org.eclipse.e4.ui.internal.workbench.E4Workbench.createAndRunUI(E4Workbench.java:155)
04:37:36 [2021-09-15T08:37:36.217Z] 	at org.eclipse.ui.internal.Workbench.lambda$3(Workbench.java:644)
04:37:36 [2021-09-15T08:37:36.217Z] 	at org.eclipse.core.databinding.observable.Realm.runWithDefault(Realm.java:338)
04:37:36 [2021-09-15T08:37:36.217Z] 	at org.eclipse.ui.internal.Workbench.createAndRunWorkbench(Workbench.java:551)
04:37:36 [2021-09-15T08:37:36.217Z] 	at org.eclipse.ui.PlatformUI.createAndRunWorkbench(PlatformUI.java:156)
04:37:36 [2021-09-15T08:37:36.218Z] 	at org.eclipse.ui.internal.ide.application.IDEApplication.start(IDEApplication.java:152)
04:37:36 [2021-09-15T08:37:36.218Z] 	at org.eclipse.tycho.surefire.osgibooter.UITestApplication.runApplication(UITestApplication.java:29)
04:37:36 [2021-09-15T08:37:36.218Z] 	at org.eclipse.tycho.surefire.osgibooter.AbstractUITestApplication.run(AbstractUITestApplication.java:122)
04:37:36 [2021-09-15T08:37:36.218Z] 	at org.eclipse.tycho.surefire.osgibooter.UITestApplication.start(UITestApplication.java:35)
04:37:36 [2021-09-15T08:37:36.218Z] 	at org.eclipse.equinox.internal.app.EclipseAppHandle.run(EclipseAppHandle.java:203)
04:37:36 [2021-09-15T08:37:36.218Z] 	at org.eclipse.core.runtime.internal.adaptor.EclipseAppLauncher.runApplication(EclipseAppLauncher.java:136)
04:37:36 [2021-09-15T08:37:36.218Z] 	at org.eclipse.core.runtime.internal.adaptor.EclipseAppLauncher.start(EclipseAppLauncher.java:104)
04:37:36 [2021-09-15T08:37:36.218Z] 	at org.eclipse.core.runtime.adaptor.EclipseStarter.run(EclipseStarter.java:401)
04:37:36 [2021-09-15T08:37:36.218Z] 	at org.eclipse.core.runtime.adaptor.EclipseStarter.run(EclipseStarter.java:255)
04:37:36 [2021-09-15T08:37:36.218Z] 	at java.base/jdk.internal.reflect.NativeMethodAccessorImpl.invoke0(Native Method)
04:37:36 [2021-09-15T08:37:36.218Z] 	at java.base/jdk.internal.reflect.NativeMethodAccessorImpl.invoke(NativeMethodAccessorImpl.java:62)
04:37:36 [2021-09-15T08:37:36.218Z] 	at java.base/jdk.internal.reflect.DelegatingMethodAccessorImpl.invoke(DelegatingMethodAccessorImpl.java:43)
04:37:36 [2021-09-15T08:37:36.218Z] 	at java.base/java.lang.reflect.Method.invoke(Method.java:566)
04:37:36 [2021-09-15T08:37:36.218Z] 	at org.eclipse.equinox.launcher.Main.invokeFramework(Main.java:659)
04:37:36 [2021-09-15T08:37:36.218Z] 	at org.eclipse.equinox.launcher.Main.basicRun(Main.java:596)
04:37:36 [2021-09-15T08:37:36.218Z] 	at org.eclipse.equinox.launcher.Main.run(Main.java:1467)
04:37:36 [2021-09-15T08:37:36.218Z] 	at org.eclipse.equinox.launcher.Main.main(Main.java:1440)
04:37:36 [2021-09-15T08:37:36.218Z] 
04:37:36 [2021-09-15T08:37:36.218Z] testArchiveImport  Time elapsed: 0.075 s  <<< FAILURE!
04:37:36 [2021-09-15T08:37:36.218Z] java.lang.AssertionError: expected:<2> but was:<0>
04:37:36 [2021-09-15T08:37:36.218Z] 	at org.junit.Assert.fail(Assert.java:89)
04:37:36 [2021-09-15T08:37:36.218Z] 	at org.junit.Assert.failNotEquals(Assert.java:835)
04:37:36 [2021-09-15T08:37:36.218Z] 	at org.junit.Assert.assertEquals(Assert.java:647)
04:37:36 [2021-09-15T08:37:36.218Z] 	at org.junit.Assert.assertEquals(Assert.java:633)
04:37:36 [2021-09-15T08:37:36.218Z] 	at org.eclipse.tracecompass.tmf.ui.tests.actions.HttpTraceImportOperationTest.validateImport(HttpTraceImportOperationTest.java:143)
04:37:36 [2021-09-15T08:37:36.218Z] 	at org.eclipse.tracecompass.tmf.ui.tests.actions.HttpTraceImportOperationTest.testArchiveImport(HttpTraceImportOperationTest.java:138)
04:37:36 [2021-09-15T08:37:36.218Z] 	at java.base/jdk.internal.reflect.NativeMethodAccessorImpl.invoke0(Native Method)
04:37:36 [2021-09-15T08:37:36.218Z] 	at java.base/jdk.internal.reflect.NativeMethodAccessorImpl.invoke(NativeMethodAccessorImpl.java:62)
04:37:36 [2021-09-15T08:37:36.218Z] 	at java.base/jdk.internal.reflect.DelegatingMethodAccessorImpl.invoke(DelegatingMethodAccessorImpl.java:43)
04:37:36 [2021-09-15T08:37:36.218Z] 	at java.base/java.lang.reflect.Method.invoke(Method.java:566)
04:37:36 [2021-09-15T08:37:36.218Z] 	at org.junit.runners.model.FrameworkMethod$1.runReflectiveCall(FrameworkMethod.java:59)
04:37:36 [2021-09-15T08:37:36.218Z] 	at org.junit.internal.runners.model.ReflectiveCallable.run(ReflectiveCallable.java:12)
04:37:36 [2021-09-15T08:37:36.218Z] 	at org.junit.runners.model.FrameworkMethod.invokeExplosively(FrameworkMethod.java:56)
04:37:36 [2021-09-15T08:37:36.218Z] 	at org.junit.internal.runners.statements.InvokeMethod.evaluate(InvokeMethod.java:17)
04:37:36 [2021-09-15T08:37:36.218Z] 	at org.junit.runners.ParentRunner$3.evaluate(ParentRunner.java:306)
04:37:36 [2021-09-15T08:37:36.218Z] 	at org.junit.runners.BlockJUnit4ClassRunner$1.evaluate(BlockJUnit4ClassRunner.java:100)
04:37:36 [2021-09-15T08:37:36.218Z] 	at org.junit.runners.ParentRunner.runLeaf(ParentRunner.java:366)
04:37:36 [2021-09-15T08:37:36.218Z] 	at org.junit.runners.BlockJUnit4ClassRunner.runChild(BlockJUnit4ClassRunner.java:103)
04:37:36 [2021-09-15T08:37:36.218Z] 	at org.junit.runners.BlockJUnit4ClassRunner.runChild(BlockJUnit4ClassRunner.java:63)
04:37:36 [2021-09-15T08:37:36.218Z] 	at org.junit.runners.ParentRunner$4.run(ParentRunner.java:331)
04:37:36 [2021-09-15T08:37:36.218Z] 	at org.junit.runners.ParentRunner$1.schedule(ParentRunner.java:79)
04:37:36 [2021-09-15T08:37:36.218Z] 	at org.junit.runners.ParentRunner.runChildren(ParentRunner.java:329)
04:37:36 [2021-09-15T08:37:36.218Z] 	at org.junit.runners.ParentRunner.access$100(ParentRunner.java:66)
04:37:36 [2021-09-15T08:37:36.218Z] 	at org.junit.runners.ParentRunner$2.evaluate(ParentRunner.java:293)
04:37:36 [2021-09-15T08:37:36.218Z] 	at org.junit.internal.runners.statements.RunBefores.evaluate(RunBefores.java:26)
04:37:36 [2021-09-15T08:37:36.218Z] 	at org.junit.internal.runners.statements.RunAfters.evaluate(RunAfters.java:27)
04:37:36 [2021-09-15T08:37:36.218Z] 	at org.junit.runners.ParentRunner$3.evaluate(ParentRunner.java:306)
04:37:36 [2021-09-15T08:37:36.218Z] 	at org.junit.runners.ParentRunner.run(ParentRunner.java:413)
04:37:36 [2021-09-15T08:37:36.218Z] 	at org.junit.runner.JUnitCore.run(JUnitCore.java:137)
04:37:36 [2021-09-15T08:37:36.218Z] 	at org.junit.runner.JUnitCore.run(JUnitCore.java:115)
04:37:36 [2021-09-15T08:37:36.218Z] 	at org.junit.vintage.engine.execution.RunnerExecutor.execute(RunnerExecutor.java:43)
04:37:36 [2021-09-15T08:37:36.218Z] 	at java.base/java.util.stream.ForEachOps$ForEachOp$OfRef.accept(ForEachOps.java:183)
04:37:36 [2021-09-15T08:37:36.218Z] 	at java.base/java.util.stream.ReferencePipeline$3$1.accept(ReferencePipeline.java:195)
04:37:36 [2021-09-15T08:37:36.218Z] 	at java.base/java.util.Iterator.forEachRemaining(Iterator.java:133)
04:37:36 [2021-09-15T08:37:36.218Z] 	at java.base/java.util.Spliterators$IteratorSpliterator.forEachRemaining(Spliterators.java:1801)
04:37:36 [2021-09-15T08:37:36.218Z] 	at java.base/java.util.stream.AbstractPipeline.copyInto(AbstractPipeline.java:484)
04:37:36 [2021-09-15T08:37:36.218Z] 	at java.base/java.util.stream.AbstractPipeline.wrapAndCopyInto(AbstractPipeline.java:474)
04:37:36 [2021-09-15T08:37:36.218Z] 	at java.base/java.util.stream.ForEachOps$ForEachOp.evaluateSequential(ForEachOps.java:150)
04:37:36 [2021-09-15T08:37:36.218Z] 	at java.base/java.util.stream.ForEachOps$ForEachOp$OfRef.evaluateSequential(ForEachOps.java:173)
04:37:36 [2021-09-15T08:37:36.218Z] 	at java.base/java.util.stream.AbstractPipeline.evaluate(AbstractPipeline.java:234)
04:37:36 [2021-09-15T08:37:36.218Z] 	at java.base/java.util.stream.ReferencePipeline.forEach(ReferencePipeline.java:497)
04:37:36 [2021-09-15T08:37:36.218Z] 	at org.junit.vintage.engine.VintageTestEngine.executeAllChildren(VintageTestEngine.java:82)
04:37:36 [2021-09-15T08:37:36.218Z] 	at org.junit.vintage.engine.VintageTestEngine.execute(VintageTestEngine.java:73)
04:37:36 [2021-09-15T08:37:36.218Z] 	at org.junit.platform.launcher.core.EngineExecutionOrchestrator.execute(EngineExecutionOrchestrator.java:108)
04:37:36 [2021-09-15T08:37:36.218Z] 	at org.junit.platform.launcher.core.EngineExecutionOrchestrator.execute(EngineExecutionOrchestrator.java:88)
04:37:36 [2021-09-15T08:37:36.218Z] 	at org.junit.platform.launcher.core.EngineExecutionOrchestrator.lambda$execute$0(EngineExecutionOrchestrator.java:54)
04:37:36 [2021-09-15T08:37:36.218Z] 	at org.junit.platform.launcher.core.EngineExecutionOrchestrator.withInterceptedStreams(EngineExecutionOrchestrator.java:67)
04:37:36 [2021-09-15T08:37:36.218Z] 	at org.junit.platform.launcher.core.EngineExecutionOrchestrator.execute(EngineExecutionOrchestrator.java:52)
04:37:36 [2021-09-15T08:37:36.218Z] 	at org.junit.platform.launcher.core.DefaultLauncher.execute(DefaultLauncher.java:96)
04:37:36 [2021-09-15T08:37:36.218Z] 	at org.junit.platform.launcher.core.DefaultLauncher.execute(DefaultLauncher.java:75)
04:37:36 [2021-09-15T08:37:36.218Z] 	at org.apache.maven.surefire.junitplatform.JUnitPlatformProvider.invokeAllTests(JUnitPlatformProvider.java:150)
04:37:36 [2021-09-15T08:37:36.218Z] 	at org.apache.maven.surefire.junitplatform.JUnitPlatformProvider.invoke(JUnitPlatformProvider.java:124)
04:37:36 [2021-09-15T08:37:36.218Z] 	at java.base/jdk.internal.reflect.NativeMethodAccessorImpl.invoke0(Native Method)
04:37:36 [2021-09-15T08:37:36.218Z] 	at java.base/jdk.internal.reflect.NativeMethodAccessorImpl.invoke(NativeMethodAccessorImpl.java:62)
04:37:36 [2021-09-15T08:37:36.218Z] 	at java.base/jdk.internal.reflect.DelegatingMethodAccessorImpl.invoke(DelegatingMethodAccessorImpl.java:43)
04:37:36 [2021-09-15T08:37:36.218Z] 	at java.base/java.lang.reflect.Method.invoke(Method.java:566)
04:37:36 [2021-09-15T08:37:36.218Z] 	at org.apache.maven.surefire.util.ReflectionUtils.invokeMethodWithArray2(ReflectionUtils.java:206)
04:37:36 [2021-09-15T08:37:36.218Z] 	at org.apache.maven.surefire.booter.ProviderFactory$ProviderProxy.invoke(ProviderFactory.java:161)
04:37:36 [2021-09-15T08:37:36.218Z] 	at org.apache.maven.surefire.booter.ProviderFactory.invokeProvider(ProviderFactory.java:84)
04:37:36 [2021-09-15T08:37:36.218Z] 	at org.eclipse.tycho.surefire.osgibooter.OsgiSurefireBooter.run(OsgiSurefireBooter.java:116)
04:37:36 [2021-09-15T08:37:36.218Z] 	at org.eclipse.tycho.surefire.osgibooter.AbstractUITestApplication$1.run(AbstractUITestApplication.java:37)
04:37:36 [2021-09-15T08:37:36.218Z] 	at org.eclipse.swt.widgets.RunnableLock.run(RunnableLock.java:40)
04:37:36 [2021-09-15T08:37:36.218Z] 	at org.eclipse.swt.widgets.Synchronizer.runAsyncMessages(Synchronizer.java:185)
04:37:36 [2021-09-15T08:37:36.218Z] 	at org.eclipse.swt.widgets.Display.runAsyncMessages(Display.java:5101)
04:37:36 [2021-09-15T08:37:36.218Z] 	at org.eclipse.swt.widgets.Display.readAndDispatch(Display.java:4579)
04:37:36 [2021-09-15T08:37:36.218Z] 	at org.eclipse.e4.ui.internal.workbench.swt.PartRenderingEngine$5.run(PartRenderingEngine.java:1150)
04:37:36 [2021-09-15T08:37:36.218Z] 	at org.eclipse.core.databinding.observable.Realm.runWithDefault(Realm.java:338)
04:37:36 [2021-09-15T08:37:36.218Z] 	at org.eclipse.e4.ui.internal.workbench.swt.PartRenderingEngine.run(PartRenderingEngine.java:1041)
04:37:36 [2021-09-15T08:37:36.218Z] 	at org.eclipse.e4.ui.internal.workbench.E4Workbench.createAndRunUI(E4Workbench.java:155)
04:37:36 [2021-09-15T08:37:36.218Z] 	at org.eclipse.ui.internal.Workbench.lambda$3(Workbench.java:644)
04:37:36 [2021-09-15T08:37:36.218Z] 	at org.eclipse.core.databinding.observable.Realm.runWithDefault(Realm.java:338)
04:37:36 [2021-09-15T08:37:36.218Z] 	at org.eclipse.ui.internal.Workbench.createAndRunWorkbench(Workbench.java:551)
04:37:36 [2021-09-15T08:37:36.218Z] 	at org.eclipse.ui.PlatformUI.createAndRunWorkbench(PlatformUI.java:156)
04:37:36 [2021-09-15T08:37:36.218Z] 	at org.eclipse.ui.internal.ide.application.IDEApplication.start(IDEApplication.java:152)
04:37:36 [2021-09-15T08:37:36.218Z] 	at org.eclipse.tycho.surefire.osgibooter.UITestApplication.runApplication(UITestApplication.java:29)
04:37:36 [2021-09-15T08:37:36.218Z] 	at org.eclipse.tycho.surefire.osgibooter.AbstractUITestApplication.run(AbstractUITestApplication.java:122)
04:37:36 [2021-09-15T08:37:36.218Z] 	at org.eclipse.tycho.surefire.osgibooter.UITestApplication.start(UITestApplication.java:35)
04:37:36 [2021-09-15T08:37:36.218Z] 	at org.eclipse.equinox.internal.app.EclipseAppHandle.run(EclipseAppHandle.java:203)
04:37:36 [2021-09-15T08:37:36.218Z] 	at org.eclipse.core.runtime.internal.adaptor.EclipseAppLauncher.runApplication(EclipseAppLauncher.java:136)
04:37:36 [2021-09-15T08:37:36.218Z] 	at org.eclipse.core.runtime.internal.adaptor.EclipseAppLauncher.start(EclipseAppLauncher.java:104)
04:37:36 [2021-09-15T08:37:36.218Z] 	at org.eclipse.core.runtime.adaptor.EclipseStarter.run(EclipseStarter.java:401)
04:37:36 [2021-09-15T08:37:36.218Z] 	at org.eclipse.core.runtime.adaptor.EclipseStarter.run(EclipseStarter.java:255)
04:37:36 [2021-09-15T08:37:36.218Z] 	at java.base/jdk.internal.reflect.NativeMethodAccessorImpl.invoke0(Native Method)
04:37:36 [2021-09-15T08:37:36.218Z] 	at java.base/jdk.internal.reflect.NativeMethodAccessorImpl.invoke(NativeMethodAccessorImpl.java:62)
04:37:36 [2021-09-15T08:37:36.218Z] 	at java.base/jdk.internal.reflect.DelegatingMethodAccessorImpl.invoke(DelegatingMethodAccessorImpl.java:43)
04:37:36 [2021-09-15T08:37:36.218Z] 	at java.base/java.lang.reflect.Method.invoke(Method.java:566)
04:37:36 [2021-09-15T08:37:36.218Z] 	at org.eclipse.equinox.launcher.Main.invokeFramework(Main.java:659)
04:37:36 [2021-09-15T08:37:36.218Z] 	at org.eclipse.equinox.launcher.Main.basicRun(Main.java:596)
04:37:36 [2021-09-15T08:37:36.218Z] 	at org.eclipse.equinox.launcher.Main.run(Main.java:1467)
04:37:36 [2021-09-15T08:37:36.218Z] 	at org.eclipse.equinox.launcher.Main.main(Main.java:1440)
04:37:36 [2021-09-15T08:37:36.218Z] 
04:37:36 [2021-09-15T08:37:36.218Z] Running org.eclipse.tracecompass.tmf.ui.tests.actions.DownloadTraceHttpHelperTest
04:37:36 [2021-09-15T08:37:36.478Z] Tests run: 3, Failures: 3, Errors: 0, Skipped: 0, Time elapsed: 0.016 s <<< FAILURE! - in org.eclipse.tracecompass.tmf.ui.tests.actions.DownloadTraceHttpHelperTest
04:37:36 [2021-09-15T08:37:36.478Z] testTraceDownload  Time elapsed: 0.012 s  <<< FAILURE!
04:37:36 [2021-09-15T08:37:36.478Z] java.lang.AssertionError
04:37:36 [2021-09-15T08:37:36.478Z] 	at org.junit.Assert.fail(Assert.java:87)
04:37:36 [2021-09-15T08:37:36.478Z] 	at org.junit.Assert.assertTrue(Assert.java:42)
04:37:36 [2021-09-15T08:37:36.478Z] 	at org.junit.Assert.assertTrue(Assert.java:53)
04:37:36 [2021-09-15T08:37:36.478Z] 	at org.eclipse.tracecompass.tmf.ui.tests.actions.DownloadTraceHttpHelperTest.testTraceDownload(DownloadTraceHttpHelperTest.java:75)
04:37:36 [2021-09-15T08:37:36.478Z] 	at java.base/jdk.internal.reflect.NativeMethodAccessorImpl.invoke0(Native Method)
04:37:36 [2021-09-15T08:37:36.478Z] 	at java.base/jdk.internal.reflect.NativeMethodAccessorImpl.invoke(NativeMethodAccessorImpl.java:62)
04:37:36 [2021-09-15T08:37:36.478Z] 	at java.base/jdk.internal.reflect.DelegatingMethodAccessorImpl.invoke(DelegatingMethodAccessorImpl.java:43)
04:37:36 [2021-09-15T08:37:36.478Z] 	at java.base/java.lang.reflect.Method.invoke(Method.java:566)
04:37:36 [2021-09-15T08:37:36.478Z] 	at org.junit.runners.model.FrameworkMethod$1.runReflectiveCall(FrameworkMethod.java:59)
04:37:36 [2021-09-15T08:37:36.478Z] 	at org.junit.internal.runners.model.ReflectiveCallable.run(ReflectiveCallable.java:12)
04:37:36 [2021-09-15T08:37:36.478Z] 	at org.junit.runners.model.FrameworkMethod.invokeExplosively(FrameworkMethod.java:56)
04:37:36 [2021-09-15T08:37:36.478Z] 	at org.junit.internal.runners.statements.InvokeMethod.evaluate(InvokeMethod.java:17)
04:37:36 [2021-09-15T08:37:36.478Z] 	at org.junit.internal.runners.statements.RunAfters.evaluate(RunAfters.java:27)
04:37:36 [2021-09-15T08:37:36.478Z] 	at org.junit.runners.ParentRunner$3.evaluate(ParentRunner.java:306)
04:37:36 [2021-09-15T08:37:36.478Z] 	at org.junit.runners.BlockJUnit4ClassRunner$1.evaluate(BlockJUnit4ClassRunner.java:100)
04:37:36 [2021-09-15T08:37:36.478Z] 	at org.junit.runners.ParentRunner.runLeaf(ParentRunner.java:366)
04:37:36 [2021-09-15T08:37:36.478Z] 	at org.junit.runners.BlockJUnit4ClassRunner.runChild(BlockJUnit4ClassRunner.java:103)
04:37:36 [2021-09-15T08:37:36.478Z] 	at org.junit.runners.BlockJUnit4ClassRunner.runChild(BlockJUnit4ClassRunner.java:63)
04:37:36 [2021-09-15T08:37:36.478Z] 	at org.junit.runners.ParentRunner$4.run(ParentRunner.java:331)
04:37:36 [2021-09-15T08:37:36.478Z] 	at org.junit.runners.ParentRunner$1.schedule(ParentRunner.java:79)
04:37:36 [2021-09-15T08:37:36.478Z] 	at org.junit.runners.ParentRunner.runChildren(ParentRunner.java:329)
04:37:36 [2021-09-15T08:37:36.478Z] 	at org.junit.runners.ParentRunner.access$100(ParentRunner.java:66)
04:37:36 [2021-09-15T08:37:36.478Z] 	at org.junit.runners.ParentRunner$2.evaluate(ParentRunner.java:293)
04:37:36 [2021-09-15T08:37:36.478Z] 	at org.junit.internal.runners.statements.RunBefores.evaluate(RunBefores.java:26)
04:37:36 [2021-09-15T08:37:36.478Z] 	at org.junit.runners.ParentRunner$3.evaluate(ParentRunner.java:306)
04:37:36 [2021-09-15T08:37:36.478Z] 	at org.junit.runners.ParentRunner.run(ParentRunner.java:413)
04:37:36 [2021-09-15T08:37:36.478Z] 	at org.junit.runner.JUnitCore.run(JUnitCore.java:137)
04:37:36 [2021-09-15T08:37:36.478Z] 	at org.junit.runner.JUnitCore.run(JUnitCore.java:115)
04:37:36 [2021-09-15T08:37:36.478Z] 	at org.junit.vintage.engine.execution.RunnerExecutor.execute(RunnerExecutor.java:43)
04:37:36 [2021-09-15T08:37:36.478Z] 	at java.base/java.util.stream.ForEachOps$ForEachOp$OfRef.accept(ForEachOps.java:183)
04:37:36 [2021-09-15T08:37:36.478Z] 	at java.base/java.util.stream.ReferencePipeline$3$1.accept(ReferencePipeline.java:195)
04:37:36 [2021-09-15T08:37:36.478Z] 	at java.base/java.util.Iterator.forEachRemaining(Iterator.java:133)
04:37:36 [2021-09-15T08:37:36.478Z] 	at java.base/java.util.Spliterators$IteratorSpliterator.forEachRemaining(Spliterators.java:1801)
04:37:36 [2021-09-15T08:37:36.478Z] 	at java.base/java.util.stream.AbstractPipeline.copyInto(AbstractPipeline.java:484)
04:37:36 [2021-09-15T08:37:36.478Z] 	at java.base/java.util.stream.AbstractPipeline.wrapAndCopyInto(AbstractPipeline.java:474)
04:37:36 [2021-09-15T08:37:36.478Z] 	at java.base/java.util.stream.ForEachOps$ForEachOp.evaluateSequential(ForEachOps.java:150)
04:37:36 [2021-09-15T08:37:36.478Z] 	at java.base/java.util.stream.ForEachOps$ForEachOp$OfRef.evaluateSequential(ForEachOps.java:173)
04:37:36 [2021-09-15T08:37:36.478Z] 	at java.base/java.util.stream.AbstractPipeline.evaluate(AbstractPipeline.java:234)
04:37:36 [2021-09-15T08:37:36.478Z] 	at java.base/java.util.stream.ReferencePipeline.forEach(ReferencePipeline.java:497)
04:37:36 [2021-09-15T08:37:36.478Z] 	at org.junit.vintage.engine.VintageTestEngine.executeAllChildren(VintageTestEngine.java:82)
04:37:36 [2021-09-15T08:37:36.478Z] 	at org.junit.vintage.engine.VintageTestEngine.execute(VintageTestEngine.java:73)
04:37:36 [2021-09-15T08:37:36.478Z] 	at org.junit.platform.launcher.core.EngineExecutionOrchestrator.execute(EngineExecutionOrchestrator.java:108)
04:37:36 [2021-09-15T08:37:36.478Z] 	at org.junit.platform.launcher.core.EngineExecutionOrchestrator.execute(EngineExecutionOrchestrator.java:88)
04:37:36 [2021-09-15T08:37:36.478Z] 	at org.junit.platform.launcher.core.EngineExecutionOrchestrator.lambda$execute$0(EngineExecutionOrchestrator.java:54)
04:37:36 [2021-09-15T08:37:36.478Z] 	at org.junit.platform.launcher.core.EngineExecutionOrchestrator.withInterceptedStreams(EngineExecutionOrchestrator.java:67)
04:37:36 [2021-09-15T08:37:36.478Z] 	at org.junit.platform.launcher.core.EngineExecutionOrchestrator.execute(EngineExecutionOrchestrator.java:52)
04:37:36 [2021-09-15T08:37:36.478Z] 	at org.junit.platform.launcher.core.DefaultLauncher.execute(DefaultLauncher.java:96)
04:37:36 [2021-09-15T08:37:36.478Z] 	at org.junit.platform.launcher.core.DefaultLauncher.execute(DefaultLauncher.java:75)
04:37:36 [2021-09-15T08:37:36.478Z] 	at org.apache.maven.surefire.junitplatform.JUnitPlatformProvider.invokeAllTests(JUnitPlatformProvider.java:150)
04:37:36 [2021-09-15T08:37:36.478Z] 	at org.apache.maven.surefire.junitplatform.JUnitPlatformProvider.invoke(JUnitPlatformProvider.java:124)
04:37:36 [2021-09-15T08:37:36.478Z] 	at java.base/jdk.internal.reflect.NativeMethodAccessorImpl.invoke0(Native Method)
04:37:36 [2021-09-15T08:37:36.478Z] 	at java.base/jdk.internal.reflect.NativeMethodAccessorImpl.invoke(NativeMethodAccessorImpl.java:62)
04:37:36 [2021-09-15T08:37:36.478Z] 	at java.base/jdk.internal.reflect.DelegatingMethodAccessorImpl.invoke(DelegatingMethodAccessorImpl.java:43)
04:37:36 [2021-09-15T08:37:36.478Z] 	at java.base/java.lang.reflect.Method.invoke(Method.java:566)
04:37:36 [2021-09-15T08:37:36.478Z] 	at org.apache.maven.surefire.util.ReflectionUtils.invokeMethodWithArray2(ReflectionUtils.java:206)
04:37:36 [2021-09-15T08:37:36.478Z] 	at org.apache.maven.surefire.booter.ProviderFactory$ProviderProxy.invoke(ProviderFactory.java:161)
04:37:36 [2021-09-15T08:37:36.478Z] 	at org.apache.maven.surefire.booter.ProviderFactory.invokeProvider(ProviderFactory.java:84)
04:37:36 [2021-09-15T08:37:36.478Z] 	at org.eclipse.tycho.surefire.osgibooter.OsgiSurefireBooter.run(OsgiSurefireBooter.java:116)
04:37:36 [2021-09-15T08:37:36.478Z] 	at org.eclipse.tycho.surefire.osgibooter.AbstractUITestApplication$1.run(AbstractUITestApplication.java:37)
04:37:36 [2021-09-15T08:37:36.478Z] 	at org.eclipse.swt.widgets.RunnableLock.run(RunnableLock.java:40)
04:37:36 [2021-09-15T08:37:36.478Z] 	at org.eclipse.swt.widgets.Synchronizer.runAsyncMessages(Synchronizer.java:185)
04:37:36 [2021-09-15T08:37:36.478Z] 	at org.eclipse.swt.widgets.Display.runAsyncMessages(Display.java:5101)
04:37:36 [2021-09-15T08:37:36.478Z] 	at org.eclipse.swt.widgets.Display.readAndDispatch(Display.java:4579)
04:37:36 [2021-09-15T08:37:36.478Z] 	at org.eclipse.e4.ui.internal.workbench.swt.PartRenderingEngine$5.run(PartRenderingEngine.java:1150)
04:37:36 [2021-09-15T08:37:36.478Z] 	at org.eclipse.core.databinding.observable.Realm.runWithDefault(Realm.java:338)
04:37:36 [2021-09-15T08:37:36.478Z] 	at org.eclipse.e4.ui.internal.workbench.swt.PartRenderingEngine.run(PartRenderingEngine.java:1041)
04:37:36 [2021-09-15T08:37:36.478Z] 	at org.eclipse.e4.ui.internal.workbench.E4Workbench.createAndRunUI(E4Workbench.java:155)
04:37:36 [2021-09-15T08:37:36.478Z] 	at org.eclipse.ui.internal.Workbench.lambda$3(Workbench.java:644)
04:37:36 [2021-09-15T08:37:36.478Z] 	at org.eclipse.core.databinding.observable.Realm.runWithDefault(Realm.java:338)
04:37:36 [2021-09-15T08:37:36.478Z] 	at org.eclipse.ui.internal.Workbench.createAndRunWorkbench(Workbench.java:551)
04:37:36 [2021-09-15T08:37:36.478Z] 	at org.eclipse.ui.PlatformUI.createAndRunWorkbench(PlatformUI.java:156)
04:37:36 [2021-09-15T08:37:36.478Z] 	at org.eclipse.ui.internal.ide.application.IDEApplication.start(IDEApplication.java:152)
04:37:36 [2021-09-15T08:37:36.478Z] 	at org.eclipse.tycho.surefire.osgibooter.UITestApplication.runApplication(UITestApplication.java:29)
04:37:36 [2021-09-15T08:37:36.479Z] 	at org.eclipse.tycho.surefire.osgibooter.AbstractUITestApplication.run(AbstractUITestApplication.java:122)
04:37:36 [2021-09-15T08:37:36.479Z] 	at org.eclipse.tycho.surefire.osgibooter.UITestApplication.start(UITestApplication.java:35)
04:37:36 [2021-09-15T08:37:36.479Z] 	at org.eclipse.equinox.internal.app.EclipseAppHandle.run(EclipseAppHandle.java:203)
04:37:36 [2021-09-15T08:37:36.479Z] 	at org.eclipse.core.runtime.internal.adaptor.EclipseAppLauncher.runApplication(EclipseAppLauncher.java:136)
04:37:36 [2021-09-15T08:37:36.479Z] 	at org.eclipse.core.runtime.internal.adaptor.EclipseAppLauncher.start(EclipseAppLauncher.java:104)
04:37:36 [2021-09-15T08:37:36.479Z] 	at org.eclipse.core.runtime.adaptor.EclipseStarter.run(EclipseStarter.java:401)
04:37:36 [2021-09-15T08:37:36.479Z] 	at org.eclipse.core.runtime.adaptor.EclipseStarter.run(EclipseStarter.java:255)
04:37:36 [2021-09-15T08:37:36.479Z] 	at java.base/jdk.internal.reflect.NativeMethodAccessorImpl.invoke0(Native Method)
04:37:36 [2021-09-15T08:37:36.479Z] 	at java.base/jdk.internal.reflect.NativeMethodAccessorImpl.invoke(NativeMethodAccessorImpl.java:62)
04:37:36 [2021-09-15T08:37:36.479Z] 	at java.base/jdk.internal.reflect.DelegatingMethodAccessorImpl.invoke(DelegatingMethodAccessorImpl.java:43)
04:37:36 [2021-09-15T08:37:36.479Z] 	at java.base/java.lang.reflect.Method.invoke(Method.java:566)
04:37:36 [2021-09-15T08:37:36.479Z] 	at org.eclipse.equinox.launcher.Main.invokeFramework(Main.java:659)
04:37:36 [2021-09-15T08:37:36.479Z] 	at org.eclipse.equinox.launcher.Main.basicRun(Main.java:596)
04:37:36 [2021-09-15T08:37:36.479Z] 	at org.eclipse.equinox.launcher.Main.run(Main.java:1467)
04:37:36 [2021-09-15T08:37:36.479Z] 	at org.eclipse.equinox.launcher.Main.main(Main.java:1440)
04:37:36 [2021-09-15T08:37:36.479Z] 
04:37:36 [2021-09-15T08:37:36.479Z] testArchiveTraceDownload  Time elapsed: 0.001 s  <<< FAILURE!
04:37:36 [2021-09-15T08:37:36.479Z] java.lang.AssertionError
04:37:36 [2021-09-15T08:37:36.479Z] 	at org.junit.Assert.fail(Assert.java:87)
04:37:36 [2021-09-15T08:37:36.479Z] 	at org.junit.Assert.assertTrue(Assert.java:42)
04:37:36 [2021-09-15T08:37:36.479Z] 	at org.junit.Assert.assertTrue(Assert.java:53)
04:37:36 [2021-09-15T08:37:36.479Z] 	at org.eclipse.tracecompass.tmf.ui.tests.actions.DownloadTraceHttpHelperTest.testArchiveTraceDownload(DownloadTraceHttpHelperTest.java:109)
04:37:36 [2021-09-15T08:37:36.479Z] 	at java.base/jdk.internal.reflect.NativeMethodAccessorImpl.invoke0(Native Method)
04:37:36 [2021-09-15T08:37:36.479Z] 	at java.base/jdk.internal.reflect.NativeMethodAccessorImpl.invoke(NativeMethodAccessorImpl.java:62)
04:37:36 [2021-09-15T08:37:36.479Z] 	at java.base/jdk.internal.reflect.DelegatingMethodAccessorImpl.invoke(DelegatingMethodAccessorImpl.java:43)
04:37:36 [2021-09-15T08:37:36.479Z] 	at java.base/java.lang.reflect.Method.invoke(Method.java:566)
04:37:36 [2021-09-15T08:37:36.479Z] 	at org.junit.runners.model.FrameworkMethod$1.runReflectiveCall(FrameworkMethod.java:59)
04:37:36 [2021-09-15T08:37:36.479Z] 	at org.junit.internal.runners.model.ReflectiveCallable.run(ReflectiveCallable.java:12)
04:37:36 [2021-09-15T08:37:36.479Z] 	at org.junit.runners.model.FrameworkMethod.invokeExplosively(FrameworkMethod.java:56)
04:37:36 [2021-09-15T08:37:36.479Z] 	at org.junit.internal.runners.statements.InvokeMethod.evaluate(InvokeMethod.java:17)
04:37:36 [2021-09-15T08:37:36.479Z] 	at org.junit.internal.runners.statements.RunAfters.evaluate(RunAfters.java:27)
04:37:36 [2021-09-15T08:37:36.479Z] 	at org.junit.runners.ParentRunner$3.evaluate(ParentRunner.java:306)
04:37:36 [2021-09-15T08:37:36.479Z] 	at org.junit.runners.BlockJUnit4ClassRunner$1.evaluate(BlockJUnit4ClassRunner.java:100)
04:37:36 [2021-09-15T08:37:36.479Z] 	at org.junit.runners.ParentRunner.runLeaf(ParentRunner.java:366)
04:37:36 [2021-09-15T08:37:36.479Z] 	at org.junit.runners.BlockJUnit4ClassRunner.runChild(BlockJUnit4ClassRunner.java:103)
04:37:36 [2021-09-15T08:37:36.479Z] 	at org.junit.runners.BlockJUnit4ClassRunner.runChild(BlockJUnit4ClassRunner.java:63)
04:37:36 [2021-09-15T08:37:36.479Z] 	at org.junit.runners.ParentRunner$4.run(ParentRunner.java:331)
04:37:36 [2021-09-15T08:37:36.479Z] 	at org.junit.runners.ParentRunner$1.schedule(ParentRunner.java:79)
04:37:36 [2021-09-15T08:37:36.479Z] 	at org.junit.runners.ParentRunner.runChildren(ParentRunner.java:329)
04:37:36 [2021-09-15T08:37:36.479Z] 	at org.junit.runners.ParentRunner.access$100(ParentRunner.java:66)
04:37:36 [2021-09-15T08:37:36.479Z] 	at org.junit.runners.ParentRunner$2.evaluate(ParentRunner.java:293)
04:37:36 [2021-09-15T08:37:36.479Z] 	at org.junit.internal.runners.statements.RunBefores.evaluate(RunBefores.java:26)
04:37:36 [2021-09-15T08:37:36.479Z] 	at org.junit.runners.ParentRunner$3.evaluate(ParentRunner.java:306)
04:37:36 [2021-09-15T08:37:36.479Z] 	at org.junit.runners.ParentRunner.run(ParentRunner.java:413)
04:37:36 [2021-09-15T08:37:36.479Z] 	at org.junit.runner.JUnitCore.run(JUnitCore.java:137)
04:37:36 [2021-09-15T08:37:36.479Z] 	at org.junit.runner.JUnitCore.run(JUnitCore.java:115)
04:37:36 [2021-09-15T08:37:36.479Z] 	at org.junit.vintage.engine.execution.RunnerExecutor.execute(RunnerExecutor.java:43)
04:37:36 [2021-09-15T08:37:36.479Z] 	at java.base/java.util.stream.ForEachOps$ForEachOp$OfRef.accept(ForEachOps.java:183)
04:37:36 [2021-09-15T08:37:36.479Z] 	at java.base/java.util.stream.ReferencePipeline$3$1.accept(ReferencePipeline.java:195)
04:37:36 [2021-09-15T08:37:36.479Z] 	at java.base/java.util.Iterator.forEachRemaining(Iterator.java:133)
04:37:36 [2021-09-15T08:37:36.479Z] 	at java.base/java.util.Spliterators$IteratorSpliterator.forEachRemaining(Spliterators.java:1801)
04:37:36 [2021-09-15T08:37:36.479Z] 	at java.base/java.util.stream.AbstractPipeline.copyInto(AbstractPipeline.java:484)
04:37:36 [2021-09-15T08:37:36.479Z] 	at java.base/java.util.stream.AbstractPipeline.wrapAndCopyInto(AbstractPipeline.java:474)
04:37:36 [2021-09-15T08:37:36.479Z] 	at java.base/java.util.stream.ForEachOps$ForEachOp.evaluateSequential(ForEachOps.java:150)
04:37:36 [2021-09-15T08:37:36.479Z] 	at java.base/java.util.stream.ForEachOps$ForEachOp$OfRef.evaluateSequential(ForEachOps.java:173)
04:37:36 [2021-09-15T08:37:36.479Z] 	at java.base/java.util.stream.AbstractPipeline.evaluate(AbstractPipeline.java:234)
04:37:36 [2021-09-15T08:37:36.479Z] 	at java.base/java.util.stream.ReferencePipeline.forEach(ReferencePipeline.java:497)
04:37:36 [2021-09-15T08:37:36.479Z] 	at org.junit.vintage.engine.VintageTestEngine.executeAllChildren(VintageTestEngine.java:82)
04:37:36 [2021-09-15T08:37:36.479Z] 	at org.junit.vintage.engine.VintageTestEngine.execute(VintageTestEngine.java:73)
04:37:36 [2021-09-15T08:37:36.479Z] 	at org.junit.platform.launcher.core.EngineExecutionOrchestrator.execute(EngineExecutionOrchestrator.java:108)
04:37:36 [2021-09-15T08:37:36.479Z] 	at org.junit.platform.launcher.core.EngineExecutionOrchestrator.execute(EngineExecutionOrchestrator.java:88)
04:37:36 [2021-09-15T08:37:36.479Z] 	at org.junit.platform.launcher.core.EngineExecutionOrchestrator.lambda$execute$0(EngineExecutionOrchestrator.java:54)
04:37:36 [2021-09-15T08:37:36.479Z] 	at org.junit.platform.launcher.core.EngineExecutionOrchestrator.withInterceptedStreams(EngineExecutionOrchestrator.java:67)
04:37:36 [2021-09-15T08:37:36.479Z] 	at org.junit.platform.launcher.core.EngineExecutionOrchestrator.execute(EngineExecutionOrchestrator.java:52)
04:37:36 [2021-09-15T08:37:36.479Z] 	at org.junit.platform.launcher.core.DefaultLauncher.execute(DefaultLauncher.java:96)
04:37:36 [2021-09-15T08:37:36.479Z] 	at org.junit.platform.launcher.core.DefaultLauncher.execute(DefaultLauncher.java:75)
04:37:36 [2021-09-15T08:37:36.479Z] 	at org.apache.maven.surefire.junitplatform.JUnitPlatformProvider.invokeAllTests(JUnitPlatformProvider.java:150)
04:37:36 [2021-09-15T08:37:36.479Z] 	at org.apache.maven.surefire.junitplatform.JUnitPlatformProvider.invoke(JUnitPlatformProvider.java:124)
04:37:36 [2021-09-15T08:37:36.479Z] 	at java.base/jdk.internal.reflect.NativeMethodAccessorImpl.invoke0(Native Method)
04:37:36 [2021-09-15T08:37:36.479Z] 	at java.base/jdk.internal.reflect.NativeMethodAccessorImpl.invoke(NativeMethodAccessorImpl.java:62)
04:37:36 [2021-09-15T08:37:36.479Z] 	at java.base/jdk.internal.reflect.DelegatingMethodAccessorImpl.invoke(DelegatingMethodAccessorImpl.java:43)
04:37:36 [2021-09-15T08:37:36.479Z] 	at java.base/java.lang.reflect.Method.invoke(Method.java:566)
04:37:36 [2021-09-15T08:37:36.479Z] 	at org.apache.maven.surefire.util.ReflectionUtils.invokeMethodWithArray2(ReflectionUtils.java:206)
04:37:36 [2021-09-15T08:37:36.479Z] 	at org.apache.maven.surefire.booter.ProviderFactory$ProviderProxy.invoke(ProviderFactory.java:161)
04:37:36 [2021-09-15T08:37:36.479Z] 	at org.apache.maven.surefire.booter.ProviderFactory.invokeProvider(ProviderFactory.java:84)
04:37:36 [2021-09-15T08:37:36.479Z] 	at org.eclipse.tycho.surefire.osgibooter.OsgiSurefireBooter.run(OsgiSurefireBooter.java:116)
04:37:36 [2021-09-15T08:37:36.479Z] 	at org.eclipse.tycho.surefire.osgibooter.AbstractUITestApplication$1.run(AbstractUITestApplication.java:37)
04:37:36 [2021-09-15T08:37:36.479Z] 	at org.eclipse.swt.widgets.RunnableLock.run(RunnableLock.java:40)
04:37:36 [2021-09-15T08:37:36.479Z] 	at org.eclipse.swt.widgets.Synchronizer.runAsyncMessages(Synchronizer.java:185)
04:37:36 [2021-09-15T08:37:36.479Z] 	at org.eclipse.swt.widgets.Display.runAsyncMessages(Display.java:5101)
04:37:36 [2021-09-15T08:37:36.479Z] 	at org.eclipse.swt.widgets.Display.readAndDispatch(Display.java:4579)
04:37:36 [2021-09-15T08:37:36.479Z] 	at org.eclipse.e4.ui.internal.workbench.swt.PartRenderingEngine$5.run(PartRenderingEngine.java:1150)
04:37:36 [2021-09-15T08:37:36.479Z] 	at org.eclipse.core.databinding.observable.Realm.runWithDefault(Realm.java:338)
04:37:36 [2021-09-15T08:37:36.479Z] 	at org.eclipse.e4.ui.internal.workbench.swt.PartRenderingEngine.run(PartRenderingEngine.java:1041)
04:37:36 [2021-09-15T08:37:36.479Z] 	at org.eclipse.e4.ui.internal.workbench.E4Workbench.createAndRunUI(E4Workbench.java:155)
04:37:36 [2021-09-15T08:37:36.479Z] 	at org.eclipse.ui.internal.Workbench.lambda$3(Workbench.java:644)
04:37:36 [2021-09-15T08:37:36.479Z] 	at org.eclipse.core.databinding.observable.Realm.runWithDefault(Realm.java:338)
04:37:36 [2021-09-15T08:37:36.479Z] 	at org.eclipse.ui.internal.Workbench.createAndRunWorkbench(Workbench.java:551)
04:37:36 [2021-09-15T08:37:36.479Z] 	at org.eclipse.ui.PlatformUI.createAndRunWorkbench(PlatformUI.java:156)
04:37:36 [2021-09-15T08:37:36.479Z] 	at org.eclipse.ui.internal.ide.application.IDEApplication.start(IDEApplication.java:152)
04:37:36 [2021-09-15T08:37:36.479Z] 	at org.eclipse.tycho.surefire.osgibooter.UITestApplication.runApplication(UITestApplication.java:29)
04:37:36 [2021-09-15T08:37:36.479Z] 	at org.eclipse.tycho.surefire.osgibooter.AbstractUITestApplication.run(AbstractUITestApplication.java:122)
04:37:36 [2021-09-15T08:37:36.479Z] 	at org.eclipse.tycho.surefire.osgibooter.UITestApplication.start(UITestApplication.java:35)
04:37:36 [2021-09-15T08:37:36.479Z] 	at org.eclipse.equinox.internal.app.EclipseAppHandle.run(EclipseAppHandle.java:203)
04:37:36 [2021-09-15T08:37:36.479Z] 	at org.eclipse.core.runtime.internal.adaptor.EclipseAppLauncher.runApplication(EclipseAppLauncher.java:136)
04:37:36 [2021-09-15T08:37:36.479Z] 	at org.eclipse.core.runtime.internal.adaptor.EclipseAppLauncher.start(EclipseAppLauncher.java:104)
04:37:36 [2021-09-15T08:37:36.479Z] 	at org.eclipse.core.runtime.adaptor.EclipseStarter.run(EclipseStarter.java:401)
04:37:36 [2021-09-15T08:37:36.479Z] 	at org.eclipse.core.runtime.adaptor.EclipseStarter.run(EclipseStarter.java:255)
04:37:36 [2021-09-15T08:37:36.479Z] 	at java.base/jdk.internal.reflect.NativeMethodAccessorImpl.invoke0(Native Method)
04:37:36 [2021-09-15T08:37:36.479Z] 	at java.base/jdk.internal.reflect.NativeMethodAccessorImpl.invoke(NativeMethodAccessorImpl.java:62)
04:37:36 [2021-09-15T08:37:36.479Z] 	at java.base/jdk.internal.reflect.DelegatingMethodAccessorImpl.invoke(DelegatingMethodAccessorImpl.java:43)
04:37:36 [2021-09-15T08:37:36.479Z] 	at java.base/java.lang.reflect.Method.invoke(Method.java:566)
04:37:36 [2021-09-15T08:37:36.479Z] 	at org.eclipse.equinox.launcher.Main.invokeFramework(Main.java:659)
04:37:36 [2021-09-15T08:37:36.479Z] 	at org.eclipse.equinox.launcher.Main.basicRun(Main.java:596)
04:37:36 [2021-09-15T08:37:36.479Z] 	at org.eclipse.equinox.launcher.Main.run(Main.java:1467)
04:37:36 [2021-09-15T08:37:36.479Z] 	at org.eclipse.equinox.launcher.Main.main(Main.java:1440)
04:37:36 [2021-09-15T08:37:36.479Z] 
04:37:36 [2021-09-15T08:37:36.479Z] testMutlipleTracesDownload  Time elapsed: 0.002 s  <<< FAILURE!
04:37:36 [2021-09-15T08:37:36.479Z] java.lang.AssertionError
04:37:36 [2021-09-15T08:37:36.479Z] 	at org.junit.Assert.fail(Assert.java:87)
04:37:36 [2021-09-15T08:37:36.479Z] 	at org.junit.Assert.assertTrue(Assert.java:42)
04:37:36 [2021-09-15T08:37:36.479Z] 	at org.junit.Assert.assertTrue(Assert.java:53)
04:37:36 [2021-09-15T08:37:36.479Z] 	at org.eclipse.tracecompass.tmf.ui.tests.actions.DownloadTraceHttpHelperTest.testMutlipleTracesDownload(DownloadTraceHttpHelperTest.java:90)
04:37:36 [2021-09-15T08:37:36.479Z] 	at java.base/jdk.internal.reflect.NativeMethodAccessorImpl.invoke0(Native Method)
04:37:36 [2021-09-15T08:37:36.479Z] 	at java.base/jdk.internal.reflect.NativeMethodAccessorImpl.invoke(NativeMethodAccessorImpl.java:62)
04:37:36 [2021-09-15T08:37:36.479Z] 	at java.base/jdk.internal.reflect.DelegatingMethodAccessorImpl.invoke(DelegatingMethodAccessorImpl.java:43)
04:37:36 [2021-09-15T08:37:36.479Z] 	at java.base/java.lang.reflect.Method.invoke(Method.java:566)
04:37:36 [2021-09-15T08:37:36.479Z] 	at org.junit.runners.model.FrameworkMethod$1.runReflectiveCall(FrameworkMethod.java:59)
04:37:36 [2021-09-15T08:37:36.479Z] 	at org.junit.internal.runners.model.ReflectiveCallable.run(ReflectiveCallable.java:12)
04:37:36 [2021-09-15T08:37:36.479Z] 	at org.junit.runners.model.FrameworkMethod.invokeExplosively(FrameworkMethod.java:56)
04:37:36 [2021-09-15T08:37:36.479Z] 	at org.junit.internal.runners.statements.InvokeMethod.evaluate(InvokeMethod.java:17)
04:37:36 [2021-09-15T08:37:36.479Z] 	at org.junit.internal.runners.statements.RunAfters.evaluate(RunAfters.java:27)
04:37:36 [2021-09-15T08:37:36.479Z] 	at org.junit.runners.ParentRunner$3.evaluate(ParentRunner.java:306)
04:37:36 [2021-09-15T08:37:36.479Z] 	at org.junit.runners.BlockJUnit4ClassRunner$1.evaluate(BlockJUnit4ClassRunner.java:100)
04:37:36 [2021-09-15T08:37:36.479Z] 	at org.junit.runners.ParentRunner.runLeaf(ParentRunner.java:366)
04:37:36 [2021-09-15T08:37:36.479Z] 	at org.junit.runners.BlockJUnit4ClassRunner.runChild(BlockJUnit4ClassRunner.java:103)
04:37:36 [2021-09-15T08:37:36.479Z] 	at org.junit.runners.BlockJUnit4ClassRunner.runChild(BlockJUnit4ClassRunner.java:63)
04:37:36 [2021-09-15T08:37:36.479Z] 	at org.junit.runners.ParentRunner$4.run(ParentRunner.java:331)
04:37:36 [2021-09-15T08:37:36.479Z] 	at org.junit.runners.ParentRunner$1.schedule(ParentRunner.java:79)
04:37:36 [2021-09-15T08:37:36.479Z] 	at org.junit.runners.ParentRunner.runChildren(ParentRunner.java:329)
04:37:36 [2021-09-15T08:37:36.479Z] 	at org.junit.runners.ParentRunner.access$100(ParentRunner.java:66)
04:37:36 [2021-09-15T08:37:36.479Z] 	at org.junit.runners.ParentRunner$2.evaluate(ParentRunner.java:293)
04:37:36 [2021-09-15T08:37:36.479Z] 	at org.junit.internal.runners.statements.RunBefores.evaluate(RunBefores.java:26)
04:37:36 [2021-09-15T08:37:36.479Z] 	at org.junit.runners.ParentRunner$3.evaluate(ParentRunner.java:306)
04:37:36 [2021-09-15T08:37:36.479Z] 	at org.junit.runners.ParentRunner.run(ParentRunner.java:413)
04:37:36 [2021-09-15T08:37:36.479Z] 	at org.junit.runner.JUnitCore.run(JUnitCore.java:137)
04:37:36 [2021-09-15T08:37:36.479Z] 	at org.junit.runner.JUnitCore.run(JUnitCore.java:115)
04:37:36 [2021-09-15T08:37:36.479Z] 	at org.junit.vintage.engine.execution.RunnerExecutor.execute(RunnerExecutor.java:43)
04:37:36 [2021-09-15T08:37:36.479Z] 	at java.base/java.util.stream.ForEachOps$ForEachOp$OfRef.accept(ForEachOps.java:183)
04:37:36 [2021-09-15T08:37:36.479Z] 	at java.base/java.util.stream.ReferencePipeline$3$1.accept(ReferencePipeline.java:195)
04:37:36 [2021-09-15T08:37:36.479Z] 	at java.base/java.util.Iterator.forEachRemaining(Iterator.java:133)
04:37:36 [2021-09-15T08:37:36.479Z] 	at java.base/java.util.Spliterators$IteratorSpliterator.forEachRemaining(Spliterators.java:1801)
04:37:36 [2021-09-15T08:37:36.480Z] 	at java.base/java.util.stream.AbstractPipeline.copyInto(AbstractPipeline.java:484)
04:37:36 [2021-09-15T08:37:36.480Z] 	at java.base/java.util.stream.AbstractPipeline.wrapAndCopyInto(AbstractPipeline.java:474)
04:37:36 [2021-09-15T08:37:36.480Z] 	at java.base/java.util.stream.ForEachOps$ForEachOp.evaluateSequential(ForEachOps.java:150)
04:37:36 [2021-09-15T08:37:36.480Z] 	at java.base/java.util.stream.ForEachOps$ForEachOp$OfRef.evaluateSequential(ForEachOps.java:173)
04:37:36 [2021-09-15T08:37:36.480Z] 	at java.base/java.util.stream.AbstractPipeline.evaluate(AbstractPipeline.java:234)
04:37:36 [2021-09-15T08:37:36.480Z] 	at java.base/java.util.stream.ReferencePipeline.forEach(ReferencePipeline.java:497)
04:37:36 [2021-09-15T08:37:36.480Z] 	at org.junit.vintage.engine.VintageTestEngine.executeAllChildren(VintageTestEngine.java:82)
04:37:36 [2021-09-15T08:37:36.480Z] 	at org.junit.vintage.engine.VintageTestEngine.execute(VintageTestEngine.java:73)
04:37:36 [2021-09-15T08:37:36.480Z] 	at org.junit.platform.launcher.core.EngineExecutionOrchestrator.execute(EngineExecutionOrchestrator.java:108)
04:37:36 [2021-09-15T08:37:36.480Z] 	at org.junit.platform.launcher.core.EngineExecutionOrchestrator.execute(EngineExecutionOrchestrator.java:88)
04:37:36 [2021-09-15T08:37:36.480Z] 	at org.junit.platform.launcher.core.EngineExecutionOrchestrator.lambda$execute$0(EngineExecutionOrchestrator.java:54)
04:37:36 [2021-09-15T08:37:36.480Z] 	at org.junit.platform.launcher.core.EngineExecutionOrchestrator.withInterceptedStreams(EngineExecutionOrchestrator.java:67)
04:37:36 [2021-09-15T08:37:36.480Z] 	at org.junit.platform.launcher.core.EngineExecutionOrchestrator.execute(EngineExecutionOrchestrator.java:52)
04:37:36 [2021-09-15T08:37:36.480Z] 	at org.junit.platform.launcher.core.DefaultLauncher.execute(DefaultLauncher.java:96)
04:37:36 [2021-09-15T08:37:36.480Z] 	at org.junit.platform.launcher.core.DefaultLauncher.execute(DefaultLauncher.java:75)
04:37:36 [2021-09-15T08:37:36.480Z] 	at org.apache.maven.surefire.junitplatform.JUnitPlatformProvider.invokeAllTests(JUnitPlatformProvider.java:150)
04:37:36 [2021-09-15T08:37:36.480Z] 	at org.apache.maven.surefire.junitplatform.JUnitPlatformProvider.invoke(JUnitPlatformProvider.java:124)
04:37:36 [2021-09-15T08:37:36.480Z] 	at java.base/jdk.internal.reflect.NativeMethodAccessorImpl.invoke0(Native Method)
04:37:36 [2021-09-15T08:37:36.480Z] 	at java.base/jdk.internal.reflect.NativeMethodAccessorImpl.invoke(NativeMethodAccessorImpl.java:62)
04:37:36 [2021-09-15T08:37:36.480Z] 	at java.base/jdk.internal.reflect.DelegatingMethodAccessorImpl.invoke(DelegatingMethodAccessorImpl.java:43)
04:37:36 [2021-09-15T08:37:36.480Z] 	at java.base/java.lang.reflect.Method.invoke(Method.java:566)
04:37:36 [2021-09-15T08:37:36.480Z] 	at org.apache.maven.surefire.util.ReflectionUtils.invokeMethodWithArray2(ReflectionUtils.java:206)
04:37:36 [2021-09-15T08:37:36.480Z] 	at org.apache.maven.surefire.booter.ProviderFactory$ProviderProxy.invoke(ProviderFactory.java:161)
04:37:36 [2021-09-15T08:37:36.480Z] 	at org.apache.maven.surefire.booter.ProviderFactory.invokeProvider(ProviderFactory.java:84)
04:37:36 [2021-09-15T08:37:36.480Z] 	at org.eclipse.tycho.surefire.osgibooter.OsgiSurefireBooter.run(OsgiSurefireBooter.java:116)
04:37:36 [2021-09-15T08:37:36.480Z] 	at org.eclipse.tycho.surefire.osgibooter.AbstractUITestApplication$1.run(AbstractUITestApplication.java:37)
04:37:36 [2021-09-15T08:37:36.480Z] 	at org.eclipse.swt.widgets.RunnableLock.run(RunnableLock.java:40)
04:37:36 [2021-09-15T08:37:36.480Z] 	at org.eclipse.swt.widgets.Synchronizer.runAsyncMessages(Synchronizer.java:185)
04:37:36 [2021-09-15T08:37:36.480Z] 	at org.eclipse.swt.widgets.Display.runAsyncMessages(Display.java:5101)
04:37:36 [2021-09-15T08:37:36.480Z] 	at org.eclipse.swt.widgets.Display.readAndDispatch(Display.java:4579)
04:37:36 [2021-09-15T08:37:36.480Z] 	at org.eclipse.e4.ui.internal.workbench.swt.PartRenderingEngine$5.run(PartRenderingEngine.java:1150)
04:37:36 [2021-09-15T08:37:36.480Z] 	at org.eclipse.core.databinding.observable.Realm.runWithDefault(Realm.java:338)
04:37:36 [2021-09-15T08:37:36.480Z] 	at org.eclipse.e4.ui.internal.workbench.swt.PartRenderingEngine.run(PartRenderingEngine.java:1041)
04:37:36 [2021-09-15T08:37:36.480Z] 	at org.eclipse.e4.ui.internal.workbench.E4Workbench.createAndRunUI(E4Workbench.java:155)
04:37:36 [2021-09-15T08:37:36.480Z] 	at org.eclipse.ui.internal.Workbench.lambda$3(Workbench.java:644)
04:37:36 [2021-09-15T08:37:36.480Z] 	at org.eclipse.core.databinding.observable.Realm.runWithDefault(Realm.java:338)
04:37:36 [2021-09-15T08:37:36.480Z] 	at org.eclipse.ui.internal.Workbench.createAndRunWorkbench(Workbench.java:551)
04:37:36 [2021-09-15T08:37:36.480Z] 	at org.eclipse.ui.PlatformUI.createAndRunWorkbench(PlatformUI.java:156)
04:37:36 [2021-09-15T08:37:36.480Z] 	at org.eclipse.ui.internal.ide.application.IDEApplication.start(IDEApplication.java:152)
04:37:36 [2021-09-15T08:37:36.480Z] 	at org.eclipse.tycho.surefire.osgibooter.UITestApplication.runApplication(UITestApplication.java:29)
04:37:36 [2021-09-15T08:37:36.480Z] 	at org.eclipse.tycho.surefire.osgibooter.AbstractUITestApplication.run(AbstractUITestApplication.java:122)
04:37:36 [2021-09-15T08:37:36.480Z] 	at org.eclipse.tycho.surefire.osgibooter.UITestApplication.start(UITestApplication.java:35)
04:37:36 [2021-09-15T08:37:36.480Z] 	at org.eclipse.equinox.internal.app.EclipseAppHandle.run(EclipseAppHandle.java:203)
04:37:36 [2021-09-15T08:37:36.480Z] 	at org.eclipse.core.runtime.internal.adaptor.EclipseAppLauncher.runApplication(EclipseAppLauncher.java:136)
04:37:36 [2021-09-15T08:37:36.480Z] 	at org.eclipse.core.runtime.internal.adaptor.EclipseAppLauncher.start(EclipseAppLauncher.java:104)
04:37:36 [2021-09-15T08:37:36.480Z] 	at org.eclipse.core.runtime.adaptor.EclipseStarter.run(EclipseStarter.java:401)
04:37:36 [2021-09-15T08:37:36.480Z] 	at org.eclipse.core.runtime.adaptor.EclipseStarter.run(EclipseStarter.java:255)
04:37:36 [2021-09-15T08:37:36.480Z] 	at java.base/jdk.internal.reflect.NativeMethodAccessorImpl.invoke0(Native Method)
04:37:36 [2021-09-15T08:37:36.480Z] 	at java.base/jdk.internal.reflect.NativeMethodAccessorImpl.invoke(NativeMethodAccessorImpl.java:62)
04:37:36 [2021-09-15T08:37:36.480Z] 	at java.base/jdk.internal.reflect.DelegatingMethodAccessorImpl.invoke(DelegatingMethodAccessorImpl.java:43)
04:37:36 [2021-09-15T08:37:36.480Z] 	at java.base/java.lang.reflect.Method.invoke(Method.java:566)
04:37:36 [2021-09-15T08:37:36.480Z] 	at org.eclipse.equinox.launcher.Main.invokeFramework(Main.java:659)
04:37:36 [2021-09-15T08:37:36.480Z] 	at org.eclipse.equinox.launcher.Main.basicRun(Main.java:596)
04:37:36 [2021-09-15T08:37:36.480Z] 	at org.eclipse.equinox.launcher.Main.run(Main.java:1467)
04:37:36 [2021-09-15T08:37:36.480Z] 	at org.eclipse.equinox.launcher.Main.main(Main.java:1440)
04:37:36 [2021-09-15T08:37:36.480Z] 
04:37:36 [2021-09-15T08:37:36.480Z] Running org.eclipse.tracecompass.tmf.ui.tests.actions.TraceImportOperationTest
04:37:44 [2021-09-15T08:37:44.581Z] Tests run: 4, Failures: 0, Errors: 0, Skipped: 0, Time elapsed: 7.839 s - in org.eclipse.tracecompass.tmf.ui.tests.actions.TraceImportOperationTest
04:37:44 [2021-09-15T08:37:44.581Z] testTimeRangeFiltering  Time elapsed: 0.866 s
04:37:44 [2021-09-15T08:37:44.581Z] test  Time elapsed: 0.825 s
04:37:44 [2021-09-15T08:37:44.581Z] testSkipArchiveExtraction  Time elapsed: 1.226 s
04:37:44 [2021-09-15T08:37:44.581Z] testRename  Time elapsed: 4.868 s
04:37:44 [2021-09-15T08:37:44.581Z] Running org.eclipse.tracecompass.tmf.ui.tests.actions.SelectTracesOperationTest
04:37:44 [2021-09-15T08:37:44.839Z] Tests run: 2, Failures: 0, Errors: 0, Skipped: 0, Time elapsed: 0.584 s - in org.eclipse.tracecompass.tmf.ui.tests.actions.SelectTracesOperationTest
04:37:44 [2021-09-15T08:37:44.839Z] testOperationTimeRange  Time elapsed: 0.354 s
04:37:44 [2021-09-15T08:37:44.839Z] testBasicOperation  Time elapsed: 0.23 s
04:37:44 [2021-09-15T08:37:44.839Z] Running org.eclipse.tracecompass.tmf.ui.tests.views.uml2sd.loader.TmfUml2SDSyncLoaderPagesTest
04:38:31 [2021-09-15T08:38:31.499Z] Tests run: 6, Failures: 0, Errors: 0, Skipped: 0, Time elapsed: 46.262 s - in org.eclipse.tracecompass.tmf.ui.tests.views.uml2sd.loader.TmfUml2SDSyncLoaderPagesTest
04:38:31 [2021-09-15T08:38:31.499Z] verifyLastPage  Time elapsed: 2.733 s
04:38:31 [2021-09-15T08:38:31.499Z] verifyPrevPage  Time elapsed: 13.842 s
04:38:31 [2021-09-15T08:38:31.499Z] verifyPageNumberChanged  Time elapsed: 2.999 s
04:38:31 [2021-09-15T08:38:31.499Z] verifyFirstPage  Time elapsed: 2.572 s
04:38:31 [2021-09-15T08:38:31.499Z] verifyPagesCount  Time elapsed: 0.001 s
04:38:31 [2021-09-15T08:38:31.499Z] verifyNextPage  Time elapsed: 13.743 s
04:38:31 [2021-09-15T08:38:31.499Z] Running org.eclipse.tracecompass.tmf.ui.tests.views.uml2sd.loader.TmfUml2SDSyncLoaderExpTest
04:38:58 [2021-09-15T08:38:58.024Z] Tests run: 5, Failures: 0, Errors: 0, Skipped: 0, Time elapsed: 26.011 s - in org.eclipse.tracecompass.tmf.ui.tests.views.uml2sd.loader.TmfUml2SDSyncLoaderExpTest
04:38:58 [2021-09-15T08:38:58.024Z] verifySetup  Time elapsed: 2.047 s
04:38:58 [2021-09-15T08:38:58.024Z] verifyCancel  Time elapsed: 15.865 s
04:38:58 [2021-09-15T08:38:58.024Z] verifyLoaderDispose  Time elapsed: 0.049 s
04:38:58 [2021-09-15T08:38:58.024Z] testSetViewer  Time elapsed: 0.103 s
04:38:58 [2021-09-15T08:38:58.024Z] verifyDispose  Time elapsed: 0.001 s
04:38:58 [2021-09-15T08:38:58.024Z] Running org.eclipse.tracecompass.tmf.ui.tests.views.uml2sd.loader.TmfUml2SDSyncLoaderFindTest
04:39:19 [2021-09-15T08:39:19.946Z] Tests run: 4, Failures: 0, Errors: 0, Skipped: 0, Time elapsed: 21.232 s - in org.eclipse.tracecompass.tmf.ui.tests.views.uml2sd.loader.TmfUml2SDSyncLoaderFindTest
04:39:19 [2021-09-15T08:39:19.946Z] verifyFirstMessage  Time elapsed: 3.556 s
04:39:19 [2021-09-15T08:39:19.946Z] verifyFind  Time elapsed: 5.487 s
04:39:19 [2021-09-15T08:39:19.946Z] verifyISDGraphNodeSupporter  Time elapsed: 1.325 s
04:39:19 [2021-09-15T08:39:19.946Z] verifyCancelSearch  Time elapsed: 2.947 s
04:39:19 [2021-09-15T08:39:19.946Z] Running org.eclipse.tracecompass.tmf.ui.tests.views.uml2sd.loader.TmfUml2SDSyncLoaderSignalTest
04:39:30 [2021-09-15T08:39:30.119Z] Tests run: 2, Failures: 0, Errors: 0, Skipped: 0, Time elapsed: 11.035 s - in org.eclipse.tracecompass.tmf.ui.tests.views.uml2sd.loader.TmfUml2SDSyncLoaderSignalTest
04:39:30 [2021-09-15T08:39:30.119Z] verifyFirstPageSignal  Time elapsed: 1.384 s
04:39:30 [2021-09-15T08:39:30.119Z] verifySelectionSignal  Time elapsed: 0.002 s
04:39:30 [2021-09-15T08:39:30.119Z] Running org.eclipse.tracecompass.tmf.ui.tests.views.uml2sd.loader.TmfUml2SDSyncLoaderFilterTest
04:39:56 [2021-09-15T08:39:56.644Z] Tests run: 5, Failures: 0, Errors: 0, Skipped: 0, Time elapsed: 26.823 s - in org.eclipse.tracecompass.tmf.ui.tests.views.uml2sd.loader.TmfUml2SDSyncLoaderFilterTest
04:39:56 [2021-09-15T08:39:56.644Z] verifyMessageFilter  Time elapsed: 3.464 s
04:39:56 [2021-09-15T08:39:56.644Z] verifyRemoval  Time elapsed: 4.502 s
04:39:56 [2021-09-15T08:39:56.644Z] verifyFilter1of2  Time elapsed: 3.465 s
04:39:56 [2021-09-15T08:39:56.644Z] verifyFilter1of3  Time elapsed: 3.954 s
04:39:56 [2021-09-15T08:39:56.644Z] verifyFilter2of2  Time elapsed: 3.468 s
04:39:56 [2021-09-15T08:39:56.644Z] Running org.eclipse.tracecompass.tmf.ui.tests.views.uml2sd.loader.TmfUml2SDSyncLoaderTimeTest
04:40:18 [2021-09-15T08:40:18.555Z] Tests run: 9, Failures: 0, Errors: 0, Skipped: 0, Time elapsed: 21.261 s - in org.eclipse.tracecompass.tmf.ui.tests.views.uml2sd.loader.TmfUml2SDSyncLoaderTimeTest
04:40:18 [2021-09-15T08:40:18.555Z] verifyTimeRangeSamePage  Time elapsed: 1.377 s
04:40:18 [2021-09-15T08:40:18.555Z] verifyTimeRangeDifferentPages  Time elapsed: 1.547 s
04:40:18 [2021-09-15T08:40:18.555Z] verifySynchToTimeEqualsLast  Time elapsed: 1.558 s
04:40:18 [2021-09-15T08:40:18.555Z] verifySynchToTimeBeforeExpStart  Time elapsed: 1.441 s
04:40:18 [2021-09-15T08:40:18.555Z] verifySynchToTimeAfterExpEnd  Time elapsed: 1.208 s
04:40:18 [2021-09-15T08:40:18.555Z] verifySynchToTimeInPage  Time elapsed: 1.385 s
04:40:18 [2021-09-15T08:40:18.555Z] verifySynchToTimeNonExisting  Time elapsed: 1.966 s
04:40:18 [2021-09-15T08:40:18.555Z] verifySynchToTimeFirst  Time elapsed: 1.594 s
04:40:18 [2021-09-15T08:40:18.555Z] verifySynchToTimeOutsidePage  Time elapsed: 1.576 s
04:40:18 [2021-09-15T08:40:18.555Z] Running org.eclipse.tracecompass.tmf.ui.tests.views.uml2sd.load.LoadersManagerTest
04:40:18 [2021-09-15T08:40:18.812Z] Tests run: 1, Failures: 0, Errors: 0, Skipped: 0, Time elapsed: 1.25 s - in org.eclipse.tracecompass.tmf.ui.tests.views.uml2sd.load.LoadersManagerTest
04:40:18 [2021-09-15T08:40:18.812Z] testLoaderManager  Time elapsed: 1.25 s
04:40:18 [2021-09-15T08:40:18.812Z] Running org.eclipse.tracecompass.tmf.ui.tests.views.uml2sd.dialogs.CriteriaTest
04:40:18 [2021-09-15T08:40:18.812Z] Tests run: 8, Failures: 0, Errors: 0, Skipped: 0, Time elapsed: 0.003 s - in org.eclipse.tracecompass.tmf.ui.tests.views.uml2sd.dialogs.CriteriaTest
04:40:18 [2021-09-15T08:40:18.812Z] testCriteria  Time elapsed: 0.001 s
04:40:18 [2021-09-15T08:40:18.812Z] testAccessors  Time elapsed: 0 s
04:40:18 [2021-09-15T08:40:18.812Z] testLoad  Time elapsed: 0 s
04:40:18 [2021-09-15T08:40:18.812Z] testSave  Time elapsed: 0.001 s
04:40:18 [2021-09-15T08:40:18.812Z] testCompareTo  Time elapsed: 0 s
04:40:18 [2021-09-15T08:40:18.812Z] testCriteriaCriteria  Time elapsed: 0 s
04:40:18 [2021-09-15T08:40:18.812Z] testMatches  Time elapsed: 0 s
04:40:18 [2021-09-15T08:40:18.812Z] testGetGraphNodeSummary  Time elapsed: 0.001 s
04:40:18 [2021-09-15T08:40:18.812Z] Running org.eclipse.tracecompass.tmf.ui.tests.views.TmfViewFactoryTest
04:40:18 [2021-09-15T08:40:18.812Z] Tests run: 2, Failures: 0, Errors: 0, Skipped: 0, Time elapsed: 0.115 s - in org.eclipse.tracecompass.tmf.ui.tests.views.TmfViewFactoryTest
04:40:18 [2021-09-15T08:40:18.812Z] testGetBaseSecId  Time elapsed: 0.001 s
04:40:18 [2021-09-15T08:40:18.812Z] testNewView  Time elapsed: 0.114 s
04:40:18 [2021-09-15T08:40:18.812Z] Running org.eclipse.tracecompass.tmf.ui.tests.views.FormatTimeUtilsTest
04:40:18 [2021-09-15T08:40:18.812Z] Tests run: 2, Failures: 0, Errors: 0, Skipped: 0, Time elapsed: 0.004 s - in org.eclipse.tracecompass.tmf.ui.tests.views.FormatTimeUtilsTest
04:40:18 [2021-09-15T08:40:18.812Z] testFormatTimeRelative  Time elapsed: 0.004 s
04:40:18 [2021-09-15T08:40:18.812Z] testFormatTimeCalendar  Time elapsed: 0 s
04:40:18 [2021-09-15T08:40:18.812Z] Running org.eclipse.tracecompass.tmf.ui.tests.project.model.ProjectModelAnalysisTest
04:40:20 [2021-09-15T08:40:20.917Z] Tests run: 3, Failures: 0, Errors: 0, Skipped: 0, Time elapsed: 1.994 s - in org.eclipse.tracecompass.tmf.ui.tests.project.model.ProjectModelAnalysisTest
04:40:20 [2021-09-15T08:40:20.917Z] testListAnalysis  Time elapsed: 0.304 s
04:40:20 [2021-09-15T08:40:20.917Z] testPopulate  Time elapsed: 0.018 s
04:40:20 [2021-09-15T08:40:20.917Z] testInstantiate  Time elapsed: 1.672 s
04:40:20 [2021-09-15T08:40:20.917Z] Running org.eclipse.tracecompass.tmf.ui.tests.project.model.ProjectModelOutputTest
04:40:21 [2021-09-15T08:40:21.865Z] Tests run: 2, Failures: 0, Errors: 0, Skipped: 0, Time elapsed: 1.109 s - in org.eclipse.tracecompass.tmf.ui.tests.project.model.ProjectModelOutputTest
04:40:21 [2021-09-15T08:40:21.865Z] testListOutputs  Time elapsed: 0.482 s
04:40:21 [2021-09-15T08:40:21.865Z] testOpenView  Time elapsed: 0.627 s
04:40:21 [2021-09-15T08:40:21.865Z] Running org.eclipse.tracecompass.tmf.ui.tests.project.model.ProjectModelTraceTest
04:40:22 [2021-09-15T08:40:22.438Z] Tests run: 1, Failures: 0, Errors: 0, Skipped: 0, Time elapsed: 0.584 s - in org.eclipse.tracecompass.tmf.ui.tests.project.model.ProjectModelTraceTest
04:40:22 [2021-09-15T08:40:22.438Z] testOpenTrace  Time elapsed: 0.584 s
04:40:22 [2021-09-15T08:40:22.438Z] Running org.eclipse.tracecompass.tmf.ui.tests.project.model.TraceAndExperimentTypeTest
04:40:25 [2021-09-15T08:40:25.715Z] Tests run: 5, Failures: 0, Errors: 0, Skipped: 0, Time elapsed: 2.61 s - in org.eclipse.tracecompass.tmf.ui.tests.project.model.TraceAndExperimentTypeTest
04:40:25 [2021-09-15T08:40:25.715Z] testExperimentTypeAnalysis  Time elapsed: 0.138 s
04:40:25 [2021-09-15T08:40:25.715Z] testDefaultExperimentType  Time elapsed: 0.377 s
04:40:25 [2021-09-15T08:40:25.715Z] testNoExperimentTypeChildren  Time elapsed: 0.586 s
04:40:25 [2021-09-15T08:40:25.715Z] testExperimentType  Time elapsed: 0.52 s
04:40:25 [2021-09-15T08:40:25.715Z] testExperimentTypeChildren  Time elapsed: 0.989 s
04:40:25 [2021-09-15T08:40:25.715Z] Running org.eclipse.tracecompass.tmf.ui.tests.project.model.TmfProjectModelPreferencesTest
04:40:25 [2021-09-15T08:40:25.715Z] Tests run: 3, Failures: 0, Errors: 0, Skipped: 0, Time elapsed: 0.007 s - in org.eclipse.tracecompass.tmf.ui.tests.project.model.TmfProjectModelPreferencesTest
04:40:25 [2021-09-15T08:40:25.715Z] testInit  Time elapsed: 0 s
04:40:25 [2021-09-15T08:40:25.715Z] testLabelSetterGetters  Time elapsed: 0 s
04:40:25 [2021-09-15T08:40:25.715Z] testIconSetterGetters  Time elapsed: 0 s
04:40:25 [2021-09-15T08:40:25.715Z] Running org.eclipse.tracecompass.tmf.ui.tests.project.model.TmfProjectRegistryTest
04:40:25 [2021-09-15T08:40:25.715Z] 
04:40:25 [2021-09-15T08:40:25.715Z] !ENTRY org.eclipse.core.resources 2 2 2021-09-15 08:40:25.671
04:40:25 [2021-09-15T08:40:25.715Z] !MESSAGE Save operation warnings.
04:40:25 [2021-09-15T08:40:25.715Z] !SUBENTRY 1 org.eclipse.core.resources 2 234 2021-09-15 08:40:25.671
04:40:25 [2021-09-15T08:40:25.715Z] !MESSAGE The project description file (.project) for '.tracecompass-SomeProject' was missing.  This file contains important information about the project.  A new project description file has been created, but some information about the project may have been lost.
04:40:25 [2021-09-15T08:40:25.715Z] 
04:40:25 [2021-09-15T08:40:25.715Z] !ENTRY org.eclipse.cdt.core 1 0 2021-09-15 08:40:25.702
04:40:25 [2021-09-15T08:40:25.715Z] !MESSAGE Indexed 'SomeProject2' (0 sources, 0 headers) in 0.001 sec: 0 declarations; 0 references; 0 unresolved inclusions; 0 syntax errors; 0 unresolved names (0%)
04:40:25 [2021-09-15T08:40:25.972Z] Tests run: 3, Failures: 0, Errors: 0, Skipped: 0, Time elapsed: 0.761 s - in org.eclipse.tracecompass.tmf.ui.tests.project.model.TmfProjectRegistryTest
04:40:25 [2021-09-15T08:40:25.973Z] testAddingTracingNature  Time elapsed: 0.401 s
04:40:25 [2021-09-15T08:40:25.973Z] testCreateTracingProject  Time elapsed: 0.067 s
04:40:25 [2021-09-15T08:40:25.973Z] testAddingTracingNatureNotAllowed  Time elapsed: 0.001 s
04:40:25 [2021-09-15T08:40:25.973Z] Running org.eclipse.tracecompass.tmf.ui.tests.viewers.ToolTipStringTest
04:40:25 [2021-09-15T08:40:25.973Z] Tests run: 5, Failures: 0, Errors: 0, Skipped: 0, Time elapsed: 0.016 s - in org.eclipse.tracecompass.tmf.ui.tests.viewers.ToolTipStringTest
04:40:25 [2021-09-15T08:40:25.973Z] testHtml  Time elapsed: 0.012 s
04:40:25 [2021-09-15T08:40:25.973Z] testTimestamp  Time elapsed: 0.001 s
04:40:25 [2021-09-15T08:40:25.973Z] testDecimal  Time elapsed: 0.002 s
04:40:25 [2021-09-15T08:40:25.973Z] testString  Time elapsed: 0.001 s
04:40:25 [2021-09-15T08:40:25.973Z] testEgality  Time elapsed: 0 s
04:40:25 [2021-09-15T08:40:25.973Z] Running org.eclipse.tracecompass.tmf.ui.tests.histogram.HistogramDataModelTest
04:40:25 [2021-09-15T08:40:25.973Z] Tests run: 28, Failures: 0, Errors: 0, Skipped: 0, Time elapsed: 0.02 s - in org.eclipse.tracecompass.tmf.ui.tests.histogram.HistogramDataModelTest
04:40:25 [2021-09-15T08:40:25.973Z] testHistogramDataModelInt  Time elapsed: 0.001 s
04:40:25 [2021-09-15T08:40:25.973Z] testScaleTo_0  Time elapsed: 0 s
04:40:25 [2021-09-15T08:40:25.973Z] testScaleTo_1  Time elapsed: 0.002 s
04:40:25 [2021-09-15T08:40:25.973Z] testScaleTo_2  Time elapsed: 0 s
04:40:25 [2021-09-15T08:40:25.973Z] testScaleTo_3  Time elapsed: 0 s
04:40:25 [2021-09-15T08:40:25.973Z] testScaleTo_4  Time elapsed: 0.001 s
04:40:25 [2021-09-15T08:40:25.973Z] testScaleTo_5  Time elapsed: 0 s
04:40:25 [2021-09-15T08:40:25.973Z] testScaleTo_6  Time elapsed: 0.001 s
04:40:25 [2021-09-15T08:40:25.973Z] testScaleTo_7  Time elapsed: 0 s
04:40:25 [2021-09-15T08:40:25.973Z] testClear  Time elapsed: 0 s
04:40:25 [2021-09-15T08:40:25.973Z] testHistogramDataModel  Time elapsed: 0.001 s
04:40:25 [2021-09-15T08:40:25.973Z] testModelListener  Time elapsed: 0.006 s
04:40:25 [2021-09-15T08:40:25.973Z] testHistogramDataModelCopyConstructor  Time elapsed: 0.003 s
04:40:25 [2021-09-15T08:40:25.973Z] testLostEventsScaleTo_0  Time elapsed: 0 s
04:40:25 [2021-09-15T08:40:25.973Z] testLostEventsScaleTo_1  Time elapsed: 0 s
04:40:25 [2021-09-15T08:40:25.973Z] testLostEventsScaleTo_2  Time elapsed: 0.001 s
04:40:25 [2021-09-15T08:40:25.973Z] testLostEventsScaleTo_3  Time elapsed: 0 s
04:40:25 [2021-09-15T08:40:25.973Z] testLostEventsScaleTo_4  Time elapsed: 0 s
04:40:25 [2021-09-15T08:40:25.973Z] testCountEvent_0  Time elapsed: 0 s
04:40:25 [2021-09-15T08:40:25.973Z] testCountEvent_1  Time elapsed: 0 s
04:40:25 [2021-09-15T08:40:25.973Z] testCountEvent_2  Time elapsed: 0.001 s
04:40:25 [2021-09-15T08:40:25.973Z] testCountEvent_3  Time elapsed: 0 s
04:40:25 [2021-09-15T08:40:25.973Z] testCountEvent_4  Time elapsed: 0 s
04:40:25 [2021-09-15T08:40:25.973Z] testCountEvent_5  Time elapsed: 0 s
04:40:25 [2021-09-15T08:40:25.973Z] testCountEvent_6  Time elapsed: 0 s
04:40:25 [2021-09-15T08:40:25.973Z] testScaleToReverse_1  Time elapsed: 0.002 s
04:40:25 [2021-09-15T08:40:25.973Z] testScaleToReverse_2  Time elapsed: 0.001 s
04:40:25 [2021-09-15T08:40:25.973Z] testCountEventLimitOverflow  Time elapsed: 0 s
04:40:25 [2021-09-15T08:40:25.973Z] Running org.eclipse.tracecompass.tmf.ui.tests.widgets.timegraph.model.TimeGraphEntryTest
04:40:25 [2021-09-15T08:40:25.973Z] Tests run: 19, Failures: 0, Errors: 0, Skipped: 0, Time elapsed: 0.058 s - in org.eclipse.tracecompass.tmf.ui.tests.widgets.timegraph.model.TimeGraphEntryTest
04:40:25 [2021-09-15T08:40:25.973Z] testAddChildOtherParent  Time elapsed: 0.052 s
04:40:25 [2021-09-15T08:40:25.973Z] testAddEventReplaceLast  Time elapsed: 0.003 s
04:40:25 [2021-09-15T08:40:25.973Z] testAddChildAtPosition  Time elapsed: 0 s
04:40:25 [2021-09-15T08:40:25.973Z] testGetTimeEventsIteratorMixedSplit  Time elapsed: 0 s
04:40:25 [2021-09-15T08:40:25.973Z] testSortChildren  Time elapsed: 0.001 s
04:40:25 [2021-09-15T08:40:25.973Z] testAddEventNulls  Time elapsed: 0 s
04:40:25 [2021-09-15T08:40:25.973Z] testRemoveChild  Time elapsed: 0 s
04:40:25 [2021-09-15T08:40:25.973Z] testGetTimeEventsIteratorMixed  Time elapsed: 0 s
04:40:25 [2021-09-15T08:40:25.973Z] testSortChildrenThenAdd  Time elapsed: 0.001 s
04:40:25 [2021-09-15T08:40:25.973Z] testAddChild  Time elapsed: 0 s
04:40:25 [2021-09-15T08:40:25.973Z] testAddEvent  Time elapsed: 0 s
04:40:25 [2021-09-15T08:40:25.973Z] testRemoveChildOtherParent  Time elapsed: 0 s
04:40:25 [2021-09-15T08:40:25.973Z] testaddZoomedEvent  Time elapsed: 0 s
04:40:25 [2021-09-15T08:40:25.973Z] testRemoveChildNoParent  Time elapsed: 0 s
04:40:25 [2021-09-15T08:40:25.973Z] testaddZoomedEventPartialRestart  Time elapsed: 0 s
04:40:25 [2021-09-15T08:40:25.973Z] testAddChildSameParent  Time elapsed: 0.001 s
04:40:25 [2021-09-15T08:40:25.973Z] testaddZoomedEventDuplicate  Time elapsed: 0 s
04:40:25 [2021-09-15T08:40:25.973Z] testaddZoomedEventReplaceLast  Time elapsed: 0 s
04:40:25 [2021-09-15T08:40:25.973Z] testAddZoomedEventNulls  Time elapsed: 0 s
04:40:25 [2021-09-15T08:40:25.973Z] Running org.eclipse.tracecompass.tmf.ui.tests.widgets.timegraph.model.StyleManagerTest
04:40:25 [2021-09-15T08:40:25.973Z] Tests run: 15, Failures: 0, Errors: 0, Skipped: 0, Time elapsed: 0.004 s - in org.eclipse.tracecompass.tmf.ui.tests.widgets.timegraph.model.StyleManagerTest
04:40:25 [2021-09-15T08:40:25.973Z] testStyleProperties[0: disjoint styles]  Time elapsed: 0.001 s
04:40:25 [2021-09-15T08:40:25.973Z] testColorStyleProperties[0: disjoint styles]  Time elapsed: 0.001 s
04:40:25 [2021-09-15T08:40:25.973Z] testFactorStyleProperties[0: disjoint styles]  Time elapsed: 0 s
04:40:25 [2021-09-15T08:40:25.973Z] testStyleProperties[1: styles with map]  Time elapsed: 0 s
04:40:25 [2021-09-15T08:40:25.973Z] testColorStyleProperties[1: styles with map]  Time elapsed: 0.001 s
04:40:25 [2021-09-15T08:40:25.973Z] testFactorStyleProperties[1: styles with map]  Time elapsed: 0 s
04:40:25 [2021-09-15T08:40:25.973Z] testStyleProperties[2: style inheritance]  Time elapsed: 0 s
04:40:25 [2021-09-15T08:40:25.973Z] testColorStyleProperties[2: style inheritance]  Time elapsed: 0 s
04:40:25 [2021-09-15T08:40:25.973Z] testFactorStyleProperties[2: style inheritance]  Time elapsed: 0 s
04:40:25 [2021-09-15T08:40:25.973Z] testStyleProperties[3: default values]  Time elapsed: 0 s
04:40:25 [2021-09-15T08:40:25.973Z] testColorStyleProperties[3: default values]  Time elapsed: 0 s
04:40:25 [2021-09-15T08:40:25.973Z] testFactorStyleProperties[3: default values]  Time elapsed: 0.001 s
04:40:25 [2021-09-15T08:40:25.973Z] testStyleProperties[4: multiple inheritance]  Time elapsed: 0 s
04:40:25 [2021-09-15T08:40:25.973Z] testColorStyleProperties[4: multiple inheritance]  Time elapsed: 0 s
04:40:25 [2021-09-15T08:40:25.973Z] testFactorStyleProperties[4: multiple inheritance]  Time elapsed: 0 s
04:40:25 [2021-09-15T08:40:25.973Z] Running org.eclipse.tracecompass.tmf.ui.tests.util.LineClipperTest
04:40:25 [2021-09-15T08:40:25.973Z] Tests run: 13, Failures: 0, Errors: 0, Skipped: 0, Time elapsed: 0.002 s - in org.eclipse.tracecompass.tmf.ui.tests.util.LineClipperTest
04:40:25 [2021-09-15T08:40:25.973Z] clipRightTest  Time elapsed: 0.001 s
04:40:25 [2021-09-15T08:40:25.973Z] clipXTest  Time elapsed: 0 s
04:40:25 [2021-09-15T08:40:25.973Z] horizontalTest  Time elapsed: 0 s
04:40:25 [2021-09-15T08:40:25.973Z] tangentInsideTest  Time elapsed: 0 s
04:40:25 [2021-09-15T08:40:25.973Z] glancingTest  Time elapsed: 0 s
04:40:25 [2021-09-15T08:40:25.973Z] ousideSquareTest  Time elapsed: 0 s
04:40:25 [2021-09-15T08:40:25.973Z] insideTest  Time elapsed: 0 s
04:40:25 [2021-09-15T08:40:25.973Z] verticalTest  Time elapsed: 0 s
04:40:25 [2021-09-15T08:40:25.973Z] clipTopTest  Time elapsed: 0.001 s
04:40:25 [2021-09-15T08:40:25.973Z] tangentTest  Time elapsed: 0 s
04:40:25 [2021-09-15T08:40:25.973Z] tangentInsideCornerTest  Time elapsed: 0 s
04:40:25 [2021-09-15T08:40:25.973Z] clipLeftTest  Time elapsed: 0 s
04:40:25 [2021-09-15T08:40:25.973Z] clipBottomTest  Time elapsed: 0 s
04:40:25 [2021-09-15T08:40:25.973Z] Running org.eclipse.tracecompass.tmf.ui.tests.colors.ColorUtilsTest
04:40:25 [2021-09-15T08:40:25.973Z] Tests run: 1, Failures: 0, Errors: 0, Skipped: 0, Time elapsed: 0.001 s - in org.eclipse.tracecompass.tmf.ui.tests.colors.ColorUtilsTest
04:40:25 [2021-09-15T08:40:25.973Z] testToHexStringRGB  Time elapsed: 0.001 s
04:40:25 [2021-09-15T08:40:25.973Z] Running org.eclipse.tracecompass.tmf.ui.tests.symbols.BasicSymbolProviderTest
04:40:25 [2021-09-15T08:40:25.973Z] 
04:40:25 [2021-09-15T08:40:25.973Z] !ENTRY org.eclipse.cdt.core.native 4 0 2021-09-15 08:40:25.897
04:40:25 [2021-09-15T08:40:25.973Z] !MESSAGE no spawner in java.library.path: [/usr/java/packages/lib, /usr/lib64, /lib64, /lib, /usr/lib]
04:40:25 [2021-09-15T08:40:25.973Z] Tests run: 1, Failures: 0, Errors: 0, Skipped: 0, Time elapsed: 0.034 s - in org.eclipse.tracecompass.tmf.ui.tests.symbols.BasicSymbolProviderTest
04:40:25 [2021-09-15T08:40:25.973Z] testBasicProvider  Time elapsed: 0.034 s
04:40:25 [2021-09-15T08:40:25.973Z] Running org.eclipse.tracecompass.tmf.ui.tests.markers.PeriodicMarkerEventSourceTest
04:40:26 [2021-09-15T08:40:26.230Z] Tests run: 11, Failures: 0, Errors: 0, Skipped: 0, Time elapsed: 0.05 s - in org.eclipse.tracecompass.tmf.ui.tests.markers.PeriodicMarkerEventSourceTest
04:40:26 [2021-09-15T08:40:26.230Z] testNextPreviousIncluded  Time elapsed: 0.047 s
04:40:26 [2021-09-15T08:40:26.230Z] testInvalidRollover  Time elapsed: 0 s
04:40:26 [2021-09-15T08:40:26.230Z] testSmallPeriod  Time elapsed: 0.001 s
04:40:26 [2021-09-15T08:40:26.230Z] testIsApplicable  Time elapsed: 0 s
04:40:26 [2021-09-15T08:40:26.230Z] testAlternateShadingMarkerEventSource  Time elapsed: 0.001 s
04:40:26 [2021-09-15T08:40:26.230Z] testFractionalPeriod  Time elapsed: 0 s
04:40:26 [2021-09-15T08:40:26.230Z] testReference  Time elapsed: 0 s
04:40:26 [2021-09-15T08:40:26.230Z] testRollover  Time elapsed: 0 s
04:40:26 [2021-09-15T08:40:26.230Z] testInvalidPeriod  Time elapsed: 0 s
04:40:26 [2021-09-15T08:40:26.230Z] testLineMarkerEventSource  Time elapsed: 0 s
04:40:26 [2021-09-15T08:40:26.230Z] testResolution  Time elapsed: 0.001 s
04:40:26 [2021-09-15T08:40:26.230Z] 
04:40:26 [2021-09-15T08:40:26.230Z] Results:
04:40:26 [2021-09-15T08:40:26.230Z] 
04:40:26 [2021-09-15T08:40:26.230Z] Failures: 
04:40:26 [2021-09-15T08:40:26.230Z]   DownloadTraceHttpHelperTest.testArchiveTraceDownload:109
04:40:26 [2021-09-15T08:40:26.230Z]   DownloadTraceHttpHelperTest.testMutlipleTracesDownload:90
04:40:26 [2021-09-15T08:40:26.230Z]   DownloadTraceHttpHelperTest.testTraceDownload:75
04:40:26 [2021-09-15T08:40:26.230Z]   HttpTraceImportOperationTest.testArchiveImport:138->validateImport:143 expected:<2> but was:<0>
04:40:26 [2021-09-15T08:40:26.230Z]   HttpTraceImportOperationTest.testMultipleTracesImport:121->validateImport:143 expected:<2> but was:<0>
04:40:26 [2021-09-15T08:40:26.230Z]   HttpTraceImportOperationTest.testTraceImport:101->validateImport:143 expected:<1> but was:<0>
04:40:26 [2021-09-15T08:40:26.230Z] 
04:40:26 [2021-09-15T08:40:26.230Z] Tests run: 205, Failures: 6, Errors: 0, Skipped: 0
04:40:26 [2021-09-15T08:40:26.230Z] 
04:40:26 [2021-09-15T08:40:26.487Z] 
04:40:26 [2021-09-15T08:40:26.487Z] !ENTRY org.eclipse.core.resources 2 10035 2021-09-15 08:40:26.409
04:40:26 [2021-09-15T08:40:26.487Z] !MESSAGE The workspace will exit with unsaved changes in this session.
04:40:26 [2021-09-15T08:40:26.745Z] [INFO] ------------------------------------------------------------------------
04:40:26 [2021-09-15T08:40:26.745Z] [INFO] Reactor Summary:
04:40:26 [2021-09-15T08:40:26.745Z] [INFO] 
04:40:26 [2021-09-15T08:40:26.745Z] [INFO] Trace Compass Parent 7.1.0-SNAPSHOT ................ SUCCESS [ 50.812 s]
04:40:26 [2021-09-15T08:40:26.745Z] [INFO] Trace Compass Tracetype-agnostic Analyses Parent 7.1.0-SNAPSHOT SUCCESS [  0.013 s]
04:40:26 [2021-09-15T08:40:26.745Z] [INFO] Trace Compass Common Utilities Parent 7.1.0-SNAPSHOT SUCCESS [  0.030 s]
04:40:26 [2021-09-15T08:40:26.745Z] [INFO] org.eclipse.tracecompass.common.core 4.3.1-SNAPSHOT  SUCCESS [ 32.693 s]
04:40:26 [2021-09-15T08:40:26.745Z] [INFO] Trace Compass State System Parent 7.1.0-SNAPSHOT ... SUCCESS [  0.013 s]
04:40:26 [2021-09-15T08:40:26.745Z] [INFO] org.eclipse.tracecompass.datastore.core 1.2.2-SNAPSHOT SUCCESS [  4.793 s]
04:40:26 [2021-09-15T08:40:26.745Z] [INFO] org.eclipse.tracecompass.segmentstore.core 3.0.1-SNAPSHOT SUCCESS [  3.021 s]
04:40:26 [2021-09-15T08:40:26.745Z] [INFO] org.eclipse.tracecompass.statesystem.core 5.0.3-SNAPSHOT SUCCESS [  5.304 s]
04:40:26 [2021-09-15T08:40:26.745Z] [INFO] Trace Compass TMF Parent 7.1.0-SNAPSHOT ............ SUCCESS [  0.011 s]
04:40:26 [2021-09-15T08:40:26.745Z] [INFO] Trace Compass Filter Parser 1.0.6-SNAPSHOT ......... SUCCESS [  3.906 s]
04:40:26 [2021-09-15T08:40:26.745Z] [INFO] org.eclipse.tracecompass.tmf.core 7.1.0-SNAPSHOT ... SUCCESS [ 12.478 s]
04:40:26 [2021-09-15T08:40:26.745Z] [INFO] org.eclipse.tracecompass.analysis.counters.core 2.0.6-SNAPSHOT SUCCESS [  3.686 s]
04:40:26 [2021-09-15T08:40:26.745Z] [INFO] Trace Compass CTF Support Parent 7.1.0-SNAPSHOT .... SUCCESS [  0.026 s]
04:40:26 [2021-09-15T08:40:26.745Z] [INFO] Trace Compass CTF Parser Plug-in 1.0.6-SNAPSHOT .... SUCCESS [ 15.868 s]
04:40:26 [2021-09-15T08:40:26.745Z] [INFO] org.eclipse.tracecompass.ctf.core 4.0.6-SNAPSHOT ... SUCCESS [  5.612 s]
04:40:26 [2021-09-15T08:40:26.745Z] [INFO] Trace Compass CTF Core Tests Plug-in 1.0.9-SNAPSHOT  SUCCESS [01:12 min]
04:40:26 [2021-09-15T08:40:26.745Z] [INFO] org.eclipse.tracecompass.statesystem.core.tests 1.0.13-SNAPSHOT SUCCESS [ 15.452 s]
04:40:26 [2021-09-15T08:40:26.745Z] [INFO] org.eclipse.tracecompass.tmf.core.tests 1.0.18-SNAPSHOT SUCCESS [05:35 min]
04:40:26 [2021-09-15T08:40:26.745Z] [INFO] org.eclipse.tracecompass.tmf.ctf.core 4.2.3-SNAPSHOT SUCCESS [  3.906 s]
04:40:26 [2021-09-15T08:40:26.745Z] [INFO] org.eclipse.tracecompass.tmf.ctf.core.tests 1.0.13-SNAPSHOT SUCCESS [04:46 min]
04:40:26 [2021-09-15T08:40:26.745Z] [INFO] org.eclipse.tracecompass.analysis.counters.core.tests 1.0.1-SNAPSHOT SUCCESS [ 10.000 s]
04:40:26 [2021-09-15T08:40:26.745Z] [INFO] org.eclipse.tracecompass.tmf.ui 7.1.0-SNAPSHOT ..... SUCCESS [ 18.697 s]
04:40:26 [2021-09-15T08:40:26.745Z] [INFO] org.eclipse.tracecompass.analysis.counters.ui 2.0.0-SNAPSHOT SUCCESS [  2.933 s]
04:40:26 [2021-09-15T08:40:26.745Z] [INFO] org.eclipse.tracecompass.tmf.ui.tests 1.0.17-SNAPSHOT FAILURE [03:10 min]
04:40:26 [2021-09-15T08:40:26.745Z] [INFO] org.eclipse.tracecompass.tmf.ui.swtbot.tests 1.0.17-SNAPSHOT SKIPPED
04:40:26 [2021-09-15T08:40:26.745Z] [INFO] org.eclipse.tracecompass.analysis.graph.core 3.1.0-SNAPSHOT SKIPPED
04:40:26 [2021-09-15T08:40:26.745Z] [INFO] org.eclipse.tracecompass.tmf.chart.core 1.0.4-SNAPSHOT SKIPPED
04:40:26 [2021-09-15T08:40:26.745Z] [INFO] org.eclipse.tracecompass.analysis.lami.core 1.1.3-SNAPSHOT SKIPPED
04:40:26 [2021-09-15T08:40:26.745Z] [INFO] org.eclipse.tracecompass.analysis.timing.core 5.2.2-SNAPSHOT SKIPPED
04:40:26 [2021-09-15T08:40:26.745Z] [INFO] org.eclipse.tracecompass.analysis.os.linux.core 6.0.1-SNAPSHOT SKIPPED
04:40:26 [2021-09-15T08:40:26.745Z] [INFO] Trace Compass LTTng Support Parent 7.1.0-SNAPSHOT .. SKIPPED
04:40:26 [2021-09-15T08:40:26.745Z] [INFO] org.eclipse.tracecompass.lttng2.common.core 1.1.3-SNAPSHOT SKIPPED
04:40:26 [2021-09-15T08:40:26.745Z] [INFO] org.eclipse.tracecompass.tmf.analysis.xml.core 4.0.3-SNAPSHOT SKIPPED
04:40:26 [2021-09-15T08:40:26.745Z] [INFO] org.eclipse.tracecompass.lttng2.kernel.core 3.0.5-SNAPSHOT SKIPPED
04:40:26 [2021-09-15T08:40:26.745Z] [INFO] org.eclipse.tracecompass.analysis.counters.ui.swtbot.tests 1.0.2-SNAPSHOT SKIPPED
04:40:26 [2021-09-15T08:40:26.745Z] [INFO] org.eclipse.tracecompass.analysis.graph.core.tests 1.0.6-SNAPSHOT SKIPPED
04:40:26 [2021-09-15T08:40:26.745Z] [INFO] org.eclipse.tracecompass.analysis.graph.ui 1.0.11-SNAPSHOT SKIPPED
04:40:26 [2021-09-15T08:40:26.745Z] [INFO] org.eclipse.tracecompass.analysis.lami.core.tests 1.0.4-SNAPSHOT SKIPPED
04:40:26 [2021-09-15T08:40:26.745Z] [INFO] org.eclipse.tracecompass.tmf.chart.ui 1.0.11-SNAPSHOT SKIPPED
04:40:26 [2021-09-15T08:40:26.745Z] [INFO] org.eclipse.tracecompass.analysis.lami.ui 1.1.5-SNAPSHOT SKIPPED
04:40:26 [2021-09-15T08:40:26.745Z] [INFO] org.eclipse.tracecompass.tmf.chart.core.tests 1.0.3-SNAPSHOT SKIPPED
04:40:26 [2021-09-15T08:40:26.745Z] [INFO] org.eclipse.tracecompass.tmf.chart.ui.swtbot.tests 1.0.6-SNAPSHOT SKIPPED
04:40:26 [2021-09-15T08:40:26.745Z] [INFO] org.eclipse.tracecompass.analysis.lami.ui.swtbot.tests 1.0.6-SNAPSHOT SKIPPED
04:40:26 [2021-09-15T08:40:26.745Z] [INFO] org.eclipse.tracecompass.analysis.os.linux.core.tests 1.0.15-SNAPSHOT SKIPPED
04:40:26 [2021-09-15T08:40:26.745Z] [INFO] org.eclipse.tracecompass.analysis.timing.ui 5.0.1-SNAPSHOT SKIPPED
04:40:26 [2021-09-15T08:40:26.745Z] [INFO] org.eclipse.tracecompass.analysis.os.linux.ui 4.0.4-SNAPSHOT SKIPPED
04:40:26 [2021-09-15T08:40:26.745Z] [INFO] org.eclipse.tracecompass.analysis.os.linux.ui.tests 1.0.9-SNAPSHOT SKIPPED
04:40:26 [2021-09-15T08:40:26.745Z] [INFO] org.eclipse.tracecompass.analysis.timing.core.tests 1.0.6-SNAPSHOT SKIPPED
04:40:26 [2021-09-15T08:40:26.745Z] [INFO] org.eclipse.tracecompass.analysis.timing.ui.swtbot.tests 1.0.11-SNAPSHOT SKIPPED
04:40:26 [2021-09-15T08:40:26.745Z] [INFO] org.eclipse.tracecompass.analysis.os.linux.ui.swtbot.tests 1.0.16-SNAPSHOT SKIPPED
04:40:26 [2021-09-15T08:40:26.745Z] [INFO] org.eclipse.tracecompass.analysis.profiling.core 2.1.0-SNAPSHOT SKIPPED
04:40:26 [2021-09-15T08:40:26.745Z] [INFO] org.eclipse.tracecompass.analysis.profiling.core.tests 1.0.6-SNAPSHOT SKIPPED
04:40:26 [2021-09-15T08:40:26.745Z] [INFO] org.eclipse.tracecompass.analysis.profiling.ui 3.0.0-SNAPSHOT SKIPPED
04:40:26 [2021-09-15T08:40:26.745Z] [INFO] org.eclipse.tracecompass.analysis.profiling.ui.swtbot.tests 1.0.6-SNAPSHOT SKIPPED
04:40:26 [2021-09-15T08:40:26.745Z] [INFO] Trace Compass BTF Support Parent 7.1.0-SNAPSHOT .... SKIPPED
04:40:26 [2021-09-15T08:40:26.745Z] [INFO] org.eclipse.tracecompass.btf.core 3.0.0-SNAPSHOT ... SKIPPED
04:40:26 [2021-09-15T08:40:26.745Z] [INFO] Trace Compass Documentation 7.1.0-SNAPSHOT ......... SKIPPED
04:40:26 [2021-09-15T08:40:26.745Z] [INFO] Trace Compass Developer Guide 7.1.0-SNAPSHOT ....... SKIPPED
04:40:26 [2021-09-15T08:40:26.745Z] [INFO] org.eclipse.tracecompass.tmf.analysis.xml.ui 2.1.15-SNAPSHOT SKIPPED
04:40:26 [2021-09-15T08:40:26.745Z] [INFO] org.eclipse.tracecompass.tmf 7.1.0-SNAPSHOT ........ SKIPPED
04:40:26 [2021-09-15T08:40:26.745Z] [INFO] org.eclipse.tracecompass.btf.ui 1.0.4-SNAPSHOT ..... SKIPPED
04:40:26 [2021-09-15T08:40:26.745Z] [INFO] org.eclipse.tracecompass.btf 7.1.0-SNAPSHOT ........ SKIPPED
04:40:26 [2021-09-15T08:40:26.745Z] [INFO] org.eclipse.tracecompass.btf.core.tests 1.0.3-SNAPSHOT SKIPPED
04:40:26 [2021-09-15T08:40:26.745Z] [INFO] org.eclipse.tracecompass.common.core.tests 1.1.9-SNAPSHOT SKIPPED
04:40:26 [2021-09-15T08:40:26.745Z] [INFO] org.eclipse.tracecompass.ctf 7.1.0-SNAPSHOT ........ SKIPPED
04:40:26 [2021-09-15T08:40:26.745Z] [INFO] org.eclipse.tracecompass.ctf.parser.tests 1.0.3-SNAPSHOT SKIPPED
04:40:26 [2021-09-15T08:40:26.745Z] [INFO] org.eclipse.tracecompass.tmf.ctf 7.1.0-SNAPSHOT .... SKIPPED
04:40:26 [2021-09-15T08:40:26.745Z] [INFO] org.eclipse.tracecompass.tmf.ctf.ui.swtbot.tests 1.0.11-SNAPSHOT SKIPPED
04:40:26 [2021-09-15T08:40:26.745Z] [INFO] Trace Compass User Guide 7.1.0-SNAPSHOT ............ SKIPPED
04:40:26 [2021-09-15T08:40:26.745Z] [INFO] Trace Compass GDB Tracepoint Analysis User Guide 7.1.0-SNAPSHOT SKIPPED
04:40:26 [2021-09-15T08:40:26.745Z] [INFO] Trace Compass RCP User Guide 7.1.0-SNAPSHOT ........ SKIPPED
04:40:26 [2021-09-15T08:40:26.745Z] [INFO] Trace Compass Pcap User Guide 7.1.0-SNAPSHOT ....... SKIPPED
04:40:26 [2021-09-15T08:40:26.745Z] [INFO] org.eclipse.tracecompass.examples 1.0.8-SNAPSHOT ... SKIPPED
04:40:26 [2021-09-15T08:40:26.745Z] [INFO] Trace Compass GDB Tracepoint Analysis Parent 7.1.0-SNAPSHOT SKIPPED
04:40:26 [2021-09-15T08:40:26.745Z] [INFO] org.eclipse.tracecompass.gdbtrace.core 1.0.7-SNAPSHOT SKIPPED
04:40:26 [2021-09-15T08:40:26.745Z] [INFO] org.eclipse.tracecompass.gdbtrace.ui 1.1.4-SNAPSHOT  SKIPPED
04:40:26 [2021-09-15T08:40:26.745Z] [INFO] org.eclipse.tracecompass.gdbtrace 7.1.0-SNAPSHOT ... SKIPPED
04:40:26 [2021-09-15T08:40:26.745Z] [INFO] org.eclipse.tracecompass.gdbtrace.core.tests 1.0.2-SNAPSHOT SKIPPED
04:40:26 [2021-09-15T08:40:26.745Z] [INFO] org.eclipse.tracecompass.gdbtrace.ui.tests 1.0.2-SNAPSHOT SKIPPED
04:40:26 [2021-09-15T08:40:26.745Z] [INFO] org.eclipse.tracecompass.lttng2.common.core.tests 1.0.2-SNAPSHOT SKIPPED
04:40:26 [2021-09-15T08:40:26.745Z] [INFO] org.eclipse.tracecompass.lttng2.control.core 1.2.5-SNAPSHOT SKIPPED
04:40:26 [2021-09-15T08:40:26.745Z] [INFO] org.eclipse.tracecompass.tmf.remote.core 2.0.5-SNAPSHOT SKIPPED
04:40:26 [2021-09-15T08:40:26.745Z] [INFO] org.eclipse.tracecompass.tmf.remote.ui 1.0.9-SNAPSHOT SKIPPED
04:40:26 [2021-09-15T08:40:26.745Z] [INFO] org.eclipse.tracecompass.lttng2.control.ui 1.2.13-SNAPSHOT SKIPPED
04:40:26 [2021-09-15T08:40:26.745Z] [INFO] org.eclipse.tracecompass.lttng2.control 7.1.0-SNAPSHOT SKIPPED
04:40:26 [2021-09-15T08:40:26.745Z] [INFO] org.eclipse.tracecompass.lttng2.control.core.tests 1.1.3-SNAPSHOT SKIPPED
04:40:26 [2021-09-15T08:40:26.745Z] [INFO] org.eclipse.tracecompass.tmf.remote.core.tests 1.0.2-SNAPSHOT SKIPPED
04:40:26 [2021-09-15T08:40:26.745Z] [INFO] org.eclipse.tracecompass.lttng2.control.ui.tests 2.0.5-SNAPSHOT SKIPPED
04:40:26 [2021-09-15T08:40:26.745Z] [INFO] org.eclipse.tracecompass.lttng2.control.ui.swtbot.tests 1.0.8-SNAPSHOT SKIPPED
04:40:26 [2021-09-15T08:40:26.745Z] [INFO] org.eclipse.tracecompass.lttng2.kernel.ui 2.0.2-SNAPSHOT SKIPPED
04:40:26 [2021-09-15T08:40:26.745Z] [INFO] org.eclipse.tracecompass.lttng2.kernel 7.1.0-SNAPSHOT SKIPPED
04:40:26 [2021-09-15T08:40:26.745Z] [INFO] org.eclipse.tracecompass.tmf.analysis.xml.core.tests 1.0.13-SNAPSHOT SKIPPED
04:40:26 [2021-09-15T08:40:26.745Z] [INFO] org.eclipse.tracecompass.lttng2.kernel.core.tests 2.0.3-SNAPSHOT SKIPPED
04:40:26 [2021-09-15T08:40:26.745Z] [INFO] org.eclipse.tracecompass.lttng2.kernel.ui.swtbot.tests 1.0.17-SNAPSHOT SKIPPED
04:40:26 [2021-09-15T08:40:26.745Z] [INFO] org.eclipse.tracecompass.lttng2.ust.core 5.0.3-SNAPSHOT SKIPPED
04:40:26 [2021-09-15T08:40:26.745Z] [INFO] org.eclipse.tracecompass.lttng2.ust.ui 3.0.10-SNAPSHOT SKIPPED
04:40:26 [2021-09-15T08:40:26.745Z] [INFO] org.eclipse.tracecompass.lttng2.ust 7.1.0-SNAPSHOT . SKIPPED
04:40:26 [2021-09-15T08:40:26.745Z] [INFO] org.eclipse.tracecompass.lttng2.ust.core.tests 1.0.12-SNAPSHOT SKIPPED
04:40:26 [2021-09-15T08:40:26.745Z] [INFO] org.eclipse.tracecompass.lttng2.ust.ui.tests 1.0.2-SNAPSHOT SKIPPED
04:40:26 [2021-09-15T08:40:26.746Z] [INFO] org.eclipse.tracecompass.lttng2.ust.ui.swtbot.tests 1.0.15-SNAPSHOT SKIPPED
04:40:26 [2021-09-15T08:40:26.746Z] [INFO] Trace Compass Pcap Format Support Parent 7.1.0-SNAPSHOT SKIPPED
04:40:26 [2021-09-15T08:40:26.746Z] [INFO] org.eclipse.tracecompass.pcap.core 1.1.3-SNAPSHOT .. SKIPPED
04:40:26 [2021-09-15T08:40:26.746Z] [INFO] Trace Compass Pcap Parser Core Tests Plug-in 1.0.5-SNAPSHOT SKIPPED
04:40:26 [2021-09-15T08:40:26.746Z] [INFO] org.eclipse.tracecompass.tmf.pcap.core 1.0.5-SNAPSHOT SKIPPED
04:40:26 [2021-09-15T08:40:26.746Z] [INFO] org.eclipse.tracecompass.tmf.pcap.ui 1.1.4-SNAPSHOT  SKIPPED
04:40:26 [2021-09-15T08:40:26.746Z] [INFO] org.eclipse.tracecompass.tmf.pcap 7.1.0-SNAPSHOT ... SKIPPED
04:40:26 [2021-09-15T08:40:26.746Z] [INFO] org.eclipse.tracecompass.tmf.pcap.core.tests 1.0.3-SNAPSHOT SKIPPED
04:40:26 [2021-09-15T08:40:26.746Z] [INFO] org.eclipse.tracecompass.tmf.pcap.ui.swtbot.tests 1.0.2-SNAPSHOT SKIPPED
04:40:26 [2021-09-15T08:40:26.746Z] [INFO] Trace Compass RCP Parent 7.1.0-SNAPSHOT ............ SKIPPED
04:40:26 [2021-09-15T08:40:26.746Z] [INFO] Trace Compass RCP Branding plug-in 7.1.0-SNAPSHOT .. SKIPPED
04:40:26 [2021-09-15T08:40:26.746Z] [INFO] Trace Compass RCP Branding Feature 7.1.0-SNAPSHOT .. SKIPPED
04:40:26 [2021-09-15T08:40:26.746Z] [INFO] org.eclipse.tracecompass.tmf.cli.core 1.0.2-SNAPSHOT SKIPPED
04:40:26 [2021-09-15T08:40:26.746Z] [INFO] org.eclipse.tracecompass.rcp.ui 7.1.0-SNAPSHOT ..... SKIPPED
04:40:26 [2021-09-15T08:40:26.746Z] [INFO] Trace Compass RCP Feature 7.1.0-SNAPSHOT ........... SKIPPED
04:40:26 [2021-09-15T08:40:26.746Z] [INFO] org.eclipse.tracecompass.tmf.cli.core.tests 1.0.2-SNAPSHOT SKIPPED
04:40:26 [2021-09-15T08:40:26.746Z] [INFO] org.eclipse.tracecompass.rcp.ui.tests 2.0.4-SNAPSHOT SKIPPED
04:40:26 [2021-09-15T08:40:26.746Z] [INFO] org.eclipse.tracecompass.rcp.incubator.ui 1.0.2-SNAPSHOT SKIPPED
04:40:26 [2021-09-15T08:40:26.746Z] [INFO] org.eclipse.tracecompass.rcp.incubator 7.1.0-SNAPSHOT SKIPPED
04:40:26 [2021-09-15T08:40:26.746Z] [INFO] Trace Compass Json trace Parent 7.1.0-SNAPSHOT ..... SKIPPED
04:40:26 [2021-09-15T08:40:26.746Z] [INFO] org.eclipse.tracecompass.jsontrace.core 1.0.3-SNAPSHOT SKIPPED
04:40:26 [2021-09-15T08:40:26.746Z] [INFO] org.eclipse.tracecompass.jsontrace 7.1.0-SNAPSHOT .. SKIPPED
04:40:26 [2021-09-15T08:40:26.746Z] [INFO] org.eclipse.tracecompass.tmf.cli 7.1.0-SNAPSHOT .... SKIPPED
04:40:26 [2021-09-15T08:40:26.746Z] [INFO] Trace Compass RCP Product 7.1.0-SNAPSHOT ........... SKIPPED
04:40:26 [2021-09-15T08:40:26.746Z] [INFO] Trace Compass Release Engineering Parent 7.1.0-SNAPSHOT SKIPPED
04:40:26 [2021-09-15T08:40:26.746Z] [INFO] Trace Compass Target Platform 7.1.0-SNAPSHOT ....... SKIPPED
04:40:26 [2021-09-15T08:40:26.746Z] [INFO] org.eclipse.tracecompass.integration.swtbot.tests 1.0.12-SNAPSHOT SKIPPED
04:40:26 [2021-09-15T08:40:26.746Z] [INFO] org.eclipse.tracecompass.datastore.core.tests 1.0.6-SNAPSHOT SKIPPED
04:40:26 [2021-09-15T08:40:26.746Z] [INFO] org.eclipse.tracecompass.segmentstore.core.tests 1.0.6-SNAPSHOT SKIPPED
04:40:26 [2021-09-15T08:40:26.746Z] [INFO] org.eclipse.tracecompass.tmf.analysis.xml.ui.swtbot.tests 1.0.13-SNAPSHOT SKIPPED
04:40:26 [2021-09-15T08:40:26.746Z] [INFO] org.eclipse.tracecompass.tmf.analysis.xml.ui.tests 1.0.4-SNAPSHOT SKIPPED
04:40:26 [2021-09-15T08:40:26.746Z] [INFO] org.eclipse.tracecompass.tmf.chart.ui.tests 1.0.2-SNAPSHOT SKIPPED
04:40:26 [2021-09-15T08:40:26.746Z] [INFO] org.eclipse.tracecompass.tmf.remote.ui.swtbot.tests 1.0.9-SNAPSHOT SKIPPED
04:40:26 [2021-09-15T08:40:26.746Z] [INFO] org.eclipse.tracecompass.tmf.remote.ui.tests 1.0.2-SNAPSHOT SKIPPED
04:40:26 [2021-09-15T08:40:26.746Z] [INFO] Trace Compass All Tests 1.0.11-SNAPSHOT ............ SKIPPED
04:40:26 [2021-09-15T08:40:26.746Z] [INFO] org.eclipse.tracecompass.testing 7.1.0-SNAPSHOT .... SKIPPED
04:40:26 [2021-09-15T08:40:26.746Z] [INFO] org.eclipse.tracecompass.tmf.remote 7.1.0-SNAPSHOT . SKIPPED
04:40:26 [2021-09-15T08:40:26.746Z] [INFO] Trace Compass Repository 7.1.0-SNAPSHOT ............ SKIPPED
04:40:26 [2021-09-15T08:40:26.746Z] [INFO] org.eclipse.tracecompass.jsontrace.core.tests 1.0.3-SNAPSHOT SKIPPED
04:40:26 [2021-09-15T08:40:26.746Z] [INFO] ------------------------------------------------------------------------
04:40:26 [2021-09-15T08:40:26.746Z] [INFO] BUILD FAILURE
04:40:26 [2021-09-15T08:40:26.746Z] [INFO] ------------------------------------------------------------------------
04:40:26 [2021-09-15T08:40:26.746Z] [INFO] Total time:  26:19 min
04:40:26 [2021-09-15T08:40:26.746Z] [INFO] Finished at: 2021-09-15T08:40:26Z
04:40:26 [2021-09-15T08:40:26.746Z] [INFO] ------------------------------------------------------------------------
04:40:26 [2021-09-15T08:40:26.746Z] [ERROR] Failed to execute goal org.eclipse.tycho:tycho-surefire-plugin:2.3.0:test (default-test) on project org.eclipse.tracecompass.tmf.ui.tests: There are test failures.
04:40:26 [2021-09-15T08:40:26.746Z] [ERROR] 
04:40:26 [2021-09-15T08:40:26.746Z] [ERROR] Please refer to /home/jenkins/agent/workspace/tracecompass-stable-release-nightly-new/tmf/org.eclipse.tracecompass.tmf.ui.tests/target/surefire-reports for the individual test results.
04:40:26 [2021-09-15T08:40:26.746Z] [ERROR] -> [Help 1]
04:40:26 [2021-09-15T08:40:26.746Z] [ERROR] 
04:40:26 [2021-09-15T08:40:26.746Z] [ERROR] To see the full stack trace of the errors, re-run Maven with the -e switch.
04:40:26 [2021-09-15T08:40:26.746Z] [ERROR] Re-run Maven using the -X switch to enable full debug logging.
04:40:26 [2021-09-15T08:40:26.746Z] [ERROR] 
04:40:26 [2021-09-15T08:40:26.746Z] [ERROR] For more information about the errors and possible solutions, please read the following articles:
04:40:26 [2021-09-15T08:40:26.746Z] [ERROR] [Help 1] http://cwiki.apache.org/confluence/display/MAVEN/MojoFailureException
04:40:26 [2021-09-15T08:40:26.746Z] [ERROR] 
04:40:26 [2021-09-15T08:40:26.746Z] [ERROR] After correcting the problems, you can resume the build with the command
04:40:26 [2021-09-15T08:40:26.746Z] [ERROR]   mvn <args> -rf :org.eclipse.tracecompass.tmf.ui.tests
04:40:27 [2021-09-15T08:40:27.683Z] [Pipeline] }
04:40:27 [2021-09-15T08:40:27.690Z] [Pipeline] // container
04:40:27 [2021-09-15T08:40:27.696Z] Post stage
04:40:27 [2021-09-15T08:40:27.699Z] [Pipeline] container
04:40:27 [2021-09-15T08:40:27.700Z] [Pipeline] {
04:40:27 [2021-09-15T08:40:27.706Z] [Pipeline] sh
04:40:28 [2021-09-15T08:40:28.231Z] + echo */*tests/screenshots/*.jpeg,*/*tests/target/work/data/.metadata/.log
04:40:28 [2021-09-15T08:40:28.232Z] */*tests/screenshots/*.jpeg,*/*tests/target/work/data/.metadata/.log
04:40:28 [2021-09-15T08:40:28.238Z] [Pipeline] junit
04:40:28 [2021-09-15T08:40:28.241Z] Recording test results
04:40:35 [2021-09-15T08:40:35.690Z] [Checks API] No suitable checks publisher found.
04:40:35 [2021-09-15T08:40:35.692Z] [Pipeline] archiveArtifacts
04:40:35 [2021-09-15T08:40:35.766Z] Archiving artifacts
04:40:35 [2021-09-15T08:40:35.779Z] [Pipeline] }
04:40:35 [2021-09-15T08:40:35.927Z] [Pipeline] // container
04:40:35 [2021-09-15T08:40:35.936Z] [Pipeline] }
04:40:35 [2021-09-15T08:40:35.941Z] [Pipeline] // withEnv
04:40:35 [2021-09-15T08:40:35.946Z] [Pipeline] }
04:40:35 [2021-09-15T08:40:35.951Z] [Pipeline] // stage
04:40:35 [2021-09-15T08:40:35.958Z] [Pipeline] stage
04:40:35 [2021-09-15T08:40:35.958Z] [Pipeline] { (Deploy Site)
04:40:35 [2021-09-15T08:40:35.965Z] Stage "Deploy Site" skipped due to earlier failure(s)
04:40:35 [2021-09-15T08:40:35.965Z] [Pipeline] }
04:40:35 [2021-09-15T08:40:35.970Z] [Pipeline] // stage
04:40:35 [2021-09-15T08:40:35.977Z] [Pipeline] stage
04:40:35 [2021-09-15T08:40:35.977Z] [Pipeline] { (Deploy RCP)
04:40:35 [2021-09-15T08:40:35.984Z] Stage "Deploy RCP" skipped due to earlier failure(s)
04:40:35 [2021-09-15T08:40:35.984Z] [Pipeline] }
04:40:35 [2021-09-15T08:40:35.992Z] [Pipeline] // stage
04:40:35 [2021-09-15T08:40:35.999Z] [Pipeline] stage
04:40:35 [2021-09-15T08:40:35.999Z] [Pipeline] { (Deploy Doc)
04:40:36 [2021-09-15T08:40:36.005Z] Stage "Deploy Doc" skipped due to earlier failure(s)
04:40:36 [2021-09-15T08:40:36.005Z] [Pipeline] }
04:40:36 [2021-09-15T08:40:36.010Z] [Pipeline] // stage
04:40:36 [2021-09-15T08:40:36.017Z] [Pipeline] stage
04:40:36 [2021-09-15T08:40:36.018Z] [Pipeline] { (Declarative: Post Actions)
04:40:36 [2021-09-15T08:40:36.031Z] [Pipeline] container
04:40:36 [2021-09-15T08:40:36.032Z] [Pipeline] {
04:40:36 [2021-09-15T08:40:36.310Z] [Pipeline] emailext
04:40:36 [2021-09-15T08:40:36.614Z] Sending email to: bernd.hufmann@ericsson.com patrick.tasse@gmail.com matthew.khouzam@ericsson.com
04:40:36 [2021-09-15T08:40:36.745Z] [Pipeline] }
04:40:36 [2021-09-15T08:40:36.966Z] [Pipeline] // container
04:40:36 [2021-09-15T08:40:36.971Z] [Pipeline] }
04:40:36 [2021-09-15T08:40:36.976Z] [Pipeline] // stage
04:40:36 [2021-09-15T08:40:36.981Z] [Pipeline] }
04:40:36 [2021-09-15T08:40:36.986Z] [Pipeline] // withEnv
04:40:36 [2021-09-15T08:40:36.991Z] [Pipeline] }
04:40:36 [2021-09-15T08:40:36.996Z] [Pipeline] // timeout
04:40:37 [2021-09-15T08:40:37.001Z] [Pipeline] }
04:40:37 [2021-09-15T08:40:37.006Z] [Pipeline] // timestamps
04:40:37 [2021-09-15T08:40:37.011Z] [Pipeline] }
04:40:37 [2021-09-15T08:40:37.016Z] [Pipeline] // withEnv
04:40:37 [2021-09-15T08:40:37.021Z] [Pipeline] }
04:40:37 [2021-09-15T08:40:37.026Z] [Pipeline] // withEnv
04:40:37 [2021-09-15T08:40:37.032Z] [Pipeline] }
04:40:37 [2021-09-15T08:40:37.037Z] [Pipeline] // node
04:40:37 [2021-09-15T08:40:37.043Z] [Pipeline] }
04:40:37 [2021-09-15T08:40:37.048Z] [Pipeline] // podTemplate
04:40:37 [2021-09-15T08:40:37.054Z] [Pipeline] End of Pipeline
04:40:37 [2021-09-15T08:40:37.092Z] ERROR: script returned exit code 1
04:40:37 [2021-09-15T08:40:37.105Z] Finished: FAILURE