Console Output

Skipping 14,230 KB.. Full Log
05:10:00 [2021-09-12T09:10:00.263Z] DEBUG - matched Button with text "&No", using matcher: of type 'Button'
05:10:00 [2021-09-12T09:10:00.263Z] DEBUG - matched Button with text "&Yes", using matcher: of type 'Button'
05:10:00 [2021-09-12T09:10:00.263Z] DEBUG - matched Button with text "&Yes", using matcher: with mnemonic 'Yes'
05:10:00 [2021-09-12T09:10:00.263Z] DEBUG - matched Button with text "&Yes", using matcher: with style 'SWT.PUSH'
05:10:00 [2021-09-12T09:10:00.263Z] DEBUG - matched Button with text "&Yes", using matcher: (of type 'Button' and with mnemonic 'Yes' and with style 'SWT.PUSH')
05:10:00 [2021-09-12T09:10:00.263Z] DEBUG - Clicking on &Yes
05:10:00 [2021-09-12T09:10:00.263Z] DEBUG - Sent event MouseEnter [6]: MouseEvent{Button {&Yes} time=-649772297 data=null button=0 stateMask=0x0 x=0 y=0 count=0} to (of type 'Button' and with mnemonic 'Yes' and with style 'SWT.PUSH')
05:10:00 [2021-09-12T09:10:00.263Z] DEBUG - Sent event MouseMove [5]: MouseEvent{Button {&Yes} time=-649772297 data=null button=0 stateMask=0x0 x=0 y=0 count=0} to (of type 'Button' and with mnemonic 'Yes' and with style 'SWT.PUSH')
05:10:00 [2021-09-12T09:10:00.263Z] DEBUG - Sent event Activate [26]: ShellEvent{Button {&Yes} time=-649772297 data=null doit=true} to (of type 'Button' and with mnemonic 'Yes' and with style 'SWT.PUSH')
05:10:00 [2021-09-12T09:10:00.263Z] DEBUG - Sent event FocusIn [15]: FocusEvent{Button {&Yes} time=-649772297 data=null} to (of type 'Button' and with mnemonic 'Yes' and with style 'SWT.PUSH')
05:10:00 [2021-09-12T09:10:00.264Z] DEBUG - Sent event MouseDown [3]: MouseEvent{Button {&Yes} time=-649772297 data=null button=0 stateMask=0x0 x=0 y=0 count=0} to (of type 'Button' and with mnemonic 'Yes' and with style 'SWT.PUSH')
05:10:00 [2021-09-12T09:10:00.264Z] DEBUG - Sent event MouseUp [4]: MouseEvent{Button {&Yes} time=-649772297 data=null button=0 stateMask=0x0 x=0 y=0 count=0} to (of type 'Button' and with mnemonic 'Yes' and with style 'SWT.PUSH')
05:10:00 [2021-09-12T09:10:00.264Z] DEBUG - Sent event Selection [13]: SelectionEvent{Button {&Yes} time=-649772297 data=null item=null detail=0 x=0 y=0 width=0 height=0 stateMask=0x0 text=null doit=true} to (of type 'Button' and with mnemonic 'Yes' and with style 'SWT.PUSH')
05:10:00 [2021-09-12T09:10:00.264Z] DEBUG - Sent event Selection [13]: SelectionEvent{Button {Delete} time=-649772336 data=null item=null detail=0 x=0 y=0 width=0 height=0 stateMask=0x0 text=null doit=true} to (of type 'Button' and with mnemonic 'Delete' and with style 'SWT.PUSH')
05:10:00 [2021-09-12T09:10:00.264Z] DEBUG - Clicked on 
05:10:00 [2021-09-12T09:10:00.264Z] DEBUG - matched Button with text "Import", using matcher: of type 'Button'
05:10:00 [2021-09-12T09:10:00.264Z] DEBUG - matched Button with text "Export", using matcher: of type 'Button'
05:10:00 [2021-09-12T09:10:00.264Z] DEBUG - matched Button with text "Edit...", using matcher: of type 'Button'
05:10:00 [2021-09-12T09:10:00.264Z] DEBUG - matched Button with text "Delete", using matcher: of type 'Button'
05:10:00 [2021-09-12T09:10:00.264Z] DEBUG - matched Button with text "Check selected", using matcher: of type 'Button'
05:10:00 [2021-09-12T09:10:00.264Z] DEBUG - matched Button with text "Check all", using matcher: of type 'Button'
05:10:00 [2021-09-12T09:10:00.264Z] DEBUG - matched Button with text "Uncheck selected", using matcher: of type 'Button'
05:10:00 [2021-09-12T09:10:00.264Z] DEBUG - matched Button with text "Uncheck all", using matcher: of type 'Button'
05:10:00 [2021-09-12T09:10:00.264Z] DEBUG - matched Button with text "Restore &Defaults", using matcher: of type 'Button'
05:10:00 [2021-09-12T09:10:00.264Z] DEBUG - matched Button with text "&Apply", using matcher: of type 'Button'
05:10:00 [2021-09-12T09:10:00.264Z] DEBUG - matched Button with text "Cancel", using matcher: of type 'Button'
05:10:00 [2021-09-12T09:10:00.264Z] DEBUG - matched Button with text "Apply and Close", using matcher: of type 'Button'
05:10:00 [2021-09-12T09:10:00.264Z] DEBUG - matched Button with text "Apply and Close", using matcher: with mnemonic 'Apply and Close'
05:10:00 [2021-09-12T09:10:00.264Z] DEBUG - matched Button with text "Apply and Close", using matcher: (with mnemonic 'Apply and Close' or with mnemonic 'OK')
05:10:00 [2021-09-12T09:10:00.264Z] DEBUG - matched Button with text "Apply and Close", using matcher: with style 'SWT.PUSH'
05:10:00 [2021-09-12T09:10:00.264Z] DEBUG - matched Button with text "Apply and Close", using matcher: (of type 'Button' and (with mnemonic 'Apply and Close' or with mnemonic 'OK') and with style 'SWT.PUSH')
05:10:00 [2021-09-12T09:10:00.264Z] DEBUG - Clicking on Apply and Close
05:10:00 [2021-09-12T09:10:00.264Z] DEBUG - Sent event MouseEnter [6]: MouseEvent{Button {Apply and Close} time=-649772227 data=null button=0 stateMask=0x0 x=0 y=0 count=0} to (of type 'Button' and (with mnemonic 'Apply and Close' or with mnemonic 'OK') and with style 'SWT.PUSH')
05:10:00 [2021-09-12T09:10:00.264Z] DEBUG - Sent event MouseMove [5]: MouseEvent{Button {Apply and Close} time=-649772227 data=null button=0 stateMask=0x0 x=0 y=0 count=0} to (of type 'Button' and (with mnemonic 'Apply and Close' or with mnemonic 'OK') and with style 'SWT.PUSH')
05:10:00 [2021-09-12T09:10:00.264Z] DEBUG - Sent event Activate [26]: ShellEvent{Button {Apply and Close} time=-649772226 data=null doit=true} to (of type 'Button' and (with mnemonic 'Apply and Close' or with mnemonic 'OK') and with style 'SWT.PUSH')
05:10:00 [2021-09-12T09:10:00.264Z] DEBUG - Sent event FocusIn [15]: FocusEvent{Button {Apply and Close} time=-649772226 data=null} to (of type 'Button' and (with mnemonic 'Apply and Close' or with mnemonic 'OK') and with style 'SWT.PUSH')
05:10:00 [2021-09-12T09:10:00.264Z] DEBUG - Sent event MouseDown [3]: MouseEvent{Button {Apply and Close} time=-649772226 data=null button=0 stateMask=0x0 x=0 y=0 count=0} to (of type 'Button' and (with mnemonic 'Apply and Close' or with mnemonic 'OK') and with style 'SWT.PUSH')
05:10:00 [2021-09-12T09:10:00.264Z] DEBUG - Sent event MouseUp [4]: MouseEvent{Button {Apply and Close} time=-649772226 data=null button=0 stateMask=0x0 x=0 y=0 count=0} to (of type 'Button' and (with mnemonic 'Apply and Close' or with mnemonic 'OK') and with style 'SWT.PUSH')
05:10:00 [2021-09-12T09:10:00.520Z] DEBUG - Sent event Selection [13]: SelectionEvent{Button {Apply and Close} time=-649772226 data=null item=null detail=0 x=0 y=0 width=0 height=0 stateMask=0x0 text=null doit=true} to (of type 'Button' and (with mnemonic 'Apply and Close' or with mnemonic 'OK') and with style 'SWT.PUSH')
05:10:00 [2021-09-12T09:10:00.520Z] DEBUG - Sent event Selection [13]: SelectionEvent{MenuItem {&Preferences} time=-649772640 data=null item=null detail=0 x=0 y=0 width=0 height=0 stateMask=0x0 text=null doit=true} to with mnemonic 'Preferences'
05:10:00 [2021-09-12T09:10:00.520Z] DEBUG - Clicked on 
05:10:00 [2021-09-12T09:10:00.520Z] Tests run: 9, Failures: 0, Errors: 0, Skipped: 0, Time elapsed: 12.299 s - in org.eclipse.tracecompass.tmf.analysis.xml.ui.swtbot.tests.preferences.XMLAnalysesManagerPreferencePageTest
05:10:00 [2021-09-12T09:10:00.520Z] testPreferencePageMenuBar  Time elapsed: 1.093 s
05:10:00 [2021-09-12T09:10:00.520Z] testImportInvalid  Time elapsed: 0.802 s
05:10:00 [2021-09-12T09:10:00.520Z] testPreferencePageContextMenu  Time elapsed: 2.619 s
05:10:00 [2021-09-12T09:10:00.520Z] testEdit  Time elapsed: 2.255 s
05:10:00 [2021-09-12T09:10:00.520Z] testImportValid  Time elapsed: 1.015 s
05:10:00 [2021-09-12T09:10:00.520Z] testCheckButtons  Time elapsed: 1.28 s
05:10:00 [2021-09-12T09:10:00.520Z] testDelete  Time elapsed: 1.394 s
05:10:00 [2021-09-12T09:10:00.520Z] testExport  Time elapsed: 0.902 s
05:10:00 [2021-09-12T09:10:00.520Z] testInvalidLabel  Time elapsed: 0.835 s
05:10:00 [2021-09-12T09:10:00.520Z] Running org.eclipse.tracecompass.tmf.analysis.xml.ui.swtbot.tests.timegraph.XmlTimegraphViewTest
05:10:05 [2021-09-12T09:10:05.771Z] Tests run: 1, Failures: 0, Errors: 0, Skipped: 0, Time elapsed: 5.268 s - in org.eclipse.tracecompass.tmf.analysis.xml.ui.swtbot.tests.timegraph.XmlTimegraphViewTest
05:10:05 [2021-09-12T09:10:05.771Z] testData  Time elapsed: 5.268 s
05:10:05 [2021-09-12T09:10:05.771Z] 
05:10:05 [2021-09-12T09:10:05.771Z] Results:
05:10:05 [2021-09-12T09:10:05.771Z] 
05:10:05 [2021-09-12T09:10:05.771Z] Tests run: 13, Failures: 0, Errors: 0, Skipped: 0
05:10:05 [2021-09-12T09:10:05.771Z] 
05:10:06 [2021-09-12T09:10:06.028Z] 
05:10:06 [2021-09-12T09:10:06.028Z] !ENTRY org.eclipse.core.resources 2 10035 2021-09-12 09:10:05.770
05:10:06 [2021-09-12T09:10:06.028Z] !MESSAGE The workspace will exit with unsaved changes in this session.
05:10:06 [2021-09-12T09:10:06.284Z] [INFO] All tests passed!
05:10:06 [2021-09-12T09:10:06.284Z] [INFO] 
05:10:06 [2021-09-12T09:10:06.284Z] [INFO] --- maven-install-plugin:2.5.2:install (default-install) @ org.eclipse.tracecompass.tmf.analysis.xml.ui.swtbot.tests ---
05:10:06 [2021-09-12T09:10:06.284Z] [INFO] Installing /home/jenkins/agent/workspace/tracecompass-stable-release-nightly-new/tmf/org.eclipse.tracecompass.tmf.analysis.xml.ui.swtbot.tests/target/org.eclipse.tracecompass.tmf.analysis.xml.ui.swtbot.tests-1.0.13-SNAPSHOT.jar to /home/jenkins/.m2/repository/org/eclipse/tracecompass/org.eclipse.tracecompass.tmf.analysis.xml.ui.swtbot.tests/1.0.13-SNAPSHOT/org.eclipse.tracecompass.tmf.analysis.xml.ui.swtbot.tests-1.0.13-SNAPSHOT.jar
05:10:06 [2021-09-12T09:10:06.284Z] [INFO] Installing /home/jenkins/agent/workspace/tracecompass-stable-release-nightly-new/tmf/org.eclipse.tracecompass.tmf.analysis.xml.ui.swtbot.tests/pom.xml to /home/jenkins/.m2/repository/org/eclipse/tracecompass/org.eclipse.tracecompass.tmf.analysis.xml.ui.swtbot.tests/1.0.13-SNAPSHOT/org.eclipse.tracecompass.tmf.analysis.xml.ui.swtbot.tests-1.0.13-SNAPSHOT.pom
05:10:06 [2021-09-12T09:10:06.284Z] [INFO] Installing /home/jenkins/agent/workspace/tracecompass-stable-release-nightly-new/tmf/org.eclipse.tracecompass.tmf.analysis.xml.ui.swtbot.tests/target/org.eclipse.tracecompass.tmf.analysis.xml.ui.swtbot.tests-1.0.13-SNAPSHOT-sources.jar to /home/jenkins/.m2/repository/org/eclipse/tracecompass/org.eclipse.tracecompass.tmf.analysis.xml.ui.swtbot.tests/1.0.13-SNAPSHOT/org.eclipse.tracecompass.tmf.analysis.xml.ui.swtbot.tests-1.0.13-SNAPSHOT-sources.jar
05:10:06 [2021-09-12T09:10:06.284Z] [INFO] Installing /home/jenkins/agent/workspace/tracecompass-stable-release-nightly-new/tmf/org.eclipse.tracecompass.tmf.analysis.xml.ui.swtbot.tests/target/org.eclipse.tracecompass.tmf.analysis.xml.ui.swtbot.tests-1.0.13-SNAPSHOT.jar.pack.gz to /home/jenkins/.m2/repository/org/eclipse/tracecompass/org.eclipse.tracecompass.tmf.analysis.xml.ui.swtbot.tests/1.0.13-SNAPSHOT/org.eclipse.tracecompass.tmf.analysis.xml.ui.swtbot.tests-1.0.13-SNAPSHOT-pack200.jar.pack.gz
05:10:06 [2021-09-12T09:10:06.284Z] [INFO] Installing /home/jenkins/agent/workspace/tracecompass-stable-release-nightly-new/tmf/org.eclipse.tracecompass.tmf.analysis.xml.ui.swtbot.tests/target/p2content.xml to /home/jenkins/.m2/repository/org/eclipse/tracecompass/org.eclipse.tracecompass.tmf.analysis.xml.ui.swtbot.tests/1.0.13-SNAPSHOT/org.eclipse.tracecompass.tmf.analysis.xml.ui.swtbot.tests-1.0.13-SNAPSHOT-p2metadata.xml
05:10:06 [2021-09-12T09:10:06.285Z] [INFO] Installing /home/jenkins/agent/workspace/tracecompass-stable-release-nightly-new/tmf/org.eclipse.tracecompass.tmf.analysis.xml.ui.swtbot.tests/target/p2artifacts.xml to /home/jenkins/.m2/repository/org/eclipse/tracecompass/org.eclipse.tracecompass.tmf.analysis.xml.ui.swtbot.tests/1.0.13-SNAPSHOT/org.eclipse.tracecompass.tmf.analysis.xml.ui.swtbot.tests-1.0.13-SNAPSHOT-p2artifacts.xml
05:10:06 [2021-09-12T09:10:06.285Z] [INFO] 
05:10:06 [2021-09-12T09:10:06.285Z] [INFO] --- tycho-p2-plugin:2.3.0:update-local-index (default-update-local-index) @ org.eclipse.tracecompass.tmf.analysis.xml.ui.swtbot.tests ---
05:10:06 [2021-09-12T09:10:06.285Z] [INFO] 
05:10:06 [2021-09-12T09:10:06.285Z] [INFO] --< org.eclipse.tracecompass:org.eclipse.tracecompass.tmf.analysis.xml.ui.tests >--
05:10:06 [2021-09-12T09:10:06.285Z] [INFO] Building org.eclipse.tracecompass.tmf.analysis.xml.ui.tests 1.0.4-SNAPSHOT [130/138]
05:10:06 [2021-09-12T09:10:06.285Z] [INFO] ------------------------[ eclipse-test-plugin ]-------------------------
05:10:06 [2021-09-12T09:10:06.285Z] [INFO] 
05:10:06 [2021-09-12T09:10:06.285Z] [INFO] --- maven-clean-plugin:3.0.0:clean (default-clean) @ org.eclipse.tracecompass.tmf.analysis.xml.ui.tests ---
05:10:06 [2021-09-12T09:10:06.285Z] [INFO] 
05:10:06 [2021-09-12T09:10:06.285Z] [INFO] --- tycho-packaging-plugin:2.3.0:build-qualifier (default-build-qualifier) @ org.eclipse.tracecompass.tmf.analysis.xml.ui.tests ---
05:10:06 [2021-09-12T09:10:06.285Z] [INFO] The project's OSGi version is 1.0.4.202109120813
05:10:06 [2021-09-12T09:10:06.285Z] [INFO] 
05:10:06 [2021-09-12T09:10:06.285Z] [INFO] --- tycho-packaging-plugin:2.3.0:validate-id (default-validate-id) @ org.eclipse.tracecompass.tmf.analysis.xml.ui.tests ---
05:10:06 [2021-09-12T09:10:06.285Z] [INFO] 
05:10:06 [2021-09-12T09:10:06.285Z] [INFO] --- tycho-packaging-plugin:2.3.0:validate-version (default-validate-version) @ org.eclipse.tracecompass.tmf.analysis.xml.ui.tests ---
05:10:06 [2021-09-12T09:10:06.285Z] [INFO] 
05:10:06 [2021-09-12T09:10:06.285Z] [INFO] --- maven-enforcer-plugin:3.0.0-M3:enforce (enforce-maven-version) @ org.eclipse.tracecompass.tmf.analysis.xml.ui.tests ---
05:10:06 [2021-09-12T09:10:06.285Z] [INFO] 
05:10:06 [2021-09-12T09:10:06.285Z] [INFO] --- maven-resources-plugin:3.0.2:resources (default-resources) @ org.eclipse.tracecompass.tmf.analysis.xml.ui.tests ---
05:10:06 [2021-09-12T09:10:06.285Z] [INFO] Using 'UTF-8' encoding to copy filtered resources.
05:10:06 [2021-09-12T09:10:06.285Z] [INFO] skip non existing resourceDirectory /home/jenkins/agent/workspace/tracecompass-stable-release-nightly-new/tmf/org.eclipse.tracecompass.tmf.analysis.xml.ui.tests/src/main/resources
05:10:06 [2021-09-12T09:10:06.285Z] [INFO] 
05:10:06 [2021-09-12T09:10:06.285Z] [INFO] --- tycho-compiler-plugin:2.3.0:compile (default-compile) @ org.eclipse.tracecompass.tmf.analysis.xml.ui.tests ---
05:10:06 [2021-09-12T09:10:06.285Z] [WARNING] The effective compiler target level 11 is incompatible with the following OSGi execution environments: [JavaSE-1.8 (assumes 1.8)] @ MavenProject: org.eclipse.tracecompass:org.eclipse.tracecompass.tmf.analysis.xml.ui.tests:1.0.4-SNAPSHOT @ /home/jenkins/agent/workspace/tracecompass-stable-release-nightly-new/tmf/org.eclipse.tracecompass.tmf.analysis.xml.ui.tests/pom.xml
05:10:06 [2021-09-12T09:10:06.285Z] [INFO] Compiling 3 source files to /home/jenkins/agent/workspace/tracecompass-stable-release-nightly-new/tmf/org.eclipse.tracecompass.tmf.analysis.xml.ui.tests/target/classes
05:10:06 [2021-09-12T09:10:06.541Z] [INFO] 
05:10:06 [2021-09-12T09:10:06.542Z] [INFO] --- maven-resources-plugin:3.0.2:testResources (default-testResources) @ org.eclipse.tracecompass.tmf.analysis.xml.ui.tests ---
05:10:06 [2021-09-12T09:10:06.542Z] [INFO] Using 'UTF-8' encoding to copy filtered resources.
05:10:06 [2021-09-12T09:10:06.542Z] [INFO] skip non existing resourceDirectory /home/jenkins/agent/workspace/tracecompass-stable-release-nightly-new/tmf/org.eclipse.tracecompass.tmf.analysis.xml.ui.tests/src/test/resources
05:10:06 [2021-09-12T09:10:06.542Z] [INFO] 
05:10:06 [2021-09-12T09:10:06.542Z] [INFO] --- tycho-source-plugin:2.3.0:plugin-source (plugin-source) @ org.eclipse.tracecompass.tmf.analysis.xml.ui.tests ---
05:10:06 [2021-09-12T09:10:06.542Z] [INFO] Building jar: /home/jenkins/agent/workspace/tracecompass-stable-release-nightly-new/tmf/org.eclipse.tracecompass.tmf.analysis.xml.ui.tests/target/org.eclipse.tracecompass.tmf.analysis.xml.ui.tests-1.0.4-SNAPSHOT-sources.jar
05:10:06 [2021-09-12T09:10:06.542Z] [INFO] 
05:10:06 [2021-09-12T09:10:06.542Z] [INFO] --- target-platform-configuration:2.3.0:target-platform (default-target-platform) @ org.eclipse.tracecompass.tmf.analysis.xml.ui.tests ---
05:10:06 [2021-09-12T09:10:06.542Z] [INFO] 
05:10:06 [2021-09-12T09:10:06.542Z] [INFO] --- tycho-packaging-plugin:2.3.0:package-plugin (default-package-plugin) @ org.eclipse.tracecompass.tmf.analysis.xml.ui.tests ---
05:10:06 [2021-09-12T09:10:06.542Z] [INFO] Building jar: /home/jenkins/agent/workspace/tracecompass-stable-release-nightly-new/tmf/org.eclipse.tracecompass.tmf.analysis.xml.ui.tests/target/org.eclipse.tracecompass.tmf.analysis.xml.ui.tests-1.0.4-SNAPSHOT.jar
05:10:06 [2021-09-12T09:10:06.542Z] [INFO] 
05:10:06 [2021-09-12T09:10:06.542Z] [INFO] --- tycho-p2-plugin:2.3.0:p2-metadata-default (default-p2-metadata-default) @ org.eclipse.tracecompass.tmf.analysis.xml.ui.tests ---
05:10:06 [2021-09-12T09:10:06.542Z] [INFO] 
05:10:06 [2021-09-12T09:10:06.542Z] [INFO] --- tycho-source-feature-plugin:2.3.0:source-feature (source-feature) @ org.eclipse.tracecompass.tmf.analysis.xml.ui.tests ---
05:10:06 [2021-09-12T09:10:06.542Z] [WARNING] Mojo tycho-source-feature-plugin:source-feature is replaced by the tycho-source-plugin:feature-source which offers equivalent and even enhanced functionality
05:10:06 [2021-09-12T09:10:06.542Z] [INFO] 
05:10:06 [2021-09-12T09:10:06.542Z] [INFO] --- tycho-pack200a-plugin:2.3.0:normalize (pack200-normalize) @ org.eclipse.tracecompass.tmf.analysis.xml.ui.tests ---
05:10:06 [2021-09-12T09:10:06.542Z] [WARNING] Pack200 actions are deprecated and scheduled for removal.
05:10:06 [2021-09-12T09:10:06.542Z] [INFO] Pack200 normalizing jar /home/jenkins/agent/workspace/tracecompass-stable-release-nightly-new/tmf/org.eclipse.tracecompass.tmf.analysis.xml.ui.tests/target/org.eclipse.tracecompass.tmf.analysis.xml.ui.tests-1.0.4-SNAPSHOT.jar
05:10:06 [2021-09-12T09:10:06.542Z] [INFO] 
05:10:06 [2021-09-12T09:10:06.542Z] [INFO] --- eclipse-jarsigner-plugin:1.3.1:sign (sign) @ org.eclipse.tracecompass.tmf.analysis.xml.ui.tests ---
05:10:06 [2021-09-12T09:10:06.542Z] [INFO] Signing jar: /home/jenkins/agent/workspace/tracecompass-stable-release-nightly-new/tmf/org.eclipse.tracecompass.tmf.analysis.xml.ui.tests/target/org.eclipse.tracecompass.tmf.analysis.xml.ui.tests-1.0.4-SNAPSHOT.jar
05:10:07 [2021-09-12T09:10:07.910Z] [INFO] Signing jar: /home/jenkins/agent/workspace/tracecompass-stable-release-nightly-new/tmf/org.eclipse.tracecompass.tmf.analysis.xml.ui.tests/target/org.eclipse.tracecompass.tmf.analysis.xml.ui.tests-1.0.4-SNAPSHOT-sources.jar
05:10:09 [2021-09-12T09:10:09.802Z] [INFO] 
05:10:09 [2021-09-12T09:10:09.802Z] [INFO] --- tycho-pack200b-plugin:2.3.0:pack (pack200-pack) @ org.eclipse.tracecompass.tmf.analysis.xml.ui.tests ---
05:10:09 [2021-09-12T09:10:09.802Z] [WARNING] Pack200 actions are deprecated and scheduled for removal.
05:10:09 [2021-09-12T09:10:09.802Z] [INFO] Pack200 packing jar /home/jenkins/agent/workspace/tracecompass-stable-release-nightly-new/tmf/org.eclipse.tracecompass.tmf.analysis.xml.ui.tests/target/org.eclipse.tracecompass.tmf.analysis.xml.ui.tests-1.0.4-SNAPSHOT.jar
05:10:09 [2021-09-12T09:10:09.802Z] [INFO] 
05:10:09 [2021-09-12T09:10:09.802Z] [INFO] --- tycho-p2-plugin:2.3.0:p2-metadata (p2-metadata) @ org.eclipse.tracecompass.tmf.analysis.xml.ui.tests ---
05:10:09 [2021-09-12T09:10:09.802Z] [INFO] 
05:10:09 [2021-09-12T09:10:09.802Z] [INFO] --- tycho-surefire-plugin:2.3.0:test (default-test) @ org.eclipse.tracecompass.tmf.analysis.xml.ui.tests ---
05:10:09 [2021-09-12T09:10:09.802Z] [INFO] Executing Test Runtime with timeout 0, logs (if any) will be placed at: /home/jenkins/agent/workspace/tracecompass-stable-release-nightly-new/tmf/org.eclipse.tracecompass.tmf.analysis.xml.ui.tests/target/work/data/.metadata/.log
05:10:09 [2021-09-12T09:10:09.802Z] [INFO] Command line:
05:10:09 [2021-09-12T09:10:09.802Z] 	[/opt/tools/java/openjdk/jdk-11/11.0.2+9/bin/java, -Dosgi.noShutdown=false, -Dosgi.os=linux, -Dosgi.ws=gtk, -Dosgi.arch=x86_64, -Dorg.eclipse.swt.browser.DefaultType=mozilla, -Xms512m, -Xmx1024m, -Dosgi.clean=true, -jar, /home/jenkins/.m2/repository/p2/osgi/bundle/org.eclipse.equinox.launcher/1.6.300.v20210813-1054/org.eclipse.equinox.launcher-1.6.300.v20210813-1054.jar, -data, /home/jenkins/agent/workspace/tracecompass-stable-release-nightly-new/tmf/org.eclipse.tracecompass.tmf.analysis.xml.ui.tests/target/work/data, -install, /home/jenkins/agent/workspace/tracecompass-stable-release-nightly-new/tmf/org.eclipse.tracecompass.tmf.analysis.xml.ui.tests/target/work, -configuration, /home/jenkins/agent/workspace/tracecompass-stable-release-nightly-new/tmf/org.eclipse.tracecompass.tmf.analysis.xml.ui.tests/target/work/configuration, -application, org.eclipse.tycho.surefire.osgibooter.uitest, -testproperties, /home/jenkins/agent/workspace/tracecompass-stable-release-nightly-new/tmf/org.eclipse.tracecompass.tmf.analysis.xml.ui.tests/target/surefire.properties, -product, org.eclipse.platform.ide, -consoleLog]
05:10:09 [2021-09-12T09:10:09.802Z] Picked up _JAVA_OPTIONS: -Duser.home=/home/tracecompass
05:10:13 [2021-09-12T09:10:13.073Z] !SESSION 2021-09-12 09:10:09.902 -----------------------------------------------
05:10:13 [2021-09-12T09:10:13.073Z] eclipse.buildId=unknown
05:10:13 [2021-09-12T09:10:13.073Z] java.version=11.0.2
05:10:13 [2021-09-12T09:10:13.073Z] java.vendor=Oracle Corporation
05:10:13 [2021-09-12T09:10:13.073Z] BootLoader constants: OS=linux, ARCH=x86_64, WS=gtk, NL=en_US
05:10:13 [2021-09-12T09:10:13.073Z] Framework arguments:  -application org.eclipse.tycho.surefire.osgibooter.uitest -testproperties /home/jenkins/agent/workspace/tracecompass-stable-release-nightly-new/tmf/org.eclipse.tracecompass.tmf.analysis.xml.ui.tests/target/surefire.properties -product org.eclipse.platform.ide
05:10:13 [2021-09-12T09:10:13.073Z] Command-line arguments:  -data /home/jenkins/agent/workspace/tracecompass-stable-release-nightly-new/tmf/org.eclipse.tracecompass.tmf.analysis.xml.ui.tests/target/work/data -application org.eclipse.tycho.surefire.osgibooter.uitest -testproperties /home/jenkins/agent/workspace/tracecompass-stable-release-nightly-new/tmf/org.eclipse.tracecompass.tmf.analysis.xml.ui.tests/target/surefire.properties -product org.eclipse.platform.ide -consoleLog
05:10:13 [2021-09-12T09:10:13.073Z] 
05:10:13 [2021-09-12T09:10:13.073Z] !ENTRY org.eclipse.compare.win32 4 0 2021-09-12 09:10:12.345
05:10:13 [2021-09-12T09:10:13.073Z] !MESSAGE FrameworkEvent ERROR
05:10:13 [2021-09-12T09:10:13.073Z] !STACK 0
05:10:13 [2021-09-12T09:10:13.073Z] org.osgi.framework.BundleException: Could not resolve module: org.eclipse.compare.win32 [69]
05:10:13 [2021-09-12T09:10:13.073Z]   Unresolved requirement: Require-Capability: eclipse.platform; filter:="(osgi.os=win32)"
05:10:13 [2021-09-12T09:10:13.073Z] 
05:10:13 [2021-09-12T09:10:13.073Z] 	at org.eclipse.osgi.container.Module.start(Module.java:463)
05:10:13 [2021-09-12T09:10:13.073Z] 	at org.eclipse.osgi.container.ModuleContainer$ContainerStartLevel.lambda$1(ModuleContainer.java:1834)
05:10:13 [2021-09-12T09:10:13.073Z] 	at org.eclipse.osgi.container.ModuleContainer$ContainerStartLevel.incStartLevel(ModuleContainer.java:1829)
05:10:13 [2021-09-12T09:10:13.073Z] 	at org.eclipse.osgi.container.ModuleContainer$ContainerStartLevel.incStartLevel(ModuleContainer.java:1775)
05:10:13 [2021-09-12T09:10:13.073Z] 	at org.eclipse.osgi.container.ModuleContainer$ContainerStartLevel.doContainerStartLevel(ModuleContainer.java:1739)
05:10:13 [2021-09-12T09:10:13.073Z] 	at org.eclipse.osgi.container.ModuleContainer$ContainerStartLevel.dispatchEvent(ModuleContainer.java:1661)
05:10:13 [2021-09-12T09:10:13.073Z] 	at org.eclipse.osgi.container.ModuleContainer$ContainerStartLevel.dispatchEvent(ModuleContainer.java:1)
05:10:13 [2021-09-12T09:10:13.073Z] 	at org.eclipse.osgi.framework.eventmgr.EventManager.dispatchEvent(EventManager.java:228)
05:10:13 [2021-09-12T09:10:13.073Z] 	at org.eclipse.osgi.framework.eventmgr.EventManager$EventThread.run(EventManager.java:339)
05:10:13 [2021-09-12T09:10:13.073Z] 
05:10:13 [2021-09-12T09:10:13.073Z] !ENTRY org.eclipse.ecf.provider.filetransfer.httpclient45.win32 4 0 2021-09-12 09:10:12.562
05:10:13 [2021-09-12T09:10:13.073Z] !MESSAGE FrameworkEvent ERROR
05:10:13 [2021-09-12T09:10:13.073Z] !STACK 0
05:10:13 [2021-09-12T09:10:13.073Z] org.osgi.framework.BundleException: Could not resolve module: org.eclipse.ecf.provider.filetransfer.httpclient45.win32 [141]
05:10:13 [2021-09-12T09:10:13.073Z]   Unresolved requirement: Require-Capability: eclipse.platform; filter:="(osgi.os=win32)"
05:10:13 [2021-09-12T09:10:13.073Z]   Unresolved requirement: Import-Package: org.apache.http.impl.auth.win; version="[4.5.0,5.0.0)"
05:10:13 [2021-09-12T09:10:13.073Z]     -> Export-Package: org.apache.http.impl.auth.win; bundle-symbolic-name="org.apache.httpcomponents.httpclient.win"; bundle-version="4.5.13.v20210128-2225"; version="4.5.13"; x-internal:="true"; uses:="org.apache.http,org.apache.http.auth,org.apache.http.client,org.apache.http.impl.auth,org.apache.http.protocol,org.apache.http.util"
05:10:13 [2021-09-12T09:10:13.073Z]        org.apache.httpcomponents.httpclient.win [38]
05:10:13 [2021-09-12T09:10:13.073Z]          Unresolved requirement: Require-Capability: eclipse.platform; filter:="(osgi.os=win32)"
05:10:13 [2021-09-12T09:10:13.073Z] 
05:10:13 [2021-09-12T09:10:13.073Z] 	at org.eclipse.osgi.container.Module.start(Module.java:463)
05:10:13 [2021-09-12T09:10:13.073Z] 	at org.eclipse.osgi.container.ModuleContainer$ContainerStartLevel.lambda$1(ModuleContainer.java:1834)
05:10:13 [2021-09-12T09:10:13.073Z] 	at org.eclipse.osgi.container.ModuleContainer$ContainerStartLevel.incStartLevel(ModuleContainer.java:1829)
05:10:13 [2021-09-12T09:10:13.073Z] 	at org.eclipse.osgi.container.ModuleContainer$ContainerStartLevel.incStartLevel(ModuleContainer.java:1775)
05:10:13 [2021-09-12T09:10:13.073Z] 	at org.eclipse.osgi.container.ModuleContainer$ContainerStartLevel.doContainerStartLevel(ModuleContainer.java:1739)
05:10:13 [2021-09-12T09:10:13.073Z] 	at org.eclipse.osgi.container.ModuleContainer$ContainerStartLevel.dispatchEvent(ModuleContainer.java:1661)
05:10:13 [2021-09-12T09:10:13.074Z] 	at org.eclipse.osgi.container.ModuleContainer$ContainerStartLevel.dispatchEvent(ModuleContainer.java:1)
05:10:13 [2021-09-12T09:10:13.074Z] 	at org.eclipse.osgi.framework.eventmgr.EventManager.dispatchEvent(EventManager.java:228)
05:10:13 [2021-09-12T09:10:13.074Z] 	at org.eclipse.osgi.framework.eventmgr.EventManager$EventThread.run(EventManager.java:339)
05:10:13 [2021-09-12T09:10:13.074Z] SWT SessionManagerDBus: Failed to connect to org.gnome.SessionManager: Failed to execute child process “dbus-launch” (No such file or directory)
05:10:13 [2021-09-12T09:10:13.074Z] SWT SessionManagerDBus: Failed to connect to org.xfce.SessionManager: Failed to execute child process “dbus-launch” (No such file or directory)
05:10:17 [2021-09-12T09:10:17.244Z] 
05:10:17 [2021-09-12T09:10:17.244Z] !ENTRY org.eclipse.urischeme 4 0 2021-09-12 09:10:16.761
05:10:17 [2021-09-12T09:10:17.244Z] !MESSAGE Cannot run program "xdg-mime": error=2, No such file or directory
05:10:17 [2021-09-12T09:10:17.244Z] !STACK 0
05:10:17 [2021-09-12T09:10:17.244Z] java.io.IOException: Cannot run program "xdg-mime": error=2, No such file or directory
05:10:17 [2021-09-12T09:10:17.244Z] 	at java.base/java.lang.ProcessBuilder.start(ProcessBuilder.java:1128)
05:10:17 [2021-09-12T09:10:17.244Z] 	at java.base/java.lang.ProcessBuilder.start(ProcessBuilder.java:1071)
05:10:17 [2021-09-12T09:10:17.244Z] 	at org.eclipse.urischeme.internal.registration.ProcessExecutor.execute(ProcessExecutor.java:36)
05:10:17 [2021-09-12T09:10:17.244Z] 	at org.eclipse.urischeme.internal.registration.RegistrationLinux.getRegisteredDesktopFileForScheme(RegistrationLinux.java:145)
05:10:17 [2021-09-12T09:10:17.244Z] 	at org.eclipse.urischeme.internal.registration.RegistrationLinux.determineHandlerLocation(RegistrationLinux.java:87)
05:10:17 [2021-09-12T09:10:17.244Z] 	at org.eclipse.urischeme.internal.registration.RegistrationLinux.getSchemesInformation(RegistrationLinux.java:76)
05:10:17 [2021-09-12T09:10:17.244Z] 	at org.eclipse.urischeme.AutoRegisterSchemeHandlersJob.run(AutoRegisterSchemeHandlersJob.java:87)
05:10:17 [2021-09-12T09:10:17.244Z] 	at org.eclipse.core.internal.jobs.Worker.run(Worker.java:63)
05:10:17 [2021-09-12T09:10:17.244Z] Caused by: java.io.IOException: error=2, No such file or directory
05:10:17 [2021-09-12T09:10:17.244Z] 	at java.base/java.lang.ProcessImpl.forkAndExec(Native Method)
05:10:17 [2021-09-12T09:10:17.244Z] 	at java.base/java.lang.ProcessImpl.<init>(ProcessImpl.java:340)
05:10:17 [2021-09-12T09:10:17.244Z] 	at java.base/java.lang.ProcessImpl.start(ProcessImpl.java:271)
05:10:17 [2021-09-12T09:10:17.244Z] 	at java.base/java.lang.ProcessBuilder.start(ProcessBuilder.java:1107)
05:10:17 [2021-09-12T09:10:17.244Z] 	... 7 more
05:10:17 [2021-09-12T09:10:17.501Z] Running org.eclipse.tracecompass.tmf.analysis.xml.ui.tests.module.XmlAnalysisOutputSourceTest
05:10:17 [2021-09-12T09:10:17.757Z] Tests run: 1, Failures: 0, Errors: 0, Skipped: 0, Time elapsed: 0.167 s - in org.eclipse.tracecompass.tmf.analysis.xml.ui.tests.module.XmlAnalysisOutputSourceTest
05:10:17 [2021-09-12T09:10:17.757Z] testBuiltinOutput  Time elapsed: 0.163 s
05:10:17 [2021-09-12T09:10:17.757Z] Running org.eclipse.tracecompass.tmf.analysis.xml.ui.tests.XmlAnalysisUiPluginTest
05:10:17 [2021-09-12T09:10:17.757Z] Tests run: 2, Failures: 0, Errors: 0, Skipped: 0, Time elapsed: 0 s - in org.eclipse.tracecompass.tmf.analysis.xml.ui.tests.XmlAnalysisUiPluginTest
05:10:17 [2021-09-12T09:10:17.757Z] testTmfCorePluginId  Time elapsed: 0 s
05:10:17 [2021-09-12T09:10:17.757Z] testGetDefault  Time elapsed: 0 s
05:10:17 [2021-09-12T09:10:17.757Z] 
05:10:17 [2021-09-12T09:10:17.757Z] Results:
05:10:17 [2021-09-12T09:10:17.757Z] 
05:10:17 [2021-09-12T09:10:17.757Z] Tests run: 3, Failures: 0, Errors: 0, Skipped: 0
05:10:17 [2021-09-12T09:10:17.757Z] 
05:10:17 [2021-09-12T09:10:17.757Z] 
05:10:17 [2021-09-12T09:10:17.757Z] !ENTRY org.eclipse.tracecompass.tmf.core 4 0 2021-09-12 09:10:17.640
05:10:17 [2021-09-12T09:10:17.757Z] !MESSAGE Unexpected error executing analysis with trace 
05:10:17 [2021-09-12T09:10:17.757Z] !STACK 0
05:10:17 [2021-09-12T09:10:17.757Z] java.lang.NullPointerException
05:10:17 [2021-09-12T09:10:17.757Z] 	at java.base/java.io.File.<init>(File.java:276)
05:10:17 [2021-09-12T09:10:17.757Z] 	at org.eclipse.tracecompass.tmf.core.statesystem.TmfStateSystemAnalysisModule.loadInitialState(TmfStateSystemAnalysisModule.java:580)
05:10:17 [2021-09-12T09:10:17.757Z] 	at org.eclipse.tracecompass.tmf.core.statesystem.TmfStateSystemAnalysisModule.build(TmfStateSystemAnalysisModule.java:528)
05:10:17 [2021-09-12T09:10:17.757Z] 	at org.eclipse.tracecompass.tmf.core.statesystem.TmfStateSystemAnalysisModule.createFullHistory(TmfStateSystemAnalysisModule.java:376)
05:10:17 [2021-09-12T09:10:17.757Z] 	at org.eclipse.tracecompass.tmf.core.statesystem.TmfStateSystemAnalysisModule.executeAnalysis(TmfStateSystemAnalysisModule.java:282)
05:10:17 [2021-09-12T09:10:17.757Z] 	at org.eclipse.tracecompass.tmf.core.analysis.TmfAbstractAnalysisModule$1.run(TmfAbstractAnalysisModule.java:394)
05:10:17 [2021-09-12T09:10:17.757Z] 	at org.eclipse.core.internal.jobs.Worker.run(Worker.java:63)
05:10:17 [2021-09-12T09:10:17.757Z] 
05:10:17 [2021-09-12T09:10:17.757Z] !ENTRY org.eclipse.tracecompass.tmf.core 4 0 2021-09-12 09:10:17.640
05:10:17 [2021-09-12T09:10:17.757Z] !MESSAGE Unexpected error executing analysis with trace 
05:10:17 [2021-09-12T09:10:17.757Z] !STACK 0
05:10:17 [2021-09-12T09:10:17.757Z] java.lang.NullPointerException
05:10:17 [2021-09-12T09:10:17.757Z] 	at java.base/java.io.File.<init>(File.java:276)
05:10:17 [2021-09-12T09:10:17.757Z] 	at org.eclipse.tracecompass.tmf.core.statesystem.TmfStateSystemAnalysisModule.loadInitialState(TmfStateSystemAnalysisModule.java:580)
05:10:17 [2021-09-12T09:10:17.757Z] 	at org.eclipse.tracecompass.tmf.core.statesystem.TmfStateSystemAnalysisModule.build(TmfStateSystemAnalysisModule.java:528)
05:10:17 [2021-09-12T09:10:17.757Z] 	at org.eclipse.tracecompass.tmf.core.statesystem.TmfStateSystemAnalysisModule.createFullHistory(TmfStateSystemAnalysisModule.java:376)
05:10:17 [2021-09-12T09:10:17.757Z] 	at org.eclipse.tracecompass.tmf.core.statesystem.TmfStateSystemAnalysisModule.executeAnalysis(TmfStateSystemAnalysisModule.java:282)
05:10:17 [2021-09-12T09:10:17.757Z] 	at org.eclipse.tracecompass.tmf.core.analysis.TmfAbstractAnalysisModule$1.run(TmfAbstractAnalysisModule.java:394)
05:10:17 [2021-09-12T09:10:17.757Z] 	at org.eclipse.core.internal.jobs.Worker.run(Worker.java:63)
05:10:17 [2021-09-12T09:10:17.757Z] 
05:10:17 [2021-09-12T09:10:17.757Z] !ENTRY org.eclipse.tracecompass.tmf.core 4 0 2021-09-12 09:10:17.644
05:10:17 [2021-09-12T09:10:17.757Z] !MESSAGE Exception executing analysis
05:10:17 [2021-09-12T09:10:17.757Z] !STACK 0
05:10:17 [2021-09-12T09:10:17.757Z] java.lang.NullPointerException
05:10:17 [2021-09-12T09:10:17.757Z] 	at java.base/java.io.File.<init>(File.java:276)
05:10:17 [2021-09-12T09:10:17.757Z] 	at org.eclipse.tracecompass.tmf.core.statesystem.TmfStateSystemAnalysisModule.loadInitialState(TmfStateSystemAnalysisModule.java:580)
05:10:17 [2021-09-12T09:10:17.757Z] 	at org.eclipse.tracecompass.tmf.core.statesystem.TmfStateSystemAnalysisModule.build(TmfStateSystemAnalysisModule.java:528)
05:10:17 [2021-09-12T09:10:17.757Z] 	at org.eclipse.tracecompass.tmf.core.statesystem.TmfStateSystemAnalysisModule.createFullHistory(TmfStateSystemAnalysisModule.java:376)
05:10:17 [2021-09-12T09:10:17.757Z] 	at org.eclipse.tracecompass.tmf.core.statesystem.TmfStateSystemAnalysisModule.executeAnalysis(TmfStateSystemAnalysisModule.java:282)
05:10:17 [2021-09-12T09:10:17.757Z] 	at org.eclipse.tracecompass.tmf.core.analysis.TmfAbstractAnalysisModule$1.run(TmfAbstractAnalysisModule.java:394)
05:10:17 [2021-09-12T09:10:17.757Z] 	at org.eclipse.core.internal.jobs.Worker.run(Worker.java:63)
05:10:17 [2021-09-12T09:10:17.757Z] 
05:10:17 [2021-09-12T09:10:17.757Z] !ENTRY org.eclipse.tracecompass.tmf.core 4 0 2021-09-12 09:10:17.644
05:10:17 [2021-09-12T09:10:17.757Z] !MESSAGE Exception executing analysis
05:10:17 [2021-09-12T09:10:17.757Z] !STACK 0
05:10:17 [2021-09-12T09:10:17.757Z] java.lang.NullPointerException
05:10:17 [2021-09-12T09:10:17.757Z] 	at java.base/java.io.File.<init>(File.java:276)
05:10:17 [2021-09-12T09:10:17.757Z] 	at org.eclipse.tracecompass.tmf.core.statesystem.TmfStateSystemAnalysisModule.loadInitialState(TmfStateSystemAnalysisModule.java:580)
05:10:17 [2021-09-12T09:10:17.757Z] 	at org.eclipse.tracecompass.tmf.core.statesystem.TmfStateSystemAnalysisModule.build(TmfStateSystemAnalysisModule.java:528)
05:10:17 [2021-09-12T09:10:17.757Z] 	at org.eclipse.tracecompass.tmf.core.statesystem.TmfStateSystemAnalysisModule.createFullHistory(TmfStateSystemAnalysisModule.java:376)
05:10:17 [2021-09-12T09:10:17.757Z] 	at org.eclipse.tracecompass.tmf.core.statesystem.TmfStateSystemAnalysisModule.executeAnalysis(TmfStateSystemAnalysisModule.java:282)
05:10:17 [2021-09-12T09:10:17.757Z] 	at org.eclipse.tracecompass.tmf.core.analysis.TmfAbstractAnalysisModule$1.run(TmfAbstractAnalysisModule.java:394)
05:10:17 [2021-09-12T09:10:17.757Z] 	at org.eclipse.core.internal.jobs.Worker.run(Worker.java:63)
05:10:18 [2021-09-12T09:10:18.013Z] 
05:10:18 [2021-09-12T09:10:18.013Z] !ENTRY org.eclipse.e4.ui.workbench 4 0 2021-09-12 09:10:17.974
05:10:18 [2021-09-12T09:10:18.013Z] !MESSAGE Failed to evaluate: ReferenceExpression [definitionId=org.eclipse.ui.ide.showInDefinition]
05:10:18 [2021-09-12T09:10:18.013Z] !STACK 0
05:10:18 [2021-09-12T09:10:18.013Z] org.eclipse.core.runtime.CoreException: Error evaluating Property [org.eclipse.ui.ide.page.activePreferencePage, type=class org.eclipse.swt.widgets.Shell, tester=org.eclipse.ui.internal.ide.handlers.PagePropertyTester@35cb657f]
05:10:18 [2021-09-12T09:10:18.013Z] 	at org.eclipse.core.internal.expressions.Property.test(Property.java:68)
05:10:18 [2021-09-12T09:10:18.013Z] 	at org.eclipse.core.expressions.TestExpression.evaluate(TestExpression.java:107)
05:10:18 [2021-09-12T09:10:18.013Z] 	at org.eclipse.core.expressions.CompositeExpression.evaluateAnd(CompositeExpression.java:54)
05:10:18 [2021-09-12T09:10:18.013Z] 	at org.eclipse.core.expressions.WithExpression.evaluate(WithExpression.java:84)
05:10:18 [2021-09-12T09:10:18.013Z] 	at org.eclipse.core.expressions.CompositeExpression.evaluateOr(CompositeExpression.java:68)
05:10:18 [2021-09-12T09:10:18.013Z] 	at org.eclipse.core.expressions.OrExpression.evaluate(OrExpression.java:26)
05:10:18 [2021-09-12T09:10:18.013Z] 	at org.eclipse.core.expressions.ReferenceExpression.evaluate(ReferenceExpression.java:72)
05:10:18 [2021-09-12T09:10:18.013Z] 	at org.eclipse.ui.internal.services.EvaluationReference.evaluate(EvaluationReference.java:79)
05:10:18 [2021-09-12T09:10:18.013Z] 	at org.eclipse.ui.internal.services.EvaluationReference.evaluate(EvaluationReference.java:109)
05:10:18 [2021-09-12T09:10:18.013Z] 	at org.eclipse.ui.internal.services.EvaluationReference.changed(EvaluationReference.java:103)
05:10:18 [2021-09-12T09:10:18.013Z] 	at org.eclipse.e4.core.internal.contexts.TrackableComputationExt.update(TrackableComputationExt.java:105)
05:10:18 [2021-09-12T09:10:18.013Z] 	at org.eclipse.e4.core.internal.contexts.EclipseContext.processScheduled(EclipseContext.java:364)
05:10:18 [2021-09-12T09:10:18.013Z] 	at org.eclipse.e4.core.internal.contexts.EclipseContext.set(EclipseContext.java:379)
05:10:18 [2021-09-12T09:10:18.013Z] 	at org.eclipse.e4.core.internal.contexts.EclipseContext.dispose(EclipseContext.java:208)
05:10:18 [2021-09-12T09:10:18.013Z] 	at org.eclipse.e4.core.internal.contexts.EclipseContext.dispose(EclipseContext.java:171)
05:10:18 [2021-09-12T09:10:18.013Z] 	at org.eclipse.e4.core.internal.contexts.osgi.EclipseContextOSGi.dispose(EclipseContextOSGi.java:102)
05:10:18 [2021-09-12T09:10:18.013Z] 	at org.eclipse.e4.core.internal.contexts.osgi.EclipseContextOSGi.bundleChanged(EclipseContextOSGi.java:144)
05:10:18 [2021-09-12T09:10:18.013Z] 	at org.eclipse.osgi.internal.framework.BundleContextImpl.dispatchEvent(BundleContextImpl.java:935)
05:10:18 [2021-09-12T09:10:18.013Z] 	at org.eclipse.osgi.framework.eventmgr.EventManager.dispatchEvent(EventManager.java:228)
05:10:18 [2021-09-12T09:10:18.013Z] 	at org.eclipse.osgi.framework.eventmgr.ListenerQueue.dispatchEventSynchronous(ListenerQueue.java:151)
05:10:18 [2021-09-12T09:10:18.013Z] 	at org.eclipse.osgi.internal.framework.EquinoxEventPublisher.publishBundleEventPrivileged(EquinoxEventPublisher.java:229)
05:10:18 [2021-09-12T09:10:18.013Z] 	at org.eclipse.osgi.internal.framework.EquinoxEventPublisher.publishBundleEvent(EquinoxEventPublisher.java:138)
05:10:18 [2021-09-12T09:10:18.013Z] 	at org.eclipse.osgi.internal.framework.EquinoxEventPublisher.publishBundleEvent(EquinoxEventPublisher.java:130)
05:10:18 [2021-09-12T09:10:18.013Z] 	at org.eclipse.osgi.internal.framework.EquinoxContainerAdaptor.publishModuleEvent(EquinoxContainerAdaptor.java:206)
05:10:18 [2021-09-12T09:10:18.014Z] 	at org.eclipse.osgi.container.Module.publishEvent(Module.java:499)
05:10:18 [2021-09-12T09:10:18.014Z] 	at org.eclipse.osgi.container.Module.doStop(Module.java:658)
05:10:18 [2021-09-12T09:10:18.014Z] 	at org.eclipse.osgi.container.Module.stop(Module.java:521)
05:10:18 [2021-09-12T09:10:18.014Z] 	at org.eclipse.osgi.container.SystemModule.stop(SystemModule.java:207)
05:10:18 [2021-09-12T09:10:18.014Z] 	at org.eclipse.osgi.internal.framework.EquinoxBundle$SystemBundle$EquinoxSystemModule.lambda$0(EquinoxBundle.java:224)
05:10:18 [2021-09-12T09:10:18.014Z] 	at java.base/java.lang.Thread.run(Thread.java:834)
05:10:18 [2021-09-12T09:10:18.014Z] Caused by: org.eclipse.swt.SWTException: Invalid thread access
05:10:18 [2021-09-12T09:10:18.014Z] 	at org.eclipse.swt.SWT.error(SWT.java:4893)
05:10:18 [2021-09-12T09:10:18.014Z] 	at org.eclipse.swt.SWT.error(SWT.java:4808)
05:10:18 [2021-09-12T09:10:18.014Z] 	at org.eclipse.swt.SWT.error(SWT.java:4779)
05:10:18 [2021-09-12T09:10:18.014Z] 	at org.eclipse.swt.widgets.Widget.error(Widget.java:560)
05:10:18 [2021-09-12T09:10:18.014Z] 	at org.eclipse.swt.widgets.Widget.checkWidget(Widget.java:476)
05:10:18 [2021-09-12T09:10:18.014Z] 	at org.eclipse.swt.widgets.Widget.getData(Widget.java:586)
05:10:18 [2021-09-12T09:10:18.014Z] 	at org.eclipse.ui.internal.ide.handlers.PagePropertyTester.test(PagePropertyTester.java:39)
05:10:18 [2021-09-12T09:10:18.014Z] 	at org.eclipse.core.internal.expressions.Property.test(Property.java:65)
05:10:18 [2021-09-12T09:10:18.014Z] 	... 29 more
05:10:18 [2021-09-12T09:10:18.577Z] [INFO] All tests passed!
05:10:18 [2021-09-12T09:10:18.577Z] [INFO] 
05:10:18 [2021-09-12T09:10:18.577Z] [INFO] --- maven-install-plugin:2.5.2:install (default-install) @ org.eclipse.tracecompass.tmf.analysis.xml.ui.tests ---
05:10:18 [2021-09-12T09:10:18.577Z] [INFO] Installing /home/jenkins/agent/workspace/tracecompass-stable-release-nightly-new/tmf/org.eclipse.tracecompass.tmf.analysis.xml.ui.tests/target/org.eclipse.tracecompass.tmf.analysis.xml.ui.tests-1.0.4-SNAPSHOT.jar to /home/jenkins/.m2/repository/org/eclipse/tracecompass/org.eclipse.tracecompass.tmf.analysis.xml.ui.tests/1.0.4-SNAPSHOT/org.eclipse.tracecompass.tmf.analysis.xml.ui.tests-1.0.4-SNAPSHOT.jar
05:10:18 [2021-09-12T09:10:18.577Z] [INFO] Installing /home/jenkins/agent/workspace/tracecompass-stable-release-nightly-new/tmf/org.eclipse.tracecompass.tmf.analysis.xml.ui.tests/pom.xml to /home/jenkins/.m2/repository/org/eclipse/tracecompass/org.eclipse.tracecompass.tmf.analysis.xml.ui.tests/1.0.4-SNAPSHOT/org.eclipse.tracecompass.tmf.analysis.xml.ui.tests-1.0.4-SNAPSHOT.pom
05:10:18 [2021-09-12T09:10:18.577Z] [INFO] Installing /home/jenkins/agent/workspace/tracecompass-stable-release-nightly-new/tmf/org.eclipse.tracecompass.tmf.analysis.xml.ui.tests/target/org.eclipse.tracecompass.tmf.analysis.xml.ui.tests-1.0.4-SNAPSHOT-sources.jar to /home/jenkins/.m2/repository/org/eclipse/tracecompass/org.eclipse.tracecompass.tmf.analysis.xml.ui.tests/1.0.4-SNAPSHOT/org.eclipse.tracecompass.tmf.analysis.xml.ui.tests-1.0.4-SNAPSHOT-sources.jar
05:10:18 [2021-09-12T09:10:18.577Z] [INFO] Installing /home/jenkins/agent/workspace/tracecompass-stable-release-nightly-new/tmf/org.eclipse.tracecompass.tmf.analysis.xml.ui.tests/target/org.eclipse.tracecompass.tmf.analysis.xml.ui.tests-1.0.4-SNAPSHOT.jar.pack.gz to /home/jenkins/.m2/repository/org/eclipse/tracecompass/org.eclipse.tracecompass.tmf.analysis.xml.ui.tests/1.0.4-SNAPSHOT/org.eclipse.tracecompass.tmf.analysis.xml.ui.tests-1.0.4-SNAPSHOT-pack200.jar.pack.gz
05:10:18 [2021-09-12T09:10:18.577Z] [INFO] Installing /home/jenkins/agent/workspace/tracecompass-stable-release-nightly-new/tmf/org.eclipse.tracecompass.tmf.analysis.xml.ui.tests/target/p2content.xml to /home/jenkins/.m2/repository/org/eclipse/tracecompass/org.eclipse.tracecompass.tmf.analysis.xml.ui.tests/1.0.4-SNAPSHOT/org.eclipse.tracecompass.tmf.analysis.xml.ui.tests-1.0.4-SNAPSHOT-p2metadata.xml
05:10:18 [2021-09-12T09:10:18.577Z] [INFO] Installing /home/jenkins/agent/workspace/tracecompass-stable-release-nightly-new/tmf/org.eclipse.tracecompass.tmf.analysis.xml.ui.tests/target/p2artifacts.xml to /home/jenkins/.m2/repository/org/eclipse/tracecompass/org.eclipse.tracecompass.tmf.analysis.xml.ui.tests/1.0.4-SNAPSHOT/org.eclipse.tracecompass.tmf.analysis.xml.ui.tests-1.0.4-SNAPSHOT-p2artifacts.xml
05:10:18 [2021-09-12T09:10:18.577Z] [INFO] 
05:10:18 [2021-09-12T09:10:18.577Z] [INFO] --- tycho-p2-plugin:2.3.0:update-local-index (default-update-local-index) @ org.eclipse.tracecompass.tmf.analysis.xml.ui.tests ---
05:10:18 [2021-09-12T09:10:18.577Z] [INFO] 
05:10:18 [2021-09-12T09:10:18.577Z] [INFO] --< org.eclipse.tracecompass:org.eclipse.tracecompass.tmf.chart.ui.tests >--
05:10:18 [2021-09-12T09:10:18.577Z] [INFO] Building org.eclipse.tracecompass.tmf.chart.ui.tests 1.0.2-SNAPSHOT [131/138]
05:10:18 [2021-09-12T09:10:18.577Z] [INFO] ------------------------[ eclipse-test-plugin ]-------------------------
05:10:18 [2021-09-12T09:10:18.577Z] [INFO] 
05:10:18 [2021-09-12T09:10:18.577Z] [INFO] --- maven-clean-plugin:3.0.0:clean (default-clean) @ org.eclipse.tracecompass.tmf.chart.ui.tests ---
05:10:18 [2021-09-12T09:10:18.577Z] [INFO] 
05:10:18 [2021-09-12T09:10:18.577Z] [INFO] --- tycho-packaging-plugin:2.3.0:build-qualifier (default-build-qualifier) @ org.eclipse.tracecompass.tmf.chart.ui.tests ---
05:10:18 [2021-09-12T09:10:18.577Z] [INFO] The project's OSGi version is 1.0.2.202109120813
05:10:18 [2021-09-12T09:10:18.577Z] [INFO] 
05:10:18 [2021-09-12T09:10:18.577Z] [INFO] --- tycho-packaging-plugin:2.3.0:validate-id (default-validate-id) @ org.eclipse.tracecompass.tmf.chart.ui.tests ---
05:10:18 [2021-09-12T09:10:18.577Z] [INFO] 
05:10:18 [2021-09-12T09:10:18.577Z] [INFO] --- tycho-packaging-plugin:2.3.0:validate-version (default-validate-version) @ org.eclipse.tracecompass.tmf.chart.ui.tests ---
05:10:18 [2021-09-12T09:10:18.577Z] [INFO] 
05:10:18 [2021-09-12T09:10:18.577Z] [INFO] --- maven-enforcer-plugin:3.0.0-M3:enforce (enforce-maven-version) @ org.eclipse.tracecompass.tmf.chart.ui.tests ---
05:10:18 [2021-09-12T09:10:18.577Z] [INFO] 
05:10:18 [2021-09-12T09:10:18.577Z] [INFO] --- maven-resources-plugin:3.0.2:resources (default-resources) @ org.eclipse.tracecompass.tmf.chart.ui.tests ---
05:10:18 [2021-09-12T09:10:18.577Z] [INFO] Using 'UTF-8' encoding to copy filtered resources.
05:10:18 [2021-09-12T09:10:18.577Z] [INFO] skip non existing resourceDirectory /home/jenkins/agent/workspace/tracecompass-stable-release-nightly-new/tmf/org.eclipse.tracecompass.tmf.chart.ui.tests/src/main/resources
05:10:18 [2021-09-12T09:10:18.577Z] [INFO] 
05:10:18 [2021-09-12T09:10:18.577Z] [INFO] --- tycho-compiler-plugin:2.3.0:compile (default-compile) @ org.eclipse.tracecompass.tmf.chart.ui.tests ---
05:10:18 [2021-09-12T09:10:18.577Z] [WARNING] The effective compiler target level 11 is incompatible with the following OSGi execution environments: [JavaSE-1.8 (assumes 1.8)] @ MavenProject: org.eclipse.tracecompass:org.eclipse.tracecompass.tmf.chart.ui.tests:1.0.2-SNAPSHOT @ /home/jenkins/agent/workspace/tracecompass-stable-release-nightly-new/tmf/org.eclipse.tracecompass.tmf.chart.ui.tests/pom.xml
05:10:18 [2021-09-12T09:10:18.577Z] [INFO] Compiling 2 source files to /home/jenkins/agent/workspace/tracecompass-stable-release-nightly-new/tmf/org.eclipse.tracecompass.tmf.chart.ui.tests/target/classes
05:10:18 [2021-09-12T09:10:18.577Z] [INFO] 
05:10:18 [2021-09-12T09:10:18.577Z] [INFO] --- maven-resources-plugin:3.0.2:testResources (default-testResources) @ org.eclipse.tracecompass.tmf.chart.ui.tests ---
05:10:18 [2021-09-12T09:10:18.577Z] [INFO] Using 'UTF-8' encoding to copy filtered resources.
05:10:18 [2021-09-12T09:10:18.577Z] [INFO] skip non existing resourceDirectory /home/jenkins/agent/workspace/tracecompass-stable-release-nightly-new/tmf/org.eclipse.tracecompass.tmf.chart.ui.tests/src/test/resources
05:10:18 [2021-09-12T09:10:18.577Z] [INFO] 
05:10:18 [2021-09-12T09:10:18.577Z] [INFO] --- tycho-source-plugin:2.3.0:plugin-source (plugin-source) @ org.eclipse.tracecompass.tmf.chart.ui.tests ---
05:10:18 [2021-09-12T09:10:18.577Z] [INFO] Building jar: /home/jenkins/agent/workspace/tracecompass-stable-release-nightly-new/tmf/org.eclipse.tracecompass.tmf.chart.ui.tests/target/org.eclipse.tracecompass.tmf.chart.ui.tests-1.0.2-SNAPSHOT-sources.jar
05:10:18 [2021-09-12T09:10:18.577Z] [INFO] 
05:10:18 [2021-09-12T09:10:18.577Z] [INFO] --- target-platform-configuration:2.3.0:target-platform (default-target-platform) @ org.eclipse.tracecompass.tmf.chart.ui.tests ---
05:10:18 [2021-09-12T09:10:18.577Z] [INFO] 
05:10:18 [2021-09-12T09:10:18.577Z] [INFO] --- tycho-packaging-plugin:2.3.0:package-plugin (default-package-plugin) @ org.eclipse.tracecompass.tmf.chart.ui.tests ---
05:10:18 [2021-09-12T09:10:18.577Z] [INFO] Building jar: /home/jenkins/agent/workspace/tracecompass-stable-release-nightly-new/tmf/org.eclipse.tracecompass.tmf.chart.ui.tests/target/org.eclipse.tracecompass.tmf.chart.ui.tests-1.0.2-SNAPSHOT.jar
05:10:18 [2021-09-12T09:10:18.577Z] [INFO] 
05:10:18 [2021-09-12T09:10:18.577Z] [INFO] --- tycho-p2-plugin:2.3.0:p2-metadata-default (default-p2-metadata-default) @ org.eclipse.tracecompass.tmf.chart.ui.tests ---
05:10:18 [2021-09-12T09:10:18.577Z] [INFO] 
05:10:18 [2021-09-12T09:10:18.577Z] [INFO] --- tycho-source-feature-plugin:2.3.0:source-feature (source-feature) @ org.eclipse.tracecompass.tmf.chart.ui.tests ---
05:10:18 [2021-09-12T09:10:18.577Z] [WARNING] Mojo tycho-source-feature-plugin:source-feature is replaced by the tycho-source-plugin:feature-source which offers equivalent and even enhanced functionality
05:10:18 [2021-09-12T09:10:18.577Z] [INFO] 
05:10:18 [2021-09-12T09:10:18.577Z] [INFO] --- tycho-pack200a-plugin:2.3.0:normalize (pack200-normalize) @ org.eclipse.tracecompass.tmf.chart.ui.tests ---
05:10:18 [2021-09-12T09:10:18.577Z] [WARNING] Pack200 actions are deprecated and scheduled for removal.
05:10:18 [2021-09-12T09:10:18.577Z] [INFO] Pack200 normalizing jar /home/jenkins/agent/workspace/tracecompass-stable-release-nightly-new/tmf/org.eclipse.tracecompass.tmf.chart.ui.tests/target/org.eclipse.tracecompass.tmf.chart.ui.tests-1.0.2-SNAPSHOT.jar
05:10:18 [2021-09-12T09:10:18.577Z] [INFO] 
05:10:18 [2021-09-12T09:10:18.578Z] [INFO] --- eclipse-jarsigner-plugin:1.3.1:sign (sign) @ org.eclipse.tracecompass.tmf.chart.ui.tests ---
05:10:18 [2021-09-12T09:10:18.578Z] [INFO] Signing jar: /home/jenkins/agent/workspace/tracecompass-stable-release-nightly-new/tmf/org.eclipse.tracecompass.tmf.chart.ui.tests/target/org.eclipse.tracecompass.tmf.chart.ui.tests-1.0.2-SNAPSHOT.jar
05:10:21 [2021-09-12T09:10:21.100Z] [INFO] Signing jar: /home/jenkins/agent/workspace/tracecompass-stable-release-nightly-new/tmf/org.eclipse.tracecompass.tmf.chart.ui.tests/target/org.eclipse.tracecompass.tmf.chart.ui.tests-1.0.2-SNAPSHOT-sources.jar
05:10:22 [2021-09-12T09:10:22.029Z] [INFO] 
05:10:22 [2021-09-12T09:10:22.029Z] [INFO] --- tycho-pack200b-plugin:2.3.0:pack (pack200-pack) @ org.eclipse.tracecompass.tmf.chart.ui.tests ---
05:10:22 [2021-09-12T09:10:22.029Z] [WARNING] Pack200 actions are deprecated and scheduled for removal.
05:10:22 [2021-09-12T09:10:22.029Z] [INFO] Pack200 packing jar /home/jenkins/agent/workspace/tracecompass-stable-release-nightly-new/tmf/org.eclipse.tracecompass.tmf.chart.ui.tests/target/org.eclipse.tracecompass.tmf.chart.ui.tests-1.0.2-SNAPSHOT.jar
05:10:22 [2021-09-12T09:10:22.029Z] [INFO] 
05:10:22 [2021-09-12T09:10:22.029Z] [INFO] --- tycho-p2-plugin:2.3.0:p2-metadata (p2-metadata) @ org.eclipse.tracecompass.tmf.chart.ui.tests ---
05:10:22 [2021-09-12T09:10:22.029Z] [INFO] 
05:10:22 [2021-09-12T09:10:22.029Z] [INFO] --- tycho-surefire-plugin:2.3.0:test (default-test) @ org.eclipse.tracecompass.tmf.chart.ui.tests ---
05:10:22 [2021-09-12T09:10:22.029Z] [INFO] Executing Test Runtime with timeout 0, logs (if any) will be placed at: /home/jenkins/agent/workspace/tracecompass-stable-release-nightly-new/tmf/org.eclipse.tracecompass.tmf.chart.ui.tests/target/work/data/.metadata/.log
05:10:22 [2021-09-12T09:10:22.029Z] [INFO] Command line:
05:10:22 [2021-09-12T09:10:22.029Z] 	[/opt/tools/java/openjdk/jdk-11/11.0.2+9/bin/java, -Dosgi.noShutdown=false, -Dosgi.os=linux, -Dosgi.ws=gtk, -Dosgi.arch=x86_64, -Dorg.eclipse.swt.browser.DefaultType=mozilla, -Xms512m, -Xmx1024m, -Dosgi.clean=true, -jar, /home/jenkins/.m2/repository/p2/osgi/bundle/org.eclipse.equinox.launcher/1.6.300.v20210813-1054/org.eclipse.equinox.launcher-1.6.300.v20210813-1054.jar, -data, /home/jenkins/agent/workspace/tracecompass-stable-release-nightly-new/tmf/org.eclipse.tracecompass.tmf.chart.ui.tests/target/work/data, -install, /home/jenkins/agent/workspace/tracecompass-stable-release-nightly-new/tmf/org.eclipse.tracecompass.tmf.chart.ui.tests/target/work, -configuration, /home/jenkins/agent/workspace/tracecompass-stable-release-nightly-new/tmf/org.eclipse.tracecompass.tmf.chart.ui.tests/target/work/configuration, -application, org.eclipse.tycho.surefire.osgibooter.uitest, -testproperties, /home/jenkins/agent/workspace/tracecompass-stable-release-nightly-new/tmf/org.eclipse.tracecompass.tmf.chart.ui.tests/target/surefire.properties, -product, org.eclipse.platform.ide, -consoleLog]
05:10:22 [2021-09-12T09:10:22.029Z] Picked up _JAVA_OPTIONS: -Duser.home=/home/tracecompass
05:10:25 [2021-09-12T09:10:25.297Z] !SESSION 2021-09-12 09:10:22.241 -----------------------------------------------
05:10:25 [2021-09-12T09:10:25.297Z] eclipse.buildId=unknown
05:10:25 [2021-09-12T09:10:25.297Z] java.version=11.0.2
05:10:25 [2021-09-12T09:10:25.297Z] java.vendor=Oracle Corporation
05:10:25 [2021-09-12T09:10:25.297Z] BootLoader constants: OS=linux, ARCH=x86_64, WS=gtk, NL=en_US
05:10:25 [2021-09-12T09:10:25.297Z] Framework arguments:  -application org.eclipse.tycho.surefire.osgibooter.uitest -testproperties /home/jenkins/agent/workspace/tracecompass-stable-release-nightly-new/tmf/org.eclipse.tracecompass.tmf.chart.ui.tests/target/surefire.properties -product org.eclipse.platform.ide
05:10:25 [2021-09-12T09:10:25.297Z] Command-line arguments:  -data /home/jenkins/agent/workspace/tracecompass-stable-release-nightly-new/tmf/org.eclipse.tracecompass.tmf.chart.ui.tests/target/work/data -application org.eclipse.tycho.surefire.osgibooter.uitest -testproperties /home/jenkins/agent/workspace/tracecompass-stable-release-nightly-new/tmf/org.eclipse.tracecompass.tmf.chart.ui.tests/target/surefire.properties -product org.eclipse.platform.ide -consoleLog
05:10:25 [2021-09-12T09:10:25.297Z] 
05:10:25 [2021-09-12T09:10:25.297Z] !ENTRY org.eclipse.compare.win32 4 0 2021-09-12 09:10:24.848
05:10:25 [2021-09-12T09:10:25.297Z] !MESSAGE FrameworkEvent ERROR
05:10:25 [2021-09-12T09:10:25.297Z] !STACK 0
05:10:25 [2021-09-12T09:10:25.297Z] org.osgi.framework.BundleException: Could not resolve module: org.eclipse.compare.win32 [68]
05:10:25 [2021-09-12T09:10:25.297Z]   Unresolved requirement: Require-Capability: eclipse.platform; filter:="(osgi.os=win32)"
05:10:25 [2021-09-12T09:10:25.297Z] 
05:10:25 [2021-09-12T09:10:25.297Z] 	at org.eclipse.osgi.container.Module.start(Module.java:463)
05:10:25 [2021-09-12T09:10:25.297Z] 	at org.eclipse.osgi.container.ModuleContainer$ContainerStartLevel.lambda$1(ModuleContainer.java:1834)
05:10:25 [2021-09-12T09:10:25.297Z] 	at org.eclipse.osgi.container.ModuleContainer$ContainerStartLevel.incStartLevel(ModuleContainer.java:1829)
05:10:25 [2021-09-12T09:10:25.297Z] 	at org.eclipse.osgi.container.ModuleContainer$ContainerStartLevel.incStartLevel(ModuleContainer.java:1775)
05:10:25 [2021-09-12T09:10:25.297Z] 	at org.eclipse.osgi.container.ModuleContainer$ContainerStartLevel.doContainerStartLevel(ModuleContainer.java:1739)
05:10:25 [2021-09-12T09:10:25.297Z] 	at org.eclipse.osgi.container.ModuleContainer$ContainerStartLevel.dispatchEvent(ModuleContainer.java:1661)
05:10:25 [2021-09-12T09:10:25.297Z] 	at org.eclipse.osgi.container.ModuleContainer$ContainerStartLevel.dispatchEvent(ModuleContainer.java:1)
05:10:25 [2021-09-12T09:10:25.297Z] 	at org.eclipse.osgi.framework.eventmgr.EventManager.dispatchEvent(EventManager.java:228)
05:10:25 [2021-09-12T09:10:25.297Z] 	at org.eclipse.osgi.framework.eventmgr.EventManager$EventThread.run(EventManager.java:339)
05:10:25 [2021-09-12T09:10:25.297Z] 
05:10:25 [2021-09-12T09:10:25.297Z] !ENTRY org.eclipse.ecf.provider.filetransfer.httpclient45.win32 4 0 2021-09-12 09:10:25.067
05:10:25 [2021-09-12T09:10:25.297Z] !MESSAGE FrameworkEvent ERROR
05:10:25 [2021-09-12T09:10:25.297Z] !STACK 0
05:10:25 [2021-09-12T09:10:25.297Z] org.osgi.framework.BundleException: Could not resolve module: org.eclipse.ecf.provider.filetransfer.httpclient45.win32 [140]
05:10:25 [2021-09-12T09:10:25.297Z]   Unresolved requirement: Require-Capability: eclipse.platform; filter:="(osgi.os=win32)"
05:10:25 [2021-09-12T09:10:25.297Z]   Unresolved requirement: Import-Package: org.apache.http.impl.auth.win; version="[4.5.0,5.0.0)"
05:10:25 [2021-09-12T09:10:25.297Z]     -> Export-Package: org.apache.http.impl.auth.win; bundle-symbolic-name="org.apache.httpcomponents.httpclient.win"; bundle-version="4.5.13.v20210128-2225"; version="4.5.13"; x-internal:="true"; uses:="org.apache.http,org.apache.http.auth,org.apache.http.client,org.apache.http.impl.auth,org.apache.http.protocol,org.apache.http.util"
05:10:25 [2021-09-12T09:10:25.297Z]        org.apache.httpcomponents.httpclient.win [38]
05:10:25 [2021-09-12T09:10:25.297Z]          Unresolved requirement: Require-Capability: eclipse.platform; filter:="(osgi.os=win32)"
05:10:25 [2021-09-12T09:10:25.297Z] 
05:10:25 [2021-09-12T09:10:25.297Z] 	at org.eclipse.osgi.container.Module.start(Module.java:463)
05:10:25 [2021-09-12T09:10:25.297Z] 	at org.eclipse.osgi.container.ModuleContainer$ContainerStartLevel.lambda$1(ModuleContainer.java:1834)
05:10:25 [2021-09-12T09:10:25.297Z] 	at org.eclipse.osgi.container.ModuleContainer$ContainerStartLevel.incStartLevel(ModuleContainer.java:1829)
05:10:25 [2021-09-12T09:10:25.297Z] 	at org.eclipse.osgi.container.ModuleContainer$ContainerStartLevel.incStartLevel(ModuleContainer.java:1775)
05:10:25 [2021-09-12T09:10:25.297Z] 	at org.eclipse.osgi.container.ModuleContainer$ContainerStartLevel.doContainerStartLevel(ModuleContainer.java:1739)
05:10:25 [2021-09-12T09:10:25.297Z] 	at org.eclipse.osgi.container.ModuleContainer$ContainerStartLevel.dispatchEvent(ModuleContainer.java:1661)
05:10:25 [2021-09-12T09:10:25.297Z] 	at org.eclipse.osgi.container.ModuleContainer$ContainerStartLevel.dispatchEvent(ModuleContainer.java:1)
05:10:25 [2021-09-12T09:10:25.297Z] 	at org.eclipse.osgi.framework.eventmgr.EventManager.dispatchEvent(EventManager.java:228)
05:10:25 [2021-09-12T09:10:25.297Z] 	at org.eclipse.osgi.framework.eventmgr.EventManager$EventThread.run(EventManager.java:339)
05:10:25 [2021-09-12T09:10:25.553Z] SWT SessionManagerDBus: Failed to connect to org.gnome.SessionManager: Failed to execute child process “dbus-launch” (No such file or directory)
05:10:25 [2021-09-12T09:10:25.553Z] SWT SessionManagerDBus: Failed to connect to org.xfce.SessionManager: Failed to execute child process “dbus-launch” (No such file or directory)
05:10:29 [2021-09-12T09:10:29.725Z] 
05:10:29 [2021-09-12T09:10:29.725Z] !ENTRY org.eclipse.urischeme 4 0 2021-09-12 09:10:28.938
05:10:29 [2021-09-12T09:10:29.725Z] !MESSAGE Cannot run program "xdg-mime": error=2, No such file or directory
05:10:29 [2021-09-12T09:10:29.725Z] !STACK 0
05:10:29 [2021-09-12T09:10:29.725Z] java.io.IOException: Cannot run program "xdg-mime": error=2, No such file or directory
05:10:29 [2021-09-12T09:10:29.725Z] 	at java.base/java.lang.ProcessBuilder.start(ProcessBuilder.java:1128)
05:10:29 [2021-09-12T09:10:29.725Z] 	at java.base/java.lang.ProcessBuilder.start(ProcessBuilder.java:1071)
05:10:29 [2021-09-12T09:10:29.725Z] 	at org.eclipse.urischeme.internal.registration.ProcessExecutor.execute(ProcessExecutor.java:36)
05:10:29 [2021-09-12T09:10:29.725Z] 	at org.eclipse.urischeme.internal.registration.RegistrationLinux.getRegisteredDesktopFileForScheme(RegistrationLinux.java:145)
05:10:29 [2021-09-12T09:10:29.725Z] 	at org.eclipse.urischeme.internal.registration.RegistrationLinux.determineHandlerLocation(RegistrationLinux.java:87)
05:10:29 [2021-09-12T09:10:29.725Z] 	at org.eclipse.urischeme.internal.registration.RegistrationLinux.getSchemesInformation(RegistrationLinux.java:76)
05:10:29 [2021-09-12T09:10:29.725Z] 	at org.eclipse.urischeme.AutoRegisterSchemeHandlersJob.run(AutoRegisterSchemeHandlersJob.java:87)
05:10:29 [2021-09-12T09:10:29.725Z] 	at org.eclipse.core.internal.jobs.Worker.run(Worker.java:63)
05:10:29 [2021-09-12T09:10:29.725Z] Caused by: java.io.IOException: error=2, No such file or directory
05:10:29 [2021-09-12T09:10:29.725Z] 	at java.base/java.lang.ProcessImpl.forkAndExec(Native Method)
05:10:29 [2021-09-12T09:10:29.725Z] 	at java.base/java.lang.ProcessImpl.<init>(ProcessImpl.java:340)
05:10:29 [2021-09-12T09:10:29.725Z] 	at java.base/java.lang.ProcessImpl.start(ProcessImpl.java:271)
05:10:29 [2021-09-12T09:10:29.725Z] 	at java.base/java.lang.ProcessBuilder.start(ProcessBuilder.java:1107)
05:10:29 [2021-09-12T09:10:29.725Z] 	... 7 more
05:10:29 [2021-09-12T09:10:29.725Z] Running org.eclipse.tracecompass.tmf.chart.ui.tests.data.ChartRangeTest
05:10:29 [2021-09-12T09:10:29.725Z] Tests run: 4, Failures: 0, Errors: 0, Skipped: 0, Time elapsed: 0.076 s - in org.eclipse.tracecompass.tmf.chart.ui.tests.data.ChartRangeTest
05:10:29 [2021-09-12T09:10:29.725Z] testClamp(org.eclipse.tracecompass.tmf.chart.ui.tests.data.ChartRangeTest)  Time elapsed: 0.002 s
05:10:29 [2021-09-12T09:10:29.725Z] testInvalidConstructor(org.eclipse.tracecompass.tmf.chart.ui.tests.data.ChartRangeTest)  Time elapsed: 0.001 s
05:10:29 [2021-09-12T09:10:29.725Z] testConstructor(org.eclipse.tracecompass.tmf.chart.ui.tests.data.ChartRangeTest)  Time elapsed: 0 s
05:10:29 [2021-09-12T09:10:29.725Z] testDefaultConstructor(org.eclipse.tracecompass.tmf.chart.ui.tests.data.ChartRangeTest)  Time elapsed: 0 s
05:10:29 [2021-09-12T09:10:29.725Z] 
05:10:29 [2021-09-12T09:10:29.725Z] Results:
05:10:29 [2021-09-12T09:10:29.725Z] 
05:10:29 [2021-09-12T09:10:29.725Z] Tests run: 4, Failures: 0, Errors: 0, Skipped: 0
05:10:29 [2021-09-12T09:10:29.725Z] 
05:10:30 [2021-09-12T09:10:30.287Z] [INFO] All tests passed!
05:10:30 [2021-09-12T09:10:30.287Z] [INFO] 
05:10:30 [2021-09-12T09:10:30.287Z] [INFO] --- maven-install-plugin:2.5.2:install (default-install) @ org.eclipse.tracecompass.tmf.chart.ui.tests ---
05:10:30 [2021-09-12T09:10:30.287Z] [INFO] Installing /home/jenkins/agent/workspace/tracecompass-stable-release-nightly-new/tmf/org.eclipse.tracecompass.tmf.chart.ui.tests/target/org.eclipse.tracecompass.tmf.chart.ui.tests-1.0.2-SNAPSHOT.jar to /home/jenkins/.m2/repository/org/eclipse/tracecompass/org.eclipse.tracecompass.tmf.chart.ui.tests/1.0.2-SNAPSHOT/org.eclipse.tracecompass.tmf.chart.ui.tests-1.0.2-SNAPSHOT.jar
05:10:30 [2021-09-12T09:10:30.287Z] [INFO] Installing /home/jenkins/agent/workspace/tracecompass-stable-release-nightly-new/tmf/org.eclipse.tracecompass.tmf.chart.ui.tests/pom.xml to /home/jenkins/.m2/repository/org/eclipse/tracecompass/org.eclipse.tracecompass.tmf.chart.ui.tests/1.0.2-SNAPSHOT/org.eclipse.tracecompass.tmf.chart.ui.tests-1.0.2-SNAPSHOT.pom
05:10:30 [2021-09-12T09:10:30.287Z] [INFO] Installing /home/jenkins/agent/workspace/tracecompass-stable-release-nightly-new/tmf/org.eclipse.tracecompass.tmf.chart.ui.tests/target/org.eclipse.tracecompass.tmf.chart.ui.tests-1.0.2-SNAPSHOT-sources.jar to /home/jenkins/.m2/repository/org/eclipse/tracecompass/org.eclipse.tracecompass.tmf.chart.ui.tests/1.0.2-SNAPSHOT/org.eclipse.tracecompass.tmf.chart.ui.tests-1.0.2-SNAPSHOT-sources.jar
05:10:30 [2021-09-12T09:10:30.287Z] [INFO] Installing /home/jenkins/agent/workspace/tracecompass-stable-release-nightly-new/tmf/org.eclipse.tracecompass.tmf.chart.ui.tests/target/org.eclipse.tracecompass.tmf.chart.ui.tests-1.0.2-SNAPSHOT.jar.pack.gz to /home/jenkins/.m2/repository/org/eclipse/tracecompass/org.eclipse.tracecompass.tmf.chart.ui.tests/1.0.2-SNAPSHOT/org.eclipse.tracecompass.tmf.chart.ui.tests-1.0.2-SNAPSHOT-pack200.jar.pack.gz
05:10:30 [2021-09-12T09:10:30.287Z] [INFO] Installing /home/jenkins/agent/workspace/tracecompass-stable-release-nightly-new/tmf/org.eclipse.tracecompass.tmf.chart.ui.tests/target/p2content.xml to /home/jenkins/.m2/repository/org/eclipse/tracecompass/org.eclipse.tracecompass.tmf.chart.ui.tests/1.0.2-SNAPSHOT/org.eclipse.tracecompass.tmf.chart.ui.tests-1.0.2-SNAPSHOT-p2metadata.xml
05:10:30 [2021-09-12T09:10:30.287Z] [INFO] Installing /home/jenkins/agent/workspace/tracecompass-stable-release-nightly-new/tmf/org.eclipse.tracecompass.tmf.chart.ui.tests/target/p2artifacts.xml to /home/jenkins/.m2/repository/org/eclipse/tracecompass/org.eclipse.tracecompass.tmf.chart.ui.tests/1.0.2-SNAPSHOT/org.eclipse.tracecompass.tmf.chart.ui.tests-1.0.2-SNAPSHOT-p2artifacts.xml
05:10:30 [2021-09-12T09:10:30.287Z] [INFO] 
05:10:30 [2021-09-12T09:10:30.287Z] [INFO] --- tycho-p2-plugin:2.3.0:update-local-index (default-update-local-index) @ org.eclipse.tracecompass.tmf.chart.ui.tests ---
05:10:30 [2021-09-12T09:10:30.287Z] [INFO] 
05:10:30 [2021-09-12T09:10:30.287Z] [INFO] --< org.eclipse.tracecompass:org.eclipse.tracecompass.tmf.remote.ui.swtbot.tests >--
05:10:30 [2021-09-12T09:10:30.287Z] [INFO] Building org.eclipse.tracecompass.tmf.remote.ui.swtbot.tests 1.0.9-SNAPSHOT [132/138]
05:10:30 [2021-09-12T09:10:30.287Z] [INFO] ------------------------[ eclipse-test-plugin ]-------------------------
05:10:30 [2021-09-12T09:10:30.287Z] [INFO] 
05:10:30 [2021-09-12T09:10:30.287Z] [INFO] --- maven-clean-plugin:3.0.0:clean (default-clean) @ org.eclipse.tracecompass.tmf.remote.ui.swtbot.tests ---
05:10:30 [2021-09-12T09:10:30.287Z] [INFO] 
05:10:30 [2021-09-12T09:10:30.287Z] [INFO] --- tycho-packaging-plugin:2.3.0:build-qualifier (default-build-qualifier) @ org.eclipse.tracecompass.tmf.remote.ui.swtbot.tests ---
05:10:30 [2021-09-12T09:10:30.287Z] [INFO] The project's OSGi version is 1.0.9.202109120813
05:10:30 [2021-09-12T09:10:30.287Z] [INFO] 
05:10:30 [2021-09-12T09:10:30.287Z] [INFO] --- tycho-packaging-plugin:2.3.0:validate-id (default-validate-id) @ org.eclipse.tracecompass.tmf.remote.ui.swtbot.tests ---
05:10:30 [2021-09-12T09:10:30.287Z] [INFO] 
05:10:30 [2021-09-12T09:10:30.287Z] [INFO] --- tycho-packaging-plugin:2.3.0:validate-version (default-validate-version) @ org.eclipse.tracecompass.tmf.remote.ui.swtbot.tests ---
05:10:30 [2021-09-12T09:10:30.287Z] [INFO] 
05:10:30 [2021-09-12T09:10:30.287Z] [INFO] --- maven-enforcer-plugin:3.0.0-M3:enforce (enforce-maven-version) @ org.eclipse.tracecompass.tmf.remote.ui.swtbot.tests ---
05:10:30 [2021-09-12T09:10:30.287Z] [INFO] 
05:10:30 [2021-09-12T09:10:30.287Z] [INFO] --- maven-resources-plugin:3.0.2:resources (default-resources) @ org.eclipse.tracecompass.tmf.remote.ui.swtbot.tests ---
05:10:30 [2021-09-12T09:10:30.287Z] [INFO] Using 'UTF-8' encoding to copy filtered resources.
05:10:30 [2021-09-12T09:10:30.287Z] [INFO] skip non existing resourceDirectory /home/jenkins/agent/workspace/tracecompass-stable-release-nightly-new/tmf/org.eclipse.tracecompass.tmf.remote.ui.swtbot.tests/src/main/resources
05:10:30 [2021-09-12T09:10:30.287Z] [INFO] 
05:10:30 [2021-09-12T09:10:30.287Z] [INFO] --- tycho-compiler-plugin:2.3.0:compile (default-compile) @ org.eclipse.tracecompass.tmf.remote.ui.swtbot.tests ---
05:10:30 [2021-09-12T09:10:30.287Z] [WARNING] The effective compiler target level 11 is incompatible with the following OSGi execution environments: [JavaSE-1.8 (assumes 1.8)] @ MavenProject: org.eclipse.tracecompass:org.eclipse.tracecompass.tmf.remote.ui.swtbot.tests:1.0.9-SNAPSHOT @ /home/jenkins/agent/workspace/tracecompass-stable-release-nightly-new/tmf/org.eclipse.tracecompass.tmf.remote.ui.swtbot.tests/pom.xml
05:10:30 [2021-09-12T09:10:30.287Z] [INFO] Compiling 2 source files to /home/jenkins/agent/workspace/tracecompass-stable-release-nightly-new/tmf/org.eclipse.tracecompass.tmf.remote.ui.swtbot.tests/target/classes
05:10:30 [2021-09-12T09:10:30.545Z] [INFO] 
05:10:30 [2021-09-12T09:10:30.545Z] [INFO] --- maven-resources-plugin:3.0.2:testResources (default-testResources) @ org.eclipse.tracecompass.tmf.remote.ui.swtbot.tests ---
05:10:30 [2021-09-12T09:10:30.545Z] [INFO] Using 'UTF-8' encoding to copy filtered resources.
05:10:30 [2021-09-12T09:10:30.545Z] [INFO] skip non existing resourceDirectory /home/jenkins/agent/workspace/tracecompass-stable-release-nightly-new/tmf/org.eclipse.tracecompass.tmf.remote.ui.swtbot.tests/src/test/resources
05:10:30 [2021-09-12T09:10:30.545Z] [INFO] 
05:10:30 [2021-09-12T09:10:30.545Z] [INFO] --- tycho-source-plugin:2.3.0:plugin-source (plugin-source) @ org.eclipse.tracecompass.tmf.remote.ui.swtbot.tests ---
05:10:30 [2021-09-12T09:10:30.545Z] [INFO] Building jar: /home/jenkins/agent/workspace/tracecompass-stable-release-nightly-new/tmf/org.eclipse.tracecompass.tmf.remote.ui.swtbot.tests/target/org.eclipse.tracecompass.tmf.remote.ui.swtbot.tests-1.0.9-SNAPSHOT-sources.jar
05:10:30 [2021-09-12T09:10:30.545Z] [INFO] 
05:10:30 [2021-09-12T09:10:30.545Z] [INFO] --- target-platform-configuration:2.3.0:target-platform (default-target-platform) @ org.eclipse.tracecompass.tmf.remote.ui.swtbot.tests ---
05:10:30 [2021-09-12T09:10:30.545Z] [INFO] 
05:10:30 [2021-09-12T09:10:30.545Z] [INFO] --- tycho-packaging-plugin:2.3.0:package-plugin (default-package-plugin) @ org.eclipse.tracecompass.tmf.remote.ui.swtbot.tests ---
05:10:30 [2021-09-12T09:10:30.545Z] [INFO] Building jar: /home/jenkins/agent/workspace/tracecompass-stable-release-nightly-new/tmf/org.eclipse.tracecompass.tmf.remote.ui.swtbot.tests/target/org.eclipse.tracecompass.tmf.remote.ui.swtbot.tests-1.0.9-SNAPSHOT.jar
05:10:30 [2021-09-12T09:10:30.545Z] [INFO] 
05:10:30 [2021-09-12T09:10:30.545Z] [INFO] --- tycho-p2-plugin:2.3.0:p2-metadata-default (default-p2-metadata-default) @ org.eclipse.tracecompass.tmf.remote.ui.swtbot.tests ---
05:10:30 [2021-09-12T09:10:30.545Z] [INFO] 
05:10:30 [2021-09-12T09:10:30.545Z] [INFO] --- tycho-source-feature-plugin:2.3.0:source-feature (source-feature) @ org.eclipse.tracecompass.tmf.remote.ui.swtbot.tests ---
05:10:30 [2021-09-12T09:10:30.545Z] [WARNING] Mojo tycho-source-feature-plugin:source-feature is replaced by the tycho-source-plugin:feature-source which offers equivalent and even enhanced functionality
05:10:30 [2021-09-12T09:10:30.545Z] [INFO] 
05:10:30 [2021-09-12T09:10:30.545Z] [INFO] --- tycho-pack200a-plugin:2.3.0:normalize (pack200-normalize) @ org.eclipse.tracecompass.tmf.remote.ui.swtbot.tests ---
05:10:30 [2021-09-12T09:10:30.545Z] [WARNING] Pack200 actions are deprecated and scheduled for removal.
05:10:30 [2021-09-12T09:10:30.545Z] [INFO] Pack200 normalizing jar /home/jenkins/agent/workspace/tracecompass-stable-release-nightly-new/tmf/org.eclipse.tracecompass.tmf.remote.ui.swtbot.tests/target/org.eclipse.tracecompass.tmf.remote.ui.swtbot.tests-1.0.9-SNAPSHOT.jar
05:10:30 [2021-09-12T09:10:30.545Z] [INFO] 
05:10:30 [2021-09-12T09:10:30.545Z] [INFO] --- eclipse-jarsigner-plugin:1.3.1:sign (sign) @ org.eclipse.tracecompass.tmf.remote.ui.swtbot.tests ---
05:10:30 [2021-09-12T09:10:30.545Z] [INFO] Signing jar: /home/jenkins/agent/workspace/tracecompass-stable-release-nightly-new/tmf/org.eclipse.tracecompass.tmf.remote.ui.swtbot.tests/target/org.eclipse.tracecompass.tmf.remote.ui.swtbot.tests-1.0.9-SNAPSHOT.jar
05:10:31 [2021-09-12T09:10:31.913Z] [INFO] Signing jar: /home/jenkins/agent/workspace/tracecompass-stable-release-nightly-new/tmf/org.eclipse.tracecompass.tmf.remote.ui.swtbot.tests/target/org.eclipse.tracecompass.tmf.remote.ui.swtbot.tests-1.0.9-SNAPSHOT-sources.jar
05:10:32 [2021-09-12T09:10:32.841Z] [INFO] 
05:10:32 [2021-09-12T09:10:32.841Z] [INFO] --- tycho-pack200b-plugin:2.3.0:pack (pack200-pack) @ org.eclipse.tracecompass.tmf.remote.ui.swtbot.tests ---
05:10:32 [2021-09-12T09:10:32.841Z] [WARNING] Pack200 actions are deprecated and scheduled for removal.
05:10:32 [2021-09-12T09:10:32.841Z] [INFO] Pack200 packing jar /home/jenkins/agent/workspace/tracecompass-stable-release-nightly-new/tmf/org.eclipse.tracecompass.tmf.remote.ui.swtbot.tests/target/org.eclipse.tracecompass.tmf.remote.ui.swtbot.tests-1.0.9-SNAPSHOT.jar
05:10:32 [2021-09-12T09:10:32.841Z] [INFO] 
05:10:32 [2021-09-12T09:10:32.841Z] [INFO] --- tycho-p2-plugin:2.3.0:p2-metadata (p2-metadata) @ org.eclipse.tracecompass.tmf.remote.ui.swtbot.tests ---
05:10:32 [2021-09-12T09:10:32.841Z] [INFO] 
05:10:32 [2021-09-12T09:10:32.841Z] [INFO] --- tycho-surefire-plugin:2.3.0:test (default-test) @ org.eclipse.tracecompass.tmf.remote.ui.swtbot.tests ---
05:10:32 [2021-09-12T09:10:32.841Z] [INFO] Executing Test Runtime with timeout 0, logs (if any) will be placed at: /home/jenkins/agent/workspace/tracecompass-stable-release-nightly-new/tmf/org.eclipse.tracecompass.tmf.remote.ui.swtbot.tests/target/work/data/.metadata/.log
05:10:32 [2021-09-12T09:10:32.841Z] [INFO] Command line:
05:10:32 [2021-09-12T09:10:32.841Z] 	[/opt/tools/java/openjdk/jdk-11/11.0.2+9/bin/java, -Dosgi.noShutdown=false, -Dosgi.os=linux, -Dosgi.ws=gtk, -Dosgi.arch=x86_64, -Dorg.eclipse.swt.browser.DefaultType=mozilla, -Xms512m, -Xmx1024m, -Dosgi.clean=true, -jar, /home/jenkins/.m2/repository/p2/osgi/bundle/org.eclipse.equinox.launcher/1.6.300.v20210813-1054/org.eclipse.equinox.launcher-1.6.300.v20210813-1054.jar, -data, /home/jenkins/agent/workspace/tracecompass-stable-release-nightly-new/tmf/org.eclipse.tracecompass.tmf.remote.ui.swtbot.tests/target/work/data, -install, /home/jenkins/agent/workspace/tracecompass-stable-release-nightly-new/tmf/org.eclipse.tracecompass.tmf.remote.ui.swtbot.tests/target/work, -configuration, /home/jenkins/agent/workspace/tracecompass-stable-release-nightly-new/tmf/org.eclipse.tracecompass.tmf.remote.ui.swtbot.tests/target/work/configuration, -application, org.eclipse.tycho.surefire.osgibooter.uitest, -testproperties, /home/jenkins/agent/workspace/tracecompass-stable-release-nightly-new/tmf/org.eclipse.tracecompass.tmf.remote.ui.swtbot.tests/target/surefire.properties, -product, org.eclipse.platform.ide, -nouithread, -consoleLog]
05:10:32 [2021-09-12T09:10:32.841Z] Picked up _JAVA_OPTIONS: -Duser.home=/home/tracecompass
05:10:36 [2021-09-12T09:10:36.112Z] !SESSION 2021-09-12 09:10:32.961 -----------------------------------------------
05:10:36 [2021-09-12T09:10:36.112Z] eclipse.buildId=unknown
05:10:36 [2021-09-12T09:10:36.112Z] java.version=11.0.2
05:10:36 [2021-09-12T09:10:36.112Z] java.vendor=Oracle Corporation
05:10:36 [2021-09-12T09:10:36.112Z] BootLoader constants: OS=linux, ARCH=x86_64, WS=gtk, NL=en_US
05:10:36 [2021-09-12T09:10:36.112Z] Framework arguments:  -application org.eclipse.tycho.surefire.osgibooter.uitest -testproperties /home/jenkins/agent/workspace/tracecompass-stable-release-nightly-new/tmf/org.eclipse.tracecompass.tmf.remote.ui.swtbot.tests/target/surefire.properties -product org.eclipse.platform.ide -nouithread
05:10:36 [2021-09-12T09:10:36.112Z] Command-line arguments:  -data /home/jenkins/agent/workspace/tracecompass-stable-release-nightly-new/tmf/org.eclipse.tracecompass.tmf.remote.ui.swtbot.tests/target/work/data -application org.eclipse.tycho.surefire.osgibooter.uitest -testproperties /home/jenkins/agent/workspace/tracecompass-stable-release-nightly-new/tmf/org.eclipse.tracecompass.tmf.remote.ui.swtbot.tests/target/surefire.properties -product org.eclipse.platform.ide -nouithread -consoleLog
05:10:36 [2021-09-12T09:10:36.112Z] 
05:10:36 [2021-09-12T09:10:36.112Z] !ENTRY org.eclipse.compare.win32 4 0 2021-09-12 09:10:35.541
05:10:36 [2021-09-12T09:10:36.112Z] !MESSAGE FrameworkEvent ERROR
05:10:36 [2021-09-12T09:10:36.112Z] !STACK 0
05:10:36 [2021-09-12T09:10:36.112Z] org.osgi.framework.BundleException: Could not resolve module: org.eclipse.compare.win32 [69]
05:10:36 [2021-09-12T09:10:36.112Z]   Unresolved requirement: Require-Capability: eclipse.platform; filter:="(osgi.os=win32)"
05:10:36 [2021-09-12T09:10:36.112Z] 
05:10:36 [2021-09-12T09:10:36.112Z] 	at org.eclipse.osgi.container.Module.start(Module.java:463)
05:10:36 [2021-09-12T09:10:36.112Z] 	at org.eclipse.osgi.container.ModuleContainer$ContainerStartLevel.lambda$1(ModuleContainer.java:1834)
05:10:36 [2021-09-12T09:10:36.112Z] 	at org.eclipse.osgi.container.ModuleContainer$ContainerStartLevel.incStartLevel(ModuleContainer.java:1829)
05:10:36 [2021-09-12T09:10:36.112Z] 	at org.eclipse.osgi.container.ModuleContainer$ContainerStartLevel.incStartLevel(ModuleContainer.java:1775)
05:10:36 [2021-09-12T09:10:36.112Z] 	at org.eclipse.osgi.container.ModuleContainer$ContainerStartLevel.doContainerStartLevel(ModuleContainer.java:1739)
05:10:36 [2021-09-12T09:10:36.112Z] 	at org.eclipse.osgi.container.ModuleContainer$ContainerStartLevel.dispatchEvent(ModuleContainer.java:1661)
05:10:36 [2021-09-12T09:10:36.112Z] 	at org.eclipse.osgi.container.ModuleContainer$ContainerStartLevel.dispatchEvent(ModuleContainer.java:1)
05:10:36 [2021-09-12T09:10:36.112Z] 	at org.eclipse.osgi.framework.eventmgr.EventManager.dispatchEvent(EventManager.java:228)
05:10:36 [2021-09-12T09:10:36.112Z] 	at org.eclipse.osgi.framework.eventmgr.EventManager$EventThread.run(EventManager.java:339)
05:10:36 [2021-09-12T09:10:36.112Z] 
05:10:36 [2021-09-12T09:10:36.112Z] !ENTRY org.eclipse.ecf.provider.filetransfer.httpclient45.win32 4 0 2021-09-12 09:10:35.756
05:10:36 [2021-09-12T09:10:36.112Z] !MESSAGE FrameworkEvent ERROR
05:10:36 [2021-09-12T09:10:36.112Z] !STACK 0
05:10:36 [2021-09-12T09:10:36.112Z] org.osgi.framework.BundleException: Could not resolve module: org.eclipse.ecf.provider.filetransfer.httpclient45.win32 [141]
05:10:36 [2021-09-12T09:10:36.112Z]   Unresolved requirement: Require-Capability: eclipse.platform; filter:="(osgi.os=win32)"
05:10:36 [2021-09-12T09:10:36.112Z]   Unresolved requirement: Import-Package: org.apache.http.impl.auth.win; version="[4.5.0,5.0.0)"
05:10:36 [2021-09-12T09:10:36.112Z]     -> Export-Package: org.apache.http.impl.auth.win; bundle-symbolic-name="org.apache.httpcomponents.httpclient.win"; bundle-version="4.5.13.v20210128-2225"; version="4.5.13"; x-internal:="true"; uses:="org.apache.http,org.apache.http.auth,org.apache.http.client,org.apache.http.impl.auth,org.apache.http.protocol,org.apache.http.util"
05:10:36 [2021-09-12T09:10:36.112Z]        org.apache.httpcomponents.httpclient.win [38]
05:10:36 [2021-09-12T09:10:36.112Z]          Unresolved requirement: Require-Capability: eclipse.platform; filter:="(osgi.os=win32)"
05:10:36 [2021-09-12T09:10:36.112Z] 
05:10:36 [2021-09-12T09:10:36.112Z] 	at org.eclipse.osgi.container.Module.start(Module.java:463)
05:10:36 [2021-09-12T09:10:36.112Z] 	at org.eclipse.osgi.container.ModuleContainer$ContainerStartLevel.lambda$1(ModuleContainer.java:1834)
05:10:36 [2021-09-12T09:10:36.112Z] 	at org.eclipse.osgi.container.ModuleContainer$ContainerStartLevel.incStartLevel(ModuleContainer.java:1829)
05:10:36 [2021-09-12T09:10:36.112Z] 	at org.eclipse.osgi.container.ModuleContainer$ContainerStartLevel.incStartLevel(ModuleContainer.java:1775)
05:10:36 [2021-09-12T09:10:36.112Z] 	at org.eclipse.osgi.container.ModuleContainer$ContainerStartLevel.doContainerStartLevel(ModuleContainer.java:1739)
05:10:36 [2021-09-12T09:10:36.112Z] 	at org.eclipse.osgi.container.ModuleContainer$ContainerStartLevel.dispatchEvent(ModuleContainer.java:1661)
05:10:36 [2021-09-12T09:10:36.112Z] 	at org.eclipse.osgi.container.ModuleContainer$ContainerStartLevel.dispatchEvent(ModuleContainer.java:1)
05:10:36 [2021-09-12T09:10:36.112Z] 	at org.eclipse.osgi.framework.eventmgr.EventManager.dispatchEvent(EventManager.java:228)
05:10:36 [2021-09-12T09:10:36.112Z] 	at org.eclipse.osgi.framework.eventmgr.EventManager$EventThread.run(EventManager.java:339)
05:10:36 [2021-09-12T09:10:36.368Z] SWT SessionManagerDBus: Failed to connect to org.gnome.SessionManager: Failed to execute child process “dbus-launch” (No such file or directory)
05:10:36 [2021-09-12T09:10:36.368Z] SWT SessionManagerDBus: Failed to connect to org.xfce.SessionManager: Failed to execute child process “dbus-launch” (No such file or directory)
05:10:40 [2021-09-12T09:10:40.538Z] 
05:10:40 [2021-09-12T09:10:40.538Z] !ENTRY org.eclipse.e4.ui.workbench 2 0 2021-09-12 09:10:39.970
05:10:40 [2021-09-12T09:10:40.538Z] !MESSAGE Removing PartDescriptorImpl with the "org.eclipse.tracecompass.tmf.ui.swtbot.tests.views.xychart.stub" id and the "XY Chart View Stub" label.It points to the non available "bundleclass://org.eclipse.ui.workbench/org.eclipse.ui.internal.e4.compatibility.CompatibilityView" class. Bundle might have been uninstalled
05:10:40 [2021-09-12T09:10:40.538Z] 
05:10:40 [2021-09-12T09:10:40.538Z] !ENTRY org.eclipse.urischeme 4 0 2021-09-12 09:10:40.043
05:10:40 [2021-09-12T09:10:40.538Z] !MESSAGE Cannot run program "xdg-mime": error=2, No such file or directory
05:10:40 [2021-09-12T09:10:40.538Z] !STACK 0
05:10:40 [2021-09-12T09:10:40.538Z] java.io.IOException: Cannot run program "xdg-mime": error=2, No such file or directory
05:10:40 [2021-09-12T09:10:40.538Z] 	at java.base/java.lang.ProcessBuilder.start(ProcessBuilder.java:1128)
05:10:40 [2021-09-12T09:10:40.538Z] 	at java.base/java.lang.ProcessBuilder.start(ProcessBuilder.java:1071)
05:10:40 [2021-09-12T09:10:40.538Z] 	at org.eclipse.urischeme.internal.registration.ProcessExecutor.execute(ProcessExecutor.java:36)
05:10:40 [2021-09-12T09:10:40.538Z] 	at org.eclipse.urischeme.internal.registration.RegistrationLinux.getRegisteredDesktopFileForScheme(RegistrationLinux.java:145)
05:10:40 [2021-09-12T09:10:40.538Z] 	at org.eclipse.urischeme.internal.registration.RegistrationLinux.determineHandlerLocation(RegistrationLinux.java:87)
05:10:40 [2021-09-12T09:10:40.538Z] 	at org.eclipse.urischeme.internal.registration.RegistrationLinux.getSchemesInformation(RegistrationLinux.java:76)
05:10:40 [2021-09-12T09:10:40.538Z] 	at org.eclipse.urischeme.AutoRegisterSchemeHandlersJob.run(AutoRegisterSchemeHandlersJob.java:87)
05:10:40 [2021-09-12T09:10:40.538Z] 	at org.eclipse.core.internal.jobs.Worker.run(Worker.java:63)
05:10:40 [2021-09-12T09:10:40.538Z] Caused by: java.io.IOException: error=2, No such file or directory
05:10:40 [2021-09-12T09:10:40.538Z] 	at java.base/java.lang.ProcessImpl.forkAndExec(Native Method)
05:10:40 [2021-09-12T09:10:40.538Z] 	at java.base/java.lang.ProcessImpl.<init>(ProcessImpl.java:340)
05:10:40 [2021-09-12T09:10:40.538Z] 	at java.base/java.lang.ProcessImpl.start(ProcessImpl.java:271)
05:10:40 [2021-09-12T09:10:40.538Z] 	at java.base/java.lang.ProcessBuilder.start(ProcessBuilder.java:1107)
05:10:40 [2021-09-12T09:10:40.538Z] 	... 7 more
05:10:40 [2021-09-12T09:10:40.794Z] Running org.eclipse.tracecompass.tmf.remote.ui.swtbot.tests.fetch.FetchRemoteTracesTest
05:10:41 [2021-09-12T09:10:41.051Z] Display size: 1440x900
05:10:41 [2021-09-12T09:10:41.051Z] OS version=5.12.7-300.fc34.x86_64
05:10:41 [2021-09-12T09:10:41.051Z] GTK version=3.22.30
05:10:41 [2021-09-12T09:10:41.051Z] GTK theme=Ambiance
05:10:41 [2021-09-12T09:10:41.051Z] LIBOVERLAY_SCROLLBAR=0
05:10:41 [2021-09-12T09:10:41.051Z] Time zone: Greenwich Mean Time
05:10:41 [2021-09-12T09:10:41.051Z] log4j:WARN No appenders could be found for logger (org.eclipse.swtbot.swt.finder.widgets.SWTBotShell).
05:10:41 [2021-09-12T09:10:41.051Z] log4j:WARN Please initialize the log4j system properly.
05:12:02 [2021-09-12T09:12:02.438Z] 
05:12:02 [2021-09-12T09:12:02.438Z] !ENTRY org.eclipse.tracecompass.tmf.ui 4 0 2021-09-12 09:11:58.989
05:12:02 [2021-09-12T09:12:02.438Z] !MESSAGE Error connection to node 'ssh://anonymous@unknown.unknown.unknown'
05:12:02 [2021-09-12T09:12:02.438Z] !STACK 0
05:12:02 [2021-09-12T09:12:02.438Z] org.eclipse.core.commands.ExecutionException: Cannot connect Unknown
05:12:02 [2021-09-12T09:12:02.438Z] 	at org.eclipse.tracecompass.tmf.remote.core.proxy.RemoteSystemProxy.connect(RemoteSystemProxy.java:90)
05:12:02 [2021-09-12T09:12:02.438Z] 	at org.eclipse.tracecompass.internal.tmf.remote.ui.wizards.fetch.model.RemoteImportConnectionNodeElement.connect(RemoteImportConnectionNodeElement.java:143)
05:12:02 [2021-09-12T09:12:02.438Z] 	at org.eclipse.tracecompass.internal.tmf.remote.ui.wizards.fetch.RemoteFetchLogWizardRemotePage$6.run(RemoteFetchLogWizardRemotePage.java:392)
05:12:02 [2021-09-12T09:12:02.438Z] 	at org.eclipse.jface.operation.ModalContext$ModalContextThread.run(ModalContext.java:122)
05:12:02 [2021-09-12T09:12:02.438Z] Caused by: org.eclipse.remote.core.exception.RemoteConnectionException: Session.connect: java.net.UnknownHostException: unknown.unknown.unknown
05:12:02 [2021-09-12T09:12:02.438Z] 	at org.eclipse.remote.internal.jsch.core.JSchConnection.newSession(JSchConnection.java:715)
05:12:02 [2021-09-12T09:12:02.438Z] 	at org.eclipse.remote.internal.jsch.core.JSchConnection.open(JSchConnection.java:748)
05:12:02 [2021-09-12T09:12:02.438Z] 	at org.eclipse.remote.internal.jsch.core.JSchConnection.open(JSchConnection.java:721)
05:12:02 [2021-09-12T09:12:02.438Z] 	at org.eclipse.remote.internal.core.RemoteConnection.open(RemoteConnection.java:163)
05:12:02 [2021-09-12T09:12:02.438Z] 	at org.eclipse.tracecompass.tmf.remote.core.proxy.RemoteSystemProxy.connect(RemoteSystemProxy.java:86)
05:12:02 [2021-09-12T09:12:02.438Z] 	... 3 more
05:12:02 [2021-09-12T09:12:02.438Z] 
05:12:02 [2021-09-12T09:12:02.438Z] !ENTRY org.eclipse.jface 4 4 2021-09-12 09:11:58.994
05:12:02 [2021-09-12T09:12:02.438Z] !MESSAGE Internal error : Error connection to node 'ssh://anonymous@unknown.unknown.unknown'
05:12:02 [2021-09-12T09:12:02.438Z] 
05:12:02 [2021-09-12T09:12:02.438Z] Reason:
05:12:02 [2021-09-12T09:12:02.438Z] Cannot connect Unknown
05:12:02 [2021-09-12T09:12:02.438Z] !STACK 0
05:12:02 [2021-09-12T09:12:02.438Z] java.lang.IllegalStateException: Error dialog is supposed to be shown now
05:12:02 [2021-09-12T09:12:02.438Z] 	at org.eclipse.jface.dialogs.ErrorDialog.open(ErrorDialog.java:341)
05:12:02 [2021-09-12T09:12:02.438Z] 	at org.eclipse.jface.dialogs.ErrorDialog.openError(ErrorDialog.java:406)
05:12:02 [2021-09-12T09:12:02.438Z] 	at org.eclipse.jface.dialogs.ErrorDialog.openError(ErrorDialog.java:377)
05:12:02 [2021-09-12T09:12:02.438Z] 	at org.eclipse.tracecompass.internal.tmf.ui.project.wizards.tracepkg.AbstractTracePackageWizardPage.displayErrorDialog(AbstractTracePackageWizardPage.java:438)
05:12:02 [2021-09-12T09:12:02.438Z] 	at org.eclipse.tracecompass.internal.tmf.ui.project.wizards.tracepkg.AbstractTracePackageWizardPage.handleError(AbstractTracePackageWizardPage.java:414)
05:12:02 [2021-09-12T09:12:02.438Z] 	at org.eclipse.tracecompass.internal.tmf.ui.project.wizards.tracepkg.AbstractTracePackageWizardPage.handleErrorStatus(AbstractTracePackageWizardPage.java:361)
05:12:02 [2021-09-12T09:12:02.438Z] 	at org.eclipse.tracecompass.internal.tmf.remote.ui.wizards.fetch.RemoteFetchLogWizardRemotePage.createElementViewerInput(RemoteFetchLogWizardRemotePage.java:414)
05:12:02 [2021-09-12T09:12:02.438Z] 	at org.eclipse.tracecompass.internal.tmf.remote.ui.wizards.fetch.RemoteFetchLogWizardRemotePage.updateViewer(RemoteFetchLogWizardRemotePage.java:575)
05:12:02 [2021-09-12T09:12:02.438Z] 	at org.eclipse.tracecompass.internal.tmf.remote.ui.wizards.fetch.RemoteFetchLogWizardRemotePage.finish(RemoteFetchLogWizardRemotePage.java:471)
05:12:02 [2021-09-12T09:12:02.438Z] 	at org.eclipse.tracecompass.internal.tmf.remote.ui.wizards.fetch.RemoteFetchLogWizard.performFinish(RemoteFetchLogWizard.java:114)
05:12:02 [2021-09-12T09:12:02.438Z] 	at org.eclipse.jface.wizard.WizardDialog.finishPressed(WizardDialog.java:832)
05:12:02 [2021-09-12T09:12:02.438Z] 	at org.eclipse.jface.wizard.WizardDialog.buttonPressed(WizardDialog.java:472)
05:12:02 [2021-09-12T09:12:02.438Z] 	at org.eclipse.jface.dialogs.Dialog.lambda$0(Dialog.java:619)
05:12:02 [2021-09-12T09:12:02.438Z] 	at org.eclipse.swt.events.SelectionListener$1.widgetSelected(SelectionListener.java:84)
05:12:02 [2021-09-12T09:12:02.438Z] 	at org.eclipse.swt.widgets.TypedListener.handleEvent(TypedListener.java:252)
05:12:02 [2021-09-12T09:12:02.438Z] 	at org.eclipse.swt.widgets.EventTable.sendEvent(EventTable.java:89)
05:12:02 [2021-09-12T09:12:02.438Z] 	at org.eclipse.swt.widgets.Display.sendEvent(Display.java:5884)
05:12:02 [2021-09-12T09:12:02.438Z] 	at org.eclipse.swt.widgets.Widget.sendEvent(Widget.java:1522)
05:12:02 [2021-09-12T09:12:02.438Z] 	at org.eclipse.swt.widgets.Widget.sendEvent(Widget.java:1548)
05:12:02 [2021-09-12T09:12:02.438Z] 	at org.eclipse.swt.widgets.Widget.sendEvent(Widget.java:1531)
05:12:02 [2021-09-12T09:12:02.438Z] 	at org.eclipse.swt.widgets.Widget.notifyListeners(Widget.java:1310)
05:12:02 [2021-09-12T09:12:02.438Z] 	at org.eclipse.swtbot.swt.finder.widgets.AbstractSWTBot$2.run(AbstractSWTBot.java:192)
05:12:02 [2021-09-12T09:12:02.438Z] 	at org.eclipse.swtbot.swt.finder.finders.UIThreadRunnable$5.doRun(UIThreadRunnable.java:224)
05:12:02 [2021-09-12T09:12:02.438Z] 	at org.eclipse.swtbot.swt.finder.finders.UIThreadRunnable$1.run(UIThreadRunnable.java:90)
05:12:02 [2021-09-12T09:12:02.438Z] 	at org.eclipse.swt.widgets.RunnableLock.run(RunnableLock.java:40)
05:12:02 [2021-09-12T09:12:02.438Z] 	at org.eclipse.swt.widgets.Synchronizer.runAsyncMessages(Synchronizer.java:185)
05:12:02 [2021-09-12T09:12:02.438Z] 	at org.eclipse.swt.widgets.Display.runAsyncMessages(Display.java:5101)
05:12:02 [2021-09-12T09:12:02.438Z] 	at org.eclipse.swt.widgets.Display.readAndDispatch(Display.java:4579)
05:12:02 [2021-09-12T09:12:02.438Z] 	at org.eclipse.jface.window.Window.runEventLoop(Window.java:823)
05:12:02 [2021-09-12T09:12:02.438Z] 	at org.eclipse.jface.window.Window.open(Window.java:799)
05:12:02 [2021-09-12T09:12:02.438Z] 	at org.eclipse.tracecompass.internal.tmf.remote.ui.wizards.fetch.RemoteFetchLogHandler.execute(RemoteFetchLogHandler.java:54)
05:12:02 [2021-09-12T09:12:02.438Z] 	at org.eclipse.ui.internal.handlers.HandlerProxy.execute(HandlerProxy.java:283)
05:12:02 [2021-09-12T09:12:02.438Z] 	at org.eclipse.ui.internal.handlers.E4HandlerProxy.execute(E4HandlerProxy.java:97)
05:12:02 [2021-09-12T09:12:02.438Z] 	at jdk.internal.reflect.GeneratedMethodAccessor80.invoke(Unknown Source)
05:12:02 [2021-09-12T09:12:02.438Z] 	at java.base/jdk.internal.reflect.DelegatingMethodAccessorImpl.invoke(DelegatingMethodAccessorImpl.java:43)
05:12:02 [2021-09-12T09:12:02.438Z] 	at java.base/java.lang.reflect.Method.invoke(Method.java:566)
05:12:02 [2021-09-12T09:12:02.438Z] 	at org.eclipse.e4.core.internal.di.MethodRequestor.execute(MethodRequestor.java:58)
05:12:02 [2021-09-12T09:12:02.438Z] 	at org.eclipse.e4.core.internal.di.InjectorImpl.invokeUsingClass(InjectorImpl.java:317)
05:12:02 [2021-09-12T09:12:02.438Z] 	at org.eclipse.e4.core.internal.di.InjectorImpl.invoke(InjectorImpl.java:251)
05:12:02 [2021-09-12T09:12:02.438Z] 	at org.eclipse.e4.core.contexts.ContextInjectionFactory.invoke(ContextInjectionFactory.java:173)
05:12:02 [2021-09-12T09:12:02.438Z] 	at org.eclipse.e4.core.commands.internal.HandlerServiceHandler.execute(HandlerServiceHandler.java:156)
05:12:02 [2021-09-12T09:12:02.438Z] 	at org.eclipse.core.commands.Command.executeWithChecks(Command.java:488)
05:12:02 [2021-09-12T09:12:02.438Z] 	at org.eclipse.core.commands.ParameterizedCommand.executeWithChecks(ParameterizedCommand.java:487)
05:12:02 [2021-09-12T09:12:02.438Z] 	at org.eclipse.e4.core.commands.internal.HandlerServiceImpl.executeHandler(HandlerServiceImpl.java:213)
05:12:02 [2021-09-12T09:12:02.438Z] 	at org.eclipse.e4.ui.workbench.renderers.swt.HandledContributionItem.executeItem(HandledContributionItem.java:438)
05:12:02 [2021-09-12T09:12:02.438Z] 	at org.eclipse.e4.ui.workbench.renderers.swt.AbstractContributionItem.handleWidgetSelection(AbstractContributionItem.java:449)
05:12:02 [2021-09-12T09:12:02.438Z] 	at org.eclipse.e4.ui.workbench.renderers.swt.AbstractContributionItem.lambda$2(AbstractContributionItem.java:475)
05:12:02 [2021-09-12T09:12:02.438Z] 	at org.eclipse.swt.widgets.EventTable.sendEvent(EventTable.java:89)
05:12:02 [2021-09-12T09:12:02.438Z] 	at org.eclipse.swt.widgets.Display.sendEvent(Display.java:5884)
05:12:02 [2021-09-12T09:12:02.439Z] 	at org.eclipse.swt.widgets.Widget.sendEvent(Widget.java:1522)
05:12:02 [2021-09-12T09:12:02.439Z] 	at org.eclipse.swt.widgets.Widget.sendEvent(Widget.java:1548)
05:12:02 [2021-09-12T09:12:02.439Z] 	at org.eclipse.swt.widgets.Widget.sendEvent(Widget.java:1531)
05:12:02 [2021-09-12T09:12:02.439Z] 	at org.eclipse.swt.widgets.Widget.notifyListeners(Widget.java:1310)
05:12:02 [2021-09-12T09:12:02.439Z] 	at org.eclipse.swtbot.swt.finder.widgets.AbstractSWTBot$2.run(AbstractSWTBot.java:192)
05:12:02 [2021-09-12T09:12:02.439Z] 	at org.eclipse.swtbot.swt.finder.finders.UIThreadRunnable$5.doRun(UIThreadRunnable.java:224)
05:12:02 [2021-09-12T09:12:02.439Z] 	at org.eclipse.swtbot.swt.finder.finders.UIThreadRunnable.run(UIThreadRunnable.java:78)
05:12:02 [2021-09-12T09:12:02.439Z] 	at org.eclipse.swtbot.swt.finder.finders.UIThreadRunnable.asyncExec(UIThreadRunnable.java:226)
05:12:02 [2021-09-12T09:12:02.439Z] 	at org.eclipse.swtbot.swt.finder.widgets.AbstractSWTBot.asyncExec(AbstractSWTBot.java:658)
05:12:02 [2021-09-12T09:12:02.439Z] 	at org.eclipse.swtbot.swt.finder.widgets.AbstractSWTBot.notify(AbstractSWTBot.java:177)
05:12:02 [2021-09-12T09:12:02.439Z] 	at org.eclipse.swtbot.swt.finder.widgets.AbstractSWTBot.notify(AbstractSWTBot.java:155)
05:12:02 [2021-09-12T09:12:02.439Z] 	at org.eclipse.swtbot.swt.finder.widgets.AbstractSWTBot.notify(AbstractSWTBot.java:144)
05:12:02 [2021-09-12T09:12:02.439Z] 	at org.eclipse.swtbot.swt.finder.widgets.AbstractSWTBot.notify(AbstractSWTBot.java:134)
05:12:02 [2021-09-12T09:12:02.439Z] 	at org.eclipse.swtbot.swt.finder.widgets.SWTBotMenu$1.run(SWTBotMenu.java:90)
05:12:02 [2021-09-12T09:12:02.439Z] 	at org.eclipse.swtbot.swt.finder.finders.UIThreadRunnable$5.doRun(UIThreadRunnable.java:224)
05:12:02 [2021-09-12T09:12:02.439Z] 	at org.eclipse.swtbot.swt.finder.finders.UIThreadRunnable$1.run(UIThreadRunnable.java:90)
05:12:02 [2021-09-12T09:12:02.439Z] 	at org.eclipse.swt.widgets.RunnableLock.run(RunnableLock.java:40)
05:12:02 [2021-09-12T09:12:02.439Z] 	at org.eclipse.swt.widgets.Synchronizer.runAsyncMessages(Synchronizer.java:185)
05:12:02 [2021-09-12T09:12:02.439Z] 	at org.eclipse.swt.widgets.Display.runAsyncMessages(Display.java:5101)
05:12:02 [2021-09-12T09:12:02.439Z] 	at org.eclipse.swt.widgets.Display.readAndDispatch(Display.java:4579)
05:12:02 [2021-09-12T09:12:02.439Z] 	at org.eclipse.e4.ui.internal.workbench.swt.PartRenderingEngine$5.run(PartRenderingEngine.java:1150)
05:12:02 [2021-09-12T09:12:02.439Z] 	at org.eclipse.core.databinding.observable.Realm.runWithDefault(Realm.java:338)
05:12:02 [2021-09-12T09:12:02.439Z] 	at org.eclipse.e4.ui.internal.workbench.swt.PartRenderingEngine.run(PartRenderingEngine.java:1041)
05:12:02 [2021-09-12T09:12:02.439Z] 	at org.eclipse.e4.ui.internal.workbench.E4Workbench.createAndRunUI(E4Workbench.java:155)
05:12:02 [2021-09-12T09:12:02.439Z] 	at org.eclipse.ui.internal.Workbench.lambda$3(Workbench.java:644)
05:12:02 [2021-09-12T09:12:02.439Z] 	at org.eclipse.core.databinding.observable.Realm.runWithDefault(Realm.java:338)
05:12:02 [2021-09-12T09:12:02.439Z] 	at org.eclipse.ui.internal.Workbench.createAndRunWorkbench(Workbench.java:551)
05:12:02 [2021-09-12T09:12:02.439Z] 	at org.eclipse.ui.PlatformUI.createAndRunWorkbench(PlatformUI.java:156)
05:12:02 [2021-09-12T09:12:02.439Z] 	at org.eclipse.ui.internal.ide.application.IDEApplication.start(IDEApplication.java:152)
05:12:02 [2021-09-12T09:12:02.439Z] 	at org.eclipse.tycho.surefire.osgibooter.UITestApplication.runApplication(UITestApplication.java:29)
05:12:02 [2021-09-12T09:12:02.439Z] 	at org.eclipse.tycho.surefire.osgibooter.AbstractUITestApplication.run(AbstractUITestApplication.java:122)
05:12:02 [2021-09-12T09:12:02.439Z] 	at org.eclipse.tycho.surefire.osgibooter.UITestApplication.start(UITestApplication.java:35)
05:12:02 [2021-09-12T09:12:02.439Z] 	at org.eclipse.equinox.internal.app.EclipseAppHandle.run(EclipseAppHandle.java:203)
05:12:02 [2021-09-12T09:12:02.439Z] 	at org.eclipse.core.runtime.internal.adaptor.EclipseAppLauncher.runApplication(EclipseAppLauncher.java:136)
05:12:02 [2021-09-12T09:12:02.439Z] 	at org.eclipse.core.runtime.internal.adaptor.EclipseAppLauncher.start(EclipseAppLauncher.java:104)
05:12:02 [2021-09-12T09:12:02.439Z] 	at org.eclipse.core.runtime.adaptor.EclipseStarter.run(EclipseStarter.java:401)
05:12:02 [2021-09-12T09:12:02.439Z] 	at org.eclipse.core.runtime.adaptor.EclipseStarter.run(EclipseStarter.java:255)
05:12:02 [2021-09-12T09:12:02.439Z] 	at java.base/jdk.internal.reflect.NativeMethodAccessorImpl.invoke0(Native Method)
05:12:02 [2021-09-12T09:12:02.439Z] 	at java.base/jdk.internal.reflect.NativeMethodAccessorImpl.invoke(NativeMethodAccessorImpl.java:62)
05:12:02 [2021-09-12T09:12:02.439Z] 	at java.base/jdk.internal.reflect.DelegatingMethodAccessorImpl.invoke(DelegatingMethodAccessorImpl.java:43)
05:12:02 [2021-09-12T09:12:02.439Z] 	at java.base/java.lang.reflect.Method.invoke(Method.java:566)
05:12:02 [2021-09-12T09:12:02.439Z] 	at org.eclipse.equinox.launcher.Main.invokeFramework(Main.java:659)
05:12:02 [2021-09-12T09:12:02.439Z] 	at org.eclipse.equinox.launcher.Main.basicRun(Main.java:596)
05:12:02 [2021-09-12T09:12:02.439Z] 	at org.eclipse.equinox.launcher.Main.run(Main.java:1467)
05:12:02 [2021-09-12T09:12:02.439Z] 	at org.eclipse.equinox.launcher.Main.main(Main.java:1440)
05:12:02 [2021-09-12T09:12:02.439Z] !SUBENTRY 1 org.eclipse.tracecompass.tmf.ui 4 4 2021-09-12 09:11:58.994
05:12:02 [2021-09-12T09:12:02.439Z] !MESSAGE Cannot connect Unknown
05:12:02 [2021-09-12T09:12:02.439Z] !STACK 1
05:12:02 [2021-09-12T09:12:02.439Z] org.eclipse.core.runtime.CoreException: org.eclipse.core.commands.ExecutionException: Cannot connect Unknown
05:12:02 [2021-09-12T09:12:02.439Z] 	at org.eclipse.tracecompass.tmf.remote.core.proxy.RemoteSystemProxy.connect(RemoteSystemProxy.java:90)
05:12:02 [2021-09-12T09:12:02.439Z] 	at org.eclipse.tracecompass.internal.tmf.remote.ui.wizards.fetch.model.RemoteImportConnectionNodeElement.connect(RemoteImportConnectionNodeElement.java:143)
05:12:02 [2021-09-12T09:12:02.439Z] 	at org.eclipse.tracecompass.internal.tmf.remote.ui.wizards.fetch.RemoteFetchLogWizardRemotePage$6.run(RemoteFetchLogWizardRemotePage.java:392)
05:12:02 [2021-09-12T09:12:02.439Z] 	at org.eclipse.jface.operation.ModalContext$ModalContextThread.run(ModalContext.java:122)
05:12:02 [2021-09-12T09:12:02.439Z] Caused by: org.eclipse.remote.core.exception.RemoteConnectionException: Session.connect: java.net.UnknownHostException: unknown.unknown.unknown
05:12:02 [2021-09-12T09:12:02.439Z] 	at org.eclipse.remote.internal.jsch.core.JSchConnection.newSession(JSchConnection.java:715)
05:12:02 [2021-09-12T09:12:02.439Z] 	at org.eclipse.remote.internal.jsch.core.JSchConnection.open(JSchConnection.java:748)
05:12:02 [2021-09-12T09:12:02.439Z] 	at org.eclipse.remote.internal.jsch.core.JSchConnection.open(JSchConnection.java:721)
05:12:02 [2021-09-12T09:12:02.439Z] 	at org.eclipse.remote.internal.core.RemoteConnection.open(RemoteConnection.java:163)
05:12:02 [2021-09-12T09:12:02.439Z] 	at org.eclipse.tracecompass.tmf.remote.core.proxy.RemoteSystemProxy.connect(RemoteSystemProxy.java:86)
05:12:02 [2021-09-12T09:12:02.439Z] 	... 3 more
05:12:02 [2021-09-12T09:12:02.439Z] 
05:12:02 [2021-09-12T09:12:02.439Z] 	at org.eclipse.tracecompass.internal.tmf.ui.project.wizards.tracepkg.AbstractTracePackageWizardPage.displayErrorDialog(AbstractTracePackageWizardPage.java:436)
05:12:02 [2021-09-12T09:12:02.439Z] 	at org.eclipse.tracecompass.internal.tmf.ui.project.wizards.tracepkg.AbstractTracePackageWizardPage.handleError(AbstractTracePackageWizardPage.java:414)
05:12:02 [2021-09-12T09:12:02.439Z] 	at org.eclipse.tracecompass.internal.tmf.ui.project.wizards.tracepkg.AbstractTracePackageWizardPage.handleErrorStatus(AbstractTracePackageWizardPage.java:361)
05:12:02 [2021-09-12T09:12:02.439Z] 	at org.eclipse.tracecompass.internal.tmf.remote.ui.wizards.fetch.RemoteFetchLogWizardRemotePage.createElementViewerInput(RemoteFetchLogWizardRemotePage.java:414)
05:12:02 [2021-09-12T09:12:02.439Z] 	at org.eclipse.tracecompass.internal.tmf.remote.ui.wizards.fetch.RemoteFetchLogWizardRemotePage.updateViewer(RemoteFetchLogWizardRemotePage.java:575)
05:12:02 [2021-09-12T09:12:02.439Z] 	at org.eclipse.tracecompass.internal.tmf.remote.ui.wizards.fetch.RemoteFetchLogWizardRemotePage.finish(RemoteFetchLogWizardRemotePage.java:471)
05:12:02 [2021-09-12T09:12:02.439Z] 	at org.eclipse.tracecompass.internal.tmf.remote.ui.wizards.fetch.RemoteFetchLogWizard.performFinish(RemoteFetchLogWizard.java:114)
05:12:02 [2021-09-12T09:12:02.439Z] 	at org.eclipse.jface.wizard.WizardDialog.finishPressed(WizardDialog.java:832)
05:12:02 [2021-09-12T09:12:02.439Z] 	at org.eclipse.jface.wizard.WizardDialog.buttonPressed(WizardDialog.java:472)
05:12:02 [2021-09-12T09:12:02.439Z] 	at org.eclipse.jface.dialogs.Dialog.lambda$0(Dialog.java:619)
05:12:02 [2021-09-12T09:12:02.439Z] 	at org.eclipse.swt.events.SelectionListener$1.widgetSelected(SelectionListener.java:84)
05:12:02 [2021-09-12T09:12:02.439Z] 	at org.eclipse.swt.widgets.TypedListener.handleEvent(TypedListener.java:252)
05:12:02 [2021-09-12T09:12:02.439Z] 	at org.eclipse.swt.widgets.EventTable.sendEvent(EventTable.java:89)
05:12:02 [2021-09-12T09:12:02.439Z] 	at org.eclipse.swt.widgets.Display.sendEvent(Display.java:5884)
05:12:02 [2021-09-12T09:12:02.439Z] 	at org.eclipse.swt.widgets.Widget.sendEvent(Widget.java:1522)
05:12:02 [2021-09-12T09:12:02.439Z] 	at org.eclipse.swt.widgets.Widget.sendEvent(Widget.java:1548)
05:12:02 [2021-09-12T09:12:02.439Z] 	at org.eclipse.swt.widgets.Widget.sendEvent(Widget.java:1531)
05:12:02 [2021-09-12T09:12:02.439Z] 	at org.eclipse.swt.widgets.Widget.notifyListeners(Widget.java:1310)
05:12:02 [2021-09-12T09:12:02.439Z] 	at org.eclipse.swtbot.swt.finder.widgets.AbstractSWTBot$2.run(AbstractSWTBot.java:192)
05:12:02 [2021-09-12T09:12:02.439Z] 	at org.eclipse.swtbot.swt.finder.finders.UIThreadRunnable$5.doRun(UIThreadRunnable.java:224)
05:12:02 [2021-09-12T09:12:02.439Z] 	at org.eclipse.swtbot.swt.finder.finders.UIThreadRunnable$1.run(UIThreadRunnable.java:90)
05:12:02 [2021-09-12T09:12:02.439Z] 	at org.eclipse.swt.widgets.RunnableLock.run(RunnableLock.java:40)
05:12:02 [2021-09-12T09:12:02.439Z] 	at org.eclipse.swt.widgets.Synchronizer.runAsyncMessages(Synchronizer.java:185)
05:12:02 [2021-09-12T09:12:02.439Z] 	at org.eclipse.swt.widgets.Display.runAsyncMessages(Display.java:5101)
05:12:02 [2021-09-12T09:12:02.439Z] 	at org.eclipse.swt.widgets.Display.readAndDispatch(Display.java:4579)
05:12:02 [2021-09-12T09:12:02.439Z] 	at org.eclipse.jface.window.Window.runEventLoop(Window.java:823)
05:12:02 [2021-09-12T09:12:02.439Z] 	at org.eclipse.jface.window.Window.open(Window.java:799)
05:12:02 [2021-09-12T09:12:02.439Z] 	at org.eclipse.tracecompass.internal.tmf.remote.ui.wizards.fetch.RemoteFetchLogHandler.execute(RemoteFetchLogHandler.java:54)
05:12:02 [2021-09-12T09:12:02.439Z] 	at org.eclipse.ui.internal.handlers.HandlerProxy.execute(HandlerProxy.java:283)
05:12:02 [2021-09-12T09:12:02.439Z] 	at org.eclipse.ui.internal.handlers.E4HandlerProxy.execute(E4HandlerProxy.java:97)
05:12:02 [2021-09-12T09:12:02.439Z] 	at jdk.internal.reflect.GeneratedMethodAccessor80.invoke(Unknown Source)
05:12:02 [2021-09-12T09:12:02.439Z] 	at java.base/jdk.internal.reflect.DelegatingMethodAccessorImpl.invoke(DelegatingMethodAccessorImpl.java:43)
05:12:02 [2021-09-12T09:12:02.439Z] 	at java.base/java.lang.reflect.Method.invoke(Method.java:566)
05:12:02 [2021-09-12T09:12:02.439Z] 	at org.eclipse.e4.core.internal.di.MethodRequestor.execute(MethodRequestor.java:58)
05:12:02 [2021-09-12T09:12:02.439Z] 	at org.eclipse.e4.core.internal.di.InjectorImpl.invokeUsingClass(InjectorImpl.java:317)
05:12:02 [2021-09-12T09:12:02.439Z] 	at org.eclipse.e4.core.internal.di.InjectorImpl.invoke(InjectorImpl.java:251)
05:12:02 [2021-09-12T09:12:02.439Z] 	at org.eclipse.e4.core.contexts.ContextInjectionFactory.invoke(ContextInjectionFactory.java:173)
05:12:02 [2021-09-12T09:12:02.439Z] 	at org.eclipse.e4.core.commands.internal.HandlerServiceHandler.execute(HandlerServiceHandler.java:156)
05:12:02 [2021-09-12T09:12:02.439Z] 	at org.eclipse.core.commands.Command.executeWithChecks(Command.java:488)
05:12:02 [2021-09-12T09:12:02.439Z] 	at org.eclipse.core.commands.ParameterizedCommand.executeWithChecks(ParameterizedCommand.java:487)
05:12:02 [2021-09-12T09:12:02.439Z] 	at org.eclipse.e4.core.commands.internal.HandlerServiceImpl.executeHandler(HandlerServiceImpl.java:213)
05:12:02 [2021-09-12T09:12:02.439Z] 	at org.eclipse.e4.ui.workbench.renderers.swt.HandledContributionItem.executeItem(HandledContributionItem.java:438)
05:12:02 [2021-09-12T09:12:02.439Z] 	at org.eclipse.e4.ui.workbench.renderers.swt.AbstractContributionItem.handleWidgetSelection(AbstractContributionItem.java:449)
05:12:02 [2021-09-12T09:12:02.439Z] 	at org.eclipse.e4.ui.workbench.renderers.swt.AbstractContributionItem.lambda$2(AbstractContributionItem.java:475)
05:12:02 [2021-09-12T09:12:02.439Z] 	at org.eclipse.swt.widgets.EventTable.sendEvent(EventTable.java:89)
05:12:02 [2021-09-12T09:12:02.439Z] 	at org.eclipse.swt.widgets.Display.sendEvent(Display.java:5884)
05:12:02 [2021-09-12T09:12:02.439Z] 	at org.eclipse.swt.widgets.Widget.sendEvent(Widget.java:1522)
05:12:02 [2021-09-12T09:12:02.439Z] 	at org.eclipse.swt.widgets.Widget.sendEvent(Widget.java:1548)
05:12:02 [2021-09-12T09:12:02.439Z] 	at org.eclipse.swt.widgets.Widget.sendEvent(Widget.java:1531)
05:12:02 [2021-09-12T09:12:02.440Z] 	at org.eclipse.swt.widgets.Widget.notifyListeners(Widget.java:1310)
05:12:02 [2021-09-12T09:12:02.440Z] 	at org.eclipse.swtbot.swt.finder.widgets.AbstractSWTBot$2.run(AbstractSWTBot.java:192)
05:12:02 [2021-09-12T09:12:02.440Z] 	at org.eclipse.swtbot.swt.finder.finders.UIThreadRunnable$5.doRun(UIThreadRunnable.java:224)
05:12:02 [2021-09-12T09:12:02.440Z] 	at org.eclipse.swtbot.swt.finder.finders.UIThreadRunnable.run(UIThreadRunnable.java:78)
05:12:02 [2021-09-12T09:12:02.440Z] 	at org.eclipse.swtbot.swt.finder.finders.UIThreadRunnable.asyncExec(UIThreadRunnable.java:226)
05:12:02 [2021-09-12T09:12:02.440Z] 	at org.eclipse.swtbot.swt.finder.widgets.AbstractSWTBot.asyncExec(AbstractSWTBot.java:658)
05:12:02 [2021-09-12T09:12:02.440Z] 	at org.eclipse.swtbot.swt.finder.widgets.AbstractSWTBot.notify(AbstractSWTBot.java:177)
05:12:02 [2021-09-12T09:12:02.440Z] 	at org.eclipse.swtbot.swt.finder.widgets.AbstractSWTBot.notify(AbstractSWTBot.java:155)
05:12:02 [2021-09-12T09:12:02.440Z] 	at org.eclipse.swtbot.swt.finder.widgets.AbstractSWTBot.notify(AbstractSWTBot.java:144)
05:12:02 [2021-09-12T09:12:02.440Z] 	at org.eclipse.swtbot.swt.finder.widgets.AbstractSWTBot.notify(AbstractSWTBot.java:134)
05:12:02 [2021-09-12T09:12:02.440Z] 	at org.eclipse.swtbot.swt.finder.widgets.SWTBotMenu$1.run(SWTBotMenu.java:90)
05:12:02 [2021-09-12T09:12:02.440Z] 	at org.eclipse.swtbot.swt.finder.finders.UIThreadRunnable$5.doRun(UIThreadRunnable.java:224)
05:12:02 [2021-09-12T09:12:02.440Z] 	at org.eclipse.swtbot.swt.finder.finders.UIThreadRunnable$1.run(UIThreadRunnable.java:90)
05:12:02 [2021-09-12T09:12:02.440Z] 	at org.eclipse.swt.widgets.RunnableLock.run(RunnableLock.java:40)
05:12:02 [2021-09-12T09:12:02.440Z] 	at org.eclipse.swt.widgets.Synchronizer.runAsyncMessages(Synchronizer.java:185)
05:12:02 [2021-09-12T09:12:02.440Z] 	at org.eclipse.swt.widgets.Display.runAsyncMessages(Display.java:5101)
05:12:02 [2021-09-12T09:12:02.440Z] 	at org.eclipse.swt.widgets.Display.readAndDispatch(Display.java:4579)
05:12:02 [2021-09-12T09:12:02.440Z] 	at org.eclipse.e4.ui.internal.workbench.swt.PartRenderingEngine$5.run(PartRenderingEngine.java:1150)
05:12:02 [2021-09-12T09:12:02.440Z] 	at org.eclipse.core.databinding.observable.Realm.runWithDefault(Realm.java:338)
05:12:02 [2021-09-12T09:12:02.440Z] 	at org.eclipse.e4.ui.internal.workbench.swt.PartRenderingEngine.run(PartRenderingEngine.java:1041)
05:12:02 [2021-09-12T09:12:02.440Z] 	at org.eclipse.e4.ui.internal.workbench.E4Workbench.createAndRunUI(E4Workbench.java:155)
05:12:02 [2021-09-12T09:12:02.440Z] 	at org.eclipse.ui.internal.Workbench.lambda$3(Workbench.java:644)
05:12:02 [2021-09-12T09:12:02.440Z] 	at org.eclipse.core.databinding.observable.Realm.runWithDefault(Realm.java:338)
05:12:02 [2021-09-12T09:12:02.440Z] 	at org.eclipse.ui.internal.Workbench.createAndRunWorkbench(Workbench.java:551)
05:12:02 [2021-09-12T09:12:02.440Z] 	at org.eclipse.ui.PlatformUI.createAndRunWorkbench(PlatformUI.java:156)
05:12:02 [2021-09-12T09:12:02.440Z] 	at org.eclipse.ui.internal.ide.application.IDEApplication.start(IDEApplication.java:152)
05:12:02 [2021-09-12T09:12:02.440Z] 	at org.eclipse.tycho.surefire.osgibooter.UITestApplication.runApplication(UITestApplication.java:29)
05:12:02 [2021-09-12T09:12:02.440Z] 	at org.eclipse.tycho.surefire.osgibooter.AbstractUITestApplication.run(AbstractUITestApplication.java:122)
05:12:02 [2021-09-12T09:12:02.440Z] 	at org.eclipse.tycho.surefire.osgibooter.UITestApplication.start(UITestApplication.java:35)
05:12:02 [2021-09-12T09:12:02.440Z] 	at org.eclipse.equinox.internal.app.EclipseAppHandle.run(EclipseAppHandle.java:203)
05:12:02 [2021-09-12T09:12:02.440Z] 	at org.eclipse.core.runtime.internal.adaptor.EclipseAppLauncher.runApplication(EclipseAppLauncher.java:136)
05:12:02 [2021-09-12T09:12:02.440Z] 	at org.eclipse.core.runtime.internal.adaptor.EclipseAppLauncher.start(EclipseAppLauncher.java:104)
05:12:02 [2021-09-12T09:12:02.440Z] 	at org.eclipse.core.runtime.adaptor.EclipseStarter.run(EclipseStarter.java:401)
05:12:02 [2021-09-12T09:12:02.440Z] 	at org.eclipse.core.runtime.adaptor.EclipseStarter.run(EclipseStarter.java:255)
05:12:02 [2021-09-12T09:12:02.440Z] 	at java.base/jdk.internal.reflect.NativeMethodAccessorImpl.invoke0(Native Method)
05:12:02 [2021-09-12T09:12:02.440Z] 	at java.base/jdk.internal.reflect.NativeMethodAccessorImpl.invoke(NativeMethodAccessorImpl.java:62)
05:12:02 [2021-09-12T09:12:02.440Z] 	at java.base/jdk.internal.reflect.DelegatingMethodAccessorImpl.invoke(DelegatingMethodAccessorImpl.java:43)
05:12:02 [2021-09-12T09:12:02.440Z] 	at java.base/java.lang.reflect.Method.invoke(Method.java:566)
05:12:02 [2021-09-12T09:12:02.440Z] 	at org.eclipse.equinox.launcher.Main.invokeFramework(Main.java:659)
05:12:02 [2021-09-12T09:12:02.440Z] 	at org.eclipse.equinox.launcher.Main.basicRun(Main.java:596)
05:12:02 [2021-09-12T09:12:02.440Z] 	at org.eclipse.equinox.launcher.Main.run(Main.java:1467)
05:12:02 [2021-09-12T09:12:02.440Z] 	at org.eclipse.equinox.launcher.Main.main(Main.java:1440)
05:12:02 [2021-09-12T09:12:02.440Z] Caused by: org.eclipse.core.commands.ExecutionException: Cannot connect Unknown
05:12:02 [2021-09-12T09:12:02.440Z] 	at org.eclipse.tracecompass.tmf.remote.core.proxy.RemoteSystemProxy.connect(RemoteSystemProxy.java:90)
05:12:02 [2021-09-12T09:12:02.440Z] 	at org.eclipse.tracecompass.internal.tmf.remote.ui.wizards.fetch.model.RemoteImportConnectionNodeElement.connect(RemoteImportConnectionNodeElement.java:143)
05:12:02 [2021-09-12T09:12:02.440Z] 	at org.eclipse.tracecompass.internal.tmf.remote.ui.wizards.fetch.RemoteFetchLogWizardRemotePage$6.run(RemoteFetchLogWizardRemotePage.java:392)
05:12:02 [2021-09-12T09:12:02.440Z] 	at org.eclipse.jface.operation.ModalContext$ModalContextThread.run(ModalContext.java:122)
05:12:02 [2021-09-12T09:12:02.440Z] Caused by: org.eclipse.remote.core.exception.RemoteConnectionException: Session.connect: java.net.UnknownHostException: unknown.unknown.unknown
05:12:02 [2021-09-12T09:12:02.440Z] 	at org.eclipse.remote.internal.jsch.core.JSchConnection.newSession(JSchConnection.java:715)
05:12:02 [2021-09-12T09:12:02.440Z] 	at org.eclipse.remote.internal.jsch.core.JSchConnection.open(JSchConnection.java:748)
05:12:02 [2021-09-12T09:12:02.440Z] 	at org.eclipse.remote.internal.jsch.core.JSchConnection.open(JSchConnection.java:721)
05:12:02 [2021-09-12T09:12:02.440Z] 	at org.eclipse.remote.internal.core.RemoteConnection.open(RemoteConnection.java:163)
05:12:02 [2021-09-12T09:12:02.440Z] 	at org.eclipse.tracecompass.tmf.remote.core.proxy.RemoteSystemProxy.connect(RemoteSystemProxy.java:86)
05:12:02 [2021-09-12T09:12:02.440Z] 	... 3 more
05:12:02 [2021-09-12T09:12:02.440Z] !SUBENTRY 2 org.eclipse.tracecompass.tmf.ui 4 4 2021-09-12 09:11:58.995
05:12:02 [2021-09-12T09:12:02.440Z] !MESSAGE org.eclipse.core.commands.ExecutionException: Cannot connect Unknown
05:12:02 [2021-09-12T09:12:02.440Z] 	at org.eclipse.tracecompass.tmf.remote.core.proxy.RemoteSystemProxy.connect(RemoteSystemProxy.java:90)
05:12:02 [2021-09-12T09:12:02.440Z] 	at org.eclipse.tracecompass.internal.tmf.remote.ui.wizards.fetch.model.RemoteImportConnectionNodeElement.connect(RemoteImportConnectionNodeElement.java:143)
05:12:02 [2021-09-12T09:12:02.440Z] 	at org.eclipse.tracecompass.internal.tmf.remote.ui.wizards.fetch.RemoteFetchLogWizardRemotePage$6.run(RemoteFetchLogWizardRemotePage.java:392)
05:12:02 [2021-09-12T09:12:02.440Z] 	at org.eclipse.jface.operation.ModalContext$ModalContextThread.run(ModalContext.java:122)
05:12:02 [2021-09-12T09:12:02.440Z] Caused by: org.eclipse.remote.core.exception.RemoteConnectionException: Session.connect: java.net.UnknownHostException: unknown.unknown.unknown
05:12:02 [2021-09-12T09:12:02.440Z] 	at org.eclipse.remote.internal.jsch.core.JSchConnection.newSession(JSchConnection.java:715)
05:12:02 [2021-09-12T09:12:02.440Z] 	at org.eclipse.remote.internal.jsch.core.JSchConnection.open(JSchConnection.java:748)
05:12:02 [2021-09-12T09:12:02.440Z] 	at org.eclipse.remote.internal.jsch.core.JSchConnection.open(JSchConnection.java:721)
05:12:02 [2021-09-12T09:12:02.440Z] 	at org.eclipse.remote.internal.core.RemoteConnection.open(RemoteConnection.java:163)
05:12:02 [2021-09-12T09:12:02.440Z] 	at org.eclipse.tracecompass.tmf.remote.core.proxy.RemoteSystemProxy.connect(RemoteSystemProxy.java:86)
05:12:02 [2021-09-12T09:12:02.440Z] 	... 3 more
05:12:02 [2021-09-12T09:12:02.440Z] 
05:12:02 [2021-09-12T09:12:02.440Z] !STACK 0
05:12:02 [2021-09-12T09:12:02.440Z] org.eclipse.core.commands.ExecutionException: Cannot connect Unknown
05:12:02 [2021-09-12T09:12:02.440Z] 	at org.eclipse.tracecompass.tmf.remote.core.proxy.RemoteSystemProxy.connect(RemoteSystemProxy.java:90)
05:12:02 [2021-09-12T09:12:02.440Z] 	at org.eclipse.tracecompass.internal.tmf.remote.ui.wizards.fetch.model.RemoteImportConnectionNodeElement.connect(RemoteImportConnectionNodeElement.java:143)
05:12:02 [2021-09-12T09:12:02.440Z] 	at org.eclipse.tracecompass.internal.tmf.remote.ui.wizards.fetch.RemoteFetchLogWizardRemotePage$6.run(RemoteFetchLogWizardRemotePage.java:392)
05:12:02 [2021-09-12T09:12:02.440Z] 	at org.eclipse.jface.operation.ModalContext$ModalContextThread.run(ModalContext.java:122)
05:12:02 [2021-09-12T09:12:02.440Z] Caused by: org.eclipse.remote.core.exception.RemoteConnectionException: Session.connect: java.net.UnknownHostException: unknown.unknown.unknown
05:12:02 [2021-09-12T09:12:02.440Z] 	at org.eclipse.remote.internal.jsch.core.JSchConnection.newSession(JSchConnection.java:715)
05:12:02 [2021-09-12T09:12:02.440Z] 	at org.eclipse.remote.internal.jsch.core.JSchConnection.open(JSchConnection.java:748)
05:12:02 [2021-09-12T09:12:02.440Z] 	at org.eclipse.remote.internal.jsch.core.JSchConnection.open(JSchConnection.java:721)
05:12:02 [2021-09-12T09:12:02.440Z] 	at org.eclipse.remote.internal.core.RemoteConnection.open(RemoteConnection.java:163)
05:12:02 [2021-09-12T09:12:02.440Z] 	at org.eclipse.tracecompass.tmf.remote.core.proxy.RemoteSystemProxy.connect(RemoteSystemProxy.java:86)
05:12:02 [2021-09-12T09:12:02.440Z] 	... 3 more
05:12:14 [2021-09-12T09:12:14.615Z] Tests run: 20, Failures: 0, Errors: 1, Skipped: 1, Time elapsed: 92.876 s <<< FAILURE! - in org.eclipse.tracecompass.tmf.remote.ui.swtbot.tests.fetch.FetchRemoteTracesTest
05:12:14 [2021-09-12T09:12:14.615Z] testImportNothing  Time elapsed: 4.342 s
05:12:14 [2021-09-12T09:12:14.615Z] test_7_03  Time elapsed: 1.916 s
05:12:14 [2021-09-12T09:12:14.615Z] test_8_04  Time elapsed: 4.086 s
05:12:14 [2021-09-12T09:12:14.615Z] test_8_05  Time elapsed: 9.788 s
05:12:14 [2021-09-12T09:12:14.615Z] test_8_06  Time elapsed: 5.417 s
05:12:14 [2021-09-12T09:12:14.615Z] test_8_07  Time elapsed: 4.104 s
05:12:14 [2021-09-12T09:12:14.615Z] test_8_08  Time elapsed: 4.287 s
05:12:14 [2021-09-12T09:12:14.615Z] test_8_09  Time elapsed: 3.416 s
05:12:14 [2021-09-12T09:12:14.615Z] test_8_10  Time elapsed: 2.694 s
05:12:14 [2021-09-12T09:12:14.615Z] test_8_11  Time elapsed: 3.183 s
05:12:14 [2021-09-12T09:12:14.615Z] test_8_12  Time elapsed: 2.931 s
05:12:14 [2021-09-12T09:12:14.615Z] test_8_13  Time elapsed: 3.674 s
05:12:14 [2021-09-12T09:12:14.615Z] test_8_14  Time elapsed: 22.401 s  <<< ERROR!
05:12:14 [2021-09-12T09:12:14.615Z] org.eclipse.swtbot.swt.finder.exceptions.WidgetNotFoundException: Could not find widget matching: (of type 'Button' and with mnemonic 'Cancel' and with style 'SWT.PUSH')
05:12:14 [2021-09-12T09:12:14.615Z] 	at org.eclipse.swtbot.swt.finder.SWTBotFactory.waitUntilWidgetAppears(SWTBotFactory.java:473)
05:12:14 [2021-09-12T09:12:14.615Z] 	at org.eclipse.swtbot.swt.finder.SWTBot.waitUntilWidgetAppears(SWTBot.java:1)
05:12:14 [2021-09-12T09:12:14.615Z] 	at org.eclipse.swtbot.eclipse.finder.SWTWorkbenchBot.waitUntilWidgetAppears(SWTWorkbenchBot.java:1)
05:12:14 [2021-09-12T09:12:14.615Z] 	at org.eclipse.swtbot.swt.finder.SWTBotFactory.widget(SWTBotFactory.java:420)
05:12:14 [2021-09-12T09:12:14.615Z] 	at org.eclipse.swtbot.swt.finder.SWTBot.widget(SWTBot.java:1)
05:12:14 [2021-09-12T09:12:14.615Z] 	at org.eclipse.swtbot.eclipse.finder.SWTWorkbenchBot.widget(SWTWorkbenchBot.java:1)
05:12:14 [2021-09-12T09:12:14.615Z] 	at org.eclipse.swtbot.swt.finder.SWTBot.button(SWTBot.java:200)
05:12:14 [2021-09-12T09:12:14.615Z] 	at org.eclipse.swtbot.swt.finder.SWTBot.button(SWTBot.java:188)
05:12:14 [2021-09-12T09:12:14.615Z] 	at org.eclipse.tracecompass.tmf.remote.ui.swtbot.tests.fetch.FetchRemoteTracesTest.test_8_14(FetchRemoteTracesTest.java:672)
05:12:14 [2021-09-12T09:12:14.615Z] 	at java.base/jdk.internal.reflect.NativeMethodAccessorImpl.invoke0(Native Method)
05:12:14 [2021-09-12T09:12:14.615Z] 	at java.base/jdk.internal.reflect.NativeMethodAccessorImpl.invoke(NativeMethodAccessorImpl.java:62)
05:12:14 [2021-09-12T09:12:14.615Z] 	at java.base/jdk.internal.reflect.DelegatingMethodAccessorImpl.invoke(DelegatingMethodAccessorImpl.java:43)
05:12:14 [2021-09-12T09:12:14.615Z] 	at java.base/java.lang.reflect.Method.invoke(Method.java:566)
05:12:14 [2021-09-12T09:12:14.615Z] 	at org.junit.runners.model.FrameworkMethod$1.runReflectiveCall(FrameworkMethod.java:59)
05:12:14 [2021-09-12T09:12:14.615Z] 	at org.junit.internal.runners.model.ReflectiveCallable.run(ReflectiveCallable.java:12)
05:12:14 [2021-09-12T09:12:14.615Z] 	at org.junit.runners.model.FrameworkMethod.invokeExplosively(FrameworkMethod.java:56)
05:12:14 [2021-09-12T09:12:14.615Z] 	at org.eclipse.swtbot.swt.finder.junit.internal.CapturingFrameworkMethod.invokeExplosively(CapturingFrameworkMethod.java:49)
05:12:14 [2021-09-12T09:12:14.615Z] 	at org.junit.internal.runners.statements.InvokeMethod.evaluate(InvokeMethod.java:17)
05:12:14 [2021-09-12T09:12:14.615Z] 	at org.junit.internal.runners.statements.RunBefores.evaluate(RunBefores.java:26)
05:12:14 [2021-09-12T09:12:14.615Z] 	at org.junit.internal.runners.statements.RunAfters.evaluate(RunAfters.java:27)
05:12:14 [2021-09-12T09:12:14.615Z] 	at org.junit.runners.ParentRunner$3.evaluate(ParentRunner.java:306)
05:12:14 [2021-09-12T09:12:14.615Z] 	at org.junit.runners.ParentRunner.runLeaf(ParentRunner.java:366)
05:12:14 [2021-09-12T09:12:14.615Z] 	at org.eclipse.swtbot.swt.finder.junit.SWTBotJunit4ClassRunner.runChild(SWTBotJunit4ClassRunner.java:77)
05:12:14 [2021-09-12T09:12:14.615Z] 	at org.junit.runners.BlockJUnit4ClassRunner.runChild(BlockJUnit4ClassRunner.java:63)
05:12:14 [2021-09-12T09:12:14.615Z] 	at org.junit.runners.ParentRunner$4.run(ParentRunner.java:331)
05:12:14 [2021-09-12T09:12:14.615Z] 	at org.junit.runners.ParentRunner$1.schedule(ParentRunner.java:79)
05:12:14 [2021-09-12T09:12:14.615Z] 	at org.junit.runners.ParentRunner.runChildren(ParentRunner.java:329)
05:12:14 [2021-09-12T09:12:14.615Z] 	at org.junit.runners.ParentRunner.access$100(ParentRunner.java:66)
05:12:14 [2021-09-12T09:12:14.615Z] 	at org.junit.runners.ParentRunner$2.evaluate(ParentRunner.java:293)
05:12:14 [2021-09-12T09:12:14.615Z] 	at org.junit.internal.runners.statements.RunBefores.evaluate(RunBefores.java:26)
05:12:14 [2021-09-12T09:12:14.615Z] 	at org.junit.internal.runners.statements.RunAfters.evaluate(RunAfters.java:27)
05:12:14 [2021-09-12T09:12:14.615Z] 	at org.junit.runners.ParentRunner$3.evaluate(ParentRunner.java:306)
05:12:14 [2021-09-12T09:12:14.615Z] 	at org.junit.runners.ParentRunner.run(ParentRunner.java:413)
05:12:14 [2021-09-12T09:12:14.616Z] 	at org.eclipse.swtbot.swt.finder.junit.SWTBotJunit4ClassRunner.run(SWTBotJunit4ClassRunner.java:62)
05:12:14 [2021-09-12T09:12:14.616Z] 	at org.junit.runner.JUnitCore.run(JUnitCore.java:137)
05:12:14 [2021-09-12T09:12:14.616Z] 	at org.junit.runner.JUnitCore.run(JUnitCore.java:115)
05:12:14 [2021-09-12T09:12:14.616Z] 	at org.junit.vintage.engine.execution.RunnerExecutor.execute(RunnerExecutor.java:43)
05:12:14 [2021-09-12T09:12:14.616Z] 	at java.base/java.util.stream.ForEachOps$ForEachOp$OfRef.accept(ForEachOps.java:183)
05:12:14 [2021-09-12T09:12:14.616Z] 	at java.base/java.util.stream.ReferencePipeline$3$1.accept(ReferencePipeline.java:195)
05:12:14 [2021-09-12T09:12:14.616Z] 	at java.base/java.util.Iterator.forEachRemaining(Iterator.java:133)
05:12:14 [2021-09-12T09:12:14.616Z] 	at java.base/java.util.Spliterators$IteratorSpliterator.forEachRemaining(Spliterators.java:1801)
05:12:14 [2021-09-12T09:12:14.616Z] 	at java.base/java.util.stream.AbstractPipeline.copyInto(AbstractPipeline.java:484)
05:12:14 [2021-09-12T09:12:14.616Z] 	at java.base/java.util.stream.AbstractPipeline.wrapAndCopyInto(AbstractPipeline.java:474)
05:12:14 [2021-09-12T09:12:14.616Z] 	at java.base/java.util.stream.ForEachOps$ForEachOp.evaluateSequential(ForEachOps.java:150)
05:12:14 [2021-09-12T09:12:14.616Z] 	at java.base/java.util.stream.ForEachOps$ForEachOp$OfRef.evaluateSequential(ForEachOps.java:173)
05:12:14 [2021-09-12T09:12:14.616Z] 	at java.base/java.util.stream.AbstractPipeline.evaluate(AbstractPipeline.java:234)
05:12:14 [2021-09-12T09:12:14.616Z] 	at java.base/java.util.stream.ReferencePipeline.forEach(ReferencePipeline.java:497)
05:12:14 [2021-09-12T09:12:14.616Z] 	at org.junit.vintage.engine.VintageTestEngine.executeAllChildren(VintageTestEngine.java:82)
05:12:14 [2021-09-12T09:12:14.616Z] 	at org.junit.vintage.engine.VintageTestEngine.execute(VintageTestEngine.java:73)
05:12:14 [2021-09-12T09:12:14.616Z] 	at org.junit.platform.launcher.core.EngineExecutionOrchestrator.execute(EngineExecutionOrchestrator.java:108)
05:12:14 [2021-09-12T09:12:14.616Z] 	at org.junit.platform.launcher.core.EngineExecutionOrchestrator.execute(EngineExecutionOrchestrator.java:88)
05:12:14 [2021-09-12T09:12:14.616Z] 	at org.junit.platform.launcher.core.EngineExecutionOrchestrator.lambda$execute$0(EngineExecutionOrchestrator.java:54)
05:12:14 [2021-09-12T09:12:14.616Z] 	at org.junit.platform.launcher.core.EngineExecutionOrchestrator.withInterceptedStreams(EngineExecutionOrchestrator.java:67)
05:12:14 [2021-09-12T09:12:14.616Z] 	at org.junit.platform.launcher.core.EngineExecutionOrchestrator.execute(EngineExecutionOrchestrator.java:52)
05:12:14 [2021-09-12T09:12:14.616Z] 	at org.junit.platform.launcher.core.DefaultLauncher.execute(DefaultLauncher.java:96)
05:12:14 [2021-09-12T09:12:14.616Z] 	at org.junit.platform.launcher.core.DefaultLauncher.execute(DefaultLauncher.java:75)
05:12:14 [2021-09-12T09:12:14.616Z] 	at org.apache.maven.surefire.junitplatform.JUnitPlatformProvider.invokeAllTests(JUnitPlatformProvider.java:150)
05:12:14 [2021-09-12T09:12:14.616Z] 	at org.apache.maven.surefire.junitplatform.JUnitPlatformProvider.invoke(JUnitPlatformProvider.java:124)
05:12:14 [2021-09-12T09:12:14.616Z] 	at java.base/jdk.internal.reflect.NativeMethodAccessorImpl.invoke0(Native Method)
05:12:14 [2021-09-12T09:12:14.616Z] 	at java.base/jdk.internal.reflect.NativeMethodAccessorImpl.invoke(NativeMethodAccessorImpl.java:62)
05:12:14 [2021-09-12T09:12:14.616Z] 	at java.base/jdk.internal.reflect.DelegatingMethodAccessorImpl.invoke(DelegatingMethodAccessorImpl.java:43)
05:12:14 [2021-09-12T09:12:14.616Z] 	at java.base/java.lang.reflect.Method.invoke(Method.java:566)
05:12:14 [2021-09-12T09:12:14.616Z] 	at org.apache.maven.surefire.util.ReflectionUtils.invokeMethodWithArray2(ReflectionUtils.java:206)
05:12:14 [2021-09-12T09:12:14.616Z] 	at org.apache.maven.surefire.booter.ProviderFactory$ProviderProxy.invoke(ProviderFactory.java:161)
05:12:14 [2021-09-12T09:12:14.616Z] 	at org.apache.maven.surefire.booter.ProviderFactory.invokeProvider(ProviderFactory.java:84)
05:12:14 [2021-09-12T09:12:14.616Z] 	at org.eclipse.tycho.surefire.osgibooter.OsgiSurefireBooter.run(OsgiSurefireBooter.java:116)
05:12:14 [2021-09-12T09:12:14.616Z] 	at org.eclipse.tycho.surefire.osgibooter.AbstractUITestApplication.runTests(AbstractUITestApplication.java:46)
05:12:14 [2021-09-12T09:12:14.616Z] 	at org.eclipse.e4.ui.internal.workbench.swt.E4Testable.lambda$0(E4Testable.java:76)
05:12:14 [2021-09-12T09:12:14.616Z] 	at java.base/java.lang.Thread.run(Thread.java:834)
05:12:14 [2021-09-12T09:12:14.616Z] Caused by: org.eclipse.swtbot.swt.finder.widgets.TimeoutException: Timeout after: 20000 ms.: Could not find widget matching: (of type 'Button' and with mnemonic 'Cancel' and with style 'SWT.PUSH')
05:12:14 [2021-09-12T09:12:14.616Z] 	at org.eclipse.swtbot.swt.finder.SWTBotFactory.waitUntil(SWTBotFactory.java:523)
05:12:14 [2021-09-12T09:12:14.616Z] 	at org.eclipse.swtbot.swt.finder.SWTBot.waitUntil(SWTBot.java:1)
05:12:14 [2021-09-12T09:12:14.616Z] 	at org.eclipse.swtbot.eclipse.finder.SWTWorkbenchBot.waitUntil(SWTWorkbenchBot.java:1)
05:12:14 [2021-09-12T09:12:14.616Z] 	at org.eclipse.swtbot.swt.finder.SWTBotFactory.waitUntil(SWTBotFactory.java:497)
05:12:14 [2021-09-12T09:12:14.616Z] 	at org.eclipse.swtbot.swt.finder.SWTBot.waitUntil(SWTBot.java:1)
05:12:14 [2021-09-12T09:12:14.616Z] 	at org.eclipse.swtbot.eclipse.finder.SWTWorkbenchBot.waitUntil(SWTWorkbenchBot.java:1)
05:12:14 [2021-09-12T09:12:14.616Z] 	at org.eclipse.swtbot.swt.finder.SWTBotFactory.waitUntil(SWTBotFactory.java:485)
05:12:14 [2021-09-12T09:12:14.616Z] 	at org.eclipse.swtbot.swt.finder.SWTBot.waitUntil(SWTBot.java:1)
05:12:14 [2021-09-12T09:12:14.616Z] 	at org.eclipse.swtbot.eclipse.finder.SWTWorkbenchBot.waitUntil(SWTWorkbenchBot.java:1)
05:12:14 [2021-09-12T09:12:14.616Z] 	at org.eclipse.swtbot.swt.finder.SWTBotFactory.waitUntilWidgetAppears(SWTBotFactory.java:467)
05:12:14 [2021-09-12T09:12:14.616Z] 	... 68 more
05:12:14 [2021-09-12T09:12:14.616Z] 
05:12:14 [2021-09-12T09:12:14.616Z] test_8_15  Time elapsed: 3.049 s
05:12:14 [2021-09-12T09:12:14.616Z] test_9_01  Time elapsed: 2.496 s
05:12:14 [2021-09-12T09:12:14.616Z] test_9_02 skipped
05:12:14 [2021-09-12T09:12:14.616Z] testImportOnlyOne  Time elapsed: 3.554 s
05:12:14 [2021-09-12T09:12:14.616Z] testEmptyFile  Time elapsed: 2.88 s
05:12:14 [2021-09-12T09:12:14.616Z] testImportAll  Time elapsed: 4.099 s
05:12:14 [2021-09-12T09:12:14.616Z] testEditProfile  Time elapsed: 1.999 s
05:12:14 [2021-09-12T09:12:14.616Z] 
05:12:14 [2021-09-12T09:12:14.616Z] Results:
05:12:14 [2021-09-12T09:12:14.616Z] 
05:12:14 [2021-09-12T09:12:14.616Z] Errors: 
05:12:14 [2021-09-12T09:12:14.616Z]   FetchRemoteTracesTest.test_8_14:672 » WidgetNotFound Could not find widget mat...
05:12:14 [2021-09-12T09:12:14.616Z] 
05:12:14 [2021-09-12T09:12:14.616Z] Tests run: 20, Failures: 0, Errors: 1, Skipped: 1
05:12:14 [2021-09-12T09:12:14.616Z] 
05:12:14 [2021-09-12T09:12:14.616Z] 
05:12:14 [2021-09-12T09:12:14.616Z] !ENTRY org.eclipse.core.resources 2 10035 2021-09-12 09:12:13.856
05:12:14 [2021-09-12T09:12:14.616Z] !MESSAGE The workspace will exit with unsaved changes in this session.
05:12:14 [2021-09-12T09:12:14.616Z] [INFO] ------------------------------------------------------------------------
05:12:14 [2021-09-12T09:12:14.616Z] [INFO] Reactor Summary:
05:12:14 [2021-09-12T09:12:14.616Z] [INFO] 
05:12:14 [2021-09-12T09:12:14.616Z] [INFO] Trace Compass Parent 7.1.0-SNAPSHOT ................ SUCCESS [ 32.790 s]
05:12:14 [2021-09-12T09:12:14.616Z] [INFO] Trace Compass Tracetype-agnostic Analyses Parent 7.1.0-SNAPSHOT SUCCESS [  0.008 s]
05:12:14 [2021-09-12T09:12:14.616Z] [INFO] Trace Compass Common Utilities Parent 7.1.0-SNAPSHOT SUCCESS [  0.007 s]
05:12:14 [2021-09-12T09:12:14.616Z] [INFO] org.eclipse.tracecompass.common.core 4.3.1-SNAPSHOT  SUCCESS [ 24.587 s]
05:12:14 [2021-09-12T09:12:14.616Z] [INFO] Trace Compass State System Parent 7.1.0-SNAPSHOT ... SUCCESS [  0.007 s]
05:12:14 [2021-09-12T09:12:14.616Z] [INFO] org.eclipse.tracecompass.datastore.core 1.2.2-SNAPSHOT SUCCESS [  3.863 s]
05:12:14 [2021-09-12T09:12:14.616Z] [INFO] org.eclipse.tracecompass.segmentstore.core 3.0.1-SNAPSHOT SUCCESS [  2.615 s]
05:12:14 [2021-09-12T09:12:14.616Z] [INFO] org.eclipse.tracecompass.statesystem.core 5.0.3-SNAPSHOT SUCCESS [  4.001 s]
05:12:14 [2021-09-12T09:12:14.616Z] [INFO] Trace Compass TMF Parent 7.1.0-SNAPSHOT ............ SUCCESS [  0.007 s]
05:12:14 [2021-09-12T09:12:14.616Z] [INFO] Trace Compass Filter Parser 1.0.6-SNAPSHOT ......... SUCCESS [  2.229 s]
05:12:14 [2021-09-12T09:12:14.616Z] [INFO] org.eclipse.tracecompass.tmf.core 7.1.0-SNAPSHOT ... SUCCESS [  8.179 s]
05:12:14 [2021-09-12T09:12:14.616Z] [INFO] org.eclipse.tracecompass.analysis.counters.core 2.0.6-SNAPSHOT SUCCESS [  2.792 s]
05:12:14 [2021-09-12T09:12:14.616Z] [INFO] Trace Compass CTF Support Parent 7.1.0-SNAPSHOT .... SUCCESS [  0.007 s]
05:12:14 [2021-09-12T09:12:14.616Z] [INFO] Trace Compass CTF Parser Plug-in 1.0.6-SNAPSHOT .... SUCCESS [  9.071 s]
05:12:14 [2021-09-12T09:12:14.616Z] [INFO] org.eclipse.tracecompass.ctf.core 4.0.6-SNAPSHOT ... SUCCESS [  4.819 s]
05:12:14 [2021-09-12T09:12:14.616Z] [INFO] Trace Compass CTF Core Tests Plug-in 1.0.9-SNAPSHOT  SUCCESS [ 45.975 s]
05:12:14 [2021-09-12T09:12:14.616Z] [INFO] org.eclipse.tracecompass.statesystem.core.tests 1.0.13-SNAPSHOT SUCCESS [ 12.682 s]
05:12:14 [2021-09-12T09:12:14.616Z] [INFO] org.eclipse.tracecompass.tmf.core.tests 1.0.18-SNAPSHOT SUCCESS [04:47 min]
05:12:14 [2021-09-12T09:12:14.616Z] [INFO] org.eclipse.tracecompass.tmf.ctf.core 4.2.3-SNAPSHOT SUCCESS [  4.912 s]
05:12:14 [2021-09-12T09:12:14.616Z] [INFO] org.eclipse.tracecompass.tmf.ctf.core.tests 1.0.13-SNAPSHOT SUCCESS [03:29 min]
05:12:14 [2021-09-12T09:12:14.616Z] [INFO] org.eclipse.tracecompass.analysis.counters.core.tests 1.0.1-SNAPSHOT SUCCESS [  6.579 s]
05:12:14 [2021-09-12T09:12:14.616Z] [INFO] org.eclipse.tracecompass.tmf.ui 7.1.0-SNAPSHOT ..... SUCCESS [ 13.602 s]
05:12:14 [2021-09-12T09:12:14.616Z] [INFO] org.eclipse.tracecompass.analysis.counters.ui 2.0.0-SNAPSHOT SUCCESS [  2.908 s]
05:12:14 [2021-09-12T09:12:14.616Z] [INFO] org.eclipse.tracecompass.tmf.ui.tests 1.0.17-SNAPSHOT SUCCESS [02:38 min]
05:12:14 [2021-09-12T09:12:14.616Z] [INFO] org.eclipse.tracecompass.tmf.ui.swtbot.tests 1.0.17-SNAPSHOT SUCCESS [04:40 min]
05:12:14 [2021-09-12T09:12:14.616Z] [INFO] org.eclipse.tracecompass.analysis.graph.core 3.1.0-SNAPSHOT SUCCESS [  3.633 s]
05:12:14 [2021-09-12T09:12:14.616Z] [INFO] org.eclipse.tracecompass.tmf.chart.core 1.0.4-SNAPSHOT SUCCESS [  2.263 s]
05:12:14 [2021-09-12T09:12:14.616Z] [INFO] org.eclipse.tracecompass.analysis.lami.core 1.1.3-SNAPSHOT SUCCESS [  2.565 s]
05:12:14 [2021-09-12T09:12:14.616Z] [INFO] org.eclipse.tracecompass.analysis.timing.core 5.2.2-SNAPSHOT SUCCESS [  4.267 s]
05:12:14 [2021-09-12T09:12:14.616Z] [INFO] org.eclipse.tracecompass.analysis.os.linux.core 6.0.1-SNAPSHOT SUCCESS [  3.176 s]
05:12:14 [2021-09-12T09:12:14.616Z] [INFO] Trace Compass LTTng Support Parent 7.1.0-SNAPSHOT .. SUCCESS [  0.005 s]
05:12:14 [2021-09-12T09:12:14.616Z] [INFO] org.eclipse.tracecompass.lttng2.common.core 1.1.3-SNAPSHOT SUCCESS [  1.933 s]
05:12:14 [2021-09-12T09:12:14.616Z] [INFO] org.eclipse.tracecompass.tmf.analysis.xml.core 4.0.3-SNAPSHOT SUCCESS [  3.202 s]
05:12:14 [2021-09-12T09:12:14.616Z] [INFO] org.eclipse.tracecompass.lttng2.kernel.core 3.0.5-SNAPSHOT SUCCESS [  3.211 s]
05:12:14 [2021-09-12T09:12:14.616Z] [INFO] org.eclipse.tracecompass.analysis.counters.ui.swtbot.tests 1.0.2-SNAPSHOT SUCCESS [ 58.554 s]
05:12:14 [2021-09-12T09:12:14.616Z] [INFO] org.eclipse.tracecompass.analysis.graph.core.tests 1.0.6-SNAPSHOT SUCCESS [  9.318 s]
05:12:14 [2021-09-12T09:12:14.616Z] [INFO] org.eclipse.tracecompass.analysis.graph.ui 1.0.11-SNAPSHOT SUCCESS [  2.200 s]
05:12:14 [2021-09-12T09:12:14.616Z] [INFO] org.eclipse.tracecompass.analysis.lami.core.tests 1.0.4-SNAPSHOT SUCCESS [  7.421 s]
05:12:14 [2021-09-12T09:12:14.616Z] [INFO] org.eclipse.tracecompass.tmf.chart.ui 1.0.11-SNAPSHOT SUCCESS [  3.255 s]
05:12:14 [2021-09-12T09:12:14.616Z] [INFO] org.eclipse.tracecompass.analysis.lami.ui 1.1.5-SNAPSHOT SUCCESS [  2.772 s]
05:12:14 [2021-09-12T09:12:14.616Z] [INFO] org.eclipse.tracecompass.tmf.chart.core.tests 1.0.3-SNAPSHOT SUCCESS [  6.989 s]
05:12:14 [2021-09-12T09:12:14.616Z] [INFO] org.eclipse.tracecompass.tmf.chart.ui.swtbot.tests 1.0.6-SNAPSHOT SUCCESS [ 12.055 s]
05:12:14 [2021-09-12T09:12:14.616Z] [INFO] org.eclipse.tracecompass.analysis.lami.ui.swtbot.tests 1.0.6-SNAPSHOT SUCCESS [ 21.059 s]
05:12:14 [2021-09-12T09:12:14.616Z] [INFO] org.eclipse.tracecompass.analysis.os.linux.core.tests 1.0.15-SNAPSHOT SUCCESS [02:01 min]
05:12:14 [2021-09-12T09:12:14.616Z] [INFO] org.eclipse.tracecompass.analysis.timing.ui 5.0.1-SNAPSHOT SUCCESS [  5.302 s]
05:12:14 [2021-09-12T09:12:14.616Z] [INFO] org.eclipse.tracecompass.analysis.os.linux.ui 4.0.4-SNAPSHOT SUCCESS [  2.764 s]
05:12:14 [2021-09-12T09:12:14.616Z] [INFO] org.eclipse.tracecompass.analysis.os.linux.ui.tests 1.0.9-SNAPSHOT SUCCESS [ 10.489 s]
05:12:14 [2021-09-12T09:12:14.616Z] [INFO] org.eclipse.tracecompass.analysis.timing.core.tests 1.0.6-SNAPSHOT SUCCESS [ 12.805 s]
05:12:14 [2021-09-12T09:12:14.616Z] [INFO] org.eclipse.tracecompass.analysis.timing.ui.swtbot.tests 1.0.11-SNAPSHOT SUCCESS [ 41.595 s]
05:12:14 [2021-09-12T09:12:14.616Z] [INFO] org.eclipse.tracecompass.analysis.os.linux.ui.swtbot.tests 1.0.16-SNAPSHOT SUCCESS [01:11 min]
05:12:14 [2021-09-12T09:12:14.616Z] [INFO] org.eclipse.tracecompass.analysis.profiling.core 2.1.0-SNAPSHOT SUCCESS [  4.680 s]
05:12:14 [2021-09-12T09:12:14.616Z] [INFO] org.eclipse.tracecompass.analysis.profiling.core.tests 1.0.6-SNAPSHOT SUCCESS [ 29.823 s]
05:12:14 [2021-09-12T09:12:14.616Z] [INFO] org.eclipse.tracecompass.analysis.profiling.ui 3.0.0-SNAPSHOT SUCCESS [  4.122 s]
05:12:14 [2021-09-12T09:12:14.616Z] [INFO] org.eclipse.tracecompass.analysis.profiling.ui.swtbot.tests 1.0.6-SNAPSHOT SUCCESS [ 13.641 s]
05:12:14 [2021-09-12T09:12:14.616Z] [INFO] Trace Compass BTF Support Parent 7.1.0-SNAPSHOT .... SUCCESS [  0.006 s]
05:12:14 [2021-09-12T09:12:14.616Z] [INFO] org.eclipse.tracecompass.btf.core 3.0.0-SNAPSHOT ... SUCCESS [  2.354 s]
05:12:14 [2021-09-12T09:12:14.616Z] [INFO] Trace Compass Documentation 7.1.0-SNAPSHOT ......... SUCCESS [  0.005 s]
05:12:14 [2021-09-12T09:12:14.616Z] [INFO] Trace Compass Developer Guide 7.1.0-SNAPSHOT ....... SUCCESS [ 55.653 s]
05:12:14 [2021-09-12T09:12:14.616Z] [INFO] org.eclipse.tracecompass.tmf.analysis.xml.ui 2.1.15-SNAPSHOT SUCCESS [  2.832 s]
05:12:14 [2021-09-12T09:12:14.616Z] [INFO] org.eclipse.tracecompass.tmf 7.1.0-SNAPSHOT ........ SUCCESS [  2.811 s]
05:12:14 [2021-09-12T09:12:14.617Z] [INFO] org.eclipse.tracecompass.btf.ui 1.0.4-SNAPSHOT ..... SUCCESS [  2.537 s]
05:12:14 [2021-09-12T09:12:14.617Z] [INFO] org.eclipse.tracecompass.btf 7.1.0-SNAPSHOT ........ SUCCESS [  2.412 s]
05:12:14 [2021-09-12T09:12:14.617Z] [INFO] org.eclipse.tracecompass.btf.core.tests 1.0.3-SNAPSHOT SUCCESS [  6.856 s]
05:12:14 [2021-09-12T09:12:14.617Z] [INFO] org.eclipse.tracecompass.common.core.tests 1.1.9-SNAPSHOT SUCCESS [  6.718 s]
05:12:14 [2021-09-12T09:12:14.617Z] [INFO] org.eclipse.tracecompass.ctf 7.1.0-SNAPSHOT ........ SUCCESS [  4.339 s]
05:12:14 [2021-09-12T09:12:14.617Z] [INFO] org.eclipse.tracecompass.ctf.parser.tests 1.0.3-SNAPSHOT SUCCESS [  8.561 s]
05:12:14 [2021-09-12T09:12:14.617Z] [INFO] org.eclipse.tracecompass.tmf.ctf 7.1.0-SNAPSHOT .... SUCCESS [  2.517 s]
05:12:14 [2021-09-12T09:12:14.617Z] [INFO] org.eclipse.tracecompass.tmf.ctf.ui.swtbot.tests 1.0.11-SNAPSHOT SUCCESS [01:56 min]
05:12:14 [2021-09-12T09:12:14.617Z] [INFO] Trace Compass User Guide 7.1.0-SNAPSHOT ............ SUCCESS [ 11.448 s]
05:12:14 [2021-09-12T09:12:14.617Z] [INFO] Trace Compass GDB Tracepoint Analysis User Guide 7.1.0-SNAPSHOT SUCCESS [  6.273 s]
05:12:14 [2021-09-12T09:12:14.617Z] [INFO] Trace Compass RCP User Guide 7.1.0-SNAPSHOT ........ SUCCESS [  5.447 s]
05:12:14 [2021-09-12T09:12:14.617Z] [INFO] Trace Compass Pcap User Guide 7.1.0-SNAPSHOT ....... SUCCESS [  4.912 s]
05:12:14 [2021-09-12T09:12:14.617Z] [INFO] org.eclipse.tracecompass.examples 1.0.8-SNAPSHOT ... SUCCESS [  3.573 s]
05:12:14 [2021-09-12T09:12:14.617Z] [INFO] Trace Compass GDB Tracepoint Analysis Parent 7.1.0-SNAPSHOT SUCCESS [  0.005 s]
05:12:14 [2021-09-12T09:12:14.617Z] [INFO] org.eclipse.tracecompass.gdbtrace.core 1.0.7-SNAPSHOT SUCCESS [  3.897 s]
05:12:14 [2021-09-12T09:12:14.617Z] [INFO] org.eclipse.tracecompass.gdbtrace.ui 1.1.4-SNAPSHOT  SUCCESS [  1.826 s]
05:12:14 [2021-09-12T09:12:14.617Z] [INFO] org.eclipse.tracecompass.gdbtrace 7.1.0-SNAPSHOT ... SUCCESS [  2.912 s]
05:12:14 [2021-09-12T09:12:14.617Z] [INFO] org.eclipse.tracecompass.gdbtrace.core.tests 1.0.2-SNAPSHOT SUCCESS [  7.603 s]
05:12:14 [2021-09-12T09:12:14.617Z] [INFO] org.eclipse.tracecompass.gdbtrace.ui.tests 1.0.2-SNAPSHOT SUCCESS [ 11.615 s]
05:12:14 [2021-09-12T09:12:14.617Z] [INFO] org.eclipse.tracecompass.lttng2.common.core.tests 1.0.2-SNAPSHOT SUCCESS [  5.345 s]
05:12:14 [2021-09-12T09:12:14.617Z] [INFO] org.eclipse.tracecompass.lttng2.control.core 1.2.5-SNAPSHOT SUCCESS [  2.523 s]
05:12:14 [2021-09-12T09:12:14.617Z] [INFO] org.eclipse.tracecompass.tmf.remote.core 2.0.5-SNAPSHOT SUCCESS [  2.464 s]
05:12:14 [2021-09-12T09:12:14.617Z] [INFO] org.eclipse.tracecompass.tmf.remote.ui 1.0.9-SNAPSHOT SUCCESS [  2.681 s]
05:12:14 [2021-09-12T09:12:14.617Z] [INFO] org.eclipse.tracecompass.lttng2.control.ui 1.2.13-SNAPSHOT SUCCESS [  5.036 s]
05:12:14 [2021-09-12T09:12:14.617Z] [INFO] org.eclipse.tracecompass.lttng2.control 7.1.0-SNAPSHOT SUCCESS [  2.043 s]
05:12:14 [2021-09-12T09:12:14.617Z] [INFO] org.eclipse.tracecompass.lttng2.control.core.tests 1.1.3-SNAPSHOT SUCCESS [  5.876 s]
05:12:14 [2021-09-12T09:12:14.617Z] [INFO] org.eclipse.tracecompass.tmf.remote.core.tests 1.0.2-SNAPSHOT SUCCESS [  6.309 s]
05:12:14 [2021-09-12T09:12:14.617Z] [INFO] org.eclipse.tracecompass.lttng2.control.ui.tests 2.0.5-SNAPSHOT SUCCESS [ 29.872 s]
05:12:14 [2021-09-12T09:12:14.617Z] [INFO] org.eclipse.tracecompass.lttng2.control.ui.swtbot.tests 1.0.8-SNAPSHOT SUCCESS [ 45.987 s]
05:12:14 [2021-09-12T09:12:14.617Z] [INFO] org.eclipse.tracecompass.lttng2.kernel.ui 2.0.2-SNAPSHOT SUCCESS [  2.616 s]
05:12:14 [2021-09-12T09:12:14.617Z] [INFO] org.eclipse.tracecompass.lttng2.kernel 7.1.0-SNAPSHOT SUCCESS [  1.844 s]
05:12:14 [2021-09-12T09:12:14.617Z] [INFO] org.eclipse.tracecompass.tmf.analysis.xml.core.tests 1.0.13-SNAPSHOT SUCCESS [ 39.697 s]
05:12:14 [2021-09-12T09:12:14.617Z] [INFO] org.eclipse.tracecompass.lttng2.kernel.core.tests 2.0.3-SNAPSHOT SUCCESS [ 48.381 s]
05:12:14 [2021-09-12T09:12:14.617Z] [INFO] org.eclipse.tracecompass.lttng2.kernel.ui.swtbot.tests 1.0.17-SNAPSHOT SUCCESS [03:54 min]
05:12:14 [2021-09-12T09:12:14.617Z] [INFO] org.eclipse.tracecompass.lttng2.ust.core 5.0.3-SNAPSHOT SUCCESS [  3.187 s]
05:12:14 [2021-09-12T09:12:14.617Z] [INFO] org.eclipse.tracecompass.lttng2.ust.ui 3.0.10-SNAPSHOT SUCCESS [  5.121 s]
05:12:14 [2021-09-12T09:12:14.617Z] [INFO] org.eclipse.tracecompass.lttng2.ust 7.1.0-SNAPSHOT . SUCCESS [  2.587 s]
05:12:14 [2021-09-12T09:12:14.617Z] [INFO] org.eclipse.tracecompass.lttng2.ust.core.tests 1.0.12-SNAPSHOT SUCCESS [ 30.903 s]
05:12:14 [2021-09-12T09:12:14.617Z] [INFO] org.eclipse.tracecompass.lttng2.ust.ui.tests 1.0.2-SNAPSHOT SUCCESS [ 11.812 s]
05:12:14 [2021-09-12T09:12:14.617Z] [INFO] org.eclipse.tracecompass.lttng2.ust.ui.swtbot.tests 1.0.15-SNAPSHOT SUCCESS [01:08 min]
05:12:14 [2021-09-12T09:12:14.617Z] [INFO] Trace Compass Pcap Format Support Parent 7.1.0-SNAPSHOT SUCCESS [  0.005 s]
05:12:14 [2021-09-12T09:12:14.617Z] [INFO] org.eclipse.tracecompass.pcap.core 1.1.3-SNAPSHOT .. SUCCESS [  2.921 s]
05:12:14 [2021-09-12T09:12:14.617Z] [INFO] Trace Compass Pcap Parser Core Tests Plug-in 1.0.5-SNAPSHOT SUCCESS [  7.520 s]
05:12:14 [2021-09-12T09:12:14.617Z] [INFO] org.eclipse.tracecompass.tmf.pcap.core 1.0.5-SNAPSHOT SUCCESS [  2.890 s]
05:12:14 [2021-09-12T09:12:14.617Z] [INFO] org.eclipse.tracecompass.tmf.pcap.ui 1.1.4-SNAPSHOT  SUCCESS [  2.442 s]
05:12:14 [2021-09-12T09:12:14.617Z] [INFO] org.eclipse.tracecompass.tmf.pcap 7.1.0-SNAPSHOT ... SUCCESS [  1.804 s]
05:12:14 [2021-09-12T09:12:14.617Z] [INFO] org.eclipse.tracecompass.tmf.pcap.core.tests 1.0.3-SNAPSHOT SUCCESS [  8.582 s]
05:12:14 [2021-09-12T09:12:14.617Z] [INFO] org.eclipse.tracecompass.tmf.pcap.ui.swtbot.tests 1.0.2-SNAPSHOT SUCCESS [ 25.731 s]
05:12:14 [2021-09-12T09:12:14.617Z] [INFO] Trace Compass RCP Parent 7.1.0-SNAPSHOT ............ SUCCESS [  0.006 s]
05:12:14 [2021-09-12T09:12:14.617Z] [INFO] Trace Compass RCP Branding plug-in 7.1.0-SNAPSHOT .. SUCCESS [  3.195 s]
05:12:14 [2021-09-12T09:12:14.617Z] [INFO] Trace Compass RCP Branding Feature 7.1.0-SNAPSHOT .. SUCCESS [  2.052 s]
05:12:14 [2021-09-12T09:12:14.617Z] [INFO] org.eclipse.tracecompass.tmf.cli.core 1.0.2-SNAPSHOT SUCCESS [  2.016 s]
05:12:14 [2021-09-12T09:12:14.617Z] [INFO] org.eclipse.tracecompass.rcp.ui 7.1.0-SNAPSHOT ..... SUCCESS [  3.037 s]
05:12:14 [2021-09-12T09:12:14.617Z] [INFO] Trace Compass RCP Feature 7.1.0-SNAPSHOT ........... SUCCESS [  2.781 s]
05:12:14 [2021-09-12T09:12:14.617Z] [INFO] org.eclipse.tracecompass.tmf.cli.core.tests 1.0.2-SNAPSHOT SUCCESS [  6.530 s]
05:12:14 [2021-09-12T09:12:14.617Z] [INFO] org.eclipse.tracecompass.rcp.ui.tests 2.0.4-SNAPSHOT SUCCESS [ 10.421 s]
05:12:14 [2021-09-12T09:12:14.617Z] [INFO] org.eclipse.tracecompass.rcp.incubator.ui 1.0.2-SNAPSHOT SUCCESS [  2.543 s]
05:12:14 [2021-09-12T09:12:14.617Z] [INFO] org.eclipse.tracecompass.rcp.incubator 7.1.0-SNAPSHOT SUCCESS [  2.840 s]
05:12:14 [2021-09-12T09:12:14.617Z] [INFO] Trace Compass Json trace Parent 7.1.0-SNAPSHOT ..... SUCCESS [  0.005 s]
05:12:14 [2021-09-12T09:12:14.617Z] [INFO] org.eclipse.tracecompass.jsontrace.core 1.0.3-SNAPSHOT SUCCESS [  2.001 s]
05:12:14 [2021-09-12T09:12:14.617Z] [INFO] org.eclipse.tracecompass.jsontrace 7.1.0-SNAPSHOT .. SUCCESS [  2.312 s]
05:12:14 [2021-09-12T09:12:14.617Z] [INFO] org.eclipse.tracecompass.tmf.cli 7.1.0-SNAPSHOT .... SUCCESS [  2.250 s]
05:12:14 [2021-09-12T09:12:14.617Z] [INFO] Trace Compass RCP Product 7.1.0-SNAPSHOT ........... SUCCESS [ 56.366 s]
05:12:14 [2021-09-12T09:12:14.617Z] [INFO] Trace Compass Release Engineering Parent 7.1.0-SNAPSHOT SUCCESS [  0.011 s]
05:12:14 [2021-09-12T09:12:14.617Z] [INFO] Trace Compass Target Platform 7.1.0-SNAPSHOT ....... SUCCESS [  6.474 s]
05:12:14 [2021-09-12T09:12:14.617Z] [INFO] org.eclipse.tracecompass.integration.swtbot.tests 1.0.12-SNAPSHOT SUCCESS [07:28 min]
05:12:14 [2021-09-12T09:12:14.617Z] [INFO] org.eclipse.tracecompass.datastore.core.tests 1.0.6-SNAPSHOT SUCCESS [  7.693 s]
05:12:14 [2021-09-12T09:12:14.617Z] [INFO] org.eclipse.tracecompass.segmentstore.core.tests 1.0.6-SNAPSHOT SUCCESS [  7.255 s]
05:12:14 [2021-09-12T09:12:14.617Z] [INFO] org.eclipse.tracecompass.tmf.analysis.xml.ui.swtbot.tests 1.0.13-SNAPSHOT SUCCESS [ 52.294 s]
05:12:14 [2021-09-12T09:12:14.617Z] [INFO] org.eclipse.tracecompass.tmf.analysis.xml.ui.tests 1.0.4-SNAPSHOT SUCCESS [ 12.139 s]
05:12:14 [2021-09-12T09:12:14.617Z] [INFO] org.eclipse.tracecompass.tmf.chart.ui.tests 1.0.2-SNAPSHOT SUCCESS [ 11.701 s]
05:12:14 [2021-09-12T09:12:14.617Z] [INFO] org.eclipse.tracecompass.tmf.remote.ui.swtbot.tests 1.0.9-SNAPSHOT FAILURE [01:44 min]
05:12:14 [2021-09-12T09:12:14.617Z] [INFO] org.eclipse.tracecompass.tmf.remote.ui.tests 1.0.2-SNAPSHOT SKIPPED
05:12:14 [2021-09-12T09:12:14.617Z] [INFO] Trace Compass All Tests 1.0.11-SNAPSHOT ............ SKIPPED
05:12:14 [2021-09-12T09:12:14.617Z] [INFO] org.eclipse.tracecompass.testing 7.1.0-SNAPSHOT .... SKIPPED
05:12:14 [2021-09-12T09:12:14.617Z] [INFO] org.eclipse.tracecompass.tmf.remote 7.1.0-SNAPSHOT . SKIPPED
05:12:14 [2021-09-12T09:12:14.617Z] [INFO] Trace Compass Repository 7.1.0-SNAPSHOT ............ SKIPPED
05:12:14 [2021-09-12T09:12:14.617Z] [INFO] org.eclipse.tracecompass.jsontrace.core.tests 1.0.3-SNAPSHOT SKIPPED
05:12:14 [2021-09-12T09:12:14.617Z] [INFO] ------------------------------------------------------------------------
05:12:14 [2021-09-12T09:12:14.617Z] [INFO] BUILD FAILURE
05:12:14 [2021-09-12T09:12:14.617Z] [INFO] ------------------------------------------------------------------------
05:12:14 [2021-09-12T09:12:14.617Z] [INFO] Total time:  58:37 min
05:12:14 [2021-09-12T09:12:14.617Z] [INFO] Finished at: 2021-09-12T09:12:14Z
05:12:14 [2021-09-12T09:12:14.617Z] [INFO] ------------------------------------------------------------------------
05:12:14 [2021-09-12T09:12:14.617Z] [ERROR] Failed to execute goal org.eclipse.tycho:tycho-surefire-plugin:2.3.0:test (default-test) on project org.eclipse.tracecompass.tmf.remote.ui.swtbot.tests: There are test failures.
05:12:14 [2021-09-12T09:12:14.617Z] [ERROR] 
05:12:14 [2021-09-12T09:12:14.617Z] [ERROR] Please refer to /home/jenkins/agent/workspace/tracecompass-stable-release-nightly-new/tmf/org.eclipse.tracecompass.tmf.remote.ui.swtbot.tests/target/surefire-reports for the individual test results.
05:12:14 [2021-09-12T09:12:14.617Z] [ERROR] -> [Help 1]
05:12:14 [2021-09-12T09:12:14.617Z] [ERROR] 
05:12:14 [2021-09-12T09:12:14.617Z] [ERROR] To see the full stack trace of the errors, re-run Maven with the -e switch.
05:12:14 [2021-09-12T09:12:14.617Z] [ERROR] Re-run Maven using the -X switch to enable full debug logging.
05:12:14 [2021-09-12T09:12:14.617Z] [ERROR] 
05:12:14 [2021-09-12T09:12:14.617Z] [ERROR] For more information about the errors and possible solutions, please read the following articles:
05:12:14 [2021-09-12T09:12:14.617Z] [ERROR] [Help 1] http://cwiki.apache.org/confluence/display/MAVEN/MojoFailureException
05:12:14 [2021-09-12T09:12:14.617Z] [ERROR] 
05:12:14 [2021-09-12T09:12:14.617Z] [ERROR] After correcting the problems, you can resume the build with the command
05:12:14 [2021-09-12T09:12:14.617Z] [ERROR]   mvn <args> -rf :org.eclipse.tracecompass.tmf.remote.ui.swtbot.tests
05:12:15 [2021-09-12T09:12:15.185Z] [Pipeline] }
05:12:15 [2021-09-12T09:12:15.193Z] [Pipeline] // container
05:12:15 [2021-09-12T09:12:15.204Z] Post stage
05:12:15 [2021-09-12T09:12:15.208Z] [Pipeline] container
05:12:15 [2021-09-12T09:12:15.208Z] [Pipeline] {
05:12:15 [2021-09-12T09:12:15.214Z] [Pipeline] sh
05:12:15 [2021-09-12T09:12:15.751Z] + echo */*tests/screenshots/*.jpeg,*/*tests/target/work/data/.metadata/.log
05:12:15 [2021-09-12T09:12:15.751Z] */*tests/screenshots/*.jpeg,*/*tests/target/work/data/.metadata/.log
05:12:15 [2021-09-12T09:12:15.758Z] [Pipeline] junit
05:12:15 [2021-09-12T09:12:15.760Z] Recording test results
05:12:23 [2021-09-12T09:12:23.780Z] [Checks API] No suitable checks publisher found.
05:12:23 [2021-09-12T09:12:23.782Z] [Pipeline] archiveArtifacts
05:12:23 [2021-09-12T09:12:23.836Z] Archiving artifacts
05:12:23 [2021-09-12T09:12:23.850Z] [Pipeline] }
05:12:24 [2021-09-12T09:12:24.057Z] [Pipeline] // container
05:12:24 [2021-09-12T09:12:24.067Z] [Pipeline] }
05:12:24 [2021-09-12T09:12:24.072Z] [Pipeline] // withEnv
05:12:24 [2021-09-12T09:12:24.078Z] [Pipeline] }
05:12:24 [2021-09-12T09:12:24.083Z] [Pipeline] // stage
05:12:24 [2021-09-12T09:12:24.089Z] [Pipeline] stage
05:12:24 [2021-09-12T09:12:24.089Z] [Pipeline] { (Deploy Site)
05:12:24 [2021-09-12T09:12:24.095Z] Stage "Deploy Site" skipped due to earlier failure(s)
05:12:24 [2021-09-12T09:12:24.096Z] [Pipeline] }
05:12:24 [2021-09-12T09:12:24.174Z] [Pipeline] // stage
05:12:24 [2021-09-12T09:12:24.181Z] [Pipeline] stage
05:12:24 [2021-09-12T09:12:24.182Z] [Pipeline] { (Deploy RCP)
05:12:24 [2021-09-12T09:12:24.187Z] Stage "Deploy RCP" skipped due to earlier failure(s)
05:12:24 [2021-09-12T09:12:24.188Z] [Pipeline] }
05:12:24 [2021-09-12T09:12:24.305Z] [Pipeline] // stage
05:12:24 [2021-09-12T09:12:24.311Z] [Pipeline] stage
05:12:24 [2021-09-12T09:12:24.312Z] [Pipeline] { (Deploy Doc)
05:12:24 [2021-09-12T09:12:24.317Z] Stage "Deploy Doc" skipped due to earlier failure(s)
05:12:24 [2021-09-12T09:12:24.318Z] [Pipeline] }
05:12:24 [2021-09-12T09:12:24.323Z] [Pipeline] // stage
05:12:24 [2021-09-12T09:12:24.329Z] [Pipeline] stage
05:12:24 [2021-09-12T09:12:24.330Z] [Pipeline] { (Declarative: Post Actions)
05:12:24 [2021-09-12T09:12:24.340Z] [Pipeline] container
05:12:24 [2021-09-12T09:12:24.341Z] [Pipeline] {
05:12:24 [2021-09-12T09:12:24.407Z] [Pipeline] emailext
05:12:24 [2021-09-12T09:12:24.665Z] Sending email to: bernd.hufmann@ericsson.com patrick.tasse@gmail.com matthew.khouzam@ericsson.com
05:12:24 [2021-09-12T09:12:24.861Z] [Pipeline] }
05:12:24 [2021-09-12T09:12:24.867Z] [Pipeline] // container
05:12:25 [2021-09-12T09:12:25.000Z] [Pipeline] }
05:12:25 [2021-09-12T09:12:25.116Z] [Pipeline] // stage
05:12:25 [2021-09-12T09:12:25.230Z] [Pipeline] }
05:12:25 [2021-09-12T09:12:25.235Z] [Pipeline] // withEnv
05:12:25 [2021-09-12T09:12:25.240Z] [Pipeline] }
05:12:25 [2021-09-12T09:12:25.245Z] [Pipeline] // timeout
05:12:25 [2021-09-12T09:12:25.250Z] [Pipeline] }
05:12:25 [2021-09-12T09:12:25.256Z] [Pipeline] // timestamps
05:12:25 [2021-09-12T09:12:25.261Z] [Pipeline] }
05:12:25 [2021-09-12T09:12:25.265Z] [Pipeline] // withEnv
05:12:25 [2021-09-12T09:12:25.271Z] [Pipeline] }
05:12:25 [2021-09-12T09:12:25.276Z] [Pipeline] // withEnv
05:12:25 [2021-09-12T09:12:25.281Z] [Pipeline] }
05:12:25 [2021-09-12T09:12:25.286Z] [Pipeline] // node
05:12:25 [2021-09-12T09:12:25.292Z] [Pipeline] }
05:12:25 [2021-09-12T09:12:25.297Z] [Pipeline] // podTemplate
05:12:25 [2021-09-12T09:12:25.303Z] [Pipeline] End of Pipeline
05:12:25 [2021-09-12T09:12:25.330Z] ERROR: script returned exit code 1
05:12:25 [2021-09-12T09:12:25.400Z] Finished: FAILURE