UnstableConsole Output

Skipping 11,446 KB.. Full Log
DEBUG - matched Button with text "Import", using matcher: (of type 'Button' and with mnemonic 'Import' and with style 'SWT.PUSH')
08:07:21 DEBUG - matched Button with text "Export", using matcher: of type 'Button'
08:07:21 DEBUG - matched Button with text "Edit...", using matcher: of type 'Button'
08:07:21 DEBUG - matched Button with text "Delete", using matcher: of type 'Button'
08:07:21 DEBUG - matched Button with text "Check selected", using matcher: of type 'Button'
08:07:21 DEBUG - matched Button with text "Check all", using matcher: of type 'Button'
08:07:21 DEBUG - matched Button with text "Uncheck selected", using matcher: of type 'Button'
08:07:21 DEBUG - matched Button with text "Uncheck all", using matcher: of type 'Button'
08:07:21 DEBUG - matched Button with text "Restore &Defaults", using matcher: of type 'Button'
08:07:21 DEBUG - matched Button with text "&Apply", using matcher: of type 'Button'
08:07:21 DEBUG - matched Button with text "Apply and Close", using matcher: of type 'Button'
08:07:21 DEBUG - matched Button with text "Cancel", using matcher: of type 'Button'
08:07:21 DEBUG - Clicking on Import
08:07:21 DEBUG - Sent event MouseEnter [6]: MouseEvent{Button {Import} time=1415874546 data=null button=0 stateMask=0x0 x=0 y=0 count=0} to (of type 'Button' and with mnemonic 'Import' and with style 'SWT.PUSH')
08:07:21 DEBUG - Sent event MouseMove [5]: MouseEvent{Button {Import} time=1415874546 data=null button=0 stateMask=0x0 x=0 y=0 count=0} to (of type 'Button' and with mnemonic 'Import' and with style 'SWT.PUSH')
08:07:21 DEBUG - Sent event Activate [26]: ShellEvent{Button {Import} time=1415874555 data=null doit=true} to (of type 'Button' and with mnemonic 'Import' and with style 'SWT.PUSH')
08:07:21 DEBUG - Sent event FocusIn [15]: FocusEvent{Button {Import} time=1415874556 data=null} to (of type 'Button' and with mnemonic 'Import' and with style 'SWT.PUSH')
08:07:21 DEBUG - Sent event MouseDown [3]: MouseEvent{Button {Import} time=1415874557 data=null button=0 stateMask=0x0 x=0 y=0 count=0} to (of type 'Button' and with mnemonic 'Import' and with style 'SWT.PUSH')
08:07:21 DEBUG - Sent event MouseUp [4]: MouseEvent{Button {Import} time=1415874557 data=null button=0 stateMask=0x0 x=0 y=0 count=0} to (of type 'Button' and with mnemonic 'Import' and with style 'SWT.PUSH')
08:07:21 DEBUG - Sent event Selection [13]: SelectionEvent{Button {Import} time=1415874557 data=null item=null detail=0 x=0 y=0 width=0 height=0 stateMask=0x0 text=null doit=true} to (of type 'Button' and with mnemonic 'Import' and with style 'SWT.PUSH')
08:07:21 DEBUG - Sent event MouseHover [32]: MouseEvent{Button {Import} time=1415874592 data=null button=0 stateMask=0x0 x=0 y=0 count=0} to (of type 'Button' and with mnemonic 'Import' and with style 'SWT.PUSH')
08:07:21 DEBUG - Sent event MouseMove [5]: MouseEvent{Button {Import} time=1415874593 data=null button=0 stateMask=0x0 x=0 y=0 count=0} to (of type 'Button' and with mnemonic 'Import' and with style 'SWT.PUSH')
08:07:21 DEBUG - Sent event MouseExit [7]: MouseEvent{Button {Import} time=1415874593 data=null button=0 stateMask=0x0 x=0 y=0 count=0} to (of type 'Button' and with mnemonic 'Import' and with style 'SWT.PUSH')
08:07:21 DEBUG - Sent event Deactivate [27]: ShellEvent{Button {Import} time=1415874593 data=null doit=true} to (of type 'Button' and with mnemonic 'Import' and with style 'SWT.PUSH')
08:07:21 DEBUG - Sent event FocusOut [16]: FocusEvent{Button {Import} time=1415874593 data=null} to (of type 'Button' and with mnemonic 'Import' and with style 'SWT.PUSH')
08:07:21 DEBUG - Clicked on Import
08:07:21 DEBUG - matched Table with text "", using matcher: of type 'Table'
08:07:21 DEBUG - matched Table with text "", using matcher: (of type 'Table')
08:07:21 DEBUG - matched Table with text "", using matcher: of type 'Table'
08:07:21 DEBUG - matched Table with text "", using matcher: (of type 'Table')
08:07:21 DEBUG - Attempting to set focus on (of type 'Table')
08:07:21 DEBUG - Attempting to set focus on (of type 'Table')
08:07:21 DEBUG - Selecting rows [0] in (of type 'Table')
08:07:21 DEBUG - Sent event MouseEnter [6]: MouseEvent{Table {} time=1415874606 data=null button=0 stateMask=0x0 x=0 y=0 count=0} to (of type 'Table')
08:07:21 DEBUG - Sent event MouseMove [5]: MouseEvent{Table {} time=1415874606 data=null button=0 stateMask=0x0 x=0 y=0 count=0} to (of type 'Table')
08:07:21 DEBUG - Sent event Activate [26]: ShellEvent{Table {} time=1415874606 data=null doit=true} to (of type 'Table')
08:07:21 DEBUG - Sent event FocusIn [15]: FocusEvent{Table {} time=1415874607 data=null} to (of type 'Table')
08:07:21 DEBUG - Sent event MouseDown [3]: MouseEvent{TableItem {state_provider_placement} time=1415874607 data=null button=1 stateMask=0x0 x=97 y=10 count=1} to (of type 'Table')
08:07:21 DEBUG - Sent event Selection [13]: SelectionEvent{Table {} time=1415874608 data=null item=TableItem {state_provider_placement} detail=0 x=0 y=0 width=0 height=0 stateMask=0x80000 text=null doit=true} to (of type 'Table')
08:07:21 DEBUG - Sent event MouseUp [4]: MouseEvent{TableItem {state_provider_placement} time=1415874642 data=null button=1 stateMask=0x80000 x=97 y=10 count=1} to (of type 'Table')
08:07:21 DEBUG - matched Button with text "Import", using matcher: of type 'Button'
08:07:21 DEBUG - matched Button with text "Export", using matcher: of type 'Button'
08:07:21 DEBUG - matched Button with text "Export", using matcher: with mnemonic 'Export'
08:07:21 DEBUG - matched Button with text "Export", using matcher: with style 'SWT.PUSH'
08:07:21 DEBUG - matched Button with text "Export", using matcher: (of type 'Button' and with mnemonic 'Export' and with style 'SWT.PUSH')
08:07:21 DEBUG - matched Button with text "Edit...", using matcher: of type 'Button'
08:07:21 DEBUG - matched Button with text "Delete", using matcher: of type 'Button'
08:07:21 DEBUG - matched Button with text "Check selected", using matcher: of type 'Button'
08:07:21 DEBUG - matched Button with text "Check all", using matcher: of type 'Button'
08:07:21 DEBUG - matched Button with text "Uncheck selected", using matcher: of type 'Button'
08:07:21 DEBUG - matched Button with text "Uncheck all", using matcher: of type 'Button'
08:07:21 DEBUG - matched Button with text "Restore &Defaults", using matcher: of type 'Button'
08:07:21 DEBUG - matched Button with text "&Apply", using matcher: of type 'Button'
08:07:21 DEBUG - matched Button with text "Apply and Close", using matcher: of type 'Button'
08:07:21 DEBUG - matched Button with text "Cancel", using matcher: of type 'Button'
08:07:21 DEBUG - Clicking on Export
08:07:21 DEBUG - Sent event MouseEnter [6]: MouseEvent{Button {Export} time=1415874644 data=null button=0 stateMask=0x0 x=0 y=0 count=0} to (of type 'Button' and with mnemonic 'Export' and with style 'SWT.PUSH')
08:07:21 DEBUG - Sent event MouseMove [5]: MouseEvent{Button {Export} time=1415874645 data=null button=0 stateMask=0x0 x=0 y=0 count=0} to (of type 'Button' and with mnemonic 'Export' and with style 'SWT.PUSH')
08:07:21 DEBUG - Sent event Activate [26]: ShellEvent{Button {Export} time=1415874645 data=null doit=true} to (of type 'Button' and with mnemonic 'Export' and with style 'SWT.PUSH')
08:07:21 DEBUG - Sent event FocusIn [15]: FocusEvent{Button {Export} time=1415874645 data=null} to (of type 'Button' and with mnemonic 'Export' and with style 'SWT.PUSH')
08:07:21 DEBUG - Sent event MouseDown [3]: MouseEvent{Button {Export} time=1415874646 data=null button=0 stateMask=0x0 x=0 y=0 count=0} to (of type 'Button' and with mnemonic 'Export' and with style 'SWT.PUSH')
08:07:21 DEBUG - Sent event MouseUp [4]: MouseEvent{Button {Export} time=1415874646 data=null button=0 stateMask=0x0 x=0 y=0 count=0} to (of type 'Button' and with mnemonic 'Export' and with style 'SWT.PUSH')
08:07:21 
08:07:21 !ENTRY org.eclipse.tracecompass.tmf.analysis.xml.core 4 0 2019-04-25 12:07:15.800
08:07:21 !MESSAGE An error occurred while copying the XML file to the TMF directory. The file was not imported.
08:07:21 !STACK 0
08:07:21 java.io.IOException: The system cannot find the path specified
08:07:21 	at java.io.WinNTFileSystem.createFileExclusively(Native Method)
08:07:21 	at java.io.File.createNewFile(File.java:1012)
08:07:21 	at org.eclipse.tracecompass.internal.tmf.analysis.xml.core.module.XmlUtils.copyXmlFile(XmlUtils.java:467)
08:07:21 	at org.eclipse.tracecompass.internal.tmf.analysis.xml.core.module.XmlUtils.exportXmlFile(XmlUtils.java:461)
08:07:21 	at org.eclipse.tracecompass.internal.tmf.analysis.xml.ui.preferences.XMLAnalysesManagerPreferencePage.exportAnalysis(XMLAnalysesManagerPreferencePage.java:537)
08:07:21 	at org.eclipse.tracecompass.internal.tmf.analysis.xml.ui.preferences.XMLAnalysesManagerPreferencePage.access$6(XMLAnalysesManagerPreferencePage.java:526)
08:07:21 	at org.eclipse.tracecompass.internal.tmf.analysis.xml.ui.preferences.XMLAnalysesManagerPreferencePage$4.widgetSelected(XMLAnalysesManagerPreferencePage.java:240)
08:07:21 	at org.eclipse.swt.widgets.TypedListener.handleEvent(TypedListener.java:252)
08:07:21 	at org.eclipse.swt.widgets.EventTable.sendEvent(EventTable.java:89)
08:07:21 	at org.eclipse.swt.widgets.Display.sendEvent(Display.java:4131)
08:07:21 	at org.eclipse.swt.widgets.Widget.sendEvent(Widget.java:1055)
08:07:21 	at org.eclipse.swt.widgets.Widget.sendEvent(Widget.java:1079)
08:07:21 	at org.eclipse.swt.widgets.Widget.sendEvent(Widget.java:1064)
08:07:21 	at org.eclipse.swt.widgets.Widget.notifyListeners(Widget.java:778)
08:07:21 	at org.eclipse.swtbot.swt.finder.widgets.AbstractSWTBot$2.run(AbstractSWTBot.java:190)
08:07:21 	at org.eclipse.swtbot.swt.finder.finders.UIThreadRunnable$5.doRun(UIThreadRunnable.java:222)
08:07:21 	at org.eclipse.swtbot.swt.finder.finders.UIThreadRunnable$1.run(UIThreadRunnable.java:88)
08:07:21 	at org.eclipse.swt.widgets.RunnableLock.run(RunnableLock.java:40)
08:07:21 	at org.eclipse.swt.widgets.Synchronizer.runAsyncMessages(Synchronizer.java:185)
08:07:21 	at org.eclipse.swt.widgets.Display.runAsyncMessages(Display.java:3919)
08:07:21 	at org.eclipse.swt.widgets.Display.readAndDispatch(Display.java:3550)
08:07:21 	at org.eclipse.jface.window.Window.runEventLoop(Window.java:823)
08:07:21 	at org.eclipse.jface.window.Window.open(Window.java:799)
08:07:21 	at org.eclipse.ui.internal.dialogs.WorkbenchPreferenceDialog.open(WorkbenchPreferenceDialog.java:214)
08:07:21 	at org.eclipse.ui.internal.OpenPreferencesAction.run(OpenPreferencesAction.java:66)
08:07:21 	at org.eclipse.jface.action.Action.runWithEvent(Action.java:474)
08:07:21 	at org.eclipse.jface.action.ActionContributionItem.handleWidgetSelection(ActionContributionItem.java:568)
08:07:21 	at org.eclipse.jface.action.ActionContributionItem.lambda$4(ActionContributionItem.java:400)
08:07:21 	at org.eclipse.swt.widgets.EventTable.sendEvent(EventTable.java:89)
08:07:21 	at org.eclipse.swt.widgets.Display.sendEvent(Display.java:4131)
08:07:21 	at org.eclipse.swt.widgets.Widget.sendEvent(Widget.java:1055)
08:07:21 	at org.eclipse.swt.widgets.Widget.sendEvent(Widget.java:1079)
08:07:21 	at org.eclipse.swt.widgets.Widget.sendEvent(Widget.java:1064)
08:07:21 	at org.eclipse.swt.widgets.Widget.notifyListeners(Widget.java:778)
08:07:21 	at org.eclipse.swtbot.swt.finder.widgets.AbstractSWTBot$2.run(AbstractSWTBot.java:190)
08:07:21 	at org.eclipse.swtbot.swt.finder.finders.UIThreadRunnable$5.doRun(UIThreadRunnable.java:222)
08:07:21 	at org.eclipse.swtbot.swt.finder.finders.UIThreadRunnable.run(UIThreadRunnable.java:76)
08:07:21 	at org.eclipse.swtbot.swt.finder.finders.UIThreadRunnable.asyncExec(UIThreadRunnable.java:224)
08:07:21 	at org.eclipse.swtbot.swt.finder.widgets.AbstractSWTBot.asyncExec(AbstractSWTBot.java:656)
08:07:21 	at org.eclipse.swtbot.swt.finder.widgets.AbstractSWTBot.notify(AbstractSWTBot.java:175)
08:07:21 	at org.eclipse.swtbot.swt.finder.widgets.AbstractSWTBot.notify(AbstractSWTBot.java:153)
08:07:21 	at org.eclipse.swtbot.swt.finder.widgets.AbstractSWTBot.notify(AbstractSWTBot.java:142)
08:07:21 	at org.eclipse.swtbot.swt.finder.widgets.AbstractSWTBot.notify(AbstractSWTBot.java:132)
08:07:21 	at org.eclipse.swtbot.swt.finder.widgets.SWTBotMenu$1.run(SWTBotMenu.java:88)
08:07:21 	at org.eclipse.swtbot.swt.finder.finders.UIThreadRunnable$5.doRun(UIThreadRunnable.java:222)
08:07:21 	at org.eclipse.swtbot.swt.finder.finders.UIThreadRunnable$1.run(UIThreadRunnable.java:88)
08:07:21 	at org.eclipse.swt.widgets.RunnableLock.run(RunnableLock.java:40)
08:07:21 	at org.eclipse.swt.widgets.Synchronizer.runAsyncMessages(Synchronizer.java:185)
08:07:21 	at org.eclipse.swt.widgets.Display.runAsyncMessages(Display.java:3919)
08:07:21 	at org.eclipse.swt.widgets.Display.readAndDispatch(Display.java:3550)
08:07:21 	at org.eclipse.e4.ui.internal.workbench.swt.PartRenderingEngine$5.run(PartRenderingEngine.java:1173)
08:07:21 	at org.eclipse.core.databinding.observable.Realm.runWithDefault(Realm.java:338)
08:07:21 	at org.eclipse.e4.ui.internal.workbench.swt.PartRenderingEngine.run(PartRenderingEngine.java:1062)
08:07:21 	at org.eclipse.e4.ui.internal.workbench.E4Workbench.createAndRunUI(E4Workbench.java:155)
08:07:21 	at org.eclipse.ui.internal.Workbench.lambda$3(Workbench.java:644)
08:07:21 	at org.eclipse.core.databinding.observable.Realm.runWithDefault(Realm.java:338)
08:07:21 	at org.eclipse.ui.internal.Workbench.createAndRunWorkbench(Workbench.java:566)
08:07:21 	at org.eclipse.ui.PlatformUI.createAndRunWorkbench(PlatformUI.java:150)
08:07:21 	at org.eclipse.ui.internal.ide.application.IDEApplication.start(IDEApplication.java:155)
08:07:21 	at org.eclipse.tycho.surefire.osgibooter.UITestApplication.runApplication(UITestApplication.java:31)
08:07:21 	at org.eclipse.tycho.surefire.osgibooter.AbstractUITestApplication.run(AbstractUITestApplication.java:120)
08:07:21 	at org.eclipse.tycho.surefire.osgibooter.UITestApplication.start(UITestApplication.java:37)
08:07:21 	at org.eclipse.equinox.internal.app.EclipseAppHandle.run(EclipseAppHandle.java:203)
08:07:21 	at org.eclipse.core.runtime.internal.adaptor.EclipseAppLauncher.runApplication(EclipseAppLauncher.java:137)
08:07:21 	at org.eclipse.core.runtime.internal.adaptor.EclipseAppLauncher.start(EclipseAppLauncher.java:107)
08:07:21 	at org.eclipse.core.runtime.adaptor.EclipseStarter.run(EclipseStarter.java:400)
08:07:21 	at org.eclipse.core.runtime.adaptor.EclipseStarter.run(EclipseStarter.java:255)
08:07:21 	at sun.reflect.NativeMethodAccessorImpl.invoke0(Native Method)
08:07:21 	at sun.reflect.NativeMethodAccessorImpl.invoke(NativeMethodAccessorImpl.java:62)
08:07:21 	at sun.reflect.DelegatingMethodAccessorImpl.invoke(DelegatingMethodAccessorImpl.java:43)
08:07:21 	at java.lang.reflect.Method.invoke(Method.java:498)
08:07:21 	at org.eclipse.equinox.launcher.Main.invokeFramework(Main.java:661)
08:07:21 	at org.eclipse.equinox.launcher.Main.basicRun(Main.java:597)
08:07:21 	at org.eclipse.equinox.launcher.Main.run(Main.java:1476)
08:07:21 	at org.eclipse.equinox.launcher.Main.main(Main.java:1449)
08:07:21 
08:07:21 !ENTRY org.eclipse.tracecompass.tmf.analysis.xml.ui 4 0 2019-04-25 12:07:15.803
08:07:21 !MESSAGE Failed to export state_provider_placement.xml
08:07:21 DEBUG - Sent event Selection [13]: SelectionEvent{Button {Export} time=1415874646 data=null item=null detail=0 x=0 y=0 width=0 height=0 stateMask=0x0 text=null doit=true} to (of type 'Button' and with mnemonic 'Export' and with style 'SWT.PUSH')
08:07:21 DEBUG - Sent event MouseHover [32]: MouseEvent{Button {Export} time=1415874652 data=null button=0 stateMask=0x0 x=0 y=0 count=0} to (of type 'Button' and with mnemonic 'Export' and with style 'SWT.PUSH')
08:07:21 DEBUG - Sent event MouseMove [5]: MouseEvent{Button {Export} time=1415874652 data=null button=0 stateMask=0x0 x=0 y=0 count=0} to (of type 'Button' and with mnemonic 'Export' and with style 'SWT.PUSH')
08:07:21 DEBUG - Sent event MouseExit [7]: MouseEvent{Button {Export} time=1415874652 data=null button=0 stateMask=0x0 x=0 y=0 count=0} to (of type 'Button' and with mnemonic 'Export' and with style 'SWT.PUSH')
08:07:21 DEBUG - Sent event Deactivate [27]: ShellEvent{Button {Export} time=1415874652 data=null doit=true} to (of type 'Button' and with mnemonic 'Export' and with style 'SWT.PUSH')
08:07:21 DEBUG - Sent event FocusOut [16]: FocusEvent{Button {Export} time=1415874652 data=null} to (of type 'Button' and with mnemonic 'Export' and with style 'SWT.PUSH')
08:07:21 DEBUG - Clicked on Export
08:07:21 DEBUG - Capturing screenshot 'screenshots/testExport(org.eclipse.tracecompass.tmf.analysis.xml.ui.swtbot.tests.preferences.XMLAnalysesManagerPreferencePageTest).jpeg'
08:07:21 
08:07:41 !ENTRY org.eclipse.tracecompass.tmf.analysis.xml.core 4 0 2019-04-25 12:07:36.223
08:07:41 !MESSAGE XML Parsing error at line 6: cvc-complex-type.2.4.a: Invalid content was found starting with element 'element'. One of '{timeGraphView, xyView, stateProvider, pattern, extra}' is expected.
08:07:41 DEBUG - Capturing screenshot 'screenshots/testInvalidLabel(org.eclipse.tracecompass.tmf.analysis.xml.ui.swtbot.tests.preferences.XMLAnalysesManagerPreferencePageTest).jpeg'
08:08:02 Tests run: 11, Failures: 1, Errors: 3, Skipped: 0, Time elapsed: 87.069 s <<< FAILURE! - in org.eclipse.tracecompass.tmf.analysis.xml.ui.swtbot.tests.preferences.XMLAnalysesManagerPreferencePageTest
08:08:24 testPreferencePageMenuBar(org.eclipse.tracecompass.tmf.analysis.xml.ui.swtbot.tests.preferences.XMLAnalysesManagerPreferencePageTest)  Time elapsed: 3.402 s
08:08:24 testImportInvalid(org.eclipse.tracecompass.tmf.analysis.xml.ui.swtbot.tests.preferences.XMLAnalysesManagerPreferencePageTest)  Time elapsed: 1.915 s
08:08:24 testPreferencePageContextMenu(org.eclipse.tracecompass.tmf.analysis.xml.ui.swtbot.tests.preferences.XMLAnalysesManagerPreferencePageTest)  Time elapsed: 3.81 s
08:08:24 testEdit(org.eclipse.tracecompass.tmf.analysis.xml.ui.swtbot.tests.preferences.XMLAnalysesManagerPreferencePageTest)  Time elapsed: 5.817 s
08:08:24 testImportValid(org.eclipse.tracecompass.tmf.analysis.xml.ui.swtbot.tests.preferences.XMLAnalysesManagerPreferencePageTest)  Time elapsed: 3.212 s
08:08:24 testCheckButtons(org.eclipse.tracecompass.tmf.analysis.xml.ui.swtbot.tests.preferences.XMLAnalysesManagerPreferencePageTest)  Time elapsed: 3.324 s
08:08:24 testDelete(org.eclipse.tracecompass.tmf.analysis.xml.ui.swtbot.tests.preferences.XMLAnalysesManagerPreferencePageTest)  Time elapsed: 2.692 s
08:08:24 testExport(org.eclipse.tracecompass.tmf.analysis.xml.ui.swtbot.tests.preferences.XMLAnalysesManagerPreferencePageTest)  Time elapsed: 20.673 s  <<< FAILURE!
08:08:24 java.lang.AssertionError: \tmp\state_provider_placement.xml
08:08:24 	at org.junit.Assert.fail(Assert.java:88)
08:08:24 	at org.junit.Assert.assertTrue(Assert.java:41)
08:08:24 	at org.eclipse.tracecompass.tmf.analysis.xml.ui.swtbot.tests.preferences.XMLAnalysesManagerPreferencePageTest.testExport(XMLAnalysesManagerPreferencePageTest.java:348)
08:08:24 	at sun.reflect.NativeMethodAccessorImpl.invoke0(Native Method)
08:08:24 	at sun.reflect.NativeMethodAccessorImpl.invoke(NativeMethodAccessorImpl.java:62)
08:08:24 	at sun.reflect.DelegatingMethodAccessorImpl.invoke(DelegatingMethodAccessorImpl.java:43)
08:08:24 	at java.lang.reflect.Method.invoke(Method.java:498)
08:08:24 	at org.junit.runners.model.FrameworkMethod$1.runReflectiveCall(FrameworkMethod.java:50)
08:08:24 	at org.junit.internal.runners.model.ReflectiveCallable.run(ReflectiveCallable.java:12)
08:08:24 	at org.junit.runners.model.FrameworkMethod.invokeExplosively(FrameworkMethod.java:47)
08:08:24 	at org.eclipse.swtbot.swt.finder.junit.internal.CapturingFrameworkMethod.invokeExplosively(CapturingFrameworkMethod.java:47)
08:08:24 	at org.junit.internal.runners.statements.InvokeMethod.evaluate(InvokeMethod.java:17)
08:08:24 	at org.junit.internal.runners.statements.RunBefores.evaluate(RunBefores.java:26)
08:08:24 	at org.junit.internal.runners.statements.RunAfters.evaluate(RunAfters.java:27)
08:08:24 	at org.junit.runners.ParentRunner.runLeaf(ParentRunner.java:325)
08:08:24 	at org.eclipse.swtbot.swt.finder.junit.SWTBotJunit4ClassRunner.runChild(SWTBotJunit4ClassRunner.java:75)
08:08:24 	at org.junit.runners.BlockJUnit4ClassRunner.runChild(BlockJUnit4ClassRunner.java:57)
08:08:24 	at org.junit.runners.ParentRunner$3.run(ParentRunner.java:290)
08:08:24 	at org.junit.runners.ParentRunner$1.schedule(ParentRunner.java:71)
08:08:24 	at org.junit.runners.ParentRunner.runChildren(ParentRunner.java:288)
08:08:24 	at org.junit.runners.ParentRunner.access$000(ParentRunner.java:58)
08:08:24 	at org.junit.runners.ParentRunner$2.evaluate(ParentRunner.java:268)
08:08:24 	at org.junit.internal.runners.statements.RunBefores.evaluate(RunBefores.java:26)
08:08:24 	at org.junit.internal.runners.statements.RunAfters.evaluate(RunAfters.java:27)
08:08:24 	at org.junit.runners.ParentRunner.run(ParentRunner.java:363)
08:08:24 	at org.eclipse.swtbot.swt.finder.junit.SWTBotJunit4ClassRunner.run(SWTBotJunit4ClassRunner.java:60)
08:08:24 	at org.apache.maven.surefire.junit4.JUnit4Provider.execute(JUnit4Provider.java:365)
08:08:24 	at org.apache.maven.surefire.junit4.JUnit4Provider.executeWithRerun(JUnit4Provider.java:273)
08:08:24 	at org.apache.maven.surefire.junit4.JUnit4Provider.executeTestSet(JUnit4Provider.java:238)
08:08:24 	at org.apache.maven.surefire.junit4.JUnit4Provider.invoke(JUnit4Provider.java:159)
08:08:24 	at sun.reflect.NativeMethodAccessorImpl.invoke0(Native Method)
08:08:24 	at sun.reflect.NativeMethodAccessorImpl.invoke(NativeMethodAccessorImpl.java:62)
08:08:24 	at sun.reflect.DelegatingMethodAccessorImpl.invoke(DelegatingMethodAccessorImpl.java:43)
08:08:24 	at java.lang.reflect.Method.invoke(Method.java:498)
08:08:24 	at org.apache.maven.surefire.util.ReflectionUtils.invokeMethodWithArray2(ReflectionUtils.java:206)
08:08:24 	at org.apache.maven.surefire.booter.ProviderFactory$ProviderProxy.invoke(ProviderFactory.java:161)
08:08:24 	at org.apache.maven.surefire.booter.ProviderFactory.invokeProvider(ProviderFactory.java:84)
08:08:24 	at org.eclipse.tycho.surefire.osgibooter.OsgiSurefireBooter.run(OsgiSurefireBooter.java:110)
08:08:24 	at org.eclipse.tycho.surefire.osgibooter.AbstractUITestApplication.runTests(AbstractUITestApplication.java:44)
08:08:24 	at org.eclipse.e4.ui.internal.workbench.swt.E4Testable.lambda$0(E4Testable.java:76)
08:08:24 	at java.lang.Thread.run(Thread.java:745)
08:08:24 
08:08:24 testExport(org.eclipse.tracecompass.tmf.analysis.xml.ui.swtbot.tests.preferences.XMLAnalysesManagerPreferencePageTest)  Time elapsed: 20.673 s  <<< ERROR!
08:08:24 org.eclipse.swtbot.swt.finder.widgets.TimeoutException: Timeout after: 20000 ms.: Timed out waiting for Shell {data - Eclipse Platf...} to get activated
08:08:24 	at org.eclipse.swtbot.swt.finder.SWTBotFactory.waitUntil(SWTBotFactory.java:524)
08:08:24 	at org.eclipse.swtbot.swt.finder.SWTBot.waitUntil(SWTBot.java:1)
08:08:24 	at org.eclipse.swtbot.swt.finder.SWTBotFactory.waitUntil(SWTBotFactory.java:498)
08:08:24 	at org.eclipse.swtbot.swt.finder.SWTBot.waitUntil(SWTBot.java:1)
08:08:24 	at org.eclipse.swtbot.swt.finder.SWTBotFactory.waitUntil(SWTBotFactory.java:486)
08:08:24 	at org.eclipse.swtbot.swt.finder.SWTBot.waitUntil(SWTBot.java:1)
08:08:24 	at org.eclipse.swtbot.swt.finder.widgets.SWTBotShell.activate(SWTBotShell.java:78)
08:08:24 	at org.eclipse.tracecompass.tmf.ui.swtbot.tests.shared.SWTBotUtils.focusMainWindow(SWTBotUtils.java:318)
08:08:24 	at org.eclipse.tracecompass.tmf.ui.swtbot.tests.shared.SWTBotUtils.openPreferences(SWTBotUtils.java:1117)
08:08:24 	at org.eclipse.tracecompass.tmf.analysis.xml.ui.swtbot.tests.preferences.XMLAnalysesManagerPreferencePageTest.openXMLAnalysesPreferences(XMLAnalysesManagerPreferencePageTest.java:404)
08:08:24 	at org.eclipse.tracecompass.tmf.analysis.xml.ui.swtbot.tests.preferences.XMLAnalysesManagerPreferencePageTest.after(XMLAnalysesManagerPreferencePageTest.java:359)
08:08:24 	at sun.reflect.NativeMethodAccessorImpl.invoke0(Native Method)
08:08:24 	at sun.reflect.NativeMethodAccessorImpl.invoke(NativeMethodAccessorImpl.java:62)
08:08:24 	at sun.reflect.DelegatingMethodAccessorImpl.invoke(DelegatingMethodAccessorImpl.java:43)
08:08:24 	at java.lang.reflect.Method.invoke(Method.java:498)
08:08:24 	at org.junit.runners.model.FrameworkMethod$1.runReflectiveCall(FrameworkMethod.java:50)
08:08:24 	at org.junit.internal.runners.model.ReflectiveCallable.run(ReflectiveCallable.java:12)
08:08:24 	at org.junit.runners.model.FrameworkMethod.invokeExplosively(FrameworkMethod.java:47)
08:08:24 	at org.junit.internal.runners.statements.RunAfters.evaluate(RunAfters.java:33)
08:08:24 	at org.junit.runners.ParentRunner.runLeaf(ParentRunner.java:325)
08:08:24 	at org.eclipse.swtbot.swt.finder.junit.SWTBotJunit4ClassRunner.runChild(SWTBotJunit4ClassRunner.java:75)
08:08:24 	at org.junit.runners.BlockJUnit4ClassRunner.runChild(BlockJUnit4ClassRunner.java:57)
08:08:24 	at org.junit.runners.ParentRunner$3.run(ParentRunner.java:290)
08:08:24 	at org.junit.runners.ParentRunner$1.schedule(ParentRunner.java:71)
08:08:24 	at org.junit.runners.ParentRunner.runChildren(ParentRunner.java:288)
08:08:24 	at org.junit.runners.ParentRunner.access$000(ParentRunner.java:58)
08:08:24 	at org.junit.runners.ParentRunner$2.evaluate(ParentRunner.java:268)
08:08:24 	at org.junit.internal.runners.statements.RunBefores.evaluate(RunBefores.java:26)
08:08:24 	at org.junit.internal.runners.statements.RunAfters.evaluate(RunAfters.java:27)
08:08:24 	at org.junit.runners.ParentRunner.run(ParentRunner.java:363)
08:08:24 	at org.eclipse.swtbot.swt.finder.junit.SWTBotJunit4ClassRunner.run(SWTBotJunit4ClassRunner.java:60)
08:08:24 	at org.apache.maven.surefire.junit4.JUnit4Provider.execute(JUnit4Provider.java:365)
08:08:24 	at org.apache.maven.surefire.junit4.JUnit4Provider.executeWithRerun(JUnit4Provider.java:273)
08:08:24 	at org.apache.maven.surefire.junit4.JUnit4Provider.executeTestSet(JUnit4Provider.java:238)
08:08:24 	at org.apache.maven.surefire.junit4.JUnit4Provider.invoke(JUnit4Provider.java:159)
08:08:24 	at sun.reflect.NativeMethodAccessorImpl.invoke0(Native Method)
08:08:24 	at sun.reflect.NativeMethodAccessorImpl.invoke(NativeMethodAccessorImpl.java:62)
08:08:24 	at sun.reflect.DelegatingMethodAccessorImpl.invoke(DelegatingMethodAccessorImpl.java:43)
08:08:24 	at java.lang.reflect.Method.invoke(Method.java:498)
08:08:24 	at org.apache.maven.surefire.util.ReflectionUtils.invokeMethodWithArray2(ReflectionUtils.java:206)
08:08:24 	at org.apache.maven.surefire.booter.ProviderFactory$ProviderProxy.invoke(ProviderFactory.java:161)
08:08:24 	at org.apache.maven.surefire.booter.ProviderFactory.invokeProvider(ProviderFactory.java:84)
08:08:24 	at org.eclipse.tycho.surefire.osgibooter.OsgiSurefireBooter.run(OsgiSurefireBooter.java:110)
08:08:24 	at org.eclipse.tycho.surefire.osgibooter.AbstractUITestApplication.runTests(AbstractUITestApplication.java:44)
08:08:24 	at org.eclipse.e4.ui.internal.workbench.swt.E4Testable.lambda$0(E4Testable.java:76)
08:08:24 	at java.lang.Thread.run(Thread.java:745)
08:08:24 
08:08:24 testInvalidLabel(org.eclipse.tracecompass.tmf.analysis.xml.ui.swtbot.tests.preferences.XMLAnalysesManagerPreferencePageTest)  Time elapsed: 42 s  <<< ERROR!
08:08:24 org.eclipse.swtbot.swt.finder.widgets.TimeoutException: Timeout after: 20000 ms.: Timed out waiting for Shell {data - Eclipse Platf...} to get activated
08:08:24 	at org.eclipse.swtbot.swt.finder.SWTBotFactory.waitUntil(SWTBotFactory.java:524)
08:08:24 	at org.eclipse.swtbot.swt.finder.SWTBot.waitUntil(SWTBot.java:1)
08:08:24 	at org.eclipse.swtbot.swt.finder.SWTBotFactory.waitUntil(SWTBotFactory.java:498)
08:08:24 	at org.eclipse.swtbot.swt.finder.SWTBot.waitUntil(SWTBot.java:1)
08:08:24 	at org.eclipse.swtbot.swt.finder.SWTBotFactory.waitUntil(SWTBotFactory.java:486)
08:08:24 	at org.eclipse.swtbot.swt.finder.SWTBot.waitUntil(SWTBot.java:1)
08:08:24 	at org.eclipse.swtbot.swt.finder.widgets.SWTBotShell.activate(SWTBotShell.java:78)
08:08:24 	at org.eclipse.tracecompass.tmf.ui.swtbot.tests.shared.SWTBotUtils.focusMainWindow(SWTBotUtils.java:318)
08:08:24 	at org.eclipse.tracecompass.tmf.ui.swtbot.tests.shared.SWTBotUtils.openPreferences(SWTBotUtils.java:1117)
08:08:24 	at org.eclipse.tracecompass.tmf.analysis.xml.ui.swtbot.tests.preferences.XMLAnalysesManagerPreferencePageTest.openXMLAnalysesPreferences(XMLAnalysesManagerPreferencePageTest.java:404)
08:08:24 	at org.eclipse.tracecompass.tmf.analysis.xml.ui.swtbot.tests.preferences.XMLAnalysesManagerPreferencePageTest.testInvalidLabel(XMLAnalysesManagerPreferencePageTest.java:261)
08:08:24 	at sun.reflect.NativeMethodAccessorImpl.invoke0(Native Method)
08:08:24 	at sun.reflect.NativeMethodAccessorImpl.invoke(NativeMethodAccessorImpl.java:62)
08:08:24 	at sun.reflect.DelegatingMethodAccessorImpl.invoke(DelegatingMethodAccessorImpl.java:43)
08:08:24 	at java.lang.reflect.Method.invoke(Method.java:498)
08:08:24 	at org.junit.runners.model.FrameworkMethod$1.runReflectiveCall(FrameworkMethod.java:50)
08:08:24 	at org.junit.internal.runners.model.ReflectiveCallable.run(ReflectiveCallable.java:12)
08:08:24 	at org.junit.runners.model.FrameworkMethod.invokeExplosively(FrameworkMethod.java:47)
08:08:24 	at org.eclipse.swtbot.swt.finder.junit.internal.CapturingFrameworkMethod.invokeExplosively(CapturingFrameworkMethod.java:47)
08:08:24 	at org.junit.internal.runners.statements.InvokeMethod.evaluate(InvokeMethod.java:17)
08:08:24 	at org.junit.internal.runners.statements.RunBefores.evaluate(RunBefores.java:26)
08:08:24 	at org.junit.internal.runners.statements.RunAfters.evaluate(RunAfters.java:27)
08:08:24 	at org.junit.runners.ParentRunner.runLeaf(ParentRunner.java:325)
08:08:24 	at org.eclipse.swtbot.swt.finder.junit.SWTBotJunit4ClassRunner.runChild(SWTBotJunit4ClassRunner.java:75)
08:08:24 	at org.junit.runners.BlockJUnit4ClassRunner.runChild(BlockJUnit4ClassRunner.java:57)
08:08:24 	at org.junit.runners.ParentRunner$3.run(ParentRunner.java:290)
08:08:24 	at org.junit.runners.ParentRunner$1.schedule(ParentRunner.java:71)
08:08:24 	at org.junit.runners.ParentRunner.runChildren(ParentRunner.java:288)
08:08:24 	at org.junit.runners.ParentRunner.access$000(ParentRunner.java:58)
08:08:24 	at org.junit.runners.ParentRunner$2.evaluate(ParentRunner.java:268)
08:08:24 	at org.junit.internal.runners.statements.RunBefores.evaluate(RunBefores.java:26)
08:08:24 	at org.junit.internal.runners.statements.RunAfters.evaluate(RunAfters.java:27)
08:08:24 	at org.junit.runners.ParentRunner.run(ParentRunner.java:363)
08:08:24 	at org.eclipse.swtbot.swt.finder.junit.SWTBotJunit4ClassRunner.run(SWTBotJunit4ClassRunner.java:60)
08:08:24 	at org.apache.maven.surefire.junit4.JUnit4Provider.execute(JUnit4Provider.java:365)
08:08:24 	at org.apache.maven.surefire.junit4.JUnit4Provider.executeWithRerun(JUnit4Provider.java:273)
08:08:24 	at org.apache.maven.surefire.junit4.JUnit4Provider.executeTestSet(JUnit4Provider.java:238)
08:08:24 	at org.apache.maven.surefire.junit4.JUnit4Provider.invoke(JUnit4Provider.java:159)
08:08:24 	at sun.reflect.NativeMethodAccessorImpl.invoke0(Native Method)
08:08:24 	at sun.reflect.NativeMethodAccessorImpl.invoke(NativeMethodAccessorImpl.java:62)
08:08:24 	at sun.reflect.DelegatingMethodAccessorImpl.invoke(DelegatingMethodAccessorImpl.java:43)
08:08:24 	at java.lang.reflect.Method.invoke(Method.java:498)
08:08:24 	at org.apache.maven.surefire.util.ReflectionUtils.invokeMethodWithArray2(ReflectionUtils.java:206)
08:08:24 	at org.apache.maven.surefire.booter.ProviderFactory$ProviderProxy.invoke(ProviderFactory.java:161)
08:08:24 	at org.apache.maven.surefire.booter.ProviderFactory.invokeProvider(ProviderFactory.java:84)
08:08:24 	at org.eclipse.tycho.surefire.osgibooter.OsgiSurefireBooter.run(OsgiSurefireBooter.java:110)
08:08:24 	at org.eclipse.tycho.surefire.osgibooter.AbstractUITestApplication.runTests(AbstractUITestApplication.java:44)
08:08:24 	at org.eclipse.e4.ui.internal.workbench.swt.E4Testable.lambda$0(E4Testable.java:76)
08:08:24 	at java.lang.Thread.run(Thread.java:745)
08:08:24 
08:08:24 testInvalidLabel(org.eclipse.tracecompass.tmf.analysis.xml.ui.swtbot.tests.preferences.XMLAnalysesManagerPreferencePageTest)  Time elapsed: 42 s  <<< ERROR!
08:08:24 org.eclipse.swtbot.swt.finder.widgets.TimeoutException: Timeout after: 20000 ms.: Timed out waiting for Shell {data - Eclipse Platf...} to get activated
08:08:24 	at org.eclipse.swtbot.swt.finder.SWTBotFactory.waitUntil(SWTBotFactory.java:524)
08:08:24 	at org.eclipse.swtbot.swt.finder.SWTBot.waitUntil(SWTBot.java:1)
08:08:24 	at org.eclipse.swtbot.swt.finder.SWTBotFactory.waitUntil(SWTBotFactory.java:498)
08:08:24 	at org.eclipse.swtbot.swt.finder.SWTBot.waitUntil(SWTBot.java:1)
08:08:24 	at org.eclipse.swtbot.swt.finder.SWTBotFactory.waitUntil(SWTBotFactory.java:486)
08:08:24 	at org.eclipse.swtbot.swt.finder.SWTBot.waitUntil(SWTBot.java:1)
08:08:24 	at org.eclipse.swtbot.swt.finder.widgets.SWTBotShell.activate(SWTBotShell.java:78)
08:08:24 	at org.eclipse.tracecompass.tmf.ui.swtbot.tests.shared.SWTBotUtils.focusMainWindow(SWTBotUtils.java:318)
08:08:24 	at org.eclipse.tracecompass.tmf.ui.swtbot.tests.shared.SWTBotUtils.openPreferences(SWTBotUtils.java:1117)
08:08:24 	at org.eclipse.tracecompass.tmf.analysis.xml.ui.swtbot.tests.preferences.XMLAnalysesManagerPreferencePageTest.openXMLAnalysesPreferences(XMLAnalysesManagerPreferencePageTest.java:404)
08:08:24 	at org.eclipse.tracecompass.tmf.analysis.xml.ui.swtbot.tests.preferences.XMLAnalysesManagerPreferencePageTest.after(XMLAnalysesManagerPreferencePageTest.java:359)
08:08:24 	at sun.reflect.NativeMethodAccessorImpl.invoke0(Native Method)
08:08:24 	at sun.reflect.NativeMethodAccessorImpl.invoke(NativeMethodAccessorImpl.java:62)
08:08:24 	at sun.reflect.DelegatingMethodAccessorImpl.invoke(DelegatingMethodAccessorImpl.java:43)
08:08:24 	at java.lang.reflect.Method.invoke(Method.java:498)
08:08:24 	at org.junit.runners.model.FrameworkMethod$1.runReflectiveCall(FrameworkMethod.java:50)
08:08:24 	at org.junit.internal.runners.model.ReflectiveCallable.run(ReflectiveCallable.java:12)
08:08:24 	at org.junit.runners.model.FrameworkMethod.invokeExplosively(FrameworkMethod.java:47)
08:08:24 	at org.junit.internal.runners.statements.RunAfters.evaluate(RunAfters.java:33)
08:08:24 	at org.junit.runners.ParentRunner.runLeaf(ParentRunner.java:325)
08:08:24 	at org.eclipse.swtbot.swt.finder.junit.SWTBotJunit4ClassRunner.runChild(SWTBotJunit4ClassRunner.java:75)
08:08:24 	at org.junit.runners.BlockJUnit4ClassRunner.runChild(BlockJUnit4ClassRunner.java:57)
08:08:24 	at org.junit.runners.ParentRunner$3.run(ParentRunner.java:290)
08:08:24 	at org.junit.runners.ParentRunner$1.schedule(ParentRunner.java:71)
08:08:24 	at org.junit.runners.ParentRunner.runChildren(ParentRunner.java:288)
08:08:24 	at org.junit.runners.ParentRunner.access$000(ParentRunner.java:58)
08:08:24 	at org.junit.runners.ParentRunner$2.evaluate(ParentRunner.java:268)
08:08:24 	at org.junit.internal.runners.statements.RunBefores.evaluate(RunBefores.java:26)
08:08:24 	at org.junit.internal.runners.statements.RunAfters.evaluate(RunAfters.java:27)
08:08:24 	at org.junit.runners.ParentRunner.run(ParentRunner.java:363)
08:08:24 	at org.eclipse.swtbot.swt.finder.junit.SWTBotJunit4ClassRunner.run(SWTBotJunit4ClassRunner.java:60)
08:08:24 	at org.apache.maven.surefire.junit4.JUnit4Provider.execute(JUnit4Provider.java:365)
08:08:24 	at org.apache.maven.surefire.junit4.JUnit4Provider.executeWithRerun(JUnit4Provider.java:273)
08:08:24 	at org.apache.maven.surefire.junit4.JUnit4Provider.executeTestSet(JUnit4Provider.java:238)
08:08:24 	at org.apache.maven.surefire.junit4.JUnit4Provider.invoke(JUnit4Provider.java:159)
08:08:24 	at sun.reflect.NativeMethodAccessorImpl.invoke0(Native Method)
08:08:24 	at sun.reflect.NativeMethodAccessorImpl.invoke(NativeMethodAccessorImpl.java:62)
08:08:24 	at sun.reflect.DelegatingMethodAccessorImpl.invoke(DelegatingMethodAccessorImpl.java:43)
08:08:24 	at java.lang.reflect.Method.invoke(Method.java:498)
08:08:24 	at org.apache.maven.surefire.util.ReflectionUtils.invokeMethodWithArray2(ReflectionUtils.java:206)
08:08:24 	at org.apache.maven.surefire.booter.ProviderFactory$ProviderProxy.invoke(ProviderFactory.java:161)
08:08:24 	at org.apache.maven.surefire.booter.ProviderFactory.invokeProvider(ProviderFactory.java:84)
08:08:24 	at org.eclipse.tycho.surefire.osgibooter.OsgiSurefireBooter.run(OsgiSurefireBooter.java:110)
08:08:24 	at org.eclipse.tycho.surefire.osgibooter.AbstractUITestApplication.runTests(AbstractUITestApplication.java:44)
08:08:24 	at org.eclipse.e4.ui.internal.workbench.swt.E4Testable.lambda$0(E4Testable.java:76)
08:08:24 	at java.lang.Thread.run(Thread.java:745)
08:08:24 
08:08:24 Running org.eclipse.tracecompass.tmf.analysis.xml.ui.swtbot.tests.timegraph.XmlTimegraphViewTest
08:08:24 
08:08:45 !ENTRY org.eclipse.ui 4 0 2019-04-25 12:08:39.880
08:08:45 !MESSAGE Unhandled event loop exception
08:08:45 !STACK 0
08:08:45 org.eclipse.swtbot.swt.finder.widgets.TimeoutException: Timeout after: 20000 ms.: Timed out waiting for Shell {data - Eclipse Platf...} to get activated
08:08:45 	at org.eclipse.swtbot.swt.finder.SWTBotFactory.waitUntil(SWTBotFactory.java:524)
08:08:45 	at org.eclipse.swtbot.swt.finder.SWTBot.waitUntil(SWTBot.java:1)
08:08:45 	at org.eclipse.swtbot.swt.finder.SWTBotFactory.waitUntil(SWTBotFactory.java:498)
08:08:45 	at org.eclipse.swtbot.swt.finder.SWTBot.waitUntil(SWTBot.java:1)
08:08:45 	at org.eclipse.swtbot.swt.finder.SWTBotFactory.waitUntil(SWTBotFactory.java:486)
08:08:45 	at org.eclipse.swtbot.swt.finder.SWTBot.waitUntil(SWTBot.java:1)
08:08:45 	at org.eclipse.swtbot.swt.finder.widgets.SWTBotShell.activate(SWTBotShell.java:78)
08:08:45 	at org.eclipse.tracecompass.tmf.ui.swtbot.tests.shared.SWTBotUtils.focusMainWindow(SWTBotUtils.java:318)
08:08:45 	at org.eclipse.tracecompass.tmf.ui.swtbot.tests.shared.SWTBotUtils.lambda$5(SWTBotUtils.java:430)
08:08:45 	at org.eclipse.swtbot.swt.finder.finders.UIThreadRunnable$4.doRun(UIThreadRunnable.java:197)
08:08:45 	at org.eclipse.swtbot.swt.finder.finders.UIThreadRunnable$1.run(UIThreadRunnable.java:88)
08:08:45 	at org.eclipse.swt.widgets.RunnableLock.run(RunnableLock.java:40)
08:08:45 	at org.eclipse.swt.widgets.Synchronizer.runAsyncMessages(Synchronizer.java:185)
08:08:45 	at org.eclipse.swt.widgets.Display.runAsyncMessages(Display.java:3919)
08:08:45 	at org.eclipse.swt.widgets.Display.readAndDispatch(Display.java:3550)
08:08:45 	at org.eclipse.jface.window.Window.runEventLoop(Window.java:823)
08:08:45 	at org.eclipse.jface.window.Window.open(Window.java:799)
08:08:45 	at org.eclipse.ui.internal.dialogs.WorkbenchPreferenceDialog.open(WorkbenchPreferenceDialog.java:214)
08:08:45 	at org.eclipse.ui.internal.OpenPreferencesAction.run(OpenPreferencesAction.java:66)
08:08:45 	at org.eclipse.jface.action.Action.runWithEvent(Action.java:474)
08:08:45 	at org.eclipse.jface.action.ActionContributionItem.handleWidgetSelection(ActionContributionItem.java:568)
08:08:45 	at org.eclipse.jface.action.ActionContributionItem.lambda$4(ActionContributionItem.java:400)
08:08:45 	at org.eclipse.swt.widgets.EventTable.sendEvent(EventTable.java:89)
08:08:45 	at org.eclipse.swt.widgets.Display.sendEvent(Display.java:4131)
08:08:45 	at org.eclipse.swt.widgets.Widget.sendEvent(Widget.java:1055)
08:08:45 	at org.eclipse.swt.widgets.Widget.sendEvent(Widget.java:1079)
08:08:45 	at org.eclipse.swt.widgets.Widget.sendEvent(Widget.java:1064)
08:08:45 	at org.eclipse.swt.widgets.Widget.notifyListeners(Widget.java:778)
08:08:45 	at org.eclipse.swtbot.swt.finder.widgets.AbstractSWTBot$2.run(AbstractSWTBot.java:190)
08:08:45 	at org.eclipse.swtbot.swt.finder.finders.UIThreadRunnable$5.doRun(UIThreadRunnable.java:222)
08:08:45 	at org.eclipse.swtbot.swt.finder.finders.UIThreadRunnable.run(UIThreadRunnable.java:76)
08:08:45 	at org.eclipse.swtbot.swt.finder.finders.UIThreadRunnable.asyncExec(UIThreadRunnable.java:224)
08:08:45 	at org.eclipse.swtbot.swt.finder.widgets.AbstractSWTBot.asyncExec(AbstractSWTBot.java:656)
08:08:45 	at org.eclipse.swtbot.swt.finder.widgets.AbstractSWTBot.notify(AbstractSWTBot.java:175)
08:08:45 	at org.eclipse.swtbot.swt.finder.widgets.AbstractSWTBot.notify(AbstractSWTBot.java:153)
08:08:45 	at org.eclipse.swtbot.swt.finder.widgets.AbstractSWTBot.notify(AbstractSWTBot.java:142)
08:08:45 	at org.eclipse.swtbot.swt.finder.widgets.AbstractSWTBot.notify(AbstractSWTBot.java:132)
08:08:45 	at org.eclipse.swtbot.swt.finder.widgets.SWTBotMenu$1.run(SWTBotMenu.java:88)
08:08:45 	at org.eclipse.swtbot.swt.finder.finders.UIThreadRunnable$5.doRun(UIThreadRunnable.java:222)
08:08:45 	at org.eclipse.swtbot.swt.finder.finders.UIThreadRunnable$1.run(UIThreadRunnable.java:88)
08:08:45 	at org.eclipse.swt.widgets.RunnableLock.run(RunnableLock.java:40)
08:08:45 	at org.eclipse.swt.widgets.Synchronizer.runAsyncMessages(Synchronizer.java:185)
08:08:45 	at org.eclipse.swt.widgets.Display.runAsyncMessages(Display.java:3919)
08:08:45 	at org.eclipse.swt.widgets.Display.readAndDispatch(Display.java:3550)
08:08:45 	at org.eclipse.e4.ui.internal.workbench.swt.PartRenderingEngine$5.run(PartRenderingEngine.java:1173)
08:08:45 	at org.eclipse.core.databinding.observable.Realm.runWithDefault(Realm.java:338)
08:08:45 	at org.eclipse.e4.ui.internal.workbench.swt.PartRenderingEngine.run(PartRenderingEngine.java:1062)
08:08:45 	at org.eclipse.e4.ui.internal.workbench.E4Workbench.createAndRunUI(E4Workbench.java:155)
08:08:45 	at org.eclipse.ui.internal.Workbench.lambda$3(Workbench.java:644)
08:08:45 	at org.eclipse.core.databinding.observable.Realm.runWithDefault(Realm.java:338)
08:08:45 	at org.eclipse.ui.internal.Workbench.createAndRunWorkbench(Workbench.java:566)
08:08:45 	at org.eclipse.ui.PlatformUI.createAndRunWorkbench(PlatformUI.java:150)
08:08:45 	at org.eclipse.ui.internal.ide.application.IDEApplication.start(IDEApplication.java:155)
08:08:45 	at org.eclipse.tycho.surefire.osgibooter.UITestApplication.runApplication(UITestApplication.java:31)
08:08:45 	at org.eclipse.tycho.surefire.osgibooter.AbstractUITestApplication.run(AbstractUITestApplication.java:120)
08:08:45 	at org.eclipse.tycho.surefire.osgibooter.UITestApplication.start(UITestApplication.java:37)
08:08:45 	at org.eclipse.equinox.internal.app.EclipseAppHandle.run(EclipseAppHandle.java:203)
08:08:45 	at org.eclipse.core.runtime.internal.adaptor.EclipseAppLauncher.runApplication(EclipseAppLauncher.java:137)
08:08:45 	at org.eclipse.core.runtime.internal.adaptor.EclipseAppLauncher.start(EclipseAppLauncher.java:107)
08:08:45 	at org.eclipse.core.runtime.adaptor.EclipseStarter.run(EclipseStarter.java:400)
08:08:45 	at org.eclipse.core.runtime.adaptor.EclipseStarter.run(EclipseStarter.java:255)
08:08:45 	at sun.reflect.NativeMethodAccessorImpl.invoke0(Native Method)
08:08:45 	at sun.reflect.NativeMethodAccessorImpl.invoke(NativeMethodAccessorImpl.java:62)
08:08:45 	at sun.reflect.DelegatingMethodAccessorImpl.invoke(DelegatingMethodAccessorImpl.java:43)
08:08:45 	at java.lang.reflect.Method.invoke(Method.java:498)
08:08:45 	at org.eclipse.equinox.launcher.Main.invokeFramework(Main.java:661)
08:08:45 	at org.eclipse.equinox.launcher.Main.basicRun(Main.java:597)
08:08:45 	at org.eclipse.equinox.launcher.Main.run(Main.java:1476)
08:08:45 	at org.eclipse.equinox.launcher.Main.main(Main.java:1449)
08:08:45 
08:08:45 !ENTRY org.eclipse.tracecompass.tmf.analysis.xml.core 4 0 2019-04-25 12:08:40.468
08:08:45 !MESSAGE XML Parsing error at line 6: cvc-complex-type.2.4.a: Invalid content was found starting with element 'element'. One of '{timeGraphView, xyView, stateProvider, pattern, extra}' is expected.
08:08:45 
08:08:49 !ENTRY org.eclipse.ui 4 4 2019-04-25 12:08:44.602
08:08:49 !MESSAGE Conflicting handlers for org.eclipse.ui.navigate.backwardHistory: {ActionHandler(org.eclipse.ui.internal.NavigationHistoryAction@7f27f59b)} vs {ActionHandler(org.eclipse.ui.internal.dialogs.PreferencePageHistory$1@61736817)} in: PartImpl (org.eclipse.linuxtools.tmf.analysis.xml.ui.views.timegraph:Xml Timegraph View Test) Context
08:08:49 !STACK 0
08:08:49 java.lang.IllegalStateException: Conflicting handlers: {[ActionHandler(org.eclipse.ui.internal.NavigationHistoryAction@7f27f59b),  for 'org.eclipse.ui.navigate.backwardHistory',  in TrimmedWindowImpl (IDEWindow) Context, activeWhen=AndExpression [children=[ActiveShellExpression(Shell {data - Eclipse Platform}), WorkbenchWindowExpression(org.eclipse.ui.internal.WorkbenchWindow@6b357eb6)]], active=true, sourcePriority=17408, participating=true]} vs {[ActionHandler(org.eclipse.ui.internal.dialogs.PreferencePageHistory$1@61736817),  for 'org.eclipse.ui.navigate.backwardHistory',  in WorkbenchContext, activeWhen=ActiveShellExpression(Shell {Manage XML analyses files}), active=true, sourcePriority=17408, participating=true]} in: PartImpl (org.eclipse.linuxtools.tmf.analysis.xml.ui.views.timegraph:Xml Timegraph View Test) Context
08:08:49 	at org.eclipse.ui.internal.handlers.LegacyHandlerService$HandlerSelectionFunction.compute(LegacyHandlerService.java:146)
08:08:49 	at org.eclipse.e4.core.internal.contexts.ValueComputation.get(ValueComputation.java:65)
08:08:49 	at org.eclipse.e4.core.internal.contexts.EclipseContext.internalGet(EclipseContext.java:272)
08:08:49 	at org.eclipse.e4.core.internal.contexts.EclipseContext.internalGet(EclipseContext.java:283)
08:08:49 	at org.eclipse.e4.core.internal.contexts.EclipseContext.internalGet(EclipseContext.java:283)
08:08:49 	at org.eclipse.e4.core.internal.contexts.EclipseContext.get(EclipseContext.java:238)
08:08:49 	at org.eclipse.e4.core.commands.internal.HandlerServiceImpl.lookUpHandler(HandlerServiceImpl.java:103)
08:08:49 	at org.eclipse.ui.internal.handlers.E4HandlerProxy.handlerChanged(E4HandlerProxy.java:115)
08:08:49 	at org.eclipse.core.commands.AbstractHandler.fireHandlerChanged(AbstractHandler.java:77)
08:08:49 	at org.eclipse.jface.commands.ActionHandler.lambda$0(ActionHandler.java:81)
08:08:49 	at org.eclipse.jface.action.AbstractAction.firePropertyChange(AbstractAction.java:52)
08:08:49 	at org.eclipse.jface.action.AbstractAction.firePropertyChange(AbstractAction.java:75)
08:08:49 	at org.eclipse.jface.action.Action.setToolTipText(Action.java:635)
08:08:49 	at org.eclipse.ui.internal.NavigationHistoryAction.update(NavigationHistoryAction.java:260)
08:08:49 	at org.eclipse.ui.internal.NavigationHistory.updateActions(NavigationHistory.java:432)
08:08:49 	at org.eclipse.ui.internal.NavigationHistory.access$1(NavigationHistory.java:430)
08:08:49 	at org.eclipse.ui.internal.NavigationHistory$1.updateNavigationHistory(NavigationHistory.java:172)
08:08:49 	at org.eclipse.ui.internal.NavigationHistory$1.partClosed(NavigationHistory.java:103)
08:08:49 	at org.eclipse.ui.internal.WorkbenchPage$14.run(WorkbenchPage.java:5253)
08:08:49 	at org.eclipse.core.runtime.SafeRunner.run(SafeRunner.java:45)
08:08:49 	at org.eclipse.ui.internal.WorkbenchPage.firePartClosed(WorkbenchPage.java:5250)
08:08:49 	at org.eclipse.ui.internal.e4.compatibility.CompatibilityPart.lambda$0(CompatibilityPart.java:109)
08:08:49 	at org.eclipse.e4.ui.services.internal.events.UIEventHandler.lambda$0(UIEventHandler.java:38)
08:08:49 	at org.eclipse.swt.widgets.Synchronizer.syncExec(Synchronizer.java:236)
08:08:49 	at org.eclipse.ui.internal.UISynchronizer.syncExec(UISynchronizer.java:147)
08:08:49 	at org.eclipse.swt.widgets.Display.syncExec(Display.java:4580)
08:08:49 	at org.eclipse.e4.ui.internal.workbench.swt.E4Application$1.syncExec(E4Application.java:219)
08:08:49 	at org.eclipse.e4.ui.services.internal.events.UIEventHandler.handleEvent(UIEventHandler.java:38)
08:08:49 	at org.eclipse.equinox.internal.event.EventHandlerWrapper.handleEvent(EventHandlerWrapper.java:205)
08:08:49 	at org.eclipse.equinox.internal.event.EventHandlerTracker.dispatchEvent(EventHandlerTracker.java:203)
08:08:49 	at org.eclipse.equinox.internal.event.EventHandlerTracker.dispatchEvent(EventHandlerTracker.java:1)
08:08:49 	at org.eclipse.osgi.framework.eventmgr.EventManager.dispatchEvent(EventManager.java:233)
08:08:49 	at org.eclipse.osgi.framework.eventmgr.ListenerQueue.dispatchEventSynchronous(ListenerQueue.java:151)
08:08:49 	at org.eclipse.equinox.internal.event.EventAdminImpl.dispatchEvent(EventAdminImpl.java:132)
08:08:49 	at org.eclipse.equinox.internal.event.EventAdminImpl.sendEvent(EventAdminImpl.java:75)
08:08:49 	at org.eclipse.equinox.internal.event.EventComponent.sendEvent(EventComponent.java:44)
08:08:49 	at org.eclipse.e4.ui.services.internal.events.EventBroker.send(EventBroker.java:55)
08:08:49 	at org.eclipse.e4.ui.internal.workbench.UIEventPublisher.notifyChanged(UIEventPublisher.java:63)
08:08:49 	at org.eclipse.emf.common.notify.impl.BasicNotifierImpl.eNotify(BasicNotifierImpl.java:424)
08:08:49 	at org.eclipse.e4.ui.model.application.ui.impl.UIElementImpl.setWidget(UIElementImpl.java:265)
08:08:49 	at org.eclipse.e4.ui.workbench.renderers.swt.SWTPartRenderer.unbindWidget(SWTPartRenderer.java:150)
08:08:49 	at org.eclipse.e4.ui.workbench.renderers.swt.SWTPartRenderer.disposeWidget(SWTPartRenderer.java:173)
08:08:49 	at org.eclipse.e4.ui.workbench.renderers.swt.ContributedPartRenderer.disposeWidget(ContributedPartRenderer.java:273)
08:08:49 	at org.eclipse.e4.ui.internal.workbench.swt.PartRenderingEngine.safeRemoveGui(PartRenderingEngine.java:958)
08:08:49 	at org.eclipse.e4.ui.internal.workbench.swt.PartRenderingEngine.access$1(PartRenderingEngine.java:886)
08:08:49 	at org.eclipse.e4.ui.internal.workbench.swt.PartRenderingEngine$4.run(PartRenderingEngine.java:881)
08:08:49 	at org.eclipse.core.runtime.SafeRunner.run(SafeRunner.java:45)
08:08:49 	at org.eclipse.e4.ui.internal.workbench.swt.PartRenderingEngine.removeGui(PartRenderingEngine.java:865)
08:08:49 	at org.eclipse.e4.ui.internal.workbench.swt.PartRenderingEngine.subscribeTopicToBeRendered(PartRenderingEngine.java:186)
08:08:49 	at sun.reflect.GeneratedMethodAccessor59.invoke(Unknown Source)
08:08:49 	at sun.reflect.DelegatingMethodAccessorImpl.invoke(DelegatingMethodAccessorImpl.java:43)
08:08:49 	at java.lang.reflect.Method.invoke(Method.java:498)
08:08:49 	at org.eclipse.e4.core.internal.di.MethodRequestor.execute(MethodRequestor.java:58)
08:08:49 	at org.eclipse.e4.core.di.internal.extensions.EventObjectSupplier$DIEventHandler.handleEvent(EventObjectSupplier.java:91)
08:08:49 	at org.eclipse.equinox.internal.event.EventHandlerWrapper.handleEvent(EventHandlerWrapper.java:205)
08:08:49 	at org.eclipse.equinox.internal.event.EventHandlerTracker.dispatchEvent(EventHandlerTracker.java:203)
08:08:49 	at org.eclipse.equinox.internal.event.EventHandlerTracker.dispatchEvent(EventHandlerTracker.java:1)
08:08:49 	at org.eclipse.osgi.framework.eventmgr.EventManager.dispatchEvent(EventManager.java:233)
08:08:49 	at org.eclipse.osgi.framework.eventmgr.ListenerQueue.dispatchEventSynchronous(ListenerQueue.java:151)
08:08:49 	at org.eclipse.equinox.internal.event.EventAdminImpl.dispatchEvent(EventAdminImpl.java:132)
08:08:49 	at org.eclipse.equinox.internal.event.EventAdminImpl.sendEvent(EventAdminImpl.java:75)
08:08:49 	at org.eclipse.equinox.internal.event.EventComponent.sendEvent(EventComponent.java:44)
08:08:49 	at org.eclipse.e4.ui.services.internal.events.EventBroker.send(EventBroker.java:55)
08:08:49 	at org.eclipse.e4.ui.internal.workbench.UIEventPublisher.notifyChanged(UIEventPublisher.java:63)
08:08:49 	at org.eclipse.emf.common.notify.impl.BasicNotifierImpl.eNotify(BasicNotifierImpl.java:424)
08:08:49 	at org.eclipse.e4.ui.model.application.ui.impl.UIElementImpl.setToBeRendered(UIElementImpl.java:307)
08:08:49 	at org.eclipse.e4.ui.internal.workbench.PartServiceImpl.hidePart(PartServiceImpl.java:1380)
08:08:49 	at org.eclipse.ui.internal.WorkbenchPage.hidePart(WorkbenchPage.java:1591)
08:08:49 	at org.eclipse.ui.internal.WorkbenchPage.hidePart(WorkbenchPage.java:1543)
08:08:49 	at org.eclipse.ui.internal.WorkbenchPage.closeEditors(WorkbenchPage.java:1513)
08:08:49 	at org.eclipse.ui.internal.WorkbenchPage.closeEditor(WorkbenchPage.java:1637)
08:08:49 	at org.eclipse.swtbot.eclipse.finder.widgets.SWTBotEditor$2.run(SWTBotEditor.java:104)
08:08:49 	at org.eclipse.swtbot.swt.finder.finders.UIThreadRunnable$4.doRun(UIThreadRunnable.java:197)
08:08:49 	at org.eclipse.swtbot.swt.finder.finders.UIThreadRunnable$1.run(UIThreadRunnable.java:88)
08:08:49 	at org.eclipse.swt.widgets.RunnableLock.run(RunnableLock.java:40)
08:08:49 	at org.eclipse.swt.widgets.Synchronizer.runAsyncMessages(Synchronizer.java:185)
08:08:49 	at org.eclipse.swt.widgets.Display.runAsyncMessages(Display.java:3919)
08:08:49 	at org.eclipse.swt.widgets.Display.readAndDispatch(Display.java:3550)
08:08:49 	at org.eclipse.jface.window.Window.runEventLoop(Window.java:823)
08:08:49 	at org.eclipse.jface.window.Window.open(Window.java:799)
08:08:49 	at org.eclipse.ui.internal.dialogs.WorkbenchPreferenceDialog.open(WorkbenchPreferenceDialog.java:214)
08:08:49 	at org.eclipse.ui.internal.OpenPreferencesAction.run(OpenPreferencesAction.java:66)
08:08:49 	at org.eclipse.jface.action.Action.runWithEvent(Action.java:474)
08:08:49 	at org.eclipse.jface.action.ActionContributionItem.handleWidgetSelection(ActionContributionItem.java:568)
08:08:49 	at org.eclipse.jface.action.ActionContributionItem.lambda$4(ActionContributionItem.java:400)
08:08:49 	at org.eclipse.swt.widgets.EventTable.sendEvent(EventTable.java:89)
08:08:49 	at org.eclipse.swt.widgets.Display.sendEvent(Display.java:4131)
08:08:49 	at org.eclipse.swt.widgets.Widget.sendEvent(Widget.java:1055)
08:08:49 	at org.eclipse.swt.widgets.Widget.sendEvent(Widget.java:1079)
08:08:49 	at org.eclipse.swt.widgets.Widget.sendEvent(Widget.java:1064)
08:08:49 	at org.eclipse.swt.widgets.Widget.notifyListeners(Widget.java:778)
08:08:49 	at org.eclipse.swtbot.swt.finder.widgets.AbstractSWTBot$2.run(AbstractSWTBot.java:190)
08:08:49 	at org.eclipse.swtbot.swt.finder.finders.UIThreadRunnable$5.doRun(UIThreadRunnable.java:222)
08:08:49 	at org.eclipse.swtbot.swt.finder.finders.UIThreadRunnable.run(UIThreadRunnable.java:76)
08:08:49 	at org.eclipse.swtbot.swt.finder.finders.UIThreadRunnable.asyncExec(UIThreadRunnable.java:224)
08:08:49 	at org.eclipse.swtbot.swt.finder.widgets.AbstractSWTBot.asyncExec(AbstractSWTBot.java:656)
08:08:49 	at org.eclipse.swtbot.swt.finder.widgets.AbstractSWTBot.notify(AbstractSWTBot.java:175)
08:08:49 	at org.eclipse.swtbot.swt.finder.widgets.AbstractSWTBot.notify(AbstractSWTBot.java:153)
08:08:49 	at org.eclipse.swtbot.swt.finder.widgets.AbstractSWTBot.notify(AbstractSWTBot.java:142)
08:08:49 	at org.eclipse.swtbot.swt.finder.widgets.AbstractSWTBot.notify(AbstractSWTBot.java:132)
08:08:49 	at org.eclipse.swtbot.swt.finder.widgets.SWTBotMenu$1.run(SWTBotMenu.java:88)
08:08:49 	at org.eclipse.swtbot.swt.finder.finders.UIThreadRunnable$5.doRun(UIThreadRunnable.java:222)
08:08:49 	at org.eclipse.swtbot.swt.finder.finders.UIThreadRunnable$1.run(UIThreadRunnable.java:88)
08:08:49 	at org.eclipse.swt.widgets.RunnableLock.run(RunnableLock.java:40)
08:08:49 	at org.eclipse.swt.widgets.Synchronizer.runAsyncMessages(Synchronizer.java:185)
08:08:49 	at org.eclipse.swt.widgets.Display.runAsyncMessages(Display.java:3919)
08:08:49 	at org.eclipse.swt.widgets.Display.readAndDispatch(Display.java:3550)
08:08:49 	at org.eclipse.e4.ui.internal.workbench.swt.PartRenderingEngine$5.run(PartRenderingEngine.java:1173)
08:08:49 	at org.eclipse.core.databinding.observable.Realm.runWithDefault(Realm.java:338)
08:08:49 	at org.eclipse.e4.ui.internal.workbench.swt.PartRenderingEngine.run(PartRenderingEngine.java:1062)
08:08:49 	at org.eclipse.e4.ui.internal.workbench.E4Workbench.createAndRunUI(E4Workbench.java:155)
08:08:49 	at org.eclipse.ui.internal.Workbench.lambda$3(Workbench.java:644)
08:08:49 	at org.eclipse.core.databinding.observable.Realm.runWithDefault(Realm.java:338)
08:08:49 	at org.eclipse.ui.internal.Workbench.createAndRunWorkbench(Workbench.java:566)
08:08:49 	at org.eclipse.ui.PlatformUI.createAndRunWorkbench(PlatformUI.java:150)
08:08:49 	at org.eclipse.ui.internal.ide.application.IDEApplication.start(IDEApplication.java:155)
08:08:49 	at org.eclipse.tycho.surefire.osgibooter.UITestApplication.runApplication(UITestApplication.java:31)
08:08:49 	at org.eclipse.tycho.surefire.osgibooter.AbstractUITestApplication.run(AbstractUITestApplication.java:120)
08:08:49 	at org.eclipse.tycho.surefire.osgibooter.UITestApplication.start(UITestApplication.java:37)
08:08:49 	at org.eclipse.equinox.internal.app.EclipseAppHandle.run(EclipseAppHandle.java:203)
08:08:49 	at org.eclipse.core.runtime.internal.adaptor.EclipseAppLauncher.runApplication(EclipseAppLauncher.java:137)
08:08:49 	at org.eclipse.core.runtime.internal.adaptor.EclipseAppLauncher.start(EclipseAppLauncher.java:107)
08:08:49 	at org.eclipse.core.runtime.adaptor.EclipseStarter.run(EclipseStarter.java:400)
08:08:49 	at org.eclipse.core.runtime.adaptor.EclipseStarter.run(EclipseStarter.java:255)
08:08:49 	at sun.reflect.NativeMethodAccessorImpl.invoke0(Native Method)
08:08:49 	at sun.reflect.NativeMethodAccessorImpl.invoke(NativeMethodAccessorImpl.java:62)
08:08:49 	at sun.reflect.DelegatingMethodAccessorImpl.invoke(DelegatingMethodAccessorImpl.java:43)
08:08:49 	at java.lang.reflect.Method.invoke(Method.java:498)
08:08:49 	at org.eclipse.equinox.launcher.Main.invokeFramework(Main.java:661)
08:08:49 	at org.eclipse.equinox.launcher.Main.basicRun(Main.java:597)
08:08:49 	at org.eclipse.equinox.launcher.Main.run(Main.java:1476)
08:08:49 	at org.eclipse.equinox.launcher.Main.main(Main.java:1449)
08:08:49 Tests run: 1, Failures: 0, Errors: 0, Skipped: 0, Time elapsed: 27.358 s - in org.eclipse.tracecompass.tmf.analysis.xml.ui.swtbot.tests.timegraph.XmlTimegraphViewTest
08:08:51 testData(org.eclipse.tracecompass.tmf.analysis.xml.ui.swtbot.tests.timegraph.XmlTimegraphViewTest)  Time elapsed: 27.342 s
08:08:51 
08:08:51 Results:
08:08:51 
08:08:51 Errors: 
08:08:51 org.eclipse.tracecompass.tmf.analysis.xml.ui.swtbot.tests.preferences.XMLAnalysesManagerPreferencePageTest.testExport(org.eclipse.tracecompass.tmf.analysis.xml.ui.swtbot.tests.preferences.XMLAnalysesManagerPreferencePageTest)
08:08:51   Run 1: XMLAnalysesManagerPreferencePageTest.testExport:348 \tmp\state_provider_placement.xml
08:08:51   Run 2: XMLAnalysesManagerPreferencePageTest.after:359->openXMLAnalysesPreferences:404 » Timeout
08:08:51 
08:08:51 org.eclipse.tracecompass.tmf.analysis.xml.ui.swtbot.tests.preferences.XMLAnalysesManagerPreferencePageTest.testInvalidLabel(org.eclipse.tracecompass.tmf.analysis.xml.ui.swtbot.tests.preferences.XMLAnalysesManagerPreferencePageTest)
08:08:51   Run 1: XMLAnalysesManagerPreferencePageTest.testInvalidLabel:261->openXMLAnalysesPreferences:404 » Timeout
08:08:51   Run 2: XMLAnalysesManagerPreferencePageTest.after:359->openXMLAnalysesPreferences:404 » Timeout
08:08:51 
08:08:51 
08:08:51 Tests run: 13, Failures: 0, Errors: 2, Skipped: 0
08:08:51 
08:08:51 
08:08:52 !ENTRY org.eclipse.core.resources 2 10035 2019-04-25 12:08:47.499
08:08:52 !MESSAGE The workspace will exit with unsaved changes in this session.
08:08:52 [ERROR] There are test failures.
08:08:54 
08:08:54 Please refer to C:\Users\hudson\jenkins-slave-tracecompass\workspace\tracecompass-master-nightly-windows\tmf\org.eclipse.tracecompass.tmf.analysis.xml.ui.swtbot.tests\target\surefire-reports for the individual test results.
08:08:54 [INFO] 
08:08:54 [INFO] --- maven-install-plugin:2.5.2:install (default-install) @ org.eclipse.tracecompass.tmf.analysis.xml.ui.swtbot.tests ---
08:08:54 [INFO] Installing C:\Users\hudson\jenkins-slave-tracecompass\workspace\tracecompass-master-nightly-windows\tmf\org.eclipse.tracecompass.tmf.analysis.xml.ui.swtbot.tests\target\org.eclipse.tracecompass.tmf.analysis.xml.ui.swtbot.tests-1.0.7-SNAPSHOT.jar to C:\Users\hudson\jenkins-slave-tracecompass\workspace\tracecompass-master-nightly-windows\.maven\repo\org\eclipse\tracecompass\org.eclipse.tracecompass.tmf.analysis.xml.ui.swtbot.tests\1.0.7-SNAPSHOT\org.eclipse.tracecompass.tmf.analysis.xml.ui.swtbot.tests-1.0.7-SNAPSHOT.jar
08:08:54 [INFO] Installing C:\Users\hudson\jenkins-slave-tracecompass\workspace\tracecompass-master-nightly-windows\tmf\org.eclipse.tracecompass.tmf.analysis.xml.ui.swtbot.tests\.polyglot.build.properties to C:\Users\hudson\jenkins-slave-tracecompass\workspace\tracecompass-master-nightly-windows\.maven\repo\org\eclipse\tracecompass\org.eclipse.tracecompass.tmf.analysis.xml.ui.swtbot.tests\1.0.7-SNAPSHOT\org.eclipse.tracecompass.tmf.analysis.xml.ui.swtbot.tests-1.0.7-SNAPSHOT.pom
08:08:54 [INFO] Installing C:\Users\hudson\jenkins-slave-tracecompass\workspace\tracecompass-master-nightly-windows\tmf\org.eclipse.tracecompass.tmf.analysis.xml.ui.swtbot.tests\target\org.eclipse.tracecompass.tmf.analysis.xml.ui.swtbot.tests-1.0.7-SNAPSHOT-sources.jar to C:\Users\hudson\jenkins-slave-tracecompass\workspace\tracecompass-master-nightly-windows\.maven\repo\org\eclipse\tracecompass\org.eclipse.tracecompass.tmf.analysis.xml.ui.swtbot.tests\1.0.7-SNAPSHOT\org.eclipse.tracecompass.tmf.analysis.xml.ui.swtbot.tests-1.0.7-SNAPSHOT-sources.jar
08:08:54 [INFO] Installing C:\Users\hudson\jenkins-slave-tracecompass\workspace\tracecompass-master-nightly-windows\tmf\org.eclipse.tracecompass.tmf.analysis.xml.ui.swtbot.tests\target\org.eclipse.tracecompass.tmf.analysis.xml.ui.swtbot.tests-1.0.7-SNAPSHOT.jar.pack.gz to C:\Users\hudson\jenkins-slave-tracecompass\workspace\tracecompass-master-nightly-windows\.maven\repo\org\eclipse\tracecompass\org.eclipse.tracecompass.tmf.analysis.xml.ui.swtbot.tests\1.0.7-SNAPSHOT\org.eclipse.tracecompass.tmf.analysis.xml.ui.swtbot.tests-1.0.7-SNAPSHOT-pack200.jar.pack.gz
08:08:54 [INFO] Installing C:\Users\hudson\jenkins-slave-tracecompass\workspace\tracecompass-master-nightly-windows\tmf\org.eclipse.tracecompass.tmf.analysis.xml.ui.swtbot.tests\target\p2content.xml to C:\Users\hudson\jenkins-slave-tracecompass\workspace\tracecompass-master-nightly-windows\.maven\repo\org\eclipse\tracecompass\org.eclipse.tracecompass.tmf.analysis.xml.ui.swtbot.tests\1.0.7-SNAPSHOT\org.eclipse.tracecompass.tmf.analysis.xml.ui.swtbot.tests-1.0.7-SNAPSHOT-p2metadata.xml
08:08:54 [INFO] Installing C:\Users\hudson\jenkins-slave-tracecompass\workspace\tracecompass-master-nightly-windows\tmf\org.eclipse.tracecompass.tmf.analysis.xml.ui.swtbot.tests\target\p2artifacts.xml to C:\Users\hudson\jenkins-slave-tracecompass\workspace\tracecompass-master-nightly-windows\.maven\repo\org\eclipse\tracecompass\org.eclipse.tracecompass.tmf.analysis.xml.ui.swtbot.tests\1.0.7-SNAPSHOT\org.eclipse.tracecompass.tmf.analysis.xml.ui.swtbot.tests-1.0.7-SNAPSHOT-p2artifacts.xml
08:08:54 [INFO] 
08:08:54 [INFO] --- tycho-p2-plugin:1.3.0:update-local-index (default-update-local-index) @ org.eclipse.tracecompass.tmf.analysis.xml.ui.swtbot.tests ---
08:08:54 [INFO]                                                                         
08:08:54 [INFO] ------------------------------------------------------------------------
08:08:54 [INFO] Building org.eclipse.tracecompass.tmf.analysis.xml.ui.tests 1.0.2-SNAPSHOT
08:08:54 [INFO] ------------------------------------------------------------------------
08:08:54 [INFO] 
08:08:54 [INFO] --- maven-clean-plugin:3.0.0:clean (default-clean) @ org.eclipse.tracecompass.tmf.analysis.xml.ui.tests ---
08:08:54 [INFO] Deleting C:\Users\hudson\jenkins-slave-tracecompass\workspace\tracecompass-master-nightly-windows\tmf\org.eclipse.tracecompass.tmf.analysis.xml.ui.tests\target
08:08:54 [INFO] 
08:08:57 [INFO] --- tycho-packaging-plugin:1.3.0:build-qualifier (default-build-qualifier) @ org.eclipse.tracecompass.tmf.analysis.xml.ui.tests ---
08:08:57 [INFO] The project's OSGi version is 1.0.2.201904251016
08:08:57 [INFO] 
08:08:57 [INFO] --- tycho-packaging-plugin:1.3.0:validate-id (default-validate-id) @ org.eclipse.tracecompass.tmf.analysis.xml.ui.tests ---
08:08:57 [INFO] 
08:08:57 [INFO] --- tycho-packaging-plugin:1.3.0:validate-version (default-validate-version) @ org.eclipse.tracecompass.tmf.analysis.xml.ui.tests ---
08:08:57 [INFO] 
08:08:57 [INFO] --- maven-enforcer-plugin:1.4.1:enforce (enforce-maven-version) @ org.eclipse.tracecompass.tmf.analysis.xml.ui.tests ---
08:08:57 [INFO] 
08:08:57 [INFO] --- maven-resources-plugin:3.0.2:resources (default-resources) @ org.eclipse.tracecompass.tmf.analysis.xml.ui.tests ---
08:08:57 [INFO] Using 'UTF-8' encoding to copy filtered resources.
08:08:57 [INFO] skip non existing resourceDirectory C:\Users\hudson\jenkins-slave-tracecompass\workspace\tracecompass-master-nightly-windows\tmf\org.eclipse.tracecompass.tmf.analysis.xml.ui.tests\src\main\resources
08:08:57 [INFO] 
08:08:57 [INFO] --- tycho-compiler-plugin:1.3.0:compile (default-compile) @ org.eclipse.tracecompass.tmf.analysis.xml.ui.tests ---
08:08:57 [INFO] Compiling 3 source files to C:\Users\hudson\jenkins-slave-tracecompass\workspace\tracecompass-master-nightly-windows\tmf\org.eclipse.tracecompass.tmf.analysis.xml.ui.tests\target\classes
08:08:57 [INFO] 
08:08:57 [INFO] --- maven-resources-plugin:3.0.2:testResources (default-testResources) @ org.eclipse.tracecompass.tmf.analysis.xml.ui.tests ---
08:08:57 [INFO] Using 'UTF-8' encoding to copy filtered resources.
08:08:57 [INFO] skip non existing resourceDirectory C:\Users\hudson\jenkins-slave-tracecompass\workspace\tracecompass-master-nightly-windows\tmf\org.eclipse.tracecompass.tmf.analysis.xml.ui.tests\src\test\resources
08:08:57 [INFO] 
08:08:57 [INFO] --- tycho-source-plugin:1.3.0:plugin-source (plugin-source) @ org.eclipse.tracecompass.tmf.analysis.xml.ui.tests ---
08:08:57 [INFO] Building jar: C:\Users\hudson\jenkins-slave-tracecompass\workspace\tracecompass-master-nightly-windows\tmf\org.eclipse.tracecompass.tmf.analysis.xml.ui.tests\target\org.eclipse.tracecompass.tmf.analysis.xml.ui.tests-1.0.2-SNAPSHOT-sources.jar
08:08:57 [INFO] 
08:08:57 [INFO] --- target-platform-configuration:1.3.0:target-platform (default-target-platform) @ org.eclipse.tracecompass.tmf.analysis.xml.ui.tests ---
08:08:57 [INFO] 
08:08:57 [INFO] --- tycho-packaging-plugin:1.3.0:package-plugin (default-package-plugin) @ org.eclipse.tracecompass.tmf.analysis.xml.ui.tests ---
08:08:57 [INFO] Building jar: C:\Users\hudson\jenkins-slave-tracecompass\workspace\tracecompass-master-nightly-windows\tmf\org.eclipse.tracecompass.tmf.analysis.xml.ui.tests\target\org.eclipse.tracecompass.tmf.analysis.xml.ui.tests-1.0.2-SNAPSHOT.jar
08:08:57 [INFO] 
08:08:58 [INFO] --- tycho-p2-plugin:1.3.0:p2-metadata-default (default-p2-metadata-default) @ org.eclipse.tracecompass.tmf.analysis.xml.ui.tests ---
08:08:58 [INFO] 
08:08:58 [INFO] --- tycho-source-feature-plugin:1.3.0:source-feature (source-feature) @ org.eclipse.tracecompass.tmf.analysis.xml.ui.tests ---
08:08:58 [INFO] 
08:08:58 [INFO] --- tycho-pack200b-plugin:1.3.0:pack (pack200-pack) @ org.eclipse.tracecompass.tmf.analysis.xml.ui.tests ---
08:08:58 [INFO] Pack200 packing jar C:\Users\hudson\jenkins-slave-tracecompass\workspace\tracecompass-master-nightly-windows\tmf\org.eclipse.tracecompass.tmf.analysis.xml.ui.tests\target\org.eclipse.tracecompass.tmf.analysis.xml.ui.tests-1.0.2-SNAPSHOT.jar
08:08:58 [INFO] 
08:08:58 [INFO] --- tycho-p2-plugin:1.3.0:p2-metadata (p2-metadata) @ org.eclipse.tracecompass.tmf.analysis.xml.ui.tests ---
08:08:58 [INFO] 
08:08:58 [INFO] --- tycho-surefire-plugin:1.3.0:test (default-test) @ org.eclipse.tracecompass.tmf.analysis.xml.ui.tests ---
08:08:58 [INFO] Expected eclipse log file: C:\Users\hudson\jenkins-slave-tracecompass\workspace\tracecompass-master-nightly-windows\tmf\org.eclipse.tracecompass.tmf.analysis.xml.ui.tests\target\work\data\.metadata\.log
08:08:59 [INFO] Command line:
08:08:59 	[C:\Program Files\Java\jdk1.8.0_121\jre\bin\java.exe, -Dosgi.noShutdown=false, -Dosgi.os=win32, -Dosgi.ws=win32, -Dosgi.arch=x86_64, -Dorg.eclipse.swt.browser.DefaultType=mozilla, -Xms512m, -Xmx1024m, -Dosgi.clean=true, -jar, C:\Users\hudson\jenkins-slave-tracecompass\workspace\tracecompass-master-nightly-windows\.maven\repo\p2\osgi\bundle\org.eclipse.equinox.launcher\1.5.300.v20190213-1655\org.eclipse.equinox.launcher-1.5.300.v20190213-1655.jar, -data, C:\Users\hudson\jenkins-slave-tracecompass\workspace\tracecompass-master-nightly-windows\tmf\org.eclipse.tracecompass.tmf.analysis.xml.ui.tests\target\work\data, -install, C:\Users\hudson\jenkins-slave-tracecompass\workspace\tracecompass-master-nightly-windows\tmf\org.eclipse.tracecompass.tmf.analysis.xml.ui.tests\target\work, -configuration, C:\Users\hudson\jenkins-slave-tracecompass\workspace\tracecompass-master-nightly-windows\tmf\org.eclipse.tracecompass.tmf.analysis.xml.ui.tests\target\work\configuration, -application, org.eclipse.tycho.surefire.osgibooter.uitest, -testproperties, C:\Users\hudson\jenkins-slave-tracecompass\workspace\tracecompass-master-nightly-windows\tmf\org.eclipse.tracecompass.tmf.analysis.xml.ui.tests\target\surefire.properties, -product, org.eclipse.platform.ide, -consoleLog]
08:08:59 Running org.eclipse.tracecompass.tmf.analysis.xml.ui.tests.module.XmlAnalysisOutputSourceTest
08:09:25 !SESSION 2019-04-25 12:08:54.440 -----------------------------------------------
08:09:26 eclipse.buildId=unknown
08:09:26 java.version=1.8.0_121
08:09:26 java.vendor=Oracle Corporation
08:09:26 BootLoader constants: OS=win32, ARCH=x86_64, WS=win32, NL=en_US
08:09:26 Framework arguments:  -application org.eclipse.tycho.surefire.osgibooter.uitest -testproperties C:\Users\hudson\jenkins-slave-tracecompass\workspace\tracecompass-master-nightly-windows\tmf\org.eclipse.tracecompass.tmf.analysis.xml.ui.tests\target\surefire.properties -product org.eclipse.platform.ide
08:09:26 Command-line arguments:  -data C:\Users\hudson\jenkins-slave-tracecompass\workspace\tracecompass-master-nightly-windows\tmf\org.eclipse.tracecompass.tmf.analysis.xml.ui.tests\target\work\data -application org.eclipse.tycho.surefire.osgibooter.uitest -testproperties C:\Users\hudson\jenkins-slave-tracecompass\workspace\tracecompass-master-nightly-windows\tmf\org.eclipse.tracecompass.tmf.analysis.xml.ui.tests\target\surefire.properties -product org.eclipse.platform.ide -consoleLog
08:09:26 
08:09:26 !ENTRY org.eclipse.tracecompass.tmf.core 4 0 2019-04-25 12:09:21.098
08:09:26 !MESSAGE Unexpected error executing analysis with trace 
08:09:26 !STACK 0
08:09:26 java.lang.NullPointerException
08:09:26 	at java.io.File.<init>(File.java:277)
08:09:26 	at org.eclipse.tracecompass.tmf.core.statesystem.TmfStateSystemAnalysisModule.loadInitialState(TmfStateSystemAnalysisModule.java:578)
08:09:26 	at org.eclipse.tracecompass.tmf.core.statesystem.TmfStateSystemAnalysisModule.build(TmfStateSystemAnalysisModule.java:526)
08:09:26 	at org.eclipse.tracecompass.tmf.core.statesystem.TmfStateSystemAnalysisModule.createFullHistory(TmfStateSystemAnalysisModule.java:374)
08:09:26 	at org.eclipse.tracecompass.tmf.core.statesystem.TmfStateSystemAnalysisModule.executeAnalysis(TmfStateSystemAnalysisModule.java:280)
08:09:26 	at org.eclipse.tracecompass.tmf.core.analysis.TmfAbstractAnalysisModule$1.run(TmfAbstractAnalysisModule.java:393)
08:09:26 	at org.eclipse.core.internal.jobs.Worker.run(Worker.java:63)
08:09:26 
08:09:28 !ENTRY org.eclipse.tracecompass.tmf.core 4 0 2019-04-25 12:09:22.687
08:09:28 !MESSAGE Exception executing analysis
08:09:28 !STACK 0
08:09:28 java.lang.NullPointerException
08:09:28 	at java.io.File.<init>(File.java:277)
08:09:28 	at org.eclipse.tracecompass.tmf.core.statesystem.TmfStateSystemAnalysisModule.loadInitialState(TmfStateSystemAnalysisModule.java:578)
08:09:28 	at org.eclipse.tracecompass.tmf.core.statesystem.TmfStateSystemAnalysisModule.build(TmfStateSystemAnalysisModule.java:526)
08:09:28 	at org.eclipse.tracecompass.tmf.core.statesystem.TmfStateSystemAnalysisModule.createFullHistory(TmfStateSystemAnalysisModule.java:374)
08:09:28 	at org.eclipse.tracecompass.tmf.core.statesystem.TmfStateSystemAnalysisModule.executeAnalysis(TmfStateSystemAnalysisModule.java:280)
08:09:28 	at org.eclipse.tracecompass.tmf.core.analysis.TmfAbstractAnalysisModule$1.run(TmfAbstractAnalysisModule.java:393)
08:09:28 	at org.eclipse.core.internal.jobs.Worker.run(Worker.java:63)
08:09:28 Tests run: 1, Failures: 0, Errors: 0, Skipped: 0, Time elapsed: 2.69 s - in org.eclipse.tracecompass.tmf.analysis.xml.ui.tests.module.XmlAnalysisOutputSourceTest
08:09:28 testBuiltinOutput(org.eclipse.tracecompass.tmf.analysis.xml.ui.tests.module.XmlAnalysisOutputSourceTest)  Time elapsed: 2.639 s
08:09:28 Running org.eclipse.tracecompass.tmf.analysis.xml.ui.tests.XmlAnalysisUiPluginTest
08:09:28 Tests run: 2, Failures: 0, Errors: 0, Skipped: 0, Time elapsed: 0.003 s - in org.eclipse.tracecompass.tmf.analysis.xml.ui.tests.XmlAnalysisUiPluginTest
08:09:28 testTmfCorePluginId(org.eclipse.tracecompass.tmf.analysis.xml.ui.tests.XmlAnalysisUiPluginTest)  Time elapsed: 0 s
08:09:28 testGetDefault(org.eclipse.tracecompass.tmf.analysis.xml.ui.tests.XmlAnalysisUiPluginTest)  Time elapsed: 0 s
08:09:28 
08:09:28 Results:
08:09:28 
08:09:28 Tests run: 3, Failures: 0, Errors: 0, Skipped: 0
08:09:28 
08:09:28 
08:09:28 !ENTRY org.eclipse.tracecompass.tmf.core 4 0 2019-04-25 12:09:22.915
08:09:28 !MESSAGE Unexpected error executing analysis with trace 
08:09:28 !STACK 0
08:09:28 java.lang.NullPointerException
08:09:28 	at java.io.File.<init>(File.java:277)
08:09:28 	at org.eclipse.tracecompass.tmf.core.statesystem.TmfStateSystemAnalysisModule.loadInitialState(TmfStateSystemAnalysisModule.java:578)
08:09:28 	at org.eclipse.tracecompass.tmf.core.statesystem.TmfStateSystemAnalysisModule.build(TmfStateSystemAnalysisModule.java:526)
08:09:28 	at org.eclipse.tracecompass.tmf.core.statesystem.TmfStateSystemAnalysisModule.createFullHistory(TmfStateSystemAnalysisModule.java:374)
08:09:28 	at org.eclipse.tracecompass.tmf.core.statesystem.TmfStateSystemAnalysisModule.executeAnalysis(TmfStateSystemAnalysisModule.java:280)
08:09:28 	at org.eclipse.tracecompass.tmf.core.analysis.TmfAbstractAnalysisModule$1.run(TmfAbstractAnalysisModule.java:393)
08:09:28 	at org.eclipse.core.internal.jobs.Worker.run(Worker.java:63)
08:09:28 
08:09:28 !ENTRY org.eclipse.tracecompass.tmf.core 4 0 2019-04-25 12:09:22.919
08:09:28 !MESSAGE Exception executing analysis
08:09:28 !STACK 0
08:09:28 java.lang.NullPointerException
08:09:28 	at java.io.File.<init>(File.java:277)
08:09:28 	at org.eclipse.tracecompass.tmf.core.statesystem.TmfStateSystemAnalysisModule.loadInitialState(TmfStateSystemAnalysisModule.java:578)
08:09:28 	at org.eclipse.tracecompass.tmf.core.statesystem.TmfStateSystemAnalysisModule.build(TmfStateSystemAnalysisModule.java:526)
08:09:28 	at org.eclipse.tracecompass.tmf.core.statesystem.TmfStateSystemAnalysisModule.createFullHistory(TmfStateSystemAnalysisModule.java:374)
08:09:28 	at org.eclipse.tracecompass.tmf.core.statesystem.TmfStateSystemAnalysisModule.executeAnalysis(TmfStateSystemAnalysisModule.java:280)
08:09:28 	at org.eclipse.tracecompass.tmf.core.analysis.TmfAbstractAnalysisModule$1.run(TmfAbstractAnalysisModule.java:393)
08:09:28 	at org.eclipse.core.internal.jobs.Worker.run(Worker.java:63)
08:09:28 [INFO] All tests passed!
08:09:31 [INFO] 
08:09:31 [INFO] --- maven-install-plugin:2.5.2:install (default-install) @ org.eclipse.tracecompass.tmf.analysis.xml.ui.tests ---
08:09:31 [INFO] Installing C:\Users\hudson\jenkins-slave-tracecompass\workspace\tracecompass-master-nightly-windows\tmf\org.eclipse.tracecompass.tmf.analysis.xml.ui.tests\target\org.eclipse.tracecompass.tmf.analysis.xml.ui.tests-1.0.2-SNAPSHOT.jar to C:\Users\hudson\jenkins-slave-tracecompass\workspace\tracecompass-master-nightly-windows\.maven\repo\org\eclipse\tracecompass\org.eclipse.tracecompass.tmf.analysis.xml.ui.tests\1.0.2-SNAPSHOT\org.eclipse.tracecompass.tmf.analysis.xml.ui.tests-1.0.2-SNAPSHOT.jar
08:09:31 [INFO] Installing C:\Users\hudson\jenkins-slave-tracecompass\workspace\tracecompass-master-nightly-windows\tmf\org.eclipse.tracecompass.tmf.analysis.xml.ui.tests\.polyglot.build.properties to C:\Users\hudson\jenkins-slave-tracecompass\workspace\tracecompass-master-nightly-windows\.maven\repo\org\eclipse\tracecompass\org.eclipse.tracecompass.tmf.analysis.xml.ui.tests\1.0.2-SNAPSHOT\org.eclipse.tracecompass.tmf.analysis.xml.ui.tests-1.0.2-SNAPSHOT.pom
08:09:32 [INFO] Installing C:\Users\hudson\jenkins-slave-tracecompass\workspace\tracecompass-master-nightly-windows\tmf\org.eclipse.tracecompass.tmf.analysis.xml.ui.tests\target\org.eclipse.tracecompass.tmf.analysis.xml.ui.tests-1.0.2-SNAPSHOT-sources.jar to C:\Users\hudson\jenkins-slave-tracecompass\workspace\tracecompass-master-nightly-windows\.maven\repo\org\eclipse\tracecompass\org.eclipse.tracecompass.tmf.analysis.xml.ui.tests\1.0.2-SNAPSHOT\org.eclipse.tracecompass.tmf.analysis.xml.ui.tests-1.0.2-SNAPSHOT-sources.jar
08:09:32 [INFO] Installing C:\Users\hudson\jenkins-slave-tracecompass\workspace\tracecompass-master-nightly-windows\tmf\org.eclipse.tracecompass.tmf.analysis.xml.ui.tests\target\org.eclipse.tracecompass.tmf.analysis.xml.ui.tests-1.0.2-SNAPSHOT.jar.pack.gz to C:\Users\hudson\jenkins-slave-tracecompass\workspace\tracecompass-master-nightly-windows\.maven\repo\org\eclipse\tracecompass\org.eclipse.tracecompass.tmf.analysis.xml.ui.tests\1.0.2-SNAPSHOT\org.eclipse.tracecompass.tmf.analysis.xml.ui.tests-1.0.2-SNAPSHOT-pack200.jar.pack.gz
08:09:32 [INFO] Installing C:\Users\hudson\jenkins-slave-tracecompass\workspace\tracecompass-master-nightly-windows\tmf\org.eclipse.tracecompass.tmf.analysis.xml.ui.tests\target\p2content.xml to C:\Users\hudson\jenkins-slave-tracecompass\workspace\tracecompass-master-nightly-windows\.maven\repo\org\eclipse\tracecompass\org.eclipse.tracecompass.tmf.analysis.xml.ui.tests\1.0.2-SNAPSHOT\org.eclipse.tracecompass.tmf.analysis.xml.ui.tests-1.0.2-SNAPSHOT-p2metadata.xml
08:09:32 [INFO] Installing C:\Users\hudson\jenkins-slave-tracecompass\workspace\tracecompass-master-nightly-windows\tmf\org.eclipse.tracecompass.tmf.analysis.xml.ui.tests\target\p2artifacts.xml to C:\Users\hudson\jenkins-slave-tracecompass\workspace\tracecompass-master-nightly-windows\.maven\repo\org\eclipse\tracecompass\org.eclipse.tracecompass.tmf.analysis.xml.ui.tests\1.0.2-SNAPSHOT\org.eclipse.tracecompass.tmf.analysis.xml.ui.tests-1.0.2-SNAPSHOT-p2artifacts.xml
08:09:32 [INFO] 
08:09:32 [INFO] --- tycho-p2-plugin:1.3.0:update-local-index (default-update-local-index) @ org.eclipse.tracecompass.tmf.analysis.xml.ui.tests ---
08:09:32 [INFO]                                                                         
08:09:32 [INFO] ------------------------------------------------------------------------
08:09:32 [INFO] Building org.eclipse.tracecompass.tmf.chart.ui.tests 1.0.0-SNAPSHOT
08:09:32 [INFO] ------------------------------------------------------------------------
08:09:32 [INFO] 
08:09:32 [INFO] --- maven-clean-plugin:3.0.0:clean (default-clean) @ org.eclipse.tracecompass.tmf.chart.ui.tests ---
08:09:32 [INFO] Deleting C:\Users\hudson\jenkins-slave-tracecompass\workspace\tracecompass-master-nightly-windows\tmf\org.eclipse.tracecompass.tmf.chart.ui.tests\target
08:09:32 [INFO] 
08:09:33 [INFO] --- tycho-packaging-plugin:1.3.0:build-qualifier (default-build-qualifier) @ org.eclipse.tracecompass.tmf.chart.ui.tests ---
08:09:33 [INFO] The project's OSGi version is 1.0.0.201904251016
08:09:33 [INFO] 
08:09:33 [INFO] --- tycho-packaging-plugin:1.3.0:validate-id (default-validate-id) @ org.eclipse.tracecompass.tmf.chart.ui.tests ---
08:09:33 [INFO] 
08:09:33 [INFO] --- tycho-packaging-plugin:1.3.0:validate-version (default-validate-version) @ org.eclipse.tracecompass.tmf.chart.ui.tests ---
08:09:33 [INFO] 
08:09:33 [INFO] --- maven-enforcer-plugin:1.4.1:enforce (enforce-maven-version) @ org.eclipse.tracecompass.tmf.chart.ui.tests ---
08:09:33 [INFO] 
08:09:33 [INFO] --- maven-resources-plugin:3.0.2:resources (default-resources) @ org.eclipse.tracecompass.tmf.chart.ui.tests ---
08:09:33 [INFO] Using 'UTF-8' encoding to copy filtered resources.
08:09:33 [INFO] skip non existing resourceDirectory C:\Users\hudson\jenkins-slave-tracecompass\workspace\tracecompass-master-nightly-windows\tmf\org.eclipse.tracecompass.tmf.chart.ui.tests\src\main\resources
08:09:33 [INFO] 
08:09:33 [INFO] --- tycho-compiler-plugin:1.3.0:compile (default-compile) @ org.eclipse.tracecompass.tmf.chart.ui.tests ---
08:09:33 [INFO] Compiling 2 source files to C:\Users\hudson\jenkins-slave-tracecompass\workspace\tracecompass-master-nightly-windows\tmf\org.eclipse.tracecompass.tmf.chart.ui.tests\target\classes
08:09:34 [INFO] 
08:09:34 [INFO] --- maven-resources-plugin:3.0.2:testResources (default-testResources) @ org.eclipse.tracecompass.tmf.chart.ui.tests ---
08:09:34 [INFO] Using 'UTF-8' encoding to copy filtered resources.
08:09:34 [INFO] skip non existing resourceDirectory C:\Users\hudson\jenkins-slave-tracecompass\workspace\tracecompass-master-nightly-windows\tmf\org.eclipse.tracecompass.tmf.chart.ui.tests\src\test\resources
08:09:34 [INFO] 
08:09:34 [INFO] --- tycho-source-plugin:1.3.0:plugin-source (plugin-source) @ org.eclipse.tracecompass.tmf.chart.ui.tests ---
08:09:34 [INFO] Building jar: C:\Users\hudson\jenkins-slave-tracecompass\workspace\tracecompass-master-nightly-windows\tmf\org.eclipse.tracecompass.tmf.chart.ui.tests\target\org.eclipse.tracecompass.tmf.chart.ui.tests-1.0.0-SNAPSHOT-sources.jar
08:09:34 [INFO] 
08:09:34 [INFO] --- target-platform-configuration:1.3.0:target-platform (default-target-platform) @ org.eclipse.tracecompass.tmf.chart.ui.tests ---
08:09:34 [INFO] 
08:09:34 [INFO] --- tycho-packaging-plugin:1.3.0:package-plugin (default-package-plugin) @ org.eclipse.tracecompass.tmf.chart.ui.tests ---
08:09:34 [INFO] Building jar: C:\Users\hudson\jenkins-slave-tracecompass\workspace\tracecompass-master-nightly-windows\tmf\org.eclipse.tracecompass.tmf.chart.ui.tests\target\org.eclipse.tracecompass.tmf.chart.ui.tests-1.0.0-SNAPSHOT.jar
08:09:34 [INFO] 
08:09:34 [INFO] --- tycho-p2-plugin:1.3.0:p2-metadata-default (default-p2-metadata-default) @ org.eclipse.tracecompass.tmf.chart.ui.tests ---
08:09:34 [INFO] 
08:09:34 [INFO] --- tycho-source-feature-plugin:1.3.0:source-feature (source-feature) @ org.eclipse.tracecompass.tmf.chart.ui.tests ---
08:09:34 [INFO] 
08:09:34 [INFO] --- tycho-pack200b-plugin:1.3.0:pack (pack200-pack) @ org.eclipse.tracecompass.tmf.chart.ui.tests ---
08:09:34 [INFO] Pack200 packing jar C:\Users\hudson\jenkins-slave-tracecompass\workspace\tracecompass-master-nightly-windows\tmf\org.eclipse.tracecompass.tmf.chart.ui.tests\target\org.eclipse.tracecompass.tmf.chart.ui.tests-1.0.0-SNAPSHOT.jar
08:09:34 [INFO] 
08:09:34 [INFO] --- tycho-p2-plugin:1.3.0:p2-metadata (p2-metadata) @ org.eclipse.tracecompass.tmf.chart.ui.tests ---
08:09:34 [INFO] 
08:09:34 [INFO] --- tycho-surefire-plugin:1.3.0:test (default-test) @ org.eclipse.tracecompass.tmf.chart.ui.tests ---
08:09:34 [INFO] Expected eclipse log file: C:\Users\hudson\jenkins-slave-tracecompass\workspace\tracecompass-master-nightly-windows\tmf\org.eclipse.tracecompass.tmf.chart.ui.tests\target\work\data\.metadata\.log
08:09:36 [INFO] Command line:
08:09:36 	[C:\Program Files\Java\jdk1.8.0_121\jre\bin\java.exe, -Dosgi.noShutdown=false, -Dosgi.os=win32, -Dosgi.ws=win32, -Dosgi.arch=x86_64, -Dorg.eclipse.swt.browser.DefaultType=mozilla, -Xms512m, -Xmx1024m, -Dosgi.clean=true, -jar, C:\Users\hudson\jenkins-slave-tracecompass\workspace\tracecompass-master-nightly-windows\.maven\repo\p2\osgi\bundle\org.eclipse.equinox.launcher\1.5.300.v20190213-1655\org.eclipse.equinox.launcher-1.5.300.v20190213-1655.jar, -data, C:\Users\hudson\jenkins-slave-tracecompass\workspace\tracecompass-master-nightly-windows\tmf\org.eclipse.tracecompass.tmf.chart.ui.tests\target\work\data, -install, C:\Users\hudson\jenkins-slave-tracecompass\workspace\tracecompass-master-nightly-windows\tmf\org.eclipse.tracecompass.tmf.chart.ui.tests\target\work, -configuration, C:\Users\hudson\jenkins-slave-tracecompass\workspace\tracecompass-master-nightly-windows\tmf\org.eclipse.tracecompass.tmf.chart.ui.tests\target\work\configuration, -application, org.eclipse.tycho.surefire.osgibooter.uitest, -testproperties, C:\Users\hudson\jenkins-slave-tracecompass\workspace\tracecompass-master-nightly-windows\tmf\org.eclipse.tracecompass.tmf.chart.ui.tests\target\surefire.properties, -product, org.eclipse.platform.ide, -consoleLog]
08:09:36 Running org.eclipse.tracecompass.tmf.chart.ui.tests.data.ChartRangeTest
08:10:01 Tests run: 4, Failures: 0, Errors: 0, Skipped: 0, Time elapsed: 0.065 s - in org.eclipse.tracecompass.tmf.chart.ui.tests.data.ChartRangeTest
08:10:01 testClamp(org.eclipse.tracecompass.tmf.chart.ui.tests.data.ChartRangeTest)  Time elapsed: 0.005 s
08:10:01 testInvalidConstructor(org.eclipse.tracecompass.tmf.chart.ui.tests.data.ChartRangeTest)  Time elapsed: 0.001 s
08:10:01 testConstructor(org.eclipse.tracecompass.tmf.chart.ui.tests.data.ChartRangeTest)  Time elapsed: 0 s
08:10:01 testDefaultConstructor(org.eclipse.tracecompass.tmf.chart.ui.tests.data.ChartRangeTest)  Time elapsed: 0 s
08:10:01 
08:10:01 Results:
08:10:01 
08:10:01 Tests run: 4, Failures: 0, Errors: 0, Skipped: 0
08:10:01 
08:10:01 [INFO] All tests passed!
08:10:03 [INFO] 
08:10:03 [INFO] --- maven-install-plugin:2.5.2:install (default-install) @ org.eclipse.tracecompass.tmf.chart.ui.tests ---
08:10:03 [INFO] Installing C:\Users\hudson\jenkins-slave-tracecompass\workspace\tracecompass-master-nightly-windows\tmf\org.eclipse.tracecompass.tmf.chart.ui.tests\target\org.eclipse.tracecompass.tmf.chart.ui.tests-1.0.0-SNAPSHOT.jar to C:\Users\hudson\jenkins-slave-tracecompass\workspace\tracecompass-master-nightly-windows\.maven\repo\org\eclipse\tracecompass\org.eclipse.tracecompass.tmf.chart.ui.tests\1.0.0-SNAPSHOT\org.eclipse.tracecompass.tmf.chart.ui.tests-1.0.0-SNAPSHOT.jar
08:10:03 [INFO] Installing C:\Users\hudson\jenkins-slave-tracecompass\workspace\tracecompass-master-nightly-windows\tmf\org.eclipse.tracecompass.tmf.chart.ui.tests\.polyglot.build.properties to C:\Users\hudson\jenkins-slave-tracecompass\workspace\tracecompass-master-nightly-windows\.maven\repo\org\eclipse\tracecompass\org.eclipse.tracecompass.tmf.chart.ui.tests\1.0.0-SNAPSHOT\org.eclipse.tracecompass.tmf.chart.ui.tests-1.0.0-SNAPSHOT.pom
08:10:03 [INFO] Installing C:\Users\hudson\jenkins-slave-tracecompass\workspace\tracecompass-master-nightly-windows\tmf\org.eclipse.tracecompass.tmf.chart.ui.tests\target\org.eclipse.tracecompass.tmf.chart.ui.tests-1.0.0-SNAPSHOT-sources.jar to C:\Users\hudson\jenkins-slave-tracecompass\workspace\tracecompass-master-nightly-windows\.maven\repo\org\eclipse\tracecompass\org.eclipse.tracecompass.tmf.chart.ui.tests\1.0.0-SNAPSHOT\org.eclipse.tracecompass.tmf.chart.ui.tests-1.0.0-SNAPSHOT-sources.jar
08:10:03 [INFO] Installing C:\Users\hudson\jenkins-slave-tracecompass\workspace\tracecompass-master-nightly-windows\tmf\org.eclipse.tracecompass.tmf.chart.ui.tests\target\org.eclipse.tracecompass.tmf.chart.ui.tests-1.0.0-SNAPSHOT.jar.pack.gz to C:\Users\hudson\jenkins-slave-tracecompass\workspace\tracecompass-master-nightly-windows\.maven\repo\org\eclipse\tracecompass\org.eclipse.tracecompass.tmf.chart.ui.tests\1.0.0-SNAPSHOT\org.eclipse.tracecompass.tmf.chart.ui.tests-1.0.0-SNAPSHOT-pack200.jar.pack.gz
08:10:03 [INFO] Installing C:\Users\hudson\jenkins-slave-tracecompass\workspace\tracecompass-master-nightly-windows\tmf\org.eclipse.tracecompass.tmf.chart.ui.tests\target\p2content.xml to C:\Users\hudson\jenkins-slave-tracecompass\workspace\tracecompass-master-nightly-windows\.maven\repo\org\eclipse\tracecompass\org.eclipse.tracecompass.tmf.chart.ui.tests\1.0.0-SNAPSHOT\org.eclipse.tracecompass.tmf.chart.ui.tests-1.0.0-SNAPSHOT-p2metadata.xml
08:10:03 [INFO] Installing C:\Users\hudson\jenkins-slave-tracecompass\workspace\tracecompass-master-nightly-windows\tmf\org.eclipse.tracecompass.tmf.chart.ui.tests\target\p2artifacts.xml to C:\Users\hudson\jenkins-slave-tracecompass\workspace\tracecompass-master-nightly-windows\.maven\repo\org\eclipse\tracecompass\org.eclipse.tracecompass.tmf.chart.ui.tests\1.0.0-SNAPSHOT\org.eclipse.tracecompass.tmf.chart.ui.tests-1.0.0-SNAPSHOT-p2artifacts.xml
08:10:03 [INFO] 
08:10:03 [INFO] --- tycho-p2-plugin:1.3.0:update-local-index (default-update-local-index) @ org.eclipse.tracecompass.tmf.chart.ui.tests ---
08:10:03 [INFO]                                                                         
08:10:03 [INFO] ------------------------------------------------------------------------
08:10:03 [INFO] Building org.eclipse.tracecompass.tmf.remote.ui.swtbot.tests 1.0.5-SNAPSHOT
08:10:03 [INFO] ------------------------------------------------------------------------
08:10:03 [INFO] 
08:10:03 [INFO] --- maven-clean-plugin:3.0.0:clean (default-clean) @ org.eclipse.tracecompass.tmf.remote.ui.swtbot.tests ---
08:10:03 [INFO] Deleting C:\Users\hudson\jenkins-slave-tracecompass\workspace\tracecompass-master-nightly-windows\tmf\org.eclipse.tracecompass.tmf.remote.ui.swtbot.tests\target
08:10:03 [INFO] 
08:10:06 [INFO] --- tycho-packaging-plugin:1.3.0:build-qualifier (default-build-qualifier) @ org.eclipse.tracecompass.tmf.remote.ui.swtbot.tests ---
08:10:06 [INFO] The project's OSGi version is 1.0.5.201904251016
08:10:06 [INFO] 
08:10:06 [INFO] --- tycho-packaging-plugin:1.3.0:validate-id (default-validate-id) @ org.eclipse.tracecompass.tmf.remote.ui.swtbot.tests ---
08:10:06 [INFO] 
08:10:06 [INFO] --- tycho-packaging-plugin:1.3.0:validate-version (default-validate-version) @ org.eclipse.tracecompass.tmf.remote.ui.swtbot.tests ---
08:10:06 [INFO] 
08:10:06 [INFO] --- maven-enforcer-plugin:1.4.1:enforce (enforce-maven-version) @ org.eclipse.tracecompass.tmf.remote.ui.swtbot.tests ---
08:10:06 [INFO] 
08:10:06 [INFO] --- maven-resources-plugin:3.0.2:resources (default-resources) @ org.eclipse.tracecompass.tmf.remote.ui.swtbot.tests ---
08:10:06 [INFO] Using 'UTF-8' encoding to copy filtered resources.
08:10:06 [INFO] skip non existing resourceDirectory C:\Users\hudson\jenkins-slave-tracecompass\workspace\tracecompass-master-nightly-windows\tmf\org.eclipse.tracecompass.tmf.remote.ui.swtbot.tests\src\main\resources
08:10:06 [INFO] 
08:10:06 [INFO] --- tycho-compiler-plugin:1.3.0:compile (default-compile) @ org.eclipse.tracecompass.tmf.remote.ui.swtbot.tests ---
08:10:06 [INFO] Compiling 2 source files to C:\Users\hudson\jenkins-slave-tracecompass\workspace\tracecompass-master-nightly-windows\tmf\org.eclipse.tracecompass.tmf.remote.ui.swtbot.tests\target\classes
08:10:06 [INFO] 
08:10:07 [INFO] --- maven-resources-plugin:3.0.2:testResources (default-testResources) @ org.eclipse.tracecompass.tmf.remote.ui.swtbot.tests ---
08:10:07 [INFO] Using 'UTF-8' encoding to copy filtered resources.
08:10:07 [INFO] skip non existing resourceDirectory C:\Users\hudson\jenkins-slave-tracecompass\workspace\tracecompass-master-nightly-windows\tmf\org.eclipse.tracecompass.tmf.remote.ui.swtbot.tests\src\test\resources
08:10:07 [INFO] 
08:10:07 [INFO] --- tycho-source-plugin:1.3.0:plugin-source (plugin-source) @ org.eclipse.tracecompass.tmf.remote.ui.swtbot.tests ---
08:10:07 [INFO] Building jar: C:\Users\hudson\jenkins-slave-tracecompass\workspace\tracecompass-master-nightly-windows\tmf\org.eclipse.tracecompass.tmf.remote.ui.swtbot.tests\target\org.eclipse.tracecompass.tmf.remote.ui.swtbot.tests-1.0.5-SNAPSHOT-sources.jar
08:10:07 [INFO] 
08:10:07 [INFO] --- target-platform-configuration:1.3.0:target-platform (default-target-platform) @ org.eclipse.tracecompass.tmf.remote.ui.swtbot.tests ---
08:10:07 [INFO] 
08:10:07 [INFO] --- tycho-packaging-plugin:1.3.0:package-plugin (default-package-plugin) @ org.eclipse.tracecompass.tmf.remote.ui.swtbot.tests ---
08:10:07 [INFO] Building jar: C:\Users\hudson\jenkins-slave-tracecompass\workspace\tracecompass-master-nightly-windows\tmf\org.eclipse.tracecompass.tmf.remote.ui.swtbot.tests\target\org.eclipse.tracecompass.tmf.remote.ui.swtbot.tests-1.0.5-SNAPSHOT.jar
08:10:07 [INFO] 
08:10:08 [INFO] --- tycho-p2-plugin:1.3.0:p2-metadata-default (default-p2-metadata-default) @ org.eclipse.tracecompass.tmf.remote.ui.swtbot.tests ---
08:10:08 [INFO] 
08:10:08 [INFO] --- tycho-source-feature-plugin:1.3.0:source-feature (source-feature) @ org.eclipse.tracecompass.tmf.remote.ui.swtbot.tests ---
08:10:08 [INFO] 
08:10:08 [INFO] --- tycho-pack200b-plugin:1.3.0:pack (pack200-pack) @ org.eclipse.tracecompass.tmf.remote.ui.swtbot.tests ---
08:10:08 [INFO] Pack200 packing jar C:\Users\hudson\jenkins-slave-tracecompass\workspace\tracecompass-master-nightly-windows\tmf\org.eclipse.tracecompass.tmf.remote.ui.swtbot.tests\target\org.eclipse.tracecompass.tmf.remote.ui.swtbot.tests-1.0.5-SNAPSHOT.jar
08:10:08 [INFO] 
08:10:08 [INFO] --- tycho-p2-plugin:1.3.0:p2-metadata (p2-metadata) @ org.eclipse.tracecompass.tmf.remote.ui.swtbot.tests ---
08:10:08 [INFO] 
08:10:08 [INFO] --- tycho-surefire-plugin:1.3.0:test (default-test) @ org.eclipse.tracecompass.tmf.remote.ui.swtbot.tests ---
08:10:08 [INFO] Expected eclipse log file: C:\Users\hudson\jenkins-slave-tracecompass\workspace\tracecompass-master-nightly-windows\tmf\org.eclipse.tracecompass.tmf.remote.ui.swtbot.tests\target\work\data\.metadata\.log
08:10:09 [INFO] Command line:
08:10:09 	[C:\Program Files\Java\jdk1.8.0_121\jre\bin\java.exe, -Dosgi.noShutdown=false, -Dosgi.os=win32, -Dosgi.ws=win32, -Dosgi.arch=x86_64, -Dorg.eclipse.swt.browser.DefaultType=mozilla, -Xms512m, -Xmx1024m, -Dosgi.clean=true, -jar, C:\Users\hudson\jenkins-slave-tracecompass\workspace\tracecompass-master-nightly-windows\.maven\repo\p2\osgi\bundle\org.eclipse.equinox.launcher\1.5.300.v20190213-1655\org.eclipse.equinox.launcher-1.5.300.v20190213-1655.jar, -data, C:\Users\hudson\jenkins-slave-tracecompass\workspace\tracecompass-master-nightly-windows\tmf\org.eclipse.tracecompass.tmf.remote.ui.swtbot.tests\target\work\data, -install, C:\Users\hudson\jenkins-slave-tracecompass\workspace\tracecompass-master-nightly-windows\tmf\org.eclipse.tracecompass.tmf.remote.ui.swtbot.tests\target\work, -configuration, C:\Users\hudson\jenkins-slave-tracecompass\workspace\tracecompass-master-nightly-windows\tmf\org.eclipse.tracecompass.tmf.remote.ui.swtbot.tests\target\work\configuration, -application, org.eclipse.tycho.surefire.osgibooter.uitest, -testproperties, C:\Users\hudson\jenkins-slave-tracecompass\workspace\tracecompass-master-nightly-windows\tmf\org.eclipse.tracecompass.tmf.remote.ui.swtbot.tests\target\surefire.properties, -product, org.eclipse.platform.ide, -nouithread, -consoleLog]
08:10:09 Running org.eclipse.tracecompass.tmf.remote.ui.swtbot.tests.fetch.FetchRemoteTracesTest
08:10:37 Display size: 1920x1200
08:10:38 OS version=6.3
08:10:38 Time zone: Greenwich Mean Time
08:10:38 log4j:WARN No appenders could be found for logger (org.eclipse.swtbot.swt.finder.widgets.SWTBotShell).
08:10:38 log4j:WARN Please initialize the log4j system properly.
08:10:38 !SESSION 2019-04-25 12:10:04.448 -----------------------------------------------
08:12:14 eclipse.buildId=unknown
08:12:14 java.version=1.8.0_121
08:12:14 java.vendor=Oracle Corporation
08:12:14 BootLoader constants: OS=win32, ARCH=x86_64, WS=win32, NL=en_US
08:12:14 Framework arguments:  -application org.eclipse.tycho.surefire.osgibooter.uitest -testproperties C:\Users\hudson\jenkins-slave-tracecompass\workspace\tracecompass-master-nightly-windows\tmf\org.eclipse.tracecompass.tmf.remote.ui.swtbot.tests\target\surefire.properties -product org.eclipse.platform.ide -nouithread
08:12:14 Command-line arguments:  -data C:\Users\hudson\jenkins-slave-tracecompass\workspace\tracecompass-master-nightly-windows\tmf\org.eclipse.tracecompass.tmf.remote.ui.swtbot.tests\target\work\data -application org.eclipse.tycho.surefire.osgibooter.uitest -testproperties C:\Users\hudson\jenkins-slave-tracecompass\workspace\tracecompass-master-nightly-windows\tmf\org.eclipse.tracecompass.tmf.remote.ui.swtbot.tests\target\surefire.properties -product org.eclipse.platform.ide -nouithread -consoleLog
08:12:14 
08:12:14 !ENTRY org.eclipse.tracecompass.tmf.ui 4 0 2019-04-25 12:12:09.219
08:12:14 !MESSAGE Error connection to node 'ssh://anonymous@unknown.unknown.unknown'
08:12:14 !STACK 0
08:12:14 org.eclipse.core.commands.ExecutionException: Cannot connect Unknown
08:12:14 	at org.eclipse.tracecompass.tmf.remote.core.proxy.RemoteSystemProxy.connect(RemoteSystemProxy.java:88)
08:12:14 	at org.eclipse.tracecompass.internal.tmf.remote.ui.wizards.fetch.model.RemoteImportConnectionNodeElement.connect(RemoteImportConnectionNodeElement.java:141)
08:12:14 	at org.eclipse.tracecompass.internal.tmf.remote.ui.wizards.fetch.RemoteFetchLogWizardRemotePage$8.run(RemoteFetchLogWizardRemotePage.java:401)
08:12:14 	at org.eclipse.jface.operation.ModalContext$ModalContextThread.run(ModalContext.java:122)
08:12:14 Caused by: org.eclipse.remote.core.exception.RemoteConnectionException: Session.connect: java.net.UnknownHostException: unknown.unknown.unknown
08:12:14 	at org.eclipse.remote.internal.jsch.core.JSchConnection.newSession(JSchConnection.java:803)
08:12:14 	at org.eclipse.remote.internal.jsch.core.JSchConnection.open(JSchConnection.java:841)
08:12:14 	at org.eclipse.remote.internal.jsch.core.JSchConnection.open(JSchConnection.java:814)
08:12:14 	at org.eclipse.remote.internal.core.RemoteConnection.open(RemoteConnection.java:208)
08:12:14 	at org.eclipse.tracecompass.tmf.remote.core.proxy.RemoteSystemProxy.connect(RemoteSystemProxy.java:84)
08:12:14 	... 3 more
08:12:14 Tests run: 20, Failures: 1, Errors: 0, Skipped: 1, Time elapsed: 109.785 s <<< FAILURE! - in org.eclipse.tracecompass.tmf.remote.ui.swtbot.tests.fetch.FetchRemoteTracesTest
08:12:27 testImportNothing(org.eclipse.tracecompass.tmf.remote.ui.swtbot.tests.fetch.FetchRemoteTracesTest)  Time elapsed: 8.717 s
08:12:27 test_7_03(org.eclipse.tracecompass.tmf.remote.ui.swtbot.tests.fetch.FetchRemoteTracesTest)  Time elapsed: 5.995 s
08:12:27 test_8_04(org.eclipse.tracecompass.tmf.remote.ui.swtbot.tests.fetch.FetchRemoteTracesTest)  Time elapsed: 13.604 s
08:12:27 test_8_05(org.eclipse.tracecompass.tmf.remote.ui.swtbot.tests.fetch.FetchRemoteTracesTest)  Time elapsed: 13.966 s
08:12:27 test_8_06(org.eclipse.tracecompass.tmf.remote.ui.swtbot.tests.fetch.FetchRemoteTracesTest)  Time elapsed: 7.926 s
08:12:27 test_8_07(org.eclipse.tracecompass.tmf.remote.ui.swtbot.tests.fetch.FetchRemoteTracesTest)  Time elapsed: 7.193 s
08:12:27 test_8_08(org.eclipse.tracecompass.tmf.remote.ui.swtbot.tests.fetch.FetchRemoteTracesTest)  Time elapsed: 6.84 s
08:12:27 test_8_09(org.eclipse.tracecompass.tmf.remote.ui.swtbot.tests.fetch.FetchRemoteTracesTest)  Time elapsed: 3.829 s
08:12:27 test_8_10(org.eclipse.tracecompass.tmf.remote.ui.swtbot.tests.fetch.FetchRemoteTracesTest)  Time elapsed: 2.884 s
08:12:27 test_8_11(org.eclipse.tracecompass.tmf.remote.ui.swtbot.tests.fetch.FetchRemoteTracesTest)  Time elapsed: 4.102 s
08:12:27 test_8_12(org.eclipse.tracecompass.tmf.remote.ui.swtbot.tests.fetch.FetchRemoteTracesTest)  Time elapsed: 3.046 s
08:12:27 test_8_13(org.eclipse.tracecompass.tmf.remote.ui.swtbot.tests.fetch.FetchRemoteTracesTest)  Time elapsed: 3.866 s
08:12:27 test_8_14(org.eclipse.tracecompass.tmf.remote.ui.swtbot.tests.fetch.FetchRemoteTracesTest)  Time elapsed: 1.564 s
08:12:27 test_8_15(org.eclipse.tracecompass.tmf.remote.ui.swtbot.tests.fetch.FetchRemoteTracesTest)  Time elapsed: 4.214 s
08:12:27 test_9_01(org.eclipse.tracecompass.tmf.remote.ui.swtbot.tests.fetch.FetchRemoteTracesTest)  Time elapsed: 1.669 s
08:12:27 test_9_02(org.eclipse.tracecompass.tmf.remote.ui.swtbot.tests.fetch.FetchRemoteTracesTest) skipped
08:12:27 testImportOnlyOne(org.eclipse.tracecompass.tmf.remote.ui.swtbot.tests.fetch.FetchRemoteTracesTest)  Time elapsed: 3.248 s
08:12:27 testEmptyFile(org.eclipse.tracecompass.tmf.remote.ui.swtbot.tests.fetch.FetchRemoteTracesTest)  Time elapsed: 1.788 s
08:12:27 testImportAll(org.eclipse.tracecompass.tmf.remote.ui.swtbot.tests.fetch.FetchRemoteTracesTest)  Time elapsed: 4.824 s
08:12:27 testEditProfile(org.eclipse.tracecompass.tmf.remote.ui.swtbot.tests.fetch.FetchRemoteTracesTest)  Time elapsed: 1.977 s  <<< FAILURE!
08:12:27 java.lang.AssertionError: expected:<0> but was:<3>
08:12:27 	at org.junit.Assert.fail(Assert.java:88)
08:12:27 	at org.junit.Assert.failNotEquals(Assert.java:834)
08:12:27 	at org.junit.Assert.assertEquals(Assert.java:645)
08:12:27 	at org.junit.Assert.assertEquals(Assert.java:631)
08:12:27 	at org.eclipse.tracecompass.tmf.remote.ui.swtbot.tests.fetch.FetchRemoteTracesTest.testEditProfile(FetchRemoteTracesTest.java:837)
08:12:27 	at sun.reflect.NativeMethodAccessorImpl.invoke0(Native Method)
08:12:27 	at sun.reflect.NativeMethodAccessorImpl.invoke(NativeMethodAccessorImpl.java:62)
08:12:27 	at sun.reflect.DelegatingMethodAccessorImpl.invoke(DelegatingMethodAccessorImpl.java:43)
08:12:27 	at java.lang.reflect.Method.invoke(Method.java:498)
08:12:27 	at org.junit.runners.model.FrameworkMethod$1.runReflectiveCall(FrameworkMethod.java:50)
08:12:27 	at org.junit.internal.runners.model.ReflectiveCallable.run(ReflectiveCallable.java:12)
08:12:27 	at org.junit.runners.model.FrameworkMethod.invokeExplosively(FrameworkMethod.java:47)
08:12:27 	at org.eclipse.swtbot.swt.finder.junit.internal.CapturingFrameworkMethod.invokeExplosively(CapturingFrameworkMethod.java:47)
08:12:27 	at org.junit.internal.runners.statements.InvokeMethod.evaluate(InvokeMethod.java:17)
08:12:27 	at org.junit.internal.runners.statements.RunBefores.evaluate(RunBefores.java:26)
08:12:27 	at org.junit.internal.runners.statements.RunAfters.evaluate(RunAfters.java:27)
08:12:27 	at org.junit.runners.ParentRunner.runLeaf(ParentRunner.java:325)
08:12:27 	at org.eclipse.swtbot.swt.finder.junit.SWTBotJunit4ClassRunner.runChild(SWTBotJunit4ClassRunner.java:75)
08:12:27 	at org.junit.runners.BlockJUnit4ClassRunner.runChild(BlockJUnit4ClassRunner.java:57)
08:12:27 	at org.junit.runners.ParentRunner$3.run(ParentRunner.java:290)
08:12:27 	at org.junit.runners.ParentRunner$1.schedule(ParentRunner.java:71)
08:12:27 	at org.junit.runners.ParentRunner.runChildren(ParentRunner.java:288)
08:12:27 	at org.junit.runners.ParentRunner.access$000(ParentRunner.java:58)
08:12:27 	at org.junit.runners.ParentRunner$2.evaluate(ParentRunner.java:268)
08:12:27 	at org.junit.internal.runners.statements.RunBefores.evaluate(RunBefores.java:26)
08:12:27 	at org.junit.internal.runners.statements.RunAfters.evaluate(RunAfters.java:27)
08:12:27 	at org.junit.runners.ParentRunner.run(ParentRunner.java:363)
08:12:27 	at org.eclipse.swtbot.swt.finder.junit.SWTBotJunit4ClassRunner.run(SWTBotJunit4ClassRunner.java:60)
08:12:27 	at org.apache.maven.surefire.junit4.JUnit4Provider.execute(JUnit4Provider.java:365)
08:12:27 	at org.apache.maven.surefire.junit4.JUnit4Provider.executeWithRerun(JUnit4Provider.java:273)
08:12:27 	at org.apache.maven.surefire.junit4.JUnit4Provider.executeTestSet(JUnit4Provider.java:238)
08:12:27 	at org.apache.maven.surefire.junit4.JUnit4Provider.invoke(JUnit4Provider.java:159)
08:12:27 	at sun.reflect.NativeMethodAccessorImpl.invoke0(Native Method)
08:12:27 	at sun.reflect.NativeMethodAccessorImpl.invoke(NativeMethodAccessorImpl.java:62)
08:12:27 	at sun.reflect.DelegatingMethodAccessorImpl.invoke(DelegatingMethodAccessorImpl.java:43)
08:12:27 	at java.lang.reflect.Method.invoke(Method.java:498)
08:12:27 	at org.apache.maven.surefire.util.ReflectionUtils.invokeMethodWithArray2(ReflectionUtils.java:206)
08:12:27 	at org.apache.maven.surefire.booter.ProviderFactory$ProviderProxy.invoke(ProviderFactory.java:161)
08:12:27 	at org.apache.maven.surefire.booter.ProviderFactory.invokeProvider(ProviderFactory.java:84)
08:12:27 	at org.eclipse.tycho.surefire.osgibooter.OsgiSurefireBooter.run(OsgiSurefireBooter.java:110)
08:12:27 	at org.eclipse.tycho.surefire.osgibooter.AbstractUITestApplication.runTests(AbstractUITestApplication.java:44)
08:12:27 	at org.eclipse.e4.ui.internal.workbench.swt.E4Testable.lambda$0(E4Testable.java:76)
08:12:27 	at java.lang.Thread.run(Thread.java:745)
08:12:27 
08:12:27 
08:12:27 Results:
08:12:27 
08:12:27 Failures: 
08:12:27   FetchRemoteTracesTest.testEditProfile:837 expected:<0> but was:<3>
08:12:27 
08:12:27 Tests run: 20, Failures: 1, Errors: 0, Skipped: 1
08:12:27 
08:12:27 
08:12:28 !ENTRY org.eclipse.core.resources 2 10035 2019-04-25 12:12:23.087
08:12:28 !MESSAGE The workspace will exit with unsaved changes in this session.
08:12:28 [ERROR] There are test failures.
08:12:29 
08:12:29 Please refer to C:\Users\hudson\jenkins-slave-tracecompass\workspace\tracecompass-master-nightly-windows\tmf\org.eclipse.tracecompass.tmf.remote.ui.swtbot.tests\target\surefire-reports for the individual test results.
08:12:29 [INFO] 
08:12:29 [INFO] --- maven-install-plugin:2.5.2:install (default-install) @ org.eclipse.tracecompass.tmf.remote.ui.swtbot.tests ---
08:12:29 [INFO] Installing C:\Users\hudson\jenkins-slave-tracecompass\workspace\tracecompass-master-nightly-windows\tmf\org.eclipse.tracecompass.tmf.remote.ui.swtbot.tests\target\org.eclipse.tracecompass.tmf.remote.ui.swtbot.tests-1.0.5-SNAPSHOT.jar to C:\Users\hudson\jenkins-slave-tracecompass\workspace\tracecompass-master-nightly-windows\.maven\repo\org\eclipse\tracecompass\org.eclipse.tracecompass.tmf.remote.ui.swtbot.tests\1.0.5-SNAPSHOT\org.eclipse.tracecompass.tmf.remote.ui.swtbot.tests-1.0.5-SNAPSHOT.jar
08:12:29 [INFO] Installing C:\Users\hudson\jenkins-slave-tracecompass\workspace\tracecompass-master-nightly-windows\tmf\org.eclipse.tracecompass.tmf.remote.ui.swtbot.tests\.polyglot.build.properties to C:\Users\hudson\jenkins-slave-tracecompass\workspace\tracecompass-master-nightly-windows\.maven\repo\org\eclipse\tracecompass\org.eclipse.tracecompass.tmf.remote.ui.swtbot.tests\1.0.5-SNAPSHOT\org.eclipse.tracecompass.tmf.remote.ui.swtbot.tests-1.0.5-SNAPSHOT.pom
08:12:29 [INFO] Installing C:\Users\hudson\jenkins-slave-tracecompass\workspace\tracecompass-master-nightly-windows\tmf\org.eclipse.tracecompass.tmf.remote.ui.swtbot.tests\target\org.eclipse.tracecompass.tmf.remote.ui.swtbot.tests-1.0.5-SNAPSHOT-sources.jar to C:\Users\hudson\jenkins-slave-tracecompass\workspace\tracecompass-master-nightly-windows\.maven\repo\org\eclipse\tracecompass\org.eclipse.tracecompass.tmf.remote.ui.swtbot.tests\1.0.5-SNAPSHOT\org.eclipse.tracecompass.tmf.remote.ui.swtbot.tests-1.0.5-SNAPSHOT-sources.jar
08:12:29 [INFO] Installing C:\Users\hudson\jenkins-slave-tracecompass\workspace\tracecompass-master-nightly-windows\tmf\org.eclipse.tracecompass.tmf.remote.ui.swtbot.tests\target\org.eclipse.tracecompass.tmf.remote.ui.swtbot.tests-1.0.5-SNAPSHOT.jar.pack.gz to C:\Users\hudson\jenkins-slave-tracecompass\workspace\tracecompass-master-nightly-windows\.maven\repo\org\eclipse\tracecompass\org.eclipse.tracecompass.tmf.remote.ui.swtbot.tests\1.0.5-SNAPSHOT\org.eclipse.tracecompass.tmf.remote.ui.swtbot.tests-1.0.5-SNAPSHOT-pack200.jar.pack.gz
08:12:29 [INFO] Installing C:\Users\hudson\jenkins-slave-tracecompass\workspace\tracecompass-master-nightly-windows\tmf\org.eclipse.tracecompass.tmf.remote.ui.swtbot.tests\target\p2content.xml to C:\Users\hudson\jenkins-slave-tracecompass\workspace\tracecompass-master-nightly-windows\.maven\repo\org\eclipse\tracecompass\org.eclipse.tracecompass.tmf.remote.ui.swtbot.tests\1.0.5-SNAPSHOT\org.eclipse.tracecompass.tmf.remote.ui.swtbot.tests-1.0.5-SNAPSHOT-p2metadata.xml
08:12:29 [INFO] Installing C:\Users\hudson\jenkins-slave-tracecompass\workspace\tracecompass-master-nightly-windows\tmf\org.eclipse.tracecompass.tmf.remote.ui.swtbot.tests\target\p2artifacts.xml to C:\Users\hudson\jenkins-slave-tracecompass\workspace\tracecompass-master-nightly-windows\.maven\repo\org\eclipse\tracecompass\org.eclipse.tracecompass.tmf.remote.ui.swtbot.tests\1.0.5-SNAPSHOT\org.eclipse.tracecompass.tmf.remote.ui.swtbot.tests-1.0.5-SNAPSHOT-p2artifacts.xml
08:12:29 [INFO] 
08:12:29 [INFO] --- tycho-p2-plugin:1.3.0:update-local-index (default-update-local-index) @ org.eclipse.tracecompass.tmf.remote.ui.swtbot.tests ---
08:12:29 [INFO]                                                                         
08:12:29 [INFO] ------------------------------------------------------------------------
08:12:29 [INFO] Building org.eclipse.tracecompass.tmf.remote.ui.tests 1.0.0-SNAPSHOT
08:12:29 [INFO] ------------------------------------------------------------------------
08:12:29 [INFO] 
08:12:29 [INFO] --- maven-clean-plugin:3.0.0:clean (default-clean) @ org.eclipse.tracecompass.tmf.remote.ui.tests ---
08:12:29 [INFO] Deleting C:\Users\hudson\jenkins-slave-tracecompass\workspace\tracecompass-master-nightly-windows\tmf\org.eclipse.tracecompass.tmf.remote.ui.tests\target
08:12:29 [INFO] 
08:12:31 [INFO] --- tycho-packaging-plugin:1.3.0:build-qualifier (default-build-qualifier) @ org.eclipse.tracecompass.tmf.remote.ui.tests ---
08:12:31 [INFO] The project's OSGi version is 1.0.0.201904251016
08:12:31 [INFO] 
08:12:31 [INFO] --- tycho-packaging-plugin:1.3.0:validate-id (default-validate-id) @ org.eclipse.tracecompass.tmf.remote.ui.tests ---
08:12:31 [INFO] 
08:12:31 [INFO] --- tycho-packaging-plugin:1.3.0:validate-version (default-validate-version) @ org.eclipse.tracecompass.tmf.remote.ui.tests ---
08:12:31 [INFO] 
08:12:31 [INFO] --- maven-enforcer-plugin:1.4.1:enforce (enforce-maven-version) @ org.eclipse.tracecompass.tmf.remote.ui.tests ---
08:12:31 [INFO] 
08:12:31 [INFO] --- maven-resources-plugin:3.0.2:resources (default-resources) @ org.eclipse.tracecompass.tmf.remote.ui.tests ---
08:12:31 [INFO] Using 'UTF-8' encoding to copy filtered resources.
08:12:31 [INFO] skip non existing resourceDirectory C:\Users\hudson\jenkins-slave-tracecompass\workspace\tracecompass-master-nightly-windows\tmf\org.eclipse.tracecompass.tmf.remote.ui.tests\src\main\resources
08:12:31 [INFO] 
08:12:31 [INFO] --- tycho-compiler-plugin:1.3.0:compile (default-compile) @ org.eclipse.tracecompass.tmf.remote.ui.tests ---
08:12:31 [INFO] Compiling 4 source files to C:\Users\hudson\jenkins-slave-tracecompass\workspace\tracecompass-master-nightly-windows\tmf\org.eclipse.tracecompass.tmf.remote.ui.tests\target\classes
08:12:31 [INFO] 
08:12:32 [INFO] --- maven-resources-plugin:3.0.2:testResources (default-testResources) @ org.eclipse.tracecompass.tmf.remote.ui.tests ---
08:12:32 [INFO] Using 'UTF-8' encoding to copy filtered resources.
08:12:32 [INFO] skip non existing resourceDirectory C:\Users\hudson\jenkins-slave-tracecompass\workspace\tracecompass-master-nightly-windows\tmf\org.eclipse.tracecompass.tmf.remote.ui.tests\src\test\resources
08:12:32 [INFO] 
08:12:32 [INFO] --- tycho-source-plugin:1.3.0:plugin-source (plugin-source) @ org.eclipse.tracecompass.tmf.remote.ui.tests ---
08:12:32 [INFO] Building jar: C:\Users\hudson\jenkins-slave-tracecompass\workspace\tracecompass-master-nightly-windows\tmf\org.eclipse.tracecompass.tmf.remote.ui.tests\target\org.eclipse.tracecompass.tmf.remote.ui.tests-1.0.0-SNAPSHOT-sources.jar
08:12:32 [INFO] 
08:12:32 [INFO] --- target-platform-configuration:1.3.0:target-platform (default-target-platform) @ org.eclipse.tracecompass.tmf.remote.ui.tests ---
08:12:32 [INFO] 
08:12:32 [INFO] --- tycho-packaging-plugin:1.3.0:package-plugin (default-package-plugin) @ org.eclipse.tracecompass.tmf.remote.ui.tests ---
08:12:32 [INFO] Building jar: C:\Users\hudson\jenkins-slave-tracecompass\workspace\tracecompass-master-nightly-windows\tmf\org.eclipse.tracecompass.tmf.remote.ui.tests\target\org.eclipse.tracecompass.tmf.remote.ui.tests-1.0.0-SNAPSHOT.jar
08:12:32 [INFO] 
08:12:32 [INFO] --- tycho-p2-plugin:1.3.0:p2-metadata-default (default-p2-metadata-default) @ org.eclipse.tracecompass.tmf.remote.ui.tests ---
08:12:32 [INFO] 
08:12:32 [INFO] --- tycho-source-feature-plugin:1.3.0:source-feature (source-feature) @ org.eclipse.tracecompass.tmf.remote.ui.tests ---
08:12:32 [INFO] 
08:12:32 [INFO] --- tycho-pack200b-plugin:1.3.0:pack (pack200-pack) @ org.eclipse.tracecompass.tmf.remote.ui.tests ---
08:12:32 [INFO] Pack200 packing jar C:\Users\hudson\jenkins-slave-tracecompass\workspace\tracecompass-master-nightly-windows\tmf\org.eclipse.tracecompass.tmf.remote.ui.tests\target\org.eclipse.tracecompass.tmf.remote.ui.tests-1.0.0-SNAPSHOT.jar
08:12:32 [INFO] 
08:12:32 [INFO] --- tycho-p2-plugin:1.3.0:p2-metadata (p2-metadata) @ org.eclipse.tracecompass.tmf.remote.ui.tests ---
08:12:32 [INFO] 
08:12:32 [INFO] --- tycho-surefire-plugin:1.3.0:test (default-test) @ org.eclipse.tracecompass.tmf.remote.ui.tests ---
08:12:32 [INFO] Expected eclipse log file: C:\Users\hudson\jenkins-slave-tracecompass\workspace\tracecompass-master-nightly-windows\tmf\org.eclipse.tracecompass.tmf.remote.ui.tests\target\work\data\.metadata\.log
08:12:33 [INFO] Command line:
08:12:33 	[C:\Program Files\Java\jdk1.8.0_121\jre\bin\java.exe, -Dosgi.noShutdown=false, -Dosgi.os=win32, -Dosgi.ws=win32, -Dosgi.arch=x86_64, -Dorg.eclipse.swt.browser.DefaultType=mozilla, -Xms512m, -Xmx1024m, -Dosgi.clean=true, -jar, C:\Users\hudson\jenkins-slave-tracecompass\workspace\tracecompass-master-nightly-windows\.maven\repo\p2\osgi\bundle\org.eclipse.equinox.launcher\1.5.300.v20190213-1655\org.eclipse.equinox.launcher-1.5.300.v20190213-1655.jar, -data, C:\Users\hudson\jenkins-slave-tracecompass\workspace\tracecompass-master-nightly-windows\tmf\org.eclipse.tracecompass.tmf.remote.ui.tests\target\work\data, -install, C:\Users\hudson\jenkins-slave-tracecompass\workspace\tracecompass-master-nightly-windows\tmf\org.eclipse.tracecompass.tmf.remote.ui.tests\target\work, -configuration, C:\Users\hudson\jenkins-slave-tracecompass\workspace\tracecompass-master-nightly-windows\tmf\org.eclipse.tracecompass.tmf.remote.ui.tests\target\work\configuration, -application, org.eclipse.tycho.surefire.osgibooter.uitest, -testproperties, C:\Users\hudson\jenkins-slave-tracecompass\workspace\tracecompass-master-nightly-windows\tmf\org.eclipse.tracecompass.tmf.remote.ui.tests\target\surefire.properties, -product, org.eclipse.platform.ide, -consoleLog]
08:12:33 Running org.eclipse.tracecompass.tmf.remote.ui.tests.fetch.RemoteImportProfilesReaderTest
08:12:59 Tests run: 5, Failures: 0, Errors: 0, Skipped: 0, Time elapsed: 0.306 s - in org.eclipse.tracecompass.tmf.remote.ui.tests.fetch.RemoteImportProfilesReaderTest
08:13:01 testLoadElements(org.eclipse.tracecompass.tmf.remote.ui.tests.fetch.RemoteImportProfilesReaderTest)  Time elapsed: 0.086 s
08:13:01 testValidateInvalidMissingFiles(org.eclipse.tracecompass.tmf.remote.ui.tests.fetch.RemoteImportProfilesReaderTest)  Time elapsed: 0.095 s
08:13:01 testValidateInvalidEmptyProfile(org.eclipse.tracecompass.tmf.remote.ui.tests.fetch.RemoteImportProfilesReaderTest)  Time elapsed: 0.055 s
08:13:01 testValidateInvalidMissingRoot(org.eclipse.tracecompass.tmf.remote.ui.tests.fetch.RemoteImportProfilesReaderTest)  Time elapsed: 0.008 s
08:13:01 testValidateValid(org.eclipse.tracecompass.tmf.remote.ui.tests.fetch.RemoteImportProfilesReaderTest)  Time elapsed: 0.005 s
08:13:01 Running org.eclipse.tracecompass.tmf.remote.ui.tests.fetch.RemoteImportProfilesWriterTest
08:13:01 Tests run: 1, Failures: 0, Errors: 0, Skipped: 0, Time elapsed: 0.128 s - in org.eclipse.tracecompass.tmf.remote.ui.tests.fetch.RemoteImportProfilesWriterTest
08:13:01 testValidateValid(org.eclipse.tracecompass.tmf.remote.ui.tests.fetch.RemoteImportProfilesWriterTest)  Time elapsed: 0.127 s
08:13:01 
08:13:01 Results:
08:13:01 
08:13:01 Tests run: 6, Failures: 0, Errors: 0, Skipped: 0
08:13:01 
08:13:01 [INFO] All tests passed!
08:13:04 [INFO] 
08:13:04 [INFO] --- maven-install-plugin:2.5.2:install (default-install) @ org.eclipse.tracecompass.tmf.remote.ui.tests ---
08:13:04 [INFO] Installing C:\Users\hudson\jenkins-slave-tracecompass\workspace\tracecompass-master-nightly-windows\tmf\org.eclipse.tracecompass.tmf.remote.ui.tests\target\org.eclipse.tracecompass.tmf.remote.ui.tests-1.0.0-SNAPSHOT.jar to C:\Users\hudson\jenkins-slave-tracecompass\workspace\tracecompass-master-nightly-windows\.maven\repo\org\eclipse\tracecompass\org.eclipse.tracecompass.tmf.remote.ui.tests\1.0.0-SNAPSHOT\org.eclipse.tracecompass.tmf.remote.ui.tests-1.0.0-SNAPSHOT.jar
08:13:04 [INFO] Installing C:\Users\hudson\jenkins-slave-tracecompass\workspace\tracecompass-master-nightly-windows\tmf\org.eclipse.tracecompass.tmf.remote.ui.tests\.polyglot.build.properties to C:\Users\hudson\jenkins-slave-tracecompass\workspace\tracecompass-master-nightly-windows\.maven\repo\org\eclipse\tracecompass\org.eclipse.tracecompass.tmf.remote.ui.tests\1.0.0-SNAPSHOT\org.eclipse.tracecompass.tmf.remote.ui.tests-1.0.0-SNAPSHOT.pom
08:13:04 [INFO] Installing C:\Users\hudson\jenkins-slave-tracecompass\workspace\tracecompass-master-nightly-windows\tmf\org.eclipse.tracecompass.tmf.remote.ui.tests\target\org.eclipse.tracecompass.tmf.remote.ui.tests-1.0.0-SNAPSHOT-sources.jar to C:\Users\hudson\jenkins-slave-tracecompass\workspace\tracecompass-master-nightly-windows\.maven\repo\org\eclipse\tracecompass\org.eclipse.tracecompass.tmf.remote.ui.tests\1.0.0-SNAPSHOT\org.eclipse.tracecompass.tmf.remote.ui.tests-1.0.0-SNAPSHOT-sources.jar
08:13:04 [INFO] Installing C:\Users\hudson\jenkins-slave-tracecompass\workspace\tracecompass-master-nightly-windows\tmf\org.eclipse.tracecompass.tmf.remote.ui.tests\target\org.eclipse.tracecompass.tmf.remote.ui.tests-1.0.0-SNAPSHOT.jar.pack.gz to C:\Users\hudson\jenkins-slave-tracecompass\workspace\tracecompass-master-nightly-windows\.maven\repo\org\eclipse\tracecompass\org.eclipse.tracecompass.tmf.remote.ui.tests\1.0.0-SNAPSHOT\org.eclipse.tracecompass.tmf.remote.ui.tests-1.0.0-SNAPSHOT-pack200.jar.pack.gz
08:13:04 [INFO] Installing C:\Users\hudson\jenkins-slave-tracecompass\workspace\tracecompass-master-nightly-windows\tmf\org.eclipse.tracecompass.tmf.remote.ui.tests\target\p2content.xml to C:\Users\hudson\jenkins-slave-tracecompass\workspace\tracecompass-master-nightly-windows\.maven\repo\org\eclipse\tracecompass\org.eclipse.tracecompass.tmf.remote.ui.tests\1.0.0-SNAPSHOT\org.eclipse.tracecompass.tmf.remote.ui.tests-1.0.0-SNAPSHOT-p2metadata.xml
08:13:04 [INFO] Installing C:\Users\hudson\jenkins-slave-tracecompass\workspace\tracecompass-master-nightly-windows\tmf\org.eclipse.tracecompass.tmf.remote.ui.tests\target\p2artifacts.xml to C:\Users\hudson\jenkins-slave-tracecompass\workspace\tracecompass-master-nightly-windows\.maven\repo\org\eclipse\tracecompass\org.eclipse.tracecompass.tmf.remote.ui.tests\1.0.0-SNAPSHOT\org.eclipse.tracecompass.tmf.remote.ui.tests-1.0.0-SNAPSHOT-p2artifacts.xml
08:13:04 [INFO] 
08:13:04 [INFO] --- tycho-p2-plugin:1.3.0:update-local-index (default-update-local-index) @ org.eclipse.tracecompass.tmf.remote.ui.tests ---
08:13:04 [INFO]                                                                         
08:13:04 [INFO] ------------------------------------------------------------------------
08:13:04 [INFO] Building Trace Compass All Tests 1.0.6-SNAPSHOT
08:13:04 [INFO] ------------------------------------------------------------------------
08:13:04 [INFO] 
08:13:05 [INFO] --- maven-clean-plugin:3.0.0:clean (default-clean) @ org.eclipse.tracecompass.alltests ---
08:13:05 [INFO] Deleting C:\Users\hudson\jenkins-slave-tracecompass\workspace\tracecompass-master-nightly-windows\releng\org.eclipse.tracecompass.alltests\target
08:13:05 [INFO] 
08:13:05 [INFO] --- tycho-packaging-plugin:1.3.0:build-qualifier (default-build-qualifier) @ org.eclipse.tracecompass.alltests ---
08:13:05 [INFO] The project's OSGi version is 1.0.6.201904251016
08:13:05 [INFO] 
08:13:05 [INFO] --- tycho-packaging-plugin:1.3.0:validate-id (default-validate-id) @ org.eclipse.tracecompass.alltests ---
08:13:05 [INFO] 
08:13:05 [INFO] --- tycho-packaging-plugin:1.3.0:validate-version (default-validate-version) @ org.eclipse.tracecompass.alltests ---
08:13:05 [INFO] 
08:13:05 [INFO] --- maven-enforcer-plugin:1.4.1:enforce (enforce-maven-version) @ org.eclipse.tracecompass.alltests ---
08:13:05 [INFO] 
08:13:05 [INFO] --- maven-resources-plugin:3.0.2:resources (default-resources) @ org.eclipse.tracecompass.alltests ---
08:13:05 [INFO] Using 'UTF-8' encoding to copy filtered resources.
08:13:05 [INFO] skip non existing resourceDirectory C:\Users\hudson\jenkins-slave-tracecompass\workspace\tracecompass-master-nightly-windows\releng\org.eclipse.tracecompass.alltests\src\main\resources
08:13:05 [INFO] 
08:13:05 [INFO] --- tycho-compiler-plugin:1.3.0:compile (default-compile) @ org.eclipse.tracecompass.alltests ---
08:13:05 [INFO] Compiling 8 source files to C:\Users\hudson\jenkins-slave-tracecompass\workspace\tracecompass-master-nightly-windows\releng\org.eclipse.tracecompass.alltests\target\classes
08:13:06 [INFO] 
08:13:08 [INFO] --- maven-resources-plugin:3.0.2:testResources (default-testResources) @ org.eclipse.tracecompass.alltests ---
08:13:08 [INFO] Using 'UTF-8' encoding to copy filtered resources.
08:13:08 [INFO] skip non existing resourceDirectory C:\Users\hudson\jenkins-slave-tracecompass\workspace\tracecompass-master-nightly-windows\releng\org.eclipse.tracecompass.alltests\src\test\resources
08:13:08 [INFO] 
08:13:08 [INFO] --- tycho-source-plugin:1.3.0:plugin-source (plugin-source) @ org.eclipse.tracecompass.alltests ---
08:13:08 [INFO] Building jar: C:\Users\hudson\jenkins-slave-tracecompass\workspace\tracecompass-master-nightly-windows\releng\org.eclipse.tracecompass.alltests\target\org.eclipse.tracecompass.alltests-1.0.6-SNAPSHOT-sources.jar
08:13:08 [INFO] 
08:13:08 [INFO] --- target-platform-configuration:1.3.0:target-platform (default-target-platform) @ org.eclipse.tracecompass.alltests ---
08:13:08 [INFO] 
08:13:10 [INFO] --- tycho-packaging-plugin:1.3.0:package-plugin (default-package-plugin) @ org.eclipse.tracecompass.alltests ---
08:13:10 [INFO] Building jar: C:\Users\hudson\jenkins-slave-tracecompass\workspace\tracecompass-master-nightly-windows\releng\org.eclipse.tracecompass.alltests\target\org.eclipse.tracecompass.alltests-1.0.6-SNAPSHOT.jar
08:13:10 [INFO] 
08:13:10 [INFO] --- tycho-p2-plugin:1.3.0:p2-metadata-default (default-p2-metadata-default) @ org.eclipse.tracecompass.alltests ---
08:13:10 [INFO] 
08:13:10 [INFO] --- tycho-source-feature-plugin:1.3.0:source-feature (source-feature) @ org.eclipse.tracecompass.alltests ---
08:13:10 [INFO] 
08:13:10 [INFO] --- tycho-pack200b-plugin:1.3.0:pack (pack200-pack) @ org.eclipse.tracecompass.alltests ---
08:13:10 [INFO] Pack200 packing jar C:\Users\hudson\jenkins-slave-tracecompass\workspace\tracecompass-master-nightly-windows\releng\org.eclipse.tracecompass.alltests\target\org.eclipse.tracecompass.alltests-1.0.6-SNAPSHOT.jar
08:13:11 [INFO] 
08:13:11 [INFO] --- tycho-p2-plugin:1.3.0:p2-metadata (p2-metadata) @ org.eclipse.tracecompass.alltests ---
08:13:11 [INFO] 
08:13:11 [INFO] --- tycho-surefire-plugin:1.3.0:test (default-test) @ org.eclipse.tracecompass.alltests ---
08:13:11 [INFO] Expected eclipse log file: C:\Users\hudson\jenkins-slave-tracecompass\workspace\tracecompass-master-nightly-windows\releng\org.eclipse.tracecompass.alltests\target\work\data\.metadata\.log
08:13:14 [INFO] Command line:
08:13:14 	[C:\Program Files\Java\jdk1.8.0_121\jre\bin\java.exe, -Dosgi.noShutdown=false, -Dosgi.os=win32, -Dosgi.ws=win32, -Dosgi.arch=x86_64, -Dorg.eclipse.swt.browser.DefaultType=mozilla, -Xms512m, -Xmx1024m, -Dosgi.clean=true, -jar, C:\Users\hudson\jenkins-slave-tracecompass\workspace\tracecompass-master-nightly-windows\.maven\repo\p2\osgi\bundle\org.eclipse.equinox.launcher\1.5.300.v20190213-1655\org.eclipse.equinox.launcher-1.5.300.v20190213-1655.jar, -data, C:\Users\hudson\jenkins-slave-tracecompass\workspace\tracecompass-master-nightly-windows\releng\org.eclipse.tracecompass.alltests\target\work\data, -install, C:\Users\hudson\jenkins-slave-tracecompass\workspace\tracecompass-master-nightly-windows\releng\org.eclipse.tracecompass.alltests\target\work, -configuration, C:\Users\hudson\jenkins-slave-tracecompass\workspace\tracecompass-master-nightly-windows\releng\org.eclipse.tracecompass.alltests\target\work\configuration, -application, org.eclipse.tycho.surefire.osgibooter.headlesstest, -testproperties, C:\Users\hudson\jenkins-slave-tracecompass\workspace\tracecompass-master-nightly-windows\releng\org.eclipse.tracecompass.alltests\target\surefire.properties, -product, org.eclipse.platform.ide, -consoleLog]
08:13:14 
08:13:25 Results:
08:13:25 
08:13:25 Tests run: 0, Failures: 0, Errors: 0, Skipped: 0
08:13:25 
08:13:25 [WARNING] No tests found.
08:13:26 [INFO] 
08:13:26 [INFO] --- maven-install-plugin:2.5.2:install (default-install) @ org.eclipse.tracecompass.alltests ---
08:13:26 [INFO] Installing C:\Users\hudson\jenkins-slave-tracecompass\workspace\tracecompass-master-nightly-windows\releng\org.eclipse.tracecompass.alltests\target\org.eclipse.tracecompass.alltests-1.0.6-SNAPSHOT.jar to C:\Users\hudson\jenkins-slave-tracecompass\workspace\tracecompass-master-nightly-windows\.maven\repo\org\eclipse\tracecompass\org.eclipse.tracecompass.alltests\1.0.6-SNAPSHOT\org.eclipse.tracecompass.alltests-1.0.6-SNAPSHOT.jar
08:13:26 [INFO] Installing C:\Users\hudson\jenkins-slave-tracecompass\workspace\tracecompass-master-nightly-windows\releng\org.eclipse.tracecompass.alltests\pom.xml to C:\Users\hudson\jenkins-slave-tracecompass\workspace\tracecompass-master-nightly-windows\.maven\repo\org\eclipse\tracecompass\org.eclipse.tracecompass.alltests\1.0.6-SNAPSHOT\org.eclipse.tracecompass.alltests-1.0.6-SNAPSHOT.pom
08:13:26 [INFO] Installing C:\Users\hudson\jenkins-slave-tracecompass\workspace\tracecompass-master-nightly-windows\releng\org.eclipse.tracecompass.alltests\target\org.eclipse.tracecompass.alltests-1.0.6-SNAPSHOT-sources.jar to C:\Users\hudson\jenkins-slave-tracecompass\workspace\tracecompass-master-nightly-windows\.maven\repo\org\eclipse\tracecompass\org.eclipse.tracecompass.alltests\1.0.6-SNAPSHOT\org.eclipse.tracecompass.alltests-1.0.6-SNAPSHOT-sources.jar
08:13:27 [INFO] Installing C:\Users\hudson\jenkins-slave-tracecompass\workspace\tracecompass-master-nightly-windows\releng\org.eclipse.tracecompass.alltests\target\org.eclipse.tracecompass.alltests-1.0.6-SNAPSHOT.jar.pack.gz to C:\Users\hudson\jenkins-slave-tracecompass\workspace\tracecompass-master-nightly-windows\.maven\repo\org\eclipse\tracecompass\org.eclipse.tracecompass.alltests\1.0.6-SNAPSHOT\org.eclipse.tracecompass.alltests-1.0.6-SNAPSHOT-pack200.jar.pack.gz
08:13:27 [INFO] Installing C:\Users\hudson\jenkins-slave-tracecompass\workspace\tracecompass-master-nightly-windows\releng\org.eclipse.tracecompass.alltests\target\p2content.xml to C:\Users\hudson\jenkins-slave-tracecompass\workspace\tracecompass-master-nightly-windows\.maven\repo\org\eclipse\tracecompass\org.eclipse.tracecompass.alltests\1.0.6-SNAPSHOT\org.eclipse.tracecompass.alltests-1.0.6-SNAPSHOT-p2metadata.xml
08:13:27 [INFO] Installing C:\Users\hudson\jenkins-slave-tracecompass\workspace\tracecompass-master-nightly-windows\releng\org.eclipse.tracecompass.alltests\target\p2artifacts.xml to C:\Users\hudson\jenkins-slave-tracecompass\workspace\tracecompass-master-nightly-windows\.maven\repo\org\eclipse\tracecompass\org.eclipse.tracecompass.alltests\1.0.6-SNAPSHOT\org.eclipse.tracecompass.alltests-1.0.6-SNAPSHOT-p2artifacts.xml
08:13:27 [INFO] 
08:13:27 [INFO] --- tycho-p2-plugin:1.3.0:update-local-index (default-update-local-index) @ org.eclipse.tracecompass.alltests ---
08:13:27 [INFO]                                                                         
08:13:27 [INFO] ------------------------------------------------------------------------
08:13:27 [INFO] Building org.eclipse.tracecompass.testing 4.3.0-SNAPSHOT
08:13:27 [INFO] ------------------------------------------------------------------------
08:13:27 [INFO] 
08:13:27 [INFO] --- maven-clean-plugin:3.0.0:clean (default-clean) @ org.eclipse.tracecompass.testing ---
08:13:27 [INFO] Deleting C:\Users\hudson\jenkins-slave-tracecompass\workspace\tracecompass-master-nightly-windows\releng\org.eclipse.tracecompass.testing\target
08:13:27 [INFO] 
08:13:27 [INFO] --- tycho-packaging-plugin:1.3.0:build-qualifier-aggregator (default-build-qualifier-aggregator) @ org.eclipse.tracecompass.testing ---
08:13:27 [INFO] The project's OSGi version is 4.3.0.201904251016
08:13:27 [INFO] 
08:13:27 [INFO] --- tycho-packaging-plugin:1.3.0:validate-id (default-validate-id) @ org.eclipse.tracecompass.testing ---
08:13:27 [INFO] 
08:13:27 [INFO] --- tycho-packaging-plugin:1.3.0:validate-version (default-validate-version) @ org.eclipse.tracecompass.testing ---
08:13:27 [INFO] 
08:13:27 [INFO] --- maven-enforcer-plugin:1.4.1:enforce (enforce-maven-version) @ org.eclipse.tracecompass.testing ---
08:13:27 [INFO] 
08:13:27 [INFO] --- tycho-source-plugin:1.3.0:plugin-source (plugin-source) @ org.eclipse.tracecompass.testing ---
08:13:27 [INFO] 
08:13:27 [INFO] --- target-platform-configuration:1.3.0:target-platform (default-target-platform) @ org.eclipse.tracecompass.testing ---
08:13:27 [INFO] 
08:13:27 [INFO] --- tycho-packaging-plugin:1.3.0:package-feature (default-package-feature) @ org.eclipse.tracecompass.testing ---
08:13:27 [INFO] Building jar: C:\Users\hudson\jenkins-slave-tracecompass\workspace\tracecompass-master-nightly-windows\releng\org.eclipse.tracecompass.testing\target\org.eclipse.tracecompass.testing-4.3.0-SNAPSHOT.jar
08:13:27 [INFO] 
08:13:27 [INFO] --- tycho-p2-plugin:1.3.0:p2-metadata-default (default-p2-metadata-default) @ org.eclipse.tracecompass.testing ---
08:13:27 [INFO] 
08:13:27 [INFO] --- tycho-p2-plugin:1.3.0:feature-p2-metadata (default-feature-p2-metadata) @ org.eclipse.tracecompass.testing ---
08:13:27 [INFO] 
08:13:27 [INFO] --- tycho-source-feature-plugin:1.3.0:source-feature (source-feature) @ org.eclipse.tracecompass.testing ---
08:13:27 [INFO] Building jar: C:\Users\hudson\jenkins-slave-tracecompass\workspace\tracecompass-master-nightly-windows\releng\org.eclipse.tracecompass.testing\target\org.eclipse.tracecompass.testing-4.3.0-SNAPSHOT-sources-feature.jar
08:13:28 [INFO] 
08:13:28 [INFO] --- tycho-pack200b-plugin:1.3.0:pack (pack200-pack) @ org.eclipse.tracecompass.testing ---
08:13:28 [INFO] 
08:13:28 [INFO] --- tycho-p2-plugin:1.3.0:p2-metadata (p2-metadata) @ org.eclipse.tracecompass.testing ---
08:13:28 [INFO] 
08:13:28 [INFO] --- maven-install-plugin:2.5.2:install (default-install) @ org.eclipse.tracecompass.testing ---
08:13:28 [INFO] Installing C:\Users\hudson\jenkins-slave-tracecompass\workspace\tracecompass-master-nightly-windows\releng\org.eclipse.tracecompass.testing\target\org.eclipse.tracecompass.testing-4.3.0-SNAPSHOT.jar to C:\Users\hudson\jenkins-slave-tracecompass\workspace\tracecompass-master-nightly-windows\.maven\repo\org\eclipse\tracecompass\org.eclipse.tracecompass.testing\4.3.0-SNAPSHOT\org.eclipse.tracecompass.testing-4.3.0-SNAPSHOT.jar
08:13:28 [INFO] Installing C:\Users\hudson\jenkins-slave-tracecompass\workspace\tracecompass-master-nightly-windows\releng\org.eclipse.tracecompass.testing\.polyglot.build.properties to C:\Users\hudson\jenkins-slave-tracecompass\workspace\tracecompass-master-nightly-windows\.maven\repo\org\eclipse\tracecompass\org.eclipse.tracecompass.testing\4.3.0-SNAPSHOT\org.eclipse.tracecompass.testing-4.3.0-SNAPSHOT.pom
08:13:28 [INFO] Installing C:\Users\hudson\jenkins-slave-tracecompass\workspace\tracecompass-master-nightly-windows\releng\org.eclipse.tracecompass.testing\target\org.eclipse.tracecompass.testing-4.3.0-SNAPSHOT-sources-feature.jar to C:\Users\hudson\jenkins-slave-tracecompass\workspace\tracecompass-master-nightly-windows\.maven\repo\org\eclipse\tracecompass\org.eclipse.tracecompass.testing\4.3.0-SNAPSHOT\org.eclipse.tracecompass.testing-4.3.0-SNAPSHOT-sources-feature.jar
08:13:28 [INFO] Installing C:\Users\hudson\jenkins-slave-tracecompass\workspace\tracecompass-master-nightly-windows\releng\org.eclipse.tracecompass.testing\target\p2content.xml to C:\Users\hudson\jenkins-slave-tracecompass\workspace\tracecompass-master-nightly-windows\.maven\repo\org\eclipse\tracecompass\org.eclipse.tracecompass.testing\4.3.0-SNAPSHOT\org.eclipse.tracecompass.testing-4.3.0-SNAPSHOT-p2metadata.xml
08:13:28 [INFO] Installing C:\Users\hudson\jenkins-slave-tracecompass\workspace\tracecompass-master-nightly-windows\releng\org.eclipse.tracecompass.testing\target\p2artifacts.xml to C:\Users\hudson\jenkins-slave-tracecompass\workspace\tracecompass-master-nightly-windows\.maven\repo\org\eclipse\tracecompass\org.eclipse.tracecompass.testing\4.3.0-SNAPSHOT\org.eclipse.tracecompass.testing-4.3.0-SNAPSHOT-p2artifacts.xml
08:13:28 [INFO] 
08:13:28 [INFO] --- tycho-p2-plugin:1.3.0:update-local-index (default-update-local-index) @ org.eclipse.tracecompass.testing ---
08:13:28 [INFO]                                                                         
08:13:28 [INFO] ------------------------------------------------------------------------
08:13:28 [INFO] Building org.eclipse.tracecompass.tmf.remote 4.3.0-SNAPSHOT
08:13:28 [INFO] ------------------------------------------------------------------------
08:13:28 [INFO] 
08:13:28 [INFO] --- maven-clean-plugin:3.0.0:clean (default-clean) @ org.eclipse.tracecompass.tmf.remote ---
08:13:28 [INFO] Deleting C:\Users\hudson\jenkins-slave-tracecompass\workspace\tracecompass-master-nightly-windows\tmf\org.eclipse.tracecompass.tmf.remote\target
08:13:28 [INFO] 
08:13:28 [INFO] --- tycho-packaging-plugin:1.3.0:build-qualifier-aggregator (default-build-qualifier-aggregator) @ org.eclipse.tracecompass.tmf.remote ---
08:13:28 [INFO] The project's OSGi version is 4.3.0.201904251016
08:13:28 [INFO] 
08:13:28 [INFO] --- tycho-packaging-plugin:1.3.0:validate-id (default-validate-id) @ org.eclipse.tracecompass.tmf.remote ---
08:13:28 [INFO] 
08:13:28 [INFO] --- tycho-packaging-plugin:1.3.0:validate-version (default-validate-version) @ org.eclipse.tracecompass.tmf.remote ---
08:13:28 [INFO] 
08:13:28 [INFO] --- maven-enforcer-plugin:1.4.1:enforce (enforce-maven-version) @ org.eclipse.tracecompass.tmf.remote ---
08:13:28 [INFO] 
08:13:28 [INFO] --- tycho-source-plugin:1.3.0:plugin-source (plugin-source) @ org.eclipse.tracecompass.tmf.remote ---
08:13:28 [INFO] 
08:13:28 [INFO] --- target-platform-configuration:1.3.0:target-platform (default-target-platform) @ org.eclipse.tracecompass.tmf.remote ---
08:13:28 [INFO] 
08:13:28 [INFO] --- tycho-packaging-plugin:1.3.0:package-feature (default-package-feature) @ org.eclipse.tracecompass.tmf.remote ---
08:13:28 [INFO] Building jar: C:\Users\hudson\jenkins-slave-tracecompass\workspace\tracecompass-master-nightly-windows\tmf\org.eclipse.tracecompass.tmf.remote\target\org.eclipse.tracecompass.tmf.remote-4.3.0-SNAPSHOT.jar
08:13:28 [INFO] 
08:13:28 [INFO] --- tycho-p2-plugin:1.3.0:p2-metadata-default (default-p2-metadata-default) @ org.eclipse.tracecompass.tmf.remote ---
08:13:28 [INFO] 
08:13:28 [INFO] --- tycho-p2-plugin:1.3.0:feature-p2-metadata (default-feature-p2-metadata) @ org.eclipse.tracecompass.tmf.remote ---
08:13:28 [INFO] 
08:13:28 [INFO] --- tycho-source-feature-plugin:1.3.0:source-feature (source-feature) @ org.eclipse.tracecompass.tmf.remote ---
08:13:28 [INFO] Building jar: C:\Users\hudson\jenkins-slave-tracecompass\workspace\tracecompass-master-nightly-windows\tmf\org.eclipse.tracecompass.tmf.remote\target\org.eclipse.tracecompass.tmf.remote-4.3.0-SNAPSHOT-sources-feature.jar
08:13:28 [INFO] 
08:13:28 [INFO] --- tycho-pack200b-plugin:1.3.0:pack (pack200-pack) @ org.eclipse.tracecompass.tmf.remote ---
08:13:28 [INFO] 
08:13:28 [INFO] --- tycho-p2-plugin:1.3.0:p2-metadata (p2-metadata) @ org.eclipse.tracecompass.tmf.remote ---
08:13:28 [INFO] 
08:13:28 [INFO] --- maven-install-plugin:2.5.2:install (default-install) @ org.eclipse.tracecompass.tmf.remote ---
08:13:28 [INFO] Installing C:\Users\hudson\jenkins-slave-tracecompass\workspace\tracecompass-master-nightly-windows\tmf\org.eclipse.tracecompass.tmf.remote\target\org.eclipse.tracecompass.tmf.remote-4.3.0-SNAPSHOT.jar to C:\Users\hudson\jenkins-slave-tracecompass\workspace\tracecompass-master-nightly-windows\.maven\repo\org\eclipse\tracecompass\org.eclipse.tracecompass.tmf.remote\4.3.0-SNAPSHOT\org.eclipse.tracecompass.tmf.remote-4.3.0-SNAPSHOT.jar
08:13:28 [INFO] Installing C:\Users\hudson\jenkins-slave-tracecompass\workspace\tracecompass-master-nightly-windows\tmf\org.eclipse.tracecompass.tmf.remote\.polyglot.build.properties to C:\Users\hudson\jenkins-slave-tracecompass\workspace\tracecompass-master-nightly-windows\.maven\repo\org\eclipse\tracecompass\org.eclipse.tracecompass.tmf.remote\4.3.0-SNAPSHOT\org.eclipse.tracecompass.tmf.remote-4.3.0-SNAPSHOT.pom
08:13:28 [INFO] Installing C:\Users\hudson\jenkins-slave-tracecompass\workspace\tracecompass-master-nightly-windows\tmf\org.eclipse.tracecompass.tmf.remote\target\org.eclipse.tracecompass.tmf.remote-4.3.0-SNAPSHOT-sources-feature.jar to C:\Users\hudson\jenkins-slave-tracecompass\workspace\tracecompass-master-nightly-windows\.maven\repo\org\eclipse\tracecompass\org.eclipse.tracecompass.tmf.remote\4.3.0-SNAPSHOT\org.eclipse.tracecompass.tmf.remote-4.3.0-SNAPSHOT-sources-feature.jar
08:13:28 [INFO] Installing C:\Users\hudson\jenkins-slave-tracecompass\workspace\tracecompass-master-nightly-windows\tmf\org.eclipse.tracecompass.tmf.remote\target\p2content.xml to C:\Users\hudson\jenkins-slave-tracecompass\workspace\tracecompass-master-nightly-windows\.maven\repo\org\eclipse\tracecompass\org.eclipse.tracecompass.tmf.remote\4.3.0-SNAPSHOT\org.eclipse.tracecompass.tmf.remote-4.3.0-SNAPSHOT-p2metadata.xml
08:13:28 [INFO] Installing C:\Users\hudson\jenkins-slave-tracecompass\workspace\tracecompass-master-nightly-windows\tmf\org.eclipse.tracecompass.tmf.remote\target\p2artifacts.xml to C:\Users\hudson\jenkins-slave-tracecompass\workspace\tracecompass-master-nightly-windows\.maven\repo\org\eclipse\tracecompass\org.eclipse.tracecompass.tmf.remote\4.3.0-SNAPSHOT\org.eclipse.tracecompass.tmf.remote-4.3.0-SNAPSHOT-p2artifacts.xml
08:13:28 [INFO] 
08:13:28 [INFO] --- tycho-p2-plugin:1.3.0:update-local-index (default-update-local-index) @ org.eclipse.tracecompass.tmf.remote ---
08:13:28 [INFO]                                                                         
08:13:28 [INFO] ------------------------------------------------------------------------
08:13:28 [INFO] Building Trace Compass Repository 4.3.0-SNAPSHOT
08:13:28 [INFO] ------------------------------------------------------------------------
08:13:28 [INFO] 
08:13:28 [INFO] --- maven-clean-plugin:3.0.0:clean (default-clean) @ org.eclipse.tracecompass.releng-site ---
08:13:28 [INFO] Deleting C:\Users\hudson\jenkins-slave-tracecompass\workspace\tracecompass-master-nightly-windows\releng\org.eclipse.tracecompass.releng-site\target
08:13:28 [INFO] 
08:13:29 [INFO] --- tycho-packaging-plugin:1.3.0:build-qualifier-aggregator (default-build-qualifier-aggregator) @ org.eclipse.tracecompass.releng-site ---
08:13:29 [INFO] The project's OSGi version is 4.3.0.201904251016
08:13:29 [INFO] 
08:13:29 [INFO] --- maven-enforcer-plugin:1.4.1:enforce (enforce-maven-version) @ org.eclipse.tracecompass.releng-site ---
08:13:29 [INFO] 
08:13:29 [INFO] --- maven-clean-plugin:3.0.0:clean (default-clean-1) @ org.eclipse.tracecompass.releng-site ---
08:13:29 [INFO] 
08:13:29 [INFO] --- maven-resources-plugin:3.0.2:resources (default-resources) @ org.eclipse.tracecompass.releng-site ---
08:13:29 [INFO] Using 'UTF-8' encoding to copy filtered resources.
08:13:29 [INFO] skip non existing resourceDirectory C:\Users\hudson\jenkins-slave-tracecompass\workspace\tracecompass-master-nightly-windows\releng\org.eclipse.tracecompass.releng-site\src\main\resources
08:13:29 [INFO] 
08:13:29 [INFO] --- tycho-source-plugin:1.3.0:plugin-source (plugin-source) @ org.eclipse.tracecompass.releng-site ---
08:13:29 [INFO] 
08:13:29 [INFO] --- target-platform-configuration:1.3.0:target-platform (default-target-platform) @ org.eclipse.tracecompass.releng-site ---
08:13:29 [INFO] 
08:13:29 [INFO] --- tycho-p2-publisher-plugin:1.3.0:publish-osgi-ee (default-publish-osgi-ee) @ org.eclipse.tracecompass.releng-site ---
08:13:29 [INFO] Published profile IUs: [a.jre.javase 10.0.0, config.a.jre.javase 10.0.0]
08:13:29 [INFO] Published profile IUs: [a.jre.javase 11.0.0, config.a.jre.javase 11.0.0]
08:13:29 [INFO] 
08:13:29 [INFO] --- tycho-p2-publisher-plugin:1.3.0:publish-products (default-publish-products) @ org.eclipse.tracecompass.releng-site ---
08:13:29 [INFO] 
08:13:29 [INFO] --- tycho-p2-publisher-plugin:1.3.0:publish-categories (default-publish-categories) @ org.eclipse.tracecompass.releng-site ---
08:13:29 [INFO] 
08:13:29 [INFO] --- tycho-p2-publisher-plugin:1.3.0:attach-artifacts (default-attach-artifacts) @ org.eclipse.tracecompass.releng-site ---
08:13:29 [INFO] 
08:13:29 [INFO] --- tycho-p2-repository-plugin:1.3.0:assemble-repository (default-assemble-repository) @ org.eclipse.tracecompass.releng-site ---
08:13:29 [WARNING] Mirror tool: Problems resolving provisioning plan.: [Unable to satisfy dependency from 201904251016.Default 1.0.0.9x9--cLhzMVEEVkfqWqTTXB7_2o to org.eclipse.equinox.p2.iu; com.google.guava [18.0.0.v20161115-1643,18.0.0.v20161115-1643].]
08:13:42 [WARNING] More information on the preceding warning(s) can be found here:
08:13:54 [WARNING] - http://wiki.eclipse.org/Tycho_Messages_Explained#Mirror_tool
08:13:54 [WARNING] Mirror tool: Problems resolving provisioning plan.: [Unable to satisfy dependency from 201904251016.Default 1.0.0.9x9--cLhzMVEEVkfqWqTTXB7_2o to org.eclipse.equinox.p2.iu; com.google.guava [18.0.0.v20161115-1643,18.0.0.v20161115-1643].]
08:13:54 [WARNING] More information on the preceding warning(s) can be found here:
08:13:54 [WARNING] - http://wiki.eclipse.org/Tycho_Messages_Explained#Mirror_tool
08:13:54 [WARNING] Mirror tool: Problems resolving provisioning plan.: [Unable to satisfy dependency from 201904251016.Default 1.0.0.9x9--cLhzMVEEVkfqWqTTXB7_2o to org.eclipse.equinox.p2.iu; com.google.guava [18.0.0.v20161115-1643,18.0.0.v20161115-1643].]
08:13:54 [WARNING] More information on the preceding warning(s) can be found here:
08:13:54 [WARNING] - http://wiki.eclipse.org/Tycho_Messages_Explained#Mirror_tool
08:13:54 [INFO] 
08:13:59 [INFO] --- tycho-p2-repository-plugin:1.3.0:archive-repository (default-archive-repository) @ org.eclipse.tracecompass.releng-site ---
08:13:59 [INFO] 
08:13:59 [INFO] --- tycho-source-feature-plugin:1.3.0:source-feature (source-feature) @ org.eclipse.tracecompass.releng-site ---
08:13:59 [INFO] 
08:13:59 [INFO] --- tycho-pack200b-plugin:1.3.0:pack (pack200-pack) @ org.eclipse.tracecompass.releng-site ---
08:13:59 [INFO] 
08:13:59 [INFO] --- tycho-p2-plugin:1.3.0:p2-metadata (p2-metadata) @ org.eclipse.tracecompass.releng-site ---
08:13:59 [INFO] 
08:13:59 [INFO] --- repository-utils:1.0.0:generate-repository-facade (generate-facade) @ org.eclipse.tracecompass.releng-site ---
08:13:59 [INFO] Building zip: C:\Users\hudson\jenkins-slave-tracecompass\workspace\tracecompass-master-nightly-windows\releng\org.eclipse.tracecompass.releng-site\target\org.eclipse.tracecompass.releng-site-4.3.0-SNAPSHOT.zip
08:14:03 [INFO] 
08:14:06 [INFO] --- maven-install-plugin:2.5.2:install (default-install) @ org.eclipse.tracecompass.releng-site ---
08:14:06 [INFO] No primary artifact to install, installing attached artifacts instead.
08:14:06 [INFO] Installing C:\Users\hudson\jenkins-slave-tracecompass\workspace\tracecompass-master-nightly-windows\releng\org.eclipse.tracecompass.releng-site\pom.xml to C:\Users\hudson\jenkins-slave-tracecompass\workspace\tracecompass-master-nightly-windows\.maven\repo\org\eclipse\tracecompass\org.eclipse.tracecompass.releng-site\4.3.0-SNAPSHOT\org.eclipse.tracecompass.releng-site-4.3.0-SNAPSHOT.pom
08:14:06 [INFO] Installing C:\Users\hudson\jenkins-slave-tracecompass\workspace\tracecompass-master-nightly-windows\releng\org.eclipse.tracecompass.releng-site\target\p2content.xml to C:\Users\hudson\jenkins-slave-tracecompass\workspace\tracecompass-master-nightly-windows\.maven\repo\org\eclipse\tracecompass\org.eclipse.tracecompass.releng-site\4.3.0-SNAPSHOT\org.eclipse.tracecompass.releng-site-4.3.0-SNAPSHOT-p2metadata.xml
08:14:06 [INFO] Installing C:\Users\hudson\jenkins-slave-tracecompass\workspace\tracecompass-master-nightly-windows\releng\org.eclipse.tracecompass.releng-site\target\p2artifacts.xml to C:\Users\hudson\jenkins-slave-tracecompass\workspace\tracecompass-master-nightly-windows\.maven\repo\org\eclipse\tracecompass\org.eclipse.tracecompass.releng-site\4.3.0-SNAPSHOT\org.eclipse.tracecompass.releng-site-4.3.0-SNAPSHOT-p2artifacts.xml
08:14:06 [INFO] 
08:14:06 [INFO] --- tycho-p2-plugin:1.3.0:update-local-index (default-update-local-index) @ org.eclipse.tracecompass.releng-site ---
08:14:06 [INFO]                                                                         
08:14:06 [INFO] ------------------------------------------------------------------------
08:14:06 [INFO] Building org.eclipse.tracecompass.jsontrace.core.test 1.0.1-SNAPSHOT
08:14:06 [INFO] ------------------------------------------------------------------------
08:14:06 [INFO] 
08:14:06 [INFO] --- maven-clean-plugin:3.0.0:clean (default-clean) @ org.eclipse.tracecompass.jsontrace.core.test ---
08:14:06 [INFO] Deleting C:\Users\hudson\jenkins-slave-tracecompass\workspace\tracecompass-master-nightly-windows\jsontrace\org.eclipse.tracecompass.jsontrace.core.test\target
08:14:06 [INFO] 
08:14:06 [INFO] --- tycho-packaging-plugin:1.3.0:build-qualifier (default-build-qualifier) @ org.eclipse.tracecompass.jsontrace.core.test ---
08:14:06 [INFO] The project's OSGi version is 1.0.1.201904251016
08:14:06 [INFO] 
08:14:06 [INFO] --- tycho-packaging-plugin:1.3.0:validate-id (default-validate-id) @ org.eclipse.tracecompass.jsontrace.core.test ---
08:14:06 [INFO] 
08:14:06 [INFO] --- tycho-packaging-plugin:1.3.0:validate-version (default-validate-version) @ org.eclipse.tracecompass.jsontrace.core.test ---
08:14:06 [INFO] 
08:14:06 [INFO] --- maven-enforcer-plugin:1.4.1:enforce (enforce-maven-version) @ org.eclipse.tracecompass.jsontrace.core.test ---
08:14:06 [INFO] 
08:14:06 [INFO] --- maven-resources-plugin:3.0.2:resources (default-resources) @ org.eclipse.tracecompass.jsontrace.core.test ---
08:14:06 [INFO] Using 'UTF-8' encoding to copy filtered resources.
08:14:06 [INFO] skip non existing resourceDirectory C:\Users\hudson\jenkins-slave-tracecompass\workspace\tracecompass-master-nightly-windows\jsontrace\org.eclipse.tracecompass.jsontrace.core.test\src\main\resources
08:14:06 [INFO] 
08:14:06 [INFO] --- tycho-compiler-plugin:1.3.0:compile (default-compile) @ org.eclipse.tracecompass.jsontrace.core.test ---
08:14:06 [INFO] Compiling 3 source files to C:\Users\hudson\jenkins-slave-tracecompass\workspace\tracecompass-master-nightly-windows\jsontrace\org.eclipse.tracecompass.jsontrace.core.test\target\classes
08:14:06 [INFO] 
08:14:07 [INFO] --- maven-resources-plugin:3.0.2:testResources (default-testResources) @ org.eclipse.tracecompass.jsontrace.core.test ---
08:14:07 [INFO] Using 'UTF-8' encoding to copy filtered resources.
08:14:07 [INFO] skip non existing resourceDirectory C:\Users\hudson\jenkins-slave-tracecompass\workspace\tracecompass-master-nightly-windows\jsontrace\org.eclipse.tracecompass.jsontrace.core.test\src\test\resources
08:14:07 [INFO] 
08:14:07 [INFO] --- tycho-source-plugin:1.3.0:plugin-source (plugin-source) @ org.eclipse.tracecompass.jsontrace.core.test ---
08:14:07 [INFO] Building jar: C:\Users\hudson\jenkins-slave-tracecompass\workspace\tracecompass-master-nightly-windows\jsontrace\org.eclipse.tracecompass.jsontrace.core.test\target\org.eclipse.tracecompass.jsontrace.core.test-1.0.1-SNAPSHOT-sources.jar
08:14:07 [INFO] 
08:14:07 [INFO] --- target-platform-configuration:1.3.0:target-platform (default-target-platform) @ org.eclipse.tracecompass.jsontrace.core.test ---
08:14:07 [INFO] 
08:14:07 [INFO] --- tycho-packaging-plugin:1.3.0:package-plugin (default-package-plugin) @ org.eclipse.tracecompass.jsontrace.core.test ---
08:14:07 [INFO] Building jar: C:\Users\hudson\jenkins-slave-tracecompass\workspace\tracecompass-master-nightly-windows\jsontrace\org.eclipse.tracecompass.jsontrace.core.test\target\org.eclipse.tracecompass.jsontrace.core.test-1.0.1-SNAPSHOT.jar
08:14:07 [INFO] 
08:14:07 [INFO] --- tycho-p2-plugin:1.3.0:p2-metadata-default (default-p2-metadata-default) @ org.eclipse.tracecompass.jsontrace.core.test ---
08:14:07 [INFO] 
08:14:07 [INFO] --- tycho-source-feature-plugin:1.3.0:source-feature (source-feature) @ org.eclipse.tracecompass.jsontrace.core.test ---
08:14:07 [INFO] 
08:14:07 [INFO] --- tycho-pack200b-plugin:1.3.0:pack (pack200-pack) @ org.eclipse.tracecompass.jsontrace.core.test ---
08:14:07 [INFO] Pack200 packing jar C:\Users\hudson\jenkins-slave-tracecompass\workspace\tracecompass-master-nightly-windows\jsontrace\org.eclipse.tracecompass.jsontrace.core.test\target\org.eclipse.tracecompass.jsontrace.core.test-1.0.1-SNAPSHOT.jar
08:14:07 [INFO] 
08:14:07 [INFO] --- tycho-p2-plugin:1.3.0:p2-metadata (p2-metadata) @ org.eclipse.tracecompass.jsontrace.core.test ---
08:14:07 [INFO] 
08:14:07 [INFO] --- maven-install-plugin:2.5.2:install (default-install) @ org.eclipse.tracecompass.jsontrace.core.test ---
08:14:07 [INFO] Installing C:\Users\hudson\jenkins-slave-tracecompass\workspace\tracecompass-master-nightly-windows\jsontrace\org.eclipse.tracecompass.jsontrace.core.test\target\org.eclipse.tracecompass.jsontrace.core.test-1.0.1-SNAPSHOT.jar to C:\Users\hudson\jenkins-slave-tracecompass\workspace\tracecompass-master-nightly-windows\.maven\repo\org\eclipse\tracecompass\org.eclipse.tracecompass.jsontrace.core.test\1.0.1-SNAPSHOT\org.eclipse.tracecompass.jsontrace.core.test-1.0.1-SNAPSHOT.jar
08:14:07 [INFO] Installing C:\Users\hudson\jenkins-slave-tracecompass\workspace\tracecompass-master-nightly-windows\jsontrace\org.eclipse.tracecompass.jsontrace.core.test\.polyglot.build.properties to C:\Users\hudson\jenkins-slave-tracecompass\workspace\tracecompass-master-nightly-windows\.maven\repo\org\eclipse\tracecompass\org.eclipse.tracecompass.jsontrace.core.test\1.0.1-SNAPSHOT\org.eclipse.tracecompass.jsontrace.core.test-1.0.1-SNAPSHOT.pom
08:14:07 [INFO] Installing C:\Users\hudson\jenkins-slave-tracecompass\workspace\tracecompass-master-nightly-windows\jsontrace\org.eclipse.tracecompass.jsontrace.core.test\target\org.eclipse.tracecompass.jsontrace.core.test-1.0.1-SNAPSHOT-sources.jar to C:\Users\hudson\jenkins-slave-tracecompass\workspace\tracecompass-master-nightly-windows\.maven\repo\org\eclipse\tracecompass\org.eclipse.tracecompass.jsontrace.core.test\1.0.1-SNAPSHOT\org.eclipse.tracecompass.jsontrace.core.test-1.0.1-SNAPSHOT-sources.jar
08:14:07 [INFO] Installing C:\Users\hudson\jenkins-slave-tracecompass\workspace\tracecompass-master-nightly-windows\jsontrace\org.eclipse.tracecompass.jsontrace.core.test\target\org.eclipse.tracecompass.jsontrace.core.test-1.0.1-SNAPSHOT.jar.pack.gz to C:\Users\hudson\jenkins-slave-tracecompass\workspace\tracecompass-master-nightly-windows\.maven\repo\org\eclipse\tracecompass\org.eclipse.tracecompass.jsontrace.core.test\1.0.1-SNAPSHOT\org.eclipse.tracecompass.jsontrace.core.test-1.0.1-SNAPSHOT-pack200.jar.pack.gz
08:14:08 [INFO] Installing C:\Users\hudson\jenkins-slave-tracecompass\workspace\tracecompass-master-nightly-windows\jsontrace\org.eclipse.tracecompass.jsontrace.core.test\target\p2content.xml to C:\Users\hudson\jenkins-slave-tracecompass\workspace\tracecompass-master-nightly-windows\.maven\repo\org\eclipse\tracecompass\org.eclipse.tracecompass.jsontrace.core.test\1.0.1-SNAPSHOT\org.eclipse.tracecompass.jsontrace.core.test-1.0.1-SNAPSHOT-p2metadata.xml
08:14:08 [INFO] Installing C:\Users\hudson\jenkins-slave-tracecompass\workspace\tracecompass-master-nightly-windows\jsontrace\org.eclipse.tracecompass.jsontrace.core.test\target\p2artifacts.xml to C:\Users\hudson\jenkins-slave-tracecompass\workspace\tracecompass-master-nightly-windows\.maven\repo\org\eclipse\tracecompass\org.eclipse.tracecompass.jsontrace.core.test\1.0.1-SNAPSHOT\org.eclipse.tracecompass.jsontrace.core.test-1.0.1-SNAPSHOT-p2artifacts.xml
08:14:08 [INFO] 
08:14:08 [INFO] --- tycho-p2-plugin:1.3.0:update-local-index (default-update-local-index) @ org.eclipse.tracecompass.jsontrace.core.test ---
08:14:08 [INFO] ------------------------------------------------------------------------
08:14:08 [INFO] Reactor Summary:
08:14:08 [INFO] 
08:14:08 [INFO] Trace Compass Parent ............................... SUCCESS [  4.527 s]
08:14:08 [INFO] Trace Compass Tracetype-agnostic Analyses Parent ... SUCCESS [  0.078 s]
08:14:08 [INFO] Trace Compass Common Utilities Parent .............. SUCCESS [  0.046 s]
08:14:08 [INFO] org.eclipse.tracecompass.common.core ............... SUCCESS [ 15.868 s]
08:14:08 [INFO] Trace Compass State System Parent .................. SUCCESS [  0.149 s]
08:14:08 [INFO] org.eclipse.tracecompass.datastore.core ............ SUCCESS [ 14.183 s]
08:14:08 [INFO] org.eclipse.tracecompass.segmentstore.core ......... SUCCESS [  5.940 s]
08:14:08 [INFO] org.eclipse.tracecompass.statesystem.core .......... SUCCESS [ 12.168 s]
08:14:08 [INFO] Trace Compass TMF Parent ........................... SUCCESS [  0.073 s]
08:14:08 [INFO] Trace Compass Filter Parser ........................ SUCCESS [  2.836 s]
08:14:08 [INFO] org.eclipse.tracecompass.tmf.core .................. SUCCESS [ 32.000 s]
08:14:08 [INFO] org.eclipse.tracecompass.analysis.counters.core .... SUCCESS [  1.521 s]
08:14:08 [INFO] Trace Compass CTF Support Parent ................... SUCCESS [  0.096 s]
08:14:08 [INFO] Trace Compass CTF Parser Plug-in ................... SUCCESS [ 13.286 s]
08:14:08 [INFO] org.eclipse.tracecompass.ctf.core .................. SUCCESS [  9.058 s]
08:14:08 [INFO] Trace Compass CTF Core Tests Plug-in ............... SUCCESS [02:20 min]
08:14:08 [INFO] org.eclipse.tracecompass.statesystem.core.tests .... SUCCESS [ 27.678 s]
08:14:08 [INFO] org.eclipse.tracecompass.tmf.core.tests ............ SUCCESS [06:15 min]
08:14:08 [INFO] org.eclipse.tracecompass.tmf.ctf.core .............. SUCCESS [  3.014 s]
08:14:08 [INFO] org.eclipse.tracecompass.tmf.ctf.core.tests ........ SUCCESS [05:21 min]
08:14:08 [INFO] org.eclipse.tracecompass.analysis.counters.core.tests SUCCESS [ 14.949 s]
08:14:08 [INFO] org.eclipse.tracecompass.tmf.ui .................... SUCCESS [01:32 min]
08:14:08 [INFO] org.eclipse.tracecompass.analysis.counters.ui ...... SUCCESS [  3.579 s]
08:14:08 [INFO] org.eclipse.tracecompass.analysis.graph.core ....... SUCCESS [  3.356 s]
08:14:08 [INFO] org.eclipse.tracecompass.analysis.graph.core.tests . SUCCESS [ 15.290 s]
08:14:08 [INFO] org.eclipse.tracecompass.tmf.chart.core ............ SUCCESS [  2.149 s]
08:14:08 [INFO] org.eclipse.tracecompass.analysis.lami.core ........ SUCCESS [  4.351 s]
08:14:08 [INFO] org.eclipse.tracecompass.analysis.lami.core.tests .. SUCCESS [ 12.304 s]
08:14:08 [INFO] org.eclipse.tracecompass.tmf.chart.ui .............. SUCCESS [  3.763 s]
08:14:08 [INFO] org.eclipse.tracecompass.analysis.lami.ui .......... SUCCESS [  2.278 s]
08:14:08 [INFO] org.eclipse.tracecompass.analysis.graph.ui ......... SUCCESS [  2.122 s]
08:14:08 [INFO] org.eclipse.tracecompass.analysis.timing.core ...... SUCCESS [  2.113 s]
08:14:08 [INFO] org.eclipse.tracecompass.analysis.os.linux.core .... SUCCESS [  7.394 s]
08:14:08 [INFO] org.eclipse.tracecompass.analysis.os.linux.core.tests SUCCESS [02:19 min]
08:14:08 [INFO] org.eclipse.tracecompass.analysis.timing.ui ........ SUCCESS [  3.399 s]
08:14:08 [INFO] org.eclipse.tracecompass.analysis.os.linux.ui ...... SUCCESS [  5.184 s]
08:14:08 [INFO] org.eclipse.tracecompass.analysis.os.linux.ui.tests  SUCCESS [ 48.125 s]
08:14:08 [INFO] org.eclipse.tracecompass.analysis.profiling.core ... SUCCESS [  3.022 s]
08:14:08 [INFO] org.eclipse.tracecompass.analysis.profiling.core.tests SUCCESS [ 52.467 s]
08:14:08 [INFO] org.eclipse.tracecompass.analysis.profiling.ui ..... SUCCESS [  2.852 s]
08:14:08 [INFO] org.eclipse.tracecompass.tmf.ui.tests .............. SUCCESS [03:46 min]
08:14:08 [INFO] org.eclipse.tracecompass.tmf.ui.swtbot.tests ....... SUCCESS [14:55 min]
08:14:08 [INFO] org.eclipse.tracecompass.analysis.timing.core.tests  SUCCESS [ 21.281 s]
08:14:08 [INFO] org.eclipse.tracecompass.analysis.profiling.ui.swtbot.tests SUCCESS [ 38.842 s]
08:14:08 [INFO] Trace Compass LTTng Support Parent ................. SUCCESS [  0.115 s]
08:14:08 [INFO] org.eclipse.tracecompass.lttng2.common.core ........ SUCCESS [  0.921 s]
08:14:08 [INFO] org.eclipse.tracecompass.tmf.analysis.xml.core ..... SUCCESS [  6.330 s]
08:14:08 [INFO] org.eclipse.tracecompass.lttng2.kernel.core ........ SUCCESS [  2.129 s]
08:14:08 [INFO] org.eclipse.tracecompass.analysis.counters.ui.swtbot.tests SUCCESS [02:10 min]
08:14:08 [INFO] org.eclipse.tracecompass.analysis.timing.ui.swtbot.tests SUCCESS [ 48.970 s]
08:14:08 [INFO] org.eclipse.tracecompass.analysis.os.linux.ui.swtbot.tests SUCCESS [02:20 min]
08:14:08 [INFO] org.eclipse.tracecompass.tmf.chart.core.tests ...... SUCCESS [ 13.351 s]
08:14:08 [INFO] org.eclipse.tracecompass.tmf.chart.ui.swtbot.tests . SUCCESS [ 34.999 s]
08:14:08 [INFO] org.eclipse.tracecompass.analysis.lami.ui.swtbot.tests SUCCESS [ 52.870 s]
08:14:08 [INFO] Trace Compass BTF Support Parent ................... SUCCESS [  0.155 s]
08:14:08 [INFO] org.eclipse.tracecompass.btf.core .................. SUCCESS [  1.558 s]
08:14:08 [INFO] Trace Compass Documentation ........................ SUCCESS [  0.087 s]
08:14:08 [INFO] Trace Compass Developer Guide ...................... SUCCESS [ 24.469 s]
08:14:08 [INFO] org.eclipse.tracecompass.tmf.analysis.xml.ui ....... SUCCESS [  3.454 s]
08:14:08 [INFO] org.eclipse.tracecompass.tmf ....................... SUCCESS [  1.222 s]
08:14:08 [INFO] org.eclipse.tracecompass.btf.ui .................... SUCCESS [  1.076 s]
08:14:08 [INFO] org.eclipse.tracecompass.btf ....................... SUCCESS [  1.341 s]
08:14:08 [INFO] org.eclipse.tracecompass.btf.core.tests ............ SUCCESS [ 13.453 s]
08:14:08 [INFO] org.eclipse.tracecompass.common.core.tests ......... SUCCESS [ 15.855 s]
08:14:08 [INFO] org.eclipse.tracecompass.ctf ....................... SUCCESS [  0.470 s]
08:14:08 [INFO] org.eclipse.tracecompass.ctf.parser.tests .......... SUCCESS [ 14.698 s]
08:14:08 [INFO] org.eclipse.tracecompass.tmf.ctf ................... SUCCESS [  0.594 s]
08:14:08 [INFO] org.eclipse.tracecompass.tmf.ctf.ui.swtbot.tests ... SUCCESS [03:05 min]
08:14:08 [INFO] Trace Compass User Guide ........................... SUCCESS [ 24.419 s]
08:14:08 [INFO] Trace Compass GDB Tracepoint Analysis User Guide ... SUCCESS [  8.356 s]
08:14:08 [INFO] Trace Compass RCP User Guide ....................... SUCCESS [  8.334 s]
08:14:08 [INFO] Trace Compass Pcap User Guide ...................... SUCCESS [  7.612 s]
08:14:08 [INFO] org.eclipse.tracecompass.examples .................. SUCCESS [  2.576 s]
08:14:08 [INFO] Trace Compass GDB Tracepoint Analysis Parent ....... SUCCESS [  0.091 s]
08:14:08 [INFO] org.eclipse.tracecompass.gdbtrace.core ............. SUCCESS [  2.426 s]
08:14:08 [INFO] org.eclipse.tracecompass.gdbtrace.ui ............... SUCCESS [  0.988 s]
08:14:08 [INFO] org.eclipse.tracecompass.gdbtrace .................. SUCCESS [  1.081 s]
08:14:08 [INFO] org.eclipse.tracecompass.gdbtrace.core.tests ....... SUCCESS [ 12.983 s]
08:14:08 [INFO] org.eclipse.tracecompass.gdbtrace.ui.tests ......... SUCCESS [ 34.733 s]
08:14:08 [INFO] org.eclipse.tracecompass.lttng2.common.core.tests .. SUCCESS [ 10.992 s]
08:14:08 [INFO] org.eclipse.tracecompass.lttng2.control.core ....... SUCCESS [  3.989 s]
08:14:08 [INFO] org.eclipse.tracecompass.tmf.remote.core ........... SUCCESS [  1.447 s]
08:14:08 [INFO] org.eclipse.tracecompass.tmf.remote.ui ............. SUCCESS [  1.941 s]
08:14:08 [INFO] org.eclipse.tracecompass.lttng2.control.ui ......... SUCCESS [  6.931 s]
08:14:08 [INFO] org.eclipse.tracecompass.lttng2.control ............ SUCCESS [  0.411 s]
08:14:08 [INFO] org.eclipse.tracecompass.lttng2.control.core.tests . SUCCESS [ 13.769 s]
08:14:08 [INFO] org.eclipse.tracecompass.tmf.remote.core.tests ..... SUCCESS [ 13.469 s]
08:14:08 [INFO] org.eclipse.tracecompass.lttng2.control.ui.tests ... SUCCESS [01:55 min]
08:14:08 [INFO] org.eclipse.tracecompass.lttng2.kernel.ui .......... SUCCESS [  1.238 s]
08:14:08 [INFO] org.eclipse.tracecompass.lttng2.kernel ............. SUCCESS [  1.360 s]
08:14:08 [INFO] org.eclipse.tracecompass.tmf.analysis.xml.core.tests SUCCESS [01:05 min]
08:14:08 [INFO] org.eclipse.tracecompass.lttng2.kernel.core.tests .. SUCCESS [01:34 min]
08:14:08 [INFO] org.eclipse.tracecompass.lttng2.ust.core ........... SUCCESS [  3.141 s]
08:14:08 [INFO] org.eclipse.tracecompass.lttng2.ust.ui ............. SUCCESS [  1.622 s]
08:14:08 [INFO] org.eclipse.tracecompass.lttng2.ust ................ SUCCESS [  0.463 s]
08:14:08 [INFO] org.eclipse.tracecompass.lttng2.ust.core.tests ..... SUCCESS [ 45.619 s]
08:14:08 [INFO] org.eclipse.tracecompass.lttng2.ust.ui.tests ....... SUCCESS [ 30.161 s]
08:14:08 [INFO] org.eclipse.tracecompass.lttng2.control.ui.swtbot.tests SUCCESS [01:46 min]
08:14:08 [INFO] org.eclipse.tracecompass.lttng2.kernel.ui.swtbot.tests SUCCESS [14:38 min]
08:14:08 [INFO] org.eclipse.tracecompass.lttng2.ust.ui.swtbot.tests  SUCCESS [01:59 min]
08:14:08 [INFO] Trace Compass Pcap Format Support Parent ........... SUCCESS [  0.065 s]
08:14:08 [INFO] org.eclipse.tracecompass.pcap.core ................. SUCCESS [  3.190 s]
08:14:08 [INFO] Trace Compass Pcap Parser Core Tests Plug-in ....... SUCCESS [01:45 min]
08:14:08 [INFO] org.eclipse.tracecompass.tmf.pcap.core ............. SUCCESS [  2.038 s]
08:14:08 [INFO] org.eclipse.tracecompass.tmf.pcap.ui ............... SUCCESS [  1.667 s]
08:14:08 [INFO] org.eclipse.tracecompass.tmf.pcap .................. SUCCESS [  0.479 s]
08:14:08 [INFO] org.eclipse.tracecompass.tmf.pcap.core.tests ....... SUCCESS [ 12.589 s]
08:14:08 [INFO] org.eclipse.tracecompass.tmf.pcap.ui.swtbot.tests .. SUCCESS [ 40.184 s]
08:14:08 [INFO] Trace Compass RCP Parent ........................... SUCCESS [  0.058 s]
08:14:08 [INFO] Trace Compass RCP Branding plug-in ................. SUCCESS [  0.904 s]
08:14:08 [INFO] Trace Compass RCP Branding Feature ................. SUCCESS [  0.346 s]
08:14:08 [INFO] org.eclipse.tracecompass.rcp.ui .................... SUCCESS [  1.100 s]
08:14:08 [INFO] Trace Compass RCP Feature .......................... SUCCESS [  0.696 s]
08:14:08 [INFO] org.eclipse.tracecompass.rcp.incubator.ui .......... SUCCESS [  1.904 s]
08:14:08 [INFO] org.eclipse.tracecompass.rcp.incubator ............. SUCCESS [  0.267 s]
08:14:08 [INFO] Trace Compass Json trace Parent .................... SUCCESS [  0.015 s]
08:14:08 [INFO] org.eclipse.tracecompass.jsontrace.core ............ SUCCESS [  1.776 s]
08:14:08 [INFO] org.eclipse.tracecompass.jsontrace ................. SUCCESS [  0.303 s]
08:14:08 [INFO] Trace Compass RCP Product .......................... SUCCESS [02:40 min]
08:14:08 [INFO] Trace Compass Release Engineering Parent ........... SUCCESS [  0.135 s]
08:14:08 [INFO] Trace Compass Target Platform ...................... SUCCESS [  3.226 s]
08:14:08 [INFO] org.eclipse.tracecompass.integration.swtbot.tests .. SUCCESS [17:17 min]
08:14:08 [INFO] org.eclipse.tracecompass.datastore.core.tests ...... SUCCESS [ 17.061 s]
08:14:08 [INFO] org.eclipse.tracecompass.segmentstore.core.tests ... SUCCESS [ 16.043 s]
08:14:08 [INFO] org.eclipse.tracecompass.tmf.analysis.xml.ui.swtbot.tests SUCCESS [03:19 min]
08:14:08 [INFO] org.eclipse.tracecompass.tmf.analysis.xml.ui.tests . SUCCESS [ 37.160 s]
08:14:08 [INFO] org.eclipse.tracecompass.tmf.chart.ui.tests ........ SUCCESS [ 31.863 s]
08:14:08 [INFO] org.eclipse.tracecompass.tmf.remote.ui.swtbot.tests  SUCCESS [02:25 min]
08:14:08 [INFO] org.eclipse.tracecompass.tmf.remote.ui.tests ....... SUCCESS [ 35.097 s]
08:14:08 [INFO] Trace Compass All Tests ............................ SUCCESS [ 22.681 s]
08:14:08 [INFO] org.eclipse.tracecompass.testing ................... SUCCESS [  1.199 s]
08:14:08 [INFO] org.eclipse.tracecompass.tmf.remote ................ SUCCESS [  0.234 s]
08:14:08 [INFO] Trace Compass Repository ........................... SUCCESS [ 37.909 s]
08:14:08 [INFO] org.eclipse.tracecompass.jsontrace.core.test ....... SUCCESS [  1.723 s]
08:14:08 [INFO] ------------------------------------------------------------------------
08:14:08 [INFO] BUILD SUCCESS
08:14:08 [INFO] ------------------------------------------------------------------------
08:14:08 [INFO] Total time: 01:57 h
08:14:08 [INFO] Finished at: 2019-04-25T12:14:02+00:00
08:14:08 [INFO] Final Memory: 209M/585M
08:14:08 [INFO] ------------------------------------------------------------------------
08:14:08 Sending e-mails to: patrick.tasse@gmail.com bernd.hufmann@ericsson.com
08:14:10 Recording test results
08:14:10 Build step 'Publish JUnit test result report' changed build result to UNSTABLE
08:16:04 Archiving artifacts
08:16:04 Started calculate disk usage of build
08:16:12 Finished Calculation of disk usage of build in 0 seconds
08:16:12 Started calculate disk usage of workspace
08:16:14 Finished Calculation of disk usage of workspace in  9 second
08:16:23 Finished: UNSTABLE