SuccessConsole Output

Skipping 13,250 KB.. Full Log
th mnemonic 'Apply and Close' or with mnemonic 'OK') and with style 'SWT.PUSH')
07:10:37 [2020-03-25T11:10:37.928Z] DEBUG - Sent event Selection [13]: SelectionEvent{Button {OK} time=291705622 data=null item=null detail=0 x=0 y=0 width=0 height=0 stateMask=0x0 text=null doit=true} to (of type 'Button' and (with mnemonic 'Apply and Close' or with mnemonic 'OK') and with style 'SWT.PUSH')
07:10:37 [2020-03-25T11:10:37.928Z] DEBUG - Sent event Selection [13]: SelectionEvent{MenuItem {&Preferences} time=291705315 data=null item=null detail=0 x=0 y=0 width=0 height=0 stateMask=0x0 text=null doit=true} to with mnemonic 'Preferences'
07:10:37 [2020-03-25T11:10:37.928Z] DEBUG - Clicked on 
07:10:38 [2020-03-25T11:10:38.184Z] 
07:10:38 [2020-03-25T11:10:38.184Z] !ENTRY org.eclipse.tracecompass.tmf.analysis.xml.core 4 0 2020-03-25 11:10:37.931
07:10:38 [2020-03-25T11:10:38.184Z] !MESSAGE XML Parsing error at line 6: cvc-complex-type.2.4.a: Invalid content was found starting with element 'element'. One of '{timeGraphView, xyView, stateProvider, pattern, extra}' is expected.
07:10:38 [2020-03-25T11:10:38.184Z] DEBUG - Sent event Activate [26]: ShellEvent{Shell {data - Testing - Eclipse Platform} time=291705708 data=null doit=true} to Shell with text {data - Testing - Eclipse Platform}
07:10:38 [2020-03-25T11:10:38.184Z] DEBUG - matched MenuItem with text "&Window", using matcher: with mnemonic 'Window'
07:10:38 [2020-03-25T11:10:38.184Z] DEBUG - matched MenuItem with text "&Preferences", using matcher: with mnemonic 'Preferences'
07:10:38 [2020-03-25T11:10:38.184Z] DEBUG - Clicking on with mnemonic 'Preferences'
07:10:38 [2020-03-25T11:10:38.184Z] DEBUG - Clicked on with mnemonic 'Preferences'
07:10:38 [2020-03-25T11:10:38.184Z] DEBUG - matched Shell with text "Manage XML analyses ...", using matcher: of type 'Shell'
07:10:38 [2020-03-25T11:10:38.184Z] DEBUG - matched Shell with text "Manage XML analyses ...", using matcher: with text 'Manage XML analyses files'
07:10:38 [2020-03-25T11:10:38.184Z] DEBUG - matched Shell with text "Manage XML analyses ...", using matcher: (with text 'Preferences' or with text 'Manage XML analyses files')
07:10:38 [2020-03-25T11:10:38.184Z] DEBUG - matched Shell with text "Manage XML analyses ...", using matcher: (of type 'Shell' and (with text 'Preferences' or with text 'Manage XML analyses files'))
07:10:38 [2020-03-25T11:10:38.184Z] DEBUG - Sent event Activate [26]: ShellEvent{Shell {Manage XML analyses files} time=291705825 data=null doit=true} to (of type 'Shell' and (with text 'Preferences' or with text 'Manage XML analyses files'))
07:10:38 [2020-03-25T11:10:38.184Z] DEBUG - matched Tree with text "", using matcher: of type 'Tree'
07:10:38 [2020-03-25T11:10:38.184Z] DEBUG - matched Tree with text "", using matcher: (of type 'Tree')
07:10:38 [2020-03-25T11:10:38.184Z] DEBUG - Attempting to set focus on Tree with text {}
07:10:38 [2020-03-25T11:10:38.185Z] DEBUG - Sent event MouseEnter [6]: MouseEvent{TreeItem {Tracing} time=291705830 data=null button=0 stateMask=0x0 x=48 y=132 count=0} to TreeItem with text {Tracing}
07:10:38 [2020-03-25T11:10:38.185Z] DEBUG - Sent event Activate [26]: ShellEvent{TreeItem {Tracing} time=291705830 data=null doit=true} to TreeItem with text {Tracing}
07:10:38 [2020-03-25T11:10:38.185Z] DEBUG - Sent event FocusIn [15]: FocusEvent{TreeItem {Tracing} time=291705831 data=null} to TreeItem with text {Tracing}
07:10:38 [2020-03-25T11:10:38.185Z] DEBUG - Sent event MouseDown [3]: MouseEvent{TreeItem {Tracing} time=291705831 data=null button=1 stateMask=0x0 x=48 y=132 count=1} to TreeItem with text {Tracing}
07:10:38 [2020-03-25T11:10:38.185Z] DEBUG - Sent event Selection [13]: SelectionEvent{Tree {} time=291705831 data=null item=TreeItem {Tracing} detail=0 x=0 y=0 width=0 height=0 stateMask=0x80000 text=null doit=true} to TreeItem with text {Tracing}
07:10:38 [2020-03-25T11:10:38.185Z] DEBUG - Sent event MouseUp [4]: MouseEvent{TreeItem {Tracing} time=291705898 data=null button=1 stateMask=0x80000 x=48 y=132 count=1} to TreeItem with text {Tracing}
07:10:38 [2020-03-25T11:10:38.185Z] WARN - Tree item TreeItem with text {Tracing} is already expanded. Won't expand it again.
07:10:38 [2020-03-25T11:10:38.185Z] DEBUG - Attempting to set focus on Tree with text {}
07:10:38 [2020-03-25T11:10:38.185Z] DEBUG - Sent event MouseEnter [6]: MouseEvent{TreeItem {XML Analyses} time=291705899 data=null button=0 stateMask=0x0 x=86 y=252 count=0} to Tree node with text: XML Analyses
07:10:38 [2020-03-25T11:10:38.185Z] DEBUG - Sent event Activate [26]: ShellEvent{TreeItem {XML Analyses} time=291705899 data=null doit=true} to Tree node with text: XML Analyses
07:10:38 [2020-03-25T11:10:38.185Z] DEBUG - Sent event FocusIn [15]: FocusEvent{TreeItem {XML Analyses} time=291705899 data=null} to Tree node with text: XML Analyses
07:10:38 [2020-03-25T11:10:38.185Z] DEBUG - Sent event MouseDown [3]: MouseEvent{TreeItem {XML Analyses} time=291705900 data=null button=1 stateMask=0x0 x=86 y=252 count=1} to Tree node with text: XML Analyses
07:10:38 [2020-03-25T11:10:38.185Z] DEBUG - Sent event Selection [13]: SelectionEvent{Tree {} time=291705900 data=null item=TreeItem {XML Analyses} detail=0 x=0 y=0 width=0 height=0 stateMask=0x80000 text=null doit=true} to Tree node with text: XML Analyses
07:10:38 [2020-03-25T11:10:38.185Z] DEBUG - Sent event MouseUp [4]: MouseEvent{TreeItem {XML Analyses} time=291705905 data=null button=1 stateMask=0x80000 x=86 y=252 count=1} to Tree node with text: XML Analyses
07:10:38 [2020-03-25T11:10:38.185Z] DEBUG - matched Table with text "", using matcher: of type 'Table'
07:10:38 [2020-03-25T11:10:38.185Z] DEBUG - matched Table with text "", using matcher: (of type 'Table')
07:10:38 [2020-03-25T11:10:38.185Z] DEBUG - Attempting to set focus on Table with text {}
07:10:38 [2020-03-25T11:10:38.185Z] DEBUG - Sent event MouseEnter [6]: MouseEvent{TableItem {test_invalid} time=291705911 data=null button=0 stateMask=0x0 x=64 y=12 count=0} to TableItem with text {test_invalid}
07:10:38 [2020-03-25T11:10:38.185Z] DEBUG - Sent event Activate [26]: ShellEvent{TableItem {test_invalid} time=291705911 data=null doit=true} to TableItem with text {test_invalid}
07:10:38 [2020-03-25T11:10:38.185Z] DEBUG - Sent event FocusIn [15]: FocusEvent{TableItem {test_invalid} time=291705911 data=null} to TableItem with text {test_invalid}
07:10:38 [2020-03-25T11:10:38.185Z] DEBUG - Sent event MouseDown [3]: MouseEvent{TableItem {test_invalid} time=291705912 data=null button=1 stateMask=0x0 x=64 y=12 count=1} to TableItem with text {test_invalid}
07:10:38 [2020-03-25T11:10:38.185Z] 
07:10:38 [2020-03-25T11:10:38.185Z] !ENTRY org.eclipse.tracecompass.tmf.analysis.xml.core 4 0 2020-03-25 11:10:38.147
07:10:38 [2020-03-25T11:10:38.185Z] !MESSAGE XML Parsing error at line 6: cvc-complex-type.2.4.a: Invalid content was found starting with element 'element'. One of '{timeGraphView, xyView, stateProvider, pattern, extra}' is expected.
07:10:38 [2020-03-25T11:10:38.185Z] DEBUG - Sent event Selection [13]: SelectionEvent{Table {} time=291705913 data=null item=TableItem {test_invalid} detail=0 x=0 y=0 width=0 height=0 stateMask=0x80000 text=null doit=true} to TableItem with text {test_invalid}
07:10:38 [2020-03-25T11:10:38.185Z] DEBUG - Sent event MouseUp [4]: MouseEvent{TableItem {test_invalid} time=291705926 data=null button=1 stateMask=0x80000 x=64 y=12 count=1} to TableItem with text {test_invalid}
07:10:38 [2020-03-25T11:10:38.185Z] DEBUG - matched Label with text "", using matcher: of type 'Label'
07:10:38 [2020-03-25T11:10:38.185Z] DEBUG - matched Label with text "", using matcher: of type 'Label'
07:10:38 [2020-03-25T11:10:38.185Z] DEBUG - matched Label with text "Invalid file", using matcher: of type 'Label'
07:10:38 [2020-03-25T11:10:38.185Z] DEBUG - matched Label with text "Invalid file", using matcher: with mnemonic 'Invalid file'
07:10:38 [2020-03-25T11:10:38.185Z] DEBUG - matched Label with text "Invalid file", using matcher: (of type 'Label' and with mnemonic 'Invalid file')
07:10:38 [2020-03-25T11:10:38.185Z] DEBUG - matched Label with text "", using matcher: of type 'Label'
07:10:38 [2020-03-25T11:10:38.185Z] DEBUG - matched Button with text "Import", using matcher: of type 'Button'
07:10:38 [2020-03-25T11:10:38.185Z] DEBUG - matched Button with text "Export", using matcher: of type 'Button'
07:10:38 [2020-03-25T11:10:38.185Z] DEBUG - matched Button with text "Edit...", using matcher: of type 'Button'
07:10:38 [2020-03-25T11:10:38.185Z] DEBUG - matched Button with text "Delete", using matcher: of type 'Button'
07:10:38 [2020-03-25T11:10:38.185Z] DEBUG - matched Button with text "Check selected", using matcher: of type 'Button'
07:10:38 [2020-03-25T11:10:38.185Z] DEBUG - matched Button with text "Check all", using matcher: of type 'Button'
07:10:38 [2020-03-25T11:10:38.185Z] DEBUG - matched Button with text "Uncheck selected", using matcher: of type 'Button'
07:10:38 [2020-03-25T11:10:38.185Z] DEBUG - matched Button with text "Uncheck all", using matcher: of type 'Button'
07:10:38 [2020-03-25T11:10:38.185Z] DEBUG - matched Button with text "Restore &Defaults", using matcher: of type 'Button'
07:10:38 [2020-03-25T11:10:38.185Z] DEBUG - matched Button with text "&Apply", using matcher: of type 'Button'
07:10:38 [2020-03-25T11:10:38.185Z] DEBUG - matched Button with text "Cancel", using matcher: of type 'Button'
07:10:38 [2020-03-25T11:10:38.185Z] DEBUG - matched Button with text "OK", using matcher: of type 'Button'
07:10:38 [2020-03-25T11:10:38.185Z] DEBUG - matched Button with text "OK", using matcher: with mnemonic 'OK'
07:10:38 [2020-03-25T11:10:38.185Z] DEBUG - matched Button with text "OK", using matcher: (with mnemonic 'Apply and Close' or with mnemonic 'OK')
07:10:38 [2020-03-25T11:10:38.185Z] DEBUG - matched Button with text "OK", using matcher: with style 'SWT.PUSH'
07:10:38 [2020-03-25T11:10:38.185Z] DEBUG - matched Button with text "OK", using matcher: (of type 'Button' and (with mnemonic 'Apply and Close' or with mnemonic 'OK') and with style 'SWT.PUSH')
07:10:38 [2020-03-25T11:10:38.185Z] DEBUG - Clicking on OK
07:10:38 [2020-03-25T11:10:38.185Z] DEBUG - Sent event MouseEnter [6]: MouseEvent{Button {OK} time=291705934 data=null button=0 stateMask=0x0 x=0 y=0 count=0} to (of type 'Button' and (with mnemonic 'Apply and Close' or with mnemonic 'OK') and with style 'SWT.PUSH')
07:10:38 [2020-03-25T11:10:38.185Z] DEBUG - Sent event MouseMove [5]: MouseEvent{Button {OK} time=291705934 data=null button=0 stateMask=0x0 x=0 y=0 count=0} to (of type 'Button' and (with mnemonic 'Apply and Close' or with mnemonic 'OK') and with style 'SWT.PUSH')
07:10:38 [2020-03-25T11:10:38.185Z] DEBUG - Sent event Activate [26]: ShellEvent{Button {OK} time=291705935 data=null doit=true} to (of type 'Button' and (with mnemonic 'Apply and Close' or with mnemonic 'OK') and with style 'SWT.PUSH')
07:10:38 [2020-03-25T11:10:38.185Z] DEBUG - Sent event FocusIn [15]: FocusEvent{Button {OK} time=291705935 data=null} to (of type 'Button' and (with mnemonic 'Apply and Close' or with mnemonic 'OK') and with style 'SWT.PUSH')
07:10:38 [2020-03-25T11:10:38.185Z] DEBUG - Sent event MouseDown [3]: MouseEvent{Button {OK} time=291705935 data=null button=0 stateMask=0x0 x=0 y=0 count=0} to (of type 'Button' and (with mnemonic 'Apply and Close' or with mnemonic 'OK') and with style 'SWT.PUSH')
07:10:38 [2020-03-25T11:10:38.185Z] DEBUG - Sent event MouseUp [4]: MouseEvent{Button {OK} time=291705935 data=null button=0 stateMask=0x0 x=0 y=0 count=0} to (of type 'Button' and (with mnemonic 'Apply and Close' or with mnemonic 'OK') and with style 'SWT.PUSH')
07:10:38 [2020-03-25T11:10:38.185Z] 
07:10:38 [2020-03-25T11:10:38.185Z] !ENTRY org.eclipse.tracecompass.tmf.analysis.xml.core 4 0 2020-03-25 11:10:38.168
07:10:38 [2020-03-25T11:10:38.185Z] !MESSAGE XML Parsing error at line 6: cvc-complex-type.2.4.a: Invalid content was found starting with element 'element'. One of '{timeGraphView, xyView, stateProvider, pattern, extra}' is expected.
07:10:38 [2020-03-25T11:10:38.442Z] DEBUG - Sent event Selection [13]: SelectionEvent{Button {OK} time=291705935 data=null item=null detail=0 x=0 y=0 width=0 height=0 stateMask=0x0 text=null doit=true} to (of type 'Button' and (with mnemonic 'Apply and Close' or with mnemonic 'OK') and with style 'SWT.PUSH')
07:10:38 [2020-03-25T11:10:38.442Z] DEBUG - Sent event Selection [13]: SelectionEvent{MenuItem {&Preferences} time=291705719 data=null item=null detail=0 x=0 y=0 width=0 height=0 stateMask=0x0 text=null doit=true} to with mnemonic 'Preferences'
07:10:38 [2020-03-25T11:10:38.442Z] DEBUG - Clicked on 
07:10:38 [2020-03-25T11:10:38.442Z] DEBUG - Sent event Activate [26]: ShellEvent{Shell {data - Testing - Eclipse Platform} time=291706010 data=null doit=true} to Shell with text {data - Testing - Eclipse Platform}
07:10:38 [2020-03-25T11:10:38.442Z] DEBUG - matched MenuItem with text "&Window", using matcher: with mnemonic 'Window'
07:10:38 [2020-03-25T11:10:38.442Z] DEBUG - matched MenuItem with text "&Preferences", using matcher: with mnemonic 'Preferences'
07:10:38 [2020-03-25T11:10:38.442Z] DEBUG - Clicking on with mnemonic 'Preferences'
07:10:38 [2020-03-25T11:10:38.442Z] DEBUG - Clicked on with mnemonic 'Preferences'
07:10:38 [2020-03-25T11:10:38.442Z] DEBUG - matched Shell with text "Manage XML analyses ...", using matcher: of type 'Shell'
07:10:38 [2020-03-25T11:10:38.442Z] DEBUG - matched Shell with text "Manage XML analyses ...", using matcher: with text 'Manage XML analyses files'
07:10:38 [2020-03-25T11:10:38.442Z] DEBUG - matched Shell with text "Manage XML analyses ...", using matcher: (with text 'Preferences' or with text 'Manage XML analyses files')
07:10:38 [2020-03-25T11:10:38.442Z] DEBUG - matched Shell with text "Manage XML analyses ...", using matcher: (of type 'Shell' and (with text 'Preferences' or with text 'Manage XML analyses files'))
07:10:38 [2020-03-25T11:10:38.442Z] DEBUG - Sent event Activate [26]: ShellEvent{Shell {Manage XML analyses files} time=291706130 data=null doit=true} to (of type 'Shell' and (with text 'Preferences' or with text 'Manage XML analyses files'))
07:10:38 [2020-03-25T11:10:38.442Z] DEBUG - matched Tree with text "", using matcher: of type 'Tree'
07:10:38 [2020-03-25T11:10:38.442Z] DEBUG - matched Tree with text "", using matcher: (of type 'Tree')
07:10:38 [2020-03-25T11:10:38.442Z] DEBUG - Attempting to set focus on Tree with text {}
07:10:38 [2020-03-25T11:10:38.442Z] DEBUG - Sent event MouseEnter [6]: MouseEvent{TreeItem {Tracing} time=291706134 data=null button=0 stateMask=0x0 x=48 y=132 count=0} to TreeItem with text {Tracing}
07:10:38 [2020-03-25T11:10:38.442Z] DEBUG - Sent event Activate [26]: ShellEvent{TreeItem {Tracing} time=291706135 data=null doit=true} to TreeItem with text {Tracing}
07:10:38 [2020-03-25T11:10:38.442Z] DEBUG - Sent event FocusIn [15]: FocusEvent{TreeItem {Tracing} time=291706135 data=null} to TreeItem with text {Tracing}
07:10:38 [2020-03-25T11:10:38.442Z] DEBUG - Sent event MouseDown [3]: MouseEvent{TreeItem {Tracing} time=291706135 data=null button=1 stateMask=0x0 x=48 y=132 count=1} to TreeItem with text {Tracing}
07:10:38 [2020-03-25T11:10:38.442Z] DEBUG - Sent event Selection [13]: SelectionEvent{Tree {} time=291706135 data=null item=TreeItem {Tracing} detail=0 x=0 y=0 width=0 height=0 stateMask=0x80000 text=null doit=true} to TreeItem with text {Tracing}
07:10:38 [2020-03-25T11:10:38.442Z] DEBUG - Sent event MouseUp [4]: MouseEvent{TreeItem {Tracing} time=291706195 data=null button=1 stateMask=0x80000 x=48 y=132 count=1} to TreeItem with text {Tracing}
07:10:38 [2020-03-25T11:10:38.442Z] WARN - Tree item TreeItem with text {Tracing} is already expanded. Won't expand it again.
07:10:38 [2020-03-25T11:10:38.442Z] DEBUG - Attempting to set focus on Tree with text {}
07:10:38 [2020-03-25T11:10:38.442Z] DEBUG - Sent event MouseEnter [6]: MouseEvent{TreeItem {XML Analyses} time=291706196 data=null button=0 stateMask=0x0 x=86 y=252 count=0} to Tree node with text: XML Analyses
07:10:38 [2020-03-25T11:10:38.442Z] DEBUG - Sent event Activate [26]: ShellEvent{TreeItem {XML Analyses} time=291706196 data=null doit=true} to Tree node with text: XML Analyses
07:10:38 [2020-03-25T11:10:38.442Z] DEBUG - Sent event FocusIn [15]: FocusEvent{TreeItem {XML Analyses} time=291706196 data=null} to Tree node with text: XML Analyses
07:10:38 [2020-03-25T11:10:38.442Z] DEBUG - Sent event MouseDown [3]: MouseEvent{TreeItem {XML Analyses} time=291706196 data=null button=1 stateMask=0x0 x=86 y=252 count=1} to Tree node with text: XML Analyses
07:10:38 [2020-03-25T11:10:38.442Z] DEBUG - Sent event Selection [13]: SelectionEvent{Tree {} time=291706197 data=null item=TreeItem {XML Analyses} detail=0 x=0 y=0 width=0 height=0 stateMask=0x80000 text=null doit=true} to Tree node with text: XML Analyses
07:10:38 [2020-03-25T11:10:38.442Z] DEBUG - Sent event MouseUp [4]: MouseEvent{TreeItem {XML Analyses} time=291706202 data=null button=1 stateMask=0x80000 x=86 y=252 count=1} to Tree node with text: XML Analyses
07:10:38 [2020-03-25T11:10:38.442Z] DEBUG - matched Table with text "", using matcher: of type 'Table'
07:10:38 [2020-03-25T11:10:38.442Z] DEBUG - matched Table with text "", using matcher: (of type 'Table')
07:10:38 [2020-03-25T11:10:38.442Z] DEBUG - Attempting to set focus on (of type 'Table')
07:10:38 [2020-03-25T11:10:38.442Z] DEBUG - Attempting to set focus on (of type 'Table')
07:10:38 [2020-03-25T11:10:38.442Z] DEBUG - Selecting rows [0] in (of type 'Table')
07:10:38 [2020-03-25T11:10:38.442Z] DEBUG - Sent event MouseEnter [6]: MouseEvent{Table {} time=291706207 data=null button=0 stateMask=0x0 x=0 y=0 count=0} to (of type 'Table')
07:10:38 [2020-03-25T11:10:38.442Z] DEBUG - Sent event MouseMove [5]: MouseEvent{Table {} time=291706207 data=null button=0 stateMask=0x0 x=0 y=0 count=0} to (of type 'Table')
07:10:38 [2020-03-25T11:10:38.442Z] DEBUG - Sent event Activate [26]: ShellEvent{Table {} time=291706208 data=null doit=true} to (of type 'Table')
07:10:38 [2020-03-25T11:10:38.442Z] DEBUG - Sent event FocusIn [15]: FocusEvent{Table {} time=291706208 data=null} to (of type 'Table')
07:10:38 [2020-03-25T11:10:38.442Z] DEBUG - Sent event MouseDown [3]: MouseEvent{TableItem {test_invalid} time=291706208 data=null button=1 stateMask=0x0 x=64 y=12 count=1} to (of type 'Table')
07:10:38 [2020-03-25T11:10:38.700Z] 
07:10:38 [2020-03-25T11:10:38.700Z] !ENTRY org.eclipse.tracecompass.tmf.analysis.xml.core 4 0 2020-03-25 11:10:38.441
07:10:38 [2020-03-25T11:10:38.700Z] !MESSAGE XML Parsing error at line 6: cvc-complex-type.2.4.a: Invalid content was found starting with element 'element'. One of '{timeGraphView, xyView, stateProvider, pattern, extra}' is expected.
07:10:38 [2020-03-25T11:10:38.700Z] DEBUG - Sent event Selection [13]: SelectionEvent{Table {} time=291706208 data=null item=TableItem {test_invalid} detail=0 x=0 y=0 width=0 height=0 stateMask=0x80000 text=null doit=true} to (of type 'Table')
07:10:38 [2020-03-25T11:10:38.700Z] DEBUG - Sent event MouseUp [4]: MouseEvent{TableItem {test_invalid} time=291706219 data=null button=1 stateMask=0x80000 x=64 y=12 count=1} to (of type 'Table')
07:10:38 [2020-03-25T11:10:38.700Z] DEBUG - matched Button with text "Import", using matcher: of type 'Button'
07:10:38 [2020-03-25T11:10:38.700Z] DEBUG - matched Button with text "Export", using matcher: of type 'Button'
07:10:38 [2020-03-25T11:10:38.700Z] DEBUG - matched Button with text "Edit...", using matcher: of type 'Button'
07:10:38 [2020-03-25T11:10:38.700Z] DEBUG - matched Button with text "Delete", using matcher: of type 'Button'
07:10:38 [2020-03-25T11:10:38.700Z] DEBUG - matched Button with text "Delete", using matcher: with mnemonic 'Delete'
07:10:38 [2020-03-25T11:10:38.700Z] DEBUG - matched Button with text "Delete", using matcher: with style 'SWT.PUSH'
07:10:38 [2020-03-25T11:10:38.700Z] DEBUG - matched Button with text "Delete", using matcher: (of type 'Button' and with mnemonic 'Delete' and with style 'SWT.PUSH')
07:10:38 [2020-03-25T11:10:38.700Z] DEBUG - matched Button with text "Check selected", using matcher: of type 'Button'
07:10:38 [2020-03-25T11:10:38.700Z] DEBUG - matched Button with text "Check all", using matcher: of type 'Button'
07:10:38 [2020-03-25T11:10:38.700Z] DEBUG - matched Button with text "Uncheck selected", using matcher: of type 'Button'
07:10:38 [2020-03-25T11:10:38.700Z] DEBUG - matched Button with text "Uncheck all", using matcher: of type 'Button'
07:10:38 [2020-03-25T11:10:38.700Z] DEBUG - matched Button with text "Restore &Defaults", using matcher: of type 'Button'
07:10:38 [2020-03-25T11:10:38.700Z] DEBUG - matched Button with text "&Apply", using matcher: of type 'Button'
07:10:38 [2020-03-25T11:10:38.700Z] DEBUG - matched Button with text "Cancel", using matcher: of type 'Button'
07:10:38 [2020-03-25T11:10:38.700Z] DEBUG - matched Button with text "OK", using matcher: of type 'Button'
07:10:38 [2020-03-25T11:10:38.700Z] DEBUG - Clicking on Delete
07:10:38 [2020-03-25T11:10:38.700Z] DEBUG - Sent event MouseEnter [6]: MouseEvent{Button {Delete} time=291706222 data=null button=0 stateMask=0x0 x=0 y=0 count=0} to (of type 'Button' and with mnemonic 'Delete' and with style 'SWT.PUSH')
07:10:38 [2020-03-25T11:10:38.700Z] DEBUG - Sent event MouseMove [5]: MouseEvent{Button {Delete} time=291706222 data=null button=0 stateMask=0x0 x=0 y=0 count=0} to (of type 'Button' and with mnemonic 'Delete' and with style 'SWT.PUSH')
07:10:38 [2020-03-25T11:10:38.700Z] DEBUG - Sent event Activate [26]: ShellEvent{Button {Delete} time=291706222 data=null doit=true} to (of type 'Button' and with mnemonic 'Delete' and with style 'SWT.PUSH')
07:10:38 [2020-03-25T11:10:38.700Z] DEBUG - Sent event FocusIn [15]: FocusEvent{Button {Delete} time=291706222 data=null} to (of type 'Button' and with mnemonic 'Delete' and with style 'SWT.PUSH')
07:10:38 [2020-03-25T11:10:38.700Z] DEBUG - Sent event MouseDown [3]: MouseEvent{Button {Delete} time=291706223 data=null button=0 stateMask=0x0 x=0 y=0 count=0} to (of type 'Button' and with mnemonic 'Delete' and with style 'SWT.PUSH')
07:10:38 [2020-03-25T11:10:38.700Z] DEBUG - Sent event MouseUp [4]: MouseEvent{Button {Delete} time=291706223 data=null button=0 stateMask=0x0 x=0 y=0 count=0} to (of type 'Button' and with mnemonic 'Delete' and with style 'SWT.PUSH')
07:10:38 [2020-03-25T11:10:38.700Z] DEBUG - Sent event MouseHover [32]: MouseEvent{Button {Delete} time=291706244 data=null button=0 stateMask=0x0 x=0 y=0 count=0} to (of type 'Button' and with mnemonic 'Delete' and with style 'SWT.PUSH')
07:10:38 [2020-03-25T11:10:38.700Z] DEBUG - Sent event MouseMove [5]: MouseEvent{Button {Delete} time=291706292 data=null button=0 stateMask=0x0 x=0 y=0 count=0} to (of type 'Button' and with mnemonic 'Delete' and with style 'SWT.PUSH')
07:10:38 [2020-03-25T11:10:38.700Z] DEBUG - Sent event MouseExit [7]: MouseEvent{Button {Delete} time=291706292 data=null button=0 stateMask=0x0 x=0 y=0 count=0} to (of type 'Button' and with mnemonic 'Delete' and with style 'SWT.PUSH')
07:10:38 [2020-03-25T11:10:38.700Z] DEBUG - Sent event Deactivate [27]: ShellEvent{Button {Delete} time=291706292 data=null doit=true} to (of type 'Button' and with mnemonic 'Delete' and with style 'SWT.PUSH')
07:10:38 [2020-03-25T11:10:38.700Z] DEBUG - Sent event FocusOut [16]: FocusEvent{Button {Delete} time=291706292 data=null} to (of type 'Button' and with mnemonic 'Delete' and with style 'SWT.PUSH')
07:10:38 [2020-03-25T11:10:38.700Z] DEBUG - Clicked on Delete
07:10:38 [2020-03-25T11:10:38.700Z] DEBUG - matched Shell with text "Delete XML file(s)", using matcher: with text 'Delete XML file(s)'
07:10:38 [2020-03-25T11:10:38.700Z] DEBUG - Sent event Activate [26]: ShellEvent{Shell {Delete XML file(s)} time=291706294 data=null doit=true} to Shell with text {Delete XML file(s)}
07:10:38 [2020-03-25T11:10:38.700Z] DEBUG - matched Button with text "&No", using matcher: of type 'Button'
07:10:38 [2020-03-25T11:10:38.700Z] DEBUG - matched Button with text "&Yes", using matcher: of type 'Button'
07:10:38 [2020-03-25T11:10:38.700Z] DEBUG - matched Button with text "&Yes", using matcher: with mnemonic 'Yes'
07:10:38 [2020-03-25T11:10:38.700Z] DEBUG - matched Button with text "&Yes", using matcher: with style 'SWT.PUSH'
07:10:38 [2020-03-25T11:10:38.700Z] DEBUG - matched Button with text "&Yes", using matcher: (of type 'Button' and with mnemonic 'Yes' and with style 'SWT.PUSH')
07:10:38 [2020-03-25T11:10:38.700Z] DEBUG - Clicking on &Yes
07:10:38 [2020-03-25T11:10:38.700Z] DEBUG - Sent event MouseEnter [6]: MouseEvent{Button {&Yes} time=291706295 data=null button=0 stateMask=0x0 x=0 y=0 count=0} to (of type 'Button' and with mnemonic 'Yes' and with style 'SWT.PUSH')
07:10:38 [2020-03-25T11:10:38.700Z] DEBUG - Sent event MouseMove [5]: MouseEvent{Button {&Yes} time=291706295 data=null button=0 stateMask=0x0 x=0 y=0 count=0} to (of type 'Button' and with mnemonic 'Yes' and with style 'SWT.PUSH')
07:10:38 [2020-03-25T11:10:38.700Z] DEBUG - Sent event Activate [26]: ShellEvent{Button {&Yes} time=291706295 data=null doit=true} to (of type 'Button' and with mnemonic 'Yes' and with style 'SWT.PUSH')
07:10:38 [2020-03-25T11:10:38.700Z] DEBUG - Sent event FocusIn [15]: FocusEvent{Button {&Yes} time=291706295 data=null} to (of type 'Button' and with mnemonic 'Yes' and with style 'SWT.PUSH')
07:10:38 [2020-03-25T11:10:38.700Z] DEBUG - Sent event MouseDown [3]: MouseEvent{Button {&Yes} time=291706295 data=null button=0 stateMask=0x0 x=0 y=0 count=0} to (of type 'Button' and with mnemonic 'Yes' and with style 'SWT.PUSH')
07:10:38 [2020-03-25T11:10:38.700Z] DEBUG - Sent event MouseUp [4]: MouseEvent{Button {&Yes} time=291706296 data=null button=0 stateMask=0x0 x=0 y=0 count=0} to (of type 'Button' and with mnemonic 'Yes' and with style 'SWT.PUSH')
07:10:38 [2020-03-25T11:10:38.700Z] DEBUG - Sent event Selection [13]: SelectionEvent{Button {&Yes} time=291706296 data=null item=null detail=0 x=0 y=0 width=0 height=0 stateMask=0x0 text=null doit=true} to (of type 'Button' and with mnemonic 'Yes' and with style 'SWT.PUSH')
07:10:38 [2020-03-25T11:10:38.700Z] DEBUG - Sent event Selection [13]: SelectionEvent{Button {Delete} time=291706223 data=null item=null detail=0 x=0 y=0 width=0 height=0 stateMask=0x0 text=null doit=true} to (of type 'Button' and with mnemonic 'Delete' and with style 'SWT.PUSH')
07:10:38 [2020-03-25T11:10:38.700Z] DEBUG - Clicked on 
07:10:38 [2020-03-25T11:10:38.700Z] DEBUG - matched Button with text "Import", using matcher: of type 'Button'
07:10:38 [2020-03-25T11:10:38.700Z] DEBUG - matched Button with text "Export", using matcher: of type 'Button'
07:10:38 [2020-03-25T11:10:38.700Z] DEBUG - matched Button with text "Edit...", using matcher: of type 'Button'
07:10:38 [2020-03-25T11:10:38.700Z] DEBUG - matched Button with text "Delete", using matcher: of type 'Button'
07:10:38 [2020-03-25T11:10:38.700Z] DEBUG - matched Button with text "Check selected", using matcher: of type 'Button'
07:10:38 [2020-03-25T11:10:38.700Z] DEBUG - matched Button with text "Check all", using matcher: of type 'Button'
07:10:38 [2020-03-25T11:10:38.700Z] DEBUG - matched Button with text "Uncheck selected", using matcher: of type 'Button'
07:10:38 [2020-03-25T11:10:38.700Z] DEBUG - matched Button with text "Uncheck all", using matcher: of type 'Button'
07:10:38 [2020-03-25T11:10:38.700Z] DEBUG - matched Button with text "Restore &Defaults", using matcher: of type 'Button'
07:10:38 [2020-03-25T11:10:38.700Z] DEBUG - matched Button with text "&Apply", using matcher: of type 'Button'
07:10:38 [2020-03-25T11:10:38.700Z] DEBUG - matched Button with text "Cancel", using matcher: of type 'Button'
07:10:38 [2020-03-25T11:10:38.700Z] DEBUG - matched Button with text "OK", using matcher: of type 'Button'
07:10:38 [2020-03-25T11:10:38.700Z] DEBUG - matched Button with text "OK", using matcher: with mnemonic 'OK'
07:10:38 [2020-03-25T11:10:38.700Z] DEBUG - matched Button with text "OK", using matcher: (with mnemonic 'Apply and Close' or with mnemonic 'OK')
07:10:38 [2020-03-25T11:10:38.700Z] DEBUG - matched Button with text "OK", using matcher: with style 'SWT.PUSH'
07:10:38 [2020-03-25T11:10:38.700Z] DEBUG - matched Button with text "OK", using matcher: (of type 'Button' and (with mnemonic 'Apply and Close' or with mnemonic 'OK') and with style 'SWT.PUSH')
07:10:38 [2020-03-25T11:10:38.700Z] DEBUG - Clicking on OK
07:10:38 [2020-03-25T11:10:38.700Z] DEBUG - Sent event MouseEnter [6]: MouseEvent{Button {OK} time=291706319 data=null button=0 stateMask=0x0 x=0 y=0 count=0} to (of type 'Button' and (with mnemonic 'Apply and Close' or with mnemonic 'OK') and with style 'SWT.PUSH')
07:10:38 [2020-03-25T11:10:38.700Z] DEBUG - Sent event MouseMove [5]: MouseEvent{Button {OK} time=291706319 data=null button=0 stateMask=0x0 x=0 y=0 count=0} to (of type 'Button' and (with mnemonic 'Apply and Close' or with mnemonic 'OK') and with style 'SWT.PUSH')
07:10:38 [2020-03-25T11:10:38.700Z] DEBUG - Sent event Activate [26]: ShellEvent{Button {OK} time=291706319 data=null doit=true} to (of type 'Button' and (with mnemonic 'Apply and Close' or with mnemonic 'OK') and with style 'SWT.PUSH')
07:10:38 [2020-03-25T11:10:38.700Z] DEBUG - Sent event FocusIn [15]: FocusEvent{Button {OK} time=291706320 data=null} to (of type 'Button' and (with mnemonic 'Apply and Close' or with mnemonic 'OK') and with style 'SWT.PUSH')
07:10:38 [2020-03-25T11:10:38.700Z] DEBUG - Sent event MouseDown [3]: MouseEvent{Button {OK} time=291706320 data=null button=0 stateMask=0x0 x=0 y=0 count=0} to (of type 'Button' and (with mnemonic 'Apply and Close' or with mnemonic 'OK') and with style 'SWT.PUSH')
07:10:38 [2020-03-25T11:10:38.700Z] DEBUG - Sent event MouseUp [4]: MouseEvent{Button {OK} time=291706320 data=null button=0 stateMask=0x0 x=0 y=0 count=0} to (of type 'Button' and (with mnemonic 'Apply and Close' or with mnemonic 'OK') and with style 'SWT.PUSH')
07:10:38 [2020-03-25T11:10:38.700Z] DEBUG - Sent event Selection [13]: SelectionEvent{Button {OK} time=291706320 data=null item=null detail=0 x=0 y=0 width=0 height=0 stateMask=0x0 text=null doit=true} to (of type 'Button' and (with mnemonic 'Apply and Close' or with mnemonic 'OK') and with style 'SWT.PUSH')
07:10:38 [2020-03-25T11:10:38.700Z] DEBUG - Sent event Selection [13]: SelectionEvent{MenuItem {&Preferences} time=291706020 data=null item=null detail=0 x=0 y=0 width=0 height=0 stateMask=0x0 text=null doit=true} to with mnemonic 'Preferences'
07:10:38 [2020-03-25T11:10:38.700Z] DEBUG - Clicked on 
07:10:38 [2020-03-25T11:10:38.700Z] Tests run: 9, Failures: 0, Errors: 0, Skipped: 0, Time elapsed: 12.737 s - in org.eclipse.tracecompass.tmf.analysis.xml.ui.swtbot.tests.preferences.XMLAnalysesManagerPreferencePageTest
07:10:38 [2020-03-25T11:10:38.700Z] testPreferencePageMenuBar(org.eclipse.tracecompass.tmf.analysis.xml.ui.swtbot.tests.preferences.XMLAnalysesManagerPreferencePageTest)  Time elapsed: 1.143 s
07:10:38 [2020-03-25T11:10:38.700Z] testImportInvalid(org.eclipse.tracecompass.tmf.analysis.xml.ui.swtbot.tests.preferences.XMLAnalysesManagerPreferencePageTest)  Time elapsed: 0.681 s
07:10:38 [2020-03-25T11:10:38.700Z] testPreferencePageContextMenu(org.eclipse.tracecompass.tmf.analysis.xml.ui.swtbot.tests.preferences.XMLAnalysesManagerPreferencePageTest)  Time elapsed: 1.888 s
07:10:38 [2020-03-25T11:10:38.700Z] testEdit(org.eclipse.tracecompass.tmf.analysis.xml.ui.swtbot.tests.preferences.XMLAnalysesManagerPreferencePageTest)  Time elapsed: 2.737 s
07:10:38 [2020-03-25T11:10:38.700Z] testImportValid(org.eclipse.tracecompass.tmf.analysis.xml.ui.swtbot.tests.preferences.XMLAnalysesManagerPreferencePageTest)  Time elapsed: 1.465 s
07:10:38 [2020-03-25T11:10:38.700Z] testCheckButtons(org.eclipse.tracecompass.tmf.analysis.xml.ui.swtbot.tests.preferences.XMLAnalysesManagerPreferencePageTest)  Time elapsed: 1.711 s
07:10:38 [2020-03-25T11:10:38.700Z] testDelete(org.eclipse.tracecompass.tmf.analysis.xml.ui.swtbot.tests.preferences.XMLAnalysesManagerPreferencePageTest)  Time elapsed: 1.481 s
07:10:38 [2020-03-25T11:10:38.700Z] testExport(org.eclipse.tracecompass.tmf.analysis.xml.ui.swtbot.tests.preferences.XMLAnalysesManagerPreferencePageTest)  Time elapsed: 0.795 s
07:10:38 [2020-03-25T11:10:38.700Z] testInvalidLabel(org.eclipse.tracecompass.tmf.analysis.xml.ui.swtbot.tests.preferences.XMLAnalysesManagerPreferencePageTest)  Time elapsed: 0.65 s
07:10:38 [2020-03-25T11:10:38.700Z] 
07:10:38 [2020-03-25T11:10:38.700Z] Results:
07:10:38 [2020-03-25T11:10:38.700Z] 
07:10:38 [2020-03-25T11:10:38.700Z] Tests run: 13, Failures: 0, Errors: 0, Skipped: 0
07:10:38 [2020-03-25T11:10:38.700Z] 
07:10:39 [2020-03-25T11:10:39.264Z] 
07:10:39 [2020-03-25T11:10:39.264Z] !ENTRY org.eclipse.core.resources 2 10035 2020-03-25 11:10:39.153
07:10:39 [2020-03-25T11:10:39.264Z] !MESSAGE The workspace will exit with unsaved changes in this session.
07:10:40 [2020-03-25T11:10:40.633Z] [INFO] All tests passed!
07:10:40 [2020-03-25T11:10:40.633Z] [INFO] 
07:10:40 [2020-03-25T11:10:40.633Z] [INFO] --- maven-install-plugin:2.5.2:install (default-install) @ org.eclipse.tracecompass.tmf.analysis.xml.ui.swtbot.tests ---
07:10:40 [2020-03-25T11:10:40.633Z] [INFO] Installing /home/jenkins/agent/workspace/tracecompass-master-nightly-neon/tmf/org.eclipse.tracecompass.tmf.analysis.xml.ui.swtbot.tests/target/org.eclipse.tracecompass.tmf.analysis.xml.ui.swtbot.tests-1.0.10-SNAPSHOT.jar to /home/jenkins/.m2/repository/org/eclipse/tracecompass/org.eclipse.tracecompass.tmf.analysis.xml.ui.swtbot.tests/1.0.10-SNAPSHOT/org.eclipse.tracecompass.tmf.analysis.xml.ui.swtbot.tests-1.0.10-SNAPSHOT.jar
07:10:40 [2020-03-25T11:10:40.633Z] [INFO] Installing /home/jenkins/agent/workspace/tracecompass-master-nightly-neon/tmf/org.eclipse.tracecompass.tmf.analysis.xml.ui.swtbot.tests/pom.xml to /home/jenkins/.m2/repository/org/eclipse/tracecompass/org.eclipse.tracecompass.tmf.analysis.xml.ui.swtbot.tests/1.0.10-SNAPSHOT/org.eclipse.tracecompass.tmf.analysis.xml.ui.swtbot.tests-1.0.10-SNAPSHOT.pom
07:10:40 [2020-03-25T11:10:40.633Z] [INFO] Installing /home/jenkins/agent/workspace/tracecompass-master-nightly-neon/tmf/org.eclipse.tracecompass.tmf.analysis.xml.ui.swtbot.tests/target/org.eclipse.tracecompass.tmf.analysis.xml.ui.swtbot.tests-1.0.10-SNAPSHOT-sources.jar to /home/jenkins/.m2/repository/org/eclipse/tracecompass/org.eclipse.tracecompass.tmf.analysis.xml.ui.swtbot.tests/1.0.10-SNAPSHOT/org.eclipse.tracecompass.tmf.analysis.xml.ui.swtbot.tests-1.0.10-SNAPSHOT-sources.jar
07:10:40 [2020-03-25T11:10:40.633Z] [INFO] Installing /home/jenkins/agent/workspace/tracecompass-master-nightly-neon/tmf/org.eclipse.tracecompass.tmf.analysis.xml.ui.swtbot.tests/target/org.eclipse.tracecompass.tmf.analysis.xml.ui.swtbot.tests-1.0.10-SNAPSHOT.jar.pack.gz to /home/jenkins/.m2/repository/org/eclipse/tracecompass/org.eclipse.tracecompass.tmf.analysis.xml.ui.swtbot.tests/1.0.10-SNAPSHOT/org.eclipse.tracecompass.tmf.analysis.xml.ui.swtbot.tests-1.0.10-SNAPSHOT-pack200.jar.pack.gz
07:10:40 [2020-03-25T11:10:40.633Z] [INFO] Installing /home/jenkins/agent/workspace/tracecompass-master-nightly-neon/tmf/org.eclipse.tracecompass.tmf.analysis.xml.ui.swtbot.tests/target/p2content.xml to /home/jenkins/.m2/repository/org/eclipse/tracecompass/org.eclipse.tracecompass.tmf.analysis.xml.ui.swtbot.tests/1.0.10-SNAPSHOT/org.eclipse.tracecompass.tmf.analysis.xml.ui.swtbot.tests-1.0.10-SNAPSHOT-p2metadata.xml
07:10:40 [2020-03-25T11:10:40.633Z] [INFO] Installing /home/jenkins/agent/workspace/tracecompass-master-nightly-neon/tmf/org.eclipse.tracecompass.tmf.analysis.xml.ui.swtbot.tests/target/p2artifacts.xml to /home/jenkins/.m2/repository/org/eclipse/tracecompass/org.eclipse.tracecompass.tmf.analysis.xml.ui.swtbot.tests/1.0.10-SNAPSHOT/org.eclipse.tracecompass.tmf.analysis.xml.ui.swtbot.tests-1.0.10-SNAPSHOT-p2artifacts.xml
07:10:40 [2020-03-25T11:10:40.633Z] [INFO] 
07:10:40 [2020-03-25T11:10:40.633Z] [INFO] --- tycho-p2-plugin:1.3.0:update-local-index (default-update-local-index) @ org.eclipse.tracecompass.tmf.analysis.xml.ui.swtbot.tests ---
07:10:40 [2020-03-25T11:10:40.633Z] [INFO] 
07:10:40 [2020-03-25T11:10:40.633Z] [INFO] --< org.eclipse.tracecompass:org.eclipse.tracecompass.tmf.analysis.xml.ui.tests >--
07:10:40 [2020-03-25T11:10:40.633Z] [INFO] Building org.eclipse.tracecompass.tmf.analysis.xml.ui.tests 1.0.3-SNAPSHOT [130/138]
07:10:40 [2020-03-25T11:10:40.633Z] [INFO] ------------------------[ eclipse-test-plugin ]-------------------------
07:10:40 [2020-03-25T11:10:40.633Z] [INFO] 
07:10:40 [2020-03-25T11:10:40.633Z] [INFO] --- maven-clean-plugin:3.0.0:clean (default-clean) @ org.eclipse.tracecompass.tmf.analysis.xml.ui.tests ---
07:10:40 [2020-03-25T11:10:40.633Z] [INFO] 
07:10:40 [2020-03-25T11:10:40.633Z] [INFO] --- tycho-packaging-plugin:1.3.0:build-qualifier (default-build-qualifier) @ org.eclipse.tracecompass.tmf.analysis.xml.ui.tests ---
07:10:40 [2020-03-25T11:10:40.633Z] [INFO] The project's OSGi version is 1.0.3.202003251000
07:10:40 [2020-03-25T11:10:40.633Z] [INFO] 
07:10:40 [2020-03-25T11:10:40.633Z] [INFO] --- tycho-packaging-plugin:1.3.0:validate-id (default-validate-id) @ org.eclipse.tracecompass.tmf.analysis.xml.ui.tests ---
07:10:40 [2020-03-25T11:10:40.633Z] [INFO] 
07:10:40 [2020-03-25T11:10:40.633Z] [INFO] --- tycho-packaging-plugin:1.3.0:validate-version (default-validate-version) @ org.eclipse.tracecompass.tmf.analysis.xml.ui.tests ---
07:10:40 [2020-03-25T11:10:40.633Z] [INFO] 
07:10:40 [2020-03-25T11:10:40.633Z] [INFO] --- maven-enforcer-plugin:1.4.1:enforce (enforce-maven-version) @ org.eclipse.tracecompass.tmf.analysis.xml.ui.tests ---
07:10:40 [2020-03-25T11:10:40.633Z] [INFO] 
07:10:40 [2020-03-25T11:10:40.633Z] [INFO] --- maven-resources-plugin:3.0.2:resources (default-resources) @ org.eclipse.tracecompass.tmf.analysis.xml.ui.tests ---
07:10:40 [2020-03-25T11:10:40.633Z] [INFO] Using 'UTF-8' encoding to copy filtered resources.
07:10:40 [2020-03-25T11:10:40.633Z] [INFO] skip non existing resourceDirectory /home/jenkins/agent/workspace/tracecompass-master-nightly-neon/tmf/org.eclipse.tracecompass.tmf.analysis.xml.ui.tests/src/main/resources
07:10:40 [2020-03-25T11:10:40.633Z] [INFO] 
07:10:40 [2020-03-25T11:10:40.633Z] [INFO] --- tycho-compiler-plugin:1.3.0:compile (default-compile) @ org.eclipse.tracecompass.tmf.analysis.xml.ui.tests ---
07:10:40 [2020-03-25T11:10:40.633Z] [INFO] Compiling 3 source files to /home/jenkins/agent/workspace/tracecompass-master-nightly-neon/tmf/org.eclipse.tracecompass.tmf.analysis.xml.ui.tests/target/classes
07:10:40 [2020-03-25T11:10:40.890Z] [INFO] 
07:10:40 [2020-03-25T11:10:40.890Z] [INFO] --- maven-resources-plugin:3.0.2:testResources (default-testResources) @ org.eclipse.tracecompass.tmf.analysis.xml.ui.tests ---
07:10:40 [2020-03-25T11:10:40.890Z] [INFO] Using 'UTF-8' encoding to copy filtered resources.
07:10:40 [2020-03-25T11:10:40.890Z] [INFO] skip non existing resourceDirectory /home/jenkins/agent/workspace/tracecompass-master-nightly-neon/tmf/org.eclipse.tracecompass.tmf.analysis.xml.ui.tests/src/test/resources
07:10:40 [2020-03-25T11:10:40.890Z] [INFO] 
07:10:40 [2020-03-25T11:10:40.890Z] [INFO] --- tycho-source-plugin:1.3.0:plugin-source (plugin-source) @ org.eclipse.tracecompass.tmf.analysis.xml.ui.tests ---
07:10:40 [2020-03-25T11:10:40.890Z] [INFO] Building jar: /home/jenkins/agent/workspace/tracecompass-master-nightly-neon/tmf/org.eclipse.tracecompass.tmf.analysis.xml.ui.tests/target/org.eclipse.tracecompass.tmf.analysis.xml.ui.tests-1.0.3-SNAPSHOT-sources.jar
07:10:40 [2020-03-25T11:10:40.890Z] [INFO] 
07:10:40 [2020-03-25T11:10:40.890Z] [INFO] --- target-platform-configuration:1.3.0:target-platform (default-target-platform) @ org.eclipse.tracecompass.tmf.analysis.xml.ui.tests ---
07:10:40 [2020-03-25T11:10:40.890Z] [INFO] 
07:10:40 [2020-03-25T11:10:40.890Z] [INFO] --- tycho-packaging-plugin:1.3.0:package-plugin (default-package-plugin) @ org.eclipse.tracecompass.tmf.analysis.xml.ui.tests ---
07:10:41 [2020-03-25T11:10:41.146Z] [INFO] Building jar: /home/jenkins/agent/workspace/tracecompass-master-nightly-neon/tmf/org.eclipse.tracecompass.tmf.analysis.xml.ui.tests/target/org.eclipse.tracecompass.tmf.analysis.xml.ui.tests-1.0.3-SNAPSHOT.jar
07:10:41 [2020-03-25T11:10:41.146Z] [INFO] 
07:10:41 [2020-03-25T11:10:41.146Z] [INFO] --- tycho-p2-plugin:1.3.0:p2-metadata-default (default-p2-metadata-default) @ org.eclipse.tracecompass.tmf.analysis.xml.ui.tests ---
07:10:41 [2020-03-25T11:10:41.146Z] [INFO] 
07:10:41 [2020-03-25T11:10:41.146Z] [INFO] --- tycho-source-feature-plugin:1.3.0:source-feature (source-feature) @ org.eclipse.tracecompass.tmf.analysis.xml.ui.tests ---
07:10:41 [2020-03-25T11:10:41.146Z] [INFO] 
07:10:41 [2020-03-25T11:10:41.146Z] [INFO] --- tycho-pack200b-plugin:1.3.0:pack (pack200-pack) @ org.eclipse.tracecompass.tmf.analysis.xml.ui.tests ---
07:10:41 [2020-03-25T11:10:41.146Z] [INFO] Pack200 packing jar /home/jenkins/agent/workspace/tracecompass-master-nightly-neon/tmf/org.eclipse.tracecompass.tmf.analysis.xml.ui.tests/target/org.eclipse.tracecompass.tmf.analysis.xml.ui.tests-1.0.3-SNAPSHOT.jar
07:10:41 [2020-03-25T11:10:41.146Z] [INFO] 
07:10:41 [2020-03-25T11:10:41.146Z] [INFO] --- tycho-p2-plugin:1.3.0:p2-metadata (p2-metadata) @ org.eclipse.tracecompass.tmf.analysis.xml.ui.tests ---
07:10:41 [2020-03-25T11:10:41.146Z] [INFO] 
07:10:41 [2020-03-25T11:10:41.147Z] [INFO] --- tycho-surefire-plugin:1.3.0:test (default-test) @ org.eclipse.tracecompass.tmf.analysis.xml.ui.tests ---
07:10:41 [2020-03-25T11:10:41.710Z] [INFO] Expected eclipse log file: /home/jenkins/agent/workspace/tracecompass-master-nightly-neon/tmf/org.eclipse.tracecompass.tmf.analysis.xml.ui.tests/target/work/data/.metadata/.log
07:10:41 [2020-03-25T11:10:41.710Z] [INFO] Command line:
07:10:41 [2020-03-25T11:10:41.710Z] 	[/opt/tools/java/oracle/jdk-8/1.8.0_202/jre/bin/java, -Dosgi.noShutdown=false, -Dosgi.os=linux, -Dosgi.ws=gtk, -Dosgi.arch=x86_64, -Dorg.eclipse.swt.browser.DefaultType=mozilla, -Xms512m, -Xmx1024m, -Dosgi.clean=true, -jar, /home/jenkins/.m2/repository/p2/osgi/bundle/org.eclipse.equinox.launcher/1.3.201.v20161025-1711/org.eclipse.equinox.launcher-1.3.201.v20161025-1711.jar, -data, /home/jenkins/agent/workspace/tracecompass-master-nightly-neon/tmf/org.eclipse.tracecompass.tmf.analysis.xml.ui.tests/target/work/data, -install, /home/jenkins/agent/workspace/tracecompass-master-nightly-neon/tmf/org.eclipse.tracecompass.tmf.analysis.xml.ui.tests/target/work, -configuration, /home/jenkins/agent/workspace/tracecompass-master-nightly-neon/tmf/org.eclipse.tracecompass.tmf.analysis.xml.ui.tests/target/work/configuration, -application, org.eclipse.tycho.surefire.osgibooter.uitest, -testproperties, /home/jenkins/agent/workspace/tracecompass-master-nightly-neon/tmf/org.eclipse.tracecompass.tmf.analysis.xml.ui.tests/target/surefire.properties, -product, org.eclipse.platform.ide, -consoleLog]
07:10:41 [2020-03-25T11:10:41.710Z] Picked up _JAVA_OPTIONS: -Duser.home=/home/tracecompass
07:10:44 [2020-03-25T11:10:44.986Z] !SESSION 2020-03-25 11:10:41.829 -----------------------------------------------
07:10:44 [2020-03-25T11:10:44.986Z] eclipse.buildId=unknown
07:10:44 [2020-03-25T11:10:44.986Z] java.version=1.8.0_202
07:10:44 [2020-03-25T11:10:44.986Z] java.vendor=Oracle Corporation
07:10:44 [2020-03-25T11:10:44.986Z] BootLoader constants: OS=linux, ARCH=x86_64, WS=gtk, NL=en_US
07:10:44 [2020-03-25T11:10:44.986Z] Framework arguments:  -application org.eclipse.tycho.surefire.osgibooter.uitest -testproperties /home/jenkins/agent/workspace/tracecompass-master-nightly-neon/tmf/org.eclipse.tracecompass.tmf.analysis.xml.ui.tests/target/surefire.properties -product org.eclipse.platform.ide
07:10:44 [2020-03-25T11:10:44.986Z] Command-line arguments:  -data /home/jenkins/agent/workspace/tracecompass-master-nightly-neon/tmf/org.eclipse.tracecompass.tmf.analysis.xml.ui.tests/target/work/data -application org.eclipse.tycho.surefire.osgibooter.uitest -testproperties /home/jenkins/agent/workspace/tracecompass-master-nightly-neon/tmf/org.eclipse.tracecompass.tmf.analysis.xml.ui.tests/target/surefire.properties -product org.eclipse.platform.ide -consoleLog
07:10:44 [2020-03-25T11:10:44.986Z] 
07:10:44 [2020-03-25T11:10:44.986Z] !ENTRY org.eclipse.compare.win32 4 0 2020-03-25 11:10:44.626
07:10:44 [2020-03-25T11:10:44.986Z] !MESSAGE FrameworkEvent ERROR
07:10:44 [2020-03-25T11:10:44.986Z] !STACK 0
07:10:44 [2020-03-25T11:10:44.986Z] org.osgi.framework.BundleException: Could not resolve module: org.eclipse.compare.win32 [54]
07:10:44 [2020-03-25T11:10:44.986Z]   Unresolved requirement: Require-Capability: eclipse.platform; filter:="(osgi.os=win32)"
07:10:44 [2020-03-25T11:10:44.986Z] 
07:10:44 [2020-03-25T11:10:44.986Z] 	at org.eclipse.osgi.container.Module.start(Module.java:444)
07:10:44 [2020-03-25T11:10:44.986Z] 	at org.eclipse.osgi.container.ModuleContainer$ContainerStartLevel.incStartLevel(ModuleContainer.java:1620)
07:10:44 [2020-03-25T11:10:44.986Z] 	at org.eclipse.osgi.container.ModuleContainer$ContainerStartLevel.incStartLevel(ModuleContainer.java:1599)
07:10:44 [2020-03-25T11:10:44.986Z] 	at org.eclipse.osgi.container.ModuleContainer$ContainerStartLevel.doContainerStartLevel(ModuleContainer.java:1571)
07:10:44 [2020-03-25T11:10:44.986Z] 	at org.eclipse.osgi.container.ModuleContainer$ContainerStartLevel.dispatchEvent(ModuleContainer.java:1514)
07:10:44 [2020-03-25T11:10:44.986Z] 	at org.eclipse.osgi.container.ModuleContainer$ContainerStartLevel.dispatchEvent(ModuleContainer.java:1)
07:10:44 [2020-03-25T11:10:44.986Z] 	at org.eclipse.osgi.framework.eventmgr.EventManager.dispatchEvent(EventManager.java:230)
07:10:44 [2020-03-25T11:10:44.986Z] 	at org.eclipse.osgi.framework.eventmgr.EventManager$EventThread.run(EventManager.java:340)
07:10:46 [2020-03-25T11:10:46.880Z] process 19531: D-Bus library appears to be incorrectly set up; failed to read machine uuid: UUID file '/etc/machine-id' should contain a hex string of length 32, not length 0, with no other text
07:10:46 [2020-03-25T11:10:46.880Z] See the manual page for dbus-uuidgen to correct this issue.
07:10:56 [2020-03-25T11:10:56.981Z] Running org.eclipse.tracecompass.tmf.analysis.xml.ui.tests.XmlAnalysisUiPluginTest
07:10:56 [2020-03-25T11:10:56.981Z] Tests run: 2, Failures: 0, Errors: 0, Skipped: 0, Time elapsed: 0.028 s - in org.eclipse.tracecompass.tmf.analysis.xml.ui.tests.XmlAnalysisUiPluginTest
07:10:56 [2020-03-25T11:10:56.981Z] testTmfCorePluginId(org.eclipse.tracecompass.tmf.analysis.xml.ui.tests.XmlAnalysisUiPluginTest)  Time elapsed: 0.001 s
07:10:56 [2020-03-25T11:10:56.981Z] testGetDefault(org.eclipse.tracecompass.tmf.analysis.xml.ui.tests.XmlAnalysisUiPluginTest)  Time elapsed: 0 s
07:10:56 [2020-03-25T11:10:56.981Z] Running org.eclipse.tracecompass.tmf.analysis.xml.ui.tests.module.XmlAnalysisOutputSourceTest
07:10:57 [2020-03-25T11:10:57.239Z] Tests run: 1, Failures: 0, Errors: 0, Skipped: 0, Time elapsed: 0.292 s - in org.eclipse.tracecompass.tmf.analysis.xml.ui.tests.module.XmlAnalysisOutputSourceTest
07:10:57 [2020-03-25T11:10:57.239Z] testBuiltinOutput(org.eclipse.tracecompass.tmf.analysis.xml.ui.tests.module.XmlAnalysisOutputSourceTest)  Time elapsed: 0.292 s
07:10:57 [2020-03-25T11:10:57.239Z] 
07:10:57 [2020-03-25T11:10:57.239Z] Results:
07:10:57 [2020-03-25T11:10:57.239Z] 
07:10:57 [2020-03-25T11:10:57.239Z] Tests run: 3, Failures: 0, Errors: 0, Skipped: 0
07:10:57 [2020-03-25T11:10:57.239Z] 
07:10:57 [2020-03-25T11:10:57.496Z] 
07:10:57 [2020-03-25T11:10:57.496Z] !ENTRY org.eclipse.tracecompass.tmf.core 4 0 2020-03-25 11:10:57.322
07:10:57 [2020-03-25T11:10:57.496Z] !MESSAGE Unexpected error executing analysis with trace 
07:10:57 [2020-03-25T11:10:57.496Z] !STACK 0
07:10:57 [2020-03-25T11:10:57.496Z] java.lang.NullPointerException
07:10:57 [2020-03-25T11:10:57.496Z] 	at java.io.File.<init>(File.java:277)
07:10:57 [2020-03-25T11:10:57.496Z] 	at org.eclipse.tracecompass.tmf.core.statesystem.TmfStateSystemAnalysisModule.loadInitialState(TmfStateSystemAnalysisModule.java:580)
07:10:57 [2020-03-25T11:10:57.496Z] 	at org.eclipse.tracecompass.tmf.core.statesystem.TmfStateSystemAnalysisModule.build(TmfStateSystemAnalysisModule.java:528)
07:10:57 [2020-03-25T11:10:57.496Z] 	at org.eclipse.tracecompass.tmf.core.statesystem.TmfStateSystemAnalysisModule.createFullHistory(TmfStateSystemAnalysisModule.java:376)
07:10:57 [2020-03-25T11:10:57.496Z] 	at org.eclipse.tracecompass.tmf.core.statesystem.TmfStateSystemAnalysisModule.executeAnalysis(TmfStateSystemAnalysisModule.java:282)
07:10:57 [2020-03-25T11:10:57.496Z] 	at org.eclipse.tracecompass.tmf.core.analysis.TmfAbstractAnalysisModule$1.run(TmfAbstractAnalysisModule.java:398)
07:10:57 [2020-03-25T11:10:57.496Z] 	at org.eclipse.core.internal.jobs.Worker.run(Worker.java:55)
07:10:57 [2020-03-25T11:10:57.496Z] 
07:10:57 [2020-03-25T11:10:57.496Z] !ENTRY org.eclipse.tracecompass.tmf.core 4 0 2020-03-25 11:10:57.323
07:10:57 [2020-03-25T11:10:57.496Z] !MESSAGE Unexpected error executing analysis with trace 
07:10:57 [2020-03-25T11:10:57.496Z] !STACK 0
07:10:57 [2020-03-25T11:10:57.496Z] java.lang.NullPointerException
07:10:57 [2020-03-25T11:10:57.496Z] 	at java.io.File.<init>(File.java:277)
07:10:57 [2020-03-25T11:10:57.496Z] 	at org.eclipse.tracecompass.tmf.core.statesystem.TmfStateSystemAnalysisModule.loadInitialState(TmfStateSystemAnalysisModule.java:580)
07:10:57 [2020-03-25T11:10:57.496Z] 	at org.eclipse.tracecompass.tmf.core.statesystem.TmfStateSystemAnalysisModule.build(TmfStateSystemAnalysisModule.java:528)
07:10:57 [2020-03-25T11:10:57.496Z] 	at org.eclipse.tracecompass.tmf.core.statesystem.TmfStateSystemAnalysisModule.createFullHistory(TmfStateSystemAnalysisModule.java:376)
07:10:57 [2020-03-25T11:10:57.496Z] 	at org.eclipse.tracecompass.tmf.core.statesystem.TmfStateSystemAnalysisModule.executeAnalysis(TmfStateSystemAnalysisModule.java:282)
07:10:57 [2020-03-25T11:10:57.496Z] 	at org.eclipse.tracecompass.tmf.core.analysis.TmfAbstractAnalysisModule$1.run(TmfAbstractAnalysisModule.java:398)
07:10:57 [2020-03-25T11:10:57.496Z] 	at org.eclipse.core.internal.jobs.Worker.run(Worker.java:55)
07:10:57 [2020-03-25T11:10:57.496Z] 
07:10:57 [2020-03-25T11:10:57.496Z] !ENTRY org.eclipse.tracecompass.tmf.core 4 0 2020-03-25 11:10:57.330
07:10:57 [2020-03-25T11:10:57.496Z] !MESSAGE Exception executing analysis
07:10:57 [2020-03-25T11:10:57.496Z] !STACK 0
07:10:57 [2020-03-25T11:10:57.496Z] java.lang.NullPointerException
07:10:57 [2020-03-25T11:10:57.496Z] 	at java.io.File.<init>(File.java:277)
07:10:57 [2020-03-25T11:10:57.496Z] 	at org.eclipse.tracecompass.tmf.core.statesystem.TmfStateSystemAnalysisModule.loadInitialState(TmfStateSystemAnalysisModule.java:580)
07:10:57 [2020-03-25T11:10:57.496Z] 	at org.eclipse.tracecompass.tmf.core.statesystem.TmfStateSystemAnalysisModule.build(TmfStateSystemAnalysisModule.java:528)
07:10:57 [2020-03-25T11:10:57.496Z] 	at org.eclipse.tracecompass.tmf.core.statesystem.TmfStateSystemAnalysisModule.createFullHistory(TmfStateSystemAnalysisModule.java:376)
07:10:57 [2020-03-25T11:10:57.496Z] 	at org.eclipse.tracecompass.tmf.core.statesystem.TmfStateSystemAnalysisModule.executeAnalysis(TmfStateSystemAnalysisModule.java:282)
07:10:57 [2020-03-25T11:10:57.496Z] 	at org.eclipse.tracecompass.tmf.core.analysis.TmfAbstractAnalysisModule$1.run(TmfAbstractAnalysisModule.java:398)
07:10:57 [2020-03-25T11:10:57.496Z] 	at org.eclipse.core.internal.jobs.Worker.run(Worker.java:55)
07:10:57 [2020-03-25T11:10:57.496Z] 
07:10:57 [2020-03-25T11:10:57.496Z] !ENTRY org.eclipse.tracecompass.tmf.core 4 0 2020-03-25 11:10:57.331
07:10:57 [2020-03-25T11:10:57.496Z] !MESSAGE Exception executing analysis
07:10:57 [2020-03-25T11:10:57.496Z] !STACK 0
07:10:57 [2020-03-25T11:10:57.496Z] java.lang.NullPointerException
07:10:57 [2020-03-25T11:10:57.496Z] 	at java.io.File.<init>(File.java:277)
07:10:57 [2020-03-25T11:10:57.497Z] 	at org.eclipse.tracecompass.tmf.core.statesystem.TmfStateSystemAnalysisModule.loadInitialState(TmfStateSystemAnalysisModule.java:580)
07:10:57 [2020-03-25T11:10:57.497Z] 	at org.eclipse.tracecompass.tmf.core.statesystem.TmfStateSystemAnalysisModule.build(TmfStateSystemAnalysisModule.java:528)
07:10:57 [2020-03-25T11:10:57.497Z] 	at org.eclipse.tracecompass.tmf.core.statesystem.TmfStateSystemAnalysisModule.createFullHistory(TmfStateSystemAnalysisModule.java:376)
07:10:57 [2020-03-25T11:10:57.497Z] 	at org.eclipse.tracecompass.tmf.core.statesystem.TmfStateSystemAnalysisModule.executeAnalysis(TmfStateSystemAnalysisModule.java:282)
07:10:57 [2020-03-25T11:10:57.497Z] 	at org.eclipse.tracecompass.tmf.core.analysis.TmfAbstractAnalysisModule$1.run(TmfAbstractAnalysisModule.java:398)
07:10:57 [2020-03-25T11:10:57.497Z] 	at org.eclipse.core.internal.jobs.Worker.run(Worker.java:55)
07:10:58 [2020-03-25T11:10:58.427Z] 
07:10:58 [2020-03-25T11:10:58.427Z] !ENTRY org.eclipse.e4.ui.workbench 4 0 2020-03-25 11:10:58.258
07:10:58 [2020-03-25T11:10:58.427Z] !MESSAGE FrameworkEvent ERROR
07:10:58 [2020-03-25T11:10:58.427Z] !STACK 0
07:10:58 [2020-03-25T11:10:58.427Z] org.eclipse.swt.SWTException: Invalid thread access
07:10:58 [2020-03-25T11:10:58.427Z] 	at org.eclipse.swt.SWT.error(SWT.java:4533)
07:10:58 [2020-03-25T11:10:58.427Z] 	at org.eclipse.swt.SWT.error(SWT.java:4448)
07:10:58 [2020-03-25T11:10:58.427Z] 	at org.eclipse.swt.SWT.error(SWT.java:4419)
07:10:58 [2020-03-25T11:10:58.427Z] 	at org.eclipse.swt.widgets.Widget.error(Widget.java:483)
07:10:58 [2020-03-25T11:10:58.427Z] 	at org.eclipse.swt.widgets.Widget.checkWidget(Widget.java:421)
07:10:58 [2020-03-25T11:10:58.427Z] 	at org.eclipse.swt.widgets.Widget.getData(Widget.java:509)
07:10:58 [2020-03-25T11:10:58.427Z] 	at org.eclipse.ui.internal.ide.handlers.PagePropertyTester.test(PagePropertyTester.java:36)
07:10:58 [2020-03-25T11:10:58.427Z] 	at org.eclipse.core.internal.expressions.Property.test(Property.java:58)
07:10:58 [2020-03-25T11:10:58.427Z] 	at org.eclipse.core.internal.expressions.TestExpression.evaluate(TestExpression.java:100)
07:10:58 [2020-03-25T11:10:58.427Z] 	at org.eclipse.core.internal.expressions.CompositeExpression.evaluateAnd(CompositeExpression.java:53)
07:10:58 [2020-03-25T11:10:58.427Z] 	at org.eclipse.core.internal.expressions.WithExpression.evaluate(WithExpression.java:75)
07:10:58 [2020-03-25T11:10:58.427Z] 	at org.eclipse.core.internal.expressions.CompositeExpression.evaluateOr(CompositeExpression.java:68)
07:10:58 [2020-03-25T11:10:58.427Z] 	at org.eclipse.core.internal.expressions.OrExpression.evaluate(OrExpression.java:22)
07:10:58 [2020-03-25T11:10:58.427Z] 	at org.eclipse.core.internal.expressions.ReferenceExpression.evaluate(ReferenceExpression.java:71)
07:10:58 [2020-03-25T11:10:58.427Z] 	at org.eclipse.ui.internal.services.EvaluationReference.evaluate(EvaluationReference.java:72)
07:10:58 [2020-03-25T11:10:58.427Z] 	at org.eclipse.ui.internal.services.EvaluationReference.evaluate(EvaluationReference.java:97)
07:10:58 [2020-03-25T11:10:58.427Z] 	at org.eclipse.ui.internal.services.EvaluationReference.changed(EvaluationReference.java:91)
07:10:58 [2020-03-25T11:10:58.427Z] 	at org.eclipse.e4.core.internal.contexts.TrackableComputationExt.update(TrackableComputationExt.java:114)
07:10:58 [2020-03-25T11:10:58.427Z] 	at org.eclipse.e4.core.internal.contexts.EclipseContext.processScheduled(EclipseContext.java:344)
07:10:58 [2020-03-25T11:10:58.427Z] 	at org.eclipse.e4.core.internal.contexts.EclipseContext.set(EclipseContext.java:359)
07:10:58 [2020-03-25T11:10:58.427Z] 	at org.eclipse.e4.core.internal.contexts.EclipseContext.dispose(EclipseContext.java:198)
07:10:58 [2020-03-25T11:10:58.427Z] 	at org.eclipse.e4.core.internal.contexts.EclipseContext.dispose(EclipseContext.java:161)
07:10:58 [2020-03-25T11:10:58.427Z] 	at org.eclipse.e4.core.internal.contexts.osgi.EclipseContextOSGi.dispose(EclipseContextOSGi.java:106)
07:10:58 [2020-03-25T11:10:58.427Z] 	at org.eclipse.e4.core.internal.contexts.osgi.EclipseContextOSGi.bundleChanged(EclipseContextOSGi.java:139)
07:10:58 [2020-03-25T11:10:58.427Z] 	at org.eclipse.osgi.internal.framework.BundleContextImpl.dispatchEvent(BundleContextImpl.java:903)
07:10:58 [2020-03-25T11:10:58.427Z] 	at org.eclipse.osgi.framework.eventmgr.EventManager.dispatchEvent(EventManager.java:230)
07:10:58 [2020-03-25T11:10:58.427Z] 	at org.eclipse.osgi.framework.eventmgr.ListenerQueue.dispatchEventSynchronous(ListenerQueue.java:148)
07:10:58 [2020-03-25T11:10:58.427Z] 	at org.eclipse.osgi.internal.framework.EquinoxEventPublisher.publishBundleEventPrivileged(EquinoxEventPublisher.java:213)
07:10:58 [2020-03-25T11:10:58.427Z] 	at org.eclipse.osgi.internal.framework.EquinoxEventPublisher.publishBundleEvent(EquinoxEventPublisher.java:120)
07:10:58 [2020-03-25T11:10:58.427Z] 	at org.eclipse.osgi.internal.framework.EquinoxEventPublisher.publishBundleEvent(EquinoxEventPublisher.java:112)
07:10:58 [2020-03-25T11:10:58.427Z] 	at org.eclipse.osgi.internal.framework.EquinoxContainerAdaptor.publishModuleEvent(EquinoxContainerAdaptor.java:156)
07:10:58 [2020-03-25T11:10:58.427Z] 	at org.eclipse.osgi.container.Module.publishEvent(Module.java:476)
07:10:58 [2020-03-25T11:10:58.427Z] 	at org.eclipse.osgi.container.Module.doStop(Module.java:634)
07:10:58 [2020-03-25T11:10:58.427Z] 	at org.eclipse.osgi.container.Module.stop(Module.java:498)
07:10:58 [2020-03-25T11:10:58.427Z] 	at org.eclipse.osgi.container.SystemModule.stop(SystemModule.java:202)
07:10:58 [2020-03-25T11:10:58.427Z] 	at org.eclipse.osgi.internal.framework.EquinoxBundle$SystemBundle$EquinoxSystemModule$1.run(EquinoxBundle.java:165)
07:10:58 [2020-03-25T11:10:58.427Z] 	at java.lang.Thread.run(Thread.java:748)
07:10:59 [2020-03-25T11:10:59.358Z] [INFO] All tests passed!
07:10:59 [2020-03-25T11:10:59.358Z] [INFO] 
07:10:59 [2020-03-25T11:10:59.358Z] [INFO] --- maven-install-plugin:2.5.2:install (default-install) @ org.eclipse.tracecompass.tmf.analysis.xml.ui.tests ---
07:10:59 [2020-03-25T11:10:59.358Z] [INFO] Installing /home/jenkins/agent/workspace/tracecompass-master-nightly-neon/tmf/org.eclipse.tracecompass.tmf.analysis.xml.ui.tests/target/org.eclipse.tracecompass.tmf.analysis.xml.ui.tests-1.0.3-SNAPSHOT.jar to /home/jenkins/.m2/repository/org/eclipse/tracecompass/org.eclipse.tracecompass.tmf.analysis.xml.ui.tests/1.0.3-SNAPSHOT/org.eclipse.tracecompass.tmf.analysis.xml.ui.tests-1.0.3-SNAPSHOT.jar
07:10:59 [2020-03-25T11:10:59.358Z] [INFO] Installing /home/jenkins/agent/workspace/tracecompass-master-nightly-neon/tmf/org.eclipse.tracecompass.tmf.analysis.xml.ui.tests/pom.xml to /home/jenkins/.m2/repository/org/eclipse/tracecompass/org.eclipse.tracecompass.tmf.analysis.xml.ui.tests/1.0.3-SNAPSHOT/org.eclipse.tracecompass.tmf.analysis.xml.ui.tests-1.0.3-SNAPSHOT.pom
07:10:59 [2020-03-25T11:10:59.358Z] [INFO] Installing /home/jenkins/agent/workspace/tracecompass-master-nightly-neon/tmf/org.eclipse.tracecompass.tmf.analysis.xml.ui.tests/target/org.eclipse.tracecompass.tmf.analysis.xml.ui.tests-1.0.3-SNAPSHOT-sources.jar to /home/jenkins/.m2/repository/org/eclipse/tracecompass/org.eclipse.tracecompass.tmf.analysis.xml.ui.tests/1.0.3-SNAPSHOT/org.eclipse.tracecompass.tmf.analysis.xml.ui.tests-1.0.3-SNAPSHOT-sources.jar
07:10:59 [2020-03-25T11:10:59.358Z] [INFO] Installing /home/jenkins/agent/workspace/tracecompass-master-nightly-neon/tmf/org.eclipse.tracecompass.tmf.analysis.xml.ui.tests/target/org.eclipse.tracecompass.tmf.analysis.xml.ui.tests-1.0.3-SNAPSHOT.jar.pack.gz to /home/jenkins/.m2/repository/org/eclipse/tracecompass/org.eclipse.tracecompass.tmf.analysis.xml.ui.tests/1.0.3-SNAPSHOT/org.eclipse.tracecompass.tmf.analysis.xml.ui.tests-1.0.3-SNAPSHOT-pack200.jar.pack.gz
07:10:59 [2020-03-25T11:10:59.358Z] [INFO] Installing /home/jenkins/agent/workspace/tracecompass-master-nightly-neon/tmf/org.eclipse.tracecompass.tmf.analysis.xml.ui.tests/target/p2content.xml to /home/jenkins/.m2/repository/org/eclipse/tracecompass/org.eclipse.tracecompass.tmf.analysis.xml.ui.tests/1.0.3-SNAPSHOT/org.eclipse.tracecompass.tmf.analysis.xml.ui.tests-1.0.3-SNAPSHOT-p2metadata.xml
07:10:59 [2020-03-25T11:10:59.358Z] [INFO] Installing /home/jenkins/agent/workspace/tracecompass-master-nightly-neon/tmf/org.eclipse.tracecompass.tmf.analysis.xml.ui.tests/target/p2artifacts.xml to /home/jenkins/.m2/repository/org/eclipse/tracecompass/org.eclipse.tracecompass.tmf.analysis.xml.ui.tests/1.0.3-SNAPSHOT/org.eclipse.tracecompass.tmf.analysis.xml.ui.tests-1.0.3-SNAPSHOT-p2artifacts.xml
07:10:59 [2020-03-25T11:10:59.358Z] [INFO] 
07:10:59 [2020-03-25T11:10:59.358Z] [INFO] --- tycho-p2-plugin:1.3.0:update-local-index (default-update-local-index) @ org.eclipse.tracecompass.tmf.analysis.xml.ui.tests ---
07:10:59 [2020-03-25T11:10:59.358Z] [INFO] 
07:10:59 [2020-03-25T11:10:59.358Z] [INFO] --< org.eclipse.tracecompass:org.eclipse.tracecompass.tmf.chart.ui.tests >--
07:10:59 [2020-03-25T11:10:59.358Z] [INFO] Building org.eclipse.tracecompass.tmf.chart.ui.tests 1.0.1-SNAPSHOT [131/138]
07:10:59 [2020-03-25T11:10:59.358Z] [INFO] ------------------------[ eclipse-test-plugin ]-------------------------
07:10:59 [2020-03-25T11:10:59.358Z] [INFO] 
07:10:59 [2020-03-25T11:10:59.358Z] [INFO] --- maven-clean-plugin:3.0.0:clean (default-clean) @ org.eclipse.tracecompass.tmf.chart.ui.tests ---
07:10:59 [2020-03-25T11:10:59.615Z] [INFO] 
07:10:59 [2020-03-25T11:10:59.615Z] [INFO] --- tycho-packaging-plugin:1.3.0:build-qualifier (default-build-qualifier) @ org.eclipse.tracecompass.tmf.chart.ui.tests ---
07:10:59 [2020-03-25T11:10:59.615Z] [INFO] The project's OSGi version is 1.0.1.202003251000
07:10:59 [2020-03-25T11:10:59.615Z] [INFO] 
07:10:59 [2020-03-25T11:10:59.615Z] [INFO] --- tycho-packaging-plugin:1.3.0:validate-id (default-validate-id) @ org.eclipse.tracecompass.tmf.chart.ui.tests ---
07:10:59 [2020-03-25T11:10:59.615Z] [INFO] 
07:10:59 [2020-03-25T11:10:59.615Z] [INFO] --- tycho-packaging-plugin:1.3.0:validate-version (default-validate-version) @ org.eclipse.tracecompass.tmf.chart.ui.tests ---
07:10:59 [2020-03-25T11:10:59.615Z] [INFO] 
07:10:59 [2020-03-25T11:10:59.615Z] [INFO] --- maven-enforcer-plugin:1.4.1:enforce (enforce-maven-version) @ org.eclipse.tracecompass.tmf.chart.ui.tests ---
07:10:59 [2020-03-25T11:10:59.615Z] [INFO] 
07:10:59 [2020-03-25T11:10:59.615Z] [INFO] --- maven-resources-plugin:3.0.2:resources (default-resources) @ org.eclipse.tracecompass.tmf.chart.ui.tests ---
07:10:59 [2020-03-25T11:10:59.615Z] [INFO] Using 'UTF-8' encoding to copy filtered resources.
07:10:59 [2020-03-25T11:10:59.615Z] [INFO] skip non existing resourceDirectory /home/jenkins/agent/workspace/tracecompass-master-nightly-neon/tmf/org.eclipse.tracecompass.tmf.chart.ui.tests/src/main/resources
07:10:59 [2020-03-25T11:10:59.615Z] [INFO] 
07:10:59 [2020-03-25T11:10:59.615Z] [INFO] --- tycho-compiler-plugin:1.3.0:compile (default-compile) @ org.eclipse.tracecompass.tmf.chart.ui.tests ---
07:10:59 [2020-03-25T11:10:59.615Z] [INFO] Compiling 2 source files to /home/jenkins/agent/workspace/tracecompass-master-nightly-neon/tmf/org.eclipse.tracecompass.tmf.chart.ui.tests/target/classes
07:10:59 [2020-03-25T11:10:59.872Z] [INFO] 
07:10:59 [2020-03-25T11:10:59.872Z] [INFO] --- maven-resources-plugin:3.0.2:testResources (default-testResources) @ org.eclipse.tracecompass.tmf.chart.ui.tests ---
07:10:59 [2020-03-25T11:10:59.872Z] [INFO] Using 'UTF-8' encoding to copy filtered resources.
07:10:59 [2020-03-25T11:10:59.872Z] [INFO] skip non existing resourceDirectory /home/jenkins/agent/workspace/tracecompass-master-nightly-neon/tmf/org.eclipse.tracecompass.tmf.chart.ui.tests/src/test/resources
07:10:59 [2020-03-25T11:10:59.872Z] [INFO] 
07:10:59 [2020-03-25T11:10:59.872Z] [INFO] --- tycho-source-plugin:1.3.0:plugin-source (plugin-source) @ org.eclipse.tracecompass.tmf.chart.ui.tests ---
07:10:59 [2020-03-25T11:10:59.872Z] [INFO] Building jar: /home/jenkins/agent/workspace/tracecompass-master-nightly-neon/tmf/org.eclipse.tracecompass.tmf.chart.ui.tests/target/org.eclipse.tracecompass.tmf.chart.ui.tests-1.0.1-SNAPSHOT-sources.jar
07:10:59 [2020-03-25T11:10:59.872Z] [INFO] 
07:10:59 [2020-03-25T11:10:59.872Z] [INFO] --- target-platform-configuration:1.3.0:target-platform (default-target-platform) @ org.eclipse.tracecompass.tmf.chart.ui.tests ---
07:10:59 [2020-03-25T11:10:59.872Z] [INFO] 
07:10:59 [2020-03-25T11:10:59.872Z] [INFO] --- tycho-packaging-plugin:1.3.0:package-plugin (default-package-plugin) @ org.eclipse.tracecompass.tmf.chart.ui.tests ---
07:10:59 [2020-03-25T11:10:59.872Z] [INFO] Building jar: /home/jenkins/agent/workspace/tracecompass-master-nightly-neon/tmf/org.eclipse.tracecompass.tmf.chart.ui.tests/target/org.eclipse.tracecompass.tmf.chart.ui.tests-1.0.1-SNAPSHOT.jar
07:10:59 [2020-03-25T11:10:59.872Z] [INFO] 
07:10:59 [2020-03-25T11:10:59.872Z] [INFO] --- tycho-p2-plugin:1.3.0:p2-metadata-default (default-p2-metadata-default) @ org.eclipse.tracecompass.tmf.chart.ui.tests ---
07:10:59 [2020-03-25T11:10:59.872Z] [INFO] 
07:10:59 [2020-03-25T11:10:59.872Z] [INFO] --- tycho-source-feature-plugin:1.3.0:source-feature (source-feature) @ org.eclipse.tracecompass.tmf.chart.ui.tests ---
07:10:59 [2020-03-25T11:10:59.872Z] [INFO] 
07:10:59 [2020-03-25T11:10:59.872Z] [INFO] --- tycho-pack200b-plugin:1.3.0:pack (pack200-pack) @ org.eclipse.tracecompass.tmf.chart.ui.tests ---
07:10:59 [2020-03-25T11:10:59.872Z] [INFO] Pack200 packing jar /home/jenkins/agent/workspace/tracecompass-master-nightly-neon/tmf/org.eclipse.tracecompass.tmf.chart.ui.tests/target/org.eclipse.tracecompass.tmf.chart.ui.tests-1.0.1-SNAPSHOT.jar
07:10:59 [2020-03-25T11:10:59.872Z] [INFO] 
07:10:59 [2020-03-25T11:10:59.872Z] [INFO] --- tycho-p2-plugin:1.3.0:p2-metadata (p2-metadata) @ org.eclipse.tracecompass.tmf.chart.ui.tests ---
07:10:59 [2020-03-25T11:10:59.872Z] [INFO] 
07:10:59 [2020-03-25T11:10:59.872Z] [INFO] --- tycho-surefire-plugin:1.3.0:test (default-test) @ org.eclipse.tracecompass.tmf.chart.ui.tests ---
07:11:00 [2020-03-25T11:11:00.436Z] [INFO] Expected eclipse log file: /home/jenkins/agent/workspace/tracecompass-master-nightly-neon/tmf/org.eclipse.tracecompass.tmf.chart.ui.tests/target/work/data/.metadata/.log
07:11:00 [2020-03-25T11:11:00.436Z] [INFO] Command line:
07:11:00 [2020-03-25T11:11:00.436Z] 	[/opt/tools/java/oracle/jdk-8/1.8.0_202/jre/bin/java, -Dosgi.noShutdown=false, -Dosgi.os=linux, -Dosgi.ws=gtk, -Dosgi.arch=x86_64, -Dorg.eclipse.swt.browser.DefaultType=mozilla, -Xms512m, -Xmx1024m, -Dosgi.clean=true, -jar, /home/jenkins/.m2/repository/p2/osgi/bundle/org.eclipse.equinox.launcher/1.3.201.v20161025-1711/org.eclipse.equinox.launcher-1.3.201.v20161025-1711.jar, -data, /home/jenkins/agent/workspace/tracecompass-master-nightly-neon/tmf/org.eclipse.tracecompass.tmf.chart.ui.tests/target/work/data, -install, /home/jenkins/agent/workspace/tracecompass-master-nightly-neon/tmf/org.eclipse.tracecompass.tmf.chart.ui.tests/target/work, -configuration, /home/jenkins/agent/workspace/tracecompass-master-nightly-neon/tmf/org.eclipse.tracecompass.tmf.chart.ui.tests/target/work/configuration, -application, org.eclipse.tycho.surefire.osgibooter.uitest, -testproperties, /home/jenkins/agent/workspace/tracecompass-master-nightly-neon/tmf/org.eclipse.tracecompass.tmf.chart.ui.tests/target/surefire.properties, -product, org.eclipse.platform.ide, -consoleLog]
07:11:00 [2020-03-25T11:11:00.436Z] Picked up _JAVA_OPTIONS: -Duser.home=/home/tracecompass
07:11:02 [2020-03-25T11:11:02.957Z] !SESSION 2020-03-25 11:11:00.444 -----------------------------------------------
07:11:02 [2020-03-25T11:11:02.957Z] eclipse.buildId=unknown
07:11:02 [2020-03-25T11:11:02.957Z] java.version=1.8.0_202
07:11:02 [2020-03-25T11:11:02.957Z] java.vendor=Oracle Corporation
07:11:02 [2020-03-25T11:11:02.957Z] BootLoader constants: OS=linux, ARCH=x86_64, WS=gtk, NL=en_US
07:11:02 [2020-03-25T11:11:02.957Z] Framework arguments:  -application org.eclipse.tycho.surefire.osgibooter.uitest -testproperties /home/jenkins/agent/workspace/tracecompass-master-nightly-neon/tmf/org.eclipse.tracecompass.tmf.chart.ui.tests/target/surefire.properties -product org.eclipse.platform.ide
07:11:02 [2020-03-25T11:11:02.957Z] Command-line arguments:  -data /home/jenkins/agent/workspace/tracecompass-master-nightly-neon/tmf/org.eclipse.tracecompass.tmf.chart.ui.tests/target/work/data -application org.eclipse.tycho.surefire.osgibooter.uitest -testproperties /home/jenkins/agent/workspace/tracecompass-master-nightly-neon/tmf/org.eclipse.tracecompass.tmf.chart.ui.tests/target/surefire.properties -product org.eclipse.platform.ide -consoleLog
07:11:02 [2020-03-25T11:11:02.957Z] 
07:11:02 [2020-03-25T11:11:02.957Z] !ENTRY org.eclipse.compare.win32 4 0 2020-03-25 11:11:02.945
07:11:02 [2020-03-25T11:11:02.957Z] !MESSAGE FrameworkEvent ERROR
07:11:02 [2020-03-25T11:11:02.957Z] !STACK 0
07:11:02 [2020-03-25T11:11:02.957Z] org.osgi.framework.BundleException: Could not resolve module: org.eclipse.compare.win32 [54]
07:11:02 [2020-03-25T11:11:02.957Z]   Unresolved requirement: Require-Capability: eclipse.platform; filter:="(osgi.os=win32)"
07:11:02 [2020-03-25T11:11:02.957Z] 
07:11:02 [2020-03-25T11:11:02.957Z] 	at org.eclipse.osgi.container.Module.start(Module.java:444)
07:11:02 [2020-03-25T11:11:02.957Z] 	at org.eclipse.osgi.container.ModuleContainer$ContainerStartLevel.incStartLevel(ModuleContainer.java:1620)
07:11:02 [2020-03-25T11:11:02.957Z] 	at org.eclipse.osgi.container.ModuleContainer$ContainerStartLevel.incStartLevel(ModuleContainer.java:1599)
07:11:02 [2020-03-25T11:11:02.957Z] 	at org.eclipse.osgi.container.ModuleContainer$ContainerStartLevel.doContainerStartLevel(ModuleContainer.java:1571)
07:11:02 [2020-03-25T11:11:02.957Z] 	at org.eclipse.osgi.container.ModuleContainer$ContainerStartLevel.dispatchEvent(ModuleContainer.java:1514)
07:11:02 [2020-03-25T11:11:02.957Z] 	at org.eclipse.osgi.container.ModuleContainer$ContainerStartLevel.dispatchEvent(ModuleContainer.java:1)
07:11:02 [2020-03-25T11:11:02.957Z] 	at org.eclipse.osgi.framework.eventmgr.EventManager.dispatchEvent(EventManager.java:230)
07:11:02 [2020-03-25T11:11:02.957Z] 	at org.eclipse.osgi.framework.eventmgr.EventManager$EventThread.run(EventManager.java:340)
07:11:05 [2020-03-25T11:11:05.480Z] process 19590: D-Bus library appears to be incorrectly set up; failed to read machine uuid: UUID file '/etc/machine-id' should contain a hex string of length 32, not length 0, with no other text
07:11:05 [2020-03-25T11:11:05.480Z] See the manual page for dbus-uuidgen to correct this issue.
07:11:17 [2020-03-25T11:11:17.667Z] Running org.eclipse.tracecompass.tmf.chart.ui.tests.data.ChartRangeTest
07:11:17 [2020-03-25T11:11:17.667Z] Tests run: 4, Failures: 0, Errors: 0, Skipped: 0, Time elapsed: 0.065 s - in org.eclipse.tracecompass.tmf.chart.ui.tests.data.ChartRangeTest
07:11:17 [2020-03-25T11:11:17.667Z] testClamp(org.eclipse.tracecompass.tmf.chart.ui.tests.data.ChartRangeTest)  Time elapsed: 0.004 s
07:11:17 [2020-03-25T11:11:17.667Z] testInvalidConstructor(org.eclipse.tracecompass.tmf.chart.ui.tests.data.ChartRangeTest)  Time elapsed: 0.001 s
07:11:17 [2020-03-25T11:11:17.667Z] testConstructor(org.eclipse.tracecompass.tmf.chart.ui.tests.data.ChartRangeTest)  Time elapsed: 0 s
07:11:17 [2020-03-25T11:11:17.667Z] testDefaultConstructor(org.eclipse.tracecompass.tmf.chart.ui.tests.data.ChartRangeTest)  Time elapsed: 0 s
07:11:17 [2020-03-25T11:11:17.667Z] 
07:11:17 [2020-03-25T11:11:17.667Z] Results:
07:11:17 [2020-03-25T11:11:17.667Z] 
07:11:17 [2020-03-25T11:11:17.667Z] Tests run: 4, Failures: 0, Errors: 0, Skipped: 0
07:11:17 [2020-03-25T11:11:17.667Z] 
07:11:17 [2020-03-25T11:11:17.667Z] [INFO] All tests passed!
07:11:17 [2020-03-25T11:11:17.667Z] [INFO] 
07:11:17 [2020-03-25T11:11:17.667Z] [INFO] --- maven-install-plugin:2.5.2:install (default-install) @ org.eclipse.tracecompass.tmf.chart.ui.tests ---
07:11:17 [2020-03-25T11:11:17.667Z] [INFO] Installing /home/jenkins/agent/workspace/tracecompass-master-nightly-neon/tmf/org.eclipse.tracecompass.tmf.chart.ui.tests/target/org.eclipse.tracecompass.tmf.chart.ui.tests-1.0.1-SNAPSHOT.jar to /home/jenkins/.m2/repository/org/eclipse/tracecompass/org.eclipse.tracecompass.tmf.chart.ui.tests/1.0.1-SNAPSHOT/org.eclipse.tracecompass.tmf.chart.ui.tests-1.0.1-SNAPSHOT.jar
07:11:17 [2020-03-25T11:11:17.667Z] [INFO] Installing /home/jenkins/agent/workspace/tracecompass-master-nightly-neon/tmf/org.eclipse.tracecompass.tmf.chart.ui.tests/pom.xml to /home/jenkins/.m2/repository/org/eclipse/tracecompass/org.eclipse.tracecompass.tmf.chart.ui.tests/1.0.1-SNAPSHOT/org.eclipse.tracecompass.tmf.chart.ui.tests-1.0.1-SNAPSHOT.pom
07:11:17 [2020-03-25T11:11:17.667Z] [INFO] Installing /home/jenkins/agent/workspace/tracecompass-master-nightly-neon/tmf/org.eclipse.tracecompass.tmf.chart.ui.tests/target/org.eclipse.tracecompass.tmf.chart.ui.tests-1.0.1-SNAPSHOT-sources.jar to /home/jenkins/.m2/repository/org/eclipse/tracecompass/org.eclipse.tracecompass.tmf.chart.ui.tests/1.0.1-SNAPSHOT/org.eclipse.tracecompass.tmf.chart.ui.tests-1.0.1-SNAPSHOT-sources.jar
07:11:17 [2020-03-25T11:11:17.667Z] [INFO] Installing /home/jenkins/agent/workspace/tracecompass-master-nightly-neon/tmf/org.eclipse.tracecompass.tmf.chart.ui.tests/target/org.eclipse.tracecompass.tmf.chart.ui.tests-1.0.1-SNAPSHOT.jar.pack.gz to /home/jenkins/.m2/repository/org/eclipse/tracecompass/org.eclipse.tracecompass.tmf.chart.ui.tests/1.0.1-SNAPSHOT/org.eclipse.tracecompass.tmf.chart.ui.tests-1.0.1-SNAPSHOT-pack200.jar.pack.gz
07:11:17 [2020-03-25T11:11:17.667Z] [INFO] Installing /home/jenkins/agent/workspace/tracecompass-master-nightly-neon/tmf/org.eclipse.tracecompass.tmf.chart.ui.tests/target/p2content.xml to /home/jenkins/.m2/repository/org/eclipse/tracecompass/org.eclipse.tracecompass.tmf.chart.ui.tests/1.0.1-SNAPSHOT/org.eclipse.tracecompass.tmf.chart.ui.tests-1.0.1-SNAPSHOT-p2metadata.xml
07:11:17 [2020-03-25T11:11:17.667Z] [INFO] Installing /home/jenkins/agent/workspace/tracecompass-master-nightly-neon/tmf/org.eclipse.tracecompass.tmf.chart.ui.tests/target/p2artifacts.xml to /home/jenkins/.m2/repository/org/eclipse/tracecompass/org.eclipse.tracecompass.tmf.chart.ui.tests/1.0.1-SNAPSHOT/org.eclipse.tracecompass.tmf.chart.ui.tests-1.0.1-SNAPSHOT-p2artifacts.xml
07:11:17 [2020-03-25T11:11:17.667Z] [INFO] 
07:11:17 [2020-03-25T11:11:17.667Z] [INFO] --- tycho-p2-plugin:1.3.0:update-local-index (default-update-local-index) @ org.eclipse.tracecompass.tmf.chart.ui.tests ---
07:11:17 [2020-03-25T11:11:17.667Z] [INFO] 
07:11:17 [2020-03-25T11:11:17.667Z] [INFO] --< org.eclipse.tracecompass:org.eclipse.tracecompass.tmf.remote.ui.swtbot.tests >--
07:11:17 [2020-03-25T11:11:17.667Z] [INFO] Building org.eclipse.tracecompass.tmf.remote.ui.swtbot.tests 1.0.8-SNAPSHOT [132/138]
07:11:17 [2020-03-25T11:11:17.667Z] [INFO] ------------------------[ eclipse-test-plugin ]-------------------------
07:11:17 [2020-03-25T11:11:17.667Z] [INFO] 
07:11:17 [2020-03-25T11:11:17.667Z] [INFO] --- maven-clean-plugin:3.0.0:clean (default-clean) @ org.eclipse.tracecompass.tmf.remote.ui.swtbot.tests ---
07:11:17 [2020-03-25T11:11:17.667Z] [INFO] 
07:11:17 [2020-03-25T11:11:17.667Z] [INFO] --- tycho-packaging-plugin:1.3.0:build-qualifier (default-build-qualifier) @ org.eclipse.tracecompass.tmf.remote.ui.swtbot.tests ---
07:11:17 [2020-03-25T11:11:17.667Z] [INFO] The project's OSGi version is 1.0.8.202003251000
07:11:17 [2020-03-25T11:11:17.667Z] [INFO] 
07:11:17 [2020-03-25T11:11:17.667Z] [INFO] --- tycho-packaging-plugin:1.3.0:validate-id (default-validate-id) @ org.eclipse.tracecompass.tmf.remote.ui.swtbot.tests ---
07:11:17 [2020-03-25T11:11:17.667Z] [INFO] 
07:11:17 [2020-03-25T11:11:17.667Z] [INFO] --- tycho-packaging-plugin:1.3.0:validate-version (default-validate-version) @ org.eclipse.tracecompass.tmf.remote.ui.swtbot.tests ---
07:11:17 [2020-03-25T11:11:17.667Z] [INFO] 
07:11:17 [2020-03-25T11:11:17.667Z] [INFO] --- maven-enforcer-plugin:1.4.1:enforce (enforce-maven-version) @ org.eclipse.tracecompass.tmf.remote.ui.swtbot.tests ---
07:11:17 [2020-03-25T11:11:17.667Z] [INFO] 
07:11:17 [2020-03-25T11:11:17.667Z] [INFO] --- maven-resources-plugin:3.0.2:resources (default-resources) @ org.eclipse.tracecompass.tmf.remote.ui.swtbot.tests ---
07:11:17 [2020-03-25T11:11:17.667Z] [INFO] Using 'UTF-8' encoding to copy filtered resources.
07:11:17 [2020-03-25T11:11:17.667Z] [INFO] skip non existing resourceDirectory /home/jenkins/agent/workspace/tracecompass-master-nightly-neon/tmf/org.eclipse.tracecompass.tmf.remote.ui.swtbot.tests/src/main/resources
07:11:17 [2020-03-25T11:11:17.667Z] [INFO] 
07:11:17 [2020-03-25T11:11:17.667Z] [INFO] --- tycho-compiler-plugin:1.3.0:compile (default-compile) @ org.eclipse.tracecompass.tmf.remote.ui.swtbot.tests ---
07:11:17 [2020-03-25T11:11:17.667Z] [INFO] Compiling 2 source files to /home/jenkins/agent/workspace/tracecompass-master-nightly-neon/tmf/org.eclipse.tracecompass.tmf.remote.ui.swtbot.tests/target/classes
07:11:18 [2020-03-25T11:11:18.233Z] [INFO] 
07:11:18 [2020-03-25T11:11:18.233Z] [INFO] --- maven-resources-plugin:3.0.2:testResources (default-testResources) @ org.eclipse.tracecompass.tmf.remote.ui.swtbot.tests ---
07:11:18 [2020-03-25T11:11:18.233Z] [INFO] Using 'UTF-8' encoding to copy filtered resources.
07:11:18 [2020-03-25T11:11:18.233Z] [INFO] skip non existing resourceDirectory /home/jenkins/agent/workspace/tracecompass-master-nightly-neon/tmf/org.eclipse.tracecompass.tmf.remote.ui.swtbot.tests/src/test/resources
07:11:18 [2020-03-25T11:11:18.233Z] [INFO] 
07:11:18 [2020-03-25T11:11:18.233Z] [INFO] --- tycho-source-plugin:1.3.0:plugin-source (plugin-source) @ org.eclipse.tracecompass.tmf.remote.ui.swtbot.tests ---
07:11:18 [2020-03-25T11:11:18.233Z] [INFO] Building jar: /home/jenkins/agent/workspace/tracecompass-master-nightly-neon/tmf/org.eclipse.tracecompass.tmf.remote.ui.swtbot.tests/target/org.eclipse.tracecompass.tmf.remote.ui.swtbot.tests-1.0.8-SNAPSHOT-sources.jar
07:11:18 [2020-03-25T11:11:18.233Z] [INFO] 
07:11:18 [2020-03-25T11:11:18.233Z] [INFO] --- target-platform-configuration:1.3.0:target-platform (default-target-platform) @ org.eclipse.tracecompass.tmf.remote.ui.swtbot.tests ---
07:11:18 [2020-03-25T11:11:18.233Z] [INFO] 
07:11:18 [2020-03-25T11:11:18.233Z] [INFO] --- tycho-packaging-plugin:1.3.0:package-plugin (default-package-plugin) @ org.eclipse.tracecompass.tmf.remote.ui.swtbot.tests ---
07:11:18 [2020-03-25T11:11:18.233Z] [INFO] Building jar: /home/jenkins/agent/workspace/tracecompass-master-nightly-neon/tmf/org.eclipse.tracecompass.tmf.remote.ui.swtbot.tests/target/org.eclipse.tracecompass.tmf.remote.ui.swtbot.tests-1.0.8-SNAPSHOT.jar
07:11:18 [2020-03-25T11:11:18.233Z] [INFO] 
07:11:18 [2020-03-25T11:11:18.233Z] [INFO] --- tycho-p2-plugin:1.3.0:p2-metadata-default (default-p2-metadata-default) @ org.eclipse.tracecompass.tmf.remote.ui.swtbot.tests ---
07:11:18 [2020-03-25T11:11:18.233Z] [INFO] 
07:11:18 [2020-03-25T11:11:18.233Z] [INFO] --- tycho-source-feature-plugin:1.3.0:source-feature (source-feature) @ org.eclipse.tracecompass.tmf.remote.ui.swtbot.tests ---
07:11:18 [2020-03-25T11:11:18.233Z] [INFO] 
07:11:18 [2020-03-25T11:11:18.233Z] [INFO] --- tycho-pack200b-plugin:1.3.0:pack (pack200-pack) @ org.eclipse.tracecompass.tmf.remote.ui.swtbot.tests ---
07:11:18 [2020-03-25T11:11:18.233Z] [INFO] Pack200 packing jar /home/jenkins/agent/workspace/tracecompass-master-nightly-neon/tmf/org.eclipse.tracecompass.tmf.remote.ui.swtbot.tests/target/org.eclipse.tracecompass.tmf.remote.ui.swtbot.tests-1.0.8-SNAPSHOT.jar
07:11:18 [2020-03-25T11:11:18.233Z] [INFO] 
07:11:18 [2020-03-25T11:11:18.233Z] [INFO] --- tycho-p2-plugin:1.3.0:p2-metadata (p2-metadata) @ org.eclipse.tracecompass.tmf.remote.ui.swtbot.tests ---
07:11:18 [2020-03-25T11:11:18.233Z] [INFO] 
07:11:18 [2020-03-25T11:11:18.233Z] [INFO] --- tycho-surefire-plugin:1.3.0:test (default-test) @ org.eclipse.tracecompass.tmf.remote.ui.swtbot.tests ---
07:11:18 [2020-03-25T11:11:18.797Z] [INFO] Expected eclipse log file: /home/jenkins/agent/workspace/tracecompass-master-nightly-neon/tmf/org.eclipse.tracecompass.tmf.remote.ui.swtbot.tests/target/work/data/.metadata/.log
07:11:18 [2020-03-25T11:11:18.797Z] [INFO] Command line:
07:11:18 [2020-03-25T11:11:18.797Z] 	[/opt/tools/java/oracle/jdk-8/1.8.0_202/jre/bin/java, -Dosgi.noShutdown=false, -Dosgi.os=linux, -Dosgi.ws=gtk, -Dosgi.arch=x86_64, -Dorg.eclipse.swt.browser.DefaultType=mozilla, -Xms512m, -Xmx1024m, -Dosgi.clean=true, -jar, /home/jenkins/.m2/repository/p2/osgi/bundle/org.eclipse.equinox.launcher/1.3.201.v20161025-1711/org.eclipse.equinox.launcher-1.3.201.v20161025-1711.jar, -data, /home/jenkins/agent/workspace/tracecompass-master-nightly-neon/tmf/org.eclipse.tracecompass.tmf.remote.ui.swtbot.tests/target/work/data, -install, /home/jenkins/agent/workspace/tracecompass-master-nightly-neon/tmf/org.eclipse.tracecompass.tmf.remote.ui.swtbot.tests/target/work, -configuration, /home/jenkins/agent/workspace/tracecompass-master-nightly-neon/tmf/org.eclipse.tracecompass.tmf.remote.ui.swtbot.tests/target/work/configuration, -application, org.eclipse.tycho.surefire.osgibooter.uitest, -testproperties, /home/jenkins/agent/workspace/tracecompass-master-nightly-neon/tmf/org.eclipse.tracecompass.tmf.remote.ui.swtbot.tests/target/surefire.properties, -product, org.eclipse.platform.ide, -nouithread, -consoleLog]
07:11:18 [2020-03-25T11:11:18.797Z] Picked up _JAVA_OPTIONS: -Duser.home=/home/tracecompass
07:11:22 [2020-03-25T11:11:22.071Z] !SESSION 2020-03-25 11:11:18.840 -----------------------------------------------
07:11:22 [2020-03-25T11:11:22.071Z] eclipse.buildId=unknown
07:11:22 [2020-03-25T11:11:22.071Z] java.version=1.8.0_202
07:11:22 [2020-03-25T11:11:22.071Z] java.vendor=Oracle Corporation
07:11:22 [2020-03-25T11:11:22.071Z] BootLoader constants: OS=linux, ARCH=x86_64, WS=gtk, NL=en_US
07:11:22 [2020-03-25T11:11:22.071Z] Framework arguments:  -application org.eclipse.tycho.surefire.osgibooter.uitest -testproperties /home/jenkins/agent/workspace/tracecompass-master-nightly-neon/tmf/org.eclipse.tracecompass.tmf.remote.ui.swtbot.tests/target/surefire.properties -product org.eclipse.platform.ide -nouithread
07:11:22 [2020-03-25T11:11:22.071Z] Command-line arguments:  -data /home/jenkins/agent/workspace/tracecompass-master-nightly-neon/tmf/org.eclipse.tracecompass.tmf.remote.ui.swtbot.tests/target/work/data -application org.eclipse.tycho.surefire.osgibooter.uitest -testproperties /home/jenkins/agent/workspace/tracecompass-master-nightly-neon/tmf/org.eclipse.tracecompass.tmf.remote.ui.swtbot.tests/target/surefire.properties -product org.eclipse.platform.ide -nouithread -consoleLog
07:11:22 [2020-03-25T11:11:22.071Z] 
07:11:22 [2020-03-25T11:11:22.071Z] !ENTRY org.eclipse.compare.win32 4 0 2020-03-25 11:11:21.521
07:11:22 [2020-03-25T11:11:22.071Z] !MESSAGE FrameworkEvent ERROR
07:11:22 [2020-03-25T11:11:22.071Z] !STACK 0
07:11:22 [2020-03-25T11:11:22.071Z] org.osgi.framework.BundleException: Could not resolve module: org.eclipse.compare.win32 [54]
07:11:22 [2020-03-25T11:11:22.071Z]   Unresolved requirement: Require-Capability: eclipse.platform; filter:="(osgi.os=win32)"
07:11:22 [2020-03-25T11:11:22.071Z] 
07:11:22 [2020-03-25T11:11:22.071Z] 	at org.eclipse.osgi.container.Module.start(Module.java:444)
07:11:22 [2020-03-25T11:11:22.071Z] 	at org.eclipse.osgi.container.ModuleContainer$ContainerStartLevel.incStartLevel(ModuleContainer.java:1620)
07:11:22 [2020-03-25T11:11:22.071Z] 	at org.eclipse.osgi.container.ModuleContainer$ContainerStartLevel.incStartLevel(ModuleContainer.java:1599)
07:11:22 [2020-03-25T11:11:22.071Z] 	at org.eclipse.osgi.container.ModuleContainer$ContainerStartLevel.doContainerStartLevel(ModuleContainer.java:1571)
07:11:22 [2020-03-25T11:11:22.071Z] 	at org.eclipse.osgi.container.ModuleContainer$ContainerStartLevel.dispatchEvent(ModuleContainer.java:1514)
07:11:22 [2020-03-25T11:11:22.071Z] 	at org.eclipse.osgi.container.ModuleContainer$ContainerStartLevel.dispatchEvent(ModuleContainer.java:1)
07:11:22 [2020-03-25T11:11:22.071Z] 	at org.eclipse.osgi.framework.eventmgr.EventManager.dispatchEvent(EventManager.java:230)
07:11:22 [2020-03-25T11:11:22.071Z] 	at org.eclipse.osgi.framework.eventmgr.EventManager$EventThread.run(EventManager.java:340)
07:11:28 [2020-03-25T11:11:28.619Z] Running org.eclipse.tracecompass.tmf.remote.ui.swtbot.tests.fetch.FetchRemoteTracesTest
07:11:32 [2020-03-25T11:11:32.796Z] Display size: 1440x900
07:11:32 [2020-03-25T11:11:32.796Z] OS version=3.10.0-1062.12.1.el7.x86_64
07:11:32 [2020-03-25T11:11:32.796Z] GTK version=2.24.30
07:11:32 [2020-03-25T11:11:32.796Z] GTK theme=unknown
07:11:32 [2020-03-25T11:11:32.796Z] LIBOVERLAY_SCROLLBAR=0
07:11:32 [2020-03-25T11:11:32.796Z] Time zone: Coordinated Universal Time
07:11:32 [2020-03-25T11:11:32.796Z] log4j:WARN No appenders could be found for logger (org.eclipse.swtbot.swt.finder.widgets.SWTBotShell).
07:11:32 [2020-03-25T11:11:32.796Z] log4j:WARN Please initialize the log4j system properly.
07:12:40 [2020-03-25T11:12:40.445Z] 
07:12:40 [2020-03-25T11:12:40.445Z] !ENTRY org.eclipse.tracecompass.tmf.ui 4 0 2020-03-25 11:12:39.874
07:12:40 [2020-03-25T11:12:40.445Z] !MESSAGE Error connection to node 'ssh://anonymous@unknown.unknown.unknown'
07:12:40 [2020-03-25T11:12:40.445Z] !STACK 0
07:12:40 [2020-03-25T11:12:40.445Z] org.eclipse.core.commands.ExecutionException: Cannot connect Unknown
07:12:40 [2020-03-25T11:12:40.445Z] 	at org.eclipse.tracecompass.tmf.remote.core.proxy.RemoteSystemProxy.connect(RemoteSystemProxy.java:90)
07:12:40 [2020-03-25T11:12:40.445Z] 	at org.eclipse.tracecompass.internal.tmf.remote.ui.wizards.fetch.model.RemoteImportConnectionNodeElement.connect(RemoteImportConnectionNodeElement.java:143)
07:12:40 [2020-03-25T11:12:40.445Z] 	at org.eclipse.tracecompass.internal.tmf.remote.ui.wizards.fetch.RemoteFetchLogWizardRemotePage$6.run(RemoteFetchLogWizardRemotePage.java:392)
07:12:40 [2020-03-25T11:12:40.445Z] 	at org.eclipse.jface.operation.ModalContext$ModalContextThread.run(ModalContext.java:119)
07:12:40 [2020-03-25T11:12:40.445Z] Caused by: org.eclipse.remote.core.exception.RemoteConnectionException: Session.connect: java.net.UnknownHostException: unknown.unknown.unknown
07:12:40 [2020-03-25T11:12:40.445Z] 	at org.eclipse.remote.internal.jsch.core.JSchConnection.newSession(JSchConnection.java:959)
07:12:40 [2020-03-25T11:12:40.445Z] 	at org.eclipse.remote.internal.jsch.core.JSchConnection.open(JSchConnection.java:997)
07:12:40 [2020-03-25T11:12:40.445Z] 	at org.eclipse.remote.internal.jsch.core.JSchConnection.open(JSchConnection.java:970)
07:12:40 [2020-03-25T11:12:40.445Z] 	at org.eclipse.remote.internal.core.RemoteConnection.open(RemoteConnection.java:208)
07:12:40 [2020-03-25T11:12:40.445Z] 	at org.eclipse.tracecompass.tmf.remote.core.proxy.RemoteSystemProxy.connect(RemoteSystemProxy.java:86)
07:12:40 [2020-03-25T11:12:40.445Z] 	... 3 more
07:12:58 [2020-03-25T11:12:58.504Z] Tests run: 20, Failures: 0, Errors: 0, Skipped: 1, Time elapsed: 88.437 s - in org.eclipse.tracecompass.tmf.remote.ui.swtbot.tests.fetch.FetchRemoteTracesTest
07:12:58 [2020-03-25T11:12:58.504Z] testImportNothing(org.eclipse.tracecompass.tmf.remote.ui.swtbot.tests.fetch.FetchRemoteTracesTest)  Time elapsed: 4.928 s
07:12:58 [2020-03-25T11:12:58.504Z] test_7_03(org.eclipse.tracecompass.tmf.remote.ui.swtbot.tests.fetch.FetchRemoteTracesTest)  Time elapsed: 1.554 s
07:12:58 [2020-03-25T11:12:58.504Z] test_8_04(org.eclipse.tracecompass.tmf.remote.ui.swtbot.tests.fetch.FetchRemoteTracesTest)  Time elapsed: 6.275 s
07:12:58 [2020-03-25T11:12:58.504Z] test_8_05(org.eclipse.tracecompass.tmf.remote.ui.swtbot.tests.fetch.FetchRemoteTracesTest)  Time elapsed: 14.037 s
07:12:58 [2020-03-25T11:12:58.504Z] test_8_06(org.eclipse.tracecompass.tmf.remote.ui.swtbot.tests.fetch.FetchRemoteTracesTest)  Time elapsed: 6.189 s
07:12:58 [2020-03-25T11:12:58.504Z] test_8_07(org.eclipse.tracecompass.tmf.remote.ui.swtbot.tests.fetch.FetchRemoteTracesTest)  Time elapsed: 4.213 s
07:12:58 [2020-03-25T11:12:58.504Z] test_8_08(org.eclipse.tracecompass.tmf.remote.ui.swtbot.tests.fetch.FetchRemoteTracesTest)  Time elapsed: 5.274 s
07:12:58 [2020-03-25T11:12:58.504Z] test_8_09(org.eclipse.tracecompass.tmf.remote.ui.swtbot.tests.fetch.FetchRemoteTracesTest)  Time elapsed: 3.84 s
07:12:58 [2020-03-25T11:12:58.504Z] test_8_10(org.eclipse.tracecompass.tmf.remote.ui.swtbot.tests.fetch.FetchRemoteTracesTest)  Time elapsed: 2.91 s
07:12:58 [2020-03-25T11:12:58.504Z] test_8_11(org.eclipse.tracecompass.tmf.remote.ui.swtbot.tests.fetch.FetchRemoteTracesTest)  Time elapsed: 3.346 s
07:12:58 [2020-03-25T11:12:58.504Z] test_8_12(org.eclipse.tracecompass.tmf.remote.ui.swtbot.tests.fetch.FetchRemoteTracesTest)  Time elapsed: 2.615 s
07:12:58 [2020-03-25T11:12:58.504Z] test_8_13(org.eclipse.tracecompass.tmf.remote.ui.swtbot.tests.fetch.FetchRemoteTracesTest)  Time elapsed: 3.521 s
07:12:58 [2020-03-25T11:12:58.504Z] test_8_14(org.eclipse.tracecompass.tmf.remote.ui.swtbot.tests.fetch.FetchRemoteTracesTest)  Time elapsed: 2.176 s
07:12:58 [2020-03-25T11:12:58.504Z] test_8_15(org.eclipse.tracecompass.tmf.remote.ui.swtbot.tests.fetch.FetchRemoteTracesTest)  Time elapsed: 3.739 s
07:12:58 [2020-03-25T11:12:58.504Z] test_9_01(org.eclipse.tracecompass.tmf.remote.ui.swtbot.tests.fetch.FetchRemoteTracesTest)  Time elapsed: 1.746 s
07:12:58 [2020-03-25T11:12:58.504Z] test_9_02(org.eclipse.tracecompass.tmf.remote.ui.swtbot.tests.fetch.FetchRemoteTracesTest) skipped
07:12:58 [2020-03-25T11:12:58.504Z] testImportOnlyOne(org.eclipse.tracecompass.tmf.remote.ui.swtbot.tests.fetch.FetchRemoteTracesTest)  Time elapsed: 3.504 s
07:12:58 [2020-03-25T11:12:58.504Z] testEmptyFile(org.eclipse.tracecompass.tmf.remote.ui.swtbot.tests.fetch.FetchRemoteTracesTest)  Time elapsed: 2.053 s
07:12:58 [2020-03-25T11:12:58.504Z] testImportAll(org.eclipse.tracecompass.tmf.remote.ui.swtbot.tests.fetch.FetchRemoteTracesTest)  Time elapsed: 6.298 s
07:12:58 [2020-03-25T11:12:58.504Z] testEditProfile(org.eclipse.tracecompass.tmf.remote.ui.swtbot.tests.fetch.FetchRemoteTracesTest)  Time elapsed: 2.305 s
07:12:58 [2020-03-25T11:12:58.504Z] 
07:12:58 [2020-03-25T11:12:58.504Z] Results:
07:12:58 [2020-03-25T11:12:58.504Z] 
07:12:58 [2020-03-25T11:12:58.504Z] Tests run: 20, Failures: 0, Errors: 0, Skipped: 1
07:12:58 [2020-03-25T11:12:58.504Z] 
07:12:58 [2020-03-25T11:12:58.504Z] 
07:12:58 [2020-03-25T11:12:58.504Z] !ENTRY org.eclipse.core.resources 2 10035 2020-03-25 11:12:56.433
07:12:58 [2020-03-25T11:12:58.504Z] !MESSAGE The workspace will exit with unsaved changes in this session.
07:12:58 [2020-03-25T11:12:58.504Z] [INFO] All tests passed!
07:12:58 [2020-03-25T11:12:58.504Z] [INFO] 
07:12:58 [2020-03-25T11:12:58.504Z] [INFO] --- maven-install-plugin:2.5.2:install (default-install) @ org.eclipse.tracecompass.tmf.remote.ui.swtbot.tests ---
07:12:58 [2020-03-25T11:12:58.504Z] [INFO] Installing /home/jenkins/agent/workspace/tracecompass-master-nightly-neon/tmf/org.eclipse.tracecompass.tmf.remote.ui.swtbot.tests/target/org.eclipse.tracecompass.tmf.remote.ui.swtbot.tests-1.0.8-SNAPSHOT.jar to /home/jenkins/.m2/repository/org/eclipse/tracecompass/org.eclipse.tracecompass.tmf.remote.ui.swtbot.tests/1.0.8-SNAPSHOT/org.eclipse.tracecompass.tmf.remote.ui.swtbot.tests-1.0.8-SNAPSHOT.jar
07:12:58 [2020-03-25T11:12:58.504Z] [INFO] Installing /home/jenkins/agent/workspace/tracecompass-master-nightly-neon/tmf/org.eclipse.tracecompass.tmf.remote.ui.swtbot.tests/pom.xml to /home/jenkins/.m2/repository/org/eclipse/tracecompass/org.eclipse.tracecompass.tmf.remote.ui.swtbot.tests/1.0.8-SNAPSHOT/org.eclipse.tracecompass.tmf.remote.ui.swtbot.tests-1.0.8-SNAPSHOT.pom
07:12:58 [2020-03-25T11:12:58.504Z] [INFO] Installing /home/jenkins/agent/workspace/tracecompass-master-nightly-neon/tmf/org.eclipse.tracecompass.tmf.remote.ui.swtbot.tests/target/org.eclipse.tracecompass.tmf.remote.ui.swtbot.tests-1.0.8-SNAPSHOT-sources.jar to /home/jenkins/.m2/repository/org/eclipse/tracecompass/org.eclipse.tracecompass.tmf.remote.ui.swtbot.tests/1.0.8-SNAPSHOT/org.eclipse.tracecompass.tmf.remote.ui.swtbot.tests-1.0.8-SNAPSHOT-sources.jar
07:12:58 [2020-03-25T11:12:58.504Z] [INFO] Installing /home/jenkins/agent/workspace/tracecompass-master-nightly-neon/tmf/org.eclipse.tracecompass.tmf.remote.ui.swtbot.tests/target/org.eclipse.tracecompass.tmf.remote.ui.swtbot.tests-1.0.8-SNAPSHOT.jar.pack.gz to /home/jenkins/.m2/repository/org/eclipse/tracecompass/org.eclipse.tracecompass.tmf.remote.ui.swtbot.tests/1.0.8-SNAPSHOT/org.eclipse.tracecompass.tmf.remote.ui.swtbot.tests-1.0.8-SNAPSHOT-pack200.jar.pack.gz
07:12:58 [2020-03-25T11:12:58.504Z] [INFO] Installing /home/jenkins/agent/workspace/tracecompass-master-nightly-neon/tmf/org.eclipse.tracecompass.tmf.remote.ui.swtbot.tests/target/p2content.xml to /home/jenkins/.m2/repository/org/eclipse/tracecompass/org.eclipse.tracecompass.tmf.remote.ui.swtbot.tests/1.0.8-SNAPSHOT/org.eclipse.tracecompass.tmf.remote.ui.swtbot.tests-1.0.8-SNAPSHOT-p2metadata.xml
07:12:58 [2020-03-25T11:12:58.504Z] [INFO] Installing /home/jenkins/agent/workspace/tracecompass-master-nightly-neon/tmf/org.eclipse.tracecompass.tmf.remote.ui.swtbot.tests/target/p2artifacts.xml to /home/jenkins/.m2/repository/org/eclipse/tracecompass/org.eclipse.tracecompass.tmf.remote.ui.swtbot.tests/1.0.8-SNAPSHOT/org.eclipse.tracecompass.tmf.remote.ui.swtbot.tests-1.0.8-SNAPSHOT-p2artifacts.xml
07:12:58 [2020-03-25T11:12:58.504Z] [INFO] 
07:12:58 [2020-03-25T11:12:58.504Z] [INFO] --- tycho-p2-plugin:1.3.0:update-local-index (default-update-local-index) @ org.eclipse.tracecompass.tmf.remote.ui.swtbot.tests ---
07:12:58 [2020-03-25T11:12:58.504Z] [INFO] 
07:12:58 [2020-03-25T11:12:58.504Z] [INFO] --< org.eclipse.tracecompass:org.eclipse.tracecompass.tmf.remote.ui.tests >--
07:12:58 [2020-03-25T11:12:58.504Z] [INFO] Building org.eclipse.tracecompass.tmf.remote.ui.tests 1.0.1-SNAPSHOT [133/138]
07:12:58 [2020-03-25T11:12:58.504Z] [INFO] ------------------------[ eclipse-test-plugin ]-------------------------
07:12:58 [2020-03-25T11:12:58.504Z] [INFO] 
07:12:58 [2020-03-25T11:12:58.504Z] [INFO] --- maven-clean-plugin:3.0.0:clean (default-clean) @ org.eclipse.tracecompass.tmf.remote.ui.tests ---
07:12:58 [2020-03-25T11:12:58.504Z] [INFO] 
07:12:58 [2020-03-25T11:12:58.504Z] [INFO] --- tycho-packaging-plugin:1.3.0:build-qualifier (default-build-qualifier) @ org.eclipse.tracecompass.tmf.remote.ui.tests ---
07:12:58 [2020-03-25T11:12:58.504Z] [INFO] The project's OSGi version is 1.0.1.202003251000
07:12:58 [2020-03-25T11:12:58.504Z] [INFO] 
07:12:58 [2020-03-25T11:12:58.504Z] [INFO] --- tycho-packaging-plugin:1.3.0:validate-id (default-validate-id) @ org.eclipse.tracecompass.tmf.remote.ui.tests ---
07:12:58 [2020-03-25T11:12:58.504Z] [INFO] 
07:12:58 [2020-03-25T11:12:58.504Z] [INFO] --- tycho-packaging-plugin:1.3.0:validate-version (default-validate-version) @ org.eclipse.tracecompass.tmf.remote.ui.tests ---
07:12:58 [2020-03-25T11:12:58.504Z] [INFO] 
07:12:58 [2020-03-25T11:12:58.504Z] [INFO] --- maven-enforcer-plugin:1.4.1:enforce (enforce-maven-version) @ org.eclipse.tracecompass.tmf.remote.ui.tests ---
07:12:58 [2020-03-25T11:12:58.504Z] [INFO] 
07:12:58 [2020-03-25T11:12:58.504Z] [INFO] --- maven-resources-plugin:3.0.2:resources (default-resources) @ org.eclipse.tracecompass.tmf.remote.ui.tests ---
07:12:58 [2020-03-25T11:12:58.504Z] [INFO] Using 'UTF-8' encoding to copy filtered resources.
07:12:58 [2020-03-25T11:12:58.504Z] [INFO] skip non existing resourceDirectory /home/jenkins/agent/workspace/tracecompass-master-nightly-neon/tmf/org.eclipse.tracecompass.tmf.remote.ui.tests/src/main/resources
07:12:58 [2020-03-25T11:12:58.504Z] [INFO] 
07:12:58 [2020-03-25T11:12:58.504Z] [INFO] --- tycho-compiler-plugin:1.3.0:compile (default-compile) @ org.eclipse.tracecompass.tmf.remote.ui.tests ---
07:12:58 [2020-03-25T11:12:58.504Z] [INFO] Compiling 4 source files to /home/jenkins/agent/workspace/tracecompass-master-nightly-neon/tmf/org.eclipse.tracecompass.tmf.remote.ui.tests/target/classes
07:12:58 [2020-03-25T11:12:58.504Z] [INFO] 
07:12:58 [2020-03-25T11:12:58.504Z] [INFO] --- maven-resources-plugin:3.0.2:testResources (default-testResources) @ org.eclipse.tracecompass.tmf.remote.ui.tests ---
07:12:58 [2020-03-25T11:12:58.504Z] [INFO] Using 'UTF-8' encoding to copy filtered resources.
07:12:58 [2020-03-25T11:12:58.504Z] [INFO] skip non existing resourceDirectory /home/jenkins/agent/workspace/tracecompass-master-nightly-neon/tmf/org.eclipse.tracecompass.tmf.remote.ui.tests/src/test/resources
07:12:58 [2020-03-25T11:12:58.504Z] [INFO] 
07:12:58 [2020-03-25T11:12:58.504Z] [INFO] --- tycho-source-plugin:1.3.0:plugin-source (plugin-source) @ org.eclipse.tracecompass.tmf.remote.ui.tests ---
07:12:58 [2020-03-25T11:12:58.504Z] [INFO] Building jar: /home/jenkins/agent/workspace/tracecompass-master-nightly-neon/tmf/org.eclipse.tracecompass.tmf.remote.ui.tests/target/org.eclipse.tracecompass.tmf.remote.ui.tests-1.0.1-SNAPSHOT-sources.jar
07:12:58 [2020-03-25T11:12:58.504Z] [INFO] 
07:12:58 [2020-03-25T11:12:58.504Z] [INFO] --- target-platform-configuration:1.3.0:target-platform (default-target-platform) @ org.eclipse.tracecompass.tmf.remote.ui.tests ---
07:12:58 [2020-03-25T11:12:58.504Z] [INFO] 
07:12:58 [2020-03-25T11:12:58.504Z] [INFO] --- tycho-packaging-plugin:1.3.0:package-plugin (default-package-plugin) @ org.eclipse.tracecompass.tmf.remote.ui.tests ---
07:12:58 [2020-03-25T11:12:58.504Z] [INFO] Building jar: /home/jenkins/agent/workspace/tracecompass-master-nightly-neon/tmf/org.eclipse.tracecompass.tmf.remote.ui.tests/target/org.eclipse.tracecompass.tmf.remote.ui.tests-1.0.1-SNAPSHOT.jar
07:12:58 [2020-03-25T11:12:58.504Z] [INFO] 
07:12:58 [2020-03-25T11:12:58.504Z] [INFO] --- tycho-p2-plugin:1.3.0:p2-metadata-default (default-p2-metadata-default) @ org.eclipse.tracecompass.tmf.remote.ui.tests ---
07:12:58 [2020-03-25T11:12:58.504Z] [INFO] 
07:12:58 [2020-03-25T11:12:58.504Z] [INFO] --- tycho-source-feature-plugin:1.3.0:source-feature (source-feature) @ org.eclipse.tracecompass.tmf.remote.ui.tests ---
07:12:58 [2020-03-25T11:12:58.504Z] [INFO] 
07:12:58 [2020-03-25T11:12:58.504Z] [INFO] --- tycho-pack200b-plugin:1.3.0:pack (pack200-pack) @ org.eclipse.tracecompass.tmf.remote.ui.tests ---
07:12:58 [2020-03-25T11:12:58.504Z] [INFO] Pack200 packing jar /home/jenkins/agent/workspace/tracecompass-master-nightly-neon/tmf/org.eclipse.tracecompass.tmf.remote.ui.tests/target/org.eclipse.tracecompass.tmf.remote.ui.tests-1.0.1-SNAPSHOT.jar
07:12:58 [2020-03-25T11:12:58.504Z] [INFO] 
07:12:58 [2020-03-25T11:12:58.504Z] [INFO] --- tycho-p2-plugin:1.3.0:p2-metadata (p2-metadata) @ org.eclipse.tracecompass.tmf.remote.ui.tests ---
07:12:58 [2020-03-25T11:12:58.504Z] [INFO] 
07:12:58 [2020-03-25T11:12:58.504Z] [INFO] --- tycho-surefire-plugin:1.3.0:test (default-test) @ org.eclipse.tracecompass.tmf.remote.ui.tests ---
07:12:58 [2020-03-25T11:12:58.504Z] [INFO] Expected eclipse log file: /home/jenkins/agent/workspace/tracecompass-master-nightly-neon/tmf/org.eclipse.tracecompass.tmf.remote.ui.tests/target/work/data/.metadata/.log
07:12:58 [2020-03-25T11:12:58.504Z] [INFO] Command line:
07:12:58 [2020-03-25T11:12:58.504Z] 	[/opt/tools/java/oracle/jdk-8/1.8.0_202/jre/bin/java, -Dosgi.noShutdown=false, -Dosgi.os=linux, -Dosgi.ws=gtk, -Dosgi.arch=x86_64, -Dorg.eclipse.swt.browser.DefaultType=mozilla, -Xms512m, -Xmx1024m, -Dosgi.clean=true, -jar, /home/jenkins/.m2/repository/p2/osgi/bundle/org.eclipse.equinox.launcher/1.3.201.v20161025-1711/org.eclipse.equinox.launcher-1.3.201.v20161025-1711.jar, -data, /home/jenkins/agent/workspace/tracecompass-master-nightly-neon/tmf/org.eclipse.tracecompass.tmf.remote.ui.tests/target/work/data, -install, /home/jenkins/agent/workspace/tracecompass-master-nightly-neon/tmf/org.eclipse.tracecompass.tmf.remote.ui.tests/target/work, -configuration, /home/jenkins/agent/workspace/tracecompass-master-nightly-neon/tmf/org.eclipse.tracecompass.tmf.remote.ui.tests/target/work/configuration, -application, org.eclipse.tycho.surefire.osgibooter.uitest, -testproperties, /home/jenkins/agent/workspace/tracecompass-master-nightly-neon/tmf/org.eclipse.tracecompass.tmf.remote.ui.tests/target/surefire.properties, -product, org.eclipse.platform.ide, -consoleLog]
07:12:58 [2020-03-25T11:12:58.504Z] Picked up _JAVA_OPTIONS: -Duser.home=/home/tracecompass
07:13:01 [2020-03-25T11:13:01.776Z] !SESSION 2020-03-25 11:12:58.371 -----------------------------------------------
07:13:01 [2020-03-25T11:13:01.776Z] eclipse.buildId=unknown
07:13:01 [2020-03-25T11:13:01.776Z] java.version=1.8.0_202
07:13:01 [2020-03-25T11:13:01.776Z] java.vendor=Oracle Corporation
07:13:01 [2020-03-25T11:13:01.776Z] BootLoader constants: OS=linux, ARCH=x86_64, WS=gtk, NL=en_US
07:13:01 [2020-03-25T11:13:01.776Z] Framework arguments:  -application org.eclipse.tycho.surefire.osgibooter.uitest -testproperties /home/jenkins/agent/workspace/tracecompass-master-nightly-neon/tmf/org.eclipse.tracecompass.tmf.remote.ui.tests/target/surefire.properties -product org.eclipse.platform.ide
07:13:01 [2020-03-25T11:13:01.776Z] Command-line arguments:  -data /home/jenkins/agent/workspace/tracecompass-master-nightly-neon/tmf/org.eclipse.tracecompass.tmf.remote.ui.tests/target/work/data -application org.eclipse.tycho.surefire.osgibooter.uitest -testproperties /home/jenkins/agent/workspace/tracecompass-master-nightly-neon/tmf/org.eclipse.tracecompass.tmf.remote.ui.tests/target/surefire.properties -product org.eclipse.platform.ide -consoleLog
07:13:01 [2020-03-25T11:13:01.776Z] 
07:13:01 [2020-03-25T11:13:01.776Z] !ENTRY org.eclipse.compare.win32 4 0 2020-03-25 11:13:01.229
07:13:01 [2020-03-25T11:13:01.776Z] !MESSAGE FrameworkEvent ERROR
07:13:01 [2020-03-25T11:13:01.776Z] !STACK 0
07:13:01 [2020-03-25T11:13:01.776Z] org.osgi.framework.BundleException: Could not resolve module: org.eclipse.compare.win32 [54]
07:13:01 [2020-03-25T11:13:01.776Z]   Unresolved requirement: Require-Capability: eclipse.platform; filter:="(osgi.os=win32)"
07:13:01 [2020-03-25T11:13:01.776Z] 
07:13:01 [2020-03-25T11:13:01.776Z] 	at org.eclipse.osgi.container.Module.start(Module.java:444)
07:13:01 [2020-03-25T11:13:01.776Z] 	at org.eclipse.osgi.container.ModuleContainer$ContainerStartLevel.incStartLevel(ModuleContainer.java:1620)
07:13:01 [2020-03-25T11:13:01.776Z] 	at org.eclipse.osgi.container.ModuleContainer$ContainerStartLevel.incStartLevel(ModuleContainer.java:1599)
07:13:01 [2020-03-25T11:13:01.776Z] 	at org.eclipse.osgi.container.ModuleContainer$ContainerStartLevel.doContainerStartLevel(ModuleContainer.java:1571)
07:13:01 [2020-03-25T11:13:01.776Z] 	at org.eclipse.osgi.container.ModuleContainer$ContainerStartLevel.dispatchEvent(ModuleContainer.java:1514)
07:13:01 [2020-03-25T11:13:01.776Z] 	at org.eclipse.osgi.container.ModuleContainer$ContainerStartLevel.dispatchEvent(ModuleContainer.java:1)
07:13:01 [2020-03-25T11:13:01.776Z] 	at org.eclipse.osgi.framework.eventmgr.EventManager.dispatchEvent(EventManager.java:230)
07:13:01 [2020-03-25T11:13:01.776Z] 	at org.eclipse.osgi.framework.eventmgr.EventManager$EventThread.run(EventManager.java:340)
07:13:03 [2020-03-25T11:13:03.237Z] process 20200: D-Bus library appears to be incorrectly set up; failed to read machine uuid: UUID file '/etc/machine-id' should contain a hex string of length 32, not length 0, with no other text
07:13:03 [2020-03-25T11:13:03.237Z] See the manual page for dbus-uuidgen to correct this issue.
07:13:15 [2020-03-25T11:13:15.417Z] Running org.eclipse.tracecompass.tmf.remote.ui.tests.fetch.RemoteImportProfilesWriterTest
07:13:15 [2020-03-25T11:13:15.417Z] Tests run: 1, Failures: 0, Errors: 0, Skipped: 0, Time elapsed: 0.22 s - in org.eclipse.tracecompass.tmf.remote.ui.tests.fetch.RemoteImportProfilesWriterTest
07:13:15 [2020-03-25T11:13:15.417Z] testValidateValid(org.eclipse.tracecompass.tmf.remote.ui.tests.fetch.RemoteImportProfilesWriterTest)  Time elapsed: 0.196 s
07:13:15 [2020-03-25T11:13:15.417Z] Running org.eclipse.tracecompass.tmf.remote.ui.tests.fetch.RemoteImportProfilesReaderTest
07:13:15 [2020-03-25T11:13:15.417Z] Tests run: 5, Failures: 0, Errors: 0, Skipped: 0, Time elapsed: 0.053 s - in org.eclipse.tracecompass.tmf.remote.ui.tests.fetch.RemoteImportProfilesReaderTest
07:13:15 [2020-03-25T11:13:15.417Z] testLoadElements(org.eclipse.tracecompass.tmf.remote.ui.tests.fetch.RemoteImportProfilesReaderTest)  Time elapsed: 0.032 s
07:13:15 [2020-03-25T11:13:15.417Z] testValidateInvalidMissingFiles(org.eclipse.tracecompass.tmf.remote.ui.tests.fetch.RemoteImportProfilesReaderTest)  Time elapsed: 0.007 s
07:13:15 [2020-03-25T11:13:15.417Z] testValidateInvalidEmptyProfile(org.eclipse.tracecompass.tmf.remote.ui.tests.fetch.RemoteImportProfilesReaderTest)  Time elapsed: 0.003 s
07:13:15 [2020-03-25T11:13:15.418Z] testValidateInvalidMissingRoot(org.eclipse.tracecompass.tmf.remote.ui.tests.fetch.RemoteImportProfilesReaderTest)  Time elapsed: 0.005 s
07:13:15 [2020-03-25T11:13:15.418Z] testValidateValid(org.eclipse.tracecompass.tmf.remote.ui.tests.fetch.RemoteImportProfilesReaderTest)  Time elapsed: 0.004 s
07:13:15 [2020-03-25T11:13:15.418Z] 
07:13:15 [2020-03-25T11:13:15.418Z] Results:
07:13:15 [2020-03-25T11:13:15.418Z] 
07:13:15 [2020-03-25T11:13:15.418Z] Tests run: 6, Failures: 0, Errors: 0, Skipped: 0
07:13:15 [2020-03-25T11:13:15.418Z] 
07:13:15 [2020-03-25T11:13:15.981Z] [INFO] All tests passed!
07:13:15 [2020-03-25T11:13:15.981Z] [INFO] 
07:13:15 [2020-03-25T11:13:15.981Z] [INFO] --- maven-install-plugin:2.5.2:install (default-install) @ org.eclipse.tracecompass.tmf.remote.ui.tests ---
07:13:15 [2020-03-25T11:13:15.981Z] [INFO] Installing /home/jenkins/agent/workspace/tracecompass-master-nightly-neon/tmf/org.eclipse.tracecompass.tmf.remote.ui.tests/target/org.eclipse.tracecompass.tmf.remote.ui.tests-1.0.1-SNAPSHOT.jar to /home/jenkins/.m2/repository/org/eclipse/tracecompass/org.eclipse.tracecompass.tmf.remote.ui.tests/1.0.1-SNAPSHOT/org.eclipse.tracecompass.tmf.remote.ui.tests-1.0.1-SNAPSHOT.jar
07:13:15 [2020-03-25T11:13:15.981Z] [INFO] Installing /home/jenkins/agent/workspace/tracecompass-master-nightly-neon/tmf/org.eclipse.tracecompass.tmf.remote.ui.tests/pom.xml to /home/jenkins/.m2/repository/org/eclipse/tracecompass/org.eclipse.tracecompass.tmf.remote.ui.tests/1.0.1-SNAPSHOT/org.eclipse.tracecompass.tmf.remote.ui.tests-1.0.1-SNAPSHOT.pom
07:13:15 [2020-03-25T11:13:15.981Z] [INFO] Installing /home/jenkins/agent/workspace/tracecompass-master-nightly-neon/tmf/org.eclipse.tracecompass.tmf.remote.ui.tests/target/org.eclipse.tracecompass.tmf.remote.ui.tests-1.0.1-SNAPSHOT-sources.jar to /home/jenkins/.m2/repository/org/eclipse/tracecompass/org.eclipse.tracecompass.tmf.remote.ui.tests/1.0.1-SNAPSHOT/org.eclipse.tracecompass.tmf.remote.ui.tests-1.0.1-SNAPSHOT-sources.jar
07:13:15 [2020-03-25T11:13:15.981Z] [INFO] Installing /home/jenkins/agent/workspace/tracecompass-master-nightly-neon/tmf/org.eclipse.tracecompass.tmf.remote.ui.tests/target/org.eclipse.tracecompass.tmf.remote.ui.tests-1.0.1-SNAPSHOT.jar.pack.gz to /home/jenkins/.m2/repository/org/eclipse/tracecompass/org.eclipse.tracecompass.tmf.remote.ui.tests/1.0.1-SNAPSHOT/org.eclipse.tracecompass.tmf.remote.ui.tests-1.0.1-SNAPSHOT-pack200.jar.pack.gz
07:13:15 [2020-03-25T11:13:15.981Z] [INFO] Installing /home/jenkins/agent/workspace/tracecompass-master-nightly-neon/tmf/org.eclipse.tracecompass.tmf.remote.ui.tests/target/p2content.xml to /home/jenkins/.m2/repository/org/eclipse/tracecompass/org.eclipse.tracecompass.tmf.remote.ui.tests/1.0.1-SNAPSHOT/org.eclipse.tracecompass.tmf.remote.ui.tests-1.0.1-SNAPSHOT-p2metadata.xml
07:13:15 [2020-03-25T11:13:15.981Z] [INFO] Installing /home/jenkins/agent/workspace/tracecompass-master-nightly-neon/tmf/org.eclipse.tracecompass.tmf.remote.ui.tests/target/p2artifacts.xml to /home/jenkins/.m2/repository/org/eclipse/tracecompass/org.eclipse.tracecompass.tmf.remote.ui.tests/1.0.1-SNAPSHOT/org.eclipse.tracecompass.tmf.remote.ui.tests-1.0.1-SNAPSHOT-p2artifacts.xml
07:13:15 [2020-03-25T11:13:15.981Z] [INFO] 
07:13:15 [2020-03-25T11:13:15.981Z] [INFO] --- tycho-p2-plugin:1.3.0:update-local-index (default-update-local-index) @ org.eclipse.tracecompass.tmf.remote.ui.tests ---
07:13:15 [2020-03-25T11:13:15.981Z] [INFO] 
07:13:15 [2020-03-25T11:13:15.981Z] [INFO] -----< org.eclipse.tracecompass:org.eclipse.tracecompass.alltests >-----
07:13:15 [2020-03-25T11:13:15.981Z] [INFO] Building Trace Compass All Tests 1.0.9-SNAPSHOT                [134/138]
07:13:15 [2020-03-25T11:13:15.981Z] [INFO] ------------------------[ eclipse-test-plugin ]-------------------------
07:13:15 [2020-03-25T11:13:15.981Z] [INFO] 
07:13:15 [2020-03-25T11:13:15.981Z] [INFO] --- maven-clean-plugin:3.0.0:clean (default-clean) @ org.eclipse.tracecompass.alltests ---
07:13:15 [2020-03-25T11:13:15.981Z] [INFO] 
07:13:15 [2020-03-25T11:13:15.981Z] [INFO] --- tycho-packaging-plugin:1.3.0:build-qualifier (default-build-qualifier) @ org.eclipse.tracecompass.alltests ---
07:13:15 [2020-03-25T11:13:15.981Z] [INFO] The project's OSGi version is 1.0.9.202003251000
07:13:15 [2020-03-25T11:13:15.981Z] [INFO] 
07:13:15 [2020-03-25T11:13:15.981Z] [INFO] --- tycho-packaging-plugin:1.3.0:validate-id (default-validate-id) @ org.eclipse.tracecompass.alltests ---
07:13:15 [2020-03-25T11:13:15.981Z] [INFO] 
07:13:15 [2020-03-25T11:13:15.981Z] [INFO] --- tycho-packaging-plugin:1.3.0:validate-version (default-validate-version) @ org.eclipse.tracecompass.alltests ---
07:13:15 [2020-03-25T11:13:15.981Z] [INFO] 
07:13:15 [2020-03-25T11:13:15.981Z] [INFO] --- maven-enforcer-plugin:1.4.1:enforce (enforce-maven-version) @ org.eclipse.tracecompass.alltests ---
07:13:15 [2020-03-25T11:13:15.981Z] [INFO] 
07:13:15 [2020-03-25T11:13:15.981Z] [INFO] --- maven-resources-plugin:3.0.2:resources (default-resources) @ org.eclipse.tracecompass.alltests ---
07:13:15 [2020-03-25T11:13:15.981Z] [INFO] Using 'UTF-8' encoding to copy filtered resources.
07:13:15 [2020-03-25T11:13:15.981Z] [INFO] skip non existing resourceDirectory /home/jenkins/agent/workspace/tracecompass-master-nightly-neon/releng/org.eclipse.tracecompass.alltests/src/main/resources
07:13:15 [2020-03-25T11:13:15.981Z] [INFO] 
07:13:15 [2020-03-25T11:13:15.981Z] [INFO] --- tycho-compiler-plugin:1.3.0:compile (default-compile) @ org.eclipse.tracecompass.alltests ---
07:13:15 [2020-03-25T11:13:15.981Z] [INFO] Compiling 8 source files to /home/jenkins/agent/workspace/tracecompass-master-nightly-neon/releng/org.eclipse.tracecompass.alltests/target/classes
07:13:16 [2020-03-25T11:13:16.912Z] [INFO] 
07:13:16 [2020-03-25T11:13:16.912Z] [INFO] --- maven-resources-plugin:3.0.2:testResources (default-testResources) @ org.eclipse.tracecompass.alltests ---
07:13:16 [2020-03-25T11:13:16.912Z] [INFO] Using 'UTF-8' encoding to copy filtered resources.
07:13:16 [2020-03-25T11:13:16.912Z] [INFO] skip non existing resourceDirectory /home/jenkins/agent/workspace/tracecompass-master-nightly-neon/releng/org.eclipse.tracecompass.alltests/src/test/resources
07:13:16 [2020-03-25T11:13:16.912Z] [INFO] 
07:13:16 [2020-03-25T11:13:16.912Z] [INFO] --- tycho-source-plugin:1.3.0:plugin-source (plugin-source) @ org.eclipse.tracecompass.alltests ---
07:13:16 [2020-03-25T11:13:16.912Z] [INFO] Building jar: /home/jenkins/agent/workspace/tracecompass-master-nightly-neon/releng/org.eclipse.tracecompass.alltests/target/org.eclipse.tracecompass.alltests-1.0.9-SNAPSHOT-sources.jar
07:13:17 [2020-03-25T11:13:17.169Z] [INFO] 
07:13:17 [2020-03-25T11:13:17.169Z] [INFO] --- target-platform-configuration:1.3.0:target-platform (default-target-platform) @ org.eclipse.tracecompass.alltests ---
07:13:17 [2020-03-25T11:13:17.425Z] [INFO] 
07:13:17 [2020-03-25T11:13:17.425Z] [INFO] --- tycho-packaging-plugin:1.3.0:package-plugin (default-package-plugin) @ org.eclipse.tracecompass.alltests ---
07:13:17 [2020-03-25T11:13:17.425Z] [INFO] Building jar: /home/jenkins/agent/workspace/tracecompass-master-nightly-neon/releng/org.eclipse.tracecompass.alltests/target/org.eclipse.tracecompass.alltests-1.0.9-SNAPSHOT.jar
07:13:17 [2020-03-25T11:13:17.425Z] [INFO] 
07:13:17 [2020-03-25T11:13:17.425Z] [INFO] --- tycho-p2-plugin:1.3.0:p2-metadata-default (default-p2-metadata-default) @ org.eclipse.tracecompass.alltests ---
07:13:17 [2020-03-25T11:13:17.425Z] [INFO] 
07:13:17 [2020-03-25T11:13:17.425Z] [INFO] --- tycho-source-feature-plugin:1.3.0:source-feature (source-feature) @ org.eclipse.tracecompass.alltests ---
07:13:17 [2020-03-25T11:13:17.425Z] [INFO] 
07:13:17 [2020-03-25T11:13:17.425Z] [INFO] --- tycho-pack200b-plugin:1.3.0:pack (pack200-pack) @ org.eclipse.tracecompass.alltests ---
07:13:17 [2020-03-25T11:13:17.425Z] [INFO] Pack200 packing jar /home/jenkins/agent/workspace/tracecompass-master-nightly-neon/releng/org.eclipse.tracecompass.alltests/target/org.eclipse.tracecompass.alltests-1.0.9-SNAPSHOT.jar
07:13:17 [2020-03-25T11:13:17.425Z] [INFO] 
07:13:17 [2020-03-25T11:13:17.425Z] [INFO] --- tycho-p2-plugin:1.3.0:p2-metadata (p2-metadata) @ org.eclipse.tracecompass.alltests ---
07:13:17 [2020-03-25T11:13:17.425Z] [INFO] 
07:13:17 [2020-03-25T11:13:17.425Z] [INFO] --- tycho-surefire-plugin:1.3.0:test (default-test) @ org.eclipse.tracecompass.alltests ---
07:13:18 [2020-03-25T11:13:18.795Z] [INFO] Expected eclipse log file: /home/jenkins/agent/workspace/tracecompass-master-nightly-neon/releng/org.eclipse.tracecompass.alltests/target/work/data/.metadata/.log
07:13:18 [2020-03-25T11:13:18.795Z] [INFO] Command line:
07:13:18 [2020-03-25T11:13:18.795Z] 	[/opt/tools/java/oracle/jdk-8/1.8.0_202/jre/bin/java, -Dosgi.noShutdown=false, -Dosgi.os=linux, -Dosgi.ws=gtk, -Dosgi.arch=x86_64, -Dorg.eclipse.swt.browser.DefaultType=mozilla, -Xms512m, -Xmx1024m, -Dosgi.clean=true, -jar, /home/jenkins/.m2/repository/p2/osgi/bundle/org.eclipse.equinox.launcher/1.3.201.v20161025-1711/org.eclipse.equinox.launcher-1.3.201.v20161025-1711.jar, -data, /home/jenkins/agent/workspace/tracecompass-master-nightly-neon/releng/org.eclipse.tracecompass.alltests/target/work/data, -install, /home/jenkins/agent/workspace/tracecompass-master-nightly-neon/releng/org.eclipse.tracecompass.alltests/target/work, -configuration, /home/jenkins/agent/workspace/tracecompass-master-nightly-neon/releng/org.eclipse.tracecompass.alltests/target/work/configuration, -application, org.eclipse.tycho.surefire.osgibooter.headlesstest, -testproperties, /home/jenkins/agent/workspace/tracecompass-master-nightly-neon/releng/org.eclipse.tracecompass.alltests/target/surefire.properties, -product, org.eclipse.platform.ide, -consoleLog]
07:13:18 [2020-03-25T11:13:18.795Z] Picked up _JAVA_OPTIONS: -Duser.home=/home/tracecompass
07:13:22 [2020-03-25T11:13:22.068Z] !SESSION 2020-03-25 11:13:18.582 -----------------------------------------------
07:13:22 [2020-03-25T11:13:22.068Z] eclipse.buildId=unknown
07:13:22 [2020-03-25T11:13:22.068Z] java.version=1.8.0_202
07:13:22 [2020-03-25T11:13:22.068Z] java.vendor=Oracle Corporation
07:13:22 [2020-03-25T11:13:22.068Z] BootLoader constants: OS=linux, ARCH=x86_64, WS=gtk, NL=en_US
07:13:22 [2020-03-25T11:13:22.068Z] Framework arguments:  -application org.eclipse.tycho.surefire.osgibooter.headlesstest -testproperties /home/jenkins/agent/workspace/tracecompass-master-nightly-neon/releng/org.eclipse.tracecompass.alltests/target/surefire.properties -product org.eclipse.platform.ide
07:13:22 [2020-03-25T11:13:22.068Z] Command-line arguments:  -data /home/jenkins/agent/workspace/tracecompass-master-nightly-neon/releng/org.eclipse.tracecompass.alltests/target/work/data -application org.eclipse.tycho.surefire.osgibooter.headlesstest -testproperties /home/jenkins/agent/workspace/tracecompass-master-nightly-neon/releng/org.eclipse.tracecompass.alltests/target/surefire.properties -product org.eclipse.platform.ide -consoleLog
07:13:22 [2020-03-25T11:13:22.068Z] 
07:13:22 [2020-03-25T11:13:22.068Z] !ENTRY org.eclipse.compare.win32 4 0 2020-03-25 11:13:21.650
07:13:22 [2020-03-25T11:13:22.068Z] !MESSAGE FrameworkEvent ERROR
07:13:22 [2020-03-25T11:13:22.068Z] !STACK 0
07:13:22 [2020-03-25T11:13:22.068Z] org.osgi.framework.BundleException: Could not resolve module: org.eclipse.compare.win32 [73]
07:13:22 [2020-03-25T11:13:22.068Z]   Unresolved requirement: Require-Capability: eclipse.platform; filter:="(osgi.os=win32)"
07:13:22 [2020-03-25T11:13:22.068Z] 
07:13:22 [2020-03-25T11:13:22.068Z] 	at org.eclipse.osgi.container.Module.start(Module.java:444)
07:13:22 [2020-03-25T11:13:22.068Z] 	at org.eclipse.osgi.container.ModuleContainer$ContainerStartLevel.incStartLevel(ModuleContainer.java:1620)
07:13:22 [2020-03-25T11:13:22.068Z] 	at org.eclipse.osgi.container.ModuleContainer$ContainerStartLevel.incStartLevel(ModuleContainer.java:1599)
07:13:22 [2020-03-25T11:13:22.068Z] 	at org.eclipse.osgi.container.ModuleContainer$ContainerStartLevel.doContainerStartLevel(ModuleContainer.java:1571)
07:13:22 [2020-03-25T11:13:22.068Z] 	at org.eclipse.osgi.container.ModuleContainer$ContainerStartLevel.dispatchEvent(ModuleContainer.java:1514)
07:13:22 [2020-03-25T11:13:22.068Z] 	at org.eclipse.osgi.container.ModuleContainer$ContainerStartLevel.dispatchEvent(ModuleContainer.java:1)
07:13:22 [2020-03-25T11:13:22.068Z] 	at org.eclipse.osgi.framework.eventmgr.EventManager.dispatchEvent(EventManager.java:230)
07:13:22 [2020-03-25T11:13:22.068Z] 	at org.eclipse.osgi.framework.eventmgr.EventManager$EventThread.run(EventManager.java:340)
07:13:24 [2020-03-25T11:13:24.043Z] 
07:13:24 [2020-03-25T11:13:24.043Z] Results:
07:13:24 [2020-03-25T11:13:24.043Z] 
07:13:24 [2020-03-25T11:13:24.043Z] Tests run: 0, Failures: 0, Errors: 0, Skipped: 0
07:13:24 [2020-03-25T11:13:24.043Z] 
07:13:24 [2020-03-25T11:13:24.607Z] [WARNING] No tests found.
07:13:24 [2020-03-25T11:13:24.607Z] [INFO] 
07:13:24 [2020-03-25T11:13:24.607Z] [INFO] --- maven-install-plugin:2.5.2:install (default-install) @ org.eclipse.tracecompass.alltests ---
07:13:24 [2020-03-25T11:13:24.607Z] [INFO] Installing /home/jenkins/agent/workspace/tracecompass-master-nightly-neon/releng/org.eclipse.tracecompass.alltests/target/org.eclipse.tracecompass.alltests-1.0.9-SNAPSHOT.jar to /home/jenkins/.m2/repository/org/eclipse/tracecompass/org.eclipse.tracecompass.alltests/1.0.9-SNAPSHOT/org.eclipse.tracecompass.alltests-1.0.9-SNAPSHOT.jar
07:13:24 [2020-03-25T11:13:24.607Z] [INFO] Installing /home/jenkins/agent/workspace/tracecompass-master-nightly-neon/releng/org.eclipse.tracecompass.alltests/pom.xml to /home/jenkins/.m2/repository/org/eclipse/tracecompass/org.eclipse.tracecompass.alltests/1.0.9-SNAPSHOT/org.eclipse.tracecompass.alltests-1.0.9-SNAPSHOT.pom
07:13:24 [2020-03-25T11:13:24.607Z] [INFO] Installing /home/jenkins/agent/workspace/tracecompass-master-nightly-neon/releng/org.eclipse.tracecompass.alltests/target/org.eclipse.tracecompass.alltests-1.0.9-SNAPSHOT-sources.jar to /home/jenkins/.m2/repository/org/eclipse/tracecompass/org.eclipse.tracecompass.alltests/1.0.9-SNAPSHOT/org.eclipse.tracecompass.alltests-1.0.9-SNAPSHOT-sources.jar
07:13:24 [2020-03-25T11:13:24.864Z] [INFO] Installing /home/jenkins/agent/workspace/tracecompass-master-nightly-neon/releng/org.eclipse.tracecompass.alltests/target/org.eclipse.tracecompass.alltests-1.0.9-SNAPSHOT.jar.pack.gz to /home/jenkins/.m2/repository/org/eclipse/tracecompass/org.eclipse.tracecompass.alltests/1.0.9-SNAPSHOT/org.eclipse.tracecompass.alltests-1.0.9-SNAPSHOT-pack200.jar.pack.gz
07:13:25 [2020-03-25T11:13:25.428Z] [INFO] Installing /home/jenkins/agent/workspace/tracecompass-master-nightly-neon/releng/org.eclipse.tracecompass.alltests/target/p2content.xml to /home/jenkins/.m2/repository/org/eclipse/tracecompass/org.eclipse.tracecompass.alltests/1.0.9-SNAPSHOT/org.eclipse.tracecompass.alltests-1.0.9-SNAPSHOT-p2metadata.xml
07:13:25 [2020-03-25T11:13:25.686Z] [INFO] Installing /home/jenkins/agent/workspace/tracecompass-master-nightly-neon/releng/org.eclipse.tracecompass.alltests/target/p2artifacts.xml to /home/jenkins/.m2/repository/org/eclipse/tracecompass/org.eclipse.tracecompass.alltests/1.0.9-SNAPSHOT/org.eclipse.tracecompass.alltests-1.0.9-SNAPSHOT-p2artifacts.xml
07:13:25 [2020-03-25T11:13:25.686Z] [INFO] 
07:13:25 [2020-03-25T11:13:25.686Z] [INFO] --- tycho-p2-plugin:1.3.0:update-local-index (default-update-local-index) @ org.eclipse.tracecompass.alltests ---
07:13:25 [2020-03-25T11:13:25.686Z] [INFO] 
07:13:25 [2020-03-25T11:13:25.686Z] [INFO] -----< org.eclipse.tracecompass:org.eclipse.tracecompass.testing >------
07:13:25 [2020-03-25T11:13:25.686Z] [INFO] Building org.eclipse.tracecompass.testing 5.3.0-SNAPSHOT       [135/138]
07:13:25 [2020-03-25T11:13:25.686Z] [INFO] --------------------------[ eclipse-feature ]---------------------------
07:13:25 [2020-03-25T11:13:25.686Z] [INFO] 
07:13:25 [2020-03-25T11:13:25.686Z] [INFO] --- maven-clean-plugin:3.0.0:clean (default-clean) @ org.eclipse.tracecompass.testing ---
07:13:25 [2020-03-25T11:13:25.686Z] [INFO] Deleting /home/jenkins/agent/workspace/tracecompass-master-nightly-neon/releng/org.eclipse.tracecompass.testing/target
07:13:25 [2020-03-25T11:13:25.686Z] [INFO] 
07:13:25 [2020-03-25T11:13:25.686Z] [INFO] --- tycho-packaging-plugin:1.3.0:build-qualifier-aggregator (default-build-qualifier-aggregator) @ org.eclipse.tracecompass.testing ---
07:13:25 [2020-03-25T11:13:25.686Z] [INFO] The project's OSGi version is 5.3.0.202003251000
07:13:25 [2020-03-25T11:13:25.686Z] [INFO] 
07:13:25 [2020-03-25T11:13:25.686Z] [INFO] --- tycho-packaging-plugin:1.3.0:validate-id (default-validate-id) @ org.eclipse.tracecompass.testing ---
07:13:25 [2020-03-25T11:13:25.686Z] [INFO] 
07:13:25 [2020-03-25T11:13:25.686Z] [INFO] --- tycho-packaging-plugin:1.3.0:validate-version (default-validate-version) @ org.eclipse.tracecompass.testing ---
07:13:25 [2020-03-25T11:13:25.686Z] [INFO] 
07:13:25 [2020-03-25T11:13:25.686Z] [INFO] --- maven-enforcer-plugin:1.4.1:enforce (enforce-maven-version) @ org.eclipse.tracecompass.testing ---
07:13:25 [2020-03-25T11:13:25.686Z] [INFO] 
07:13:25 [2020-03-25T11:13:25.686Z] [INFO] --- tycho-source-plugin:1.3.0:plugin-source (plugin-source) @ org.eclipse.tracecompass.testing ---
07:13:25 [2020-03-25T11:13:25.686Z] [INFO] 
07:13:25 [2020-03-25T11:13:25.686Z] [INFO] --- target-platform-configuration:1.3.0:target-platform (default-target-platform) @ org.eclipse.tracecompass.testing ---
07:13:25 [2020-03-25T11:13:25.686Z] [INFO] 
07:13:25 [2020-03-25T11:13:25.686Z] [INFO] --- tycho-packaging-plugin:1.3.0:package-feature (default-package-feature) @ org.eclipse.tracecompass.testing ---
07:13:25 [2020-03-25T11:13:25.943Z] [INFO] Building jar: /home/jenkins/agent/workspace/tracecompass-master-nightly-neon/releng/org.eclipse.tracecompass.testing/target/org.eclipse.tracecompass.testing-5.3.0-SNAPSHOT.jar
07:13:25 [2020-03-25T11:13:25.943Z] [INFO] 
07:13:25 [2020-03-25T11:13:25.943Z] [INFO] --- tycho-p2-plugin:1.3.0:p2-metadata-default (default-p2-metadata-default) @ org.eclipse.tracecompass.testing ---
07:13:25 [2020-03-25T11:13:25.943Z] [INFO] 
07:13:25 [2020-03-25T11:13:25.943Z] [INFO] --- tycho-p2-plugin:1.3.0:feature-p2-metadata (default-feature-p2-metadata) @ org.eclipse.tracecompass.testing ---
07:13:25 [2020-03-25T11:13:25.943Z] [INFO] 
07:13:25 [2020-03-25T11:13:25.943Z] [INFO] --- tycho-source-feature-plugin:1.3.0:source-feature (source-feature) @ org.eclipse.tracecompass.testing ---
07:13:25 [2020-03-25T11:13:25.943Z] [INFO] Building jar: /home/jenkins/agent/workspace/tracecompass-master-nightly-neon/releng/org.eclipse.tracecompass.testing/target/org.eclipse.tracecompass.testing-5.3.0-SNAPSHOT-sources-feature.jar
07:13:25 [2020-03-25T11:13:25.943Z] [INFO] 
07:13:25 [2020-03-25T11:13:25.943Z] [INFO] --- tycho-pack200b-plugin:1.3.0:pack (pack200-pack) @ org.eclipse.tracecompass.testing ---
07:13:25 [2020-03-25T11:13:25.943Z] [INFO] 
07:13:25 [2020-03-25T11:13:25.943Z] [INFO] --- tycho-p2-plugin:1.3.0:p2-metadata (p2-metadata) @ org.eclipse.tracecompass.testing ---
07:13:25 [2020-03-25T11:13:25.943Z] [INFO] 
07:13:25 [2020-03-25T11:13:25.943Z] [INFO] --- maven-install-plugin:2.5.2:install (default-install) @ org.eclipse.tracecompass.testing ---
07:13:25 [2020-03-25T11:13:25.943Z] [INFO] Installing /home/jenkins/agent/workspace/tracecompass-master-nightly-neon/releng/org.eclipse.tracecompass.testing/target/org.eclipse.tracecompass.testing-5.3.0-SNAPSHOT.jar to /home/jenkins/.m2/repository/org/eclipse/tracecompass/org.eclipse.tracecompass.testing/5.3.0-SNAPSHOT/org.eclipse.tracecompass.testing-5.3.0-SNAPSHOT.jar
07:13:25 [2020-03-25T11:13:25.943Z] [INFO] Installing /home/jenkins/agent/workspace/tracecompass-master-nightly-neon/releng/org.eclipse.tracecompass.testing/.polyglot.build.properties to /home/jenkins/.m2/repository/org/eclipse/tracecompass/org.eclipse.tracecompass.testing/5.3.0-SNAPSHOT/org.eclipse.tracecompass.testing-5.3.0-SNAPSHOT.pom
07:13:25 [2020-03-25T11:13:25.943Z] [INFO] Installing /home/jenkins/agent/workspace/tracecompass-master-nightly-neon/releng/org.eclipse.tracecompass.testing/target/org.eclipse.tracecompass.testing-5.3.0-SNAPSHOT-sources-feature.jar to /home/jenkins/.m2/repository/org/eclipse/tracecompass/org.eclipse.tracecompass.testing/5.3.0-SNAPSHOT/org.eclipse.tracecompass.testing-5.3.0-SNAPSHOT-sources-feature.jar
07:13:25 [2020-03-25T11:13:25.943Z] [INFO] Installing /home/jenkins/agent/workspace/tracecompass-master-nightly-neon/releng/org.eclipse.tracecompass.testing/target/p2content.xml to /home/jenkins/.m2/repository/org/eclipse/tracecompass/org.eclipse.tracecompass.testing/5.3.0-SNAPSHOT/org.eclipse.tracecompass.testing-5.3.0-SNAPSHOT-p2metadata.xml
07:13:25 [2020-03-25T11:13:25.943Z] [INFO] Installing /home/jenkins/agent/workspace/tracecompass-master-nightly-neon/releng/org.eclipse.tracecompass.testing/target/p2artifacts.xml to /home/jenkins/.m2/repository/org/eclipse/tracecompass/org.eclipse.tracecompass.testing/5.3.0-SNAPSHOT/org.eclipse.tracecompass.testing-5.3.0-SNAPSHOT-p2artifacts.xml
07:13:25 [2020-03-25T11:13:25.943Z] [INFO] 
07:13:25 [2020-03-25T11:13:25.943Z] [INFO] --- tycho-p2-plugin:1.3.0:update-local-index (default-update-local-index) @ org.eclipse.tracecompass.testing ---
07:13:25 [2020-03-25T11:13:25.943Z] [INFO] 
07:13:25 [2020-03-25T11:13:25.943Z] [INFO] ----< org.eclipse.tracecompass:org.eclipse.tracecompass.tmf.remote >----
07:13:25 [2020-03-25T11:13:25.943Z] [INFO] Building org.eclipse.tracecompass.tmf.remote 5.3.0-SNAPSHOT    [136/138]
07:13:25 [2020-03-25T11:13:25.943Z] [INFO] --------------------------[ eclipse-feature ]---------------------------
07:13:26 [2020-03-25T11:13:26.200Z] [INFO] 
07:13:26 [2020-03-25T11:13:26.200Z] [INFO] --- maven-clean-plugin:3.0.0:clean (default-clean) @ org.eclipse.tracecompass.tmf.remote ---
07:13:26 [2020-03-25T11:13:26.200Z] [INFO] Deleting /home/jenkins/agent/workspace/tracecompass-master-nightly-neon/tmf/org.eclipse.tracecompass.tmf.remote/target
07:13:26 [2020-03-25T11:13:26.200Z] [INFO] 
07:13:26 [2020-03-25T11:13:26.200Z] [INFO] --- tycho-packaging-plugin:1.3.0:build-qualifier-aggregator (default-build-qualifier-aggregator) @ org.eclipse.tracecompass.tmf.remote ---
07:13:26 [2020-03-25T11:13:26.200Z] [INFO] The project's OSGi version is 5.3.0.202003251000
07:13:26 [2020-03-25T11:13:26.200Z] [INFO] 
07:13:26 [2020-03-25T11:13:26.200Z] [INFO] --- tycho-packaging-plugin:1.3.0:validate-id (default-validate-id) @ org.eclipse.tracecompass.tmf.remote ---
07:13:26 [2020-03-25T11:13:26.200Z] [INFO] 
07:13:26 [2020-03-25T11:13:26.200Z] [INFO] --- tycho-packaging-plugin:1.3.0:validate-version (default-validate-version) @ org.eclipse.tracecompass.tmf.remote ---
07:13:26 [2020-03-25T11:13:26.200Z] [INFO] 
07:13:26 [2020-03-25T11:13:26.200Z] [INFO] --- maven-enforcer-plugin:1.4.1:enforce (enforce-maven-version) @ org.eclipse.tracecompass.tmf.remote ---
07:13:26 [2020-03-25T11:13:26.200Z] [INFO] 
07:13:26 [2020-03-25T11:13:26.200Z] [INFO] --- tycho-source-plugin:1.3.0:plugin-source (plugin-source) @ org.eclipse.tracecompass.tmf.remote ---
07:13:26 [2020-03-25T11:13:26.200Z] [INFO] 
07:13:26 [2020-03-25T11:13:26.200Z] [INFO] --- target-platform-configuration:1.3.0:target-platform (default-target-platform) @ org.eclipse.tracecompass.tmf.remote ---
07:13:26 [2020-03-25T11:13:26.200Z] [INFO] 
07:13:26 [2020-03-25T11:13:26.200Z] [INFO] --- tycho-packaging-plugin:1.3.0:package-feature (default-package-feature) @ org.eclipse.tracecompass.tmf.remote ---
07:13:26 [2020-03-25T11:13:26.200Z] [INFO] Building jar: /home/jenkins/agent/workspace/tracecompass-master-nightly-neon/tmf/org.eclipse.tracecompass.tmf.remote/target/org.eclipse.tracecompass.tmf.remote-5.3.0-SNAPSHOT.jar
07:13:26 [2020-03-25T11:13:26.200Z] [INFO] 
07:13:26 [2020-03-25T11:13:26.200Z] [INFO] --- tycho-p2-plugin:1.3.0:p2-metadata-default (default-p2-metadata-default) @ org.eclipse.tracecompass.tmf.remote ---
07:13:26 [2020-03-25T11:13:26.200Z] [INFO] 
07:13:26 [2020-03-25T11:13:26.200Z] [INFO] --- tycho-p2-plugin:1.3.0:feature-p2-metadata (default-feature-p2-metadata) @ org.eclipse.tracecompass.tmf.remote ---
07:13:26 [2020-03-25T11:13:26.200Z] [INFO] 
07:13:26 [2020-03-25T11:13:26.200Z] [INFO] --- tycho-source-feature-plugin:1.3.0:source-feature (source-feature) @ org.eclipse.tracecompass.tmf.remote ---
07:13:26 [2020-03-25T11:13:26.200Z] [INFO] Building jar: /home/jenkins/agent/workspace/tracecompass-master-nightly-neon/tmf/org.eclipse.tracecompass.tmf.remote/target/org.eclipse.tracecompass.tmf.remote-5.3.0-SNAPSHOT-sources-feature.jar
07:13:26 [2020-03-25T11:13:26.200Z] [INFO] 
07:13:26 [2020-03-25T11:13:26.200Z] [INFO] --- tycho-pack200b-plugin:1.3.0:pack (pack200-pack) @ org.eclipse.tracecompass.tmf.remote ---
07:13:26 [2020-03-25T11:13:26.200Z] [INFO] 
07:13:26 [2020-03-25T11:13:26.200Z] [INFO] --- tycho-p2-plugin:1.3.0:p2-metadata (p2-metadata) @ org.eclipse.tracecompass.tmf.remote ---
07:13:26 [2020-03-25T11:13:26.200Z] [INFO] 
07:13:26 [2020-03-25T11:13:26.200Z] [INFO] --- maven-install-plugin:2.5.2:install (default-install) @ org.eclipse.tracecompass.tmf.remote ---
07:13:26 [2020-03-25T11:13:26.200Z] [INFO] Installing /home/jenkins/agent/workspace/tracecompass-master-nightly-neon/tmf/org.eclipse.tracecompass.tmf.remote/target/org.eclipse.tracecompass.tmf.remote-5.3.0-SNAPSHOT.jar to /home/jenkins/.m2/repository/org/eclipse/tracecompass/org.eclipse.tracecompass.tmf.remote/5.3.0-SNAPSHOT/org.eclipse.tracecompass.tmf.remote-5.3.0-SNAPSHOT.jar
07:13:26 [2020-03-25T11:13:26.200Z] [INFO] Installing /home/jenkins/agent/workspace/tracecompass-master-nightly-neon/tmf/org.eclipse.tracecompass.tmf.remote/.polyglot.build.properties to /home/jenkins/.m2/repository/org/eclipse/tracecompass/org.eclipse.tracecompass.tmf.remote/5.3.0-SNAPSHOT/org.eclipse.tracecompass.tmf.remote-5.3.0-SNAPSHOT.pom
07:13:26 [2020-03-25T11:13:26.200Z] [INFO] Installing /home/jenkins/agent/workspace/tracecompass-master-nightly-neon/tmf/org.eclipse.tracecompass.tmf.remote/target/org.eclipse.tracecompass.tmf.remote-5.3.0-SNAPSHOT-sources-feature.jar to /home/jenkins/.m2/repository/org/eclipse/tracecompass/org.eclipse.tracecompass.tmf.remote/5.3.0-SNAPSHOT/org.eclipse.tracecompass.tmf.remote-5.3.0-SNAPSHOT-sources-feature.jar
07:13:26 [2020-03-25T11:13:26.200Z] [INFO] Installing /home/jenkins/agent/workspace/tracecompass-master-nightly-neon/tmf/org.eclipse.tracecompass.tmf.remote/target/p2content.xml to /home/jenkins/.m2/repository/org/eclipse/tracecompass/org.eclipse.tracecompass.tmf.remote/5.3.0-SNAPSHOT/org.eclipse.tracecompass.tmf.remote-5.3.0-SNAPSHOT-p2metadata.xml
07:13:26 [2020-03-25T11:13:26.200Z] [INFO] Installing /home/jenkins/agent/workspace/tracecompass-master-nightly-neon/tmf/org.eclipse.tracecompass.tmf.remote/target/p2artifacts.xml to /home/jenkins/.m2/repository/org/eclipse/tracecompass/org.eclipse.tracecompass.tmf.remote/5.3.0-SNAPSHOT/org.eclipse.tracecompass.tmf.remote-5.3.0-SNAPSHOT-p2artifacts.xml
07:13:26 [2020-03-25T11:13:26.200Z] [INFO] 
07:13:26 [2020-03-25T11:13:26.200Z] [INFO] --- tycho-p2-plugin:1.3.0:update-local-index (default-update-local-index) @ org.eclipse.tracecompass.tmf.remote ---
07:13:26 [2020-03-25T11:13:26.200Z] [INFO] 
07:13:26 [2020-03-25T11:13:26.200Z] [INFO] ---< org.eclipse.tracecompass:org.eclipse.tracecompass.releng-site >----
07:13:26 [2020-03-25T11:13:26.200Z] [INFO] Building Trace Compass Repository 5.3.0-SNAPSHOT               [137/138]
07:13:26 [2020-03-25T11:13:26.200Z] [INFO] -------------------------[ eclipse-repository ]-------------------------
07:13:26 [2020-03-25T11:13:26.458Z] [INFO] 
07:13:26 [2020-03-25T11:13:26.458Z] [INFO] --- maven-clean-plugin:3.0.0:clean (default-clean) @ org.eclipse.tracecompass.releng-site ---
07:13:26 [2020-03-25T11:13:26.458Z] [INFO] 
07:13:26 [2020-03-25T11:13:26.458Z] [INFO] --- tycho-packaging-plugin:1.3.0:build-qualifier-aggregator (default-build-qualifier-aggregator) @ org.eclipse.tracecompass.releng-site ---
07:13:26 [2020-03-25T11:13:26.458Z] [INFO] The project's OSGi version is 5.3.0.202003251000
07:13:26 [2020-03-25T11:13:26.458Z] [INFO] 
07:13:26 [2020-03-25T11:13:26.458Z] [INFO] --- maven-enforcer-plugin:1.4.1:enforce (enforce-maven-version) @ org.eclipse.tracecompass.releng-site ---
07:13:26 [2020-03-25T11:13:26.458Z] [INFO] 
07:13:26 [2020-03-25T11:13:26.458Z] [INFO] --- maven-clean-plugin:3.0.0:clean (default-clean-1) @ org.eclipse.tracecompass.releng-site ---
07:13:26 [2020-03-25T11:13:26.458Z] [INFO] 
07:13:26 [2020-03-25T11:13:26.458Z] [INFO] --- maven-resources-plugin:3.0.2:resources (default-resources) @ org.eclipse.tracecompass.releng-site ---
07:13:26 [2020-03-25T11:13:26.458Z] [INFO] Using 'UTF-8' encoding to copy filtered resources.
07:13:26 [2020-03-25T11:13:26.458Z] [INFO] skip non existing resourceDirectory /home/jenkins/agent/workspace/tracecompass-master-nightly-neon/releng/org.eclipse.tracecompass.releng-site/src/main/resources
07:13:26 [2020-03-25T11:13:26.458Z] [INFO] 
07:13:26 [2020-03-25T11:13:26.458Z] [INFO] --- tycho-source-plugin:1.3.0:plugin-source (plugin-source) @ org.eclipse.tracecompass.releng-site ---
07:13:26 [2020-03-25T11:13:26.458Z] [INFO] 
07:13:26 [2020-03-25T11:13:26.458Z] [INFO] --- target-platform-configuration:1.3.0:target-platform (default-target-platform) @ org.eclipse.tracecompass.releng-site ---
07:13:26 [2020-03-25T11:13:26.458Z] [INFO] 
07:13:26 [2020-03-25T11:13:26.458Z] [INFO] --- tycho-p2-publisher-plugin:1.3.0:publish-osgi-ee (default-publish-osgi-ee) @ org.eclipse.tracecompass.releng-site ---
07:13:26 [2020-03-25T11:13:26.458Z] [INFO] Published profile IUs: [a.jre.javase 10.0.0, config.a.jre.javase 10.0.0]
07:13:26 [2020-03-25T11:13:26.458Z] [INFO] Published profile IUs: [a.jre.javase 11.0.0, config.a.jre.javase 11.0.0]
07:13:26 [2020-03-25T11:13:26.458Z] [INFO] 
07:13:26 [2020-03-25T11:13:26.458Z] [INFO] --- tycho-p2-publisher-plugin:1.3.0:publish-products (default-publish-products) @ org.eclipse.tracecompass.releng-site ---
07:13:26 [2020-03-25T11:13:26.458Z] [INFO] 
07:13:26 [2020-03-25T11:13:26.458Z] [INFO] --- tycho-p2-publisher-plugin:1.3.0:publish-categories (default-publish-categories) @ org.eclipse.tracecompass.releng-site ---
07:13:26 [2020-03-25T11:13:26.458Z] [INFO] 
07:13:26 [2020-03-25T11:13:26.458Z] [INFO] --- tycho-p2-publisher-plugin:1.3.0:attach-artifacts (default-attach-artifacts) @ org.eclipse.tracecompass.releng-site ---
07:13:26 [2020-03-25T11:13:26.458Z] [INFO] 
07:13:26 [2020-03-25T11:13:26.458Z] [INFO] --- tycho-p2-repository-plugin:1.3.0:assemble-repository (default-assemble-repository) @ org.eclipse.tracecompass.releng-site ---
07:13:44 [2020-03-25T11:13:44.516Z] [INFO] 
07:13:44 [2020-03-25T11:13:44.516Z] [INFO] --- tycho-p2-repository-plugin:1.3.0:archive-repository (default-archive-repository) @ org.eclipse.tracecompass.releng-site ---
07:13:44 [2020-03-25T11:13:44.516Z] [INFO] 
07:13:44 [2020-03-25T11:13:44.516Z] [INFO] --- tycho-source-feature-plugin:1.3.0:source-feature (source-feature) @ org.eclipse.tracecompass.releng-site ---
07:13:44 [2020-03-25T11:13:44.516Z] [INFO] 
07:13:44 [2020-03-25T11:13:44.516Z] [INFO] --- tycho-pack200b-plugin:1.3.0:pack (pack200-pack) @ org.eclipse.tracecompass.releng-site ---
07:13:44 [2020-03-25T11:13:44.516Z] [INFO] 
07:13:44 [2020-03-25T11:13:44.516Z] [INFO] --- tycho-p2-plugin:1.3.0:p2-metadata (p2-metadata) @ org.eclipse.tracecompass.releng-site ---
07:13:44 [2020-03-25T11:13:44.516Z] [INFO] 
07:13:44 [2020-03-25T11:13:44.516Z] [INFO] --- repository-utils:1.0.0:generate-repository-facade (generate-facade) @ org.eclipse.tracecompass.releng-site ---
07:13:44 [2020-03-25T11:13:44.516Z] [INFO] Building zip: /home/jenkins/agent/workspace/tracecompass-master-nightly-neon/releng/org.eclipse.tracecompass.releng-site/target/org.eclipse.tracecompass.releng-site-5.3.0-SNAPSHOT.zip
07:13:47 [2020-03-25T11:13:47.790Z] [INFO] 
07:13:47 [2020-03-25T11:13:47.790Z] [INFO] --- maven-install-plugin:2.5.2:install (default-install) @ org.eclipse.tracecompass.releng-site ---
07:13:47 [2020-03-25T11:13:47.790Z] [INFO] No primary artifact to install, installing attached artifacts instead.
07:13:47 [2020-03-25T11:13:47.790Z] [INFO] Installing /home/jenkins/agent/workspace/tracecompass-master-nightly-neon/releng/org.eclipse.tracecompass.releng-site/pom.xml to /home/jenkins/.m2/repository/org/eclipse/tracecompass/org.eclipse.tracecompass.releng-site/5.3.0-SNAPSHOT/org.eclipse.tracecompass.releng-site-5.3.0-SNAPSHOT.pom
07:13:47 [2020-03-25T11:13:47.790Z] [INFO] Installing /home/jenkins/agent/workspace/tracecompass-master-nightly-neon/releng/org.eclipse.tracecompass.releng-site/target/p2content.xml to /home/jenkins/.m2/repository/org/eclipse/tracecompass/org.eclipse.tracecompass.releng-site/5.3.0-SNAPSHOT/org.eclipse.tracecompass.releng-site-5.3.0-SNAPSHOT-p2metadata.xml
07:13:47 [2020-03-25T11:13:47.790Z] [INFO] Installing /home/jenkins/agent/workspace/tracecompass-master-nightly-neon/releng/org.eclipse.tracecompass.releng-site/target/p2artifacts.xml to /home/jenkins/.m2/repository/org/eclipse/tracecompass/org.eclipse.tracecompass.releng-site/5.3.0-SNAPSHOT/org.eclipse.tracecompass.releng-site-5.3.0-SNAPSHOT-p2artifacts.xml
07:13:47 [2020-03-25T11:13:47.790Z] [INFO] 
07:13:47 [2020-03-25T11:13:47.790Z] [INFO] --- tycho-p2-plugin:1.3.0:update-local-index (default-update-local-index) @ org.eclipse.tracecompass.releng-site ---
07:13:47 [2020-03-25T11:13:47.790Z] [INFO] 
07:13:47 [2020-03-25T11:13:47.790Z] [INFO] --< org.eclipse.tracecompass:org.eclipse.tracecompass.jsontrace.core.tests >--
07:13:47 [2020-03-25T11:13:47.790Z] [INFO] Building org.eclipse.tracecompass.jsontrace.core.tests 1.0.2-SNAPSHOT [138/138]
07:13:47 [2020-03-25T11:13:47.790Z] [INFO] ---------------------------[ eclipse-plugin ]---------------------------
07:13:47 [2020-03-25T11:13:47.790Z] [INFO] 
07:13:47 [2020-03-25T11:13:47.790Z] [INFO] --- maven-clean-plugin:3.0.0:clean (default-clean) @ org.eclipse.tracecompass.jsontrace.core.tests ---
07:13:47 [2020-03-25T11:13:47.790Z] [INFO] 
07:13:47 [2020-03-25T11:13:47.790Z] [INFO] --- tycho-packaging-plugin:1.3.0:build-qualifier (default-build-qualifier) @ org.eclipse.tracecompass.jsontrace.core.tests ---
07:13:47 [2020-03-25T11:13:47.791Z] [INFO] The project's OSGi version is 1.0.2.202003251000
07:13:47 [2020-03-25T11:13:47.791Z] [INFO] 
07:13:47 [2020-03-25T11:13:47.791Z] [INFO] --- tycho-packaging-plugin:1.3.0:validate-id (default-validate-id) @ org.eclipse.tracecompass.jsontrace.core.tests ---
07:13:47 [2020-03-25T11:13:47.791Z] [INFO] 
07:13:47 [2020-03-25T11:13:47.791Z] [INFO] --- tycho-packaging-plugin:1.3.0:validate-version (default-validate-version) @ org.eclipse.tracecompass.jsontrace.core.tests ---
07:13:47 [2020-03-25T11:13:47.791Z] [INFO] 
07:13:47 [2020-03-25T11:13:47.791Z] [INFO] --- maven-enforcer-plugin:1.4.1:enforce (enforce-maven-version) @ org.eclipse.tracecompass.jsontrace.core.tests ---
07:13:47 [2020-03-25T11:13:47.791Z] [INFO] 
07:13:47 [2020-03-25T11:13:47.791Z] [INFO] --- maven-resources-plugin:3.0.2:resources (default-resources) @ org.eclipse.tracecompass.jsontrace.core.tests ---
07:13:47 [2020-03-25T11:13:47.791Z] [INFO] Using 'UTF-8' encoding to copy filtered resources.
07:13:47 [2020-03-25T11:13:47.791Z] [INFO] skip non existing resourceDirectory /home/jenkins/agent/workspace/tracecompass-master-nightly-neon/jsontrace/org.eclipse.tracecompass.jsontrace.core.tests/src/main/resources
07:13:47 [2020-03-25T11:13:47.791Z] [INFO] 
07:13:47 [2020-03-25T11:13:47.791Z] [INFO] --- tycho-compiler-plugin:1.3.0:compile (default-compile) @ org.eclipse.tracecompass.jsontrace.core.tests ---
07:13:47 [2020-03-25T11:13:47.791Z] [INFO] Compiling 3 source files to /home/jenkins/agent/workspace/tracecompass-master-nightly-neon/jsontrace/org.eclipse.tracecompass.jsontrace.core.tests/target/classes
07:13:47 [2020-03-25T11:13:47.791Z] [INFO] 
07:13:47 [2020-03-25T11:13:47.791Z] [INFO] --- maven-resources-plugin:3.0.2:testResources (default-testResources) @ org.eclipse.tracecompass.jsontrace.core.tests ---
07:13:47 [2020-03-25T11:13:47.791Z] [INFO] Using 'UTF-8' encoding to copy filtered resources.
07:13:47 [2020-03-25T11:13:47.791Z] [INFO] skip non existing resourceDirectory /home/jenkins/agent/workspace/tracecompass-master-nightly-neon/jsontrace/org.eclipse.tracecompass.jsontrace.core.tests/src/test/resources
07:13:47 [2020-03-25T11:13:47.791Z] [INFO] 
07:13:47 [2020-03-25T11:13:47.791Z] [INFO] --- tycho-source-plugin:1.3.0:plugin-source (plugin-source) @ org.eclipse.tracecompass.jsontrace.core.tests ---
07:13:47 [2020-03-25T11:13:47.791Z] [INFO] Building jar: /home/jenkins/agent/workspace/tracecompass-master-nightly-neon/jsontrace/org.eclipse.tracecompass.jsontrace.core.tests/target/org.eclipse.tracecompass.jsontrace.core.tests-1.0.2-SNAPSHOT-sources.jar
07:13:47 [2020-03-25T11:13:47.791Z] [INFO] 
07:13:47 [2020-03-25T11:13:47.791Z] [INFO] --- target-platform-configuration:1.3.0:target-platform (default-target-platform) @ org.eclipse.tracecompass.jsontrace.core.tests ---
07:13:47 [2020-03-25T11:13:47.791Z] [INFO] 
07:13:47 [2020-03-25T11:13:47.791Z] [INFO] --- tycho-packaging-plugin:1.3.0:package-plugin (default-package-plugin) @ org.eclipse.tracecompass.jsontrace.core.tests ---
07:13:47 [2020-03-25T11:13:47.791Z] [INFO] Building jar: /home/jenkins/agent/workspace/tracecompass-master-nightly-neon/jsontrace/org.eclipse.tracecompass.jsontrace.core.tests/target/org.eclipse.tracecompass.jsontrace.core.tests-1.0.2-SNAPSHOT.jar
07:13:47 [2020-03-25T11:13:47.791Z] [INFO] 
07:13:47 [2020-03-25T11:13:47.791Z] [INFO] --- tycho-p2-plugin:1.3.0:p2-metadata-default (default-p2-metadata-default) @ org.eclipse.tracecompass.jsontrace.core.tests ---
07:13:47 [2020-03-25T11:13:47.791Z] [INFO] 
07:13:47 [2020-03-25T11:13:47.791Z] [INFO] --- tycho-source-feature-plugin:1.3.0:source-feature (source-feature) @ org.eclipse.tracecompass.jsontrace.core.tests ---
07:13:47 [2020-03-25T11:13:47.791Z] [INFO] 
07:13:47 [2020-03-25T11:13:47.791Z] [INFO] --- tycho-pack200b-plugin:1.3.0:pack (pack200-pack) @ org.eclipse.tracecompass.jsontrace.core.tests ---
07:13:47 [2020-03-25T11:13:47.791Z] [INFO] Pack200 packing jar /home/jenkins/agent/workspace/tracecompass-master-nightly-neon/jsontrace/org.eclipse.tracecompass.jsontrace.core.tests/target/org.eclipse.tracecompass.jsontrace.core.tests-1.0.2-SNAPSHOT.jar
07:13:47 [2020-03-25T11:13:47.791Z] [INFO] 
07:13:47 [2020-03-25T11:13:47.791Z] [INFO] --- tycho-p2-plugin:1.3.0:p2-metadata (p2-metadata) @ org.eclipse.tracecompass.jsontrace.core.tests ---
07:13:47 [2020-03-25T11:13:47.791Z] [INFO] 
07:13:47 [2020-03-25T11:13:47.791Z] [INFO] --- maven-install-plugin:2.5.2:install (default-install) @ org.eclipse.tracecompass.jsontrace.core.tests ---
07:13:47 [2020-03-25T11:13:47.791Z] [INFO] Installing /home/jenkins/agent/workspace/tracecompass-master-nightly-neon/jsontrace/org.eclipse.tracecompass.jsontrace.core.tests/target/org.eclipse.tracecompass.jsontrace.core.tests-1.0.2-SNAPSHOT.jar to /home/jenkins/.m2/repository/org/eclipse/tracecompass/org.eclipse.tracecompass.jsontrace.core.tests/1.0.2-SNAPSHOT/org.eclipse.tracecompass.jsontrace.core.tests-1.0.2-SNAPSHOT.jar
07:13:47 [2020-03-25T11:13:47.791Z] [INFO] Installing /home/jenkins/agent/workspace/tracecompass-master-nightly-neon/jsontrace/org.eclipse.tracecompass.jsontrace.core.tests/pom.xml to /home/jenkins/.m2/repository/org/eclipse/tracecompass/org.eclipse.tracecompass.jsontrace.core.tests/1.0.2-SNAPSHOT/org.eclipse.tracecompass.jsontrace.core.tests-1.0.2-SNAPSHOT.pom
07:13:47 [2020-03-25T11:13:47.791Z] [INFO] Installing /home/jenkins/agent/workspace/tracecompass-master-nightly-neon/jsontrace/org.eclipse.tracecompass.jsontrace.core.tests/target/org.eclipse.tracecompass.jsontrace.core.tests-1.0.2-SNAPSHOT-sources.jar to /home/jenkins/.m2/repository/org/eclipse/tracecompass/org.eclipse.tracecompass.jsontrace.core.tests/1.0.2-SNAPSHOT/org.eclipse.tracecompass.jsontrace.core.tests-1.0.2-SNAPSHOT-sources.jar
07:13:47 [2020-03-25T11:13:47.791Z] [INFO] Installing /home/jenkins/agent/workspace/tracecompass-master-nightly-neon/jsontrace/org.eclipse.tracecompass.jsontrace.core.tests/target/org.eclipse.tracecompass.jsontrace.core.tests-1.0.2-SNAPSHOT.jar.pack.gz to /home/jenkins/.m2/repository/org/eclipse/tracecompass/org.eclipse.tracecompass.jsontrace.core.tests/1.0.2-SNAPSHOT/org.eclipse.tracecompass.jsontrace.core.tests-1.0.2-SNAPSHOT-pack200.jar.pack.gz
07:13:47 [2020-03-25T11:13:47.791Z] [INFO] Installing /home/jenkins/agent/workspace/tracecompass-master-nightly-neon/jsontrace/org.eclipse.tracecompass.jsontrace.core.tests/target/p2content.xml to /home/jenkins/.m2/repository/org/eclipse/tracecompass/org.eclipse.tracecompass.jsontrace.core.tests/1.0.2-SNAPSHOT/org.eclipse.tracecompass.jsontrace.core.tests-1.0.2-SNAPSHOT-p2metadata.xml
07:13:47 [2020-03-25T11:13:47.791Z] [INFO] Installing /home/jenkins/agent/workspace/tracecompass-master-nightly-neon/jsontrace/org.eclipse.tracecompass.jsontrace.core.tests/target/p2artifacts.xml to /home/jenkins/.m2/repository/org/eclipse/tracecompass/org.eclipse.tracecompass.jsontrace.core.tests/1.0.2-SNAPSHOT/org.eclipse.tracecompass.jsontrace.core.tests-1.0.2-SNAPSHOT-p2artifacts.xml
07:13:47 [2020-03-25T11:13:47.791Z] [INFO] 
07:13:47 [2020-03-25T11:13:47.791Z] [INFO] --- tycho-p2-plugin:1.3.0:update-local-index (default-update-local-index) @ org.eclipse.tracecompass.jsontrace.core.tests ---
07:13:47 [2020-03-25T11:13:47.791Z] [INFO] ------------------------------------------------------------------------
07:13:47 [2020-03-25T11:13:47.791Z] [INFO] Reactor Summary:
07:13:47 [2020-03-25T11:13:47.791Z] [INFO] 
07:13:47 [2020-03-25T11:13:47.791Z] [INFO] Trace Compass Parent 5.3.0-SNAPSHOT ................ SUCCESS [ 29.410 s]
07:13:47 [2020-03-25T11:13:47.791Z] [INFO] Trace Compass Tracetype-agnostic Analyses Parent 5.3.0-SNAPSHOT SUCCESS [  0.017 s]
07:13:47 [2020-03-25T11:13:47.791Z] [INFO] Trace Compass Common Utilities Parent 5.3.0-SNAPSHOT SUCCESS [  0.057 s]
07:13:47 [2020-03-25T11:13:47.791Z] [INFO] org.eclipse.tracecompass.common.core 4.2.1-SNAPSHOT  SUCCESS [ 19.135 s]
07:13:47 [2020-03-25T11:13:47.791Z] [INFO] Trace Compass State System Parent 5.3.0-SNAPSHOT ... SUCCESS [  0.014 s]
07:13:47 [2020-03-25T11:13:47.791Z] [INFO] org.eclipse.tracecompass.datastore.core 1.2.1-SNAPSHOT SUCCESS [  1.866 s]
07:13:47 [2020-03-25T11:13:47.791Z] [INFO] org.eclipse.tracecompass.segmentstore.core 2.1.3-SNAPSHOT SUCCESS [  1.334 s]
07:13:47 [2020-03-25T11:13:47.791Z] [INFO] org.eclipse.tracecompass.statesystem.core 4.3.1-SNAPSHOT SUCCESS [  1.746 s]
07:13:47 [2020-03-25T11:13:47.791Z] [INFO] Trace Compass TMF Parent 5.3.0-SNAPSHOT ............ SUCCESS [  0.011 s]
07:13:47 [2020-03-25T11:13:47.791Z] [INFO] Trace Compass Filter Parser 1.0.5-SNAPSHOT ......... SUCCESS [  0.524 s]
07:13:47 [2020-03-25T11:13:47.791Z] [INFO] org.eclipse.tracecompass.tmf.core 5.2.1-SNAPSHOT ... SUCCESS [ 10.868 s]
07:13:47 [2020-03-25T11:13:47.791Z] [INFO] org.eclipse.tracecompass.analysis.counters.core 2.0.3-SNAPSHOT SUCCESS [  0.895 s]
07:13:47 [2020-03-25T11:13:47.791Z] [INFO] Trace Compass CTF Support Parent 5.3.0-SNAPSHOT .... SUCCESS [  0.011 s]
07:13:47 [2020-03-25T11:13:47.791Z] [INFO] Trace Compass CTF Parser Plug-in 1.0.5-SNAPSHOT .... SUCCESS [  7.215 s]
07:13:47 [2020-03-25T11:13:47.791Z] [INFO] org.eclipse.tracecompass.ctf.core 4.0.3-SNAPSHOT ... SUCCESS [  2.107 s]
07:13:47 [2020-03-25T11:13:47.791Z] [INFO] Trace Compass CTF Core Tests Plug-in 1.0.8-SNAPSHOT  SUCCESS [01:05 min]
07:13:47 [2020-03-25T11:13:47.791Z] [INFO] org.eclipse.tracecompass.statesystem.core.tests 1.0.11-SNAPSHOT SUCCESS [ 16.722 s]
07:13:47 [2020-03-25T11:13:47.791Z] [INFO] org.eclipse.tracecompass.tmf.core.tests 1.0.12-SNAPSHOT SUCCESS [05:33 min]
07:13:47 [2020-03-25T11:13:47.791Z] [INFO] org.eclipse.tracecompass.tmf.ctf.core 4.2.1-SNAPSHOT SUCCESS [  0.947 s]
07:13:47 [2020-03-25T11:13:47.791Z] [INFO] org.eclipse.tracecompass.tmf.ctf.core.tests 1.0.10-SNAPSHOT SUCCESS [05:53 min]
07:13:47 [2020-03-25T11:13:47.791Z] [INFO] org.eclipse.tracecompass.analysis.counters.core.tests 0.0.2-SNAPSHOT SUCCESS [  7.176 s]
07:13:47 [2020-03-25T11:13:47.791Z] [INFO] org.eclipse.tracecompass.tmf.ui 5.3.0-SNAPSHOT ..... SUCCESS [ 13.090 s]
07:13:47 [2020-03-25T11:13:47.791Z] [INFO] org.eclipse.tracecompass.analysis.counters.ui 0.0.6-SNAPSHOT SUCCESS [  0.896 s]
07:13:47 [2020-03-25T11:13:47.791Z] [INFO] org.eclipse.tracecompass.tmf.ui.tests 1.0.13-SNAPSHOT SUCCESS [03:15 min]
07:13:47 [2020-03-25T11:13:47.791Z] [INFO] org.eclipse.tracecompass.tmf.ui.swtbot.tests 1.0.12-SNAPSHOT SUCCESS [06:17 min]
07:13:47 [2020-03-25T11:13:47.791Z] [INFO] org.eclipse.tracecompass.analysis.graph.core 2.1.5-SNAPSHOT SUCCESS [  0.912 s]
07:13:47 [2020-03-25T11:13:47.791Z] [INFO] org.eclipse.tracecompass.tmf.chart.core 1.0.3-SNAPSHOT SUCCESS [  0.597 s]
07:13:47 [2020-03-25T11:13:47.791Z] [INFO] org.eclipse.tracecompass.analysis.lami.core 1.1.2-SNAPSHOT SUCCESS [  0.921 s]
07:13:47 [2020-03-25T11:13:47.791Z] [INFO] org.eclipse.tracecompass.analysis.timing.core 5.1.1-SNAPSHOT SUCCESS [  0.860 s]
07:13:47 [2020-03-25T11:13:47.791Z] [INFO] org.eclipse.tracecompass.analysis.os.linux.core 4.2.0-SNAPSHOT SUCCESS [  2.011 s]
07:13:47 [2020-03-25T11:13:47.791Z] [INFO] Trace Compass LTTng Support Parent 5.3.0-SNAPSHOT .. SUCCESS [  0.019 s]
07:13:47 [2020-03-25T11:13:47.791Z] [INFO] org.eclipse.tracecompass.lttng2.common.core 1.1.2-SNAPSHOT SUCCESS [  0.370 s]
07:13:47 [2020-03-25T11:13:47.791Z] [INFO] org.eclipse.tracecompass.tmf.analysis.xml.core 3.2.5-SNAPSHOT SUCCESS [  2.051 s]
07:13:47 [2020-03-25T11:13:47.791Z] [INFO] org.eclipse.tracecompass.lttng2.kernel.core 3.0.3-SNAPSHOT SUCCESS [  0.962 s]
07:13:47 [2020-03-25T11:13:47.791Z] [INFO] org.eclipse.tracecompass.analysis.counters.ui.swtbot.tests 0.0.5-SNAPSHOT SUCCESS [01:25 min]
07:13:47 [2020-03-25T11:13:47.791Z] [INFO] org.eclipse.tracecompass.analysis.graph.core.tests 1.0.5-SNAPSHOT SUCCESS [  8.434 s]
07:13:47 [2020-03-25T11:13:47.791Z] [INFO] org.eclipse.tracecompass.analysis.graph.ui 1.0.10-SNAPSHOT SUCCESS [  0.696 s]
07:13:47 [2020-03-25T11:13:47.791Z] [INFO] org.eclipse.tracecompass.analysis.lami.core.tests 1.0.3-SNAPSHOT SUCCESS [  6.569 s]
07:13:47 [2020-03-25T11:13:47.791Z] [INFO] org.eclipse.tracecompass.tmf.chart.ui 1.0.9-SNAPSHOT SUCCESS [  1.100 s]
07:13:47 [2020-03-25T11:13:47.791Z] [INFO] org.eclipse.tracecompass.analysis.lami.ui 1.1.3-SNAPSHOT SUCCESS [  0.826 s]
07:13:47 [2020-03-25T11:13:47.791Z] [INFO] org.eclipse.tracecompass.tmf.chart.core.tests 1.0.2-SNAPSHOT SUCCESS [  6.108 s]
07:13:47 [2020-03-25T11:13:47.791Z] [INFO] org.eclipse.tracecompass.tmf.chart.ui.swtbot.tests 1.0.4-SNAPSHOT SUCCESS [ 16.636 s]
07:13:47 [2020-03-25T11:13:47.791Z] [INFO] org.eclipse.tracecompass.analysis.lami.ui.swtbot.tests 1.0.4-SNAPSHOT SUCCESS [ 29.111 s]
07:13:47 [2020-03-25T11:13:47.791Z] [INFO] org.eclipse.tracecompass.analysis.os.linux.core.tests 1.0.12-SNAPSHOT SUCCESS [02:03 min]
07:13:47 [2020-03-25T11:13:47.791Z] [INFO] org.eclipse.tracecompass.analysis.timing.ui 4.0.3-SNAPSHOT SUCCESS [  1.247 s]
07:13:47 [2020-03-25T11:13:47.791Z] [INFO] org.eclipse.tracecompass.analysis.os.linux.ui 3.0.7-SNAPSHOT SUCCESS [  1.449 s]
07:13:47 [2020-03-25T11:13:47.791Z] [INFO] org.eclipse.tracecompass.analysis.os.linux.ui.tests 1.0.8-SNAPSHOT SUCCESS [ 18.408 s]
07:13:47 [2020-03-25T11:13:47.791Z] [INFO] org.eclipse.tracecompass.analysis.timing.core.tests 1.0.5-SNAPSHOT SUCCESS [ 13.446 s]
07:13:47 [2020-03-25T11:13:47.791Z] [INFO] org.eclipse.tracecompass.analysis.timing.ui.swtbot.tests 1.0.9-SNAPSHOT SUCCESS [ 55.278 s]
07:13:47 [2020-03-25T11:13:47.791Z] [INFO] org.eclipse.tracecompass.analysis.os.linux.ui.swtbot.tests 1.0.13-SNAPSHOT SUCCESS [01:38 min]
07:13:47 [2020-03-25T11:13:47.791Z] [INFO] org.eclipse.tracecompass.analysis.profiling.core 1.2.1-SNAPSHOT SUCCESS [  1.031 s]
07:13:47 [2020-03-25T11:13:47.791Z] [INFO] org.eclipse.tracecompass.analysis.profiling.core.tests 1.0.3-SNAPSHOT SUCCESS [ 53.708 s]
07:13:47 [2020-03-25T11:13:47.791Z] [INFO] org.eclipse.tracecompass.analysis.profiling.ui 2.0.3-SNAPSHOT SUCCESS [  1.209 s]
07:13:47 [2020-03-25T11:13:47.791Z] [INFO] org.eclipse.tracecompass.analysis.profiling.ui.swtbot.tests 1.0.3-SNAPSHOT SUCCESS [ 19.579 s]
07:13:47 [2020-03-25T11:13:47.791Z] [INFO] Trace Compass BTF Support Parent 5.3.0-SNAPSHOT .... SUCCESS [  0.012 s]
07:13:47 [2020-03-25T11:13:47.791Z] [INFO] org.eclipse.tracecompass.btf.core 2.2.1-SNAPSHOT ... SUCCESS [  0.436 s]
07:13:47 [2020-03-25T11:13:47.791Z] [INFO] Trace Compass Documentation 5.3.0-SNAPSHOT ......... SUCCESS [  0.045 s]
07:13:47 [2020-03-25T11:13:47.791Z] [INFO] Trace Compass Developer Guide 5.3.0-SNAPSHOT ....... SUCCESS [ 33.103 s]
07:13:47 [2020-03-25T11:13:47.791Z] [INFO] org.eclipse.tracecompass.tmf.analysis.xml.ui 2.1.11-SNAPSHOT SUCCESS [  1.043 s]
07:13:47 [2020-03-25T11:13:47.791Z] [INFO] org.eclipse.tracecompass.tmf 5.3.0-SNAPSHOT ........ SUCCESS [  0.518 s]
07:13:47 [2020-03-25T11:13:47.791Z] [INFO] org.eclipse.tracecompass.btf.ui 1.0.3-SNAPSHOT ..... SUCCESS [  0.520 s]
07:13:47 [2020-03-25T11:13:47.791Z] [INFO] org.eclipse.tracecompass.btf 5.3.0-SNAPSHOT ........ SUCCESS [  0.277 s]
07:13:47 [2020-03-25T11:13:47.791Z] [INFO] org.eclipse.tracecompass.btf.core.tests 1.0.2-SNAPSHOT SUCCESS [  7.014 s]
07:13:47 [2020-03-25T11:13:47.791Z] [INFO] org.eclipse.tracecompass.common.core.tests 1.1.8-SNAPSHOT SUCCESS [  7.986 s]
07:13:47 [2020-03-25T11:13:47.791Z] [INFO] org.eclipse.tracecompass.ctf 5.3.0-SNAPSHOT ........ SUCCESS [  0.184 s]
07:13:47 [2020-03-25T11:13:47.791Z] [INFO] org.eclipse.tracecompass.ctf.parser.tests 1.0.2-SNAPSHOT SUCCESS [  6.565 s]
07:13:47 [2020-03-25T11:13:47.791Z] [INFO] org.eclipse.tracecompass.tmf.ctf 5.3.0-SNAPSHOT .... SUCCESS [  0.203 s]
07:13:47 [2020-03-25T11:13:47.791Z] [INFO] org.eclipse.tracecompass.tmf.ctf.ui.swtbot.tests 1.0.10-SNAPSHOT SUCCESS [02:28 min]
07:13:47 [2020-03-25T11:13:47.791Z] [INFO] Trace Compass User Guide 5.3.0-SNAPSHOT ............ SUCCESS [ 10.493 s]
07:13:47 [2020-03-25T11:13:47.791Z] [INFO] Trace Compass GDB Tracepoint Analysis User Guide 5.3.0-SNAPSHOT SUCCESS [  6.289 s]
07:13:47 [2020-03-25T11:13:47.791Z] [INFO] Trace Compass RCP User Guide 5.3.0-SNAPSHOT ........ SUCCESS [  5.910 s]
07:13:47 [2020-03-25T11:13:47.791Z] [INFO] Trace Compass Pcap User Guide 5.3.0-SNAPSHOT ....... SUCCESS [  5.989 s]
07:13:47 [2020-03-25T11:13:47.791Z] [INFO] org.eclipse.tracecompass.examples 1.0.5-SNAPSHOT ... SUCCESS [  0.819 s]
07:13:47 [2020-03-25T11:13:47.791Z] [INFO] Trace Compass GDB Tracepoint Analysis Parent 5.3.0-SNAPSHOT SUCCESS [  0.010 s]
07:13:47 [2020-03-25T11:13:47.791Z] [INFO] org.eclipse.tracecompass.gdbtrace.core 1.0.5-SNAPSHOT SUCCESS [  0.990 s]
07:13:47 [2020-03-25T11:13:47.791Z] [INFO] org.eclipse.tracecompass.gdbtrace.ui 1.1.3-SNAPSHOT  SUCCESS [  0.499 s]
07:13:47 [2020-03-25T11:13:47.791Z] [INFO] org.eclipse.tracecompass.gdbtrace 5.3.0-SNAPSHOT ... SUCCESS [  0.224 s]
07:13:47 [2020-03-25T11:13:47.791Z] [INFO] org.eclipse.tracecompass.gdbtrace.core.tests 1.0.1-SNAPSHOT SUCCESS [  6.849 s]
07:13:47 [2020-03-25T11:13:47.791Z] [INFO] org.eclipse.tracecompass.gdbtrace.ui.tests 1.0.1-SNAPSHOT SUCCESS [ 21.791 s]
07:13:47 [2020-03-25T11:13:47.791Z] [INFO] org.eclipse.tracecompass.lttng2.common.core.tests 1.0.1-SNAPSHOT SUCCESS [  6.131 s]
07:13:47 [2020-03-25T11:13:47.791Z] [INFO] org.eclipse.tracecompass.lttng2.control.core 1.2.4-SNAPSHOT SUCCESS [  1.082 s]
07:13:47 [2020-03-25T11:13:47.791Z] [INFO] org.eclipse.tracecompass.tmf.remote.core 2.0.4-SNAPSHOT SUCCESS [  0.409 s]
07:13:47 [2020-03-25T11:13:47.791Z] [INFO] org.eclipse.tracecompass.tmf.remote.ui 1.0.8-SNAPSHOT SUCCESS [  1.140 s]
07:13:47 [2020-03-25T11:13:47.791Z] [INFO] org.eclipse.tracecompass.lttng2.control.ui 1.2.10-SNAPSHOT SUCCESS [  3.004 s]
07:13:47 [2020-03-25T11:13:47.791Z] [INFO] org.eclipse.tracecompass.lttng2.control 5.3.0-SNAPSHOT SUCCESS [  0.288 s]
07:13:47 [2020-03-25T11:13:47.791Z] [INFO] org.eclipse.tracecompass.lttng2.control.core.tests 1.1.2-SNAPSHOT SUCCESS [  8.644 s]
07:13:47 [2020-03-25T11:13:47.791Z] [INFO] org.eclipse.tracecompass.tmf.remote.core.tests 1.0.1-SNAPSHOT SUCCESS [  8.891 s]
07:13:47 [2020-03-25T11:13:47.791Z] [INFO] org.eclipse.tracecompass.lttng2.control.ui.tests 2.0.4-SNAPSHOT SUCCESS [ 55.270 s]
07:13:47 [2020-03-25T11:13:47.791Z] [INFO] org.eclipse.tracecompass.lttng2.control.ui.swtbot.tests 1.0.7-SNAPSHOT SUCCESS [01:02 min]
07:13:47 [2020-03-25T11:13:47.791Z] [INFO] org.eclipse.tracecompass.lttng2.kernel.ui 2.0.1-SNAPSHOT SUCCESS [  0.447 s]
07:13:47 [2020-03-25T11:13:47.791Z] [INFO] org.eclipse.tracecompass.lttng2.kernel 5.3.0-SNAPSHOT SUCCESS [  0.198 s]
07:13:47 [2020-03-25T11:13:47.791Z] [INFO] org.eclipse.tracecompass.tmf.analysis.xml.core.tests 1.0.11-SNAPSHOT SUCCESS [ 50.193 s]
07:13:47 [2020-03-25T11:13:47.791Z] [INFO] org.eclipse.tracecompass.lttng2.kernel.core.tests 2.0.1-SNAPSHOT SUCCESS [01:35 min]
07:13:47 [2020-03-25T11:13:47.791Z] [INFO] org.eclipse.tracecompass.lttng2.kernel.ui.swtbot.tests 1.0.13-SNAPSHOT SUCCESS [04:49 min]
07:13:47 [2020-03-25T11:13:47.791Z] [INFO] org.eclipse.tracecompass.lttng2.ust.core 4.1.1-SNAPSHOT SUCCESS [  0.880 s]
07:13:47 [2020-03-25T11:13:47.791Z] [INFO] org.eclipse.tracecompass.lttng2.ust.ui 3.0.7-SNAPSHOT SUCCESS [  0.711 s]
07:13:47 [2020-03-25T11:13:47.791Z] [INFO] org.eclipse.tracecompass.lttng2.ust 5.3.0-SNAPSHOT . SUCCESS [  0.244 s]
07:13:47 [2020-03-25T11:13:47.791Z] [INFO] org.eclipse.tracecompass.lttng2.ust.core.tests 1.0.10-SNAPSHOT SUCCESS [ 33.927 s]
07:13:47 [2020-03-25T11:13:47.791Z] [INFO] org.eclipse.tracecompass.lttng2.ust.ui.tests 1.0.1-SNAPSHOT SUCCESS [ 17.913 s]
07:13:47 [2020-03-25T11:13:47.791Z] [INFO] org.eclipse.tracecompass.lttng2.ust.ui.swtbot.tests 1.0.12-SNAPSHOT SUCCESS [01:18 min]
07:13:47 [2020-03-25T11:13:47.791Z] [INFO] Trace Compass Pcap Format Support Parent 5.3.0-SNAPSHOT SUCCESS [  0.065 s]
07:13:47 [2020-03-25T11:13:47.791Z] [INFO] org.eclipse.tracecompass.pcap.core 1.1.2-SNAPSHOT .. SUCCESS [  0.553 s]
07:13:47 [2020-03-25T11:13:47.791Z] [INFO] Trace Compass Pcap Parser Core Tests Plug-in 1.0.4-SNAPSHOT SUCCESS [ 11.121 s]
07:13:47 [2020-03-25T11:13:47.791Z] [INFO] org.eclipse.tracecompass.tmf.pcap.core 1.0.4-SNAPSHOT SUCCESS [  0.580 s]
07:13:47 [2020-03-25T11:13:47.791Z] [INFO] org.eclipse.tracecompass.tmf.pcap.ui 1.1.3-SNAPSHOT  SUCCESS [  0.508 s]
07:13:47 [2020-03-25T11:13:47.791Z] [INFO] org.eclipse.tracecompass.tmf.pcap 5.3.0-SNAPSHOT ... SUCCESS [  0.250 s]
07:13:47 [2020-03-25T11:13:47.791Z] [INFO] org.eclipse.tracecompass.tmf.pcap.core.tests 1.0.2-SNAPSHOT SUCCESS [  7.519 s]
07:13:47 [2020-03-25T11:13:47.791Z] [INFO] org.eclipse.tracecompass.tmf.pcap.ui.swtbot.tests 1.0.1-SNAPSHOT SUCCESS [ 39.999 s]
07:13:47 [2020-03-25T11:13:47.791Z] [INFO] Trace Compass RCP Parent 5.3.0-SNAPSHOT ............ SUCCESS [  0.009 s]
07:13:47 [2020-03-25T11:13:47.791Z] [INFO] Trace Compass RCP Branding plug-in 5.3.0-SNAPSHOT .. SUCCESS [  0.251 s]
07:13:47 [2020-03-25T11:13:47.791Z] [INFO] Trace Compass RCP Branding Feature 5.3.0-SNAPSHOT .. SUCCESS [  0.108 s]
07:13:47 [2020-03-25T11:13:47.791Z] [INFO] org.eclipse.tracecompass.tmf.cli.core 1.0.1-SNAPSHOT SUCCESS [  0.318 s]
07:13:47 [2020-03-25T11:13:47.791Z] [INFO] org.eclipse.tracecompass.rcp.ui 5.3.0-SNAPSHOT ..... SUCCESS [  0.643 s]
07:13:47 [2020-03-25T11:13:47.791Z] [INFO] Trace Compass RCP Feature 5.3.0-SNAPSHOT ........... SUCCESS [  0.564 s]
07:13:47 [2020-03-25T11:13:47.791Z] [INFO] org.eclipse.tracecompass.tmf.cli.core.tests 1.0.1-SNAPSHOT SUCCESS [  6.734 s]
07:13:47 [2020-03-25T11:13:47.791Z] [INFO] org.eclipse.tracecompass.rcp.ui.tests 2.0.3-SNAPSHOT SUCCESS [ 17.301 s]
07:13:47 [2020-03-25T11:13:47.791Z] [INFO] org.eclipse.tracecompass.rcp.incubator.ui 1.0.1-SNAPSHOT SUCCESS [  0.307 s]
07:13:47 [2020-03-25T11:13:47.791Z] [INFO] org.eclipse.tracecompass.rcp.incubator 5.3.0-SNAPSHOT SUCCESS [  0.658 s]
07:13:47 [2020-03-25T11:13:47.791Z] [INFO] Trace Compass Json trace Parent 5.3.0-SNAPSHOT ..... SUCCESS [  0.008 s]
07:13:47 [2020-03-25T11:13:47.791Z] [INFO] org.eclipse.tracecompass.jsontrace.core 0.1.4-SNAPSHOT SUCCESS [  0.528 s]
07:13:47 [2020-03-25T11:13:47.791Z] [INFO] org.eclipse.tracecompass.jsontrace 1.1.0-SNAPSHOT .. SUCCESS [  0.255 s]
07:13:47 [2020-03-25T11:13:47.791Z] [INFO] org.eclipse.tracecompass.tmf.cli 1.0.0-SNAPSHOT .... SUCCESS [  0.197 s]
07:13:47 [2020-03-25T11:13:47.791Z] [INFO] Trace Compass RCP Product 5.3.0-SNAPSHOT ........... SUCCESS [01:55 min]
07:13:47 [2020-03-25T11:13:47.791Z] [INFO] Trace Compass Release Engineering Parent 5.3.0-SNAPSHOT SUCCESS [  0.015 s]
07:13:47 [2020-03-25T11:13:47.791Z] [INFO] Trace Compass Target Platform 5.3.0-SNAPSHOT ....... SUCCESS [  5.364 s]
07:13:47 [2020-03-25T11:13:47.791Z] [INFO] org.eclipse.tracecompass.integration.swtbot.tests 1.0.11-SNAPSHOT SUCCESS [08:55 min]
07:13:47 [2020-03-25T11:13:47.791Z] [INFO] org.eclipse.tracecompass.datastore.core.tests 1.0.4-SNAPSHOT SUCCESS [  8.994 s]
07:13:47 [2020-03-25T11:13:47.791Z] [INFO] org.eclipse.tracecompass.segmentstore.core.tests 1.0.4-SNAPSHOT SUCCESS [  8.398 s]
07:13:47 [2020-03-25T11:13:47.791Z] [INFO] org.eclipse.tracecompass.tmf.analysis.xml.ui.swtbot.tests 1.0.10-SNAPSHOT SUCCESS [01:09 min]
07:13:47 [2020-03-25T11:13:47.791Z] [INFO] org.eclipse.tracecompass.tmf.analysis.xml.ui.tests 1.0.3-SNAPSHOT SUCCESS [ 18.927 s]
07:13:47 [2020-03-25T11:13:47.791Z] [INFO] org.eclipse.tracecompass.tmf.chart.ui.tests 1.0.1-SNAPSHOT SUCCESS [ 18.276 s]
07:13:47 [2020-03-25T11:13:47.791Z] [INFO] org.eclipse.tracecompass.tmf.remote.ui.swtbot.tests 1.0.8-SNAPSHOT SUCCESS [01:39 min]
07:13:47 [2020-03-25T11:13:47.791Z] [INFO] org.eclipse.tracecompass.tmf.remote.ui.tests 1.0.1-SNAPSHOT SUCCESS [ 18.403 s]
07:13:47 [2020-03-25T11:13:47.791Z] [INFO] Trace Compass All Tests 1.0.9-SNAPSHOT ............. SUCCESS [  9.675 s]
07:13:47 [2020-03-25T11:13:47.791Z] [INFO] org.eclipse.tracecompass.testing 5.3.0-SNAPSHOT .... SUCCESS [  0.470 s]
07:13:47 [2020-03-25T11:13:47.791Z] [INFO] org.eclipse.tracecompass.tmf.remote 5.3.0-SNAPSHOT . SUCCESS [  0.145 s]
07:13:47 [2020-03-25T11:13:47.791Z] [INFO] Trace Compass Repository 5.3.0-SNAPSHOT ............ SUCCESS [ 21.068 s]
07:13:47 [2020-03-25T11:13:47.791Z] [INFO] org.eclipse.tracecompass.jsontrace.core.tests 1.0.2-SNAPSHOT SUCCESS [  0.536 s]
07:13:47 [2020-03-25T11:13:47.791Z] [INFO] ------------------------------------------------------------------------
07:13:47 [2020-03-25T11:13:47.791Z] [INFO] BUILD SUCCESS
07:13:47 [2020-03-25T11:13:47.791Z] [INFO] ------------------------------------------------------------------------
07:13:47 [2020-03-25T11:13:47.791Z] [INFO] Total time:  01:13 h
07:13:47 [2020-03-25T11:13:47.791Z] [INFO] Finished at: 2020-03-25T11:13:47Z
07:13:47 [2020-03-25T11:13:47.791Z] [INFO] ------------------------------------------------------------------------