SuccessConsole Output

Skipping 14,302 KB.. Full Log
{Apply and Close} time=-1164749371 data=null doit=true} to (of type 'Button' and (with mnemonic 'Apply and Close' or with mnemonic 'OK') and with style 'SWT.PUSH')
13:44:44 [2020-08-04T17:44:44.980Z] DEBUG - Sent event FocusIn [15]: FocusEvent{Button {Apply and Close} time=-1164749371 data=null} to (of type 'Button' and (with mnemonic 'Apply and Close' or with mnemonic 'OK') and with style 'SWT.PUSH')
13:44:44 [2020-08-04T17:44:44.980Z] DEBUG - Sent event MouseDown [3]: MouseEvent{Button {Apply and Close} time=-1164749371 data=null button=0 stateMask=0x0 x=0 y=0 count=0} to (of type 'Button' and (with mnemonic 'Apply and Close' or with mnemonic 'OK') and with style 'SWT.PUSH')
13:44:44 [2020-08-04T17:44:44.980Z] DEBUG - Sent event MouseUp [4]: MouseEvent{Button {Apply and Close} time=-1164749371 data=null button=0 stateMask=0x0 x=0 y=0 count=0} to (of type 'Button' and (with mnemonic 'Apply and Close' or with mnemonic 'OK') and with style 'SWT.PUSH')
13:44:44 [2020-08-04T17:44:44.980Z] DEBUG - Sent event Selection [13]: SelectionEvent{Button {Apply and Close} time=-1164749371 data=null item=null detail=0 x=0 y=0 width=0 height=0 stateMask=0x0 text=null doit=true} to (of type 'Button' and (with mnemonic 'Apply and Close' or with mnemonic 'OK') and with style 'SWT.PUSH')
13:44:44 [2020-08-04T17:44:44.980Z] DEBUG - Sent event Selection [13]: SelectionEvent{MenuItem {&Preferences} time=-1164749750 data=null item=null detail=0 x=0 y=0 width=0 height=0 stateMask=0x0 text=null doit=true} to with mnemonic 'Preferences'
13:44:44 [2020-08-04T17:44:44.980Z] DEBUG - Clicked on 
13:44:44 [2020-08-04T17:44:44.980Z] Tests run: 9, Failures: 0, Errors: 0, Skipped: 0, Time elapsed: 11.572 s - in org.eclipse.tracecompass.tmf.analysis.xml.ui.swtbot.tests.preferences.XMLAnalysesManagerPreferencePageTest
13:44:44 [2020-08-04T17:44:44.980Z] testPreferencePageMenuBar  Time elapsed: 1.011 s
13:44:44 [2020-08-04T17:44:44.980Z] testImportInvalid  Time elapsed: 0.689 s
13:44:44 [2020-08-04T17:44:44.980Z] testPreferencePageContextMenu  Time elapsed: 2.594 s
13:44:44 [2020-08-04T17:44:44.980Z] testEdit  Time elapsed: 2.041 s
13:44:44 [2020-08-04T17:44:44.980Z] testImportValid  Time elapsed: 0.893 s
13:44:44 [2020-08-04T17:44:44.980Z] testCheckButtons  Time elapsed: 1.169 s
13:44:44 [2020-08-04T17:44:44.980Z] testDelete  Time elapsed: 1.338 s
13:44:44 [2020-08-04T17:44:44.980Z] testExport  Time elapsed: 0.851 s
13:44:44 [2020-08-04T17:44:44.980Z] testInvalidLabel  Time elapsed: 0.803 s
13:44:44 [2020-08-04T17:44:44.980Z] 
13:44:44 [2020-08-04T17:44:44.980Z] Results:
13:44:44 [2020-08-04T17:44:44.980Z] 
13:44:44 [2020-08-04T17:44:44.980Z] Tests run: 13, Failures: 0, Errors: 0, Skipped: 0
13:44:44 [2020-08-04T17:44:44.980Z] 
13:44:45 [2020-08-04T17:44:45.235Z] 
13:44:45 [2020-08-04T17:44:45.235Z] !ENTRY org.eclipse.core.resources 2 10035 2020-08-04 17:44:45.032
13:44:45 [2020-08-04T17:44:45.235Z] !MESSAGE The workspace will exit with unsaved changes in this session.
13:44:45 [2020-08-04T17:44:45.795Z] [INFO] All tests passed!
13:44:45 [2020-08-04T17:44:45.795Z] [INFO] 
13:44:45 [2020-08-04T17:44:45.795Z] [INFO] --- maven-install-plugin:2.5.2:install (default-install) @ org.eclipse.tracecompass.tmf.analysis.xml.ui.swtbot.tests ---
13:44:45 [2020-08-04T17:44:45.795Z] [INFO] Installing /home/jenkins/agent/workspace/tracecompass-master-jdk11/tmf/org.eclipse.tracecompass.tmf.analysis.xml.ui.swtbot.tests/target/org.eclipse.tracecompass.tmf.analysis.xml.ui.swtbot.tests-1.0.11-SNAPSHOT.jar to /home/jenkins/.m2/repository/org/eclipse/tracecompass/org.eclipse.tracecompass.tmf.analysis.xml.ui.swtbot.tests/1.0.11-SNAPSHOT/org.eclipse.tracecompass.tmf.analysis.xml.ui.swtbot.tests-1.0.11-SNAPSHOT.jar
13:44:45 [2020-08-04T17:44:45.795Z] [INFO] Installing /home/jenkins/agent/workspace/tracecompass-master-jdk11/tmf/org.eclipse.tracecompass.tmf.analysis.xml.ui.swtbot.tests/pom.xml to /home/jenkins/.m2/repository/org/eclipse/tracecompass/org.eclipse.tracecompass.tmf.analysis.xml.ui.swtbot.tests/1.0.11-SNAPSHOT/org.eclipse.tracecompass.tmf.analysis.xml.ui.swtbot.tests-1.0.11-SNAPSHOT.pom
13:44:45 [2020-08-04T17:44:45.795Z] [INFO] Installing /home/jenkins/agent/workspace/tracecompass-master-jdk11/tmf/org.eclipse.tracecompass.tmf.analysis.xml.ui.swtbot.tests/target/org.eclipse.tracecompass.tmf.analysis.xml.ui.swtbot.tests-1.0.11-SNAPSHOT-sources.jar to /home/jenkins/.m2/repository/org/eclipse/tracecompass/org.eclipse.tracecompass.tmf.analysis.xml.ui.swtbot.tests/1.0.11-SNAPSHOT/org.eclipse.tracecompass.tmf.analysis.xml.ui.swtbot.tests-1.0.11-SNAPSHOT-sources.jar
13:44:45 [2020-08-04T17:44:45.795Z] [INFO] Installing /home/jenkins/agent/workspace/tracecompass-master-jdk11/tmf/org.eclipse.tracecompass.tmf.analysis.xml.ui.swtbot.tests/target/org.eclipse.tracecompass.tmf.analysis.xml.ui.swtbot.tests-1.0.11-SNAPSHOT.jar.pack.gz to /home/jenkins/.m2/repository/org/eclipse/tracecompass/org.eclipse.tracecompass.tmf.analysis.xml.ui.swtbot.tests/1.0.11-SNAPSHOT/org.eclipse.tracecompass.tmf.analysis.xml.ui.swtbot.tests-1.0.11-SNAPSHOT-pack200.jar.pack.gz
13:44:45 [2020-08-04T17:44:45.795Z] [INFO] Installing /home/jenkins/agent/workspace/tracecompass-master-jdk11/tmf/org.eclipse.tracecompass.tmf.analysis.xml.ui.swtbot.tests/target/p2content.xml to /home/jenkins/.m2/repository/org/eclipse/tracecompass/org.eclipse.tracecompass.tmf.analysis.xml.ui.swtbot.tests/1.0.11-SNAPSHOT/org.eclipse.tracecompass.tmf.analysis.xml.ui.swtbot.tests-1.0.11-SNAPSHOT-p2metadata.xml
13:44:45 [2020-08-04T17:44:45.795Z] [INFO] Installing /home/jenkins/agent/workspace/tracecompass-master-jdk11/tmf/org.eclipse.tracecompass.tmf.analysis.xml.ui.swtbot.tests/target/p2artifacts.xml to /home/jenkins/.m2/repository/org/eclipse/tracecompass/org.eclipse.tracecompass.tmf.analysis.xml.ui.swtbot.tests/1.0.11-SNAPSHOT/org.eclipse.tracecompass.tmf.analysis.xml.ui.swtbot.tests-1.0.11-SNAPSHOT-p2artifacts.xml
13:44:45 [2020-08-04T17:44:45.795Z] [INFO] 
13:44:45 [2020-08-04T17:44:45.795Z] [INFO] --- tycho-p2-plugin:2.0.0-SNAPSHOT:update-local-index (default-update-local-index) @ org.eclipse.tracecompass.tmf.analysis.xml.ui.swtbot.tests ---
13:44:45 [2020-08-04T17:44:45.795Z] [INFO] 
13:44:45 [2020-08-04T17:44:45.795Z] [INFO] --< org.eclipse.tracecompass:org.eclipse.tracecompass.tmf.analysis.xml.ui.tests >--
13:44:45 [2020-08-04T17:44:45.795Z] [INFO] Building org.eclipse.tracecompass.tmf.analysis.xml.ui.tests 1.0.3-SNAPSHOT [130/138]
13:44:45 [2020-08-04T17:44:45.795Z] [INFO] ------------------------[ eclipse-test-plugin ]-------------------------
13:44:45 [2020-08-04T17:44:45.795Z] [INFO] 
13:44:45 [2020-08-04T17:44:45.795Z] [INFO] --- maven-clean-plugin:3.0.0:clean (default-clean) @ org.eclipse.tracecompass.tmf.analysis.xml.ui.tests ---
13:44:45 [2020-08-04T17:44:45.795Z] [INFO] 
13:44:45 [2020-08-04T17:44:45.795Z] [INFO] --- tycho-packaging-plugin:2.0.0-SNAPSHOT:build-qualifier (default-build-qualifier) @ org.eclipse.tracecompass.tmf.analysis.xml.ui.tests ---
13:44:45 [2020-08-04T17:44:45.795Z] [INFO] The project's OSGi version is 1.0.3.202008041647
13:44:45 [2020-08-04T17:44:45.795Z] [INFO] 
13:44:45 [2020-08-04T17:44:45.795Z] [INFO] --- tycho-packaging-plugin:2.0.0-SNAPSHOT:validate-id (default-validate-id) @ org.eclipse.tracecompass.tmf.analysis.xml.ui.tests ---
13:44:45 [2020-08-04T17:44:45.795Z] [INFO] 
13:44:45 [2020-08-04T17:44:45.795Z] [INFO] --- tycho-packaging-plugin:2.0.0-SNAPSHOT:validate-version (default-validate-version) @ org.eclipse.tracecompass.tmf.analysis.xml.ui.tests ---
13:44:45 [2020-08-04T17:44:45.795Z] [INFO] 
13:44:45 [2020-08-04T17:44:45.795Z] [INFO] --- maven-enforcer-plugin:1.4.1:enforce (enforce-maven-version) @ org.eclipse.tracecompass.tmf.analysis.xml.ui.tests ---
13:44:45 [2020-08-04T17:44:45.795Z] [INFO] 
13:44:45 [2020-08-04T17:44:45.795Z] [INFO] --- maven-resources-plugin:3.0.2:resources (default-resources) @ org.eclipse.tracecompass.tmf.analysis.xml.ui.tests ---
13:44:45 [2020-08-04T17:44:45.795Z] [INFO] Using 'UTF-8' encoding to copy filtered resources.
13:44:45 [2020-08-04T17:44:45.795Z] [INFO] skip non existing resourceDirectory /home/jenkins/agent/workspace/tracecompass-master-jdk11/tmf/org.eclipse.tracecompass.tmf.analysis.xml.ui.tests/src/main/resources
13:44:45 [2020-08-04T17:44:45.795Z] [INFO] 
13:44:45 [2020-08-04T17:44:45.795Z] [INFO] --- tycho-compiler-plugin:2.0.0-SNAPSHOT:compile (default-compile) @ org.eclipse.tracecompass.tmf.analysis.xml.ui.tests ---
13:44:45 [2020-08-04T17:44:45.795Z] [INFO] Compiling 3 source files to /home/jenkins/agent/workspace/tracecompass-master-jdk11/tmf/org.eclipse.tracecompass.tmf.analysis.xml.ui.tests/target/classes
13:44:46 [2020-08-04T17:44:46.051Z] [INFO] 
13:44:46 [2020-08-04T17:44:46.051Z] [INFO] --- maven-resources-plugin:3.0.2:testResources (default-testResources) @ org.eclipse.tracecompass.tmf.analysis.xml.ui.tests ---
13:44:46 [2020-08-04T17:44:46.051Z] [INFO] Using 'UTF-8' encoding to copy filtered resources.
13:44:46 [2020-08-04T17:44:46.051Z] [INFO] skip non existing resourceDirectory /home/jenkins/agent/workspace/tracecompass-master-jdk11/tmf/org.eclipse.tracecompass.tmf.analysis.xml.ui.tests/src/test/resources
13:44:46 [2020-08-04T17:44:46.051Z] [INFO] 
13:44:46 [2020-08-04T17:44:46.051Z] [INFO] --- tycho-source-plugin:2.0.0-SNAPSHOT:plugin-source (plugin-source) @ org.eclipse.tracecompass.tmf.analysis.xml.ui.tests ---
13:44:46 [2020-08-04T17:44:46.051Z] [INFO] Building jar: /home/jenkins/agent/workspace/tracecompass-master-jdk11/tmf/org.eclipse.tracecompass.tmf.analysis.xml.ui.tests/target/org.eclipse.tracecompass.tmf.analysis.xml.ui.tests-1.0.3-SNAPSHOT-sources.jar
13:44:46 [2020-08-04T17:44:46.051Z] [INFO] 
13:44:46 [2020-08-04T17:44:46.051Z] [INFO] --- target-platform-configuration:2.0.0-SNAPSHOT:target-platform (default-target-platform) @ org.eclipse.tracecompass.tmf.analysis.xml.ui.tests ---
13:44:46 [2020-08-04T17:44:46.051Z] [INFO] 
13:44:46 [2020-08-04T17:44:46.051Z] [INFO] --- tycho-packaging-plugin:2.0.0-SNAPSHOT:package-plugin (default-package-plugin) @ org.eclipse.tracecompass.tmf.analysis.xml.ui.tests ---
13:44:46 [2020-08-04T17:44:46.306Z] [INFO] Building jar: /home/jenkins/agent/workspace/tracecompass-master-jdk11/tmf/org.eclipse.tracecompass.tmf.analysis.xml.ui.tests/target/org.eclipse.tracecompass.tmf.analysis.xml.ui.tests-1.0.3-SNAPSHOT.jar
13:44:46 [2020-08-04T17:44:46.306Z] [INFO] 
13:44:46 [2020-08-04T17:44:46.306Z] [INFO] --- tycho-p2-plugin:2.0.0-SNAPSHOT:p2-metadata-default (default-p2-metadata-default) @ org.eclipse.tracecompass.tmf.analysis.xml.ui.tests ---
13:44:46 [2020-08-04T17:44:46.306Z] [INFO] 
13:44:46 [2020-08-04T17:44:46.306Z] [INFO] --- tycho-source-feature-plugin:2.0.0-SNAPSHOT:source-feature (source-feature) @ org.eclipse.tracecompass.tmf.analysis.xml.ui.tests ---
13:44:46 [2020-08-04T17:44:46.306Z] [INFO] 
13:44:46 [2020-08-04T17:44:46.306Z] [INFO] --- tycho-pack200a-plugin:2.0.0-SNAPSHOT:normalize (pack200-normalize) @ org.eclipse.tracecompass.tmf.analysis.xml.ui.tests ---
13:44:46 [2020-08-04T17:44:46.306Z] [INFO] Pack200 normalizing jar /home/jenkins/agent/workspace/tracecompass-master-jdk11/tmf/org.eclipse.tracecompass.tmf.analysis.xml.ui.tests/target/org.eclipse.tracecompass.tmf.analysis.xml.ui.tests-1.0.3-SNAPSHOT.jar
13:44:46 [2020-08-04T17:44:46.307Z] [INFO] 
13:44:46 [2020-08-04T17:44:46.307Z] [INFO] --- eclipse-jarsigner-plugin:1.1.3:sign (sign) @ org.eclipse.tracecompass.tmf.analysis.xml.ui.tests ---
13:44:46 [2020-08-04T17:44:46.307Z] [INFO] Signing jar: /home/jenkins/agent/workspace/tracecompass-master-jdk11/tmf/org.eclipse.tracecompass.tmf.analysis.xml.ui.tests/target/org.eclipse.tracecompass.tmf.analysis.xml.ui.tests-1.0.3-SNAPSHOT.jar
13:44:47 [2020-08-04T17:44:47.233Z] [INFO] Signing jar: /home/jenkins/agent/workspace/tracecompass-master-jdk11/tmf/org.eclipse.tracecompass.tmf.analysis.xml.ui.tests/target/org.eclipse.tracecompass.tmf.analysis.xml.ui.tests-1.0.3-SNAPSHOT-sources.jar
13:44:48 [2020-08-04T17:44:48.599Z] [INFO] 
13:44:48 [2020-08-04T17:44:48.599Z] [INFO] --- tycho-pack200b-plugin:2.0.0-SNAPSHOT:pack (pack200-pack) @ org.eclipse.tracecompass.tmf.analysis.xml.ui.tests ---
13:44:48 [2020-08-04T17:44:48.599Z] [INFO] Pack200 packing jar /home/jenkins/agent/workspace/tracecompass-master-jdk11/tmf/org.eclipse.tracecompass.tmf.analysis.xml.ui.tests/target/org.eclipse.tracecompass.tmf.analysis.xml.ui.tests-1.0.3-SNAPSHOT.jar
13:44:48 [2020-08-04T17:44:48.599Z] [INFO] 
13:44:48 [2020-08-04T17:44:48.599Z] [INFO] --- tycho-p2-plugin:2.0.0-SNAPSHOT:p2-metadata (p2-metadata) @ org.eclipse.tracecompass.tmf.analysis.xml.ui.tests ---
13:44:48 [2020-08-04T17:44:48.599Z] [INFO] 
13:44:48 [2020-08-04T17:44:48.600Z] [INFO] --- tycho-surefire-plugin:2.0.0-SNAPSHOT:test (default-test) @ org.eclipse.tracecompass.tmf.analysis.xml.ui.tests ---
13:44:48 [2020-08-04T17:44:48.600Z] [INFO] Executing Test Runtime with timeout 0, logs (if any) will be placed at: /home/jenkins/agent/workspace/tracecompass-master-jdk11/tmf/org.eclipse.tracecompass.tmf.analysis.xml.ui.tests/target/work/data/.metadata/.log
13:44:48 [2020-08-04T17:44:48.600Z] [INFO] Command line:
13:44:48 [2020-08-04T17:44:48.600Z] 	[/opt/tools/java/openjdk/jdk-11/11.0.2+9/bin/java, -Dosgi.noShutdown=false, -Dosgi.os=linux, -Dosgi.ws=gtk, -Dosgi.arch=x86_64, -Dorg.eclipse.swt.browser.DefaultType=mozilla, -Xms512m, -Xmx1024m, -Dosgi.clean=true, -jar, /home/jenkins/.m2/repository/p2/osgi/bundle/org.eclipse.equinox.launcher/1.5.700.v20200207-2156/org.eclipse.equinox.launcher-1.5.700.v20200207-2156.jar, -data, /home/jenkins/agent/workspace/tracecompass-master-jdk11/tmf/org.eclipse.tracecompass.tmf.analysis.xml.ui.tests/target/work/data, -install, /home/jenkins/agent/workspace/tracecompass-master-jdk11/tmf/org.eclipse.tracecompass.tmf.analysis.xml.ui.tests/target/work, -configuration, /home/jenkins/agent/workspace/tracecompass-master-jdk11/tmf/org.eclipse.tracecompass.tmf.analysis.xml.ui.tests/target/work/configuration, -application, org.eclipse.tycho.surefire.osgibooter.uitest, -testproperties, /home/jenkins/agent/workspace/tracecompass-master-jdk11/tmf/org.eclipse.tracecompass.tmf.analysis.xml.ui.tests/target/surefire.properties, -product, org.eclipse.platform.ide, -consoleLog]
13:44:48 [2020-08-04T17:44:48.600Z] Picked up _JAVA_OPTIONS: -Duser.home=/home/tracecompass
13:44:51 [2020-08-04T17:44:51.112Z] !SESSION 2020-08-04 17:44:48.521 -----------------------------------------------
13:44:51 [2020-08-04T17:44:51.112Z] eclipse.buildId=unknown
13:44:51 [2020-08-04T17:44:51.112Z] java.version=11.0.2
13:44:51 [2020-08-04T17:44:51.112Z] java.vendor=Oracle Corporation
13:44:51 [2020-08-04T17:44:51.112Z] BootLoader constants: OS=linux, ARCH=x86_64, WS=gtk, NL=en_US
13:44:51 [2020-08-04T17:44:51.112Z] Framework arguments:  -application org.eclipse.tycho.surefire.osgibooter.uitest -testproperties /home/jenkins/agent/workspace/tracecompass-master-jdk11/tmf/org.eclipse.tracecompass.tmf.analysis.xml.ui.tests/target/surefire.properties -product org.eclipse.platform.ide
13:44:51 [2020-08-04T17:44:51.112Z] Command-line arguments:  -data /home/jenkins/agent/workspace/tracecompass-master-jdk11/tmf/org.eclipse.tracecompass.tmf.analysis.xml.ui.tests/target/work/data -application org.eclipse.tycho.surefire.osgibooter.uitest -testproperties /home/jenkins/agent/workspace/tracecompass-master-jdk11/tmf/org.eclipse.tracecompass.tmf.analysis.xml.ui.tests/target/surefire.properties -product org.eclipse.platform.ide -consoleLog
13:44:51 [2020-08-04T17:44:51.112Z] 
13:44:51 [2020-08-04T17:44:51.112Z] !ENTRY org.eclipse.compare.win32 4 0 2020-08-04 17:44:50.844
13:44:51 [2020-08-04T17:44:51.112Z] !MESSAGE FrameworkEvent ERROR
13:44:51 [2020-08-04T17:44:51.112Z] !STACK 0
13:44:51 [2020-08-04T17:44:51.112Z] org.osgi.framework.BundleException: Could not resolve module: org.eclipse.compare.win32 [66]
13:44:51 [2020-08-04T17:44:51.112Z]   Unresolved requirement: Require-Capability: eclipse.platform; filter:="(osgi.os=win32)"
13:44:51 [2020-08-04T17:44:51.112Z] 
13:44:51 [2020-08-04T17:44:51.112Z] 	at org.eclipse.osgi.container.Module.start(Module.java:463)
13:44:51 [2020-08-04T17:44:51.112Z] 	at org.eclipse.osgi.container.ModuleContainer$ContainerStartLevel$2.run(ModuleContainer.java:1845)
13:44:51 [2020-08-04T17:44:51.112Z] 	at org.eclipse.osgi.internal.framework.EquinoxContainerAdaptor$1$1.execute(EquinoxContainerAdaptor.java:136)
13:44:51 [2020-08-04T17:44:51.112Z] 	at org.eclipse.osgi.container.ModuleContainer$ContainerStartLevel.incStartLevel(ModuleContainer.java:1838)
13:44:51 [2020-08-04T17:44:51.112Z] 	at org.eclipse.osgi.container.ModuleContainer$ContainerStartLevel.incStartLevel(ModuleContainer.java:1779)
13:44:51 [2020-08-04T17:44:51.112Z] 	at org.eclipse.osgi.container.ModuleContainer$ContainerStartLevel.doContainerStartLevel(ModuleContainer.java:1743)
13:44:51 [2020-08-04T17:44:51.112Z] 	at org.eclipse.osgi.container.ModuleContainer$ContainerStartLevel.dispatchEvent(ModuleContainer.java:1665)
13:44:51 [2020-08-04T17:44:51.112Z] 	at org.eclipse.osgi.container.ModuleContainer$ContainerStartLevel.dispatchEvent(ModuleContainer.java:1)
13:44:51 [2020-08-04T17:44:51.112Z] 	at org.eclipse.osgi.framework.eventmgr.EventManager.dispatchEvent(EventManager.java:234)
13:44:51 [2020-08-04T17:44:51.112Z] 	at org.eclipse.osgi.framework.eventmgr.EventManager$EventThread.run(EventManager.java:345)
13:44:51 [2020-08-04T17:44:51.112Z] 
13:44:51 [2020-08-04T17:44:51.112Z] !ENTRY org.eclipse.ecf.provider.filetransfer.httpclient45.win32 4 0 2020-08-04 17:44:50.912
13:44:51 [2020-08-04T17:44:51.112Z] !MESSAGE FrameworkEvent ERROR
13:44:51 [2020-08-04T17:44:51.112Z] !STACK 0
13:44:51 [2020-08-04T17:44:51.112Z] org.osgi.framework.BundleException: Could not resolve module: org.eclipse.ecf.provider.filetransfer.httpclient45.win32 [138]
13:44:51 [2020-08-04T17:44:51.112Z]   Unresolved requirement: Require-Capability: eclipse.platform; filter:="(osgi.os=win32)"
13:44:51 [2020-08-04T17:44:51.112Z]   Unresolved requirement: Import-Package: org.apache.http.impl.auth.win; version="[4.5.0,5.0.0)"
13:44:51 [2020-08-04T17:44:51.112Z]     -> Export-Package: org.apache.http.impl.auth.win; bundle-symbolic-name="org.apache.httpcomponents.httpclient.win"; bundle-version="4.5.10.v20200113-2105"; version="4.5.10"; x-internal:="true"; uses:="org.apache.http,org.apache.http.auth,org.apache.http.client,org.apache.http.impl.auth,org.apache.http.protocol,org.apache.http.util"
13:44:51 [2020-08-04T17:44:51.112Z]        org.apache.httpcomponents.httpclient.win [36]
13:44:51 [2020-08-04T17:44:51.112Z]          Unresolved requirement: Require-Capability: eclipse.platform; filter:="(osgi.os=win32)"
13:44:51 [2020-08-04T17:44:51.112Z] 
13:44:51 [2020-08-04T17:44:51.112Z] 	at org.eclipse.osgi.container.Module.start(Module.java:463)
13:44:51 [2020-08-04T17:44:51.112Z] 	at org.eclipse.osgi.container.ModuleContainer$ContainerStartLevel$2.run(ModuleContainer.java:1845)
13:44:51 [2020-08-04T17:44:51.112Z] 	at org.eclipse.osgi.internal.framework.EquinoxContainerAdaptor$1$1.execute(EquinoxContainerAdaptor.java:136)
13:44:51 [2020-08-04T17:44:51.112Z] 	at org.eclipse.osgi.container.ModuleContainer$ContainerStartLevel.incStartLevel(ModuleContainer.java:1838)
13:44:51 [2020-08-04T17:44:51.112Z] 	at org.eclipse.osgi.container.ModuleContainer$ContainerStartLevel.incStartLevel(ModuleContainer.java:1779)
13:44:51 [2020-08-04T17:44:51.112Z] 	at org.eclipse.osgi.container.ModuleContainer$ContainerStartLevel.doContainerStartLevel(ModuleContainer.java:1743)
13:44:51 [2020-08-04T17:44:51.112Z] 	at org.eclipse.osgi.container.ModuleContainer$ContainerStartLevel.dispatchEvent(ModuleContainer.java:1665)
13:44:51 [2020-08-04T17:44:51.112Z] 	at org.eclipse.osgi.container.ModuleContainer$ContainerStartLevel.dispatchEvent(ModuleContainer.java:1)
13:44:51 [2020-08-04T17:44:51.112Z] 	at org.eclipse.osgi.framework.eventmgr.EventManager.dispatchEvent(EventManager.java:234)
13:44:51 [2020-08-04T17:44:51.112Z] 	at org.eclipse.osgi.framework.eventmgr.EventManager$EventThread.run(EventManager.java:345)
13:44:51 [2020-08-04T17:44:51.674Z] SWT SessionManagerDBus: Failed to connect to org.gnome.SessionManager: Failed to execute child process “dbus-launch” (No such file or directory)
13:44:51 [2020-08-04T17:44:51.674Z] SWT SessionManagerDBus: Failed to connect to org.xfce.SessionManager: Failed to execute child process “dbus-launch” (No such file or directory)
13:44:55 [2020-08-04T17:44:55.837Z] 
13:44:55 [2020-08-04T17:44:55.837Z] !ENTRY org.eclipse.urischeme 4 0 2020-08-04 17:44:55.538
13:44:55 [2020-08-04T17:44:55.837Z] !MESSAGE Cannot run program "xdg-mime": error=2, No such file or directory
13:44:55 [2020-08-04T17:44:55.837Z] !STACK 0
13:44:55 [2020-08-04T17:44:55.837Z] java.io.IOException: Cannot run program "xdg-mime": error=2, No such file or directory
13:44:55 [2020-08-04T17:44:55.837Z] 	at java.base/java.lang.ProcessBuilder.start(ProcessBuilder.java:1128)
13:44:55 [2020-08-04T17:44:55.837Z] 	at java.base/java.lang.ProcessBuilder.start(ProcessBuilder.java:1071)
13:44:55 [2020-08-04T17:44:55.837Z] 	at org.eclipse.urischeme.internal.registration.ProcessExecutor.execute(ProcessExecutor.java:36)
13:44:55 [2020-08-04T17:44:55.837Z] 	at org.eclipse.urischeme.internal.registration.RegistrationLinux.getRegisteredDesktopFileForScheme(RegistrationLinux.java:136)
13:44:55 [2020-08-04T17:44:55.837Z] 	at org.eclipse.urischeme.internal.registration.RegistrationLinux.determineHandlerLocation(RegistrationLinux.java:80)
13:44:55 [2020-08-04T17:44:55.837Z] 	at org.eclipse.urischeme.internal.registration.RegistrationLinux.getSchemesInformation(RegistrationLinux.java:69)
13:44:55 [2020-08-04T17:44:55.837Z] 	at org.eclipse.urischeme.AutoRegisterSchemeHandlersJob.run(AutoRegisterSchemeHandlersJob.java:63)
13:44:55 [2020-08-04T17:44:55.837Z] 	at org.eclipse.core.internal.jobs.Worker.run(Worker.java:63)
13:44:55 [2020-08-04T17:44:55.837Z] Caused by: java.io.IOException: error=2, No such file or directory
13:44:55 [2020-08-04T17:44:55.837Z] 	at java.base/java.lang.ProcessImpl.forkAndExec(Native Method)
13:44:55 [2020-08-04T17:44:55.837Z] 	at java.base/java.lang.ProcessImpl.<init>(ProcessImpl.java:340)
13:44:55 [2020-08-04T17:44:55.837Z] 	at java.base/java.lang.ProcessImpl.start(ProcessImpl.java:271)
13:44:55 [2020-08-04T17:44:55.837Z] 	at java.base/java.lang.ProcessBuilder.start(ProcessBuilder.java:1107)
13:44:55 [2020-08-04T17:44:55.837Z] 	... 7 more
13:44:56 [2020-08-04T17:44:56.397Z] Running org.eclipse.tracecompass.tmf.analysis.xml.ui.tests.XmlAnalysisUiPluginTest
13:44:56 [2020-08-04T17:44:56.397Z] Tests run: 2, Failures: 0, Errors: 0, Skipped: 0, Time elapsed: 0.005 s - in org.eclipse.tracecompass.tmf.analysis.xml.ui.tests.XmlAnalysisUiPluginTest
13:44:56 [2020-08-04T17:44:56.397Z] testTmfCorePluginId  Time elapsed: 0.001 s
13:44:56 [2020-08-04T17:44:56.397Z] testGetDefault  Time elapsed: 0 s
13:44:56 [2020-08-04T17:44:56.397Z] Running org.eclipse.tracecompass.tmf.analysis.xml.ui.tests.module.XmlAnalysisOutputSourceTest
13:44:56 [2020-08-04T17:44:56.397Z] Tests run: 1, Failures: 0, Errors: 0, Skipped: 0, Time elapsed: 0.174 s - in org.eclipse.tracecompass.tmf.analysis.xml.ui.tests.module.XmlAnalysisOutputSourceTest
13:44:56 [2020-08-04T17:44:56.397Z] testBuiltinOutput  Time elapsed: 0.174 s
13:44:56 [2020-08-04T17:44:56.397Z] 
13:44:56 [2020-08-04T17:44:56.397Z] Results:
13:44:56 [2020-08-04T17:44:56.397Z] 
13:44:56 [2020-08-04T17:44:56.397Z] Tests run: 3, Failures: 0, Errors: 0, Skipped: 0
13:44:56 [2020-08-04T17:44:56.397Z] 
13:44:56 [2020-08-04T17:44:56.653Z] 
13:44:56 [2020-08-04T17:44:56.653Z] !ENTRY org.eclipse.tracecompass.tmf.core 4 0 2020-08-04 17:44:56.412
13:44:56 [2020-08-04T17:44:56.653Z] !MESSAGE Unexpected error executing analysis with trace 
13:44:56 [2020-08-04T17:44:56.653Z] !STACK 0
13:44:56 [2020-08-04T17:44:56.653Z] java.lang.NullPointerException
13:44:56 [2020-08-04T17:44:56.653Z] 	at java.base/java.io.File.<init>(File.java:276)
13:44:56 [2020-08-04T17:44:56.653Z] 	at org.eclipse.tracecompass.tmf.core.statesystem.TmfStateSystemAnalysisModule.loadInitialState(TmfStateSystemAnalysisModule.java:580)
13:44:56 [2020-08-04T17:44:56.653Z] 	at org.eclipse.tracecompass.tmf.core.statesystem.TmfStateSystemAnalysisModule.build(TmfStateSystemAnalysisModule.java:528)
13:44:56 [2020-08-04T17:44:56.653Z] 	at org.eclipse.tracecompass.tmf.core.statesystem.TmfStateSystemAnalysisModule.createFullHistory(TmfStateSystemAnalysisModule.java:376)
13:44:56 [2020-08-04T17:44:56.653Z] 	at org.eclipse.tracecompass.tmf.core.statesystem.TmfStateSystemAnalysisModule.executeAnalysis(TmfStateSystemAnalysisModule.java:282)
13:44:56 [2020-08-04T17:44:56.653Z] 	at org.eclipse.tracecompass.tmf.core.analysis.TmfAbstractAnalysisModule$1.run(TmfAbstractAnalysisModule.java:394)
13:44:56 [2020-08-04T17:44:56.653Z] 	at org.eclipse.core.internal.jobs.Worker.run(Worker.java:63)
13:44:56 [2020-08-04T17:44:56.653Z] 
13:44:56 [2020-08-04T17:44:56.653Z] !ENTRY org.eclipse.tracecompass.tmf.core 4 0 2020-08-04 17:44:56.412
13:44:56 [2020-08-04T17:44:56.653Z] !MESSAGE Unexpected error executing analysis with trace 
13:44:56 [2020-08-04T17:44:56.653Z] !STACK 0
13:44:56 [2020-08-04T17:44:56.653Z] java.lang.NullPointerException
13:44:56 [2020-08-04T17:44:56.653Z] 	at java.base/java.io.File.<init>(File.java:276)
13:44:56 [2020-08-04T17:44:56.653Z] 	at org.eclipse.tracecompass.tmf.core.statesystem.TmfStateSystemAnalysisModule.loadInitialState(TmfStateSystemAnalysisModule.java:580)
13:44:56 [2020-08-04T17:44:56.653Z] 	at org.eclipse.tracecompass.tmf.core.statesystem.TmfStateSystemAnalysisModule.build(TmfStateSystemAnalysisModule.java:528)
13:44:56 [2020-08-04T17:44:56.653Z] 	at org.eclipse.tracecompass.tmf.core.statesystem.TmfStateSystemAnalysisModule.createFullHistory(TmfStateSystemAnalysisModule.java:376)
13:44:56 [2020-08-04T17:44:56.653Z] 	at org.eclipse.tracecompass.tmf.core.statesystem.TmfStateSystemAnalysisModule.executeAnalysis(TmfStateSystemAnalysisModule.java:282)
13:44:56 [2020-08-04T17:44:56.653Z] 	at org.eclipse.tracecompass.tmf.core.analysis.TmfAbstractAnalysisModule$1.run(TmfAbstractAnalysisModule.java:394)
13:44:56 [2020-08-04T17:44:56.653Z] 	at org.eclipse.core.internal.jobs.Worker.run(Worker.java:63)
13:44:56 [2020-08-04T17:44:56.653Z] 
13:44:56 [2020-08-04T17:44:56.653Z] !ENTRY org.eclipse.tracecompass.tmf.core 4 0 2020-08-04 17:44:56.416
13:44:56 [2020-08-04T17:44:56.653Z] !MESSAGE Exception executing analysis
13:44:56 [2020-08-04T17:44:56.653Z] !STACK 0
13:44:56 [2020-08-04T17:44:56.653Z] java.lang.NullPointerException
13:44:56 [2020-08-04T17:44:56.653Z] 	at java.base/java.io.File.<init>(File.java:276)
13:44:56 [2020-08-04T17:44:56.653Z] 	at org.eclipse.tracecompass.tmf.core.statesystem.TmfStateSystemAnalysisModule.loadInitialState(TmfStateSystemAnalysisModule.java:580)
13:44:56 [2020-08-04T17:44:56.653Z] 	at org.eclipse.tracecompass.tmf.core.statesystem.TmfStateSystemAnalysisModule.build(TmfStateSystemAnalysisModule.java:528)
13:44:56 [2020-08-04T17:44:56.653Z] 	at org.eclipse.tracecompass.tmf.core.statesystem.TmfStateSystemAnalysisModule.createFullHistory(TmfStateSystemAnalysisModule.java:376)
13:44:56 [2020-08-04T17:44:56.653Z] 	at org.eclipse.tracecompass.tmf.core.statesystem.TmfStateSystemAnalysisModule.executeAnalysis(TmfStateSystemAnalysisModule.java:282)
13:44:56 [2020-08-04T17:44:56.653Z] 	at org.eclipse.tracecompass.tmf.core.analysis.TmfAbstractAnalysisModule$1.run(TmfAbstractAnalysisModule.java:394)
13:44:56 [2020-08-04T17:44:56.653Z] 	at org.eclipse.core.internal.jobs.Worker.run(Worker.java:63)
13:44:56 [2020-08-04T17:44:56.653Z] 
13:44:56 [2020-08-04T17:44:56.653Z] !ENTRY org.eclipse.tracecompass.tmf.core 4 0 2020-08-04 17:44:56.416
13:44:56 [2020-08-04T17:44:56.653Z] !MESSAGE Exception executing analysis
13:44:56 [2020-08-04T17:44:56.653Z] !STACK 0
13:44:56 [2020-08-04T17:44:56.653Z] java.lang.NullPointerException
13:44:56 [2020-08-04T17:44:56.653Z] 	at java.base/java.io.File.<init>(File.java:276)
13:44:56 [2020-08-04T17:44:56.653Z] 	at org.eclipse.tracecompass.tmf.core.statesystem.TmfStateSystemAnalysisModule.loadInitialState(TmfStateSystemAnalysisModule.java:580)
13:44:56 [2020-08-04T17:44:56.653Z] 	at org.eclipse.tracecompass.tmf.core.statesystem.TmfStateSystemAnalysisModule.build(TmfStateSystemAnalysisModule.java:528)
13:44:56 [2020-08-04T17:44:56.653Z] 	at org.eclipse.tracecompass.tmf.core.statesystem.TmfStateSystemAnalysisModule.createFullHistory(TmfStateSystemAnalysisModule.java:376)
13:44:56 [2020-08-04T17:44:56.653Z] 	at org.eclipse.tracecompass.tmf.core.statesystem.TmfStateSystemAnalysisModule.executeAnalysis(TmfStateSystemAnalysisModule.java:282)
13:44:56 [2020-08-04T17:44:56.653Z] 	at org.eclipse.tracecompass.tmf.core.analysis.TmfAbstractAnalysisModule$1.run(TmfAbstractAnalysisModule.java:394)
13:44:56 [2020-08-04T17:44:56.653Z] 	at org.eclipse.core.internal.jobs.Worker.run(Worker.java:63)
13:44:56 [2020-08-04T17:44:56.909Z] 
13:44:56 [2020-08-04T17:44:56.909Z] !ENTRY org.eclipse.e4.ui.workbench 4 0 2020-08-04 17:44:56.733
13:44:56 [2020-08-04T17:44:56.909Z] !MESSAGE Failed to evaluate: ReferenceExpression [definitionId=org.eclipse.ui.ide.showInDefinition]
13:44:56 [2020-08-04T17:44:56.909Z] !STACK 0
13:44:56 [2020-08-04T17:44:56.909Z] org.eclipse.core.runtime.CoreException: Error evaluating Property [org.eclipse.ui.ide.page.activePreferencePage, type=class org.eclipse.swt.widgets.Shell, tester=org.eclipse.ui.internal.ide.handlers.PagePropertyTester@1bbbd0b4]
13:44:56 [2020-08-04T17:44:56.909Z] 	at org.eclipse.core.internal.expressions.Property.test(Property.java:68)
13:44:56 [2020-08-04T17:44:56.909Z] 	at org.eclipse.core.expressions.TestExpression.evaluate(TestExpression.java:107)
13:44:56 [2020-08-04T17:44:56.909Z] 	at org.eclipse.core.internal.expressions.CompositeExpression.evaluateAnd(CompositeExpression.java:55)
13:44:56 [2020-08-04T17:44:56.909Z] 	at org.eclipse.core.internal.expressions.WithExpression.evaluate(WithExpression.java:81)
13:44:56 [2020-08-04T17:44:56.909Z] 	at org.eclipse.core.internal.expressions.CompositeExpression.evaluateOr(CompositeExpression.java:69)
13:44:56 [2020-08-04T17:44:56.909Z] 	at org.eclipse.core.internal.expressions.OrExpression.evaluate(OrExpression.java:25)
13:44:56 [2020-08-04T17:44:56.909Z] 	at org.eclipse.core.expressions.ReferenceExpression.evaluate(ReferenceExpression.java:72)
13:44:56 [2020-08-04T17:44:56.909Z] 	at org.eclipse.ui.internal.services.EvaluationReference.evaluate(EvaluationReference.java:74)
13:44:56 [2020-08-04T17:44:56.909Z] 	at org.eclipse.ui.internal.services.EvaluationReference.evaluate(EvaluationReference.java:100)
13:44:56 [2020-08-04T17:44:56.909Z] 	at org.eclipse.ui.internal.services.EvaluationReference.changed(EvaluationReference.java:94)
13:44:56 [2020-08-04T17:44:56.909Z] 	at org.eclipse.e4.core.internal.contexts.TrackableComputationExt.update(TrackableComputationExt.java:108)
13:44:56 [2020-08-04T17:44:56.909Z] 	at org.eclipse.e4.core.internal.contexts.EclipseContext.processScheduled(EclipseContext.java:364)
13:44:56 [2020-08-04T17:44:56.909Z] 	at org.eclipse.e4.core.internal.contexts.EclipseContext.set(EclipseContext.java:379)
13:44:56 [2020-08-04T17:44:56.909Z] 	at org.eclipse.e4.core.internal.contexts.EclipseContext.dispose(EclipseContext.java:208)
13:44:56 [2020-08-04T17:44:56.909Z] 	at org.eclipse.e4.core.internal.contexts.EclipseContext.dispose(EclipseContext.java:171)
13:44:56 [2020-08-04T17:44:56.909Z] 	at org.eclipse.e4.core.internal.contexts.osgi.EclipseContextOSGi.dispose(EclipseContextOSGi.java:102)
13:44:56 [2020-08-04T17:44:56.909Z] 	at org.eclipse.e4.core.internal.contexts.osgi.EclipseContextOSGi.bundleChanged(EclipseContextOSGi.java:144)
13:44:56 [2020-08-04T17:44:56.909Z] 	at org.eclipse.osgi.internal.framework.BundleContextImpl.dispatchEvent(BundleContextImpl.java:945)
13:44:56 [2020-08-04T17:44:56.909Z] 	at org.eclipse.osgi.framework.eventmgr.EventManager.dispatchEvent(EventManager.java:234)
13:44:56 [2020-08-04T17:44:56.909Z] 	at org.eclipse.osgi.framework.eventmgr.ListenerQueue.dispatchEventSynchronous(ListenerQueue.java:151)
13:44:56 [2020-08-04T17:44:56.909Z] 	at org.eclipse.osgi.internal.framework.EquinoxEventPublisher.publishBundleEventPrivileged(EquinoxEventPublisher.java:232)
13:44:56 [2020-08-04T17:44:56.909Z] 	at org.eclipse.osgi.internal.framework.EquinoxEventPublisher.publishBundleEvent(EquinoxEventPublisher.java:138)
13:44:56 [2020-08-04T17:44:56.909Z] 	at org.eclipse.osgi.internal.framework.EquinoxEventPublisher.publishBundleEvent(EquinoxEventPublisher.java:130)
13:44:56 [2020-08-04T17:44:56.909Z] 	at org.eclipse.osgi.internal.framework.EquinoxContainerAdaptor.publishModuleEvent(EquinoxContainerAdaptor.java:217)
13:44:56 [2020-08-04T17:44:56.909Z] 	at org.eclipse.osgi.container.Module.publishEvent(Module.java:499)
13:44:56 [2020-08-04T17:44:56.909Z] 	at org.eclipse.osgi.container.Module.doStop(Module.java:658)
13:44:56 [2020-08-04T17:44:56.909Z] 	at org.eclipse.osgi.container.Module.stop(Module.java:521)
13:44:56 [2020-08-04T17:44:56.909Z] 	at org.eclipse.osgi.container.SystemModule.stop(SystemModule.java:207)
13:44:56 [2020-08-04T17:44:56.909Z] 	at org.eclipse.osgi.internal.framework.EquinoxBundle$SystemBundle$EquinoxSystemModule$1.run(EquinoxBundle.java:220)
13:44:56 [2020-08-04T17:44:56.909Z] 	at java.base/java.lang.Thread.run(Thread.java:834)
13:44:56 [2020-08-04T17:44:56.909Z] Caused by: org.eclipse.swt.SWTException: Invalid thread access
13:44:56 [2020-08-04T17:44:56.909Z] 	at org.eclipse.swt.SWT.error(SWT.java:4723)
13:44:56 [2020-08-04T17:44:56.909Z] 	at org.eclipse.swt.SWT.error(SWT.java:4638)
13:44:56 [2020-08-04T17:44:56.909Z] 	at org.eclipse.swt.SWT.error(SWT.java:4609)
13:44:56 [2020-08-04T17:44:56.909Z] 	at org.eclipse.swt.widgets.Widget.error(Widget.java:551)
13:44:56 [2020-08-04T17:44:56.909Z] 	at org.eclipse.swt.widgets.Widget.checkWidget(Widget.java:471)
13:44:56 [2020-08-04T17:44:56.909Z] 	at org.eclipse.swt.widgets.Widget.getData(Widget.java:577)
13:44:56 [2020-08-04T17:44:56.909Z] 	at org.eclipse.ui.internal.ide.handlers.PagePropertyTester.test(PagePropertyTester.java:39)
13:44:56 [2020-08-04T17:44:56.909Z] 	at org.eclipse.core.internal.expressions.Property.test(Property.java:65)
13:44:56 [2020-08-04T17:44:56.909Z] 	... 29 more
13:44:57 [2020-08-04T17:44:57.836Z] [INFO] All tests passed!
13:44:57 [2020-08-04T17:44:57.836Z] [INFO] 
13:44:57 [2020-08-04T17:44:57.836Z] [INFO] --- maven-install-plugin:2.5.2:install (default-install) @ org.eclipse.tracecompass.tmf.analysis.xml.ui.tests ---
13:44:57 [2020-08-04T17:44:57.836Z] [INFO] Installing /home/jenkins/agent/workspace/tracecompass-master-jdk11/tmf/org.eclipse.tracecompass.tmf.analysis.xml.ui.tests/target/org.eclipse.tracecompass.tmf.analysis.xml.ui.tests-1.0.3-SNAPSHOT.jar to /home/jenkins/.m2/repository/org/eclipse/tracecompass/org.eclipse.tracecompass.tmf.analysis.xml.ui.tests/1.0.3-SNAPSHOT/org.eclipse.tracecompass.tmf.analysis.xml.ui.tests-1.0.3-SNAPSHOT.jar
13:44:57 [2020-08-04T17:44:57.836Z] [INFO] Installing /home/jenkins/agent/workspace/tracecompass-master-jdk11/tmf/org.eclipse.tracecompass.tmf.analysis.xml.ui.tests/pom.xml to /home/jenkins/.m2/repository/org/eclipse/tracecompass/org.eclipse.tracecompass.tmf.analysis.xml.ui.tests/1.0.3-SNAPSHOT/org.eclipse.tracecompass.tmf.analysis.xml.ui.tests-1.0.3-SNAPSHOT.pom
13:44:57 [2020-08-04T17:44:57.836Z] [INFO] Installing /home/jenkins/agent/workspace/tracecompass-master-jdk11/tmf/org.eclipse.tracecompass.tmf.analysis.xml.ui.tests/target/org.eclipse.tracecompass.tmf.analysis.xml.ui.tests-1.0.3-SNAPSHOT-sources.jar to /home/jenkins/.m2/repository/org/eclipse/tracecompass/org.eclipse.tracecompass.tmf.analysis.xml.ui.tests/1.0.3-SNAPSHOT/org.eclipse.tracecompass.tmf.analysis.xml.ui.tests-1.0.3-SNAPSHOT-sources.jar
13:44:57 [2020-08-04T17:44:57.836Z] [INFO] Installing /home/jenkins/agent/workspace/tracecompass-master-jdk11/tmf/org.eclipse.tracecompass.tmf.analysis.xml.ui.tests/target/org.eclipse.tracecompass.tmf.analysis.xml.ui.tests-1.0.3-SNAPSHOT.jar.pack.gz to /home/jenkins/.m2/repository/org/eclipse/tracecompass/org.eclipse.tracecompass.tmf.analysis.xml.ui.tests/1.0.3-SNAPSHOT/org.eclipse.tracecompass.tmf.analysis.xml.ui.tests-1.0.3-SNAPSHOT-pack200.jar.pack.gz
13:44:57 [2020-08-04T17:44:57.836Z] [INFO] Installing /home/jenkins/agent/workspace/tracecompass-master-jdk11/tmf/org.eclipse.tracecompass.tmf.analysis.xml.ui.tests/target/p2content.xml to /home/jenkins/.m2/repository/org/eclipse/tracecompass/org.eclipse.tracecompass.tmf.analysis.xml.ui.tests/1.0.3-SNAPSHOT/org.eclipse.tracecompass.tmf.analysis.xml.ui.tests-1.0.3-SNAPSHOT-p2metadata.xml
13:44:57 [2020-08-04T17:44:57.836Z] [INFO] Installing /home/jenkins/agent/workspace/tracecompass-master-jdk11/tmf/org.eclipse.tracecompass.tmf.analysis.xml.ui.tests/target/p2artifacts.xml to /home/jenkins/.m2/repository/org/eclipse/tracecompass/org.eclipse.tracecompass.tmf.analysis.xml.ui.tests/1.0.3-SNAPSHOT/org.eclipse.tracecompass.tmf.analysis.xml.ui.tests-1.0.3-SNAPSHOT-p2artifacts.xml
13:44:57 [2020-08-04T17:44:57.836Z] [INFO] 
13:44:57 [2020-08-04T17:44:57.836Z] [INFO] --- tycho-p2-plugin:2.0.0-SNAPSHOT:update-local-index (default-update-local-index) @ org.eclipse.tracecompass.tmf.analysis.xml.ui.tests ---
13:44:57 [2020-08-04T17:44:57.836Z] [INFO] 
13:44:57 [2020-08-04T17:44:57.836Z] [INFO] --< org.eclipse.tracecompass:org.eclipse.tracecompass.tmf.chart.ui.tests >--
13:44:57 [2020-08-04T17:44:57.836Z] [INFO] Building org.eclipse.tracecompass.tmf.chart.ui.tests 1.0.1-SNAPSHOT [131/138]
13:44:57 [2020-08-04T17:44:57.836Z] [INFO] ------------------------[ eclipse-test-plugin ]-------------------------
13:44:57 [2020-08-04T17:44:57.836Z] [INFO] 
13:44:57 [2020-08-04T17:44:57.836Z] [INFO] --- maven-clean-plugin:3.0.0:clean (default-clean) @ org.eclipse.tracecompass.tmf.chart.ui.tests ---
13:44:57 [2020-08-04T17:44:57.836Z] [INFO] 
13:44:57 [2020-08-04T17:44:57.836Z] [INFO] --- tycho-packaging-plugin:2.0.0-SNAPSHOT:build-qualifier (default-build-qualifier) @ org.eclipse.tracecompass.tmf.chart.ui.tests ---
13:44:57 [2020-08-04T17:44:57.836Z] [INFO] The project's OSGi version is 1.0.1.202008041647
13:44:57 [2020-08-04T17:44:57.836Z] [INFO] 
13:44:57 [2020-08-04T17:44:57.836Z] [INFO] --- tycho-packaging-plugin:2.0.0-SNAPSHOT:validate-id (default-validate-id) @ org.eclipse.tracecompass.tmf.chart.ui.tests ---
13:44:57 [2020-08-04T17:44:57.836Z] [INFO] 
13:44:57 [2020-08-04T17:44:57.836Z] [INFO] --- tycho-packaging-plugin:2.0.0-SNAPSHOT:validate-version (default-validate-version) @ org.eclipse.tracecompass.tmf.chart.ui.tests ---
13:44:57 [2020-08-04T17:44:57.836Z] [INFO] 
13:44:57 [2020-08-04T17:44:57.836Z] [INFO] --- maven-enforcer-plugin:1.4.1:enforce (enforce-maven-version) @ org.eclipse.tracecompass.tmf.chart.ui.tests ---
13:44:57 [2020-08-04T17:44:57.836Z] [INFO] 
13:44:57 [2020-08-04T17:44:57.836Z] [INFO] --- maven-resources-plugin:3.0.2:resources (default-resources) @ org.eclipse.tracecompass.tmf.chart.ui.tests ---
13:44:57 [2020-08-04T17:44:57.836Z] [INFO] Using 'UTF-8' encoding to copy filtered resources.
13:44:57 [2020-08-04T17:44:57.836Z] [INFO] skip non existing resourceDirectory /home/jenkins/agent/workspace/tracecompass-master-jdk11/tmf/org.eclipse.tracecompass.tmf.chart.ui.tests/src/main/resources
13:44:57 [2020-08-04T17:44:57.836Z] [INFO] 
13:44:57 [2020-08-04T17:44:57.836Z] [INFO] --- tycho-compiler-plugin:2.0.0-SNAPSHOT:compile (default-compile) @ org.eclipse.tracecompass.tmf.chart.ui.tests ---
13:44:57 [2020-08-04T17:44:57.836Z] [INFO] Compiling 2 source files to /home/jenkins/agent/workspace/tracecompass-master-jdk11/tmf/org.eclipse.tracecompass.tmf.chart.ui.tests/target/classes
13:44:58 [2020-08-04T17:44:58.092Z] [INFO] 
13:44:58 [2020-08-04T17:44:58.092Z] [INFO] --- maven-resources-plugin:3.0.2:testResources (default-testResources) @ org.eclipse.tracecompass.tmf.chart.ui.tests ---
13:44:58 [2020-08-04T17:44:58.092Z] [INFO] Using 'UTF-8' encoding to copy filtered resources.
13:44:58 [2020-08-04T17:44:58.092Z] [INFO] skip non existing resourceDirectory /home/jenkins/agent/workspace/tracecompass-master-jdk11/tmf/org.eclipse.tracecompass.tmf.chart.ui.tests/src/test/resources
13:44:58 [2020-08-04T17:44:58.092Z] [INFO] 
13:44:58 [2020-08-04T17:44:58.092Z] [INFO] --- tycho-source-plugin:2.0.0-SNAPSHOT:plugin-source (plugin-source) @ org.eclipse.tracecompass.tmf.chart.ui.tests ---
13:44:58 [2020-08-04T17:44:58.092Z] [INFO] Building jar: /home/jenkins/agent/workspace/tracecompass-master-jdk11/tmf/org.eclipse.tracecompass.tmf.chart.ui.tests/target/org.eclipse.tracecompass.tmf.chart.ui.tests-1.0.1-SNAPSHOT-sources.jar
13:44:58 [2020-08-04T17:44:58.092Z] [INFO] 
13:44:58 [2020-08-04T17:44:58.092Z] [INFO] --- target-platform-configuration:2.0.0-SNAPSHOT:target-platform (default-target-platform) @ org.eclipse.tracecompass.tmf.chart.ui.tests ---
13:44:58 [2020-08-04T17:44:58.092Z] [INFO] 
13:44:58 [2020-08-04T17:44:58.092Z] [INFO] --- tycho-packaging-plugin:2.0.0-SNAPSHOT:package-plugin (default-package-plugin) @ org.eclipse.tracecompass.tmf.chart.ui.tests ---
13:44:58 [2020-08-04T17:44:58.092Z] [INFO] Building jar: /home/jenkins/agent/workspace/tracecompass-master-jdk11/tmf/org.eclipse.tracecompass.tmf.chart.ui.tests/target/org.eclipse.tracecompass.tmf.chart.ui.tests-1.0.1-SNAPSHOT.jar
13:44:58 [2020-08-04T17:44:58.092Z] [INFO] 
13:44:58 [2020-08-04T17:44:58.092Z] [INFO] --- tycho-p2-plugin:2.0.0-SNAPSHOT:p2-metadata-default (default-p2-metadata-default) @ org.eclipse.tracecompass.tmf.chart.ui.tests ---
13:44:58 [2020-08-04T17:44:58.092Z] [INFO] 
13:44:58 [2020-08-04T17:44:58.092Z] [INFO] --- tycho-source-feature-plugin:2.0.0-SNAPSHOT:source-feature (source-feature) @ org.eclipse.tracecompass.tmf.chart.ui.tests ---
13:44:58 [2020-08-04T17:44:58.092Z] [INFO] 
13:44:58 [2020-08-04T17:44:58.092Z] [INFO] --- tycho-pack200a-plugin:2.0.0-SNAPSHOT:normalize (pack200-normalize) @ org.eclipse.tracecompass.tmf.chart.ui.tests ---
13:44:58 [2020-08-04T17:44:58.092Z] [INFO] Pack200 normalizing jar /home/jenkins/agent/workspace/tracecompass-master-jdk11/tmf/org.eclipse.tracecompass.tmf.chart.ui.tests/target/org.eclipse.tracecompass.tmf.chart.ui.tests-1.0.1-SNAPSHOT.jar
13:44:58 [2020-08-04T17:44:58.092Z] [INFO] 
13:44:58 [2020-08-04T17:44:58.092Z] [INFO] --- eclipse-jarsigner-plugin:1.1.3:sign (sign) @ org.eclipse.tracecompass.tmf.chart.ui.tests ---
13:44:58 [2020-08-04T17:44:58.092Z] [INFO] Signing jar: /home/jenkins/agent/workspace/tracecompass-master-jdk11/tmf/org.eclipse.tracecompass.tmf.chart.ui.tests/target/org.eclipse.tracecompass.tmf.chart.ui.tests-1.0.1-SNAPSHOT.jar
13:44:59 [2020-08-04T17:44:59.457Z] [INFO] Signing jar: /home/jenkins/agent/workspace/tracecompass-master-jdk11/tmf/org.eclipse.tracecompass.tmf.chart.ui.tests/target/org.eclipse.tracecompass.tmf.chart.ui.tests-1.0.1-SNAPSHOT-sources.jar
13:45:00 [2020-08-04T17:45:00.385Z] [INFO] 
13:45:00 [2020-08-04T17:45:00.385Z] [INFO] --- tycho-pack200b-plugin:2.0.0-SNAPSHOT:pack (pack200-pack) @ org.eclipse.tracecompass.tmf.chart.ui.tests ---
13:45:00 [2020-08-04T17:45:00.385Z] [INFO] Pack200 packing jar /home/jenkins/agent/workspace/tracecompass-master-jdk11/tmf/org.eclipse.tracecompass.tmf.chart.ui.tests/target/org.eclipse.tracecompass.tmf.chart.ui.tests-1.0.1-SNAPSHOT.jar
13:45:00 [2020-08-04T17:45:00.385Z] [INFO] 
13:45:00 [2020-08-04T17:45:00.385Z] [INFO] --- tycho-p2-plugin:2.0.0-SNAPSHOT:p2-metadata (p2-metadata) @ org.eclipse.tracecompass.tmf.chart.ui.tests ---
13:45:00 [2020-08-04T17:45:00.385Z] [INFO] 
13:45:00 [2020-08-04T17:45:00.385Z] [INFO] --- tycho-surefire-plugin:2.0.0-SNAPSHOT:test (default-test) @ org.eclipse.tracecompass.tmf.chart.ui.tests ---
13:45:00 [2020-08-04T17:45:00.385Z] [INFO] Executing Test Runtime with timeout 0, logs (if any) will be placed at: /home/jenkins/agent/workspace/tracecompass-master-jdk11/tmf/org.eclipse.tracecompass.tmf.chart.ui.tests/target/work/data/.metadata/.log
13:45:00 [2020-08-04T17:45:00.385Z] [INFO] Command line:
13:45:00 [2020-08-04T17:45:00.385Z] 	[/opt/tools/java/openjdk/jdk-11/11.0.2+9/bin/java, -Dosgi.noShutdown=false, -Dosgi.os=linux, -Dosgi.ws=gtk, -Dosgi.arch=x86_64, -Dorg.eclipse.swt.browser.DefaultType=mozilla, -Xms512m, -Xmx1024m, -Dosgi.clean=true, -jar, /home/jenkins/.m2/repository/p2/osgi/bundle/org.eclipse.equinox.launcher/1.5.700.v20200207-2156/org.eclipse.equinox.launcher-1.5.700.v20200207-2156.jar, -data, /home/jenkins/agent/workspace/tracecompass-master-jdk11/tmf/org.eclipse.tracecompass.tmf.chart.ui.tests/target/work/data, -install, /home/jenkins/agent/workspace/tracecompass-master-jdk11/tmf/org.eclipse.tracecompass.tmf.chart.ui.tests/target/work, -configuration, /home/jenkins/agent/workspace/tracecompass-master-jdk11/tmf/org.eclipse.tracecompass.tmf.chart.ui.tests/target/work/configuration, -application, org.eclipse.tycho.surefire.osgibooter.uitest, -testproperties, /home/jenkins/agent/workspace/tracecompass-master-jdk11/tmf/org.eclipse.tracecompass.tmf.chart.ui.tests/target/surefire.properties, -product, org.eclipse.platform.ide, -consoleLog]
13:45:00 [2020-08-04T17:45:00.385Z] Picked up _JAVA_OPTIONS: -Duser.home=/home/tracecompass
13:45:03 [2020-08-04T17:45:03.649Z] !SESSION 2020-08-04 17:45:00.620 -----------------------------------------------
13:45:03 [2020-08-04T17:45:03.649Z] eclipse.buildId=unknown
13:45:03 [2020-08-04T17:45:03.649Z] java.version=11.0.2
13:45:03 [2020-08-04T17:45:03.649Z] java.vendor=Oracle Corporation
13:45:03 [2020-08-04T17:45:03.649Z] BootLoader constants: OS=linux, ARCH=x86_64, WS=gtk, NL=en_US
13:45:03 [2020-08-04T17:45:03.649Z] Framework arguments:  -application org.eclipse.tycho.surefire.osgibooter.uitest -testproperties /home/jenkins/agent/workspace/tracecompass-master-jdk11/tmf/org.eclipse.tracecompass.tmf.chart.ui.tests/target/surefire.properties -product org.eclipse.platform.ide
13:45:03 [2020-08-04T17:45:03.649Z] Command-line arguments:  -data /home/jenkins/agent/workspace/tracecompass-master-jdk11/tmf/org.eclipse.tracecompass.tmf.chart.ui.tests/target/work/data -application org.eclipse.tycho.surefire.osgibooter.uitest -testproperties /home/jenkins/agent/workspace/tracecompass-master-jdk11/tmf/org.eclipse.tracecompass.tmf.chart.ui.tests/target/surefire.properties -product org.eclipse.platform.ide -consoleLog
13:45:03 [2020-08-04T17:45:03.649Z] 
13:45:03 [2020-08-04T17:45:03.649Z] !ENTRY org.eclipse.compare.win32 4 0 2020-08-04 17:45:03.111
13:45:03 [2020-08-04T17:45:03.649Z] !MESSAGE FrameworkEvent ERROR
13:45:03 [2020-08-04T17:45:03.649Z] !STACK 0
13:45:03 [2020-08-04T17:45:03.649Z] org.osgi.framework.BundleException: Could not resolve module: org.eclipse.compare.win32 [65]
13:45:03 [2020-08-04T17:45:03.649Z]   Unresolved requirement: Require-Capability: eclipse.platform; filter:="(osgi.os=win32)"
13:45:03 [2020-08-04T17:45:03.649Z] 
13:45:03 [2020-08-04T17:45:03.649Z] 	at org.eclipse.osgi.container.Module.start(Module.java:463)
13:45:03 [2020-08-04T17:45:03.649Z] 	at org.eclipse.osgi.container.ModuleContainer$ContainerStartLevel$2.run(ModuleContainer.java:1845)
13:45:03 [2020-08-04T17:45:03.649Z] 	at org.eclipse.osgi.internal.framework.EquinoxContainerAdaptor$1$1.execute(EquinoxContainerAdaptor.java:136)
13:45:03 [2020-08-04T17:45:03.649Z] 	at org.eclipse.osgi.container.ModuleContainer$ContainerStartLevel.incStartLevel(ModuleContainer.java:1838)
13:45:03 [2020-08-04T17:45:03.649Z] 	at org.eclipse.osgi.container.ModuleContainer$ContainerStartLevel.incStartLevel(ModuleContainer.java:1779)
13:45:03 [2020-08-04T17:45:03.649Z] 	at org.eclipse.osgi.container.ModuleContainer$ContainerStartLevel.doContainerStartLevel(ModuleContainer.java:1743)
13:45:03 [2020-08-04T17:45:03.649Z] 	at org.eclipse.osgi.container.ModuleContainer$ContainerStartLevel.dispatchEvent(ModuleContainer.java:1665)
13:45:03 [2020-08-04T17:45:03.649Z] 	at org.eclipse.osgi.container.ModuleContainer$ContainerStartLevel.dispatchEvent(ModuleContainer.java:1)
13:45:03 [2020-08-04T17:45:03.650Z] 	at org.eclipse.osgi.framework.eventmgr.EventManager.dispatchEvent(EventManager.java:234)
13:45:03 [2020-08-04T17:45:03.650Z] 	at org.eclipse.osgi.framework.eventmgr.EventManager$EventThread.run(EventManager.java:345)
13:45:03 [2020-08-04T17:45:03.650Z] 
13:45:03 [2020-08-04T17:45:03.650Z] !ENTRY org.eclipse.ecf.provider.filetransfer.httpclient45.win32 4 0 2020-08-04 17:45:03.141
13:45:03 [2020-08-04T17:45:03.650Z] !MESSAGE FrameworkEvent ERROR
13:45:03 [2020-08-04T17:45:03.650Z] !STACK 0
13:45:03 [2020-08-04T17:45:03.650Z] org.osgi.framework.BundleException: Could not resolve module: org.eclipse.ecf.provider.filetransfer.httpclient45.win32 [137]
13:45:03 [2020-08-04T17:45:03.650Z]   Unresolved requirement: Require-Capability: eclipse.platform; filter:="(osgi.os=win32)"
13:45:03 [2020-08-04T17:45:03.650Z]   Unresolved requirement: Import-Package: org.apache.http.impl.auth.win; version="[4.5.0,5.0.0)"
13:45:03 [2020-08-04T17:45:03.650Z]     -> Export-Package: org.apache.http.impl.auth.win; bundle-symbolic-name="org.apache.httpcomponents.httpclient.win"; bundle-version="4.5.10.v20200113-2105"; version="4.5.10"; x-internal:="true"; uses:="org.apache.http,org.apache.http.auth,org.apache.http.client,org.apache.http.impl.auth,org.apache.http.protocol,org.apache.http.util"
13:45:03 [2020-08-04T17:45:03.650Z]        org.apache.httpcomponents.httpclient.win [36]
13:45:03 [2020-08-04T17:45:03.650Z]          Unresolved requirement: Require-Capability: eclipse.platform; filter:="(osgi.os=win32)"
13:45:03 [2020-08-04T17:45:03.650Z] 
13:45:03 [2020-08-04T17:45:03.650Z] 	at org.eclipse.osgi.container.Module.start(Module.java:463)
13:45:03 [2020-08-04T17:45:03.650Z] 	at org.eclipse.osgi.container.ModuleContainer$ContainerStartLevel$2.run(ModuleContainer.java:1845)
13:45:03 [2020-08-04T17:45:03.650Z] 	at org.eclipse.osgi.internal.framework.EquinoxContainerAdaptor$1$1.execute(EquinoxContainerAdaptor.java:136)
13:45:03 [2020-08-04T17:45:03.650Z] 	at org.eclipse.osgi.container.ModuleContainer$ContainerStartLevel.incStartLevel(ModuleContainer.java:1838)
13:45:03 [2020-08-04T17:45:03.650Z] 	at org.eclipse.osgi.container.ModuleContainer$ContainerStartLevel.incStartLevel(ModuleContainer.java:1779)
13:45:03 [2020-08-04T17:45:03.650Z] 	at org.eclipse.osgi.container.ModuleContainer$ContainerStartLevel.doContainerStartLevel(ModuleContainer.java:1743)
13:45:03 [2020-08-04T17:45:03.650Z] 	at org.eclipse.osgi.container.ModuleContainer$ContainerStartLevel.dispatchEvent(ModuleContainer.java:1665)
13:45:03 [2020-08-04T17:45:03.650Z] 	at org.eclipse.osgi.container.ModuleContainer$ContainerStartLevel.dispatchEvent(ModuleContainer.java:1)
13:45:03 [2020-08-04T17:45:03.650Z] 	at org.eclipse.osgi.framework.eventmgr.EventManager.dispatchEvent(EventManager.java:234)
13:45:03 [2020-08-04T17:45:03.650Z] 	at org.eclipse.osgi.framework.eventmgr.EventManager$EventThread.run(EventManager.java:345)
13:45:03 [2020-08-04T17:45:03.905Z] SWT SessionManagerDBus: Failed to connect to org.gnome.SessionManager: Failed to execute child process “dbus-launch” (No such file or directory)
13:45:03 [2020-08-04T17:45:03.905Z] SWT SessionManagerDBus: Failed to connect to org.xfce.SessionManager: Failed to execute child process “dbus-launch” (No such file or directory)
13:45:08 [2020-08-04T17:45:08.072Z] 
13:45:08 [2020-08-04T17:45:08.072Z] !ENTRY org.eclipse.urischeme 4 0 2020-08-04 17:45:07.542
13:45:08 [2020-08-04T17:45:08.072Z] !MESSAGE Cannot run program "xdg-mime": error=2, No such file or directory
13:45:08 [2020-08-04T17:45:08.072Z] !STACK 0
13:45:08 [2020-08-04T17:45:08.072Z] java.io.IOException: Cannot run program "xdg-mime": error=2, No such file or directory
13:45:08 [2020-08-04T17:45:08.072Z] 	at java.base/java.lang.ProcessBuilder.start(ProcessBuilder.java:1128)
13:45:08 [2020-08-04T17:45:08.072Z] 	at java.base/java.lang.ProcessBuilder.start(ProcessBuilder.java:1071)
13:45:08 [2020-08-04T17:45:08.072Z] 	at org.eclipse.urischeme.internal.registration.ProcessExecutor.execute(ProcessExecutor.java:36)
13:45:08 [2020-08-04T17:45:08.072Z] 	at org.eclipse.urischeme.internal.registration.RegistrationLinux.getRegisteredDesktopFileForScheme(RegistrationLinux.java:136)
13:45:08 [2020-08-04T17:45:08.072Z] 	at org.eclipse.urischeme.internal.registration.RegistrationLinux.determineHandlerLocation(RegistrationLinux.java:80)
13:45:08 [2020-08-04T17:45:08.072Z] 	at org.eclipse.urischeme.internal.registration.RegistrationLinux.getSchemesInformation(RegistrationLinux.java:69)
13:45:08 [2020-08-04T17:45:08.072Z] 	at org.eclipse.urischeme.AutoRegisterSchemeHandlersJob.run(AutoRegisterSchemeHandlersJob.java:63)
13:45:08 [2020-08-04T17:45:08.072Z] 	at org.eclipse.core.internal.jobs.Worker.run(Worker.java:63)
13:45:08 [2020-08-04T17:45:08.072Z] Caused by: java.io.IOException: error=2, No such file or directory
13:45:08 [2020-08-04T17:45:08.072Z] 	at java.base/java.lang.ProcessImpl.forkAndExec(Native Method)
13:45:08 [2020-08-04T17:45:08.072Z] 	at java.base/java.lang.ProcessImpl.<init>(ProcessImpl.java:340)
13:45:08 [2020-08-04T17:45:08.072Z] 	at java.base/java.lang.ProcessImpl.start(ProcessImpl.java:271)
13:45:08 [2020-08-04T17:45:08.072Z] 	at java.base/java.lang.ProcessBuilder.start(ProcessBuilder.java:1107)
13:45:08 [2020-08-04T17:45:08.072Z] 	... 7 more
13:45:08 [2020-08-04T17:45:08.072Z] Running org.eclipse.tracecompass.tmf.chart.ui.tests.data.ChartRangeTest
13:45:08 [2020-08-04T17:45:08.072Z] Tests run: 4, Failures: 0, Errors: 0, Skipped: 0, Time elapsed: 0.019 s - in org.eclipse.tracecompass.tmf.chart.ui.tests.data.ChartRangeTest
13:45:08 [2020-08-04T17:45:08.072Z] testClamp(org.eclipse.tracecompass.tmf.chart.ui.tests.data.ChartRangeTest)  Time elapsed: 0.003 s
13:45:08 [2020-08-04T17:45:08.072Z] testInvalidConstructor(org.eclipse.tracecompass.tmf.chart.ui.tests.data.ChartRangeTest)  Time elapsed: 0 s
13:45:08 [2020-08-04T17:45:08.072Z] testConstructor(org.eclipse.tracecompass.tmf.chart.ui.tests.data.ChartRangeTest)  Time elapsed: 0 s
13:45:08 [2020-08-04T17:45:08.072Z] testDefaultConstructor(org.eclipse.tracecompass.tmf.chart.ui.tests.data.ChartRangeTest)  Time elapsed: 0 s
13:45:08 [2020-08-04T17:45:08.072Z] 
13:45:08 [2020-08-04T17:45:08.072Z] Results:
13:45:08 [2020-08-04T17:45:08.072Z] 
13:45:08 [2020-08-04T17:45:08.072Z] Tests run: 4, Failures: 0, Errors: 0, Skipped: 0
13:45:08 [2020-08-04T17:45:08.072Z] 
13:45:09 [2020-08-04T17:45:09.436Z] [INFO] All tests passed!
13:45:09 [2020-08-04T17:45:09.436Z] [INFO] 
13:45:09 [2020-08-04T17:45:09.436Z] [INFO] --- maven-install-plugin:2.5.2:install (default-install) @ org.eclipse.tracecompass.tmf.chart.ui.tests ---
13:45:09 [2020-08-04T17:45:09.436Z] [INFO] Installing /home/jenkins/agent/workspace/tracecompass-master-jdk11/tmf/org.eclipse.tracecompass.tmf.chart.ui.tests/target/org.eclipse.tracecompass.tmf.chart.ui.tests-1.0.1-SNAPSHOT.jar to /home/jenkins/.m2/repository/org/eclipse/tracecompass/org.eclipse.tracecompass.tmf.chart.ui.tests/1.0.1-SNAPSHOT/org.eclipse.tracecompass.tmf.chart.ui.tests-1.0.1-SNAPSHOT.jar
13:45:09 [2020-08-04T17:45:09.436Z] [INFO] Installing /home/jenkins/agent/workspace/tracecompass-master-jdk11/tmf/org.eclipse.tracecompass.tmf.chart.ui.tests/pom.xml to /home/jenkins/.m2/repository/org/eclipse/tracecompass/org.eclipse.tracecompass.tmf.chart.ui.tests/1.0.1-SNAPSHOT/org.eclipse.tracecompass.tmf.chart.ui.tests-1.0.1-SNAPSHOT.pom
13:45:09 [2020-08-04T17:45:09.436Z] [INFO] Installing /home/jenkins/agent/workspace/tracecompass-master-jdk11/tmf/org.eclipse.tracecompass.tmf.chart.ui.tests/target/org.eclipse.tracecompass.tmf.chart.ui.tests-1.0.1-SNAPSHOT-sources.jar to /home/jenkins/.m2/repository/org/eclipse/tracecompass/org.eclipse.tracecompass.tmf.chart.ui.tests/1.0.1-SNAPSHOT/org.eclipse.tracecompass.tmf.chart.ui.tests-1.0.1-SNAPSHOT-sources.jar
13:45:09 [2020-08-04T17:45:09.436Z] [INFO] Installing /home/jenkins/agent/workspace/tracecompass-master-jdk11/tmf/org.eclipse.tracecompass.tmf.chart.ui.tests/target/org.eclipse.tracecompass.tmf.chart.ui.tests-1.0.1-SNAPSHOT.jar.pack.gz to /home/jenkins/.m2/repository/org/eclipse/tracecompass/org.eclipse.tracecompass.tmf.chart.ui.tests/1.0.1-SNAPSHOT/org.eclipse.tracecompass.tmf.chart.ui.tests-1.0.1-SNAPSHOT-pack200.jar.pack.gz
13:45:09 [2020-08-04T17:45:09.436Z] [INFO] Installing /home/jenkins/agent/workspace/tracecompass-master-jdk11/tmf/org.eclipse.tracecompass.tmf.chart.ui.tests/target/p2content.xml to /home/jenkins/.m2/repository/org/eclipse/tracecompass/org.eclipse.tracecompass.tmf.chart.ui.tests/1.0.1-SNAPSHOT/org.eclipse.tracecompass.tmf.chart.ui.tests-1.0.1-SNAPSHOT-p2metadata.xml
13:45:09 [2020-08-04T17:45:09.691Z] [INFO] Installing /home/jenkins/agent/workspace/tracecompass-master-jdk11/tmf/org.eclipse.tracecompass.tmf.chart.ui.tests/target/p2artifacts.xml to /home/jenkins/.m2/repository/org/eclipse/tracecompass/org.eclipse.tracecompass.tmf.chart.ui.tests/1.0.1-SNAPSHOT/org.eclipse.tracecompass.tmf.chart.ui.tests-1.0.1-SNAPSHOT-p2artifacts.xml
13:45:09 [2020-08-04T17:45:09.692Z] [INFO] 
13:45:09 [2020-08-04T17:45:09.692Z] [INFO] --- tycho-p2-plugin:2.0.0-SNAPSHOT:update-local-index (default-update-local-index) @ org.eclipse.tracecompass.tmf.chart.ui.tests ---
13:45:09 [2020-08-04T17:45:09.692Z] [INFO] 
13:45:09 [2020-08-04T17:45:09.692Z] [INFO] --< org.eclipse.tracecompass:org.eclipse.tracecompass.tmf.remote.ui.swtbot.tests >--
13:45:09 [2020-08-04T17:45:09.692Z] [INFO] Building org.eclipse.tracecompass.tmf.remote.ui.swtbot.tests 1.0.8-SNAPSHOT [132/138]
13:45:09 [2020-08-04T17:45:09.692Z] [INFO] ------------------------[ eclipse-test-plugin ]-------------------------
13:45:09 [2020-08-04T17:45:09.692Z] [INFO] 
13:45:09 [2020-08-04T17:45:09.692Z] [INFO] --- maven-clean-plugin:3.0.0:clean (default-clean) @ org.eclipse.tracecompass.tmf.remote.ui.swtbot.tests ---
13:45:09 [2020-08-04T17:45:09.692Z] [INFO] 
13:45:09 [2020-08-04T17:45:09.692Z] [INFO] --- tycho-packaging-plugin:2.0.0-SNAPSHOT:build-qualifier (default-build-qualifier) @ org.eclipse.tracecompass.tmf.remote.ui.swtbot.tests ---
13:45:09 [2020-08-04T17:45:09.692Z] [INFO] The project's OSGi version is 1.0.8.202008041647
13:45:09 [2020-08-04T17:45:09.692Z] [INFO] 
13:45:09 [2020-08-04T17:45:09.692Z] [INFO] --- tycho-packaging-plugin:2.0.0-SNAPSHOT:validate-id (default-validate-id) @ org.eclipse.tracecompass.tmf.remote.ui.swtbot.tests ---
13:45:09 [2020-08-04T17:45:09.692Z] [INFO] 
13:45:09 [2020-08-04T17:45:09.692Z] [INFO] --- tycho-packaging-plugin:2.0.0-SNAPSHOT:validate-version (default-validate-version) @ org.eclipse.tracecompass.tmf.remote.ui.swtbot.tests ---
13:45:09 [2020-08-04T17:45:09.692Z] [INFO] 
13:45:09 [2020-08-04T17:45:09.692Z] [INFO] --- maven-enforcer-plugin:1.4.1:enforce (enforce-maven-version) @ org.eclipse.tracecompass.tmf.remote.ui.swtbot.tests ---
13:45:09 [2020-08-04T17:45:09.692Z] [INFO] 
13:45:09 [2020-08-04T17:45:09.692Z] [INFO] --- maven-resources-plugin:3.0.2:resources (default-resources) @ org.eclipse.tracecompass.tmf.remote.ui.swtbot.tests ---
13:45:09 [2020-08-04T17:45:09.692Z] [INFO] Using 'UTF-8' encoding to copy filtered resources.
13:45:09 [2020-08-04T17:45:09.692Z] [INFO] skip non existing resourceDirectory /home/jenkins/agent/workspace/tracecompass-master-jdk11/tmf/org.eclipse.tracecompass.tmf.remote.ui.swtbot.tests/src/main/resources
13:45:09 [2020-08-04T17:45:09.692Z] [INFO] 
13:45:09 [2020-08-04T17:45:09.692Z] [INFO] --- tycho-compiler-plugin:2.0.0-SNAPSHOT:compile (default-compile) @ org.eclipse.tracecompass.tmf.remote.ui.swtbot.tests ---
13:45:09 [2020-08-04T17:45:09.692Z] [INFO] Compiling 2 source files to /home/jenkins/agent/workspace/tracecompass-master-jdk11/tmf/org.eclipse.tracecompass.tmf.remote.ui.swtbot.tests/target/classes
13:45:09 [2020-08-04T17:45:09.692Z] [INFO] 
13:45:09 [2020-08-04T17:45:09.692Z] [INFO] --- maven-resources-plugin:3.0.2:testResources (default-testResources) @ org.eclipse.tracecompass.tmf.remote.ui.swtbot.tests ---
13:45:09 [2020-08-04T17:45:09.692Z] [INFO] Using 'UTF-8' encoding to copy filtered resources.
13:45:09 [2020-08-04T17:45:09.692Z] [INFO] skip non existing resourceDirectory /home/jenkins/agent/workspace/tracecompass-master-jdk11/tmf/org.eclipse.tracecompass.tmf.remote.ui.swtbot.tests/src/test/resources
13:45:09 [2020-08-04T17:45:09.692Z] [INFO] 
13:45:09 [2020-08-04T17:45:09.692Z] [INFO] --- tycho-source-plugin:2.0.0-SNAPSHOT:plugin-source (plugin-source) @ org.eclipse.tracecompass.tmf.remote.ui.swtbot.tests ---
13:45:09 [2020-08-04T17:45:09.692Z] [INFO] Building jar: /home/jenkins/agent/workspace/tracecompass-master-jdk11/tmf/org.eclipse.tracecompass.tmf.remote.ui.swtbot.tests/target/org.eclipse.tracecompass.tmf.remote.ui.swtbot.tests-1.0.8-SNAPSHOT-sources.jar
13:45:09 [2020-08-04T17:45:09.692Z] [INFO] 
13:45:09 [2020-08-04T17:45:09.692Z] [INFO] --- target-platform-configuration:2.0.0-SNAPSHOT:target-platform (default-target-platform) @ org.eclipse.tracecompass.tmf.remote.ui.swtbot.tests ---
13:45:09 [2020-08-04T17:45:09.692Z] [INFO] 
13:45:09 [2020-08-04T17:45:09.692Z] [INFO] --- tycho-packaging-plugin:2.0.0-SNAPSHOT:package-plugin (default-package-plugin) @ org.eclipse.tracecompass.tmf.remote.ui.swtbot.tests ---
13:45:09 [2020-08-04T17:45:09.692Z] [INFO] Building jar: /home/jenkins/agent/workspace/tracecompass-master-jdk11/tmf/org.eclipse.tracecompass.tmf.remote.ui.swtbot.tests/target/org.eclipse.tracecompass.tmf.remote.ui.swtbot.tests-1.0.8-SNAPSHOT.jar
13:45:09 [2020-08-04T17:45:09.948Z] [INFO] 
13:45:09 [2020-08-04T17:45:09.948Z] [INFO] --- tycho-p2-plugin:2.0.0-SNAPSHOT:p2-metadata-default (default-p2-metadata-default) @ org.eclipse.tracecompass.tmf.remote.ui.swtbot.tests ---
13:45:09 [2020-08-04T17:45:09.948Z] [INFO] 
13:45:09 [2020-08-04T17:45:09.948Z] [INFO] --- tycho-source-feature-plugin:2.0.0-SNAPSHOT:source-feature (source-feature) @ org.eclipse.tracecompass.tmf.remote.ui.swtbot.tests ---
13:45:09 [2020-08-04T17:45:09.948Z] [INFO] 
13:45:09 [2020-08-04T17:45:09.948Z] [INFO] --- tycho-pack200a-plugin:2.0.0-SNAPSHOT:normalize (pack200-normalize) @ org.eclipse.tracecompass.tmf.remote.ui.swtbot.tests ---
13:45:09 [2020-08-04T17:45:09.948Z] [INFO] Pack200 normalizing jar /home/jenkins/agent/workspace/tracecompass-master-jdk11/tmf/org.eclipse.tracecompass.tmf.remote.ui.swtbot.tests/target/org.eclipse.tracecompass.tmf.remote.ui.swtbot.tests-1.0.8-SNAPSHOT.jar
13:45:09 [2020-08-04T17:45:09.948Z] [INFO] 
13:45:09 [2020-08-04T17:45:09.948Z] [INFO] --- eclipse-jarsigner-plugin:1.1.3:sign (sign) @ org.eclipse.tracecompass.tmf.remote.ui.swtbot.tests ---
13:45:09 [2020-08-04T17:45:09.948Z] [INFO] Signing jar: /home/jenkins/agent/workspace/tracecompass-master-jdk11/tmf/org.eclipse.tracecompass.tmf.remote.ui.swtbot.tests/target/org.eclipse.tracecompass.tmf.remote.ui.swtbot.tests-1.0.8-SNAPSHOT.jar
13:45:10 [2020-08-04T17:45:10.875Z] [INFO] Signing jar: /home/jenkins/agent/workspace/tracecompass-master-jdk11/tmf/org.eclipse.tracecompass.tmf.remote.ui.swtbot.tests/target/org.eclipse.tracecompass.tmf.remote.ui.swtbot.tests-1.0.8-SNAPSHOT-sources.jar
13:45:12 [2020-08-04T17:45:12.240Z] [INFO] 
13:45:12 [2020-08-04T17:45:12.240Z] [INFO] --- tycho-pack200b-plugin:2.0.0-SNAPSHOT:pack (pack200-pack) @ org.eclipse.tracecompass.tmf.remote.ui.swtbot.tests ---
13:45:12 [2020-08-04T17:45:12.240Z] [INFO] Pack200 packing jar /home/jenkins/agent/workspace/tracecompass-master-jdk11/tmf/org.eclipse.tracecompass.tmf.remote.ui.swtbot.tests/target/org.eclipse.tracecompass.tmf.remote.ui.swtbot.tests-1.0.8-SNAPSHOT.jar
13:45:12 [2020-08-04T17:45:12.240Z] [INFO] 
13:45:12 [2020-08-04T17:45:12.240Z] [INFO] --- tycho-p2-plugin:2.0.0-SNAPSHOT:p2-metadata (p2-metadata) @ org.eclipse.tracecompass.tmf.remote.ui.swtbot.tests ---
13:45:12 [2020-08-04T17:45:12.240Z] [INFO] 
13:45:12 [2020-08-04T17:45:12.240Z] [INFO] --- tycho-surefire-plugin:2.0.0-SNAPSHOT:test (default-test) @ org.eclipse.tracecompass.tmf.remote.ui.swtbot.tests ---
13:45:12 [2020-08-04T17:45:12.240Z] [INFO] Executing Test Runtime with timeout 0, logs (if any) will be placed at: /home/jenkins/agent/workspace/tracecompass-master-jdk11/tmf/org.eclipse.tracecompass.tmf.remote.ui.swtbot.tests/target/work/data/.metadata/.log
13:45:12 [2020-08-04T17:45:12.240Z] [INFO] Command line:
13:45:12 [2020-08-04T17:45:12.240Z] 	[/opt/tools/java/openjdk/jdk-11/11.0.2+9/bin/java, -Dosgi.noShutdown=false, -Dosgi.os=linux, -Dosgi.ws=gtk, -Dosgi.arch=x86_64, -Dorg.eclipse.swt.browser.DefaultType=mozilla, -Xms512m, -Xmx1024m, -Dosgi.clean=true, -jar, /home/jenkins/.m2/repository/p2/osgi/bundle/org.eclipse.equinox.launcher/1.5.700.v20200207-2156/org.eclipse.equinox.launcher-1.5.700.v20200207-2156.jar, -data, /home/jenkins/agent/workspace/tracecompass-master-jdk11/tmf/org.eclipse.tracecompass.tmf.remote.ui.swtbot.tests/target/work/data, -install, /home/jenkins/agent/workspace/tracecompass-master-jdk11/tmf/org.eclipse.tracecompass.tmf.remote.ui.swtbot.tests/target/work, -configuration, /home/jenkins/agent/workspace/tracecompass-master-jdk11/tmf/org.eclipse.tracecompass.tmf.remote.ui.swtbot.tests/target/work/configuration, -application, org.eclipse.tycho.surefire.osgibooter.uitest, -testproperties, /home/jenkins/agent/workspace/tracecompass-master-jdk11/tmf/org.eclipse.tracecompass.tmf.remote.ui.swtbot.tests/target/surefire.properties, -product, org.eclipse.platform.ide, -nouithread, -consoleLog]
13:45:12 [2020-08-04T17:45:12.240Z] Picked up _JAVA_OPTIONS: -Duser.home=/home/tracecompass
13:45:14 [2020-08-04T17:45:14.753Z] !SESSION 2020-08-04 17:45:12.217 -----------------------------------------------
13:45:14 [2020-08-04T17:45:14.753Z] eclipse.buildId=unknown
13:45:14 [2020-08-04T17:45:14.753Z] java.version=11.0.2
13:45:14 [2020-08-04T17:45:14.753Z] java.vendor=Oracle Corporation
13:45:14 [2020-08-04T17:45:14.753Z] BootLoader constants: OS=linux, ARCH=x86_64, WS=gtk, NL=en_US
13:45:14 [2020-08-04T17:45:14.753Z] Framework arguments:  -application org.eclipse.tycho.surefire.osgibooter.uitest -testproperties /home/jenkins/agent/workspace/tracecompass-master-jdk11/tmf/org.eclipse.tracecompass.tmf.remote.ui.swtbot.tests/target/surefire.properties -product org.eclipse.platform.ide -nouithread
13:45:14 [2020-08-04T17:45:14.753Z] Command-line arguments:  -data /home/jenkins/agent/workspace/tracecompass-master-jdk11/tmf/org.eclipse.tracecompass.tmf.remote.ui.swtbot.tests/target/work/data -application org.eclipse.tycho.surefire.osgibooter.uitest -testproperties /home/jenkins/agent/workspace/tracecompass-master-jdk11/tmf/org.eclipse.tracecompass.tmf.remote.ui.swtbot.tests/target/surefire.properties -product org.eclipse.platform.ide -nouithread -consoleLog
13:45:14 [2020-08-04T17:45:14.753Z] 
13:45:14 [2020-08-04T17:45:14.753Z] !ENTRY org.eclipse.compare.win32 4 0 2020-08-04 17:45:14.740
13:45:14 [2020-08-04T17:45:14.753Z] !MESSAGE FrameworkEvent ERROR
13:45:15 [2020-08-04T17:45:15.009Z] !STACK 0
13:45:15 [2020-08-04T17:45:15.009Z] org.osgi.framework.BundleException: Could not resolve module: org.eclipse.compare.win32 [66]
13:45:15 [2020-08-04T17:45:15.009Z]   Unresolved requirement: Require-Capability: eclipse.platform; filter:="(osgi.os=win32)"
13:45:15 [2020-08-04T17:45:15.009Z] 
13:45:15 [2020-08-04T17:45:15.009Z] 	at org.eclipse.osgi.container.Module.start(Module.java:463)
13:45:15 [2020-08-04T17:45:15.009Z] 	at org.eclipse.osgi.container.ModuleContainer$ContainerStartLevel$2.run(ModuleContainer.java:1845)
13:45:15 [2020-08-04T17:45:15.009Z] 	at org.eclipse.osgi.internal.framework.EquinoxContainerAdaptor$1$1.execute(EquinoxContainerAdaptor.java:136)
13:45:15 [2020-08-04T17:45:15.009Z] 	at org.eclipse.osgi.container.ModuleContainer$ContainerStartLevel.incStartLevel(ModuleContainer.java:1838)
13:45:15 [2020-08-04T17:45:15.009Z] 	at org.eclipse.osgi.container.ModuleContainer$ContainerStartLevel.incStartLevel(ModuleContainer.java:1779)
13:45:15 [2020-08-04T17:45:15.009Z] 	at org.eclipse.osgi.container.ModuleContainer$ContainerStartLevel.doContainerStartLevel(ModuleContainer.java:1743)
13:45:15 [2020-08-04T17:45:15.009Z] 	at org.eclipse.osgi.container.ModuleContainer$ContainerStartLevel.dispatchEvent(ModuleContainer.java:1665)
13:45:15 [2020-08-04T17:45:15.010Z] 	at org.eclipse.osgi.container.ModuleContainer$ContainerStartLevel.dispatchEvent(ModuleContainer.java:1)
13:45:15 [2020-08-04T17:45:15.010Z] 	at org.eclipse.osgi.framework.eventmgr.EventManager.dispatchEvent(EventManager.java:234)
13:45:15 [2020-08-04T17:45:15.010Z] 	at org.eclipse.osgi.framework.eventmgr.EventManager$EventThread.run(EventManager.java:345)
13:45:15 [2020-08-04T17:45:15.010Z] 
13:45:15 [2020-08-04T17:45:15.010Z] !ENTRY org.eclipse.ecf.provider.filetransfer.httpclient45.win32 4 0 2020-08-04 17:45:14.808
13:45:15 [2020-08-04T17:45:15.010Z] !MESSAGE FrameworkEvent ERROR
13:45:15 [2020-08-04T17:45:15.010Z] !STACK 0
13:45:15 [2020-08-04T17:45:15.010Z] org.osgi.framework.BundleException: Could not resolve module: org.eclipse.ecf.provider.filetransfer.httpclient45.win32 [138]
13:45:15 [2020-08-04T17:45:15.010Z]   Unresolved requirement: Require-Capability: eclipse.platform; filter:="(osgi.os=win32)"
13:45:15 [2020-08-04T17:45:15.010Z]   Unresolved requirement: Import-Package: org.apache.http.impl.auth.win; version="[4.5.0,5.0.0)"
13:45:15 [2020-08-04T17:45:15.010Z]     -> Export-Package: org.apache.http.impl.auth.win; bundle-symbolic-name="org.apache.httpcomponents.httpclient.win"; bundle-version="4.5.10.v20200113-2105"; version="4.5.10"; x-internal:="true"; uses:="org.apache.http,org.apache.http.auth,org.apache.http.client,org.apache.http.impl.auth,org.apache.http.protocol,org.apache.http.util"
13:45:15 [2020-08-04T17:45:15.010Z]        org.apache.httpcomponents.httpclient.win [36]
13:45:15 [2020-08-04T17:45:15.010Z]          Unresolved requirement: Require-Capability: eclipse.platform; filter:="(osgi.os=win32)"
13:45:15 [2020-08-04T17:45:15.010Z] 
13:45:15 [2020-08-04T17:45:15.010Z] 	at org.eclipse.osgi.container.Module.start(Module.java:463)
13:45:15 [2020-08-04T17:45:15.010Z] 	at org.eclipse.osgi.container.ModuleContainer$ContainerStartLevel$2.run(ModuleContainer.java:1845)
13:45:15 [2020-08-04T17:45:15.010Z] 	at org.eclipse.osgi.internal.framework.EquinoxContainerAdaptor$1$1.execute(EquinoxContainerAdaptor.java:136)
13:45:15 [2020-08-04T17:45:15.010Z] 	at org.eclipse.osgi.container.ModuleContainer$ContainerStartLevel.incStartLevel(ModuleContainer.java:1838)
13:45:15 [2020-08-04T17:45:15.010Z] 	at org.eclipse.osgi.container.ModuleContainer$ContainerStartLevel.incStartLevel(ModuleContainer.java:1779)
13:45:15 [2020-08-04T17:45:15.010Z] 	at org.eclipse.osgi.container.ModuleContainer$ContainerStartLevel.doContainerStartLevel(ModuleContainer.java:1743)
13:45:15 [2020-08-04T17:45:15.010Z] 	at org.eclipse.osgi.container.ModuleContainer$ContainerStartLevel.dispatchEvent(ModuleContainer.java:1665)
13:45:15 [2020-08-04T17:45:15.010Z] 	at org.eclipse.osgi.container.ModuleContainer$ContainerStartLevel.dispatchEvent(ModuleContainer.java:1)
13:45:15 [2020-08-04T17:45:15.010Z] 	at org.eclipse.osgi.framework.eventmgr.EventManager.dispatchEvent(EventManager.java:234)
13:45:15 [2020-08-04T17:45:15.010Z] 	at org.eclipse.osgi.framework.eventmgr.EventManager$EventThread.run(EventManager.java:345)
13:45:15 [2020-08-04T17:45:15.570Z] SWT SessionManagerDBus: Failed to connect to org.gnome.SessionManager: Failed to execute child process “dbus-launch” (No such file or directory)
13:45:15 [2020-08-04T17:45:15.570Z] SWT SessionManagerDBus: Failed to connect to org.xfce.SessionManager: Failed to execute child process “dbus-launch” (No such file or directory)
13:45:19 [2020-08-04T17:45:19.737Z] 
13:45:19 [2020-08-04T17:45:19.737Z] !ENTRY org.eclipse.urischeme 4 0 2020-08-04 17:45:19.619
13:45:19 [2020-08-04T17:45:19.737Z] !MESSAGE Cannot run program "xdg-mime": error=2, No such file or directory
13:45:19 [2020-08-04T17:45:19.737Z] !STACK 0
13:45:19 [2020-08-04T17:45:19.737Z] java.io.IOException: Cannot run program "xdg-mime": error=2, No such file or directory
13:45:19 [2020-08-04T17:45:19.737Z] 	at java.base/java.lang.ProcessBuilder.start(ProcessBuilder.java:1128)
13:45:19 [2020-08-04T17:45:19.737Z] 	at java.base/java.lang.ProcessBuilder.start(ProcessBuilder.java:1071)
13:45:19 [2020-08-04T17:45:19.737Z] 	at org.eclipse.urischeme.internal.registration.ProcessExecutor.execute(ProcessExecutor.java:36)
13:45:19 [2020-08-04T17:45:19.738Z] 	at org.eclipse.urischeme.internal.registration.RegistrationLinux.getRegisteredDesktopFileForScheme(RegistrationLinux.java:136)
13:45:19 [2020-08-04T17:45:19.738Z] 	at org.eclipse.urischeme.internal.registration.RegistrationLinux.determineHandlerLocation(RegistrationLinux.java:80)
13:45:19 [2020-08-04T17:45:19.738Z] 	at org.eclipse.urischeme.internal.registration.RegistrationLinux.getSchemesInformation(RegistrationLinux.java:69)
13:45:19 [2020-08-04T17:45:19.738Z] 	at org.eclipse.urischeme.AutoRegisterSchemeHandlersJob.run(AutoRegisterSchemeHandlersJob.java:63)
13:45:19 [2020-08-04T17:45:19.738Z] 	at org.eclipse.core.internal.jobs.Worker.run(Worker.java:63)
13:45:19 [2020-08-04T17:45:19.738Z] Caused by: java.io.IOException: error=2, No such file or directory
13:45:19 [2020-08-04T17:45:19.738Z] 	at java.base/java.lang.ProcessImpl.forkAndExec(Native Method)
13:45:19 [2020-08-04T17:45:19.738Z] 	at java.base/java.lang.ProcessImpl.<init>(ProcessImpl.java:340)
13:45:19 [2020-08-04T17:45:19.738Z] 	at java.base/java.lang.ProcessImpl.start(ProcessImpl.java:271)
13:45:19 [2020-08-04T17:45:19.738Z] 	at java.base/java.lang.ProcessBuilder.start(ProcessBuilder.java:1107)
13:45:19 [2020-08-04T17:45:19.738Z] 	... 7 more
13:45:20 [2020-08-04T17:45:20.300Z] Running org.eclipse.tracecompass.tmf.remote.ui.swtbot.tests.fetch.FetchRemoteTracesTest
13:45:20 [2020-08-04T17:45:20.555Z] Display size: 1440x900
13:45:20 [2020-08-04T17:45:20.555Z] OS version=3.10.0-1062.el7.x86_64
13:45:20 [2020-08-04T17:45:20.555Z] GTK version=3.22.30
13:45:20 [2020-08-04T17:45:20.555Z] GTK theme=Ambiance
13:45:20 [2020-08-04T17:45:20.555Z] LIBOVERLAY_SCROLLBAR=0
13:45:20 [2020-08-04T17:45:20.555Z] Time zone: Greenwich Mean Time
13:45:20 [2020-08-04T17:45:20.555Z] log4j:WARN No appenders could be found for logger (org.eclipse.swtbot.swt.finder.widgets.SWTBotShell).
13:45:20 [2020-08-04T17:45:20.555Z] log4j:WARN Please initialize the log4j system properly.
13:46:16 [2020-08-04T17:46:16.738Z] 
13:46:16 [2020-08-04T17:46:16.738Z] !ENTRY org.eclipse.tracecompass.tmf.ui 4 0 2020-08-04 17:46:16.503
13:46:16 [2020-08-04T17:46:16.738Z] !MESSAGE Error connection to node 'ssh://anonymous@unknown.unknown.unknown'
13:46:16 [2020-08-04T17:46:16.738Z] !STACK 0
13:46:16 [2020-08-04T17:46:16.738Z] org.eclipse.core.commands.ExecutionException: Cannot connect Unknown
13:46:16 [2020-08-04T17:46:16.738Z] 	at org.eclipse.tracecompass.tmf.remote.core.proxy.RemoteSystemProxy.connect(RemoteSystemProxy.java:90)
13:46:16 [2020-08-04T17:46:16.738Z] 	at org.eclipse.tracecompass.internal.tmf.remote.ui.wizards.fetch.model.RemoteImportConnectionNodeElement.connect(RemoteImportConnectionNodeElement.java:143)
13:46:16 [2020-08-04T17:46:16.738Z] 	at org.eclipse.tracecompass.internal.tmf.remote.ui.wizards.fetch.RemoteFetchLogWizardRemotePage$6.run(RemoteFetchLogWizardRemotePage.java:392)
13:46:16 [2020-08-04T17:46:16.738Z] 	at org.eclipse.jface.operation.ModalContext$ModalContextThread.run(ModalContext.java:122)
13:46:16 [2020-08-04T17:46:16.738Z] Caused by: org.eclipse.remote.core.exception.RemoteConnectionException: Session.connect: java.net.UnknownHostException: unknown.unknown.unknown
13:46:16 [2020-08-04T17:46:16.738Z] 	at org.eclipse.remote.internal.jsch.core.JSchConnection.newSession(JSchConnection.java:803)
13:46:16 [2020-08-04T17:46:16.738Z] 	at org.eclipse.remote.internal.jsch.core.JSchConnection.open(JSchConnection.java:841)
13:46:16 [2020-08-04T17:46:16.738Z] 	at org.eclipse.remote.internal.jsch.core.JSchConnection.open(JSchConnection.java:814)
13:46:16 [2020-08-04T17:46:16.738Z] 	at org.eclipse.remote.internal.core.RemoteConnection.open(RemoteConnection.java:208)
13:46:16 [2020-08-04T17:46:16.738Z] 	at org.eclipse.tracecompass.tmf.remote.core.proxy.RemoteSystemProxy.connect(RemoteSystemProxy.java:86)
13:46:16 [2020-08-04T17:46:16.738Z] 	... 3 more
13:46:31 [2020-08-04T17:46:31.584Z] Tests run: 20, Failures: 0, Errors: 0, Skipped: 1, Time elapsed: 70.479 s - in org.eclipse.tracecompass.tmf.remote.ui.swtbot.tests.fetch.FetchRemoteTracesTest
13:46:31 [2020-08-04T17:46:31.584Z] testImportNothing  Time elapsed: 4.19 s
13:46:31 [2020-08-04T17:46:31.584Z] test_7_03  Time elapsed: 1.895 s
13:46:31 [2020-08-04T17:46:31.584Z] test_8_04  Time elapsed: 4.087 s
13:46:31 [2020-08-04T17:46:31.584Z] test_8_05  Time elapsed: 8.602 s
13:46:31 [2020-08-04T17:46:31.584Z] test_8_06  Time elapsed: 5.632 s
13:46:31 [2020-08-04T17:46:31.584Z] test_8_07  Time elapsed: 4.065 s
13:46:31 [2020-08-04T17:46:31.584Z] test_8_08  Time elapsed: 4.399 s
13:46:31 [2020-08-04T17:46:31.584Z] test_8_09  Time elapsed: 3.724 s
13:46:31 [2020-08-04T17:46:31.584Z] test_8_10  Time elapsed: 2.081 s
13:46:31 [2020-08-04T17:46:31.584Z] test_8_11  Time elapsed: 3.644 s
13:46:31 [2020-08-04T17:46:31.584Z] test_8_12  Time elapsed: 2.45 s
13:46:31 [2020-08-04T17:46:31.584Z] test_8_13  Time elapsed: 3.53 s
13:46:31 [2020-08-04T17:46:31.584Z] test_8_14  Time elapsed: 2.013 s
13:46:31 [2020-08-04T17:46:31.584Z] test_8_15  Time elapsed: 3.465 s
13:46:31 [2020-08-04T17:46:31.584Z] test_9_01  Time elapsed: 2.053 s
13:46:31 [2020-08-04T17:46:31.584Z] test_9_02 skipped
13:46:31 [2020-08-04T17:46:31.584Z] testImportOnlyOne  Time elapsed: 3.381 s
13:46:31 [2020-08-04T17:46:31.584Z] testEmptyFile  Time elapsed: 2.556 s
13:46:31 [2020-08-04T17:46:31.584Z] testImportAll  Time elapsed: 4.057 s
13:46:31 [2020-08-04T17:46:31.584Z] testEditProfile  Time elapsed: 2.327 s
13:46:31 [2020-08-04T17:46:31.584Z] 
13:46:31 [2020-08-04T17:46:31.584Z] Results:
13:46:31 [2020-08-04T17:46:31.584Z] 
13:46:31 [2020-08-04T17:46:31.584Z] Tests run: 20, Failures: 0, Errors: 0, Skipped: 1
13:46:31 [2020-08-04T17:46:31.584Z] 
13:46:31 [2020-08-04T17:46:31.584Z] 
13:46:31 [2020-08-04T17:46:31.584Z] !ENTRY org.eclipse.core.resources 2 10035 2020-08-04 17:46:30.929
13:46:31 [2020-08-04T17:46:31.584Z] !MESSAGE The workspace will exit with unsaved changes in this session.
13:46:31 [2020-08-04T17:46:31.840Z] [INFO] All tests passed!
13:46:31 [2020-08-04T17:46:31.840Z] [INFO] 
13:46:31 [2020-08-04T17:46:31.840Z] [INFO] --- maven-install-plugin:2.5.2:install (default-install) @ org.eclipse.tracecompass.tmf.remote.ui.swtbot.tests ---
13:46:31 [2020-08-04T17:46:31.840Z] [INFO] Installing /home/jenkins/agent/workspace/tracecompass-master-jdk11/tmf/org.eclipse.tracecompass.tmf.remote.ui.swtbot.tests/target/org.eclipse.tracecompass.tmf.remote.ui.swtbot.tests-1.0.8-SNAPSHOT.jar to /home/jenkins/.m2/repository/org/eclipse/tracecompass/org.eclipse.tracecompass.tmf.remote.ui.swtbot.tests/1.0.8-SNAPSHOT/org.eclipse.tracecompass.tmf.remote.ui.swtbot.tests-1.0.8-SNAPSHOT.jar
13:46:31 [2020-08-04T17:46:31.840Z] [INFO] Installing /home/jenkins/agent/workspace/tracecompass-master-jdk11/tmf/org.eclipse.tracecompass.tmf.remote.ui.swtbot.tests/pom.xml to /home/jenkins/.m2/repository/org/eclipse/tracecompass/org.eclipse.tracecompass.tmf.remote.ui.swtbot.tests/1.0.8-SNAPSHOT/org.eclipse.tracecompass.tmf.remote.ui.swtbot.tests-1.0.8-SNAPSHOT.pom
13:46:31 [2020-08-04T17:46:31.840Z] [INFO] Installing /home/jenkins/agent/workspace/tracecompass-master-jdk11/tmf/org.eclipse.tracecompass.tmf.remote.ui.swtbot.tests/target/org.eclipse.tracecompass.tmf.remote.ui.swtbot.tests-1.0.8-SNAPSHOT-sources.jar to /home/jenkins/.m2/repository/org/eclipse/tracecompass/org.eclipse.tracecompass.tmf.remote.ui.swtbot.tests/1.0.8-SNAPSHOT/org.eclipse.tracecompass.tmf.remote.ui.swtbot.tests-1.0.8-SNAPSHOT-sources.jar
13:46:31 [2020-08-04T17:46:31.840Z] [INFO] Installing /home/jenkins/agent/workspace/tracecompass-master-jdk11/tmf/org.eclipse.tracecompass.tmf.remote.ui.swtbot.tests/target/org.eclipse.tracecompass.tmf.remote.ui.swtbot.tests-1.0.8-SNAPSHOT.jar.pack.gz to /home/jenkins/.m2/repository/org/eclipse/tracecompass/org.eclipse.tracecompass.tmf.remote.ui.swtbot.tests/1.0.8-SNAPSHOT/org.eclipse.tracecompass.tmf.remote.ui.swtbot.tests-1.0.8-SNAPSHOT-pack200.jar.pack.gz
13:46:31 [2020-08-04T17:46:31.840Z] [INFO] Installing /home/jenkins/agent/workspace/tracecompass-master-jdk11/tmf/org.eclipse.tracecompass.tmf.remote.ui.swtbot.tests/target/p2content.xml to /home/jenkins/.m2/repository/org/eclipse/tracecompass/org.eclipse.tracecompass.tmf.remote.ui.swtbot.tests/1.0.8-SNAPSHOT/org.eclipse.tracecompass.tmf.remote.ui.swtbot.tests-1.0.8-SNAPSHOT-p2metadata.xml
13:46:31 [2020-08-04T17:46:31.840Z] [INFO] Installing /home/jenkins/agent/workspace/tracecompass-master-jdk11/tmf/org.eclipse.tracecompass.tmf.remote.ui.swtbot.tests/target/p2artifacts.xml to /home/jenkins/.m2/repository/org/eclipse/tracecompass/org.eclipse.tracecompass.tmf.remote.ui.swtbot.tests/1.0.8-SNAPSHOT/org.eclipse.tracecompass.tmf.remote.ui.swtbot.tests-1.0.8-SNAPSHOT-p2artifacts.xml
13:46:31 [2020-08-04T17:46:31.840Z] [INFO] 
13:46:31 [2020-08-04T17:46:31.840Z] [INFO] --- tycho-p2-plugin:2.0.0-SNAPSHOT:update-local-index (default-update-local-index) @ org.eclipse.tracecompass.tmf.remote.ui.swtbot.tests ---
13:46:31 [2020-08-04T17:46:31.840Z] [INFO] 
13:46:31 [2020-08-04T17:46:31.840Z] [INFO] --< org.eclipse.tracecompass:org.eclipse.tracecompass.tmf.remote.ui.tests >--
13:46:31 [2020-08-04T17:46:31.840Z] [INFO] Building org.eclipse.tracecompass.tmf.remote.ui.tests 1.0.1-SNAPSHOT [133/138]
13:46:31 [2020-08-04T17:46:31.840Z] [INFO] ------------------------[ eclipse-test-plugin ]-------------------------
13:46:31 [2020-08-04T17:46:31.840Z] [INFO] 
13:46:31 [2020-08-04T17:46:31.840Z] [INFO] --- maven-clean-plugin:3.0.0:clean (default-clean) @ org.eclipse.tracecompass.tmf.remote.ui.tests ---
13:46:31 [2020-08-04T17:46:31.840Z] [INFO] 
13:46:31 [2020-08-04T17:46:31.840Z] [INFO] --- tycho-packaging-plugin:2.0.0-SNAPSHOT:build-qualifier (default-build-qualifier) @ org.eclipse.tracecompass.tmf.remote.ui.tests ---
13:46:31 [2020-08-04T17:46:31.840Z] [INFO] The project's OSGi version is 1.0.1.202008041647
13:46:31 [2020-08-04T17:46:31.840Z] [INFO] 
13:46:31 [2020-08-04T17:46:31.840Z] [INFO] --- tycho-packaging-plugin:2.0.0-SNAPSHOT:validate-id (default-validate-id) @ org.eclipse.tracecompass.tmf.remote.ui.tests ---
13:46:31 [2020-08-04T17:46:31.840Z] [INFO] 
13:46:31 [2020-08-04T17:46:31.840Z] [INFO] --- tycho-packaging-plugin:2.0.0-SNAPSHOT:validate-version (default-validate-version) @ org.eclipse.tracecompass.tmf.remote.ui.tests ---
13:46:31 [2020-08-04T17:46:31.840Z] [INFO] 
13:46:31 [2020-08-04T17:46:31.840Z] [INFO] --- maven-enforcer-plugin:1.4.1:enforce (enforce-maven-version) @ org.eclipse.tracecompass.tmf.remote.ui.tests ---
13:46:31 [2020-08-04T17:46:31.840Z] [INFO] 
13:46:31 [2020-08-04T17:46:31.840Z] [INFO] --- maven-resources-plugin:3.0.2:resources (default-resources) @ org.eclipse.tracecompass.tmf.remote.ui.tests ---
13:46:31 [2020-08-04T17:46:31.840Z] [INFO] Using 'UTF-8' encoding to copy filtered resources.
13:46:31 [2020-08-04T17:46:31.840Z] [INFO] skip non existing resourceDirectory /home/jenkins/agent/workspace/tracecompass-master-jdk11/tmf/org.eclipse.tracecompass.tmf.remote.ui.tests/src/main/resources
13:46:31 [2020-08-04T17:46:31.840Z] [INFO] 
13:46:31 [2020-08-04T17:46:31.840Z] [INFO] --- tycho-compiler-plugin:2.0.0-SNAPSHOT:compile (default-compile) @ org.eclipse.tracecompass.tmf.remote.ui.tests ---
13:46:31 [2020-08-04T17:46:31.840Z] [INFO] Compiling 4 source files to /home/jenkins/agent/workspace/tracecompass-master-jdk11/tmf/org.eclipse.tracecompass.tmf.remote.ui.tests/target/classes
13:46:32 [2020-08-04T17:46:32.099Z] [INFO] 
13:46:32 [2020-08-04T17:46:32.099Z] [INFO] --- maven-resources-plugin:3.0.2:testResources (default-testResources) @ org.eclipse.tracecompass.tmf.remote.ui.tests ---
13:46:32 [2020-08-04T17:46:32.099Z] [INFO] Using 'UTF-8' encoding to copy filtered resources.
13:46:32 [2020-08-04T17:46:32.099Z] [INFO] skip non existing resourceDirectory /home/jenkins/agent/workspace/tracecompass-master-jdk11/tmf/org.eclipse.tracecompass.tmf.remote.ui.tests/src/test/resources
13:46:32 [2020-08-04T17:46:32.099Z] [INFO] 
13:46:32 [2020-08-04T17:46:32.099Z] [INFO] --- tycho-source-plugin:2.0.0-SNAPSHOT:plugin-source (plugin-source) @ org.eclipse.tracecompass.tmf.remote.ui.tests ---
13:46:32 [2020-08-04T17:46:32.099Z] [INFO] Building jar: /home/jenkins/agent/workspace/tracecompass-master-jdk11/tmf/org.eclipse.tracecompass.tmf.remote.ui.tests/target/org.eclipse.tracecompass.tmf.remote.ui.tests-1.0.1-SNAPSHOT-sources.jar
13:46:32 [2020-08-04T17:46:32.099Z] [INFO] 
13:46:32 [2020-08-04T17:46:32.099Z] [INFO] --- target-platform-configuration:2.0.0-SNAPSHOT:target-platform (default-target-platform) @ org.eclipse.tracecompass.tmf.remote.ui.tests ---
13:46:32 [2020-08-04T17:46:32.099Z] [INFO] 
13:46:32 [2020-08-04T17:46:32.099Z] [INFO] --- tycho-packaging-plugin:2.0.0-SNAPSHOT:package-plugin (default-package-plugin) @ org.eclipse.tracecompass.tmf.remote.ui.tests ---
13:46:32 [2020-08-04T17:46:32.099Z] [INFO] Building jar: /home/jenkins/agent/workspace/tracecompass-master-jdk11/tmf/org.eclipse.tracecompass.tmf.remote.ui.tests/target/org.eclipse.tracecompass.tmf.remote.ui.tests-1.0.1-SNAPSHOT.jar
13:46:32 [2020-08-04T17:46:32.099Z] [INFO] 
13:46:32 [2020-08-04T17:46:32.099Z] [INFO] --- tycho-p2-plugin:2.0.0-SNAPSHOT:p2-metadata-default (default-p2-metadata-default) @ org.eclipse.tracecompass.tmf.remote.ui.tests ---
13:46:32 [2020-08-04T17:46:32.099Z] [INFO] 
13:46:32 [2020-08-04T17:46:32.099Z] [INFO] --- tycho-source-feature-plugin:2.0.0-SNAPSHOT:source-feature (source-feature) @ org.eclipse.tracecompass.tmf.remote.ui.tests ---
13:46:32 [2020-08-04T17:46:32.099Z] [INFO] 
13:46:32 [2020-08-04T17:46:32.099Z] [INFO] --- tycho-pack200a-plugin:2.0.0-SNAPSHOT:normalize (pack200-normalize) @ org.eclipse.tracecompass.tmf.remote.ui.tests ---
13:46:32 [2020-08-04T17:46:32.099Z] [INFO] Pack200 normalizing jar /home/jenkins/agent/workspace/tracecompass-master-jdk11/tmf/org.eclipse.tracecompass.tmf.remote.ui.tests/target/org.eclipse.tracecompass.tmf.remote.ui.tests-1.0.1-SNAPSHOT.jar
13:46:32 [2020-08-04T17:46:32.099Z] [INFO] 
13:46:32 [2020-08-04T17:46:32.099Z] [INFO] --- eclipse-jarsigner-plugin:1.1.3:sign (sign) @ org.eclipse.tracecompass.tmf.remote.ui.tests ---
13:46:32 [2020-08-04T17:46:32.099Z] [INFO] Signing jar: /home/jenkins/agent/workspace/tracecompass-master-jdk11/tmf/org.eclipse.tracecompass.tmf.remote.ui.tests/target/org.eclipse.tracecompass.tmf.remote.ui.tests-1.0.1-SNAPSHOT.jar
13:46:33 [2020-08-04T17:46:33.469Z] [INFO] Signing jar: /home/jenkins/agent/workspace/tracecompass-master-jdk11/tmf/org.eclipse.tracecompass.tmf.remote.ui.tests/target/org.eclipse.tracecompass.tmf.remote.ui.tests-1.0.1-SNAPSHOT-sources.jar
13:46:34 [2020-08-04T17:46:34.833Z] [INFO] 
13:46:34 [2020-08-04T17:46:34.833Z] [INFO] --- tycho-pack200b-plugin:2.0.0-SNAPSHOT:pack (pack200-pack) @ org.eclipse.tracecompass.tmf.remote.ui.tests ---
13:46:34 [2020-08-04T17:46:34.833Z] [INFO] Pack200 packing jar /home/jenkins/agent/workspace/tracecompass-master-jdk11/tmf/org.eclipse.tracecompass.tmf.remote.ui.tests/target/org.eclipse.tracecompass.tmf.remote.ui.tests-1.0.1-SNAPSHOT.jar
13:46:34 [2020-08-04T17:46:34.833Z] [INFO] 
13:46:34 [2020-08-04T17:46:34.833Z] [INFO] --- tycho-p2-plugin:2.0.0-SNAPSHOT:p2-metadata (p2-metadata) @ org.eclipse.tracecompass.tmf.remote.ui.tests ---
13:46:34 [2020-08-04T17:46:34.833Z] [INFO] 
13:46:34 [2020-08-04T17:46:34.833Z] [INFO] --- tycho-surefire-plugin:2.0.0-SNAPSHOT:test (default-test) @ org.eclipse.tracecompass.tmf.remote.ui.tests ---
13:46:34 [2020-08-04T17:46:34.833Z] [INFO] Executing Test Runtime with timeout 0, logs (if any) will be placed at: /home/jenkins/agent/workspace/tracecompass-master-jdk11/tmf/org.eclipse.tracecompass.tmf.remote.ui.tests/target/work/data/.metadata/.log
13:46:34 [2020-08-04T17:46:34.833Z] [INFO] Command line:
13:46:34 [2020-08-04T17:46:34.833Z] 	[/opt/tools/java/openjdk/jdk-11/11.0.2+9/bin/java, -Dosgi.noShutdown=false, -Dosgi.os=linux, -Dosgi.ws=gtk, -Dosgi.arch=x86_64, -Dorg.eclipse.swt.browser.DefaultType=mozilla, -Xms512m, -Xmx1024m, -Dosgi.clean=true, -jar, /home/jenkins/.m2/repository/p2/osgi/bundle/org.eclipse.equinox.launcher/1.5.700.v20200207-2156/org.eclipse.equinox.launcher-1.5.700.v20200207-2156.jar, -data, /home/jenkins/agent/workspace/tracecompass-master-jdk11/tmf/org.eclipse.tracecompass.tmf.remote.ui.tests/target/work/data, -install, /home/jenkins/agent/workspace/tracecompass-master-jdk11/tmf/org.eclipse.tracecompass.tmf.remote.ui.tests/target/work, -configuration, /home/jenkins/agent/workspace/tracecompass-master-jdk11/tmf/org.eclipse.tracecompass.tmf.remote.ui.tests/target/work/configuration, -application, org.eclipse.tycho.surefire.osgibooter.uitest, -testproperties, /home/jenkins/agent/workspace/tracecompass-master-jdk11/tmf/org.eclipse.tracecompass.tmf.remote.ui.tests/target/surefire.properties, -product, org.eclipse.platform.ide, -consoleLog]
13:46:34 [2020-08-04T17:46:34.834Z] Picked up _JAVA_OPTIONS: -Duser.home=/home/tracecompass
13:46:38 [2020-08-04T17:46:38.101Z] !SESSION 2020-08-04 17:46:34.921 -----------------------------------------------
13:46:38 [2020-08-04T17:46:38.101Z] eclipse.buildId=unknown
13:46:38 [2020-08-04T17:46:38.101Z] java.version=11.0.2
13:46:38 [2020-08-04T17:46:38.101Z] java.vendor=Oracle Corporation
13:46:38 [2020-08-04T17:46:38.101Z] BootLoader constants: OS=linux, ARCH=x86_64, WS=gtk, NL=en_US
13:46:38 [2020-08-04T17:46:38.101Z] Framework arguments:  -application org.eclipse.tycho.surefire.osgibooter.uitest -testproperties /home/jenkins/agent/workspace/tracecompass-master-jdk11/tmf/org.eclipse.tracecompass.tmf.remote.ui.tests/target/surefire.properties -product org.eclipse.platform.ide
13:46:38 [2020-08-04T17:46:38.101Z] Command-line arguments:  -data /home/jenkins/agent/workspace/tracecompass-master-jdk11/tmf/org.eclipse.tracecompass.tmf.remote.ui.tests/target/work/data -application org.eclipse.tycho.surefire.osgibooter.uitest -testproperties /home/jenkins/agent/workspace/tracecompass-master-jdk11/tmf/org.eclipse.tracecompass.tmf.remote.ui.tests/target/surefire.properties -product org.eclipse.platform.ide -consoleLog
13:46:38 [2020-08-04T17:46:38.101Z] 
13:46:38 [2020-08-04T17:46:38.101Z] !ENTRY org.eclipse.compare.win32 4 0 2020-08-04 17:46:37.427
13:46:38 [2020-08-04T17:46:38.101Z] !MESSAGE FrameworkEvent ERROR
13:46:38 [2020-08-04T17:46:38.101Z] !STACK 0
13:46:38 [2020-08-04T17:46:38.101Z] org.osgi.framework.BundleException: Could not resolve module: org.eclipse.compare.win32 [66]
13:46:38 [2020-08-04T17:46:38.101Z]   Unresolved requirement: Require-Capability: eclipse.platform; filter:="(osgi.os=win32)"
13:46:38 [2020-08-04T17:46:38.101Z] 
13:46:38 [2020-08-04T17:46:38.101Z] 	at org.eclipse.osgi.container.Module.start(Module.java:463)
13:46:38 [2020-08-04T17:46:38.101Z] 	at org.eclipse.osgi.container.ModuleContainer$ContainerStartLevel$2.run(ModuleContainer.java:1845)
13:46:38 [2020-08-04T17:46:38.101Z] 	at org.eclipse.osgi.internal.framework.EquinoxContainerAdaptor$1$1.execute(EquinoxContainerAdaptor.java:136)
13:46:38 [2020-08-04T17:46:38.101Z] 	at org.eclipse.osgi.container.ModuleContainer$ContainerStartLevel.incStartLevel(ModuleContainer.java:1838)
13:46:38 [2020-08-04T17:46:38.101Z] 	at org.eclipse.osgi.container.ModuleContainer$ContainerStartLevel.incStartLevel(ModuleContainer.java:1779)
13:46:38 [2020-08-04T17:46:38.101Z] 	at org.eclipse.osgi.container.ModuleContainer$ContainerStartLevel.doContainerStartLevel(ModuleContainer.java:1743)
13:46:38 [2020-08-04T17:46:38.101Z] 	at org.eclipse.osgi.container.ModuleContainer$ContainerStartLevel.dispatchEvent(ModuleContainer.java:1665)
13:46:38 [2020-08-04T17:46:38.101Z] 	at org.eclipse.osgi.container.ModuleContainer$ContainerStartLevel.dispatchEvent(ModuleContainer.java:1)
13:46:38 [2020-08-04T17:46:38.101Z] 	at org.eclipse.osgi.framework.eventmgr.EventManager.dispatchEvent(EventManager.java:234)
13:46:38 [2020-08-04T17:46:38.101Z] 	at org.eclipse.osgi.framework.eventmgr.EventManager$EventThread.run(EventManager.java:345)
13:46:38 [2020-08-04T17:46:38.101Z] 
13:46:38 [2020-08-04T17:46:38.101Z] !ENTRY org.eclipse.ecf.provider.filetransfer.httpclient45.win32 4 0 2020-08-04 17:46:37.435
13:46:38 [2020-08-04T17:46:38.101Z] !MESSAGE FrameworkEvent ERROR
13:46:38 [2020-08-04T17:46:38.101Z] !STACK 0
13:46:38 [2020-08-04T17:46:38.101Z] org.osgi.framework.BundleException: Could not resolve module: org.eclipse.ecf.provider.filetransfer.httpclient45.win32 [138]
13:46:38 [2020-08-04T17:46:38.101Z]   Unresolved requirement: Require-Capability: eclipse.platform; filter:="(osgi.os=win32)"
13:46:38 [2020-08-04T17:46:38.102Z]   Unresolved requirement: Import-Package: org.apache.http.impl.auth.win; version="[4.5.0,5.0.0)"
13:46:38 [2020-08-04T17:46:38.102Z]     -> Export-Package: org.apache.http.impl.auth.win; bundle-symbolic-name="org.apache.httpcomponents.httpclient.win"; bundle-version="4.5.10.v20200113-2105"; version="4.5.10"; x-internal:="true"; uses:="org.apache.http,org.apache.http.auth,org.apache.http.client,org.apache.http.impl.auth,org.apache.http.protocol,org.apache.http.util"
13:46:38 [2020-08-04T17:46:38.102Z]        org.apache.httpcomponents.httpclient.win [36]
13:46:38 [2020-08-04T17:46:38.102Z]          Unresolved requirement: Require-Capability: eclipse.platform; filter:="(osgi.os=win32)"
13:46:38 [2020-08-04T17:46:38.102Z] 
13:46:38 [2020-08-04T17:46:38.102Z] 	at org.eclipse.osgi.container.Module.start(Module.java:463)
13:46:38 [2020-08-04T17:46:38.102Z] 	at org.eclipse.osgi.container.ModuleContainer$ContainerStartLevel$2.run(ModuleContainer.java:1845)
13:46:38 [2020-08-04T17:46:38.102Z] 	at org.eclipse.osgi.internal.framework.EquinoxContainerAdaptor$1$1.execute(EquinoxContainerAdaptor.java:136)
13:46:38 [2020-08-04T17:46:38.102Z] 	at org.eclipse.osgi.container.ModuleContainer$ContainerStartLevel.incStartLevel(ModuleContainer.java:1838)
13:46:38 [2020-08-04T17:46:38.102Z] 	at org.eclipse.osgi.container.ModuleContainer$ContainerStartLevel.incStartLevel(ModuleContainer.java:1779)
13:46:38 [2020-08-04T17:46:38.102Z] 	at org.eclipse.osgi.container.ModuleContainer$ContainerStartLevel.doContainerStartLevel(ModuleContainer.java:1743)
13:46:38 [2020-08-04T17:46:38.102Z] 	at org.eclipse.osgi.container.ModuleContainer$ContainerStartLevel.dispatchEvent(ModuleContainer.java:1665)
13:46:38 [2020-08-04T17:46:38.102Z] 	at org.eclipse.osgi.container.ModuleContainer$ContainerStartLevel.dispatchEvent(ModuleContainer.java:1)
13:46:38 [2020-08-04T17:46:38.102Z] 	at org.eclipse.osgi.framework.eventmgr.EventManager.dispatchEvent(EventManager.java:234)
13:46:38 [2020-08-04T17:46:38.102Z] 	at org.eclipse.osgi.framework.eventmgr.EventManager$EventThread.run(EventManager.java:345)
13:46:38 [2020-08-04T17:46:38.102Z] SWT SessionManagerDBus: Failed to connect to org.gnome.SessionManager: Failed to execute child process “dbus-launch” (No such file or directory)
13:46:38 [2020-08-04T17:46:38.102Z] SWT SessionManagerDBus: Failed to connect to org.xfce.SessionManager: Failed to execute child process “dbus-launch” (No such file or directory)
13:46:43 [2020-08-04T17:46:43.349Z] 
13:46:43 [2020-08-04T17:46:43.349Z] !ENTRY org.eclipse.urischeme 4 0 2020-08-04 17:46:42.313
13:46:43 [2020-08-04T17:46:43.349Z] !MESSAGE Cannot run program "xdg-mime": error=2, No such file or directory
13:46:43 [2020-08-04T17:46:43.349Z] !STACK 0
13:46:43 [2020-08-04T17:46:43.349Z] java.io.IOException: Cannot run program "xdg-mime": error=2, No such file or directory
13:46:43 [2020-08-04T17:46:43.349Z] 	at java.base/java.lang.ProcessBuilder.start(ProcessBuilder.java:1128)
13:46:43 [2020-08-04T17:46:43.350Z] 	at java.base/java.lang.ProcessBuilder.start(ProcessBuilder.java:1071)
13:46:43 [2020-08-04T17:46:43.350Z] 	at org.eclipse.urischeme.internal.registration.ProcessExecutor.execute(ProcessExecutor.java:36)
13:46:43 [2020-08-04T17:46:43.350Z] 	at org.eclipse.urischeme.internal.registration.RegistrationLinux.getRegisteredDesktopFileForScheme(RegistrationLinux.java:136)
13:46:43 [2020-08-04T17:46:43.350Z] 	at org.eclipse.urischeme.internal.registration.RegistrationLinux.determineHandlerLocation(RegistrationLinux.java:80)
13:46:43 [2020-08-04T17:46:43.350Z] 	at org.eclipse.urischeme.internal.registration.RegistrationLinux.getSchemesInformation(RegistrationLinux.java:69)
13:46:43 [2020-08-04T17:46:43.350Z] 	at org.eclipse.urischeme.AutoRegisterSchemeHandlersJob.run(AutoRegisterSchemeHandlersJob.java:63)
13:46:43 [2020-08-04T17:46:43.350Z] 	at org.eclipse.core.internal.jobs.Worker.run(Worker.java:63)
13:46:43 [2020-08-04T17:46:43.350Z] Caused by: java.io.IOException: error=2, No such file or directory
13:46:43 [2020-08-04T17:46:43.350Z] 	at java.base/java.lang.ProcessImpl.forkAndExec(Native Method)
13:46:43 [2020-08-04T17:46:43.350Z] 	at java.base/java.lang.ProcessImpl.<init>(ProcessImpl.java:340)
13:46:43 [2020-08-04T17:46:43.350Z] 	at java.base/java.lang.ProcessImpl.start(ProcessImpl.java:271)
13:46:43 [2020-08-04T17:46:43.350Z] 	at java.base/java.lang.ProcessBuilder.start(ProcessBuilder.java:1107)
13:46:43 [2020-08-04T17:46:43.350Z] 	... 7 more
13:46:43 [2020-08-04T17:46:43.350Z] Running org.eclipse.tracecompass.tmf.remote.ui.tests.fetch.RemoteImportProfilesWriterTest
13:46:43 [2020-08-04T17:46:43.350Z] Tests run: 1, Failures: 0, Errors: 0, Skipped: 0, Time elapsed: 0.243 s - in org.eclipse.tracecompass.tmf.remote.ui.tests.fetch.RemoteImportProfilesWriterTest
13:46:43 [2020-08-04T17:46:43.350Z] testValidateValid  Time elapsed: 0.239 s
13:46:43 [2020-08-04T17:46:43.350Z] Running org.eclipse.tracecompass.tmf.remote.ui.tests.fetch.RemoteImportProfilesReaderTest
13:46:43 [2020-08-04T17:46:43.350Z] Tests run: 5, Failures: 0, Errors: 0, Skipped: 0, Time elapsed: 0.143 s - in org.eclipse.tracecompass.tmf.remote.ui.tests.fetch.RemoteImportProfilesReaderTest
13:46:43 [2020-08-04T17:46:43.350Z] testLoadElements  Time elapsed: 0.009 s
13:46:43 [2020-08-04T17:46:43.350Z] testValidateInvalidMissingFiles  Time elapsed: 0.115 s
13:46:43 [2020-08-04T17:46:43.350Z] testValidateInvalidEmptyProfile  Time elapsed: 0.014 s
13:46:43 [2020-08-04T17:46:43.350Z] testValidateInvalidMissingRoot  Time elapsed: 0.003 s
13:46:43 [2020-08-04T17:46:43.350Z] testValidateValid  Time elapsed: 0.002 s
13:46:43 [2020-08-04T17:46:43.350Z] 
13:46:43 [2020-08-04T17:46:43.350Z] Results:
13:46:43 [2020-08-04T17:46:43.350Z] 
13:46:43 [2020-08-04T17:46:43.350Z] Tests run: 6, Failures: 0, Errors: 0, Skipped: 0
13:46:43 [2020-08-04T17:46:43.350Z] 
13:46:44 [2020-08-04T17:46:44.715Z] [INFO] All tests passed!
13:46:44 [2020-08-04T17:46:44.715Z] [INFO] 
13:46:44 [2020-08-04T17:46:44.715Z] [INFO] --- maven-install-plugin:2.5.2:install (default-install) @ org.eclipse.tracecompass.tmf.remote.ui.tests ---
13:46:44 [2020-08-04T17:46:44.715Z] [INFO] Installing /home/jenkins/agent/workspace/tracecompass-master-jdk11/tmf/org.eclipse.tracecompass.tmf.remote.ui.tests/target/org.eclipse.tracecompass.tmf.remote.ui.tests-1.0.1-SNAPSHOT.jar to /home/jenkins/.m2/repository/org/eclipse/tracecompass/org.eclipse.tracecompass.tmf.remote.ui.tests/1.0.1-SNAPSHOT/org.eclipse.tracecompass.tmf.remote.ui.tests-1.0.1-SNAPSHOT.jar
13:46:44 [2020-08-04T17:46:44.715Z] [INFO] Installing /home/jenkins/agent/workspace/tracecompass-master-jdk11/tmf/org.eclipse.tracecompass.tmf.remote.ui.tests/pom.xml to /home/jenkins/.m2/repository/org/eclipse/tracecompass/org.eclipse.tracecompass.tmf.remote.ui.tests/1.0.1-SNAPSHOT/org.eclipse.tracecompass.tmf.remote.ui.tests-1.0.1-SNAPSHOT.pom
13:46:44 [2020-08-04T17:46:44.715Z] [INFO] Installing /home/jenkins/agent/workspace/tracecompass-master-jdk11/tmf/org.eclipse.tracecompass.tmf.remote.ui.tests/target/org.eclipse.tracecompass.tmf.remote.ui.tests-1.0.1-SNAPSHOT-sources.jar to /home/jenkins/.m2/repository/org/eclipse/tracecompass/org.eclipse.tracecompass.tmf.remote.ui.tests/1.0.1-SNAPSHOT/org.eclipse.tracecompass.tmf.remote.ui.tests-1.0.1-SNAPSHOT-sources.jar
13:46:44 [2020-08-04T17:46:44.715Z] [INFO] Installing /home/jenkins/agent/workspace/tracecompass-master-jdk11/tmf/org.eclipse.tracecompass.tmf.remote.ui.tests/target/org.eclipse.tracecompass.tmf.remote.ui.tests-1.0.1-SNAPSHOT.jar.pack.gz to /home/jenkins/.m2/repository/org/eclipse/tracecompass/org.eclipse.tracecompass.tmf.remote.ui.tests/1.0.1-SNAPSHOT/org.eclipse.tracecompass.tmf.remote.ui.tests-1.0.1-SNAPSHOT-pack200.jar.pack.gz
13:46:44 [2020-08-04T17:46:44.715Z] [INFO] Installing /home/jenkins/agent/workspace/tracecompass-master-jdk11/tmf/org.eclipse.tracecompass.tmf.remote.ui.tests/target/p2content.xml to /home/jenkins/.m2/repository/org/eclipse/tracecompass/org.eclipse.tracecompass.tmf.remote.ui.tests/1.0.1-SNAPSHOT/org.eclipse.tracecompass.tmf.remote.ui.tests-1.0.1-SNAPSHOT-p2metadata.xml
13:46:44 [2020-08-04T17:46:44.715Z] [INFO] Installing /home/jenkins/agent/workspace/tracecompass-master-jdk11/tmf/org.eclipse.tracecompass.tmf.remote.ui.tests/target/p2artifacts.xml to /home/jenkins/.m2/repository/org/eclipse/tracecompass/org.eclipse.tracecompass.tmf.remote.ui.tests/1.0.1-SNAPSHOT/org.eclipse.tracecompass.tmf.remote.ui.tests-1.0.1-SNAPSHOT-p2artifacts.xml
13:46:44 [2020-08-04T17:46:44.715Z] [INFO] 
13:46:44 [2020-08-04T17:46:44.715Z] [INFO] --- tycho-p2-plugin:2.0.0-SNAPSHOT:update-local-index (default-update-local-index) @ org.eclipse.tracecompass.tmf.remote.ui.tests ---
13:46:44 [2020-08-04T17:46:44.715Z] [INFO] 
13:46:44 [2020-08-04T17:46:44.715Z] [INFO] -----< org.eclipse.tracecompass:org.eclipse.tracecompass.alltests >-----
13:46:44 [2020-08-04T17:46:44.715Z] [INFO] Building Trace Compass All Tests 1.0.9-SNAPSHOT                [134/138]
13:46:44 [2020-08-04T17:46:44.715Z] [INFO] ------------------------[ eclipse-test-plugin ]-------------------------
13:46:44 [2020-08-04T17:46:44.715Z] [INFO] 
13:46:44 [2020-08-04T17:46:44.715Z] [INFO] --- maven-clean-plugin:3.0.0:clean (default-clean) @ org.eclipse.tracecompass.alltests ---
13:46:44 [2020-08-04T17:46:44.715Z] [INFO] 
13:46:44 [2020-08-04T17:46:44.715Z] [INFO] --- tycho-packaging-plugin:2.0.0-SNAPSHOT:build-qualifier (default-build-qualifier) @ org.eclipse.tracecompass.alltests ---
13:46:44 [2020-08-04T17:46:44.715Z] [INFO] The project's OSGi version is 1.0.9.202008041647
13:46:44 [2020-08-04T17:46:44.715Z] [INFO] 
13:46:44 [2020-08-04T17:46:44.715Z] [INFO] --- tycho-packaging-plugin:2.0.0-SNAPSHOT:validate-id (default-validate-id) @ org.eclipse.tracecompass.alltests ---
13:46:44 [2020-08-04T17:46:44.715Z] [INFO] 
13:46:44 [2020-08-04T17:46:44.715Z] [INFO] --- tycho-packaging-plugin:2.0.0-SNAPSHOT:validate-version (default-validate-version) @ org.eclipse.tracecompass.alltests ---
13:46:44 [2020-08-04T17:46:44.715Z] [INFO] 
13:46:44 [2020-08-04T17:46:44.715Z] [INFO] --- maven-enforcer-plugin:1.4.1:enforce (enforce-maven-version) @ org.eclipse.tracecompass.alltests ---
13:46:44 [2020-08-04T17:46:44.715Z] [INFO] 
13:46:44 [2020-08-04T17:46:44.715Z] [INFO] --- maven-resources-plugin:3.0.2:resources (default-resources) @ org.eclipse.tracecompass.alltests ---
13:46:44 [2020-08-04T17:46:44.715Z] [INFO] Using 'UTF-8' encoding to copy filtered resources.
13:46:44 [2020-08-04T17:46:44.715Z] [INFO] skip non existing resourceDirectory /home/jenkins/agent/workspace/tracecompass-master-jdk11/releng/org.eclipse.tracecompass.alltests/src/main/resources
13:46:44 [2020-08-04T17:46:44.715Z] [INFO] 
13:46:44 [2020-08-04T17:46:44.715Z] [INFO] --- tycho-compiler-plugin:2.0.0-SNAPSHOT:compile (default-compile) @ org.eclipse.tracecompass.alltests ---
13:46:44 [2020-08-04T17:46:44.715Z] [INFO] Compiling 8 source files to /home/jenkins/agent/workspace/tracecompass-master-jdk11/releng/org.eclipse.tracecompass.alltests/target/classes
13:46:45 [2020-08-04T17:46:45.276Z] [INFO] 
13:46:45 [2020-08-04T17:46:45.276Z] [INFO] --- maven-resources-plugin:3.0.2:testResources (default-testResources) @ org.eclipse.tracecompass.alltests ---
13:46:45 [2020-08-04T17:46:45.276Z] [INFO] Using 'UTF-8' encoding to copy filtered resources.
13:46:45 [2020-08-04T17:46:45.276Z] [INFO] skip non existing resourceDirectory /home/jenkins/agent/workspace/tracecompass-master-jdk11/releng/org.eclipse.tracecompass.alltests/src/test/resources
13:46:45 [2020-08-04T17:46:45.276Z] [INFO] 
13:46:45 [2020-08-04T17:46:45.276Z] [INFO] --- tycho-source-plugin:2.0.0-SNAPSHOT:plugin-source (plugin-source) @ org.eclipse.tracecompass.alltests ---
13:46:45 [2020-08-04T17:46:45.276Z] [INFO] Building jar: /home/jenkins/agent/workspace/tracecompass-master-jdk11/releng/org.eclipse.tracecompass.alltests/target/org.eclipse.tracecompass.alltests-1.0.9-SNAPSHOT-sources.jar
13:46:45 [2020-08-04T17:46:45.276Z] [INFO] 
13:46:45 [2020-08-04T17:46:45.276Z] [INFO] --- target-platform-configuration:2.0.0-SNAPSHOT:target-platform (default-target-platform) @ org.eclipse.tracecompass.alltests ---
13:46:45 [2020-08-04T17:46:45.532Z] [INFO] 
13:46:45 [2020-08-04T17:46:45.532Z] [INFO] --- tycho-packaging-plugin:2.0.0-SNAPSHOT:package-plugin (default-package-plugin) @ org.eclipse.tracecompass.alltests ---
13:46:45 [2020-08-04T17:46:45.532Z] [INFO] Building jar: /home/jenkins/agent/workspace/tracecompass-master-jdk11/releng/org.eclipse.tracecompass.alltests/target/org.eclipse.tracecompass.alltests-1.0.9-SNAPSHOT.jar
13:46:45 [2020-08-04T17:46:45.532Z] [INFO] 
13:46:45 [2020-08-04T17:46:45.532Z] [INFO] --- tycho-p2-plugin:2.0.0-SNAPSHOT:p2-metadata-default (default-p2-metadata-default) @ org.eclipse.tracecompass.alltests ---
13:46:45 [2020-08-04T17:46:45.532Z] [INFO] 
13:46:45 [2020-08-04T17:46:45.532Z] [INFO] --- tycho-source-feature-plugin:2.0.0-SNAPSHOT:source-feature (source-feature) @ org.eclipse.tracecompass.alltests ---
13:46:45 [2020-08-04T17:46:45.532Z] [INFO] 
13:46:45 [2020-08-04T17:46:45.532Z] [INFO] --- tycho-pack200a-plugin:2.0.0-SNAPSHOT:normalize (pack200-normalize) @ org.eclipse.tracecompass.alltests ---
13:46:45 [2020-08-04T17:46:45.532Z] [INFO] Pack200 normalizing jar /home/jenkins/agent/workspace/tracecompass-master-jdk11/releng/org.eclipse.tracecompass.alltests/target/org.eclipse.tracecompass.alltests-1.0.9-SNAPSHOT.jar
13:46:45 [2020-08-04T17:46:45.532Z] [INFO] 
13:46:45 [2020-08-04T17:46:45.532Z] [INFO] --- eclipse-jarsigner-plugin:1.1.3:sign (sign) @ org.eclipse.tracecompass.alltests ---
13:46:45 [2020-08-04T17:46:45.532Z] [INFO] Signing jar: /home/jenkins/agent/workspace/tracecompass-master-jdk11/releng/org.eclipse.tracecompass.alltests/target/org.eclipse.tracecompass.alltests-1.0.9-SNAPSHOT.jar
13:46:46 [2020-08-04T17:46:46.897Z] [INFO] Signing jar: /home/jenkins/agent/workspace/tracecompass-master-jdk11/releng/org.eclipse.tracecompass.alltests/target/org.eclipse.tracecompass.alltests-1.0.9-SNAPSHOT-sources.jar
13:46:47 [2020-08-04T17:46:47.825Z] [INFO] 
13:46:47 [2020-08-04T17:46:47.825Z] [INFO] --- tycho-pack200b-plugin:2.0.0-SNAPSHOT:pack (pack200-pack) @ org.eclipse.tracecompass.alltests ---
13:46:47 [2020-08-04T17:46:47.825Z] [INFO] Pack200 packing jar /home/jenkins/agent/workspace/tracecompass-master-jdk11/releng/org.eclipse.tracecompass.alltests/target/org.eclipse.tracecompass.alltests-1.0.9-SNAPSHOT.jar
13:46:47 [2020-08-04T17:46:47.825Z] [INFO] 
13:46:47 [2020-08-04T17:46:47.825Z] [INFO] --- tycho-p2-plugin:2.0.0-SNAPSHOT:p2-metadata (p2-metadata) @ org.eclipse.tracecompass.alltests ---
13:46:47 [2020-08-04T17:46:47.825Z] [INFO] 
13:46:47 [2020-08-04T17:46:47.825Z] [INFO] --- tycho-surefire-plugin:2.0.0-SNAPSHOT:test (default-test) @ org.eclipse.tracecompass.alltests ---
13:46:48 [2020-08-04T17:46:48.080Z] [INFO] Executing Test Runtime with timeout 0, logs (if any) will be placed at: /home/jenkins/agent/workspace/tracecompass-master-jdk11/releng/org.eclipse.tracecompass.alltests/target/work/data/.metadata/.log
13:46:48 [2020-08-04T17:46:48.080Z] [INFO] Command line:
13:46:48 [2020-08-04T17:46:48.080Z] 	[/opt/tools/java/openjdk/jdk-11/11.0.2+9/bin/java, -Dosgi.noShutdown=false, -Dosgi.os=linux, -Dosgi.ws=gtk, -Dosgi.arch=x86_64, -Dorg.eclipse.swt.browser.DefaultType=mozilla, -Xms512m, -Xmx1024m, -Dosgi.clean=true, -jar, /home/jenkins/.m2/repository/p2/osgi/bundle/org.eclipse.equinox.launcher/1.5.700.v20200207-2156/org.eclipse.equinox.launcher-1.5.700.v20200207-2156.jar, -data, /home/jenkins/agent/workspace/tracecompass-master-jdk11/releng/org.eclipse.tracecompass.alltests/target/work/data, -install, /home/jenkins/agent/workspace/tracecompass-master-jdk11/releng/org.eclipse.tracecompass.alltests/target/work, -configuration, /home/jenkins/agent/workspace/tracecompass-master-jdk11/releng/org.eclipse.tracecompass.alltests/target/work/configuration, -application, org.eclipse.tycho.surefire.osgibooter.headlesstest, -testproperties, /home/jenkins/agent/workspace/tracecompass-master-jdk11/releng/org.eclipse.tracecompass.alltests/target/surefire.properties, -product, org.eclipse.platform.ide, -consoleLog]
13:46:48 [2020-08-04T17:46:48.080Z] Picked up _JAVA_OPTIONS: -Duser.home=/home/tracecompass
13:46:51 [2020-08-04T17:46:51.348Z] !SESSION 2020-08-04 17:46:48.142 -----------------------------------------------
13:46:51 [2020-08-04T17:46:51.348Z] eclipse.buildId=unknown
13:46:51 [2020-08-04T17:46:51.348Z] java.version=11.0.2
13:46:51 [2020-08-04T17:46:51.348Z] java.vendor=Oracle Corporation
13:46:51 [2020-08-04T17:46:51.348Z] BootLoader constants: OS=linux, ARCH=x86_64, WS=gtk, NL=en_US
13:46:51 [2020-08-04T17:46:51.348Z] Framework arguments:  -application org.eclipse.tycho.surefire.osgibooter.headlesstest -testproperties /home/jenkins/agent/workspace/tracecompass-master-jdk11/releng/org.eclipse.tracecompass.alltests/target/surefire.properties -product org.eclipse.platform.ide
13:46:51 [2020-08-04T17:46:51.348Z] Command-line arguments:  -data /home/jenkins/agent/workspace/tracecompass-master-jdk11/releng/org.eclipse.tracecompass.alltests/target/work/data -application org.eclipse.tycho.surefire.osgibooter.headlesstest -testproperties /home/jenkins/agent/workspace/tracecompass-master-jdk11/releng/org.eclipse.tracecompass.alltests/target/surefire.properties -product org.eclipse.platform.ide -consoleLog
13:46:51 [2020-08-04T17:46:51.348Z] 
13:46:51 [2020-08-04T17:46:51.348Z] !ENTRY org.eclipse.compare.win32 4 0 2020-08-04 17:46:51.128
13:46:51 [2020-08-04T17:46:51.348Z] !MESSAGE FrameworkEvent ERROR
13:46:51 [2020-08-04T17:46:51.348Z] !STACK 0
13:46:51 [2020-08-04T17:46:51.348Z] org.osgi.framework.BundleException: Could not resolve module: org.eclipse.compare.win32 [87]
13:46:51 [2020-08-04T17:46:51.348Z]   Unresolved requirement: Require-Capability: eclipse.platform; filter:="(osgi.os=win32)"
13:46:51 [2020-08-04T17:46:51.348Z] 
13:46:51 [2020-08-04T17:46:51.348Z] 	at org.eclipse.osgi.container.Module.start(Module.java:463)
13:46:51 [2020-08-04T17:46:51.348Z] 	at org.eclipse.osgi.container.ModuleContainer$ContainerStartLevel$2.run(ModuleContainer.java:1845)
13:46:51 [2020-08-04T17:46:51.348Z] 	at org.eclipse.osgi.internal.framework.EquinoxContainerAdaptor$1$1.execute(EquinoxContainerAdaptor.java:136)
13:46:51 [2020-08-04T17:46:51.348Z] 	at org.eclipse.osgi.container.ModuleContainer$ContainerStartLevel.incStartLevel(ModuleContainer.java:1838)
13:46:51 [2020-08-04T17:46:51.348Z] 	at org.eclipse.osgi.container.ModuleContainer$ContainerStartLevel.incStartLevel(ModuleContainer.java:1779)
13:46:51 [2020-08-04T17:46:51.348Z] 	at org.eclipse.osgi.container.ModuleContainer$ContainerStartLevel.doContainerStartLevel(ModuleContainer.java:1743)
13:46:51 [2020-08-04T17:46:51.348Z] 	at org.eclipse.osgi.container.ModuleContainer$ContainerStartLevel.dispatchEvent(ModuleContainer.java:1665)
13:46:51 [2020-08-04T17:46:51.348Z] 	at org.eclipse.osgi.container.ModuleContainer$ContainerStartLevel.dispatchEvent(ModuleContainer.java:1)
13:46:51 [2020-08-04T17:46:51.348Z] 	at org.eclipse.osgi.framework.eventmgr.EventManager.dispatchEvent(EventManager.java:234)
13:46:51 [2020-08-04T17:46:51.348Z] 	at org.eclipse.osgi.framework.eventmgr.EventManager$EventThread.run(EventManager.java:345)
13:46:51 [2020-08-04T17:46:51.348Z] 
13:46:51 [2020-08-04T17:46:51.348Z] !ENTRY org.eclipse.ecf.provider.filetransfer.httpclient45.win32 4 0 2020-08-04 17:46:51.134
13:46:51 [2020-08-04T17:46:51.348Z] !MESSAGE FrameworkEvent ERROR
13:46:51 [2020-08-04T17:46:51.348Z] !STACK 0
13:46:51 [2020-08-04T17:46:51.348Z] org.osgi.framework.BundleException: Could not resolve module: org.eclipse.ecf.provider.filetransfer.httpclient45.win32 [153]
13:46:51 [2020-08-04T17:46:51.348Z]   Unresolved requirement: Require-Capability: eclipse.platform; filter:="(osgi.os=win32)"
13:46:51 [2020-08-04T17:46:51.348Z]   Unresolved requirement: Import-Package: org.apache.http.impl.auth.win; version="[4.5.0,5.0.0)"
13:46:51 [2020-08-04T17:46:51.348Z]     -> Export-Package: org.apache.http.impl.auth.win; bundle-symbolic-name="org.apache.httpcomponents.httpclient.win"; bundle-version="4.5.10.v20200113-2105"; version="4.5.10"; x-internal:="true"; uses:="org.apache.http,org.apache.http.auth,org.apache.http.client,org.apache.http.impl.auth,org.apache.http.protocol,org.apache.http.util"
13:46:51 [2020-08-04T17:46:51.348Z]        org.apache.httpcomponents.httpclient.win [36]
13:46:51 [2020-08-04T17:46:51.348Z]          Unresolved requirement: Require-Capability: eclipse.platform; filter:="(osgi.os=win32)"
13:46:51 [2020-08-04T17:46:51.348Z] 
13:46:51 [2020-08-04T17:46:51.348Z] 	at org.eclipse.osgi.container.Module.start(Module.java:463)
13:46:51 [2020-08-04T17:46:51.348Z] 	at org.eclipse.osgi.container.ModuleContainer$ContainerStartLevel$2.run(ModuleContainer.java:1845)
13:46:51 [2020-08-04T17:46:51.348Z] 	at org.eclipse.osgi.internal.framework.EquinoxContainerAdaptor$1$1.execute(EquinoxContainerAdaptor.java:136)
13:46:51 [2020-08-04T17:46:51.348Z] 	at org.eclipse.osgi.container.ModuleContainer$ContainerStartLevel.incStartLevel(ModuleContainer.java:1838)
13:46:51 [2020-08-04T17:46:51.348Z] 	at org.eclipse.osgi.container.ModuleContainer$ContainerStartLevel.incStartLevel(ModuleContainer.java:1779)
13:46:51 [2020-08-04T17:46:51.348Z] 	at org.eclipse.osgi.container.ModuleContainer$ContainerStartLevel.doContainerStartLevel(ModuleContainer.java:1743)
13:46:51 [2020-08-04T17:46:51.348Z] 	at org.eclipse.osgi.container.ModuleContainer$ContainerStartLevel.dispatchEvent(ModuleContainer.java:1665)
13:46:51 [2020-08-04T17:46:51.348Z] 	at org.eclipse.osgi.container.ModuleContainer$ContainerStartLevel.dispatchEvent(ModuleContainer.java:1)
13:46:51 [2020-08-04T17:46:51.348Z] 	at org.eclipse.osgi.framework.eventmgr.EventManager.dispatchEvent(EventManager.java:234)
13:46:51 [2020-08-04T17:46:51.348Z] 	at org.eclipse.osgi.framework.eventmgr.EventManager$EventThread.run(EventManager.java:345)
13:46:51 [2020-08-04T17:46:51.910Z] 
13:46:51 [2020-08-04T17:46:51.910Z] Results:
13:46:51 [2020-08-04T17:46:51.910Z] 
13:46:51 [2020-08-04T17:46:51.910Z] Tests run: 0, Failures: 0, Errors: 0, Skipped: 0
13:46:51 [2020-08-04T17:46:51.910Z] 
13:46:52 [2020-08-04T17:46:52.472Z] [WARNING] No tests found.
13:46:52 [2020-08-04T17:46:52.472Z] [INFO] 
13:46:52 [2020-08-04T17:46:52.472Z] [INFO] --- maven-install-plugin:2.5.2:install (default-install) @ org.eclipse.tracecompass.alltests ---
13:46:52 [2020-08-04T17:46:52.472Z] [INFO] Installing /home/jenkins/agent/workspace/tracecompass-master-jdk11/releng/org.eclipse.tracecompass.alltests/target/org.eclipse.tracecompass.alltests-1.0.9-SNAPSHOT.jar to /home/jenkins/.m2/repository/org/eclipse/tracecompass/org.eclipse.tracecompass.alltests/1.0.9-SNAPSHOT/org.eclipse.tracecompass.alltests-1.0.9-SNAPSHOT.jar
13:46:52 [2020-08-04T17:46:52.472Z] [INFO] Installing /home/jenkins/agent/workspace/tracecompass-master-jdk11/releng/org.eclipse.tracecompass.alltests/pom.xml to /home/jenkins/.m2/repository/org/eclipse/tracecompass/org.eclipse.tracecompass.alltests/1.0.9-SNAPSHOT/org.eclipse.tracecompass.alltests-1.0.9-SNAPSHOT.pom
13:46:52 [2020-08-04T17:46:52.472Z] [INFO] Installing /home/jenkins/agent/workspace/tracecompass-master-jdk11/releng/org.eclipse.tracecompass.alltests/target/org.eclipse.tracecompass.alltests-1.0.9-SNAPSHOT-sources.jar to /home/jenkins/.m2/repository/org/eclipse/tracecompass/org.eclipse.tracecompass.alltests/1.0.9-SNAPSHOT/org.eclipse.tracecompass.alltests-1.0.9-SNAPSHOT-sources.jar
13:46:52 [2020-08-04T17:46:52.472Z] [INFO] Installing /home/jenkins/agent/workspace/tracecompass-master-jdk11/releng/org.eclipse.tracecompass.alltests/target/org.eclipse.tracecompass.alltests-1.0.9-SNAPSHOT.jar.pack.gz to /home/jenkins/.m2/repository/org/eclipse/tracecompass/org.eclipse.tracecompass.alltests/1.0.9-SNAPSHOT/org.eclipse.tracecompass.alltests-1.0.9-SNAPSHOT-pack200.jar.pack.gz
13:46:52 [2020-08-04T17:46:52.472Z] [INFO] Installing /home/jenkins/agent/workspace/tracecompass-master-jdk11/releng/org.eclipse.tracecompass.alltests/target/p2content.xml to /home/jenkins/.m2/repository/org/eclipse/tracecompass/org.eclipse.tracecompass.alltests/1.0.9-SNAPSHOT/org.eclipse.tracecompass.alltests-1.0.9-SNAPSHOT-p2metadata.xml
13:46:52 [2020-08-04T17:46:52.472Z] [INFO] Installing /home/jenkins/agent/workspace/tracecompass-master-jdk11/releng/org.eclipse.tracecompass.alltests/target/p2artifacts.xml to /home/jenkins/.m2/repository/org/eclipse/tracecompass/org.eclipse.tracecompass.alltests/1.0.9-SNAPSHOT/org.eclipse.tracecompass.alltests-1.0.9-SNAPSHOT-p2artifacts.xml
13:46:52 [2020-08-04T17:46:52.472Z] [INFO] 
13:46:52 [2020-08-04T17:46:52.472Z] [INFO] --- tycho-p2-plugin:2.0.0-SNAPSHOT:update-local-index (default-update-local-index) @ org.eclipse.tracecompass.alltests ---
13:46:52 [2020-08-04T17:46:52.472Z] [INFO] 
13:46:52 [2020-08-04T17:46:52.472Z] [INFO] -----< org.eclipse.tracecompass:org.eclipse.tracecompass.testing >------
13:46:52 [2020-08-04T17:46:52.472Z] [INFO] Building org.eclipse.tracecompass.testing 6.0.0-SNAPSHOT       [135/138]
13:46:52 [2020-08-04T17:46:52.472Z] [INFO] --------------------------[ eclipse-feature ]---------------------------
13:46:52 [2020-08-04T17:46:52.472Z] [INFO] 
13:46:52 [2020-08-04T17:46:52.472Z] [INFO] --- maven-clean-plugin:3.0.0:clean (default-clean) @ org.eclipse.tracecompass.testing ---
13:46:52 [2020-08-04T17:46:52.472Z] [INFO] Deleting /home/jenkins/agent/workspace/tracecompass-master-jdk11/releng/org.eclipse.tracecompass.testing/target
13:46:52 [2020-08-04T17:46:52.472Z] [INFO] 
13:46:52 [2020-08-04T17:46:52.472Z] [INFO] --- tycho-packaging-plugin:2.0.0-SNAPSHOT:build-qualifier-aggregator (default-build-qualifier-aggregator) @ org.eclipse.tracecompass.testing ---
13:46:52 [2020-08-04T17:46:52.472Z] [INFO] The project's OSGi version is 6.0.0.202008041647
13:46:52 [2020-08-04T17:46:52.472Z] [INFO] 
13:46:52 [2020-08-04T17:46:52.472Z] [INFO] --- tycho-packaging-plugin:2.0.0-SNAPSHOT:validate-id (default-validate-id) @ org.eclipse.tracecompass.testing ---
13:46:52 [2020-08-04T17:46:52.472Z] [INFO] 
13:46:52 [2020-08-04T17:46:52.472Z] [INFO] --- tycho-packaging-plugin:2.0.0-SNAPSHOT:validate-version (default-validate-version) @ org.eclipse.tracecompass.testing ---
13:46:52 [2020-08-04T17:46:52.472Z] [INFO] 
13:46:52 [2020-08-04T17:46:52.472Z] [INFO] --- maven-enforcer-plugin:1.4.1:enforce (enforce-maven-version) @ org.eclipse.tracecompass.testing ---
13:46:52 [2020-08-04T17:46:52.472Z] [INFO] 
13:46:52 [2020-08-04T17:46:52.472Z] [INFO] --- tycho-source-plugin:2.0.0-SNAPSHOT:plugin-source (plugin-source) @ org.eclipse.tracecompass.testing ---
13:46:52 [2020-08-04T17:46:52.472Z] [INFO] 
13:46:52 [2020-08-04T17:46:52.472Z] [INFO] --- target-platform-configuration:2.0.0-SNAPSHOT:target-platform (default-target-platform) @ org.eclipse.tracecompass.testing ---
13:46:52 [2020-08-04T17:46:52.472Z] [INFO] 
13:46:52 [2020-08-04T17:46:52.472Z] [INFO] --- tycho-packaging-plugin:2.0.0-SNAPSHOT:package-feature (default-package-feature) @ org.eclipse.tracecompass.testing ---
13:46:52 [2020-08-04T17:46:52.729Z] [INFO] Building jar: /home/jenkins/agent/workspace/tracecompass-master-jdk11/releng/org.eclipse.tracecompass.testing/target/org.eclipse.tracecompass.testing-6.0.0-SNAPSHOT.jar
13:46:52 [2020-08-04T17:46:52.729Z] [INFO] 
13:46:52 [2020-08-04T17:46:52.729Z] [INFO] --- tycho-p2-plugin:2.0.0-SNAPSHOT:p2-metadata-default (default-p2-metadata-default) @ org.eclipse.tracecompass.testing ---
13:46:52 [2020-08-04T17:46:52.729Z] [INFO] 
13:46:52 [2020-08-04T17:46:52.729Z] [INFO] --- tycho-p2-plugin:2.0.0-SNAPSHOT:feature-p2-metadata (default-feature-p2-metadata) @ org.eclipse.tracecompass.testing ---
13:46:52 [2020-08-04T17:46:52.729Z] [INFO] 
13:46:52 [2020-08-04T17:46:52.729Z] [INFO] --- tycho-source-feature-plugin:2.0.0-SNAPSHOT:source-feature (source-feature) @ org.eclipse.tracecompass.testing ---
13:46:52 [2020-08-04T17:46:52.729Z] [INFO] Building jar: /home/jenkins/agent/workspace/tracecompass-master-jdk11/releng/org.eclipse.tracecompass.testing/target/org.eclipse.tracecompass.testing-6.0.0-SNAPSHOT-sources-feature.jar
13:46:52 [2020-08-04T17:46:52.729Z] [INFO] 
13:46:52 [2020-08-04T17:46:52.729Z] [INFO] --- tycho-pack200a-plugin:2.0.0-SNAPSHOT:normalize (pack200-normalize) @ org.eclipse.tracecompass.testing ---
13:46:52 [2020-08-04T17:46:52.729Z] [INFO] 
13:46:52 [2020-08-04T17:46:52.729Z] [INFO] --- eclipse-jarsigner-plugin:1.1.3:sign (sign) @ org.eclipse.tracecompass.testing ---
13:46:52 [2020-08-04T17:46:52.729Z] [INFO] Signing jar: /home/jenkins/agent/workspace/tracecompass-master-jdk11/releng/org.eclipse.tracecompass.testing/target/org.eclipse.tracecompass.testing-6.0.0-SNAPSHOT.jar
13:46:53 [2020-08-04T17:46:53.656Z] [INFO] Signing jar: /home/jenkins/agent/workspace/tracecompass-master-jdk11/releng/org.eclipse.tracecompass.testing/target/org.eclipse.tracecompass.testing-6.0.0-SNAPSHOT-sources-feature.jar
13:46:55 [2020-08-04T17:46:55.022Z] [INFO] 
13:46:55 [2020-08-04T17:46:55.022Z] [INFO] --- tycho-pack200b-plugin:2.0.0-SNAPSHOT:pack (pack200-pack) @ org.eclipse.tracecompass.testing ---
13:46:55 [2020-08-04T17:46:55.022Z] [INFO] 
13:46:55 [2020-08-04T17:46:55.022Z] [INFO] --- tycho-p2-plugin:2.0.0-SNAPSHOT:p2-metadata (p2-metadata) @ org.eclipse.tracecompass.testing ---
13:46:55 [2020-08-04T17:46:55.022Z] [INFO] 
13:46:55 [2020-08-04T17:46:55.022Z] [INFO] --- maven-install-plugin:2.5.2:install (default-install) @ org.eclipse.tracecompass.testing ---
13:46:55 [2020-08-04T17:46:55.022Z] [INFO] Installing /home/jenkins/agent/workspace/tracecompass-master-jdk11/releng/org.eclipse.tracecompass.testing/target/org.eclipse.tracecompass.testing-6.0.0-SNAPSHOT.jar to /home/jenkins/.m2/repository/org/eclipse/tracecompass/org.eclipse.tracecompass.testing/6.0.0-SNAPSHOT/org.eclipse.tracecompass.testing-6.0.0-SNAPSHOT.jar
13:46:55 [2020-08-04T17:46:55.022Z] [INFO] Installing /home/jenkins/agent/workspace/tracecompass-master-jdk11/releng/org.eclipse.tracecompass.testing/.polyglot.build.properties to /home/jenkins/.m2/repository/org/eclipse/tracecompass/org.eclipse.tracecompass.testing/6.0.0-SNAPSHOT/org.eclipse.tracecompass.testing-6.0.0-SNAPSHOT.pom
13:46:55 [2020-08-04T17:46:55.022Z] [INFO] Installing /home/jenkins/agent/workspace/tracecompass-master-jdk11/releng/org.eclipse.tracecompass.testing/target/org.eclipse.tracecompass.testing-6.0.0-SNAPSHOT-sources-feature.jar to /home/jenkins/.m2/repository/org/eclipse/tracecompass/org.eclipse.tracecompass.testing/6.0.0-SNAPSHOT/org.eclipse.tracecompass.testing-6.0.0-SNAPSHOT-sources-feature.jar
13:46:55 [2020-08-04T17:46:55.022Z] [INFO] Installing /home/jenkins/agent/workspace/tracecompass-master-jdk11/releng/org.eclipse.tracecompass.testing/target/p2content.xml to /home/jenkins/.m2/repository/org/eclipse/tracecompass/org.eclipse.tracecompass.testing/6.0.0-SNAPSHOT/org.eclipse.tracecompass.testing-6.0.0-SNAPSHOT-p2metadata.xml
13:46:55 [2020-08-04T17:46:55.022Z] [INFO] Installing /home/jenkins/agent/workspace/tracecompass-master-jdk11/releng/org.eclipse.tracecompass.testing/target/p2artifacts.xml to /home/jenkins/.m2/repository/org/eclipse/tracecompass/org.eclipse.tracecompass.testing/6.0.0-SNAPSHOT/org.eclipse.tracecompass.testing-6.0.0-SNAPSHOT-p2artifacts.xml
13:46:55 [2020-08-04T17:46:55.022Z] [INFO] 
13:46:55 [2020-08-04T17:46:55.022Z] [INFO] --- tycho-p2-plugin:2.0.0-SNAPSHOT:update-local-index (default-update-local-index) @ org.eclipse.tracecompass.testing ---
13:46:55 [2020-08-04T17:46:55.022Z] [INFO] 
13:46:55 [2020-08-04T17:46:55.022Z] [INFO] ----< org.eclipse.tracecompass:org.eclipse.tracecompass.tmf.remote >----
13:46:55 [2020-08-04T17:46:55.022Z] [INFO] Building org.eclipse.tracecompass.tmf.remote 6.0.0-SNAPSHOT    [136/138]
13:46:55 [2020-08-04T17:46:55.022Z] [INFO] --------------------------[ eclipse-feature ]---------------------------
13:46:55 [2020-08-04T17:46:55.022Z] [INFO] 
13:46:55 [2020-08-04T17:46:55.022Z] [INFO] --- maven-clean-plugin:3.0.0:clean (default-clean) @ org.eclipse.tracecompass.tmf.remote ---
13:46:55 [2020-08-04T17:46:55.022Z] [INFO] Deleting /home/jenkins/agent/workspace/tracecompass-master-jdk11/tmf/org.eclipse.tracecompass.tmf.remote/target
13:46:55 [2020-08-04T17:46:55.022Z] [INFO] 
13:46:55 [2020-08-04T17:46:55.022Z] [INFO] --- tycho-packaging-plugin:2.0.0-SNAPSHOT:build-qualifier-aggregator (default-build-qualifier-aggregator) @ org.eclipse.tracecompass.tmf.remote ---
13:46:55 [2020-08-04T17:46:55.022Z] [INFO] The project's OSGi version is 6.0.0.202008041647
13:46:55 [2020-08-04T17:46:55.022Z] [INFO] 
13:46:55 [2020-08-04T17:46:55.022Z] [INFO] --- tycho-packaging-plugin:2.0.0-SNAPSHOT:validate-id (default-validate-id) @ org.eclipse.tracecompass.tmf.remote ---
13:46:55 [2020-08-04T17:46:55.022Z] [INFO] 
13:46:55 [2020-08-04T17:46:55.022Z] [INFO] --- tycho-packaging-plugin:2.0.0-SNAPSHOT:validate-version (default-validate-version) @ org.eclipse.tracecompass.tmf.remote ---
13:46:55 [2020-08-04T17:46:55.022Z] [INFO] 
13:46:55 [2020-08-04T17:46:55.022Z] [INFO] --- maven-enforcer-plugin:1.4.1:enforce (enforce-maven-version) @ org.eclipse.tracecompass.tmf.remote ---
13:46:55 [2020-08-04T17:46:55.022Z] [INFO] 
13:46:55 [2020-08-04T17:46:55.022Z] [INFO] --- tycho-source-plugin:2.0.0-SNAPSHOT:plugin-source (plugin-source) @ org.eclipse.tracecompass.tmf.remote ---
13:46:55 [2020-08-04T17:46:55.022Z] [INFO] 
13:46:55 [2020-08-04T17:46:55.022Z] [INFO] --- target-platform-configuration:2.0.0-SNAPSHOT:target-platform (default-target-platform) @ org.eclipse.tracecompass.tmf.remote ---
13:46:55 [2020-08-04T17:46:55.022Z] [INFO] 
13:46:55 [2020-08-04T17:46:55.022Z] [INFO] --- tycho-packaging-plugin:2.0.0-SNAPSHOT:package-feature (default-package-feature) @ org.eclipse.tracecompass.tmf.remote ---
13:46:55 [2020-08-04T17:46:55.022Z] [INFO] Building jar: /home/jenkins/agent/workspace/tracecompass-master-jdk11/tmf/org.eclipse.tracecompass.tmf.remote/target/org.eclipse.tracecompass.tmf.remote-6.0.0-SNAPSHOT.jar
13:46:55 [2020-08-04T17:46:55.022Z] [INFO] 
13:46:55 [2020-08-04T17:46:55.022Z] [INFO] --- tycho-p2-plugin:2.0.0-SNAPSHOT:p2-metadata-default (default-p2-metadata-default) @ org.eclipse.tracecompass.tmf.remote ---
13:46:55 [2020-08-04T17:46:55.022Z] [INFO] 
13:46:55 [2020-08-04T17:46:55.022Z] [INFO] --- tycho-p2-plugin:2.0.0-SNAPSHOT:feature-p2-metadata (default-feature-p2-metadata) @ org.eclipse.tracecompass.tmf.remote ---
13:46:55 [2020-08-04T17:46:55.022Z] [INFO] 
13:46:55 [2020-08-04T17:46:55.022Z] [INFO] --- tycho-source-feature-plugin:2.0.0-SNAPSHOT:source-feature (source-feature) @ org.eclipse.tracecompass.tmf.remote ---
13:46:55 [2020-08-04T17:46:55.022Z] [INFO] Building jar: /home/jenkins/agent/workspace/tracecompass-master-jdk11/tmf/org.eclipse.tracecompass.tmf.remote/target/org.eclipse.tracecompass.tmf.remote-6.0.0-SNAPSHOT-sources-feature.jar
13:46:55 [2020-08-04T17:46:55.022Z] [INFO] 
13:46:55 [2020-08-04T17:46:55.022Z] [INFO] --- tycho-pack200a-plugin:2.0.0-SNAPSHOT:normalize (pack200-normalize) @ org.eclipse.tracecompass.tmf.remote ---
13:46:55 [2020-08-04T17:46:55.022Z] [INFO] 
13:46:55 [2020-08-04T17:46:55.022Z] [INFO] --- eclipse-jarsigner-plugin:1.1.3:sign (sign) @ org.eclipse.tracecompass.tmf.remote ---
13:46:55 [2020-08-04T17:46:55.022Z] [INFO] Signing jar: /home/jenkins/agent/workspace/tracecompass-master-jdk11/tmf/org.eclipse.tracecompass.tmf.remote/target/org.eclipse.tracecompass.tmf.remote-6.0.0-SNAPSHOT.jar
13:46:56 [2020-08-04T17:46:56.387Z] [INFO] Signing jar: /home/jenkins/agent/workspace/tracecompass-master-jdk11/tmf/org.eclipse.tracecompass.tmf.remote/target/org.eclipse.tracecompass.tmf.remote-6.0.0-SNAPSHOT-sources-feature.jar
13:46:57 [2020-08-04T17:46:57.314Z] [INFO] 
13:46:57 [2020-08-04T17:46:57.314Z] [INFO] --- tycho-pack200b-plugin:2.0.0-SNAPSHOT:pack (pack200-pack) @ org.eclipse.tracecompass.tmf.remote ---
13:46:57 [2020-08-04T17:46:57.314Z] [INFO] 
13:46:57 [2020-08-04T17:46:57.314Z] [INFO] --- tycho-p2-plugin:2.0.0-SNAPSHOT:p2-metadata (p2-metadata) @ org.eclipse.tracecompass.tmf.remote ---
13:46:57 [2020-08-04T17:46:57.314Z] [INFO] 
13:46:57 [2020-08-04T17:46:57.314Z] [INFO] --- maven-install-plugin:2.5.2:install (default-install) @ org.eclipse.tracecompass.tmf.remote ---
13:46:57 [2020-08-04T17:46:57.314Z] [INFO] Installing /home/jenkins/agent/workspace/tracecompass-master-jdk11/tmf/org.eclipse.tracecompass.tmf.remote/target/org.eclipse.tracecompass.tmf.remote-6.0.0-SNAPSHOT.jar to /home/jenkins/.m2/repository/org/eclipse/tracecompass/org.eclipse.tracecompass.tmf.remote/6.0.0-SNAPSHOT/org.eclipse.tracecompass.tmf.remote-6.0.0-SNAPSHOT.jar
13:46:57 [2020-08-04T17:46:57.314Z] [INFO] Installing /home/jenkins/agent/workspace/tracecompass-master-jdk11/tmf/org.eclipse.tracecompass.tmf.remote/.polyglot.build.properties to /home/jenkins/.m2/repository/org/eclipse/tracecompass/org.eclipse.tracecompass.tmf.remote/6.0.0-SNAPSHOT/org.eclipse.tracecompass.tmf.remote-6.0.0-SNAPSHOT.pom
13:46:57 [2020-08-04T17:46:57.314Z] [INFO] Installing /home/jenkins/agent/workspace/tracecompass-master-jdk11/tmf/org.eclipse.tracecompass.tmf.remote/target/org.eclipse.tracecompass.tmf.remote-6.0.0-SNAPSHOT-sources-feature.jar to /home/jenkins/.m2/repository/org/eclipse/tracecompass/org.eclipse.tracecompass.tmf.remote/6.0.0-SNAPSHOT/org.eclipse.tracecompass.tmf.remote-6.0.0-SNAPSHOT-sources-feature.jar
13:46:57 [2020-08-04T17:46:57.314Z] [INFO] Installing /home/jenkins/agent/workspace/tracecompass-master-jdk11/tmf/org.eclipse.tracecompass.tmf.remote/target/p2content.xml to /home/jenkins/.m2/repository/org/eclipse/tracecompass/org.eclipse.tracecompass.tmf.remote/6.0.0-SNAPSHOT/org.eclipse.tracecompass.tmf.remote-6.0.0-SNAPSHOT-p2metadata.xml
13:46:57 [2020-08-04T17:46:57.314Z] [INFO] Installing /home/jenkins/agent/workspace/tracecompass-master-jdk11/tmf/org.eclipse.tracecompass.tmf.remote/target/p2artifacts.xml to /home/jenkins/.m2/repository/org/eclipse/tracecompass/org.eclipse.tracecompass.tmf.remote/6.0.0-SNAPSHOT/org.eclipse.tracecompass.tmf.remote-6.0.0-SNAPSHOT-p2artifacts.xml
13:46:57 [2020-08-04T17:46:57.314Z] [INFO] 
13:46:57 [2020-08-04T17:46:57.314Z] [INFO] --- tycho-p2-plugin:2.0.0-SNAPSHOT:update-local-index (default-update-local-index) @ org.eclipse.tracecompass.tmf.remote ---
13:46:57 [2020-08-04T17:46:57.314Z] [INFO] 
13:46:57 [2020-08-04T17:46:57.314Z] [INFO] ---< org.eclipse.tracecompass:org.eclipse.tracecompass.releng-site >----
13:46:57 [2020-08-04T17:46:57.314Z] [INFO] Building Trace Compass Repository 6.0.0-SNAPSHOT               [137/138]
13:46:57 [2020-08-04T17:46:57.314Z] [INFO] -------------------------[ eclipse-repository ]-------------------------
13:46:57 [2020-08-04T17:46:57.314Z] [INFO] 
13:46:57 [2020-08-04T17:46:57.314Z] [INFO] --- maven-clean-plugin:3.0.0:clean (default-clean) @ org.eclipse.tracecompass.releng-site ---
13:46:57 [2020-08-04T17:46:57.314Z] [INFO] 
13:46:57 [2020-08-04T17:46:57.314Z] [INFO] --- tycho-packaging-plugin:2.0.0-SNAPSHOT:build-qualifier-aggregator (default-build-qualifier-aggregator) @ org.eclipse.tracecompass.releng-site ---
13:46:57 [2020-08-04T17:46:57.314Z] [INFO] The project's OSGi version is 6.0.0.202008041647
13:46:57 [2020-08-04T17:46:57.314Z] [INFO] 
13:46:57 [2020-08-04T17:46:57.314Z] [INFO] --- maven-enforcer-plugin:1.4.1:enforce (enforce-maven-version) @ org.eclipse.tracecompass.releng-site ---
13:46:57 [2020-08-04T17:46:57.314Z] [INFO] 
13:46:57 [2020-08-04T17:46:57.314Z] [INFO] --- maven-clean-plugin:3.0.0:clean (default-clean-1) @ org.eclipse.tracecompass.releng-site ---
13:46:57 [2020-08-04T17:46:57.314Z] [INFO] 
13:46:57 [2020-08-04T17:46:57.314Z] [INFO] --- maven-resources-plugin:3.0.2:resources (default-resources) @ org.eclipse.tracecompass.releng-site ---
13:46:57 [2020-08-04T17:46:57.314Z] [INFO] Using 'UTF-8' encoding to copy filtered resources.
13:46:57 [2020-08-04T17:46:57.314Z] [INFO] skip non existing resourceDirectory /home/jenkins/agent/workspace/tracecompass-master-jdk11/releng/org.eclipse.tracecompass.releng-site/src/main/resources
13:46:57 [2020-08-04T17:46:57.314Z] [INFO] 
13:46:57 [2020-08-04T17:46:57.314Z] [INFO] --- tycho-source-plugin:2.0.0-SNAPSHOT:plugin-source (plugin-source) @ org.eclipse.tracecompass.releng-site ---
13:46:57 [2020-08-04T17:46:57.314Z] [INFO] 
13:46:57 [2020-08-04T17:46:57.314Z] [INFO] --- target-platform-configuration:2.0.0-SNAPSHOT:target-platform (default-target-platform) @ org.eclipse.tracecompass.releng-site ---
13:46:57 [2020-08-04T17:46:57.314Z] [INFO] 
13:46:57 [2020-08-04T17:46:57.314Z] [INFO] --- tycho-p2-publisher-plugin:2.0.0-SNAPSHOT:publish-osgi-ee (default-publish-osgi-ee) @ org.eclipse.tracecompass.releng-site ---
13:46:57 [2020-08-04T17:46:57.314Z] [INFO] Published profile IUs: [a.jre.javase 11.0.0, config.a.jre.javase 11.0.0]
13:46:57 [2020-08-04T17:46:57.314Z] [INFO] Published profile IUs: [a.jre.javase 14.0.0, config.a.jre.javase 14.0.0]
13:46:57 [2020-08-04T17:46:57.314Z] [INFO] Published profile IUs: [a.jre.javase 15.0.0, config.a.jre.javase 15.0.0]
13:46:57 [2020-08-04T17:46:57.314Z] [INFO] 
13:46:57 [2020-08-04T17:46:57.314Z] [INFO] --- tycho-p2-publisher-plugin:2.0.0-SNAPSHOT:publish-products (default-publish-products) @ org.eclipse.tracecompass.releng-site ---
13:46:57 [2020-08-04T17:46:57.314Z] [INFO] 
13:46:57 [2020-08-04T17:46:57.314Z] [INFO] --- tycho-p2-publisher-plugin:2.0.0-SNAPSHOT:publish-categories (default-publish-categories) @ org.eclipse.tracecompass.releng-site ---
13:46:57 [2020-08-04T17:46:57.314Z] [INFO] 
13:46:57 [2020-08-04T17:46:57.314Z] [INFO] --- tycho-p2-publisher-plugin:2.0.0-SNAPSHOT:attach-artifacts (default-attach-artifacts) @ org.eclipse.tracecompass.releng-site ---
13:46:57 [2020-08-04T17:46:57.314Z] [INFO] 
13:46:57 [2020-08-04T17:46:57.314Z] [INFO] --- tycho-p2-repository-plugin:2.0.0-SNAPSHOT:assemble-repository (default-assemble-repository) @ org.eclipse.tracecompass.releng-site ---
13:47:07 [2020-08-04T17:47:07.255Z] [INFO] 
13:47:07 [2020-08-04T17:47:07.255Z] [INFO] --- tycho-p2-repository-plugin:2.0.0-SNAPSHOT:archive-repository (default-archive-repository) @ org.eclipse.tracecompass.releng-site ---
13:47:07 [2020-08-04T17:47:07.255Z] [INFO] 
13:47:07 [2020-08-04T17:47:07.255Z] [INFO] --- tycho-source-feature-plugin:2.0.0-SNAPSHOT:source-feature (source-feature) @ org.eclipse.tracecompass.releng-site ---
13:47:07 [2020-08-04T17:47:07.255Z] [INFO] 
13:47:07 [2020-08-04T17:47:07.255Z] [INFO] --- tycho-pack200a-plugin:2.0.0-SNAPSHOT:normalize (pack200-normalize) @ org.eclipse.tracecompass.releng-site ---
13:47:07 [2020-08-04T17:47:07.255Z] [INFO] 
13:47:07 [2020-08-04T17:47:07.255Z] [INFO] --- eclipse-jarsigner-plugin:1.1.3:sign (sign) @ org.eclipse.tracecompass.releng-site ---
13:47:07 [2020-08-04T17:47:07.255Z] [INFO] 
13:47:07 [2020-08-04T17:47:07.255Z] [INFO] --- tycho-pack200b-plugin:2.0.0-SNAPSHOT:pack (pack200-pack) @ org.eclipse.tracecompass.releng-site ---
13:47:07 [2020-08-04T17:47:07.255Z] [INFO] 
13:47:07 [2020-08-04T17:47:07.255Z] [INFO] --- tycho-p2-plugin:2.0.0-SNAPSHOT:p2-metadata (p2-metadata) @ org.eclipse.tracecompass.releng-site ---
13:47:07 [2020-08-04T17:47:07.255Z] [INFO] 
13:47:07 [2020-08-04T17:47:07.256Z] [INFO] --- repository-utils:1.0.0:generate-repository-facade (generate-facade) @ org.eclipse.tracecompass.releng-site ---
13:47:08 [2020-08-04T17:47:08.619Z] [INFO] Building zip: /home/jenkins/agent/workspace/tracecompass-master-jdk11/releng/org.eclipse.tracecompass.releng-site/target/org.eclipse.tracecompass.releng-site-6.0.0-SNAPSHOT.zip
13:47:09 [2020-08-04T17:47:09.986Z] [INFO] 
13:47:09 [2020-08-04T17:47:09.986Z] [INFO] --- maven-install-plugin:2.5.2:install (default-install) @ org.eclipse.tracecompass.releng-site ---
13:47:09 [2020-08-04T17:47:09.986Z] [INFO] No primary artifact to install, installing attached artifacts instead.
13:47:09 [2020-08-04T17:47:09.986Z] [INFO] Installing /home/jenkins/agent/workspace/tracecompass-master-jdk11/releng/org.eclipse.tracecompass.releng-site/pom.xml to /home/jenkins/.m2/repository/org/eclipse/tracecompass/org.eclipse.tracecompass.releng-site/6.0.0-SNAPSHOT/org.eclipse.tracecompass.releng-site-6.0.0-SNAPSHOT.pom
13:47:09 [2020-08-04T17:47:09.986Z] [INFO] Installing /home/jenkins/agent/workspace/tracecompass-master-jdk11/releng/org.eclipse.tracecompass.releng-site/target/p2content.xml to /home/jenkins/.m2/repository/org/eclipse/tracecompass/org.eclipse.tracecompass.releng-site/6.0.0-SNAPSHOT/org.eclipse.tracecompass.releng-site-6.0.0-SNAPSHOT-p2metadata.xml
13:47:09 [2020-08-04T17:47:09.986Z] [INFO] Installing /home/jenkins/agent/workspace/tracecompass-master-jdk11/releng/org.eclipse.tracecompass.releng-site/target/p2artifacts.xml to /home/jenkins/.m2/repository/org/eclipse/tracecompass/org.eclipse.tracecompass.releng-site/6.0.0-SNAPSHOT/org.eclipse.tracecompass.releng-site-6.0.0-SNAPSHOT-p2artifacts.xml
13:47:09 [2020-08-04T17:47:09.986Z] [INFO] 
13:47:09 [2020-08-04T17:47:09.986Z] [INFO] --- tycho-p2-plugin:2.0.0-SNAPSHOT:update-local-index (default-update-local-index) @ org.eclipse.tracecompass.releng-site ---
13:47:09 [2020-08-04T17:47:09.986Z] [INFO] 
13:47:09 [2020-08-04T17:47:09.986Z] [INFO] --< org.eclipse.tracecompass:org.eclipse.tracecompass.jsontrace.core.tests >--
13:47:09 [2020-08-04T17:47:09.986Z] [INFO] Building org.eclipse.tracecompass.jsontrace.core.tests 1.0.2-SNAPSHOT [138/138]
13:47:09 [2020-08-04T17:47:09.986Z] [INFO] ---------------------------[ eclipse-plugin ]---------------------------
13:47:09 [2020-08-04T17:47:09.986Z] [INFO] 
13:47:09 [2020-08-04T17:47:09.986Z] [INFO] --- maven-clean-plugin:3.0.0:clean (default-clean) @ org.eclipse.tracecompass.jsontrace.core.tests ---
13:47:09 [2020-08-04T17:47:09.986Z] [INFO] 
13:47:09 [2020-08-04T17:47:09.986Z] [INFO] --- tycho-packaging-plugin:2.0.0-SNAPSHOT:build-qualifier (default-build-qualifier) @ org.eclipse.tracecompass.jsontrace.core.tests ---
13:47:09 [2020-08-04T17:47:09.986Z] [INFO] The project's OSGi version is 1.0.2.202008041647
13:47:09 [2020-08-04T17:47:09.986Z] [INFO] 
13:47:09 [2020-08-04T17:47:09.986Z] [INFO] --- tycho-packaging-plugin:2.0.0-SNAPSHOT:validate-id (default-validate-id) @ org.eclipse.tracecompass.jsontrace.core.tests ---
13:47:09 [2020-08-04T17:47:09.986Z] [INFO] 
13:47:09 [2020-08-04T17:47:09.986Z] [INFO] --- tycho-packaging-plugin:2.0.0-SNAPSHOT:validate-version (default-validate-version) @ org.eclipse.tracecompass.jsontrace.core.tests ---
13:47:09 [2020-08-04T17:47:09.986Z] [INFO] 
13:47:09 [2020-08-04T17:47:09.986Z] [INFO] --- maven-enforcer-plugin:1.4.1:enforce (enforce-maven-version) @ org.eclipse.tracecompass.jsontrace.core.tests ---
13:47:09 [2020-08-04T17:47:09.986Z] [INFO] 
13:47:09 [2020-08-04T17:47:09.986Z] [INFO] --- maven-resources-plugin:3.0.2:resources (default-resources) @ org.eclipse.tracecompass.jsontrace.core.tests ---
13:47:09 [2020-08-04T17:47:09.986Z] [INFO] Using 'UTF-8' encoding to copy filtered resources.
13:47:09 [2020-08-04T17:47:09.986Z] [INFO] skip non existing resourceDirectory /home/jenkins/agent/workspace/tracecompass-master-jdk11/jsontrace/org.eclipse.tracecompass.jsontrace.core.tests/src/main/resources
13:47:09 [2020-08-04T17:47:09.986Z] [INFO] 
13:47:09 [2020-08-04T17:47:09.986Z] [INFO] --- tycho-compiler-plugin:2.0.0-SNAPSHOT:compile (default-compile) @ org.eclipse.tracecompass.jsontrace.core.tests ---
13:47:09 [2020-08-04T17:47:09.986Z] [INFO] Compiling 3 source files to /home/jenkins/agent/workspace/tracecompass-master-jdk11/jsontrace/org.eclipse.tracecompass.jsontrace.core.tests/target/classes
13:47:10 [2020-08-04T17:47:10.242Z] [INFO] 
13:47:10 [2020-08-04T17:47:10.242Z] [INFO] --- maven-resources-plugin:3.0.2:testResources (default-testResources) @ org.eclipse.tracecompass.jsontrace.core.tests ---
13:47:10 [2020-08-04T17:47:10.242Z] [INFO] Using 'UTF-8' encoding to copy filtered resources.
13:47:10 [2020-08-04T17:47:10.242Z] [INFO] skip non existing resourceDirectory /home/jenkins/agent/workspace/tracecompass-master-jdk11/jsontrace/org.eclipse.tracecompass.jsontrace.core.tests/src/test/resources
13:47:10 [2020-08-04T17:47:10.242Z] [INFO] 
13:47:10 [2020-08-04T17:47:10.242Z] [INFO] --- tycho-source-plugin:2.0.0-SNAPSHOT:plugin-source (plugin-source) @ org.eclipse.tracecompass.jsontrace.core.tests ---
13:47:10 [2020-08-04T17:47:10.242Z] [INFO] Building jar: /home/jenkins/agent/workspace/tracecompass-master-jdk11/jsontrace/org.eclipse.tracecompass.jsontrace.core.tests/target/org.eclipse.tracecompass.jsontrace.core.tests-1.0.2-SNAPSHOT-sources.jar
13:47:10 [2020-08-04T17:47:10.242Z] [INFO] 
13:47:10 [2020-08-04T17:47:10.242Z] [INFO] --- target-platform-configuration:2.0.0-SNAPSHOT:target-platform (default-target-platform) @ org.eclipse.tracecompass.jsontrace.core.tests ---
13:47:10 [2020-08-04T17:47:10.242Z] [INFO] 
13:47:10 [2020-08-04T17:47:10.242Z] [INFO] --- tycho-packaging-plugin:2.0.0-SNAPSHOT:package-plugin (default-package-plugin) @ org.eclipse.tracecompass.jsontrace.core.tests ---
13:47:10 [2020-08-04T17:47:10.242Z] [INFO] Building jar: /home/jenkins/agent/workspace/tracecompass-master-jdk11/jsontrace/org.eclipse.tracecompass.jsontrace.core.tests/target/org.eclipse.tracecompass.jsontrace.core.tests-1.0.2-SNAPSHOT.jar
13:47:10 [2020-08-04T17:47:10.242Z] [INFO] 
13:47:10 [2020-08-04T17:47:10.242Z] [INFO] --- tycho-p2-plugin:2.0.0-SNAPSHOT:p2-metadata-default (default-p2-metadata-default) @ org.eclipse.tracecompass.jsontrace.core.tests ---
13:47:10 [2020-08-04T17:47:10.242Z] [INFO] 
13:47:10 [2020-08-04T17:47:10.242Z] [INFO] --- tycho-source-feature-plugin:2.0.0-SNAPSHOT:source-feature (source-feature) @ org.eclipse.tracecompass.jsontrace.core.tests ---
13:47:10 [2020-08-04T17:47:10.242Z] [INFO] 
13:47:10 [2020-08-04T17:47:10.242Z] [INFO] --- tycho-pack200a-plugin:2.0.0-SNAPSHOT:normalize (pack200-normalize) @ org.eclipse.tracecompass.jsontrace.core.tests ---
13:47:10 [2020-08-04T17:47:10.242Z] [INFO] Pack200 normalizing jar /home/jenkins/agent/workspace/tracecompass-master-jdk11/jsontrace/org.eclipse.tracecompass.jsontrace.core.tests/target/org.eclipse.tracecompass.jsontrace.core.tests-1.0.2-SNAPSHOT.jar
13:47:10 [2020-08-04T17:47:10.242Z] [INFO] 
13:47:10 [2020-08-04T17:47:10.242Z] [INFO] --- eclipse-jarsigner-plugin:1.1.3:sign (sign) @ org.eclipse.tracecompass.jsontrace.core.tests ---
13:47:10 [2020-08-04T17:47:10.242Z] [INFO] Signing jar: /home/jenkins/agent/workspace/tracecompass-master-jdk11/jsontrace/org.eclipse.tracecompass.jsontrace.core.tests/target/org.eclipse.tracecompass.jsontrace.core.tests-1.0.2-SNAPSHOT.jar
13:47:11 [2020-08-04T17:47:11.605Z] [INFO] Signing jar: /home/jenkins/agent/workspace/tracecompass-master-jdk11/jsontrace/org.eclipse.tracecompass.jsontrace.core.tests/target/org.eclipse.tracecompass.jsontrace.core.tests-1.0.2-SNAPSHOT-sources.jar
13:47:12 [2020-08-04T17:47:12.533Z] [INFO] 
13:47:12 [2020-08-04T17:47:12.533Z] [INFO] --- tycho-pack200b-plugin:2.0.0-SNAPSHOT:pack (pack200-pack) @ org.eclipse.tracecompass.jsontrace.core.tests ---
13:47:12 [2020-08-04T17:47:12.533Z] [INFO] Pack200 packing jar /home/jenkins/agent/workspace/tracecompass-master-jdk11/jsontrace/org.eclipse.tracecompass.jsontrace.core.tests/target/org.eclipse.tracecompass.jsontrace.core.tests-1.0.2-SNAPSHOT.jar
13:47:12 [2020-08-04T17:47:12.533Z] [INFO] 
13:47:12 [2020-08-04T17:47:12.533Z] [INFO] --- tycho-p2-plugin:2.0.0-SNAPSHOT:p2-metadata (p2-metadata) @ org.eclipse.tracecompass.jsontrace.core.tests ---
13:47:12 [2020-08-04T17:47:12.533Z] [INFO] 
13:47:12 [2020-08-04T17:47:12.533Z] [INFO] --- maven-install-plugin:2.5.2:install (default-install) @ org.eclipse.tracecompass.jsontrace.core.tests ---
13:47:12 [2020-08-04T17:47:12.533Z] [INFO] Installing /home/jenkins/agent/workspace/tracecompass-master-jdk11/jsontrace/org.eclipse.tracecompass.jsontrace.core.tests/target/org.eclipse.tracecompass.jsontrace.core.tests-1.0.2-SNAPSHOT.jar to /home/jenkins/.m2/repository/org/eclipse/tracecompass/org.eclipse.tracecompass.jsontrace.core.tests/1.0.2-SNAPSHOT/org.eclipse.tracecompass.jsontrace.core.tests-1.0.2-SNAPSHOT.jar
13:47:12 [2020-08-04T17:47:12.533Z] [INFO] Installing /home/jenkins/agent/workspace/tracecompass-master-jdk11/jsontrace/org.eclipse.tracecompass.jsontrace.core.tests/pom.xml to /home/jenkins/.m2/repository/org/eclipse/tracecompass/org.eclipse.tracecompass.jsontrace.core.tests/1.0.2-SNAPSHOT/org.eclipse.tracecompass.jsontrace.core.tests-1.0.2-SNAPSHOT.pom
13:47:12 [2020-08-04T17:47:12.533Z] [INFO] Installing /home/jenkins/agent/workspace/tracecompass-master-jdk11/jsontrace/org.eclipse.tracecompass.jsontrace.core.tests/target/org.eclipse.tracecompass.jsontrace.core.tests-1.0.2-SNAPSHOT-sources.jar to /home/jenkins/.m2/repository/org/eclipse/tracecompass/org.eclipse.tracecompass.jsontrace.core.tests/1.0.2-SNAPSHOT/org.eclipse.tracecompass.jsontrace.core.tests-1.0.2-SNAPSHOT-sources.jar
13:47:12 [2020-08-04T17:47:12.533Z] [INFO] Installing /home/jenkins/agent/workspace/tracecompass-master-jdk11/jsontrace/org.eclipse.tracecompass.jsontrace.core.tests/target/org.eclipse.tracecompass.jsontrace.core.tests-1.0.2-SNAPSHOT.jar.pack.gz to /home/jenkins/.m2/repository/org/eclipse/tracecompass/org.eclipse.tracecompass.jsontrace.core.tests/1.0.2-SNAPSHOT/org.eclipse.tracecompass.jsontrace.core.tests-1.0.2-SNAPSHOT-pack200.jar.pack.gz
13:47:12 [2020-08-04T17:47:12.533Z] [INFO] Installing /home/jenkins/agent/workspace/tracecompass-master-jdk11/jsontrace/org.eclipse.tracecompass.jsontrace.core.tests/target/p2content.xml to /home/jenkins/.m2/repository/org/eclipse/tracecompass/org.eclipse.tracecompass.jsontrace.core.tests/1.0.2-SNAPSHOT/org.eclipse.tracecompass.jsontrace.core.tests-1.0.2-SNAPSHOT-p2metadata.xml
13:47:12 [2020-08-04T17:47:12.533Z] [INFO] Installing /home/jenkins/agent/workspace/tracecompass-master-jdk11/jsontrace/org.eclipse.tracecompass.jsontrace.core.tests/target/p2artifacts.xml to /home/jenkins/.m2/repository/org/eclipse/tracecompass/org.eclipse.tracecompass.jsontrace.core.tests/1.0.2-SNAPSHOT/org.eclipse.tracecompass.jsontrace.core.tests-1.0.2-SNAPSHOT-p2artifacts.xml
13:47:12 [2020-08-04T17:47:12.533Z] [INFO] 
13:47:12 [2020-08-04T17:47:12.533Z] [INFO] --- tycho-p2-plugin:2.0.0-SNAPSHOT:update-local-index (default-update-local-index) @ org.eclipse.tracecompass.jsontrace.core.tests ---
13:47:12 [2020-08-04T17:47:12.533Z] [INFO] ------------------------------------------------------------------------
13:47:12 [2020-08-04T17:47:12.533Z] [INFO] Reactor Summary:
13:47:12 [2020-08-04T17:47:12.533Z] [INFO] 
13:47:12 [2020-08-04T17:47:12.533Z] [INFO] Trace Compass Parent 6.0.0-SNAPSHOT ................ SUCCESS [01:01 min]
13:47:12 [2020-08-04T17:47:12.533Z] [INFO] Trace Compass Tracetype-agnostic Analyses Parent 6.0.0-SNAPSHOT SUCCESS [  0.008 s]
13:47:12 [2020-08-04T17:47:12.533Z] [INFO] Trace Compass Common Utilities Parent 6.0.0-SNAPSHOT SUCCESS [  0.016 s]
13:47:12 [2020-08-04T17:47:12.533Z] [INFO] org.eclipse.tracecompass.common.core 4.3.0-SNAPSHOT  SUCCESS [ 27.362 s]
13:47:12 [2020-08-04T17:47:12.533Z] [INFO] Trace Compass State System Parent 6.0.0-SNAPSHOT ... SUCCESS [  0.007 s]
13:47:12 [2020-08-04T17:47:12.533Z] [INFO] org.eclipse.tracecompass.datastore.core 1.2.1-SNAPSHOT SUCCESS [  3.600 s]
13:47:12 [2020-08-04T17:47:12.533Z] [INFO] org.eclipse.tracecompass.segmentstore.core 3.0.0-SNAPSHOT SUCCESS [  3.108 s]
13:47:12 [2020-08-04T17:47:12.533Z] [INFO] org.eclipse.tracecompass.statesystem.core 5.0.0-SNAPSHOT SUCCESS [  3.666 s]
13:47:12 [2020-08-04T17:47:12.533Z] [INFO] Trace Compass TMF Parent 6.0.0-SNAPSHOT ............ SUCCESS [  0.007 s]
13:47:12 [2020-08-04T17:47:12.533Z] [INFO] Trace Compass Filter Parser 1.0.5-SNAPSHOT ......... SUCCESS [  2.884 s]
13:47:12 [2020-08-04T17:47:12.533Z] [INFO] org.eclipse.tracecompass.tmf.core 6.1.0-SNAPSHOT ... SUCCESS [  8.654 s]
13:47:12 [2020-08-04T17:47:12.533Z] [INFO] org.eclipse.tracecompass.analysis.counters.core 2.0.4-SNAPSHOT SUCCESS [  2.874 s]
13:47:12 [2020-08-04T17:47:12.533Z] [INFO] Trace Compass CTF Support Parent 6.0.0-SNAPSHOT .... SUCCESS [  0.007 s]
13:47:12 [2020-08-04T17:47:12.533Z] [INFO] Trace Compass CTF Parser Plug-in 1.0.5-SNAPSHOT .... SUCCESS [  9.471 s]
13:47:12 [2020-08-04T17:47:12.533Z] [INFO] org.eclipse.tracecompass.ctf.core 4.0.3-SNAPSHOT ... SUCCESS [  4.444 s]
13:47:12 [2020-08-04T17:47:12.533Z] [INFO] Trace Compass CTF Core Tests Plug-in 1.0.8-SNAPSHOT  SUCCESS [ 42.763 s]
13:47:12 [2020-08-04T17:47:12.533Z] [INFO] org.eclipse.tracecompass.statesystem.core.tests 1.0.12-SNAPSHOT SUCCESS [ 12.790 s]
13:47:12 [2020-08-04T17:47:12.533Z] [INFO] org.eclipse.tracecompass.tmf.core.tests 1.0.13-SNAPSHOT SUCCESS [04:41 min]
13:47:12 [2020-08-04T17:47:12.533Z] [INFO] org.eclipse.tracecompass.tmf.ctf.core 4.2.1-SNAPSHOT SUCCESS [  2.955 s]
13:47:12 [2020-08-04T17:47:12.533Z] [INFO] org.eclipse.tracecompass.tmf.ctf.core.tests 1.0.11-SNAPSHOT SUCCESS [03:26 min]
13:47:12 [2020-08-04T17:47:12.534Z] [INFO] org.eclipse.tracecompass.analysis.counters.core.tests 1.0.0-SNAPSHOT SUCCESS [  7.204 s]
13:47:12 [2020-08-04T17:47:12.534Z] [INFO] org.eclipse.tracecompass.tmf.ui 6.1.0-SNAPSHOT ..... SUCCESS [ 13.419 s]
13:47:12 [2020-08-04T17:47:12.534Z] [INFO] org.eclipse.tracecompass.analysis.counters.ui 1.0.0-SNAPSHOT SUCCESS [  2.684 s]
13:47:12 [2020-08-04T17:47:12.534Z] [INFO] org.eclipse.tracecompass.tmf.ui.tests 1.0.14-SNAPSHOT SUCCESS [02:34 min]
13:47:12 [2020-08-04T17:47:12.534Z] [INFO] org.eclipse.tracecompass.tmf.ui.swtbot.tests 1.0.13-SNAPSHOT SUCCESS [04:42 min]
13:47:12 [2020-08-04T17:47:12.534Z] [INFO] org.eclipse.tracecompass.analysis.graph.core 2.1.6-SNAPSHOT SUCCESS [  2.851 s]
13:47:12 [2020-08-04T17:47:12.534Z] [INFO] org.eclipse.tracecompass.tmf.chart.core 1.0.3-SNAPSHOT SUCCESS [  2.785 s]
13:47:12 [2020-08-04T17:47:12.534Z] [INFO] org.eclipse.tracecompass.analysis.lami.core 1.1.2-SNAPSHOT SUCCESS [  2.972 s]
13:47:12 [2020-08-04T17:47:12.534Z] [INFO] org.eclipse.tracecompass.analysis.timing.core 5.2.0-SNAPSHOT SUCCESS [  2.829 s]
13:47:12 [2020-08-04T17:47:12.534Z] [INFO] org.eclipse.tracecompass.analysis.os.linux.core 5.0.0-SNAPSHOT SUCCESS [  4.052 s]
13:47:12 [2020-08-04T17:47:12.534Z] [INFO] Trace Compass LTTng Support Parent 6.0.0-SNAPSHOT .. SUCCESS [  0.026 s]
13:47:12 [2020-08-04T17:47:12.534Z] [INFO] org.eclipse.tracecompass.lttng2.common.core 1.1.2-SNAPSHOT SUCCESS [  2.574 s]
13:47:12 [2020-08-04T17:47:12.534Z] [INFO] org.eclipse.tracecompass.tmf.analysis.xml.core 4.0.0-SNAPSHOT SUCCESS [  4.197 s]
13:47:12 [2020-08-04T17:47:12.534Z] [INFO] org.eclipse.tracecompass.lttng2.kernel.core 3.0.4-SNAPSHOT SUCCESS [  3.037 s]
13:47:12 [2020-08-04T17:47:12.534Z] [INFO] org.eclipse.tracecompass.analysis.counters.ui.swtbot.tests 1.0.0-SNAPSHOT SUCCESS [01:28 min]
13:47:12 [2020-08-04T17:47:12.534Z] [INFO] org.eclipse.tracecompass.analysis.graph.core.tests 1.0.5-SNAPSHOT SUCCESS [  8.148 s]
13:47:12 [2020-08-04T17:47:12.534Z] [INFO] org.eclipse.tracecompass.analysis.graph.ui 1.0.10-SNAPSHOT SUCCESS [  2.494 s]
13:47:12 [2020-08-04T17:47:12.534Z] [INFO] org.eclipse.tracecompass.analysis.lami.core.tests 1.0.3-SNAPSHOT SUCCESS [  6.753 s]
13:47:12 [2020-08-04T17:47:12.534Z] [INFO] org.eclipse.tracecompass.tmf.chart.ui 1.0.10-SNAPSHOT SUCCESS [  3.108 s]
13:47:12 [2020-08-04T17:47:12.534Z] [INFO] org.eclipse.tracecompass.analysis.lami.ui 1.1.3-SNAPSHOT SUCCESS [  2.887 s]
13:47:12 [2020-08-04T17:47:12.534Z] [INFO] org.eclipse.tracecompass.tmf.chart.core.tests 1.0.2-SNAPSHOT SUCCESS [  6.563 s]
13:47:12 [2020-08-04T17:47:12.534Z] [INFO] org.eclipse.tracecompass.tmf.chart.ui.swtbot.tests 1.0.5-SNAPSHOT SUCCESS [ 13.587 s]
13:47:12 [2020-08-04T17:47:12.534Z] [INFO] org.eclipse.tracecompass.analysis.lami.ui.swtbot.tests 1.0.5-SNAPSHOT SUCCESS [ 21.582 s]
13:47:12 [2020-08-04T17:47:12.534Z] [INFO] org.eclipse.tracecompass.analysis.os.linux.core.tests 1.0.13-SNAPSHOT SUCCESS [01:58 min]
13:47:12 [2020-08-04T17:47:12.534Z] [INFO] org.eclipse.tracecompass.analysis.timing.ui 4.1.0-SNAPSHOT SUCCESS [  3.423 s]
13:47:12 [2020-08-04T17:47:12.534Z] [INFO] org.eclipse.tracecompass.analysis.os.linux.ui 4.0.0-SNAPSHOT SUCCESS [  3.309 s]
13:47:12 [2020-08-04T17:47:12.534Z] [INFO] org.eclipse.tracecompass.analysis.os.linux.ui.tests 1.0.8-SNAPSHOT SUCCESS [ 12.016 s]
13:47:12 [2020-08-04T17:47:12.534Z] [INFO] org.eclipse.tracecompass.analysis.timing.core.tests 1.0.5-SNAPSHOT SUCCESS [ 11.805 s]
13:47:12 [2020-08-04T17:47:12.534Z] [INFO] org.eclipse.tracecompass.analysis.timing.ui.swtbot.tests 1.0.9-SNAPSHOT SUCCESS [ 38.643 s]
13:47:12 [2020-08-04T17:47:12.534Z] [INFO] org.eclipse.tracecompass.analysis.os.linux.ui.swtbot.tests 1.0.14-SNAPSHOT SUCCESS [01:11 min]
13:47:12 [2020-08-04T17:47:12.534Z] [INFO] org.eclipse.tracecompass.analysis.profiling.core 2.0.0-SNAPSHOT SUCCESS [  2.970 s]
13:47:12 [2020-08-04T17:47:12.534Z] [INFO] org.eclipse.tracecompass.analysis.profiling.core.tests 1.0.4-SNAPSHOT SUCCESS [ 29.390 s]
13:47:12 [2020-08-04T17:47:12.534Z] [INFO] org.eclipse.tracecompass.analysis.profiling.ui 2.1.0-SNAPSHOT SUCCESS [  2.718 s]
13:47:12 [2020-08-04T17:47:12.534Z] [INFO] org.eclipse.tracecompass.analysis.profiling.ui.swtbot.tests 1.0.4-SNAPSHOT SUCCESS [ 14.047 s]
13:47:12 [2020-08-04T17:47:12.534Z] [INFO] Trace Compass BTF Support Parent 6.0.0-SNAPSHOT .... SUCCESS [  0.006 s]
13:47:12 [2020-08-04T17:47:12.534Z] [INFO] org.eclipse.tracecompass.btf.core 2.2.2-SNAPSHOT ... SUCCESS [  2.703 s]
13:47:12 [2020-08-04T17:47:12.534Z] [INFO] Trace Compass Documentation 6.0.0-SNAPSHOT ......... SUCCESS [  0.023 s]
13:47:12 [2020-08-04T17:47:12.534Z] [INFO] Trace Compass Developer Guide 6.0.0-SNAPSHOT ....... SUCCESS [ 23.881 s]
13:47:12 [2020-08-04T17:47:12.534Z] [INFO] org.eclipse.tracecompass.tmf.analysis.xml.ui 2.1.12-SNAPSHOT SUCCESS [  2.822 s]
13:47:12 [2020-08-04T17:47:12.534Z] [INFO] org.eclipse.tracecompass.tmf 6.0.0-SNAPSHOT ........ SUCCESS [  2.510 s]
13:47:12 [2020-08-04T17:47:12.534Z] [INFO] org.eclipse.tracecompass.btf.ui 1.0.3-SNAPSHOT ..... SUCCESS [  2.474 s]
13:47:12 [2020-08-04T17:47:12.534Z] [INFO] org.eclipse.tracecompass.btf 6.0.0-SNAPSHOT ........ SUCCESS [  2.209 s]
13:47:12 [2020-08-04T17:47:12.534Z] [INFO] org.eclipse.tracecompass.btf.core.tests 1.0.2-SNAPSHOT SUCCESS [  6.822 s]
13:47:12 [2020-08-04T17:47:12.534Z] [INFO] org.eclipse.tracecompass.common.core.tests 1.1.8-SNAPSHOT SUCCESS [  7.551 s]
13:47:12 [2020-08-04T17:47:12.534Z] [INFO] org.eclipse.tracecompass.ctf 6.0.0-SNAPSHOT ........ SUCCESS [  2.531 s]
13:47:12 [2020-08-04T17:47:12.534Z] [INFO] org.eclipse.tracecompass.ctf.parser.tests 1.0.2-SNAPSHOT SUCCESS [  6.760 s]
13:47:12 [2020-08-04T17:47:12.534Z] [INFO] org.eclipse.tracecompass.tmf.ctf 6.0.0-SNAPSHOT .... SUCCESS [  2.243 s]
13:47:12 [2020-08-04T17:47:12.534Z] [INFO] org.eclipse.tracecompass.tmf.ctf.ui.swtbot.tests 1.0.10-SNAPSHOT SUCCESS [01:56 min]
13:47:12 [2020-08-04T17:47:12.534Z] [INFO] Trace Compass User Guide 6.0.0-SNAPSHOT ............ SUCCESS [ 12.104 s]
13:47:12 [2020-08-04T17:47:12.534Z] [INFO] Trace Compass GDB Tracepoint Analysis User Guide 6.0.0-SNAPSHOT SUCCESS [  5.903 s]
13:47:12 [2020-08-04T17:47:12.534Z] [INFO] Trace Compass RCP User Guide 6.0.0-SNAPSHOT ........ SUCCESS [  6.430 s]
13:47:12 [2020-08-04T17:47:12.534Z] [INFO] Trace Compass Pcap User Guide 6.0.0-SNAPSHOT ....... SUCCESS [  5.814 s]
13:47:12 [2020-08-04T17:47:12.534Z] [INFO] org.eclipse.tracecompass.examples 1.0.6-SNAPSHOT ... SUCCESS [  2.649 s]
13:47:12 [2020-08-04T17:47:12.534Z] [INFO] Trace Compass GDB Tracepoint Analysis Parent 6.0.0-SNAPSHOT SUCCESS [  0.005 s]
13:47:12 [2020-08-04T17:47:12.534Z] [INFO] org.eclipse.tracecompass.gdbtrace.core 1.0.6-SNAPSHOT SUCCESS [  2.738 s]
13:47:12 [2020-08-04T17:47:12.534Z] [INFO] org.eclipse.tracecompass.gdbtrace.ui 1.1.3-SNAPSHOT  SUCCESS [  2.476 s]
13:47:12 [2020-08-04T17:47:12.534Z] [INFO] org.eclipse.tracecompass.gdbtrace 6.0.0-SNAPSHOT ... SUCCESS [  2.106 s]
13:47:12 [2020-08-04T17:47:12.534Z] [INFO] org.eclipse.tracecompass.gdbtrace.core.tests 1.0.1-SNAPSHOT SUCCESS [  6.279 s]
13:47:12 [2020-08-04T17:47:12.534Z] [INFO] org.eclipse.tracecompass.gdbtrace.ui.tests 1.0.1-SNAPSHOT SUCCESS [ 12.306 s]
13:47:12 [2020-08-04T17:47:12.534Z] [INFO] org.eclipse.tracecompass.lttng2.common.core.tests 1.0.1-SNAPSHOT SUCCESS [  5.904 s]
13:47:12 [2020-08-04T17:47:12.534Z] [INFO] org.eclipse.tracecompass.lttng2.control.core 1.2.4-SNAPSHOT SUCCESS [  3.135 s]
13:47:12 [2020-08-04T17:47:12.534Z] [INFO] org.eclipse.tracecompass.tmf.remote.core 2.0.4-SNAPSHOT SUCCESS [  2.476 s]
13:47:12 [2020-08-04T17:47:12.534Z] [INFO] org.eclipse.tracecompass.tmf.remote.ui 1.0.8-SNAPSHOT SUCCESS [  3.892 s]
13:47:12 [2020-08-04T17:47:12.534Z] [INFO] org.eclipse.tracecompass.lttng2.control.ui 1.2.11-SNAPSHOT SUCCESS [  4.147 s]
13:47:12 [2020-08-04T17:47:12.534Z] [INFO] org.eclipse.tracecompass.lttng2.control 6.0.0-SNAPSHOT SUCCESS [  2.228 s]
13:47:12 [2020-08-04T17:47:12.534Z] [INFO] org.eclipse.tracecompass.lttng2.control.core.tests 1.1.2-SNAPSHOT SUCCESS [  6.772 s]
13:47:12 [2020-08-04T17:47:12.534Z] [INFO] org.eclipse.tracecompass.tmf.remote.core.tests 1.0.1-SNAPSHOT SUCCESS [  6.278 s]
13:47:12 [2020-08-04T17:47:12.534Z] [INFO] org.eclipse.tracecompass.lttng2.control.ui.tests 2.0.4-SNAPSHOT SUCCESS [ 31.052 s]
13:47:12 [2020-08-04T17:47:12.534Z] [INFO] org.eclipse.tracecompass.lttng2.control.ui.swtbot.tests 1.0.7-SNAPSHOT SUCCESS [ 44.431 s]
13:47:12 [2020-08-04T17:47:12.534Z] [INFO] org.eclipse.tracecompass.lttng2.kernel.ui 2.0.1-SNAPSHOT SUCCESS [  2.757 s]
13:47:12 [2020-08-04T17:47:12.534Z] [INFO] org.eclipse.tracecompass.lttng2.kernel 6.0.0-SNAPSHOT SUCCESS [  2.241 s]
13:47:12 [2020-08-04T17:47:12.534Z] [INFO] org.eclipse.tracecompass.tmf.analysis.xml.core.tests 1.0.12-SNAPSHOT SUCCESS [ 38.628 s]
13:47:12 [2020-08-04T17:47:12.534Z] [INFO] org.eclipse.tracecompass.lttng2.kernel.core.tests 2.0.1-SNAPSHOT SUCCESS [ 47.974 s]
13:47:12 [2020-08-04T17:47:12.534Z] [INFO] org.eclipse.tracecompass.lttng2.kernel.ui.swtbot.tests 1.0.14-SNAPSHOT SUCCESS [03:42 min]
13:47:12 [2020-08-04T17:47:12.534Z] [INFO] org.eclipse.tracecompass.lttng2.ust.core 5.0.0-SNAPSHOT SUCCESS [  3.571 s]
13:47:12 [2020-08-04T17:47:12.534Z] [INFO] org.eclipse.tracecompass.lttng2.ust.ui 3.0.8-SNAPSHOT SUCCESS [  2.501 s]
13:47:12 [2020-08-04T17:47:12.534Z] [INFO] org.eclipse.tracecompass.lttng2.ust 6.0.0-SNAPSHOT . SUCCESS [  2.226 s]
13:47:12 [2020-08-04T17:47:12.534Z] [INFO] org.eclipse.tracecompass.lttng2.ust.core.tests 1.0.11-SNAPSHOT SUCCESS [ 31.969 s]
13:47:12 [2020-08-04T17:47:12.534Z] [INFO] org.eclipse.tracecompass.lttng2.ust.ui.tests 1.0.1-SNAPSHOT SUCCESS [ 12.170 s]
13:47:12 [2020-08-04T17:47:12.534Z] [INFO] org.eclipse.tracecompass.lttng2.ust.ui.swtbot.tests 1.0.13-SNAPSHOT SUCCESS [01:06 min]
13:47:12 [2020-08-04T17:47:12.534Z] [INFO] Trace Compass Pcap Format Support Parent 6.0.0-SNAPSHOT SUCCESS [  0.005 s]
13:47:12 [2020-08-04T17:47:12.534Z] [INFO] org.eclipse.tracecompass.pcap.core 1.1.2-SNAPSHOT .. SUCCESS [  2.915 s]
13:47:12 [2020-08-04T17:47:12.534Z] [INFO] Trace Compass Pcap Parser Core Tests Plug-in 1.0.4-SNAPSHOT SUCCESS [  8.640 s]
13:47:12 [2020-08-04T17:47:12.534Z] [INFO] org.eclipse.tracecompass.tmf.pcap.core 1.0.4-SNAPSHOT SUCCESS [  2.631 s]
13:47:12 [2020-08-04T17:47:12.534Z] [INFO] org.eclipse.tracecompass.tmf.pcap.ui 1.1.3-SNAPSHOT  SUCCESS [  2.755 s]
13:47:12 [2020-08-04T17:47:12.534Z] [INFO] org.eclipse.tracecompass.tmf.pcap 6.0.0-SNAPSHOT ... SUCCESS [  2.345 s]
13:47:12 [2020-08-04T17:47:12.534Z] [INFO] org.eclipse.tracecompass.tmf.pcap.core.tests 1.0.2-SNAPSHOT SUCCESS [  7.712 s]
13:47:12 [2020-08-04T17:47:12.534Z] [INFO] org.eclipse.tracecompass.tmf.pcap.ui.swtbot.tests 1.0.1-SNAPSHOT SUCCESS [ 26.667 s]
13:47:12 [2020-08-04T17:47:12.534Z] [INFO] Trace Compass RCP Parent 6.0.0-SNAPSHOT ............ SUCCESS [  0.004 s]
13:47:12 [2020-08-04T17:47:12.534Z] [INFO] Trace Compass RCP Branding plug-in 6.0.0-SNAPSHOT .. SUCCESS [  2.971 s]
13:47:12 [2020-08-04T17:47:12.534Z] [INFO] Trace Compass RCP Branding Feature 6.0.0-SNAPSHOT .. SUCCESS [  2.218 s]
13:47:12 [2020-08-04T17:47:12.534Z] [INFO] org.eclipse.tracecompass.tmf.cli.core 1.0.1-SNAPSHOT SUCCESS [  2.454 s]
13:47:12 [2020-08-04T17:47:12.534Z] [INFO] org.eclipse.tracecompass.rcp.ui 6.0.0-SNAPSHOT ..... SUCCESS [  2.600 s]
13:47:12 [2020-08-04T17:47:12.534Z] [INFO] Trace Compass RCP Feature 6.0.0-SNAPSHOT ........... SUCCESS [  2.704 s]
13:47:12 [2020-08-04T17:47:12.534Z] [INFO] org.eclipse.tracecompass.tmf.cli.core.tests 1.0.1-SNAPSHOT SUCCESS [  6.058 s]
13:47:12 [2020-08-04T17:47:12.534Z] [INFO] org.eclipse.tracecompass.rcp.ui.tests 2.0.3-SNAPSHOT SUCCESS [ 11.911 s]
13:47:12 [2020-08-04T17:47:12.534Z] [INFO] org.eclipse.tracecompass.rcp.incubator.ui 1.0.1-SNAPSHOT SUCCESS [  2.424 s]
13:47:12 [2020-08-04T17:47:12.534Z] [INFO] org.eclipse.tracecompass.rcp.incubator 6.0.0-SNAPSHOT SUCCESS [  2.652 s]
13:47:12 [2020-08-04T17:47:12.534Z] [INFO] Trace Compass Json trace Parent 6.0.0-SNAPSHOT ..... SUCCESS [  0.024 s]
13:47:12 [2020-08-04T17:47:12.534Z] [INFO] org.eclipse.tracecompass.jsontrace.core 1.0.0-SNAPSHOT SUCCESS [  2.370 s]
13:47:12 [2020-08-04T17:47:12.534Z] [INFO] org.eclipse.tracecompass.jsontrace 6.0.0-SNAPSHOT .. SUCCESS [  2.165 s]
13:47:12 [2020-08-04T17:47:12.534Z] [INFO] org.eclipse.tracecompass.tmf.cli 6.0.0-SNAPSHOT .... SUCCESS [  2.133 s]
13:47:12 [2020-08-04T17:47:12.534Z] [INFO] Trace Compass RCP Product 6.0.0-SNAPSHOT ........... SUCCESS [01:04 min]
13:47:12 [2020-08-04T17:47:12.534Z] [INFO] Trace Compass Release Engineering Parent 6.0.0-SNAPSHOT SUCCESS [  0.007 s]
13:47:12 [2020-08-04T17:47:12.534Z] [INFO] Trace Compass Target Platform 6.0.0-SNAPSHOT ....... SUCCESS [  5.531 s]
13:47:12 [2020-08-04T17:47:12.534Z] [INFO] org.eclipse.tracecompass.integration.swtbot.tests 1.0.11-SNAPSHOT SUCCESS [07:32 min]
13:47:12 [2020-08-04T17:47:12.534Z] [INFO] org.eclipse.tracecompass.datastore.core.tests 1.0.5-SNAPSHOT SUCCESS [  7.677 s]
13:47:12 [2020-08-04T17:47:12.534Z] [INFO] org.eclipse.tracecompass.segmentstore.core.tests 1.0.4-SNAPSHOT SUCCESS [  6.540 s]
13:47:12 [2020-08-04T17:47:12.534Z] [INFO] org.eclipse.tracecompass.tmf.analysis.xml.ui.swtbot.tests 1.0.11-SNAPSHOT SUCCESS [ 51.649 s]
13:47:12 [2020-08-04T17:47:12.534Z] [INFO] org.eclipse.tracecompass.tmf.analysis.xml.ui.tests 1.0.3-SNAPSHOT SUCCESS [ 11.993 s]
13:47:12 [2020-08-04T17:47:12.534Z] [INFO] org.eclipse.tracecompass.tmf.chart.ui.tests 1.0.1-SNAPSHOT SUCCESS [ 11.676 s]
13:47:12 [2020-08-04T17:47:12.534Z] [INFO] org.eclipse.tracecompass.tmf.remote.ui.swtbot.tests 1.0.8-SNAPSHOT SUCCESS [01:22 min]
13:47:12 [2020-08-04T17:47:12.534Z] [INFO] org.eclipse.tracecompass.tmf.remote.ui.tests 1.0.1-SNAPSHOT SUCCESS [ 12.715 s]
13:47:12 [2020-08-04T17:47:12.534Z] [INFO] Trace Compass All Tests 1.0.9-SNAPSHOT ............. SUCCESS [  7.877 s]
13:47:12 [2020-08-04T17:47:12.534Z] [INFO] org.eclipse.tracecompass.testing 6.0.0-SNAPSHOT .... SUCCESS [  2.501 s]
13:47:12 [2020-08-04T17:47:12.534Z] [INFO] org.eclipse.tracecompass.tmf.remote 6.0.0-SNAPSHOT . SUCCESS [  2.357 s]
13:47:12 [2020-08-04T17:47:12.534Z] [INFO] Trace Compass Repository 6.0.0-SNAPSHOT ............ SUCCESS [ 12.565 s]
13:47:12 [2020-08-04T17:47:12.534Z] [INFO] org.eclipse.tracecompass.jsontrace.core.tests 1.0.2-SNAPSHOT SUCCESS [  2.604 s]
13:47:12 [2020-08-04T17:47:12.534Z] [INFO] ------------------------------------------------------------------------
13:47:12 [2020-08-04T17:47:12.534Z] [INFO] BUILD SUCCESS
13:47:12 [2020-08-04T17:47:12.534Z] [INFO] ------------------------------------------------------------------------
13:47:12 [2020-08-04T17:47:12.534Z] [INFO] Total time:  59:29 min
13:47:12 [2020-08-04T17:47:12.534Z] [INFO] Finished at: 2020-08-04T17:47:12Z
13:47:12 [2020-08-04T17:47:12.534Z] [INFO] ------------------------------------------------------------------------