FailedConsole Output

Skipping 1,823 KB.. Full Log
ode  Time elapsed: 0 s
14:39:14 [2020-08-04T18:39:14.517Z] testEquals  Time elapsed: 0 s
14:39:14 [2020-08-04T18:39:14.517Z] Running org.eclipse.tracecompass.tmf.ctf.core.tests.context.CtfLocationTest
14:39:14 [2020-08-04T18:39:14.517Z] Tests run: 6, Failures: 0, Errors: 0, Skipped: 0, Time elapsed: 0.001 s - in org.eclipse.tracecompass.tmf.ctf.core.tests.context.CtfLocationTest
14:39:14 [2020-08-04T18:39:14.517Z] testCtfLocation_timestamp  Time elapsed: 0 s
14:39:14 [2020-08-04T18:39:14.517Z] testToString_valid  Time elapsed: 0 s
14:39:14 [2020-08-04T18:39:14.517Z] testSetLocation  Time elapsed: 0 s
14:39:14 [2020-08-04T18:39:14.517Z] testGetLocation  Time elapsed: 0.001 s
14:39:14 [2020-08-04T18:39:14.517Z] testToString_invalid  Time elapsed: 0 s
14:39:14 [2020-08-04T18:39:14.517Z] testCtfLocation_long  Time elapsed: 0 s
14:39:14 [2020-08-04T18:39:14.517Z] Running org.eclipse.tracecompass.tmf.ctf.core.tests.event.CtfTmfEventFieldSignExtensionTest
14:39:14 [2020-08-04T18:39:14.517Z] Tests run: 1, Failures: 0, Errors: 0, Skipped: 0, Time elapsed: 0.073 s - in org.eclipse.tracecompass.tmf.ctf.core.tests.event.CtfTmfEventFieldSignExtensionTest
14:39:14 [2020-08-04T18:39:14.517Z] testUnsignedByte  Time elapsed: 0.073 s
14:39:14 [2020-08-04T18:39:14.517Z] Running org.eclipse.tracecompass.tmf.ctf.core.tests.event.CtfTmfEventFieldTest
14:39:14 [2020-08-04T18:39:14.517Z] Tests run: 14, Failures: 0, Errors: 0, Skipped: 0, Time elapsed: 0.009 s - in org.eclipse.tracecompass.tmf.ctf.core.tests.event.CtfTmfEventFieldTest
14:39:14 [2020-08-04T18:39:14.517Z] testParseField_array_int  Time elapsed: 0.003 s
14:39:14 [2020-08-04T18:39:14.517Z] testParseField_variant  Time elapsed: 0.001 s
14:39:14 [2020-08-04T18:39:14.517Z] testParseField_float  Time elapsed: 0 s
14:39:14 [2020-08-04T18:39:14.517Z] testParseField_enum  Time elapsed: 0.001 s
14:39:14 [2020-08-04T18:39:14.517Z] testParseField_string  Time elapsed: 0.001 s
14:39:14 [2020-08-04T18:39:14.517Z] testParseField_struct  Time elapsed: 0 s
14:39:14 [2020-08-04T18:39:14.517Z] testParseField_sequence  Time elapsed: 0 s
14:39:14 [2020-08-04T18:39:14.517Z] testParseField_sequence_value  Time elapsed: 0 s
14:39:14 [2020-08-04T18:39:14.517Z] testParseField_array_enum  Time elapsed: 0 s
14:39:14 [2020-08-04T18:39:14.517Z] testParseField_array_float  Time elapsed: 0 s
14:39:14 [2020-08-04T18:39:14.517Z] testParseField_int  Time elapsed: 0 s
14:39:14 [2020-08-04T18:39:14.517Z] testParseField_array_variant  Time elapsed: 0 s
14:39:14 [2020-08-04T18:39:14.517Z] testParseField_array_string  Time elapsed: 0 s
14:39:14 [2020-08-04T18:39:14.517Z] testParseField_array_struct  Time elapsed: 0.001 s
14:39:14 [2020-08-04T18:39:14.517Z] Running org.eclipse.tracecompass.tmf.ctf.core.tests.event.CtfTmfLostEventStatisticsTest
14:39:16 [2020-08-04T18:39:16.406Z] Tests run: 4, Failures: 0, Errors: 0, Skipped: 0, Time elapsed: 1.987 s - in org.eclipse.tracecompass.tmf.ctf.core.tests.event.CtfTmfLostEventStatisticsTest
14:39:16 [2020-08-04T18:39:16.407Z] testLostEventsTotals  Time elapsed: 0.002 s
14:39:16 [2020-08-04T18:39:16.407Z] testLostEventsTypes  Time elapsed: 0 s
14:39:16 [2020-08-04T18:39:16.407Z] testLostEventsTotalInRange  Time elapsed: 0.001 s
14:39:16 [2020-08-04T18:39:16.407Z] testLostEventsTypesInRange  Time elapsed: 0.001 s
14:39:16 [2020-08-04T18:39:16.407Z] Running org.eclipse.tracecompass.tmf.ctf.core.tests.event.CtfTmfLostEventsTest
14:39:28 [2020-08-04T18:39:28.579Z] Tests run: 6, Failures: 0, Errors: 0, Skipped: 0, Time elapsed: 10.883 s - in org.eclipse.tracecompass.tmf.ctf.core.tests.event.CtfTmfLostEventsTest
14:39:28 [2020-08-04T18:39:28.579Z] testNbEvents  Time elapsed: 1.428 s
14:39:28 [2020-08-04T18:39:28.579Z] testNbEventsBug475007  Time elapsed: 2.864 s
14:39:28 [2020-08-04T18:39:28.579Z] testNormalEvent  Time elapsed: 1.407 s
14:39:28 [2020-08-04T18:39:28.579Z] testSecondLostEvent  Time elapsed: 1.407 s
14:39:28 [2020-08-04T18:39:28.579Z] testFirstLostEvent  Time elapsed: 1.307 s
14:39:28 [2020-08-04T18:39:28.579Z] testLostEventWithTransform  Time elapsed: 2.47 s
14:39:28 [2020-08-04T18:39:28.579Z] Running org.eclipse.tracecompass.tmf.ctf.core.tests.event.EventContextTest
14:39:30 [2020-08-04T18:39:30.470Z] Tests run: 8, Failures: 0, Errors: 0, Skipped: 0, Time elapsed: 2.821 s - in org.eclipse.tracecompass.tmf.ctf.core.tests.event.EventContextTest
14:39:30 [2020-08-04T18:39:30.470Z] testTrace  Time elapsed: 0 s
14:39:30 [2020-08-04T18:39:30.470Z] testContextEnd  Time elapsed: 0.112 s
14:39:30 [2020-08-04T18:39:30.470Z] testContext1  Time elapsed: 0.112 s
14:39:30 [2020-08-04T18:39:30.470Z] testContext2  Time elapsed: 0.064 s
14:39:30 [2020-08-04T18:39:30.470Z] testContext3  Time elapsed: 0.105 s
14:39:30 [2020-08-04T18:39:30.470Z] testContext4  Time elapsed: 0.118 s
14:39:30 [2020-08-04T18:39:30.470Z] testContextMiddle  Time elapsed: 0.08 s
14:39:30 [2020-08-04T18:39:30.470Z] testContextStart  Time elapsed: 0.083 s
14:39:30 [2020-08-04T18:39:30.470Z] Running org.eclipse.tracecompass.tmf.ctf.core.tests.event.CtfTmfEventFieldVariantTest
14:39:30 [2020-08-04T18:39:30.470Z] Tests run: 1, Failures: 0, Errors: 0, Skipped: 0, Time elapsed: 0 s - in org.eclipse.tracecompass.tmf.ctf.core.tests.event.CtfTmfEventFieldVariantTest
14:39:30 [2020-08-04T18:39:30.470Z] testVariantGetField  Time elapsed: 0 s
14:39:30 [2020-08-04T18:39:30.470Z] Running org.eclipse.tracecompass.tmf.ctf.core.tests.event.CtfTmfEventTest
14:39:30 [2020-08-04T18:39:30.470Z] Tests run: 13, Failures: 0, Errors: 0, Skipped: 0, Time elapsed: 0.027 s - in org.eclipse.tracecompass.tmf.ctf.core.tests.event.CtfTmfEventTest
14:39:30 [2020-08-04T18:39:30.470Z] testGetFieldNames  Time elapsed: 0 s
14:39:30 [2020-08-04T18:39:30.470Z] testGetFieldValue  Time elapsed: 0 s
14:39:30 [2020-08-04T18:39:30.470Z] testCTFEvent_read  Time elapsed: 0 s
14:39:30 [2020-08-04T18:39:30.470Z] testGetSubFieldValue  Time elapsed: 0 s
14:39:30 [2020-08-04T18:39:30.470Z] testToString  Time elapsed: 0 s
14:39:30 [2020-08-04T18:39:30.470Z] testCustomAttributes  Time elapsed: 0 s
14:39:30 [2020-08-04T18:39:30.470Z] testGetters  Time elapsed: 0 s
14:39:30 [2020-08-04T18:39:30.470Z] testTimestamp  Time elapsed: 0 s
14:39:30 [2020-08-04T18:39:30.470Z] testGetEventName  Time elapsed: 0 s
14:39:30 [2020-08-04T18:39:30.470Z] testGetTimestamp  Time elapsed: 0 s
14:39:30 [2020-08-04T18:39:30.470Z] testGetFields  Time elapsed: 0 s
14:39:30 [2020-08-04T18:39:30.470Z] testGetCPU  Time elapsed: 0 s
14:39:30 [2020-08-04T18:39:30.470Z] testNullEvent  Time elapsed: 0.001 s
14:39:30 [2020-08-04T18:39:30.470Z] Running org.eclipse.tracecompass.tmf.ctf.core.tests.event.CtfTmfCpuAspectTest
14:39:30 [2020-08-04T18:39:30.470Z] Tests run: 1, Failures: 0, Errors: 0, Skipped: 0, Time elapsed: 0 s - in org.eclipse.tracecompass.tmf.ctf.core.tests.event.CtfTmfCpuAspectTest
14:39:30 [2020-08-04T18:39:30.470Z] test  Time elapsed: 0 s
14:39:30 [2020-08-04T18:39:30.470Z] Running org.eclipse.tracecompass.tmf.ctf.core.tests.event.CtfTmfEventTypeTest
14:39:30 [2020-08-04T18:39:30.470Z] Tests run: 2, Failures: 0, Errors: 0, Skipped: 0, Time elapsed: 0 s - in org.eclipse.tracecompass.tmf.ctf.core.tests.event.CtfTmfEventTypeTest
14:39:30 [2020-08-04T18:39:30.470Z] testToString  Time elapsed: 0 s
14:39:30 [2020-08-04T18:39:30.470Z] testCtfTmfEventType  Time elapsed: 0 s
14:39:30 [2020-08-04T18:39:30.471Z] Running org.eclipse.tracecompass.tmf.ctf.core.tests.temp.statistics.TmfStateStatisticsTest
14:39:35 [2020-08-04T18:39:35.727Z] Tests run: 20, Failures: 0, Errors: 0, Skipped: 0, Time elapsed: 5.356 s - in org.eclipse.tracecompass.tmf.ctf.core.tests.temp.statistics.TmfStateStatisticsTest
14:39:35 [2020-08-04T18:39:35.727Z] testGetEventsInRangeWholeRange  Time elapsed: 0.001 s
14:39:35 [2020-08-04T18:39:35.727Z] testGetEventTypesInRangeMinusEnd  Time elapsed: 0 s
14:39:35 [2020-08-04T18:39:35.727Z] testGetEventsInRangeMinusEnd  Time elapsed: 0.001 s
14:39:35 [2020-08-04T18:39:35.727Z] testEventTypesTotal  Time elapsed: 0 s
14:39:35 [2020-08-04T18:39:35.727Z] testGetEventTypesInRangeWholeRange  Time elapsed: 0.001 s
14:39:35 [2020-08-04T18:39:35.727Z] testGetEventsTotal  Time elapsed: 0 s
14:39:35 [2020-08-04T18:39:35.727Z] testGetEventsInRangeNoEventsAtEdges  Time elapsed: 0.007 s
14:39:35 [2020-08-04T18:39:35.727Z] testGetEventsInRangeEventAtEnd  Time elapsed: 0.001 s
14:39:35 [2020-08-04T18:39:35.727Z] testGetEventsInRangeEventAtStart  Time elapsed: 0.001 s
14:39:35 [2020-08-04T18:39:35.727Z] testGetEventTypesInRangeNoEvents  Time elapsed: 0.001 s
14:39:35 [2020-08-04T18:39:35.727Z] testHistogramQuerySmall  Time elapsed: 0.001 s
14:39:35 [2020-08-04T18:39:35.727Z] testGetEventsInRangeNoEvents  Time elapsed: 0.001 s
14:39:35 [2020-08-04T18:39:35.727Z] testGetEventsInRangeMinusStart  Time elapsed: 0.001 s
14:39:35 [2020-08-04T18:39:35.727Z] testGetEventTypesInRangeNoEventsAtEdges  Time elapsed: 0.001 s
14:39:35 [2020-08-04T18:39:35.727Z] testGetEventTypesInRangeEventAtEnd  Time elapsed: 0.002 s
14:39:35 [2020-08-04T18:39:35.727Z] testGetEventTypesInRangeEventAtStart  Time elapsed: 0.003 s
14:39:35 [2020-08-04T18:39:35.727Z] testGetEventsInRangeEventAtBoth  Time elapsed: 0 s
14:39:35 [2020-08-04T18:39:35.727Z] testGetEventTypesInRangeMinusStart  Time elapsed: 0.001 s
14:39:35 [2020-08-04T18:39:35.727Z] testGetEventTypesInRangeEventAtBoth  Time elapsed: 0.001 s
14:39:35 [2020-08-04T18:39:35.727Z] testHistogramQueryFull  Time elapsed: 0.001 s
14:39:35 [2020-08-04T18:39:35.727Z] Running org.eclipse.tracecompass.tmf.ctf.core.tests.temp.request.TmfSchedulerTest
14:39:47 [2020-08-04T18:39:47.894Z] Tests run: 12, Failures: 0, Errors: 0, Skipped: 1, Time elapsed: 10.836 s - in org.eclipse.tracecompass.tmf.ctf.core.tests.temp.request.TmfSchedulerTest
14:39:47 [2020-08-04T18:39:47.894Z] preemptedForegroundRequest  Time elapsed: 0.186 s
14:39:47 [2020-08-04T18:39:47.894Z] foregroundRequest  Time elapsed: 0.673 s
14:39:47 [2020-08-04T18:39:47.894Z] executionOrder skipped
14:39:47 [2020-08-04T18:39:47.894Z] TestMultiRequest1  Time elapsed: 1.544 s
14:39:47 [2020-08-04T18:39:47.894Z] TestMultiRequest2  Time elapsed: 1.485 s
14:39:47 [2020-08-04T18:39:47.894Z] TestMultiRequest3  Time elapsed: 0.409 s
14:39:47 [2020-08-04T18:39:47.894Z] TestMultiRequest4  Time elapsed: 0.142 s
14:39:47 [2020-08-04T18:39:47.894Z] TestMultiRequest5  Time elapsed: 0.102 s
14:39:47 [2020-08-04T18:39:47.894Z] TestMultiRequest6  Time elapsed: 1.414 s
14:39:47 [2020-08-04T18:39:47.894Z] TestMultiRequest7  Time elapsed: 1.603 s
14:39:47 [2020-08-04T18:39:47.894Z] preemptedBackgroundRequest  Time elapsed: 0.186 s
14:39:47 [2020-08-04T18:39:47.894Z] backgroundRequest  Time elapsed: 1.528 s
14:39:47 [2020-08-04T18:39:47.894Z] Running org.eclipse.tracecompass.tmf.ctf.core.tests.temp.tracemanager.TmfTraceManagerUtilityTest
14:39:52 [2020-08-04T18:39:52.070Z] Tests run: 4, Failures: 0, Errors: 0, Skipped: 0, Time elapsed: 5.736 s - in org.eclipse.tracecompass.tmf.ctf.core.tests.temp.tracemanager.TmfTraceManagerUtilityTest
14:39:52 [2020-08-04T18:39:52.070Z] testSupplementaryFileDir  Time elapsed: 1.785 s
14:39:52 [2020-08-04T18:39:52.070Z] testDeleteSupplementaryFolder  Time elapsed: 1.306 s
14:39:52 [2020-08-04T18:39:52.070Z] testTemporaryDirPath  Time elapsed: 1.51 s
14:39:52 [2020-08-04T18:39:52.070Z] testDeleteSupplementaryFiles  Time elapsed: 1.134 s
14:39:52 [2020-08-04T18:39:52.070Z] Running org.eclipse.tracecompass.tmf.ctf.core.tests.temp.tracemanager.TmfTraceManagerTest
14:40:30 [2020-08-04T18:40:30.736Z] Tests run: 30, Failures: 0, Errors: 0, Skipped: 0, Time elapsed: 35.325 s - in org.eclipse.tracecompass.tmf.ctf.core.tests.temp.tracemanager.TmfTraceManagerTest
14:40:30 [2020-08-04T18:40:30.736Z] testTraceTimeRangeClampingEnd  Time elapsed: 0.001 s
14:40:30 [2020-08-04T18:40:30.736Z] testTraceSetNestedExperiment  Time elapsed: 6.536 s
14:40:30 [2020-08-04T18:40:30.736Z] testExperimentTimestampInTrace  Time elapsed: 1.961 s
14:40:30 [2020-08-04T18:40:30.736Z] testExperimentTimestampInvalid  Time elapsed: 1.976 s
14:40:30 [2020-08-04T18:40:30.736Z] testExperimentInitialRange  Time elapsed: 2.122 s
14:40:30 [2020-08-04T18:40:30.736Z] testTraceTimeRangeClampingStart  Time elapsed: 0.001 s
14:40:30 [2020-08-04T18:40:30.736Z] testTwoTracesTimeRangePartiallyInOne  Time elapsed: 0.001 s
14:40:30 [2020-08-04T18:40:30.736Z] testExperimentRangeClampingBoth  Time elapsed: 1.952 s
14:40:30 [2020-08-04T18:40:30.736Z] testTwoTracesTimestampValid  Time elapsed: 0.001 s
14:40:30 [2020-08-04T18:40:30.736Z] testTwoTracesTimestampInBetween  Time elapsed: 0.001 s
14:40:30 [2020-08-04T18:40:30.736Z] testTraceSetWithNestedExperiment  Time elapsed: 5.326 s
14:40:30 [2020-08-04T18:40:30.736Z] testTwoTracesTimestampInvalid  Time elapsed: 0.001 s
14:40:30 [2020-08-04T18:40:30.736Z] testTraceInitialRange  Time elapsed: 0.001 s
14:40:30 [2020-08-04T18:40:30.736Z] testTwoTracesTimeRangeAllInOne  Time elapsed: 0.001 s
14:40:30 [2020-08-04T18:40:30.736Z] testInitialize  Time elapsed: 0 s
14:40:30 [2020-08-04T18:40:30.736Z] testTraceTimeRangeClampingBoth  Time elapsed: 0.002 s
14:40:30 [2020-08-04T18:40:30.736Z] testTraceNewTimeRange  Time elapsed: 0 s
14:40:30 [2020-08-04T18:40:30.736Z] testTraceSetExperiment  Time elapsed: 1.964 s
14:40:30 [2020-08-04T18:40:30.736Z] testTwoTracesTimeRangeInBoth  Time elapsed: 0.001 s
14:40:30 [2020-08-04T18:40:30.736Z] testExperimentRangeInBetween  Time elapsed: 1.953 s
14:40:30 [2020-08-04T18:40:30.736Z] testExperimentRangeClampingOne  Time elapsed: 1.95 s
14:40:30 [2020-08-04T18:40:30.736Z] testTraceSetWithExperiment  Time elapsed: 1.962 s
14:40:30 [2020-08-04T18:40:30.736Z] testNewTimestamp  Time elapsed: 0.001 s
14:40:30 [2020-08-04T18:40:30.736Z] testTraceSetForHost  Time elapsed: 0.002 s
14:40:30 [2020-08-04T18:40:30.737Z] testTraceSetExperimentForHost  Time elapsed: 1.959 s
14:40:30 [2020-08-04T18:40:30.737Z] testTwoTracesTimeRangeInBetween  Time elapsed: 0.001 s
14:40:30 [2020-08-04T18:40:30.737Z] testExperimentTimestampInBetween  Time elapsed: 1.952 s
14:40:30 [2020-08-04T18:40:30.737Z] testTraceSet  Time elapsed: 0.001 s
14:40:30 [2020-08-04T18:40:30.737Z] testTimestampAfter  Time elapsed: 0 s
14:40:30 [2020-08-04T18:40:30.737Z] testTimestampBefore  Time elapsed: 0.001 s
14:40:30 [2020-08-04T18:40:30.737Z] Running org.eclipse.tracecompass.tmf.ctf.core.tests.trace.CtfTmfTraceValidateTest
14:40:30 [2020-08-04T18:40:30.737Z] 
14:40:30 [2020-08-04T18:40:30.737Z] !ENTRY org.eclipse.tracecompass.ctf.core 2 0 2020-08-04 18:40:27.303
14:40:30 [2020-08-04T18:40:30.737Z] !MESSAGE Unknown trace attribute: test
14:40:30 [2020-08-04T18:40:30.737Z] 
14:40:30 [2020-08-04T18:40:30.737Z] !ENTRY org.eclipse.tracecompass.ctf.core 2 0 2020-08-04 18:40:27.304
14:40:30 [2020-08-04T18:40:30.737Z] !MESSAGE Unknown trace attribute: test1
14:40:30 [2020-08-04T18:40:30.737Z] 
14:40:30 [2020-08-04T18:40:30.737Z] !ENTRY org.eclipse.tracecompass.ctf.core 2 0 2020-08-04 18:40:27.304
14:40:30 [2020-08-04T18:40:30.737Z] !MESSAGE Unknown trace attribute: test2
14:40:30 [2020-08-04T18:40:30.737Z] 
14:40:30 [2020-08-04T18:40:30.737Z] !ENTRY org.eclipse.tracecompass.ctf.core 2 0 2020-08-04 18:40:27.304
14:40:30 [2020-08-04T18:40:30.737Z] !MESSAGE Unknown trace attribute: test3
14:40:30 [2020-08-04T18:40:30.737Z] 
14:40:30 [2020-08-04T18:40:30.737Z] !ENTRY org.eclipse.tracecompass.ctf.core 2 0 2020-08-04 18:40:27.305
14:40:30 [2020-08-04T18:40:30.737Z] !MESSAGE Unknown trace attribute: test4
14:40:30 [2020-08-04T18:40:30.737Z] Tests run: 5, Failures: 0, Errors: 0, Skipped: 0, Time elapsed: 0.044 s - in org.eclipse.tracecompass.tmf.ctf.core.tests.trace.CtfTmfTraceValidateTest
14:40:30 [2020-08-04T18:40:30.737Z] testValidate[0: ../org.eclipse.tracecompass.ctf.core.tests/traces/ctf-testsuite/tests/1.8/regression/metadata/pass/literal-integers]  Time elapsed: 0.005 s
14:40:30 [2020-08-04T18:40:30.737Z] testValidate[1: /home/jenkins/agent/workspace/tracecompass-master-jdk11/ctf/org.eclipse.tracecompass.tmf.ctf.core.tests/target/work/configuration/org.eclipse.osgi/226/0/.cp/kernel]  Time elapsed: 0.035 s
14:40:30 [2020-08-04T18:40:30.737Z] testValidate[2: ../org.eclipse.tracecompass.ctf.core.tests/traces/ctf-testsuite/tests/1.8/regression/metadata/fail/enum-empty]  Time elapsed: 0.002 s
14:40:30 [2020-08-04T18:40:30.737Z] testValidate[3: ../org.eclipse.tracecompass.ctf.core.tests/traces/ctf-testsuite/tests/1.8/regression/metadata/fail/lttng-modules-2.0-pre1]  Time elapsed: 0.001 s
14:40:30 [2020-08-04T18:40:30.737Z] testValidate[4: ../org.eclipse.tracecompass.ctf.core.tests/traces/synctraces.tar.gz]  Time elapsed: 0 s
14:40:30 [2020-08-04T18:40:30.737Z] Running org.eclipse.tracecompass.tmf.ctf.core.tests.trace.CtfTmfReadBoundsTest
14:40:30 [2020-08-04T18:40:30.737Z] Tests run: 2, Failures: 0, Errors: 0, Skipped: 0, Time elapsed: 0.253 s - in org.eclipse.tracecompass.tmf.ctf.core.tests.trace.CtfTmfReadBoundsTest
14:40:30 [2020-08-04T18:40:30.737Z] testRapidBoundsWithTransform  Time elapsed: 0.179 s
14:40:30 [2020-08-04T18:40:30.737Z] testRapidBounds  Time elapsed: 0.074 s
14:40:30 [2020-08-04T18:40:30.737Z] Running org.eclipse.tracecompass.tmf.ctf.core.tests.trace.CtfTmfTraceTest
14:40:30 [2020-08-04T18:40:30.737Z] Tests run: 31, Failures: 0, Errors: 0, Skipped: 0, Time elapsed: 0.045 s - in org.eclipse.tracecompass.tmf.ctf.core.tests.trace.CtfTmfTraceTest
14:40:30 [2020-08-04T18:40:30.737Z] testCtfTmfTrace  Time elapsed: 0 s
14:40:30 [2020-08-04T18:40:30.737Z] testSeekEvent_timestamp  Time elapsed: 0 s
14:40:30 [2020-08-04T18:40:30.737Z] testSeekEventLoc_timetamp  Time elapsed: 0 s
14:40:30 [2020-08-04T18:40:30.737Z] testParseEvent  Time elapsed: 0.001 s
14:40:30 [2020-08-04T18:40:30.737Z] testGetEndTime  Time elapsed: 0 s
14:40:30 [2020-08-04T18:40:30.737Z] testGetNbEvents  Time elapsed: 0 s
14:40:30 [2020-08-04T18:40:30.737Z] testSeekEventLoc_null  Time elapsed: 0 s
14:40:30 [2020-08-04T18:40:30.737Z] testGetStartTime  Time elapsed: 0 s
14:40:30 [2020-08-04T18:40:30.737Z] testBroadcast  Time elapsed: 0 s
14:40:30 [2020-08-04T18:40:30.737Z] testEventLookup  Time elapsed: 0.001 s
14:40:30 [2020-08-04T18:40:30.737Z] testValidate  Time elapsed: 0.019 s
14:40:30 [2020-08-04T18:40:30.737Z] testGetEnvValue  Time elapsed: 0 s
14:40:30 [2020-08-04T18:40:30.737Z] testGetName  Time elapsed: 0 s
14:40:30 [2020-08-04T18:40:30.737Z] testGetNext  Time elapsed: 0 s
14:40:30 [2020-08-04T18:40:30.737Z] testGetPath  Time elapsed: 0 s
14:40:30 [2020-08-04T18:40:30.737Z] testGetStreamingInterval  Time elapsed: 0 s
14:40:30 [2020-08-04T18:40:30.737Z] testGetContainedEventTypes  Time elapsed: 0.001 s
14:40:30 [2020-08-04T18:40:30.737Z] testGetLocationRatio  Time elapsed: 0 s
14:40:30 [2020-08-04T18:40:30.737Z] testGetCacheSize  Time elapsed: 0 s
14:40:30 [2020-08-04T18:40:30.737Z] testGetTraceProperties  Time elapsed: 0 s
14:40:30 [2020-08-04T18:40:30.737Z] testCtfHostId  Time elapsed: 0 s
14:40:30 [2020-08-04T18:40:30.737Z] testSeekEvent_rank  Time elapsed: 0 s
14:40:30 [2020-08-04T18:40:30.737Z] testGetTimeRange  Time elapsed: 0.001 s
14:40:30 [2020-08-04T18:40:30.737Z] testGetEventType  Time elapsed: 0 s
14:40:30 [2020-08-04T18:40:30.737Z] testSeekEvent_ratio  Time elapsed: 0 s
14:40:30 [2020-08-04T18:40:30.737Z] testGetResource  Time elapsed: 0 s
14:40:30 [2020-08-04T18:40:30.737Z] testSeekEvent_location  Time elapsed: 0 s
14:40:30 [2020-08-04T18:40:30.737Z] testReadNextEvent  Time elapsed: 0 s
14:40:30 [2020-08-04T18:40:30.737Z] testDispose  Time elapsed: 0 s
14:40:30 [2020-08-04T18:40:30.737Z] testSeekEventInvalidLocation  Time elapsed: 0 s
14:40:30 [2020-08-04T18:40:30.737Z] testGetCurrentLocation  Time elapsed: 0 s
14:40:30 [2020-08-04T18:40:30.737Z] Running org.eclipse.tracecompass.tmf.ctf.core.tests.trace.FunkyTraceTest
14:40:30 [2020-08-04T18:40:30.737Z] Tests run: 4, Failures: 0, Errors: 0, Skipped: 0, Time elapsed: 1.514 s - in org.eclipse.tracecompass.tmf.ctf.core.tests.trace.FunkyTraceTest
14:40:30 [2020-08-04T18:40:30.737Z] testSecondToLastEvent  Time elapsed: 0.055 s
14:40:30 [2020-08-04T18:40:30.737Z] testLastEvent  Time elapsed: 0.098 s
14:40:30 [2020-08-04T18:40:30.737Z] testFirstEvent  Time elapsed: 0.055 s
14:40:30 [2020-08-04T18:40:30.737Z] testSecondEvent  Time elapsed: 0.101 s
14:40:30 [2020-08-04T18:40:30.737Z] Running org.eclipse.tracecompass.tmf.ctf.core.tests.trace.TmfTraceUtilsSearchingTest
14:40:33 [2020-08-04T18:40:33.255Z] Tests run: 12, Failures: 0, Errors: 0, Skipped: 0, Time elapsed: 3.708 s - in org.eclipse.tracecompass.tmf.ctf.core.tests.trace.TmfTraceUtilsSearchingTest
14:40:33 [2020-08-04T18:40:33.255Z] testPreviousMatchingEventStartMatches  Time elapsed: 0.272 s
14:40:33 [2020-08-04T18:40:33.255Z] testPreviousMatchingEventProgressMonitor  Time elapsed: 0.301 s
14:40:33 [2020-08-04T18:40:33.255Z] testNextMatchingEventStartMatches  Time elapsed: 0.299 s
14:40:33 [2020-08-04T18:40:33.255Z] testPreviousMatchingEvent  Time elapsed: 0.301 s
14:40:33 [2020-08-04T18:40:33.255Z] testNextMatchingEventProgressMonitor  Time elapsed: 0.301 s
14:40:33 [2020-08-04T18:40:33.255Z] testPreviousMatchingEventFar  Time elapsed: 0.3 s
14:40:33 [2020-08-04T18:40:33.255Z] testNextMatchingEventCancelled  Time elapsed: 0.001 s
14:40:33 [2020-08-04T18:40:33.255Z] testPreviousMatchingBeginningOfTrace  Time elapsed: 0.6 s
14:40:33 [2020-08-04T18:40:33.255Z] testPreviousMatchingEventNoMatch  Time elapsed: 0.301 s
14:40:33 [2020-08-04T18:40:33.255Z] testNextMatchingEventNoMatch  Time elapsed: 0.699 s
14:40:33 [2020-08-04T18:40:33.255Z] testNextMatchingEvent  Time elapsed: 0.301 s
14:40:33 [2020-08-04T18:40:33.255Z] testPreviousMatchingEventCancelled  Time elapsed: 0 s
14:40:33 [2020-08-04T18:40:33.255Z] Running org.eclipse.tracecompass.tmf.ctf.core.tests.trace.indexer.CtfExperimentCheckpointIndexTest
14:40:39 [2020-08-04T18:40:39.876Z] Tests run: 2, Failures: 0, Errors: 0, Skipped: 0, Time elapsed: 6.18 s - in org.eclipse.tracecompass.tmf.ctf.core.tests.trace.indexer.CtfExperimentCheckpointIndexTest
14:40:39 [2020-08-04T18:40:39.876Z] testReopenIndex  Time elapsed: 3.692 s
14:40:39 [2020-08-04T18:40:39.876Z] testIndexing  Time elapsed: 2.487 s
14:40:39 [2020-08-04T18:40:39.876Z] Running org.eclipse.tracecompass.tmf.ctf.core.tests.trim.CtfTmfTraceTrimmingTest
14:42:46 [2020-08-04T18:42:46.276Z] Tests run: 26, Failures: 0, Errors: 0, Skipped: 0, Time elapsed: 113.843 s - in org.eclipse.tracecompass.tmf.ctf.core.tests.trim.CtfTmfTraceTrimmingTest
14:42:46 [2020-08-04T18:42:46.276Z] testTrimEvents[0: KERNEL]  Time elapsed: 10.676 s
14:42:46 [2020-08-04T18:42:46.276Z] testTrimEvents[1: TRACE2]  Time elapsed: 7.511 s
14:42:46 [2020-08-04T18:42:46.276Z] testTrimEvents[2: KERNEL_VM]  Time elapsed: 9.439 s
14:42:46 [2020-08-04T18:42:46.276Z] testTrimEvents[3: SYNC_SRC]  Time elapsed: 2.767 s
14:42:46 [2020-08-04T18:42:46.276Z] testTrimEvents[4: SYNC_DEST]  Time elapsed: 2.726 s
14:42:46 [2020-08-04T18:42:46.276Z] testTrimEvents[5: DJANGO_CLIENT]  Time elapsed: 9.435 s
14:42:46 [2020-08-04T18:42:46.276Z] testTrimEvents[6: DJANGO_DB]  Time elapsed: 8.783 s
14:42:46 [2020-08-04T18:42:46.276Z] testTrimEvents[7: DJANGO_HTTPD]  Time elapsed: 9.205 s
14:42:46 [2020-08-04T18:42:46.276Z] testTrimEvents[8: CYG_PROFILE]  Time elapsed: 2.174 s
14:42:46 [2020-08-04T18:42:46.276Z] testTrimEvents[9: CYG_PROFILE_FAST]  Time elapsed: 2.15 s
14:42:46 [2020-08-04T18:42:46.276Z] testTrimEvents[10: FUNKY_TRACE]  Time elapsed: 2.058 s
14:42:46 [2020-08-04T18:42:46.276Z] testTrimEvents[11: ARM_64_BIT_HEADER]  Time elapsed: 2.713 s
14:42:46 [2020-08-04T18:42:46.276Z] testTrimEvents[12: FLIPPING_ENDIANNESS]  Time elapsed: 2.17 s
14:42:46 [2020-08-04T18:42:46.276Z] testTrimEvents[13: DYNSCOPE]  Time elapsed: 2.503 s
14:42:46 [2020-08-04T18:42:46.276Z] testTrimEvents[14: DEBUG_INFO]  Time elapsed: 2.217 s
14:42:46 [2020-08-04T18:42:46.276Z] testTrimEvents[15: DEBUG_INFO3]  Time elapsed: 2.218 s
14:42:46 [2020-08-04T18:42:46.276Z] testTrimEvents[16: DEBUG_INFO4]  Time elapsed: 2.215 s
14:42:46 [2020-08-04T18:42:46.276Z] testTrimEvents[17: DEBUG_INFO_SYNTH_EXEC]  Time elapsed: 2.112 s
14:42:46 [2020-08-04T18:42:46.276Z] testTrimEvents[18: DEBUG_INFO_SYNTH_TWO_PROCESSES]  Time elapsed: 2.012 s
14:42:46 [2020-08-04T18:42:46.276Z] testTrimEvents[19: DEBUG_INFO_SYNTH_BUILDID_DEBUGLINK]  Time elapsed: 2.113 s
14:42:46 [2020-08-04T18:42:46.276Z] testTrimEvents[20: MEMORY_ANALYSIS]  Time elapsed: 4.949 s
14:42:46 [2020-08-04T18:42:46.276Z] testTrimEvents[21: PERF_TASKSET2]  Time elapsed: 2.231 s
14:42:46 [2020-08-04T18:42:46.276Z] testTrimEvents[22: MANY_THREADS]  Time elapsed: 4.218 s
14:42:46 [2020-08-04T18:42:46.276Z] testTrimEvents[23: CONTEXT_SWITCHES_KERNEL]  Time elapsed: 4.777 s
14:42:46 [2020-08-04T18:42:46.276Z] testTrimEvents[24: CONTEXT_SWITCHES_UST]  Time elapsed: 2.135 s
14:42:46 [2020-08-04T18:42:46.276Z] testTrimEvents[25: UNEVEN_STREAMS]  Time elapsed: 8.335 s
14:42:46 [2020-08-04T18:42:46.276Z] Running org.eclipse.tracecompass.tmf.ctf.core.tests.iterator.CtfIteratorTest
14:42:46 [2020-08-04T18:42:46.276Z] Tests run: 17, Failures: 0, Errors: 0, Skipped: 0, Time elapsed: 0.496 s - in org.eclipse.tracecompass.tmf.ctf.core.tests.iterator.CtfIteratorTest
14:42:46 [2020-08-04T18:42:46.276Z] testEqualsEmpty  Time elapsed: 0.016 s
14:42:46 [2020-08-04T18:42:46.276Z] testEqualsOther  Time elapsed: 0.033 s
14:42:46 [2020-08-04T18:42:46.276Z] testAdvance  Time elapsed: 0.017 s
14:42:46 [2020-08-04T18:42:46.276Z] testGetCurrentEvent  Time elapsed: 0.016 s
14:42:46 [2020-08-04T18:42:46.276Z] testIncreaseRank  Time elapsed: 0.016 s
14:42:46 [2020-08-04T18:42:46.276Z] testHasValidRank  Time elapsed: 0.055 s
14:42:46 [2020-08-04T18:42:46.276Z] testSeek  Time elapsed: 0.047 s
14:42:46 [2020-08-04T18:42:46.276Z] testSetLocation  Time elapsed: 0.056 s
14:42:46 [2020-08-04T18:42:46.276Z] testGetLocation  Time elapsed: 0.025 s
14:42:46 [2020-08-04T18:42:46.276Z] testCompareTo  Time elapsed: 0.017 s
14:42:46 [2020-08-04T18:42:46.276Z] testGetRank  Time elapsed: 0.062 s
14:42:46 [2020-08-04T18:42:46.276Z] testHashCode  Time elapsed: 0.015 s
14:42:46 [2020-08-04T18:42:46.276Z] testGetCtfTmfTrace  Time elapsed: 0.015 s
14:42:46 [2020-08-04T18:42:46.276Z] testCtfIteratorPosition  Time elapsed: 0.015 s
14:42:46 [2020-08-04T18:42:46.276Z] testCtfIteratorInit  Time elapsed: 0.056 s
14:42:46 [2020-08-04T18:42:46.276Z] testSetRank  Time elapsed: 0.017 s
14:42:46 [2020-08-04T18:42:46.276Z] testCtfIteratorNoinit  Time elapsed: 0.016 s
14:42:46 [2020-08-04T18:42:46.276Z] Running org.eclipse.tracecompass.tmf.core.tests.histogram.dataprovider.HistogramDataProviderTest
14:42:46 [2020-08-04T18:42:46.276Z] Tests run: 1, Failures: 0, Errors: 0, Skipped: 0, Time elapsed: 0.103 s - in org.eclipse.tracecompass.tmf.core.tests.histogram.dataprovider.HistogramDataProviderTest
14:42:46 [2020-08-04T18:42:46.276Z] testHelloLost  Time elapsed: 0.103 s
14:42:46 [2020-08-04T18:42:46.276Z] 
14:42:46 [2020-08-04T18:42:46.276Z] Results:
14:42:46 [2020-08-04T18:42:46.276Z] 
14:42:46 [2020-08-04T18:42:46.276Z] Tests run: 229, Failures: 0, Errors: 0, Skipped: 1
14:42:46 [2020-08-04T18:42:46.276Z] 
14:42:46 [2020-08-04T18:42:46.276Z] [INFO] All tests passed!
14:42:46 [2020-08-04T18:42:46.276Z] [INFO] 
14:42:46 [2020-08-04T18:42:46.276Z] [INFO] --- maven-install-plugin:2.5.2:install (default-install) @ org.eclipse.tracecompass.tmf.ctf.core.tests ---
14:42:46 [2020-08-04T18:42:46.276Z] [INFO] Installing /home/jenkins/agent/workspace/tracecompass-master-jdk11/ctf/org.eclipse.tracecompass.tmf.ctf.core.tests/target/org.eclipse.tracecompass.tmf.ctf.core.tests-1.0.11-SNAPSHOT.jar to /home/jenkins/.m2/repository/org/eclipse/tracecompass/org.eclipse.tracecompass.tmf.ctf.core.tests/1.0.11-SNAPSHOT/org.eclipse.tracecompass.tmf.ctf.core.tests-1.0.11-SNAPSHOT.jar
14:42:46 [2020-08-04T18:42:46.276Z] [INFO] Installing /home/jenkins/agent/workspace/tracecompass-master-jdk11/ctf/org.eclipse.tracecompass.tmf.ctf.core.tests/pom.xml to /home/jenkins/.m2/repository/org/eclipse/tracecompass/org.eclipse.tracecompass.tmf.ctf.core.tests/1.0.11-SNAPSHOT/org.eclipse.tracecompass.tmf.ctf.core.tests-1.0.11-SNAPSHOT.pom
14:42:46 [2020-08-04T18:42:46.276Z] [INFO] Installing /home/jenkins/agent/workspace/tracecompass-master-jdk11/ctf/org.eclipse.tracecompass.tmf.ctf.core.tests/target/org.eclipse.tracecompass.tmf.ctf.core.tests-1.0.11-SNAPSHOT-sources.jar to /home/jenkins/.m2/repository/org/eclipse/tracecompass/org.eclipse.tracecompass.tmf.ctf.core.tests/1.0.11-SNAPSHOT/org.eclipse.tracecompass.tmf.ctf.core.tests-1.0.11-SNAPSHOT-sources.jar
14:42:46 [2020-08-04T18:42:46.277Z] [INFO] Installing /home/jenkins/agent/workspace/tracecompass-master-jdk11/ctf/org.eclipse.tracecompass.tmf.ctf.core.tests/target/org.eclipse.tracecompass.tmf.ctf.core.tests-1.0.11-SNAPSHOT.jar.pack.gz to /home/jenkins/.m2/repository/org/eclipse/tracecompass/org.eclipse.tracecompass.tmf.ctf.core.tests/1.0.11-SNAPSHOT/org.eclipse.tracecompass.tmf.ctf.core.tests-1.0.11-SNAPSHOT-pack200.jar.pack.gz
14:42:46 [2020-08-04T18:42:46.277Z] [INFO] Installing /home/jenkins/agent/workspace/tracecompass-master-jdk11/ctf/org.eclipse.tracecompass.tmf.ctf.core.tests/target/p2content.xml to /home/jenkins/.m2/repository/org/eclipse/tracecompass/org.eclipse.tracecompass.tmf.ctf.core.tests/1.0.11-SNAPSHOT/org.eclipse.tracecompass.tmf.ctf.core.tests-1.0.11-SNAPSHOT-p2metadata.xml
14:42:46 [2020-08-04T18:42:46.277Z] [INFO] Installing /home/jenkins/agent/workspace/tracecompass-master-jdk11/ctf/org.eclipse.tracecompass.tmf.ctf.core.tests/target/p2artifacts.xml to /home/jenkins/.m2/repository/org/eclipse/tracecompass/org.eclipse.tracecompass.tmf.ctf.core.tests/1.0.11-SNAPSHOT/org.eclipse.tracecompass.tmf.ctf.core.tests-1.0.11-SNAPSHOT-p2artifacts.xml
14:42:46 [2020-08-04T18:42:46.277Z] [INFO] 
14:42:46 [2020-08-04T18:42:46.277Z] [INFO] --- tycho-p2-plugin:2.0.0-SNAPSHOT:update-local-index (default-update-local-index) @ org.eclipse.tracecompass.tmf.ctf.core.tests ---
14:42:46 [2020-08-04T18:42:46.277Z] [INFO] 
14:42:46 [2020-08-04T18:42:46.277Z] [INFO] --< org.eclipse.tracecompass:org.eclipse.tracecompass.analysis.counters.core.tests >--
14:42:46 [2020-08-04T18:42:46.277Z] [INFO] Building org.eclipse.tracecompass.analysis.counters.core.tests 1.0.0-SNAPSHOT [21/138]
14:42:46 [2020-08-04T18:42:46.277Z] [INFO] ------------------------[ eclipse-test-plugin ]-------------------------
14:42:46 [2020-08-04T18:42:46.277Z] [INFO] 
14:42:46 [2020-08-04T18:42:46.277Z] [INFO] --- maven-clean-plugin:3.0.0:clean (default-clean) @ org.eclipse.tracecompass.analysis.counters.core.tests ---
14:42:46 [2020-08-04T18:42:46.277Z] [INFO] 
14:42:46 [2020-08-04T18:42:46.277Z] [INFO] --- tycho-packaging-plugin:2.0.0-SNAPSHOT:build-qualifier (default-build-qualifier) @ org.eclipse.tracecompass.analysis.counters.core.tests ---
14:42:46 [2020-08-04T18:42:46.277Z] [INFO] The project's OSGi version is 1.0.0.202008041825
14:42:46 [2020-08-04T18:42:46.277Z] [INFO] 
14:42:46 [2020-08-04T18:42:46.277Z] [INFO] --- tycho-packaging-plugin:2.0.0-SNAPSHOT:validate-id (default-validate-id) @ org.eclipse.tracecompass.analysis.counters.core.tests ---
14:42:46 [2020-08-04T18:42:46.277Z] [INFO] 
14:42:46 [2020-08-04T18:42:46.277Z] [INFO] --- tycho-packaging-plugin:2.0.0-SNAPSHOT:validate-version (default-validate-version) @ org.eclipse.tracecompass.analysis.counters.core.tests ---
14:42:46 [2020-08-04T18:42:46.277Z] [INFO] 
14:42:46 [2020-08-04T18:42:46.277Z] [INFO] --- maven-enforcer-plugin:1.4.1:enforce (enforce-maven-version) @ org.eclipse.tracecompass.analysis.counters.core.tests ---
14:42:46 [2020-08-04T18:42:46.277Z] [INFO] 
14:42:46 [2020-08-04T18:42:46.277Z] [INFO] --- maven-resources-plugin:3.0.2:resources (default-resources) @ org.eclipse.tracecompass.analysis.counters.core.tests ---
14:42:46 [2020-08-04T18:42:46.277Z] [INFO] Using 'UTF-8' encoding to copy filtered resources.
14:42:46 [2020-08-04T18:42:46.277Z] [INFO] skip non existing resourceDirectory /home/jenkins/agent/workspace/tracecompass-master-jdk11/analysis/org.eclipse.tracecompass.analysis.counters.core.tests/src/main/resources
14:42:46 [2020-08-04T18:42:46.277Z] [INFO] 
14:42:46 [2020-08-04T18:42:46.277Z] [INFO] --- tycho-compiler-plugin:2.0.0-SNAPSHOT:compile (default-compile) @ org.eclipse.tracecompass.analysis.counters.core.tests ---
14:42:46 [2020-08-04T18:42:46.277Z] [WARNING] The effective compiler target level 11 is incompatible with the following OSGi execution environments: [JavaSE-1.8 (assumes 1.8)] @ MavenProject: org.eclipse.tracecompass:org.eclipse.tracecompass.analysis.counters.core.tests:1.0.0-SNAPSHOT @ /home/jenkins/agent/workspace/tracecompass-master-jdk11/analysis/org.eclipse.tracecompass.analysis.counters.core.tests/pom.xml
14:42:46 [2020-08-04T18:42:46.277Z] [INFO] Compiling 2 source files to /home/jenkins/agent/workspace/tracecompass-master-jdk11/analysis/org.eclipse.tracecompass.analysis.counters.core.tests/target/classes
14:42:46 [2020-08-04T18:42:46.277Z] [INFO] 
14:42:46 [2020-08-04T18:42:46.277Z] [INFO] --- maven-resources-plugin:3.0.2:testResources (default-testResources) @ org.eclipse.tracecompass.analysis.counters.core.tests ---
14:42:46 [2020-08-04T18:42:46.277Z] [INFO] Using 'UTF-8' encoding to copy filtered resources.
14:42:46 [2020-08-04T18:42:46.277Z] [INFO] skip non existing resourceDirectory /home/jenkins/agent/workspace/tracecompass-master-jdk11/analysis/org.eclipse.tracecompass.analysis.counters.core.tests/src/test/resources
14:42:46 [2020-08-04T18:42:46.277Z] [INFO] 
14:42:46 [2020-08-04T18:42:46.277Z] [INFO] --- tycho-source-plugin:2.0.0-SNAPSHOT:plugin-source (plugin-source) @ org.eclipse.tracecompass.analysis.counters.core.tests ---
14:42:46 [2020-08-04T18:42:46.277Z] [INFO] Building jar: /home/jenkins/agent/workspace/tracecompass-master-jdk11/analysis/org.eclipse.tracecompass.analysis.counters.core.tests/target/org.eclipse.tracecompass.analysis.counters.core.tests-1.0.0-SNAPSHOT-sources.jar
14:42:46 [2020-08-04T18:42:46.277Z] [INFO] 
14:42:46 [2020-08-04T18:42:46.277Z] [INFO] --- target-platform-configuration:2.0.0-SNAPSHOT:target-platform (default-target-platform) @ org.eclipse.tracecompass.analysis.counters.core.tests ---
14:42:46 [2020-08-04T18:42:46.277Z] [INFO] 
14:42:46 [2020-08-04T18:42:46.277Z] [INFO] --- tycho-packaging-plugin:2.0.0-SNAPSHOT:package-plugin (default-package-plugin) @ org.eclipse.tracecompass.analysis.counters.core.tests ---
14:42:46 [2020-08-04T18:42:46.277Z] [INFO] Building jar: /home/jenkins/agent/workspace/tracecompass-master-jdk11/analysis/org.eclipse.tracecompass.analysis.counters.core.tests/target/org.eclipse.tracecompass.analysis.counters.core.tests-1.0.0-SNAPSHOT.jar
14:42:46 [2020-08-04T18:42:46.277Z] [INFO] 
14:42:46 [2020-08-04T18:42:46.277Z] [INFO] --- tycho-p2-plugin:2.0.0-SNAPSHOT:p2-metadata-default (default-p2-metadata-default) @ org.eclipse.tracecompass.analysis.counters.core.tests ---
14:42:46 [2020-08-04T18:42:46.277Z] [INFO] 
14:42:46 [2020-08-04T18:42:46.277Z] [INFO] --- tycho-source-feature-plugin:2.0.0-SNAPSHOT:source-feature (source-feature) @ org.eclipse.tracecompass.analysis.counters.core.tests ---
14:42:46 [2020-08-04T18:42:46.277Z] [INFO] 
14:42:46 [2020-08-04T18:42:46.277Z] [INFO] --- tycho-pack200a-plugin:2.0.0-SNAPSHOT:normalize (pack200-normalize) @ org.eclipse.tracecompass.analysis.counters.core.tests ---
14:42:46 [2020-08-04T18:42:46.277Z] [INFO] Pack200 normalizing jar /home/jenkins/agent/workspace/tracecompass-master-jdk11/analysis/org.eclipse.tracecompass.analysis.counters.core.tests/target/org.eclipse.tracecompass.analysis.counters.core.tests-1.0.0-SNAPSHOT.jar
14:42:46 [2020-08-04T18:42:46.277Z] [INFO] 
14:42:46 [2020-08-04T18:42:46.277Z] [INFO] --- eclipse-jarsigner-plugin:1.1.3:sign (sign) @ org.eclipse.tracecompass.analysis.counters.core.tests ---
14:42:46 [2020-08-04T18:42:46.277Z] [INFO] Signing jar: /home/jenkins/agent/workspace/tracecompass-master-jdk11/analysis/org.eclipse.tracecompass.analysis.counters.core.tests/target/org.eclipse.tracecompass.analysis.counters.core.tests-1.0.0-SNAPSHOT.jar
14:42:46 [2020-08-04T18:42:46.277Z] [INFO] Signing jar: /home/jenkins/agent/workspace/tracecompass-master-jdk11/analysis/org.eclipse.tracecompass.analysis.counters.core.tests/target/org.eclipse.tracecompass.analysis.counters.core.tests-1.0.0-SNAPSHOT-sources.jar
14:42:46 [2020-08-04T18:42:46.277Z] [INFO] 
14:42:46 [2020-08-04T18:42:46.277Z] [INFO] --- tycho-pack200b-plugin:2.0.0-SNAPSHOT:pack (pack200-pack) @ org.eclipse.tracecompass.analysis.counters.core.tests ---
14:42:46 [2020-08-04T18:42:46.277Z] [INFO] Pack200 packing jar /home/jenkins/agent/workspace/tracecompass-master-jdk11/analysis/org.eclipse.tracecompass.analysis.counters.core.tests/target/org.eclipse.tracecompass.analysis.counters.core.tests-1.0.0-SNAPSHOT.jar
14:42:46 [2020-08-04T18:42:46.277Z] [INFO] 
14:42:46 [2020-08-04T18:42:46.277Z] [INFO] --- tycho-p2-plugin:2.0.0-SNAPSHOT:p2-metadata (p2-metadata) @ org.eclipse.tracecompass.analysis.counters.core.tests ---
14:42:46 [2020-08-04T18:42:46.277Z] [INFO] 
14:42:46 [2020-08-04T18:42:46.277Z] [INFO] --- tycho-surefire-plugin:2.0.0-SNAPSHOT:test (default-test) @ org.eclipse.tracecompass.analysis.counters.core.tests ---
14:42:46 [2020-08-04T18:42:46.277Z] [INFO] Executing Test Runtime with timeout 0, logs (if any) will be placed at: /home/jenkins/agent/workspace/tracecompass-master-jdk11/analysis/org.eclipse.tracecompass.analysis.counters.core.tests/target/work/data/.metadata/.log
14:42:46 [2020-08-04T18:42:46.277Z] [INFO] Command line:
14:42:46 [2020-08-04T18:42:46.277Z] 	[/opt/tools/java/openjdk/jdk-11/11.0.2+9/bin/java, -Dosgi.noShutdown=false, -Dosgi.os=linux, -Dosgi.ws=gtk, -Dosgi.arch=x86_64, -Dorg.eclipse.swt.browser.DefaultType=mozilla, -Xms512m, -Xmx1024m, -Dosgi.clean=true, -jar, /home/jenkins/.m2/repository/p2/osgi/bundle/org.eclipse.equinox.launcher/1.5.700.v20200207-2156/org.eclipse.equinox.launcher-1.5.700.v20200207-2156.jar, -data, /home/jenkins/agent/workspace/tracecompass-master-jdk11/analysis/org.eclipse.tracecompass.analysis.counters.core.tests/target/work/data, -install, /home/jenkins/agent/workspace/tracecompass-master-jdk11/analysis/org.eclipse.tracecompass.analysis.counters.core.tests/target/work, -configuration, /home/jenkins/agent/workspace/tracecompass-master-jdk11/analysis/org.eclipse.tracecompass.analysis.counters.core.tests/target/work/configuration, -application, org.eclipse.tycho.surefire.osgibooter.headlesstest, -testproperties, /home/jenkins/agent/workspace/tracecompass-master-jdk11/analysis/org.eclipse.tracecompass.analysis.counters.core.tests/target/surefire.properties, -product, org.eclipse.platform.ide, -consoleLog]
14:42:46 [2020-08-04T18:42:46.277Z] Picked up _JAVA_OPTIONS: -Duser.home=/home/tracecompass
14:42:46 [2020-08-04T18:42:46.277Z] !SESSION 2020-08-04 18:42:37.250 -----------------------------------------------
14:42:46 [2020-08-04T18:42:46.277Z] eclipse.buildId=unknown
14:42:46 [2020-08-04T18:42:46.277Z] java.version=11.0.2
14:42:46 [2020-08-04T18:42:46.277Z] java.vendor=Oracle Corporation
14:42:46 [2020-08-04T18:42:46.277Z] BootLoader constants: OS=linux, ARCH=x86_64, WS=gtk, NL=en_US
14:42:46 [2020-08-04T18:42:46.277Z] Framework arguments:  -application org.eclipse.tycho.surefire.osgibooter.headlesstest -testproperties /home/jenkins/agent/workspace/tracecompass-master-jdk11/analysis/org.eclipse.tracecompass.analysis.counters.core.tests/target/surefire.properties -product org.eclipse.platform.ide
14:42:46 [2020-08-04T18:42:46.277Z] Command-line arguments:  -data /home/jenkins/agent/workspace/tracecompass-master-jdk11/analysis/org.eclipse.tracecompass.analysis.counters.core.tests/target/work/data -application org.eclipse.tycho.surefire.osgibooter.headlesstest -testproperties /home/jenkins/agent/workspace/tracecompass-master-jdk11/analysis/org.eclipse.tracecompass.analysis.counters.core.tests/target/surefire.properties -product org.eclipse.platform.ide -consoleLog
14:42:46 [2020-08-04T18:42:46.277Z] 
14:42:46 [2020-08-04T18:42:46.277Z] !ENTRY org.eclipse.compare.win32 4 0 2020-08-04 18:42:39.413
14:42:46 [2020-08-04T18:42:46.277Z] !MESSAGE FrameworkEvent ERROR
14:42:46 [2020-08-04T18:42:46.277Z] !STACK 0
14:42:46 [2020-08-04T18:42:46.277Z] org.osgi.framework.BundleException: Could not resolve module: org.eclipse.compare.win32 [62]
14:42:46 [2020-08-04T18:42:46.277Z]   Unresolved requirement: Require-Capability: eclipse.platform; filter:="(osgi.os=win32)"
14:42:46 [2020-08-04T18:42:46.277Z] 
14:42:46 [2020-08-04T18:42:46.277Z] 	at org.eclipse.osgi.container.Module.start(Module.java:463)
14:42:46 [2020-08-04T18:42:46.277Z] 	at org.eclipse.osgi.container.ModuleContainer$ContainerStartLevel$2.run(ModuleContainer.java:1845)
14:42:46 [2020-08-04T18:42:46.277Z] 	at org.eclipse.osgi.internal.framework.EquinoxContainerAdaptor$1$1.execute(EquinoxContainerAdaptor.java:136)
14:42:46 [2020-08-04T18:42:46.277Z] 	at org.eclipse.osgi.container.ModuleContainer$ContainerStartLevel.incStartLevel(ModuleContainer.java:1838)
14:42:46 [2020-08-04T18:42:46.277Z] 	at org.eclipse.osgi.container.ModuleContainer$ContainerStartLevel.incStartLevel(ModuleContainer.java:1779)
14:42:46 [2020-08-04T18:42:46.277Z] 	at org.eclipse.osgi.container.ModuleContainer$ContainerStartLevel.doContainerStartLevel(ModuleContainer.java:1743)
14:42:46 [2020-08-04T18:42:46.277Z] 	at org.eclipse.osgi.container.ModuleContainer$ContainerStartLevel.dispatchEvent(ModuleContainer.java:1665)
14:42:46 [2020-08-04T18:42:46.277Z] 	at org.eclipse.osgi.container.ModuleContainer$ContainerStartLevel.dispatchEvent(ModuleContainer.java:1)
14:42:46 [2020-08-04T18:42:46.277Z] 	at org.eclipse.osgi.framework.eventmgr.EventManager.dispatchEvent(EventManager.java:234)
14:42:46 [2020-08-04T18:42:46.277Z] 	at org.eclipse.osgi.framework.eventmgr.EventManager$EventThread.run(EventManager.java:345)
14:42:46 [2020-08-04T18:42:46.277Z] 
14:42:46 [2020-08-04T18:42:46.277Z] !ENTRY org.eclipse.ecf.provider.filetransfer.httpclient45.win32 4 0 2020-08-04 18:42:39.493
14:42:46 [2020-08-04T18:42:46.277Z] !MESSAGE FrameworkEvent ERROR
14:42:46 [2020-08-04T18:42:46.277Z] !STACK 0
14:42:46 [2020-08-04T18:42:46.278Z] org.osgi.framework.BundleException: Could not resolve module: org.eclipse.ecf.provider.filetransfer.httpclient45.win32 [134]
14:42:46 [2020-08-04T18:42:46.278Z]   Unresolved requirement: Require-Capability: eclipse.platform; filter:="(osgi.os=win32)"
14:42:46 [2020-08-04T18:42:46.278Z]   Unresolved requirement: Import-Package: org.apache.http.impl.auth.win; version="[4.5.0,5.0.0)"
14:42:46 [2020-08-04T18:42:46.278Z]     -> Export-Package: org.apache.http.impl.auth.win; bundle-symbolic-name="org.apache.httpcomponents.httpclient.win"; bundle-version="4.5.10.v20200113-2105"; version="4.5.10"; x-internal:="true"; uses:="org.apache.http,org.apache.http.auth,org.apache.http.client,org.apache.http.impl.auth,org.apache.http.protocol,org.apache.http.util"
14:42:46 [2020-08-04T18:42:46.278Z]        org.apache.httpcomponents.httpclient.win [35]
14:42:46 [2020-08-04T18:42:46.278Z]          Unresolved requirement: Require-Capability: eclipse.platform; filter:="(osgi.os=win32)"
14:42:46 [2020-08-04T18:42:46.278Z] 
14:42:46 [2020-08-04T18:42:46.278Z] 	at org.eclipse.osgi.container.Module.start(Module.java:463)
14:42:46 [2020-08-04T18:42:46.278Z] 	at org.eclipse.osgi.container.ModuleContainer$ContainerStartLevel$2.run(ModuleContainer.java:1845)
14:42:46 [2020-08-04T18:42:46.278Z] 	at org.eclipse.osgi.internal.framework.EquinoxContainerAdaptor$1$1.execute(EquinoxContainerAdaptor.java:136)
14:42:46 [2020-08-04T18:42:46.278Z] 	at org.eclipse.osgi.container.ModuleContainer$ContainerStartLevel.incStartLevel(ModuleContainer.java:1838)
14:42:46 [2020-08-04T18:42:46.278Z] 	at org.eclipse.osgi.container.ModuleContainer$ContainerStartLevel.incStartLevel(ModuleContainer.java:1779)
14:42:46 [2020-08-04T18:42:46.278Z] 	at org.eclipse.osgi.container.ModuleContainer$ContainerStartLevel.doContainerStartLevel(ModuleContainer.java:1743)
14:42:46 [2020-08-04T18:42:46.278Z] 	at org.eclipse.osgi.container.ModuleContainer$ContainerStartLevel.dispatchEvent(ModuleContainer.java:1665)
14:42:46 [2020-08-04T18:42:46.278Z] 	at org.eclipse.osgi.container.ModuleContainer$ContainerStartLevel.dispatchEvent(ModuleContainer.java:1)
14:42:46 [2020-08-04T18:42:46.278Z] 	at org.eclipse.osgi.framework.eventmgr.EventManager.dispatchEvent(EventManager.java:234)
14:42:46 [2020-08-04T18:42:46.278Z] 	at org.eclipse.osgi.framework.eventmgr.EventManager$EventThread.run(EventManager.java:345)
14:42:46 [2020-08-04T18:42:46.278Z] Running org.eclipse.tracecompass.analysis.counters.core.tests.CounterStateProviderTest
14:42:46 [2020-08-04T18:42:46.278Z] Tests run: 2, Failures: 0, Errors: 0, Skipped: 0, Time elapsed: 0.229 s - in org.eclipse.tracecompass.analysis.counters.core.tests.CounterStateProviderTest
14:42:46 [2020-08-04T18:42:46.278Z] testEventHandle  Time elapsed: 0.215 s
14:42:46 [2020-08-04T18:42:46.278Z] testGetNewInstance  Time elapsed: 0.008 s
14:42:46 [2020-08-04T18:42:46.278Z] Running org.eclipse.tracecompass.analysis.counters.core.tests.CounterAnalysisTest
14:42:46 [2020-08-04T18:42:46.278Z] Tests run: 1, Failures: 0, Errors: 0, Skipped: 0, Time elapsed: 0.005 s - in org.eclipse.tracecompass.analysis.counters.core.tests.CounterAnalysisTest
14:42:46 [2020-08-04T18:42:46.278Z] testCanExecute  Time elapsed: 0.004 s
14:42:46 [2020-08-04T18:42:46.278Z] 
14:42:46 [2020-08-04T18:42:46.278Z] Results:
14:42:46 [2020-08-04T18:42:46.278Z] 
14:42:46 [2020-08-04T18:42:46.278Z] Tests run: 3, Failures: 0, Errors: 0, Skipped: 0
14:42:46 [2020-08-04T18:42:46.278Z] 
14:42:46 [2020-08-04T18:42:46.278Z] [INFO] All tests passed!
14:42:46 [2020-08-04T18:42:46.278Z] [INFO] 
14:42:46 [2020-08-04T18:42:46.278Z] [INFO] --- maven-install-plugin:2.5.2:install (default-install) @ org.eclipse.tracecompass.analysis.counters.core.tests ---
14:42:46 [2020-08-04T18:42:46.278Z] [INFO] Installing /home/jenkins/agent/workspace/tracecompass-master-jdk11/analysis/org.eclipse.tracecompass.analysis.counters.core.tests/target/org.eclipse.tracecompass.analysis.counters.core.tests-1.0.0-SNAPSHOT.jar to /home/jenkins/.m2/repository/org/eclipse/tracecompass/org.eclipse.tracecompass.analysis.counters.core.tests/1.0.0-SNAPSHOT/org.eclipse.tracecompass.analysis.counters.core.tests-1.0.0-SNAPSHOT.jar
14:42:46 [2020-08-04T18:42:46.278Z] [INFO] Installing /home/jenkins/agent/workspace/tracecompass-master-jdk11/analysis/org.eclipse.tracecompass.analysis.counters.core.tests/pom.xml to /home/jenkins/.m2/repository/org/eclipse/tracecompass/org.eclipse.tracecompass.analysis.counters.core.tests/1.0.0-SNAPSHOT/org.eclipse.tracecompass.analysis.counters.core.tests-1.0.0-SNAPSHOT.pom
14:42:46 [2020-08-04T18:42:46.278Z] [INFO] Installing /home/jenkins/agent/workspace/tracecompass-master-jdk11/analysis/org.eclipse.tracecompass.analysis.counters.core.tests/target/org.eclipse.tracecompass.analysis.counters.core.tests-1.0.0-SNAPSHOT-sources.jar to /home/jenkins/.m2/repository/org/eclipse/tracecompass/org.eclipse.tracecompass.analysis.counters.core.tests/1.0.0-SNAPSHOT/org.eclipse.tracecompass.analysis.counters.core.tests-1.0.0-SNAPSHOT-sources.jar
14:42:46 [2020-08-04T18:42:46.278Z] [INFO] Installing /home/jenkins/agent/workspace/tracecompass-master-jdk11/analysis/org.eclipse.tracecompass.analysis.counters.core.tests/target/org.eclipse.tracecompass.analysis.counters.core.tests-1.0.0-SNAPSHOT.jar.pack.gz to /home/jenkins/.m2/repository/org/eclipse/tracecompass/org.eclipse.tracecompass.analysis.counters.core.tests/1.0.0-SNAPSHOT/org.eclipse.tracecompass.analysis.counters.core.tests-1.0.0-SNAPSHOT-pack200.jar.pack.gz
14:42:46 [2020-08-04T18:42:46.278Z] [INFO] Installing /home/jenkins/agent/workspace/tracecompass-master-jdk11/analysis/org.eclipse.tracecompass.analysis.counters.core.tests/target/p2content.xml to /home/jenkins/.m2/repository/org/eclipse/tracecompass/org.eclipse.tracecompass.analysis.counters.core.tests/1.0.0-SNAPSHOT/org.eclipse.tracecompass.analysis.counters.core.tests-1.0.0-SNAPSHOT-p2metadata.xml
14:42:46 [2020-08-04T18:42:46.278Z] [INFO] Installing /home/jenkins/agent/workspace/tracecompass-master-jdk11/analysis/org.eclipse.tracecompass.analysis.counters.core.tests/target/p2artifacts.xml to /home/jenkins/.m2/repository/org/eclipse/tracecompass/org.eclipse.tracecompass.analysis.counters.core.tests/1.0.0-SNAPSHOT/org.eclipse.tracecompass.analysis.counters.core.tests-1.0.0-SNAPSHOT-p2artifacts.xml
14:42:46 [2020-08-04T18:42:46.278Z] [INFO] 
14:42:46 [2020-08-04T18:42:46.278Z] [INFO] --- tycho-p2-plugin:2.0.0-SNAPSHOT:update-local-index (default-update-local-index) @ org.eclipse.tracecompass.analysis.counters.core.tests ---
14:42:46 [2020-08-04T18:42:46.278Z] [INFO] 
14:42:46 [2020-08-04T18:42:46.278Z] [INFO] ------< org.eclipse.tracecompass:org.eclipse.tracecompass.tmf.ui >------
14:42:46 [2020-08-04T18:42:46.278Z] [INFO] Building org.eclipse.tracecompass.tmf.ui 6.1.0-SNAPSHOT         [22/138]
14:42:46 [2020-08-04T18:42:46.278Z] [INFO] ---------------------------[ eclipse-plugin ]---------------------------
14:42:46 [2020-08-04T18:42:46.278Z] [INFO] 
14:42:46 [2020-08-04T18:42:46.278Z] [INFO] --- maven-clean-plugin:3.0.0:clean (default-clean) @ org.eclipse.tracecompass.tmf.ui ---
14:42:46 [2020-08-04T18:42:46.278Z] [INFO] 
14:42:46 [2020-08-04T18:42:46.278Z] [INFO] --- tycho-packaging-plugin:2.0.0-SNAPSHOT:build-qualifier (default-build-qualifier) @ org.eclipse.tracecompass.tmf.ui ---
14:42:46 [2020-08-04T18:42:46.278Z] [INFO] The project's OSGi version is 6.1.0.202008041825
14:42:46 [2020-08-04T18:42:46.278Z] [INFO] 
14:42:46 [2020-08-04T18:42:46.278Z] [INFO] --- tycho-packaging-plugin:2.0.0-SNAPSHOT:validate-id (default-validate-id) @ org.eclipse.tracecompass.tmf.ui ---
14:42:46 [2020-08-04T18:42:46.278Z] [INFO] 
14:42:46 [2020-08-04T18:42:46.278Z] [INFO] --- tycho-packaging-plugin:2.0.0-SNAPSHOT:validate-version (default-validate-version) @ org.eclipse.tracecompass.tmf.ui ---
14:42:46 [2020-08-04T18:42:46.278Z] [INFO] 
14:42:46 [2020-08-04T18:42:46.278Z] [INFO] --- maven-enforcer-plugin:1.4.1:enforce (enforce-maven-version) @ org.eclipse.tracecompass.tmf.ui ---
14:42:46 [2020-08-04T18:42:46.278Z] [INFO] 
14:42:46 [2020-08-04T18:42:46.278Z] [INFO] --- maven-antrun-plugin:1.8:run (fix-dark-theme-css) @ org.eclipse.tracecompass.tmf.ui ---
14:42:46 [2020-08-04T18:42:46.278Z] [INFO] Executing tasks
14:42:46 [2020-08-04T18:42:46.278Z] 
14:42:46 [2020-08-04T18:42:46.278Z] main:
14:42:46 [2020-08-04T18:42:46.278Z] 
14:42:46 [2020-08-04T18:42:46.278Z] main:
14:42:46 [2020-08-04T18:42:46.278Z] 
14:42:46 [2020-08-04T18:42:46.278Z] resetCSS:
14:42:46 [2020-08-04T18:42:46.278Z]      [echo] Setting default in org.eclipse.tracecompass.tmf.ui.dark.css
14:42:46 [2020-08-04T18:42:46.278Z] 
14:42:46 [2020-08-04T18:42:46.278Z] checkTargetPlatform:
14:42:46 [2020-08-04T18:42:46.278Z]      [echo] Verifying target platform: tracecompass-eStaging
14:42:46 [2020-08-04T18:42:46.278Z] 
14:42:46 [2020-08-04T18:42:46.278Z] fixCSS:
14:42:46 [2020-08-04T18:42:46.278Z]      [echo] Updating org.eclipse.tracecompass.tmf.ui.dark.css
14:42:46 [2020-08-04T18:42:46.278Z] [INFO] Executed tasks
14:42:46 [2020-08-04T18:42:46.278Z] [INFO] 
14:42:46 [2020-08-04T18:42:46.278Z] [INFO] --- maven-resources-plugin:3.0.2:resources (default-resources) @ org.eclipse.tracecompass.tmf.ui ---
14:42:46 [2020-08-04T18:42:46.278Z] [INFO] Using 'UTF-8' encoding to copy filtered resources.
14:42:46 [2020-08-04T18:42:46.278Z] [INFO] skip non existing resourceDirectory /home/jenkins/agent/workspace/tracecompass-master-jdk11/tmf/org.eclipse.tracecompass.tmf.ui/src/main/resources
14:42:46 [2020-08-04T18:42:46.278Z] [INFO] 
14:42:46 [2020-08-04T18:42:46.278Z] [INFO] --- tycho-compiler-plugin:2.0.0-SNAPSHOT:compile (default-compile) @ org.eclipse.tracecompass.tmf.ui ---
14:42:46 [2020-08-04T18:42:46.278Z] [WARNING] The effective compiler target level 11 is incompatible with the following OSGi execution environments: [JavaSE-1.8 (assumes 1.8)] @ MavenProject: org.eclipse.tracecompass:org.eclipse.tracecompass.tmf.ui:6.1.0-SNAPSHOT @ /home/jenkins/agent/workspace/tracecompass-master-jdk11/tmf/org.eclipse.tracecompass.tmf.ui/pom.xml
14:42:46 [2020-08-04T18:42:46.278Z] [INFO] Compiling 567 source files to /home/jenkins/agent/workspace/tracecompass-master-jdk11/tmf/org.eclipse.tracecompass.tmf.ui/target/classes
14:42:46 [2020-08-04T18:42:46.278Z] [INFO] ------------------------------------------------------------------------
14:42:46 [2020-08-04T18:42:46.278Z] [INFO] Reactor Summary:
14:42:46 [2020-08-04T18:42:46.278Z] [INFO] 
14:42:46 [2020-08-04T18:42:46.278Z] [INFO] Trace Compass Parent 6.0.0-SNAPSHOT ................ SUCCESS [ 54.333 s]
14:42:46 [2020-08-04T18:42:46.278Z] [INFO] Trace Compass Tracetype-agnostic Analyses Parent 6.0.0-SNAPSHOT SUCCESS [  0.008 s]
14:42:46 [2020-08-04T18:42:46.278Z] [INFO] Trace Compass Common Utilities Parent 6.0.0-SNAPSHOT SUCCESS [  0.007 s]
14:42:46 [2020-08-04T18:42:46.278Z] [INFO] org.eclipse.tracecompass.common.core 4.3.0-SNAPSHOT  SUCCESS [ 26.031 s]
14:42:46 [2020-08-04T18:42:46.278Z] [INFO] Trace Compass State System Parent 6.0.0-SNAPSHOT ... SUCCESS [  0.007 s]
14:42:46 [2020-08-04T18:42:46.278Z] [INFO] org.eclipse.tracecompass.datastore.core 1.2.1-SNAPSHOT SUCCESS [  3.475 s]
14:42:46 [2020-08-04T18:42:46.278Z] [INFO] org.eclipse.tracecompass.segmentstore.core 3.0.0-SNAPSHOT SUCCESS [  3.007 s]
14:42:46 [2020-08-04T18:42:46.278Z] [INFO] org.eclipse.tracecompass.statesystem.core 5.0.0-SNAPSHOT SUCCESS [  3.735 s]
14:42:46 [2020-08-04T18:42:46.278Z] [INFO] Trace Compass TMF Parent 6.0.0-SNAPSHOT ............ SUCCESS [  0.007 s]
14:42:46 [2020-08-04T18:42:46.278Z] [INFO] Trace Compass Filter Parser 1.0.5-SNAPSHOT ......... SUCCESS [  2.557 s]
14:42:46 [2020-08-04T18:42:46.278Z] [INFO] org.eclipse.tracecompass.tmf.core 6.1.0-SNAPSHOT ... SUCCESS [  8.997 s]
14:42:46 [2020-08-04T18:42:46.278Z] [INFO] org.eclipse.tracecompass.analysis.counters.core 2.0.4-SNAPSHOT SUCCESS [  2.882 s]
14:42:46 [2020-08-04T18:42:46.278Z] [INFO] Trace Compass CTF Support Parent 6.0.0-SNAPSHOT .... SUCCESS [  0.007 s]
14:42:46 [2020-08-04T18:42:46.278Z] [INFO] Trace Compass CTF Parser Plug-in 1.0.5-SNAPSHOT .... SUCCESS [ 10.319 s]
14:42:46 [2020-08-04T18:42:46.278Z] [INFO] org.eclipse.tracecompass.ctf.core 4.0.3-SNAPSHOT ... SUCCESS [  5.002 s]
14:42:46 [2020-08-04T18:42:46.278Z] [INFO] Trace Compass CTF Core Tests Plug-in 1.0.8-SNAPSHOT  SUCCESS [ 38.171 s]
14:42:46 [2020-08-04T18:42:46.278Z] [INFO] org.eclipse.tracecompass.statesystem.core.tests 1.0.12-SNAPSHOT SUCCESS [ 14.611 s]
14:42:46 [2020-08-04T18:42:46.278Z] [INFO] org.eclipse.tracecompass.tmf.core.tests 1.0.13-SNAPSHOT SUCCESS [04:45 min]
14:42:46 [2020-08-04T18:42:46.278Z] [INFO] org.eclipse.tracecompass.tmf.ctf.core 4.2.1-SNAPSHOT SUCCESS [  3.397 s]
14:42:46 [2020-08-04T18:42:46.278Z] [INFO] org.eclipse.tracecompass.tmf.ctf.core.tests 1.0.11-SNAPSHOT SUCCESS [03:29 min]
14:42:46 [2020-08-04T18:42:46.278Z] [INFO] org.eclipse.tracecompass.analysis.counters.core.tests 1.0.0-SNAPSHOT SUCCESS [  6.792 s]
14:42:46 [2020-08-04T18:42:46.278Z] [INFO] org.eclipse.tracecompass.tmf.ui 6.1.0-SNAPSHOT ..... FAILURE [  4.765 s]
14:42:46 [2020-08-04T18:42:46.278Z] [INFO] org.eclipse.tracecompass.analysis.counters.ui 1.0.0-SNAPSHOT SKIPPED
14:42:46 [2020-08-04T18:42:46.278Z] [INFO] org.eclipse.tracecompass.tmf.ui.tests 1.0.14-SNAPSHOT SKIPPED
14:42:46 [2020-08-04T18:42:46.278Z] [INFO] org.eclipse.tracecompass.tmf.ui.swtbot.tests 1.0.13-SNAPSHOT SKIPPED
14:42:46 [2020-08-04T18:42:46.278Z] [INFO] org.eclipse.tracecompass.analysis.graph.core 2.1.6-SNAPSHOT SKIPPED
14:42:46 [2020-08-04T18:42:46.278Z] [INFO] org.eclipse.tracecompass.tmf.chart.core 1.0.3-SNAPSHOT SKIPPED
14:42:46 [2020-08-04T18:42:46.278Z] [INFO] org.eclipse.tracecompass.analysis.lami.core 1.1.2-SNAPSHOT SKIPPED
14:42:46 [2020-08-04T18:42:46.278Z] [INFO] org.eclipse.tracecompass.analysis.timing.core 5.2.0-SNAPSHOT SKIPPED
14:42:46 [2020-08-04T18:42:46.278Z] [INFO] org.eclipse.tracecompass.analysis.os.linux.core 5.0.0-SNAPSHOT SKIPPED
14:42:46 [2020-08-04T18:42:46.278Z] [INFO] Trace Compass LTTng Support Parent 6.0.0-SNAPSHOT .. SKIPPED
14:42:46 [2020-08-04T18:42:46.278Z] [INFO] org.eclipse.tracecompass.lttng2.common.core 1.1.2-SNAPSHOT SKIPPED
14:42:46 [2020-08-04T18:42:46.278Z] [INFO] org.eclipse.tracecompass.tmf.analysis.xml.core 4.0.0-SNAPSHOT SKIPPED
14:42:46 [2020-08-04T18:42:46.278Z] [INFO] org.eclipse.tracecompass.lttng2.kernel.core 3.0.4-SNAPSHOT SKIPPED
14:42:46 [2020-08-04T18:42:46.278Z] [INFO] org.eclipse.tracecompass.analysis.counters.ui.swtbot.tests 1.0.0-SNAPSHOT SKIPPED
14:42:46 [2020-08-04T18:42:46.279Z] [INFO] org.eclipse.tracecompass.analysis.graph.core.tests 1.0.5-SNAPSHOT SKIPPED
14:42:46 [2020-08-04T18:42:46.279Z] [INFO] org.eclipse.tracecompass.analysis.graph.ui 1.0.10-SNAPSHOT SKIPPED
14:42:46 [2020-08-04T18:42:46.279Z] [INFO] org.eclipse.tracecompass.analysis.lami.core.tests 1.0.3-SNAPSHOT SKIPPED
14:42:46 [2020-08-04T18:42:46.279Z] [INFO] org.eclipse.tracecompass.tmf.chart.ui 1.0.10-SNAPSHOT SKIPPED
14:42:46 [2020-08-04T18:42:46.279Z] [INFO] org.eclipse.tracecompass.analysis.lami.ui 1.1.3-SNAPSHOT SKIPPED
14:42:46 [2020-08-04T18:42:46.279Z] [INFO] org.eclipse.tracecompass.tmf.chart.core.tests 1.0.2-SNAPSHOT SKIPPED
14:42:46 [2020-08-04T18:42:46.279Z] [INFO] org.eclipse.tracecompass.tmf.chart.ui.swtbot.tests 1.0.5-SNAPSHOT SKIPPED
14:42:46 [2020-08-04T18:42:46.279Z] [INFO] org.eclipse.tracecompass.analysis.lami.ui.swtbot.tests 1.0.5-SNAPSHOT SKIPPED
14:42:46 [2020-08-04T18:42:46.279Z] [INFO] org.eclipse.tracecompass.analysis.os.linux.core.tests 1.0.13-SNAPSHOT SKIPPED
14:42:46 [2020-08-04T18:42:46.279Z] [INFO] org.eclipse.tracecompass.analysis.timing.ui 4.1.0-SNAPSHOT SKIPPED
14:42:46 [2020-08-04T18:42:46.279Z] [INFO] org.eclipse.tracecompass.analysis.os.linux.ui 4.0.0-SNAPSHOT SKIPPED
14:42:46 [2020-08-04T18:42:46.279Z] [INFO] org.eclipse.tracecompass.analysis.os.linux.ui.tests 1.0.8-SNAPSHOT SKIPPED
14:42:46 [2020-08-04T18:42:46.279Z] [INFO] org.eclipse.tracecompass.analysis.timing.core.tests 1.0.5-SNAPSHOT SKIPPED
14:42:46 [2020-08-04T18:42:46.279Z] [INFO] org.eclipse.tracecompass.analysis.timing.ui.swtbot.tests 1.0.9-SNAPSHOT SKIPPED
14:42:46 [2020-08-04T18:42:46.279Z] [INFO] org.eclipse.tracecompass.analysis.os.linux.ui.swtbot.tests 1.0.14-SNAPSHOT SKIPPED
14:42:46 [2020-08-04T18:42:46.279Z] [INFO] org.eclipse.tracecompass.analysis.profiling.core 2.0.0-SNAPSHOT SKIPPED
14:42:46 [2020-08-04T18:42:46.279Z] [INFO] org.eclipse.tracecompass.analysis.profiling.core.tests 1.0.4-SNAPSHOT SKIPPED
14:42:46 [2020-08-04T18:42:46.279Z] [INFO] org.eclipse.tracecompass.analysis.profiling.ui 2.1.0-SNAPSHOT SKIPPED
14:42:46 [2020-08-04T18:42:46.279Z] [INFO] org.eclipse.tracecompass.analysis.profiling.ui.swtbot.tests 1.0.4-SNAPSHOT SKIPPED
14:42:46 [2020-08-04T18:42:46.279Z] [INFO] Trace Compass BTF Support Parent 6.0.0-SNAPSHOT .... SKIPPED
14:42:46 [2020-08-04T18:42:46.279Z] [INFO] org.eclipse.tracecompass.btf.core 2.2.2-SNAPSHOT ... SKIPPED
14:42:46 [2020-08-04T18:42:46.279Z] [INFO] Trace Compass Documentation 6.0.0-SNAPSHOT ......... SKIPPED
14:42:46 [2020-08-04T18:42:46.279Z] [INFO] Trace Compass Developer Guide 6.0.0-SNAPSHOT ....... SKIPPED
14:42:46 [2020-08-04T18:42:46.279Z] [INFO] org.eclipse.tracecompass.tmf.analysis.xml.ui 2.1.12-SNAPSHOT SKIPPED
14:42:46 [2020-08-04T18:42:46.279Z] [INFO] org.eclipse.tracecompass.tmf 6.0.0-SNAPSHOT ........ SKIPPED
14:42:46 [2020-08-04T18:42:46.279Z] [INFO] org.eclipse.tracecompass.btf.ui 1.0.3-SNAPSHOT ..... SKIPPED
14:42:46 [2020-08-04T18:42:46.279Z] [INFO] org.eclipse.tracecompass.btf 6.0.0-SNAPSHOT ........ SKIPPED
14:42:46 [2020-08-04T18:42:46.279Z] [INFO] org.eclipse.tracecompass.btf.core.tests 1.0.2-SNAPSHOT SKIPPED
14:42:46 [2020-08-04T18:42:46.279Z] [INFO] org.eclipse.tracecompass.common.core.tests 1.1.8-SNAPSHOT SKIPPED
14:42:46 [2020-08-04T18:42:46.279Z] [INFO] org.eclipse.tracecompass.ctf 6.0.0-SNAPSHOT ........ SKIPPED
14:42:46 [2020-08-04T18:42:46.279Z] [INFO] org.eclipse.tracecompass.ctf.parser.tests 1.0.2-SNAPSHOT SKIPPED
14:42:46 [2020-08-04T18:42:46.279Z] [INFO] org.eclipse.tracecompass.tmf.ctf 6.0.0-SNAPSHOT .... SKIPPED
14:42:46 [2020-08-04T18:42:46.279Z] [INFO] org.eclipse.tracecompass.tmf.ctf.ui.swtbot.tests 1.0.10-SNAPSHOT SKIPPED
14:42:46 [2020-08-04T18:42:46.279Z] [INFO] Trace Compass User Guide 6.0.0-SNAPSHOT ............ SKIPPED
14:42:46 [2020-08-04T18:42:46.279Z] [INFO] Trace Compass GDB Tracepoint Analysis User Guide 6.0.0-SNAPSHOT SKIPPED
14:42:46 [2020-08-04T18:42:46.279Z] [INFO] Trace Compass RCP User Guide 6.0.0-SNAPSHOT ........ SKIPPED
14:42:46 [2020-08-04T18:42:46.279Z] [INFO] Trace Compass Pcap User Guide 6.0.0-SNAPSHOT ....... SKIPPED
14:42:46 [2020-08-04T18:42:46.279Z] [INFO] org.eclipse.tracecompass.examples 1.0.6-SNAPSHOT ... SKIPPED
14:42:46 [2020-08-04T18:42:46.279Z] [INFO] Trace Compass GDB Tracepoint Analysis Parent 6.0.0-SNAPSHOT SKIPPED
14:42:46 [2020-08-04T18:42:46.279Z] [INFO] org.eclipse.tracecompass.gdbtrace.core 1.0.6-SNAPSHOT SKIPPED
14:42:46 [2020-08-04T18:42:46.279Z] [INFO] org.eclipse.tracecompass.gdbtrace.ui 1.1.3-SNAPSHOT  SKIPPED
14:42:46 [2020-08-04T18:42:46.279Z] [INFO] org.eclipse.tracecompass.gdbtrace 6.0.0-SNAPSHOT ... SKIPPED
14:42:46 [2020-08-04T18:42:46.279Z] [INFO] org.eclipse.tracecompass.gdbtrace.core.tests 1.0.1-SNAPSHOT SKIPPED
14:42:46 [2020-08-04T18:42:46.279Z] [INFO] org.eclipse.tracecompass.gdbtrace.ui.tests 1.0.1-SNAPSHOT SKIPPED
14:42:46 [2020-08-04T18:42:46.279Z] [INFO] org.eclipse.tracecompass.lttng2.common.core.tests 1.0.1-SNAPSHOT SKIPPED
14:42:46 [2020-08-04T18:42:46.279Z] [INFO] org.eclipse.tracecompass.lttng2.control.core 1.2.4-SNAPSHOT SKIPPED
14:42:46 [2020-08-04T18:42:46.279Z] [INFO] org.eclipse.tracecompass.tmf.remote.core 2.0.4-SNAPSHOT SKIPPED
14:42:46 [2020-08-04T18:42:46.279Z] [INFO] org.eclipse.tracecompass.tmf.remote.ui 1.0.8-SNAPSHOT SKIPPED
14:42:46 [2020-08-04T18:42:46.279Z] [INFO] org.eclipse.tracecompass.lttng2.control.ui 1.2.11-SNAPSHOT SKIPPED
14:42:46 [2020-08-04T18:42:46.279Z] [INFO] org.eclipse.tracecompass.lttng2.control 6.0.0-SNAPSHOT SKIPPED
14:42:46 [2020-08-04T18:42:46.279Z] [INFO] org.eclipse.tracecompass.lttng2.control.core.tests 1.1.2-SNAPSHOT SKIPPED
14:42:46 [2020-08-04T18:42:46.279Z] [INFO] org.eclipse.tracecompass.tmf.remote.core.tests 1.0.1-SNAPSHOT SKIPPED
14:42:46 [2020-08-04T18:42:46.279Z] [INFO] org.eclipse.tracecompass.lttng2.control.ui.tests 2.0.4-SNAPSHOT SKIPPED
14:42:46 [2020-08-04T18:42:46.279Z] [INFO] org.eclipse.tracecompass.lttng2.control.ui.swtbot.tests 1.0.7-SNAPSHOT SKIPPED
14:42:46 [2020-08-04T18:42:46.279Z] [INFO] org.eclipse.tracecompass.lttng2.kernel.ui 2.0.1-SNAPSHOT SKIPPED
14:42:46 [2020-08-04T18:42:46.279Z] [INFO] org.eclipse.tracecompass.lttng2.kernel 6.0.0-SNAPSHOT SKIPPED
14:42:46 [2020-08-04T18:42:46.279Z] [INFO] org.eclipse.tracecompass.tmf.analysis.xml.core.tests 1.0.12-SNAPSHOT SKIPPED
14:42:46 [2020-08-04T18:42:46.279Z] [INFO] org.eclipse.tracecompass.lttng2.kernel.core.tests 2.0.1-SNAPSHOT SKIPPED
14:42:46 [2020-08-04T18:42:46.279Z] [INFO] org.eclipse.tracecompass.lttng2.kernel.ui.swtbot.tests 1.0.14-SNAPSHOT SKIPPED
14:42:46 [2020-08-04T18:42:46.279Z] [INFO] org.eclipse.tracecompass.lttng2.ust.core 5.0.0-SNAPSHOT SKIPPED
14:42:46 [2020-08-04T18:42:46.279Z] [INFO] org.eclipse.tracecompass.lttng2.ust.ui 3.0.8-SNAPSHOT SKIPPED
14:42:46 [2020-08-04T18:42:46.279Z] [INFO] org.eclipse.tracecompass.lttng2.ust 6.0.0-SNAPSHOT . SKIPPED
14:42:46 [2020-08-04T18:42:46.279Z] [INFO] org.eclipse.tracecompass.lttng2.ust.core.tests 1.0.11-SNAPSHOT SKIPPED
14:42:46 [2020-08-04T18:42:46.279Z] [INFO] org.eclipse.tracecompass.lttng2.ust.ui.tests 1.0.1-SNAPSHOT SKIPPED
14:42:46 [2020-08-04T18:42:46.279Z] [INFO] org.eclipse.tracecompass.lttng2.ust.ui.swtbot.tests 1.0.13-SNAPSHOT SKIPPED
14:42:46 [2020-08-04T18:42:46.279Z] [INFO] Trace Compass Pcap Format Support Parent 6.0.0-SNAPSHOT SKIPPED
14:42:46 [2020-08-04T18:42:46.279Z] [INFO] org.eclipse.tracecompass.pcap.core 1.1.2-SNAPSHOT .. SKIPPED
14:42:46 [2020-08-04T18:42:46.279Z] [INFO] Trace Compass Pcap Parser Core Tests Plug-in 1.0.4-SNAPSHOT SKIPPED
14:42:46 [2020-08-04T18:42:46.279Z] [INFO] org.eclipse.tracecompass.tmf.pcap.core 1.0.4-SNAPSHOT SKIPPED
14:42:46 [2020-08-04T18:42:46.279Z] [INFO] org.eclipse.tracecompass.tmf.pcap.ui 1.1.3-SNAPSHOT  SKIPPED
14:42:46 [2020-08-04T18:42:46.279Z] [INFO] org.eclipse.tracecompass.tmf.pcap 6.0.0-SNAPSHOT ... SKIPPED
14:42:46 [2020-08-04T18:42:46.279Z] [INFO] org.eclipse.tracecompass.tmf.pcap.core.tests 1.0.2-SNAPSHOT SKIPPED
14:42:46 [2020-08-04T18:42:46.279Z] [INFO] org.eclipse.tracecompass.tmf.pcap.ui.swtbot.tests 1.0.1-SNAPSHOT SKIPPED
14:42:46 [2020-08-04T18:42:46.279Z] [INFO] Trace Compass RCP Parent 6.0.0-SNAPSHOT ............ SKIPPED
14:42:46 [2020-08-04T18:42:46.279Z] [INFO] Trace Compass RCP Branding plug-in 6.0.0-SNAPSHOT .. SKIPPED
14:42:46 [2020-08-04T18:42:46.279Z] [INFO] Trace Compass RCP Branding Feature 6.0.0-SNAPSHOT .. SKIPPED
14:42:46 [2020-08-04T18:42:46.279Z] [INFO] org.eclipse.tracecompass.tmf.cli.core 1.0.1-SNAPSHOT SKIPPED
14:42:46 [2020-08-04T18:42:46.279Z] [INFO] org.eclipse.tracecompass.rcp.ui 6.0.0-SNAPSHOT ..... SKIPPED
14:42:46 [2020-08-04T18:42:46.279Z] [INFO] Trace Compass RCP Feature 6.0.0-SNAPSHOT ........... SKIPPED
14:42:46 [2020-08-04T18:42:46.279Z] [INFO] org.eclipse.tracecompass.tmf.cli.core.tests 1.0.1-SNAPSHOT SKIPPED
14:42:46 [2020-08-04T18:42:46.279Z] [INFO] org.eclipse.tracecompass.rcp.ui.tests 2.0.3-SNAPSHOT SKIPPED
14:42:46 [2020-08-04T18:42:46.279Z] [INFO] org.eclipse.tracecompass.rcp.incubator.ui 1.0.1-SNAPSHOT SKIPPED
14:42:46 [2020-08-04T18:42:46.279Z] [INFO] org.eclipse.tracecompass.rcp.incubator 6.0.0-SNAPSHOT SKIPPED
14:42:46 [2020-08-04T18:42:46.279Z] [INFO] Trace Compass Json trace Parent 6.0.0-SNAPSHOT ..... SKIPPED
14:42:46 [2020-08-04T18:42:46.279Z] [INFO] org.eclipse.tracecompass.jsontrace.core 1.0.0-SNAPSHOT SKIPPED
14:42:46 [2020-08-04T18:42:46.279Z] [INFO] org.eclipse.tracecompass.jsontrace 6.0.0-SNAPSHOT .. SKIPPED
14:42:46 [2020-08-04T18:42:46.279Z] [INFO] org.eclipse.tracecompass.tmf.cli 6.0.0-SNAPSHOT .... SKIPPED
14:42:46 [2020-08-04T18:42:46.279Z] [INFO] Trace Compass RCP Product 6.0.0-SNAPSHOT ........... SKIPPED
14:42:46 [2020-08-04T18:42:46.279Z] [INFO] Trace Compass Release Engineering Parent 6.0.0-SNAPSHOT SKIPPED
14:42:46 [2020-08-04T18:42:46.279Z] [INFO] Trace Compass Target Platform 6.0.0-SNAPSHOT ....... SKIPPED
14:42:46 [2020-08-04T18:42:46.279Z] [INFO] org.eclipse.tracecompass.integration.swtbot.tests 1.0.11-SNAPSHOT SKIPPED
14:42:46 [2020-08-04T18:42:46.279Z] [INFO] org.eclipse.tracecompass.datastore.core.tests 1.0.5-SNAPSHOT SKIPPED
14:42:46 [2020-08-04T18:42:46.279Z] [INFO] org.eclipse.tracecompass.segmentstore.core.tests 1.0.4-SNAPSHOT SKIPPED
14:42:46 [2020-08-04T18:42:46.279Z] [INFO] org.eclipse.tracecompass.tmf.analysis.xml.ui.swtbot.tests 1.0.11-SNAPSHOT SKIPPED
14:42:46 [2020-08-04T18:42:46.279Z] [INFO] org.eclipse.tracecompass.tmf.analysis.xml.ui.tests 1.0.3-SNAPSHOT SKIPPED
14:42:46 [2020-08-04T18:42:46.279Z] [INFO] org.eclipse.tracecompass.tmf.chart.ui.tests 1.0.1-SNAPSHOT SKIPPED
14:42:46 [2020-08-04T18:42:46.279Z] [INFO] org.eclipse.tracecompass.tmf.remote.ui.swtbot.tests 1.0.8-SNAPSHOT SKIPPED
14:42:46 [2020-08-04T18:42:46.279Z] [INFO] org.eclipse.tracecompass.tmf.remote.ui.tests 1.0.1-SNAPSHOT SKIPPED
14:42:46 [2020-08-04T18:42:46.279Z] [INFO] Trace Compass All Tests 1.0.9-SNAPSHOT ............. SKIPPED
14:42:46 [2020-08-04T18:42:46.279Z] [INFO] org.eclipse.tracecompass.testing 6.0.0-SNAPSHOT .... SKIPPED
14:42:46 [2020-08-04T18:42:46.279Z] [INFO] org.eclipse.tracecompass.tmf.remote 6.0.0-SNAPSHOT . SKIPPED
14:42:46 [2020-08-04T18:42:46.279Z] [INFO] Trace Compass Repository 6.0.0-SNAPSHOT ............ SKIPPED
14:42:46 [2020-08-04T18:42:46.279Z] [INFO] org.eclipse.tracecompass.jsontrace.core.tests 1.0.2-SNAPSHOT SKIPPED
14:42:46 [2020-08-04T18:42:46.279Z] [INFO] ------------------------------------------------------------------------
14:42:46 [2020-08-04T18:42:46.279Z] [INFO] BUILD FAILURE
14:42:46 [2020-08-04T18:42:46.279Z] [INFO] ------------------------------------------------------------------------
14:42:46 [2020-08-04T18:42:46.279Z] [INFO] Total time:  16:50 min
14:42:46 [2020-08-04T18:42:46.279Z] [INFO] Finished at: 2020-08-04T18:42:45Z
14:42:46 [2020-08-04T18:42:46.279Z] [INFO] ------------------------------------------------------------------------
14:42:46 [2020-08-04T18:42:46.279Z] [ERROR] Failed to execute goal org.eclipse.tycho:tycho-compiler-plugin:2.0.0-SNAPSHOT:compile (default-compile) on project org.eclipse.tracecompass.tmf.ui: Compilation failure: Compilation failure: 
14:42:46 [2020-08-04T18:42:46.279Z] [ERROR] /home/jenkins/agent/workspace/tracecompass-master-jdk11/tmf/org.eclipse.tracecompass.tmf.ui/src/org/eclipse/tracecompass/tmf/ui/views/colors/ColorSettingsXML.java:[23] 
14:42:46 [2020-08-04T18:42:46.279Z] [ERROR] 	import javax.xml.parsers.DocumentBuilder;
14:42:46 [2020-08-04T18:42:46.279Z] [ERROR] 	       ^^^^^^^^^^^^^^^^^
14:42:46 [2020-08-04T18:42:46.279Z] [ERROR] The package javax.xml.parsers is accessible from more than one module: <unnamed>, java.xml
14:42:46 [2020-08-04T18:42:46.279Z] [ERROR] /home/jenkins/agent/workspace/tracecompass-master-jdk11/tmf/org.eclipse.tracecompass.tmf.ui/src/org/eclipse/tracecompass/tmf/ui/views/colors/ColorSettingsXML.java:[24] 
14:42:46 [2020-08-04T18:42:46.279Z] [ERROR] 	import javax.xml.parsers.ParserConfigurationException;
14:42:46 [2020-08-04T18:42:46.279Z] [ERROR] 	       ^^^^^^^^^^^^^^^^^
14:42:46 [2020-08-04T18:42:46.279Z] [ERROR] The package javax.xml.parsers is accessible from more than one module: <unnamed>, java.xml
14:42:46 [2020-08-04T18:42:46.279Z] [ERROR] /home/jenkins/agent/workspace/tracecompass-master-jdk11/tmf/org.eclipse.tracecompass.tmf.ui/src/org/eclipse/tracecompass/tmf/ui/views/colors/ColorSettingsXML.java:[25] 
14:42:46 [2020-08-04T18:42:46.279Z] [ERROR] 	import javax.xml.parsers.SAXParserFactory;
14:42:46 [2020-08-04T18:42:46.279Z] [ERROR] 	       ^^^^^^^^^^^^^^^^^
14:42:46 [2020-08-04T18:42:46.279Z] [ERROR] The package javax.xml.parsers is accessible from more than one module: <unnamed>, java.xml
14:42:46 [2020-08-04T18:42:46.279Z] [ERROR] /home/jenkins/agent/workspace/tracecompass-master-jdk11/tmf/org.eclipse.tracecompass.tmf.ui/src/org/eclipse/tracecompass/tmf/ui/views/colors/ColorSettingsXML.java:[26] 
14:42:46 [2020-08-04T18:42:46.279Z] [ERROR] 	import javax.xml.transform.Transformer;
14:42:46 [2020-08-04T18:42:46.279Z] [ERROR] 	       ^^^^^^^^^^^^^^^^^^^
14:42:46 [2020-08-04T18:42:46.279Z] [ERROR] The package javax.xml.transform is accessible from more than one module: <unnamed>, java.xml
14:42:46 [2020-08-04T18:42:46.279Z] [ERROR] /home/jenkins/agent/workspace/tracecompass-master-jdk11/tmf/org.eclipse.tracecompass.tmf.ui/src/org/eclipse/tracecompass/tmf/ui/views/colors/ColorSettingsXML.java:[27] 
14:42:46 [2020-08-04T18:42:46.279Z] [ERROR] 	import javax.xml.transform.TransformerException;
14:42:46 [2020-08-04T18:42:46.279Z] [ERROR] 	       ^^^^^^^^^^^^^^^^^^^
14:42:46 [2020-08-04T18:42:46.279Z] [ERROR] The package javax.xml.transform is accessible from more than one module: <unnamed>, java.xml
14:42:46 [2020-08-04T18:42:46.279Z] [ERROR] /home/jenkins/agent/workspace/tracecompass-master-jdk11/tmf/org.eclipse.tracecompass.tmf.ui/src/org/eclipse/tracecompass/tmf/ui/views/colors/ColorSettingsXML.java:[28] 
14:42:46 [2020-08-04T18:42:46.279Z] [ERROR] 	import javax.xml.transform.dom.DOMSource;
14:42:46 [2020-08-04T18:42:46.279Z] [ERROR] 	       ^^^^^^^^^^^^^^^^^^^^^^^
14:42:46 [2020-08-04T18:42:46.279Z] [ERROR] The package javax.xml.transform.dom is accessible from more than one module: <unnamed>, java.xml
14:42:46 [2020-08-04T18:42:46.279Z] [ERROR] /home/jenkins/agent/workspace/tracecompass-master-jdk11/tmf/org.eclipse.tracecompass.tmf.ui/src/org/eclipse/tracecompass/tmf/ui/views/colors/ColorSettingsXML.java:[29] 
14:42:46 [2020-08-04T18:42:46.279Z] [ERROR] 	import javax.xml.transform.stream.StreamResult;
14:42:46 [2020-08-04T18:42:46.279Z] [ERROR] 	       ^^^^^^^^^^^^^^^^^^^^^^^^^^
14:42:46 [2020-08-04T18:42:46.279Z] [ERROR] The package javax.xml.transform.stream is accessible from more than one module: <unnamed>, java.xml
14:42:46 [2020-08-04T18:42:46.279Z] [ERROR] /home/jenkins/agent/workspace/tracecompass-master-jdk11/tmf/org.eclipse.tracecompass.tmf.ui/src/org/eclipse/tracecompass/tmf/ui/views/colors/ColorSettingsXML.java:[37] 
14:42:46 [2020-08-04T18:42:46.279Z] [ERROR] 	import org.w3c.dom.Document;
14:42:46 [2020-08-04T18:42:46.279Z] [ERROR] 	       ^^^^^^^^^^^
14:42:46 [2020-08-04T18:42:46.279Z] [ERROR] The package org.w3c.dom is accessible from more than one module: <unnamed>, java.xml
14:42:46 [2020-08-04T18:42:46.279Z] [ERROR] /home/jenkins/agent/workspace/tracecompass-master-jdk11/tmf/org.eclipse.tracecompass.tmf.ui/src/org/eclipse/tracecompass/tmf/ui/views/colors/ColorSettingsXML.java:[38] 
14:42:46 [2020-08-04T18:42:46.279Z] [ERROR] 	import org.w3c.dom.Element;
14:42:46 [2020-08-04T18:42:46.279Z] [ERROR] 	       ^^^^^^^^^^^
14:42:46 [2020-08-04T18:42:46.280Z] [ERROR] The package org.w3c.dom is accessible from more than one module: <unnamed>, java.xml
14:42:46 [2020-08-04T18:42:46.280Z] [ERROR] /home/jenkins/agent/workspace/tracecompass-master-jdk11/tmf/org.eclipse.tracecompass.tmf.ui/src/org/eclipse/tracecompass/tmf/ui/views/colors/ColorSettingsXML.java:[39] 
14:42:46 [2020-08-04T18:42:46.280Z] [ERROR] 	import org.xml.sax.Attributes;
14:42:46 [2020-08-04T18:42:46.280Z] [ERROR] 	       ^^^^^^^^^^^
14:42:46 [2020-08-04T18:42:46.280Z] [ERROR] The package org.xml.sax is accessible from more than one module: <unnamed>, java.xml
14:42:46 [2020-08-04T18:42:46.280Z] [ERROR] /home/jenkins/agent/workspace/tracecompass-master-jdk11/tmf/org.eclipse.tracecompass.tmf.ui/src/org/eclipse/tracecompass/tmf/ui/views/colors/ColorSettingsXML.java:[40] 
14:42:46 [2020-08-04T18:42:46.280Z] [ERROR] 	import org.xml.sax.SAXException;
14:42:46 [2020-08-04T18:42:46.280Z] [ERROR] 	       ^^^^^^^^^^^
14:42:46 [2020-08-04T18:42:46.280Z] [ERROR] The package org.xml.sax is accessible from more than one module: <unnamed>, java.xml
14:42:46 [2020-08-04T18:42:46.280Z] [ERROR] /home/jenkins/agent/workspace/tracecompass-master-jdk11/tmf/org.eclipse.tracecompass.tmf.ui/src/org/eclipse/tracecompass/tmf/ui/views/colors/ColorSettingsXML.java:[41] 
14:42:46 [2020-08-04T18:42:46.280Z] [ERROR] 	import org.xml.sax.XMLReader;
14:42:46 [2020-08-04T18:42:46.280Z] [ERROR] 	       ^^^^^^^^^^^
14:42:46 [2020-08-04T18:42:46.280Z] [ERROR] The package org.xml.sax is accessible from more than one module: <unnamed>, java.xml
14:42:46 [2020-08-04T18:42:46.280Z] [ERROR] /home/jenkins/agent/workspace/tracecompass-master-jdk11/tmf/org.eclipse.tracecompass.tmf.ui/src/org/eclipse/tracecompass/tmf/ui/views/colors/ColorSettingsXML.java:[42] 
14:42:46 [2020-08-04T18:42:46.280Z] [ERROR] 	import org.xml.sax.helpers.DefaultHandler;
14:42:46 [2020-08-04T18:42:46.280Z] [ERROR] 	       ^^^^^^^^^^^^^^^^^^^
14:42:46 [2020-08-04T18:42:46.280Z] [ERROR] The package org.xml.sax.helpers is accessible from more than one module: <unnamed>, java.xml
14:42:46 [2020-08-04T18:42:46.280Z] [ERROR] /home/jenkins/agent/workspace/tracecompass-master-jdk11/tmf/org.eclipse.tracecompass.tmf.ui/src/org/eclipse/tracecompass/tmf/ui/views/colors/ColorSettingsXML.java:[74] 
14:42:46 [2020-08-04T18:42:46.280Z] [ERROR] 	DocumentBuilder documentBuilder = XmlUtils.newSafeDocumentBuilderFactory().newDocumentBuilder();
14:42:46 [2020-08-04T18:42:46.280Z] [ERROR] 	^^^^^^^^^^^^^^^
14:42:46 [2020-08-04T18:42:46.280Z] [ERROR] DocumentBuilder cannot be resolved to a type
14:42:46 [2020-08-04T18:42:46.280Z] [ERROR] /home/jenkins/agent/workspace/tracecompass-master-jdk11/tmf/org.eclipse.tracecompass.tmf.ui/src/org/eclipse/tracecompass/tmf/ui/views/colors/ColorSettingsXML.java:[75] 
14:42:46 [2020-08-04T18:42:46.280Z] [ERROR] 	Document document = documentBuilder.newDocument();
14:42:46 [2020-08-04T18:42:46.280Z] [ERROR] 	^^^^^^^^
14:42:46 [2020-08-04T18:42:46.280Z] [ERROR] Document cannot be resolved to a type
14:42:46 [2020-08-04T18:42:46.280Z] [ERROR] /home/jenkins/agent/workspace/tracecompass-master-jdk11/tmf/org.eclipse.tracecompass.tmf.ui/src/org/eclipse/tracecompass/tmf/ui/views/colors/ColorSettingsXML.java:[77] 
14:42:46 [2020-08-04T18:42:46.280Z] [ERROR] 	Element rootElement = document.createElement(COLOR_SETTINGS_TAG);
14:42:46 [2020-08-04T18:42:46.280Z] [ERROR] 	^^^^^^^
14:42:46 [2020-08-04T18:42:46.280Z] [ERROR] Element cannot be resolved to a type
14:42:46 [2020-08-04T18:42:46.280Z] [ERROR] /home/jenkins/agent/workspace/tracecompass-master-jdk11/tmf/org.eclipse.tracecompass.tmf.ui/src/org/eclipse/tracecompass/tmf/ui/views/colors/ColorSettingsXML.java:[81] 
14:42:46 [2020-08-04T18:42:46.280Z] [ERROR] 	Element colorSettingElement = document.createElement(COLOR_SETTING_TAG);
14:42:46 [2020-08-04T18:42:46.280Z] [ERROR] 	^^^^^^^
14:42:46 [2020-08-04T18:42:46.280Z] [ERROR] Element cannot be resolved to a type
14:42:46 [2020-08-04T18:42:46.280Z] [ERROR] /home/jenkins/agent/workspace/tracecompass-master-jdk11/tmf/org.eclipse.tracecompass.tmf.ui/src/org/eclipse/tracecompass/tmf/ui/views/colors/ColorSettingsXML.java:[86] 
14:42:46 [2020-08-04T18:42:46.280Z] [ERROR] 	Element fgElement = document.createElement(FG_TAG);
14:42:46 [2020-08-04T18:42:46.280Z] [ERROR] 	^^^^^^^
14:42:46 [2020-08-04T18:42:46.280Z] [ERROR] Element cannot be resolved to a type
14:42:46 [2020-08-04T18:42:46.280Z] [ERROR] /home/jenkins/agent/workspace/tracecompass-master-jdk11/tmf/org.eclipse.tracecompass.tmf.ui/src/org/eclipse/tracecompass/tmf/ui/views/colors/ColorSettingsXML.java:[93] 
14:42:46 [2020-08-04T18:42:46.280Z] [ERROR] 	Element bgElement = document.createElement(BG_TAG);
14:42:46 [2020-08-04T18:42:46.280Z] [ERROR] 	^^^^^^^
14:42:46 [2020-08-04T18:42:46.280Z] [ERROR] Element cannot be resolved to a type
14:42:46 [2020-08-04T18:42:46.280Z] [ERROR] /home/jenkins/agent/workspace/tracecompass-master-jdk11/tmf/org.eclipse.tracecompass.tmf.ui/src/org/eclipse/tracecompass/tmf/ui/views/colors/ColorSettingsXML.java:[98] 
14:42:46 [2020-08-04T18:42:46.280Z] [ERROR] 	Element tickColorElement = document.createElement(TICK_TAG);
14:42:46 [2020-08-04T18:42:46.280Z] [ERROR] 	^^^^^^^
14:42:46 [2020-08-04T18:42:46.280Z] [ERROR] Element cannot be resolved to a type
14:42:46 [2020-08-04T18:42:46.280Z] [ERROR] /home/jenkins/agent/workspace/tracecompass-master-jdk11/tmf/org.eclipse.tracecompass.tmf.ui/src/org/eclipse/tracecompass/tmf/ui/views/colors/ColorSettingsXML.java:[105] 
14:42:46 [2020-08-04T18:42:46.280Z] [ERROR] 	Element filterElement = document.createElement(FILTER_TAG);
14:42:46 [2020-08-04T18:42:46.280Z] [ERROR] 	^^^^^^^
14:42:46 [2020-08-04T18:42:46.280Z] [ERROR] Element cannot be resolved to a type
14:42:46 [2020-08-04T18:42:46.280Z] [ERROR] /home/jenkins/agent/workspace/tracecompass-master-jdk11/tmf/org.eclipse.tracecompass.tmf.ui/src/org/eclipse/tracecompass/tmf/ui/views/colors/ColorSettingsXML.java:[111] 
14:42:46 [2020-08-04T18:42:46.280Z] [ERROR] 	Transformer transformer = XmlUtils.newSecureTransformer();
14:42:46 [2020-08-04T18:42:46.280Z] [ERROR] 	^^^^^^^^^^^
14:42:46 [2020-08-04T18:42:46.280Z] [ERROR] Transformer cannot be resolved to a type
14:42:46 [2020-08-04T18:42:46.280Z] [ERROR] /home/jenkins/agent/workspace/tracecompass-master-jdk11/tmf/org.eclipse.tracecompass.tmf.ui/src/org/eclipse/tracecompass/tmf/ui/views/colors/ColorSettingsXML.java:[112] 
14:42:46 [2020-08-04T18:42:46.280Z] [ERROR] 	DOMSource source = new DOMSource(document);
14:42:46 [2020-08-04T18:42:46.280Z] [ERROR] 	^^^^^^^^^
14:42:46 [2020-08-04T18:42:46.280Z] [ERROR] DOMSource cannot be resolved to a type
14:42:46 [2020-08-04T18:42:46.280Z] [ERROR] /home/jenkins/agent/workspace/tracecompass-master-jdk11/tmf/org.eclipse.tracecompass.tmf.ui/src/org/eclipse/tracecompass/tmf/ui/views/colors/ColorSettingsXML.java:[112] 
14:42:46 [2020-08-04T18:42:46.280Z] [ERROR] 	DOMSource source = new DOMSource(document);
14:42:46 [2020-08-04T18:42:46.280Z] [ERROR] 	                       ^^^^^^^^^
14:42:46 [2020-08-04T18:42:46.280Z] [ERROR] DOMSource cannot be resolved to a type
14:42:46 [2020-08-04T18:42:46.280Z] [ERROR] /home/jenkins/agent/workspace/tracecompass-master-jdk11/tmf/org.eclipse.tracecompass.tmf.ui/src/org/eclipse/tracecompass/tmf/ui/views/colors/ColorSettingsXML.java:[113] 
14:42:46 [2020-08-04T18:42:46.280Z] [ERROR] 	StreamResult result = new StreamResult(new File(pathName));
14:42:46 [2020-08-04T18:42:46.280Z] [ERROR] 	^^^^^^^^^^^^
14:42:46 [2020-08-04T18:42:46.280Z] [ERROR] StreamResult cannot be resolved to a type
14:42:46 [2020-08-04T18:42:46.280Z] [ERROR] /home/jenkins/agent/workspace/tracecompass-master-jdk11/tmf/org.eclipse.tracecompass.tmf.ui/src/org/eclipse/tracecompass/tmf/ui/views/colors/ColorSettingsXML.java:[113] 
14:42:46 [2020-08-04T18:42:46.280Z] [ERROR] 	StreamResult result = new StreamResult(new File(pathName));
14:42:46 [2020-08-04T18:42:46.280Z] [ERROR] 	                          ^^^^^^^^^^^^
14:42:46 [2020-08-04T18:42:46.280Z] [ERROR] StreamResult cannot be resolved to a type
14:42:46 [2020-08-04T18:42:46.280Z] [ERROR] /home/jenkins/agent/workspace/tracecompass-master-jdk11/tmf/org.eclipse.tracecompass.tmf.ui/src/org/eclipse/tracecompass/tmf/ui/views/colors/ColorSettingsXML.java:[115] 
14:42:46 [2020-08-04T18:42:46.280Z] [ERROR] 	} catch (ParserConfigurationException | TransformerException e) {
14:42:46 [2020-08-04T18:42:46.280Z] [ERROR] 	         ^^^^^^^^^^^^^^^^^^^^^^^^^^^^
14:42:46 [2020-08-04T18:42:46.280Z] [ERROR] ParserConfigurationException cannot be resolved to a type
14:42:46 [2020-08-04T18:42:46.280Z] [ERROR] /home/jenkins/agent/workspace/tracecompass-master-jdk11/tmf/org.eclipse.tracecompass.tmf.ui/src/org/eclipse/tracecompass/tmf/ui/views/colors/ColorSettingsXML.java:[115] 
14:42:46 [2020-08-04T18:42:46.280Z] [ERROR] 	} catch (ParserConfigurationException | TransformerException e) {
14:42:46 [2020-08-04T18:42:46.280Z] [ERROR] 	         ^^^^^^^^^^^^^^^^^^^^^^^^^^^^^^^^^^^^^^^^^^^^^^^^^^^
14:42:46 [2020-08-04T18:42:46.280Z] [ERROR] No exception of type Object can be thrown; an exception type must be a subclass of Throwable
14:42:46 [2020-08-04T18:42:46.280Z] [ERROR] /home/jenkins/agent/workspace/tracecompass-master-jdk11/tmf/org.eclipse.tracecompass.tmf.ui/src/org/eclipse/tracecompass/tmf/ui/views/colors/ColorSettingsXML.java:[115] 
14:42:46 [2020-08-04T18:42:46.280Z] [ERROR] 	} catch (ParserConfigurationException | TransformerException e) {
14:42:46 [2020-08-04T18:42:46.280Z] [ERROR] 	                                        ^^^^^^^^^^^^^^^^^^^^
14:42:46 [2020-08-04T18:42:46.280Z] [ERROR] TransformerException cannot be resolved to a type
14:42:46 [2020-08-04T18:42:46.280Z] [ERROR] /home/jenkins/agent/workspace/tracecompass-master-jdk11/tmf/org.eclipse.tracecompass.tmf.ui/src/org/eclipse/tracecompass/tmf/ui/views/colors/ColorSettingsXML.java:[116] 
14:42:46 [2020-08-04T18:42:46.280Z] [ERROR] 	Activator.getDefault().logError("Error saving color xml file: " + pathName, e); //$NON-NLS-1$
14:42:46 [2020-08-04T18:42:46.280Z] [ERROR] 	                       ^^^^^^^^
14:42:46 [2020-08-04T18:42:46.280Z] [ERROR] The method logError(String, Throwable) in the type Activator is not applicable for the arguments (String, Object)
14:42:46 [2020-08-04T18:42:46.280Z] [ERROR] /home/jenkins/agent/workspace/tracecompass-master-jdk11/tmf/org.eclipse.tracecompass.tmf.ui/src/org/eclipse/tracecompass/tmf/ui/views/colors/ColorSettingsXML.java:[120] 
14:42:46 [2020-08-04T18:42:46.280Z] [ERROR] 	private static void setElementColor(Element element, RGB rgb) {
14:42:46 [2020-08-04T18:42:46.280Z] [ERROR] 	                                    ^^^^^^^
14:42:46 [2020-08-04T18:42:46.280Z] [ERROR] Element cannot be resolved to a type
14:42:46 [2020-08-04T18:42:46.280Z] [ERROR] /home/jenkins/agent/workspace/tracecompass-master-jdk11/tmf/org.eclipse.tracecompass.tmf.ui/src/org/eclipse/tracecompass/tmf/ui/views/colors/ColorSettingsXML.java:[138] 
14:42:46 [2020-08-04T18:42:46.280Z] [ERROR] 	SAXParserFactory parserFactory = SAXParserFactory.newInstance();
14:42:46 [2020-08-04T18:42:46.280Z] [ERROR] 	^^^^^^^^^^^^^^^^
14:42:46 [2020-08-04T18:42:46.280Z] [ERROR] SAXParserFactory cannot be resolved to a type
14:42:46 [2020-08-04T18:42:46.280Z] [ERROR] /home/jenkins/agent/workspace/tracecompass-master-jdk11/tmf/org.eclipse.tracecompass.tmf.ui/src/org/eclipse/tracecompass/tmf/ui/views/colors/ColorSettingsXML.java:[138] 
14:42:46 [2020-08-04T18:42:46.280Z] [ERROR] 	SAXParserFactory parserFactory = SAXParserFactory.newInstance();
14:42:46 [2020-08-04T18:42:46.280Z] [ERROR] 	                                 ^^^^^^^^^^^^^^^^
14:42:46 [2020-08-04T18:42:46.280Z] [ERROR] SAXParserFactory cannot be resolved
14:42:46 [2020-08-04T18:42:46.280Z] [ERROR] /home/jenkins/agent/workspace/tracecompass-master-jdk11/tmf/org.eclipse.tracecompass.tmf.ui/src/org/eclipse/tracecompass/tmf/ui/views/colors/ColorSettingsXML.java:[143] 
14:42:46 [2020-08-04T18:42:46.280Z] [ERROR] 	XMLReader saxReader = parserFactory.newSAXParser().getXMLReader();
14:42:46 [2020-08-04T18:42:46.280Z] [ERROR] 	^^^^^^^^^
14:42:46 [2020-08-04T18:42:46.280Z] [ERROR] XMLReader cannot be resolved to a type
14:42:46 [2020-08-04T18:42:46.280Z] [ERROR] /home/jenkins/agent/workspace/tracecompass-master-jdk11/tmf/org.eclipse.tracecompass.tmf.ui/src/org/eclipse/tracecompass/tmf/ui/views/colors/ColorSettingsXML.java:[147] 
14:42:46 [2020-08-04T18:42:46.280Z] [ERROR] 	} catch (ParserConfigurationException | SAXException | IOException e) {
14:42:46 [2020-08-04T18:42:46.280Z] [ERROR] 	         ^^^^^^^^^^^^^^^^^^^^^^^^^^^^
14:42:46 [2020-08-04T18:42:46.280Z] [ERROR] ParserConfigurationException cannot be resolved to a type
14:42:46 [2020-08-04T18:42:46.280Z] [ERROR] /home/jenkins/agent/workspace/tracecompass-master-jdk11/tmf/org.eclipse.tracecompass.tmf.ui/src/org/eclipse/tracecompass/tmf/ui/views/colors/ColorSettingsXML.java:[147] 
14:42:46 [2020-08-04T18:42:46.280Z] [ERROR] 	} catch (ParserConfigurationException | SAXException | IOException e) {
14:42:46 [2020-08-04T18:42:46.280Z] [ERROR] 	         ^^^^^^^^^^^^^^^^^^^^^^^^^^^^^^^^^^^^^^^^^^^^^^^^^^^^^^^^^
14:42:46 [2020-08-04T18:42:46.280Z] [ERROR] No exception of type Object can be thrown; an exception type must be a subclass of Throwable
14:42:46 [2020-08-04T18:42:46.280Z] [ERROR] /home/jenkins/agent/workspace/tracecompass-master-jdk11/tmf/org.eclipse.tracecompass.tmf.ui/src/org/eclipse/tracecompass/tmf/ui/views/colors/ColorSettingsXML.java:[147] 
14:42:46 [2020-08-04T18:42:46.280Z] [ERROR] 	} catch (ParserConfigurationException | SAXException | IOException e) {
14:42:46 [2020-08-04T18:42:46.280Z] [ERROR] 	                                        ^^^^^^^^^^^^
14:42:46 [2020-08-04T18:42:46.280Z] [ERROR] SAXException cannot be resolved to a type
14:42:46 [2020-08-04T18:42:46.280Z] [ERROR] /home/jenkins/agent/workspace/tracecompass-master-jdk11/tmf/org.eclipse.tracecompass.tmf.ui/src/org/eclipse/tracecompass/tmf/ui/views/colors/ColorSettingsXML.java:[148] 
14:42:46 [2020-08-04T18:42:46.280Z] [ERROR] 	Activator.getDefault().logError("Error loading color xml file: " + pathName, e); //$NON-NLS-1$
14:42:46 [2020-08-04T18:42:46.280Z] [ERROR] 	                       ^^^^^^^^
14:42:46 [2020-08-04T18:42:46.280Z] [ERROR] The method logError(String, Throwable) in the type Activator is not applicable for the arguments (String, Object)
14:42:46 [2020-08-04T18:42:46.280Z] [ERROR] /home/jenkins/agent/workspace/tracecompass-master-jdk11/tmf/org.eclipse.tracecompass.tmf.ui/src/org/eclipse/tracecompass/tmf/ui/views/colors/ColorSettingsXML.java:[158] 
14:42:46 [2020-08-04T18:42:46.280Z] [ERROR] 	private static class ColorSettingsContentHandler extends DefaultHandler {
14:42:46 [2020-08-04T18:42:46.280Z] [ERROR] 	                                                         ^^^^^^^^^^^^^^
14:42:46 [2020-08-04T18:42:46.281Z] [ERROR] DefaultHandler cannot be resolved to a type
14:42:46 [2020-08-04T18:42:46.281Z] [ERROR] /home/jenkins/agent/workspace/tracecompass-master-jdk11/tmf/org.eclipse.tracecompass.tmf.ui/src/org/eclipse/tracecompass/tmf/ui/views/colors/ColorSettingsXML.java:[168] 
14:42:46 [2020-08-04T18:42:46.281Z] [ERROR] 	public void startElement(String uri, String localName, String qName, Attributes attributes)
14:42:46 [2020-08-04T18:42:46.281Z] [ERROR] 	                                                                     ^^^^^^^^^^
14:42:46 [2020-08-04T18:42:46.281Z] [ERROR] Attributes cannot be resolved to a type
14:42:46 [2020-08-04T18:42:46.281Z] [ERROR] /home/jenkins/agent/workspace/tracecompass-master-jdk11/tmf/org.eclipse.tracecompass.tmf.ui/src/org/eclipse/tracecompass/tmf/ui/views/colors/ColorSettingsXML.java:[169] 
14:42:46 [2020-08-04T18:42:46.281Z] [ERROR] 	throws SAXException {
14:42:46 [2020-08-04T18:42:46.281Z] [ERROR] 	       ^^^^^^^^^^^^
14:42:46 [2020-08-04T18:42:46.281Z] [ERROR] SAXException cannot be resolved to a type
14:42:46 [2020-08-04T18:42:46.281Z] [ERROR] /home/jenkins/agent/workspace/tracecompass-master-jdk11/tmf/org.eclipse.tracecompass.tmf.ui/src/org/eclipse/tracecompass/tmf/ui/views/colors/ColorSettingsXML.java:[201] 
14:42:46 [2020-08-04T18:42:46.281Z] [ERROR] 	private static RGB getRGBfromAttributes(Attributes attributes) {
14:42:46 [2020-08-04T18:42:46.281Z] [ERROR] 	                                        ^^^^^^^^^^
14:42:46 [2020-08-04T18:42:46.281Z] [ERROR] Attributes cannot be resolved to a type
14:42:46 [2020-08-04T18:42:46.281Z] [ERROR] /home/jenkins/agent/workspace/tracecompass-master-jdk11/tmf/org.eclipse.tracecompass.tmf.ui/src/org/eclipse/tracecompass/tmf/ui/views/colors/ColorSettingsXML.java:[209] 
14:42:46 [2020-08-04T18:42:46.281Z] [ERROR] 	public void endElement(String uri, String localName, String qName)
14:42:46 [2020-08-04T18:42:46.281Z] [ERROR]                 throws SAXException {
14:42:46 [2020-08-04T18:42:46.281Z] [ERROR] 	            ^^^^^^^^^^^^^^^^^^^^^^^^^^^^^^^^^^^^^^^^^^^^^^^^^^^^^^^^^^^^^^^^^^^^^^^^^^^^^^^^^^^^^^^^^^
14:42:46 [2020-08-04T18:42:46.281Z] [ERROR] The method endElement(String, String, String) of type ColorSettingsXML.ColorSettingsContentHandler must override or implement a supertype method
14:42:46 [2020-08-04T18:42:46.281Z] [ERROR] /home/jenkins/agent/workspace/tracecompass-master-jdk11/tmf/org.eclipse.tracecompass.tmf.ui/src/org/eclipse/tracecompass/tmf/ui/views/colors/ColorSettingsXML.java:[210] 
14:42:46 [2020-08-04T18:42:46.281Z] [ERROR] 	throws SAXException {
14:42:46 [2020-08-04T18:42:46.281Z] [ERROR] 	       ^^^^^^^^^^^^
14:42:46 [2020-08-04T18:42:46.281Z] [ERROR] SAXException cannot be resolved to a type
14:42:46 [2020-08-04T18:42:46.281Z] [ERROR] /home/jenkins/agent/workspace/tracecompass-master-jdk11/tmf/org.eclipse.tracecompass.tmf.ui/src/org/eclipse/tracecompass/internal/tmf/ui/project/wizards/tracepkg/importexport/ManifestReader.java:[26] 
14:42:46 [2020-08-04T18:42:46.281Z] [ERROR] 	import javax.xml.parsers.ParserConfigurationException;
14:42:46 [2020-08-04T18:42:46.281Z] [ERROR] 	       ^^^^^^^^^^^^^^^^^
14:42:46 [2020-08-04T18:42:46.281Z] [ERROR] The package javax.xml.parsers is accessible from more than one module: <unnamed>, java.xml
14:42:46 [2020-08-04T18:42:46.281Z] [ERROR] /home/jenkins/agent/workspace/tracecompass-master-jdk11/tmf/org.eclipse.tracecompass.tmf.ui/src/org/eclipse/tracecompass/internal/tmf/ui/project/wizards/tracepkg/importexport/ManifestReader.java:[27] 
14:42:46 [2020-08-04T18:42:46.281Z] [ERROR] 	import javax.xml.transform.stream.StreamSource;
14:42:46 [2020-08-04T18:42:46.281Z] [ERROR] 	       ^^^^^^^^^^^^^^^^^^^^^^^^^^
14:42:46 [2020-08-04T18:42:46.281Z] [ERROR] The package javax.xml.transform.stream is accessible from more than one module: <unnamed>, java.xml
14:42:46 [2020-08-04T18:42:46.281Z] [ERROR] /home/jenkins/agent/workspace/tracecompass-master-jdk11/tmf/org.eclipse.tracecompass.tmf.ui/src/org/eclipse/tracecompass/internal/tmf/ui/project/wizards/tracepkg/importexport/ManifestReader.java:[28] 
14:42:46 [2020-08-04T18:42:46.281Z] [ERROR] 	import javax.xml.validation.Schema;
14:42:46 [2020-08-04T18:42:46.281Z] [ERROR] 	       ^^^^^^^^^^^^^^^^^^^^
14:42:46 [2020-08-04T18:42:46.281Z] [ERROR] The package javax.xml.validation is accessible from more than one module: <unnamed>, java.xml
14:42:46 [2020-08-04T18:42:46.281Z] [ERROR] /home/jenkins/agent/workspace/tracecompass-master-jdk11/tmf/org.eclipse.tracecompass.tmf.ui/src/org/eclipse/tracecompass/internal/tmf/ui/project/wizards/tracepkg/importexport/ManifestReader.java:[43] 
14:42:46 [2020-08-04T18:42:46.281Z] [ERROR] 	import org.w3c.dom.Document;
14:42:46 [2020-08-04T18:42:46.281Z] [ERROR] 	       ^^^^^^^^^^^
14:42:46 [2020-08-04T18:42:46.281Z] [ERROR] The package org.w3c.dom is accessible from more than one module: <unnamed>, java.xml
14:42:46 [2020-08-04T18:42:46.281Z] [ERROR] /home/jenkins/agent/workspace/tracecompass-master-jdk11/tmf/org.eclipse.tracecompass.tmf.ui/src/org/eclipse/tracecompass/internal/tmf/ui/project/wizards/tracepkg/importexport/ManifestReader.java:[44] 
14:42:46 [2020-08-04T18:42:46.281Z] [ERROR] 	import org.w3c.dom.Element;
14:42:46 [2020-08-04T18:42:46.281Z] [ERROR] 	       ^^^^^^^^^^^
14:42:46 [2020-08-04T18:42:46.281Z] [ERROR] The package org.w3c.dom is accessible from more than one module: <unnamed>, java.xml
14:42:46 [2020-08-04T18:42:46.281Z] [ERROR] /home/jenkins/agent/workspace/tracecompass-master-jdk11/tmf/org.eclipse.tracecompass.tmf.ui/src/org/eclipse/tracecompass/internal/tmf/ui/project/wizards/tracepkg/importexport/ManifestReader.java:[45] 
14:42:46 [2020-08-04T18:42:46.281Z] [ERROR] 	import org.w3c.dom.NamedNodeMap;
14:42:46 [2020-08-04T18:42:46.281Z] [ERROR] 	       ^^^^^^^^^^^
14:42:46 [2020-08-04T18:42:46.281Z] [ERROR] The package org.w3c.dom is accessible from more than one module: <unnamed>, java.xml
14:42:46 [2020-08-04T18:42:46.281Z] [ERROR] /home/jenkins/agent/workspace/tracecompass-master-jdk11/tmf/org.eclipse.tracecompass.tmf.ui/src/org/eclipse/tracecompass/internal/tmf/ui/project/wizards/tracepkg/importexport/ManifestReader.java:[46] 
14:42:46 [2020-08-04T18:42:46.281Z] [ERROR] 	import org.w3c.dom.Node;
14:42:46 [2020-08-04T18:42:46.281Z] [ERROR] 	       ^^^^^^^^^^^
14:42:46 [2020-08-04T18:42:46.281Z] [ERROR] The package org.w3c.dom is accessible from more than one module: <unnamed>, java.xml
14:42:46 [2020-08-04T18:42:46.281Z] [ERROR] /home/jenkins/agent/workspace/tracecompass-master-jdk11/tmf/org.eclipse.tracecompass.tmf.ui/src/org/eclipse/tracecompass/internal/tmf/ui/project/wizards/tracepkg/importexport/ManifestReader.java:[47] 
14:42:46 [2020-08-04T18:42:46.281Z] [ERROR] 	import org.w3c.dom.NodeList;
14:42:46 [2020-08-04T18:42:46.281Z] [ERROR] 	       ^^^^^^^^^^^
14:42:46 [2020-08-04T18:42:46.281Z] [ERROR] The package org.w3c.dom is accessible from more than one module: <unnamed>, java.xml
14:42:46 [2020-08-04T18:42:46.281Z] [ERROR] /home/jenkins/agent/workspace/tracecompass-master-jdk11/tmf/org.eclipse.tracecompass.tmf.ui/src/org/eclipse/tracecompass/internal/tmf/ui/project/wizards/tracepkg/importexport/ManifestReader.java:[48] 
14:42:46 [2020-08-04T18:42:46.281Z] [ERROR] 	import org.xml.sax.SAXException;
14:42:46 [2020-08-04T18:42:46.281Z] [ERROR] 	       ^^^^^^^^^^^
14:42:46 [2020-08-04T18:42:46.281Z] [ERROR] The package org.xml.sax is accessible from more than one module: <unnamed>, java.xml
14:42:46 [2020-08-04T18:42:46.281Z] [ERROR] /home/jenkins/agent/workspace/tracecompass-master-jdk11/tmf/org.eclipse.tracecompass.tmf.ui/src/org/eclipse/tracecompass/internal/tmf/ui/project/wizards/tracepkg/importexport/ManifestReader.java:[80] 
14:42:46 [2020-08-04T18:42:46.281Z] [ERROR] 	Schema schema = XmlUtils.newSafeSchemaFactory().newSchema(new StreamSource(schemaFileUrl.openStream()));
14:42:46 [2020-08-04T18:42:46.281Z] [ERROR] 	^^^^^^
14:42:46 [2020-08-04T18:42:46.281Z] [ERROR] Schema cannot be resolved to a type
14:42:46 [2020-08-04T18:42:46.281Z] [ERROR] /home/jenkins/agent/workspace/tracecompass-master-jdk11/tmf/org.eclipse.tracecompass.tmf.ui/src/org/eclipse/tracecompass/internal/tmf/ui/project/wizards/tracepkg/importexport/ManifestReader.java:[80] 
14:42:46 [2020-08-04T18:42:46.281Z] [ERROR] 	Schema schema = XmlUtils.newSafeSchemaFactory().newSchema(new StreamSource(schemaFileUrl.openStream()));
14:42:46 [2020-08-04T18:42:46.282Z] [ERROR] 	                                                              ^^^^^^^^^^^^
14:42:46 [2020-08-04T18:42:46.282Z] [ERROR] StreamSource cannot be resolved to a type
14:42:46 [2020-08-04T18:42:46.282Z] [ERROR] /home/jenkins/agent/workspace/tracecompass-master-jdk11/tmf/org.eclipse.tracecompass.tmf.ui/src/org/eclipse/tracecompass/internal/tmf/ui/project/wizards/tracepkg/importexport/ManifestReader.java:[81] 
14:42:46 [2020-08-04T18:42:46.282Z] [ERROR] 	XmlUtils.safeValidate(schema, new StreamSource(input));
14:42:46 [2020-08-04T18:42:46.282Z] [ERROR] 	                                  ^^^^^^^^^^^^
14:42:46 [2020-08-04T18:42:46.282Z] [ERROR] StreamSource cannot be resolved to a type
14:42:46 [2020-08-04T18:42:46.282Z] [ERROR] /home/jenkins/agent/workspace/tracecompass-master-jdk11/tmf/org.eclipse.tracecompass.tmf.ui/src/org/eclipse/tracecompass/internal/tmf/ui/project/wizards/tracepkg/importexport/ManifestReader.java:[82] 
14:42:46 [2020-08-04T18:42:46.282Z] [ERROR] 	} catch (SAXException | IOException e) {
14:42:46 [2020-08-04T18:42:46.282Z] [ERROR] 	         ^^^^^^^^^^^^
14:42:46 [2020-08-04T18:42:46.282Z] [ERROR] SAXException cannot be resolved to a type
14:42:46 [2020-08-04T18:42:46.282Z] [ERROR] /home/jenkins/agent/workspace/tracecompass-master-jdk11/tmf/org.eclipse.tracecompass.tmf.ui/src/org/eclipse/tracecompass/internal/tmf/ui/project/wizards/tracepkg/importexport/ManifestReader.java:[82] 
14:42:46 [2020-08-04T18:42:46.282Z] [ERROR] 	} catch (SAXException | IOException e) {
14:42:46 [2020-08-04T18:42:46.282Z] [ERROR] 	         ^^^^^^^^^^^^^^^^^^^^^^^^^^
14:42:46 [2020-08-04T18:42:46.282Z] [ERROR] No exception of type Object can be thrown; an exception type must be a subclass of Throwable
14:42:46 [2020-08-04T18:42:46.282Z] [ERROR] /home/jenkins/agent/workspace/tracecompass-master-jdk11/tmf/org.eclipse.tracecompass.tmf.ui/src/org/eclipse/tracecompass/internal/tmf/ui/project/wizards/tracepkg/importexport/ManifestReader.java:[83] 
14:42:46 [2020-08-04T18:42:46.282Z] [ERROR] 	throw new IOException(Messages.TracePackageExtractManifestOperation_ErrorManifestNotValid, e);
14:42:46 [2020-08-04T18:42:46.282Z] [ERROR] 	      ^^^^^^^^^^^^^^^^^^^^^^^^^^^^^^^^^^^^^^^^^^^^^^^^^^^^^^^^^^^^^^^^^^^^^^^^^^^^^^^^^^^^^^^
14:42:46 [2020-08-04T18:42:46.282Z] [ERROR] The constructor IOException(String, Object) is undefined
14:42:46 [2020-08-04T18:42:46.282Z] [ERROR] /home/jenkins/agent/workspace/tracecompass-master-jdk11/tmf/org.eclipse.tracecompass.tmf.ui/src/org/eclipse/tracecompass/internal/tmf/ui/project/wizards/tracepkg/importexport/ManifestReader.java:[114] 
14:42:46 [2020-08-04T18:42:46.282Z] [ERROR] 	public static TracePackageElement[] loadElementsFromManifest(InputStream inputStream) throws IOException, SAXException, ParserConfigurationException {
14:42:46 [2020-08-04T18:42:46.282Z] [ERROR] 	                                                                                                          ^^^^^^^^^^^^
14:42:46 [2020-08-04T18:42:46.282Z] [ERROR] SAXException cannot be resolved to a type
14:42:46 [2020-08-04T18:42:46.282Z] [ERROR] /home/jenkins/agent/workspace/tracecompass-master-jdk11/tmf/org.eclipse.tracecompass.tmf.ui/src/org/eclipse/tracecompass/internal/tmf/ui/project/wizards/tracepkg/importexport/ManifestReader.java:[114] 
14:42:46 [2020-08-04T18:42:46.282Z] [ERROR] 	public static TracePackageElement[] loadElementsFromManifest(InputStream inputStream) throws IOException, SAXException, ParserConfigurationException {
14:42:46 [2020-08-04T18:42:46.282Z] [ERROR] 	                                                                                                                        ^^^^^^^^^^^^^^^^^^^^^^^^^^^^
14:42:46 [2020-08-04T18:42:46.282Z] [ERROR] ParserConfigurationException cannot be resolved to a type
14:42:46 [2020-08-04T18:42:46.282Z] [ERROR] /home/jenkins/agent/workspace/tracecompass-master-jdk11/tmf/org.eclipse.tracecompass.tmf.ui/src/org/eclipse/tracecompass/internal/tmf/ui/project/wizards/tracepkg/importexport/ManifestReader.java:[115] 
14:42:46 [2020-08-04T18:42:46.282Z] [ERROR] 	Document doc = XmlUtils.newSafeDocumentBuilderFactory().newDocumentBuilder().parse(inputStream);
14:42:46 [2020-08-04T18:42:46.282Z] [ERROR] 	^^^^^^^^
14:42:46 [2020-08-04T18:42:46.282Z] [ERROR] Document cannot be resolved to a type
14:42:46 [2020-08-04T18:42:46.282Z] [ERROR] /home/jenkins/agent/workspace/tracecompass-master-jdk11/tmf/org.eclipse.tracecompass.tmf.ui/src/org/eclipse/tracecompass/internal/tmf/ui/project/wizards/tracepkg/importexport/ManifestReader.java:[116] 
14:42:46 [2020-08-04T18:42:46.282Z] [ERROR] 	Element rootElement = doc.getDocumentElement();
14:42:46 [2020-08-04T18:42:46.282Z] [ERROR] 	^^^^^^^
14:42:46 [2020-08-04T18:42:46.282Z] [ERROR] Element cannot be resolved to a type
14:42:46 [2020-08-04T18:42:46.282Z] [ERROR] /home/jenkins/agent/workspace/tracecompass-master-jdk11/tmf/org.eclipse.tracecompass.tmf.ui/src/org/eclipse/tracecompass/internal/tmf/ui/project/wizards/tracepkg/importexport/ManifestReader.java:[127] 
14:42:46 [2020-08-04T18:42:46.282Z] [ERROR] 	public static TracePackageElement[] loadElementsFromNode(Element rootElement) {
14:42:46 [2020-08-04T18:42:46.282Z] [ERROR] 	                                                         ^^^^^^^
14:42:46 [2020-08-04T18:42:46.282Z] [ERROR] Element cannot be resolved to a type
14:42:46 [2020-08-04T18:42:46.282Z] [ERROR] /home/jenkins/agent/workspace/tracecompass-master-jdk11/tmf/org.eclipse.tracecompass.tmf.ui/src/org/eclipse/tracecompass/internal/tmf/ui/project/wizards/tracepkg/importexport/ManifestReader.java:[129] 
14:42:46 [2020-08-04T18:42:46.282Z] [ERROR] 	NodeList experimentElements = rootElement.getElementsByTagName(ITracePackageConstants.EXPERIMENT_ELEMENT);
14:42:46 [2020-08-04T18:42:46.282Z] [ERROR] 	^^^^^^^^
14:42:46 [2020-08-04T18:42:46.282Z] [ERROR] NodeList cannot be resolved to a type
14:42:46 [2020-08-04T18:42:46.282Z] [ERROR] /home/jenkins/agent/workspace/tracecompass-master-jdk11/tmf/org.eclipse.tracecompass.tmf.ui/src/org/eclipse/tracecompass/internal/tmf/ui/project/wizards/tracepkg/importexport/ManifestReader.java:[131] 
14:42:46 [2020-08-04T18:42:46.282Z] [ERROR] 	NodeList traceElements = rootElement.getElementsByTagName(ITracePackageConstants.TRACE_ELEMENT);
14:42:46 [2020-08-04T18:42:46.282Z] [ERROR] 	^^^^^^^^
14:42:46 [2020-08-04T18:42:46.282Z] [ERROR] NodeList cannot be resolved to a type
14:42:46 [2020-08-04T18:42:46.282Z] [ERROR] /home/jenkins/agent/workspace/tracecompass-master-jdk11/tmf/org.eclipse.tracecompass.tmf.ui/src/org/eclipse/tracecompass/internal/tmf/ui/project/wizards/tracepkg/importexport/ManifestReader.java:[136] 
14:42:46 [2020-08-04T18:42:46.282Z] [ERROR] 	private static void loadTracesFomNodeList(List<TracePackageElement> packageElements, NodeList traceElements) {
14:42:46 [2020-08-04T18:42:46.282Z] [ERROR] 	                                                                                     ^^^^^^^^
14:42:46 [2020-08-04T18:42:46.282Z] [ERROR] NodeList cannot be resolved to a type
14:42:46 [2020-08-04T18:42:46.282Z] [ERROR] /home/jenkins/agent/workspace/tracecompass-master-jdk11/tmf/org.eclipse.tracecompass.tmf.ui/src/org/eclipse/tracecompass/internal/tmf/ui/project/wizards/tracepkg/importexport/ManifestReader.java:[138] 
14:42:46 [2020-08-04T18:42:46.282Z] [ERROR] 	Node traceNode = traceElements.item(i);
14:42:46 [2020-08-04T18:42:46.282Z] [ERROR] 	^^^^
14:42:46 [2020-08-04T18:42:46.282Z] [ERROR] Node cannot be resolved to a type
14:42:46 [2020-08-04T18:42:46.282Z] [ERROR] /home/jenkins/agent/workspace/tracecompass-master-jdk11/tmf/org.eclipse.tracecompass.tmf.ui/src/org/eclipse/tracecompass/internal/tmf/ui/project/wizards/tracepkg/importexport/ManifestReader.java:[139] 
14:42:46 [2020-08-04T18:42:46.282Z] [ERROR] 	if (traceNode.getNodeType() == Node.ELEMENT_NODE) {
14:42:46 [2020-08-04T18:42:46.282Z] [ERROR] 	                               ^^^^
14:42:46 [2020-08-04T18:42:46.282Z] [ERROR] Node cannot be resolved to a variable
14:42:46 [2020-08-04T18:42:46.282Z] [ERROR] /home/jenkins/agent/workspace/tracecompass-master-jdk11/tmf/org.eclipse.tracecompass.tmf.ui/src/org/eclipse/tracecompass/internal/tmf/ui/project/wizards/tracepkg/importexport/ManifestReader.java:[140] 
14:42:46 [2020-08-04T18:42:46.282Z] [ERROR] 	Element traceElement = (Element) traceNode;
14:42:46 [2020-08-04T18:42:46.282Z] [ERROR] 	^^^^^^^
14:42:46 [2020-08-04T18:42:46.282Z] [ERROR] Element cannot be resolved to a type
14:42:46 [2020-08-04T18:42:46.282Z] [ERROR] /home/jenkins/agent/workspace/tracecompass-master-jdk11/tmf/org.eclipse.tracecompass.tmf.ui/src/org/eclipse/tracecompass/internal/tmf/ui/project/wizards/tracepkg/importexport/ManifestReader.java:[140] 
14:42:46 [2020-08-04T18:42:46.282Z] [ERROR] 	Element traceElement = (Element) traceNode;
14:42:46 [2020-08-04T18:42:46.282Z] [ERROR] 	                        ^^^^^^^
14:42:46 [2020-08-04T18:42:46.282Z] [ERROR] Element cannot be resolved to a type
14:42:46 [2020-08-04T18:42:46.282Z] [ERROR] /home/jenkins/agent/workspace/tracecompass-master-jdk11/tmf/org.eclipse.tracecompass.tmf.ui/src/org/eclipse/tracecompass/internal/tmf/ui/project/wizards/tracepkg/importexport/ManifestReader.java:[147] 
14:42:46 [2020-08-04T18:42:46.282Z] [ERROR] 	NodeList expTraces = traceElement.getElementsByTagName(ITracePackageConstants.EXP_TRACE_ELEMENT);
14:42:46 [2020-08-04T18:42:46.282Z] [ERROR] 	^^^^^^^^
14:42:46 [2020-08-04T18:42:46.282Z] [ERROR] NodeList cannot be resolved to a type
14:42:46 [2020-08-04T18:42:46.282Z] [ERROR] /home/jenkins/agent/workspace/tracecompass-master-jdk11/tmf/org.eclipse.tracecompass.tmf.ui/src/org/eclipse/tracecompass/internal/tmf/ui/project/wizards/tracepkg/importexport/ManifestReader.java:[149] 
14:42:46 [2020-08-04T18:42:46.282Z] [ERROR] 	Node expTraceNode = expTraces.item(j);
14:42:46 [2020-08-04T18:42:46.282Z] [ERROR] 	^^^^
14:42:46 [2020-08-04T18:42:46.282Z] [ERROR] Node cannot be resolved to a type
14:42:46 [2020-08-04T18:42:46.282Z] [ERROR] /home/jenkins/agent/workspace/tracecompass-master-jdk11/tmf/org.eclipse.tracecompass.tmf.ui/src/org/eclipse/tracecompass/internal/tmf/ui/project/wizards/tracepkg/importexport/ManifestReader.java:[150] 
14:42:46 [2020-08-04T18:42:46.282Z] [ERROR] 	if (expTraceNode.getNodeType() == Node.ELEMENT_NODE) {
14:42:46 [2020-08-04T18:42:46.282Z] [ERROR] 	                                  ^^^^
14:42:46 [2020-08-04T18:42:46.282Z] [ERROR] Node cannot be resolved to a variable
14:42:46 [2020-08-04T18:42:46.282Z] [ERROR] /home/jenkins/agent/workspace/tracecompass-master-jdk11/tmf/org.eclipse.tracecompass.tmf.ui/src/org/eclipse/tracecompass/internal/tmf/ui/project/wizards/tracepkg/importexport/ManifestReader.java:[151] 
14:42:46 [2020-08-04T18:42:46.282Z] [ERROR] 	Element expTraceElement = (Element) expTraceNode;
14:42:46 [2020-08-04T18:42:46.282Z] [ERROR] 	^^^^^^^
14:42:46 [2020-08-04T18:42:46.282Z] [ERROR] Element cannot be resolved to a type
14:42:46 [2020-08-04T18:42:46.282Z] [ERROR] /home/jenkins/agent/workspace/tracecompass-master-jdk11/tmf/org.eclipse.tracecompass.tmf.ui/src/org/eclipse/tracecompass/internal/tmf/ui/project/wizards/tracepkg/importexport/ManifestReader.java:[151] 
14:42:46 [2020-08-04T18:42:46.282Z] [ERROR] 	Element expTraceElement = (Element) expTraceNode;
14:42:46 [2020-08-04T18:42:46.282Z] [ERROR] 	                           ^^^^^^^
14:42:46 [2020-08-04T18:42:46.282Z] [ERROR] Element cannot be resolved to a type
14:42:46 [2020-08-04T18:42:46.282Z] [ERROR] /home/jenkins/agent/workspace/tracecompass-master-jdk11/tmf/org.eclipse.tracecompass.tmf.ui/src/org/eclipse/tracecompass/internal/tmf/ui/project/wizards/tracepkg/importexport/ManifestReader.java:[158] 
14:42:46 [2020-08-04T18:42:46.282Z] [ERROR] 	NodeList fileElements = traceElement.getElementsByTagName(ITracePackageConstants.TRACE_FILE_ELEMENT);
14:42:46 [2020-08-04T18:42:46.282Z] [ERROR] 	^^^^^^^^
14:42:46 [2020-08-04T18:42:46.282Z] [ERROR] NodeList cannot be resolved to a type
14:42:46 [2020-08-04T18:42:46.282Z] [ERROR] /home/jenkins/agent/workspace/tracecompass-master-jdk11/tmf/org.eclipse.tracecompass.tmf.ui/src/org/eclipse/tracecompass/internal/tmf/ui/project/wizards/tracepkg/importexport/ManifestReader.java:[160] 
14:42:46 [2020-08-04T18:42:46.282Z] [ERROR] 	Node fileNode = fileElements.item(j);
14:42:46 [2020-08-04T18:42:46.282Z] [ERROR] 	^^^^
14:42:46 [2020-08-04T18:42:46.282Z] [ERROR] Node cannot be resolved to a type
14:42:46 [2020-08-04T18:42:46.282Z] [ERROR] /home/jenkins/agent/workspace/tracecompass-master-jdk11/tmf/org.eclipse.tracecompass.tmf.ui/src/org/eclipse/tracecompass/internal/tmf/ui/project/wizards/tracepkg/importexport/ManifestReader.java:[161] 
14:42:46 [2020-08-04T18:42:46.282Z] [ERROR] 	if (fileNode.getNodeType() == Node.ELEMENT_NODE) {
14:42:46 [2020-08-04T18:42:46.282Z] [ERROR] 	                              ^^^^
14:42:46 [2020-08-04T18:42:46.282Z] [ERROR] Node cannot be resolved to a variable
14:42:46 [2020-08-04T18:42:46.282Z] [ERROR] /home/jenkins/agent/workspace/tracecompass-master-jdk11/tmf/org.eclipse.tracecompass.tmf.ui/src/org/eclipse/tracecompass/internal/tmf/ui/project/wizards/tracepkg/importexport/ManifestReader.java:[162] 
14:42:46 [2020-08-04T18:42:46.282Z] [ERROR] 	Element fileElement = (Element) fileNode;
14:42:46 [2020-08-04T18:42:46.282Z] [ERROR] 	^^^^^^^
14:42:46 [2020-08-04T18:42:46.282Z] [ERROR] Element cannot be resolved to a type
14:42:46 [2020-08-04T18:42:46.282Z] [ERROR] /home/jenkins/agent/workspace/tracecompass-master-jdk11/tmf/org.eclipse.tracecompass.tmf.ui/src/org/eclipse/tracecompass/internal/tmf/ui/project/wizards/tracepkg/importexport/ManifestReader.java:[162] 
14:42:46 [2020-08-04T18:42:46.282Z] [ERROR] 	Element fileElement = (Element) fileNode;
14:42:46 [2020-08-04T18:42:46.282Z] [ERROR] 	                       ^^^^^^^
14:42:46 [2020-08-04T18:42:46.282Z] [ERROR] Element cannot be resolved to a type
14:42:46 [2020-08-04T18:42:46.282Z] [ERROR] /home/jenkins/agent/workspace/tracecompass-master-jdk11/tmf/org.eclipse.tracecompass.tmf.ui/src/org/eclipse/tracecompass/internal/tmf/ui/project/wizards/tracepkg/importexport/ManifestReader.java:[170] 
14:42:46 [2020-08-04T18:42:46.282Z] [ERROR] 	NodeList suppFilesElements = traceElement.getElementsByTagName(ITracePackageConstants.SUPPLEMENTARY_FILE_ELEMENT);
14:42:46 [2020-08-04T18:42:46.282Z] [ERROR] 	^^^^^^^^
14:42:46 [2020-08-04T18:42:46.282Z] [ERROR] NodeList cannot be resolved to a type
14:42:46 [2020-08-04T18:42:46.282Z] [ERROR] /home/jenkins/agent/workspace/tracecompass-master-jdk11/tmf/org.eclipse.tracecompass.tmf.ui/src/org/eclipse/tracecompass/internal/tmf/ui/project/wizards/tracepkg/importexport/ManifestReader.java:[174] 
14:42:46 [2020-08-04T18:42:46.282Z] [ERROR] 	Node suppFileNode = suppFilesElements.item(j);
14:42:46 [2020-08-04T18:42:46.282Z] [ERROR] 	^^^^
14:42:46 [2020-08-04T18:42:46.282Z] [ERROR] Node cannot be resolved to a type
14:42:46 [2020-08-04T18:42:46.282Z] [ERROR] /home/jenkins/agent/workspace/tracecompass-master-jdk11/tmf/org.eclipse.tracecompass.tmf.ui/src/org/eclipse/tracecompass/internal/tmf/ui/project/wizards/tracepkg/importexport/ManifestReader.java:[175] 
14:42:46 [2020-08-04T18:42:46.282Z] [ERROR] 	if (suppFileNode.getNodeType() == Node.ELEMENT_NODE) {
14:42:46 [2020-08-04T18:42:46.282Z] [ERROR] 	                                  ^^^^
14:42:46 [2020-08-04T18:42:46.282Z] [ERROR] Node cannot be resolved to a variable
14:42:46 [2020-08-04T18:42:46.283Z] [ERROR] /home/jenkins/agent/workspace/tracecompass-master-jdk11/tmf/org.eclipse.tracecompass.tmf.ui/src/org/eclipse/tracecompass/internal/tmf/ui/project/wizards/tracepkg/importexport/ManifestReader.java:[176] 
14:42:46 [2020-08-04T18:42:46.283Z] [ERROR] 	Element suppFileElement = (Element) suppFileNode;
14:42:46 [2020-08-04T18:42:46.283Z] [ERROR] 	^^^^^^^
14:42:46 [2020-08-04T18:42:46.283Z] [ERROR] Element cannot be resolved to a type
14:42:46 [2020-08-04T18:42:46.283Z] [ERROR] /home/jenkins/agent/workspace/tracecompass-master-jdk11/tmf/org.eclipse.tracecompass.tmf.ui/src/org/eclipse/tracecompass/internal/tmf/ui/project/wizards/tracepkg/importexport/ManifestReader.java:[176] 
14:42:46 [2020-08-04T18:42:46.283Z] [ERROR] 	Element suppFileElement = (Element) suppFileNode;
14:42:46 [2020-08-04T18:42:46.283Z] [ERROR] 	                           ^^^^^^^
14:42:46 [2020-08-04T18:42:46.283Z] [ERROR] Element cannot be resolved to a type
14:42:46 [2020-08-04T18:42:46.283Z] [ERROR] /home/jenkins/agent/workspace/tracecompass-master-jdk11/tmf/org.eclipse.tracecompass.tmf.ui/src/org/eclipse/tracecompass/internal/tmf/ui/project/wizards/tracepkg/importexport/ManifestReader.java:[185] 
14:42:46 [2020-08-04T18:42:46.283Z] [ERROR] 	NodeList bookmarksElements = traceElement.getElementsByTagName(ITracePackageConstants.BOOKMARKS_ELEMENT);
14:42:46 [2020-08-04T18:42:46.283Z] [ERROR] 	^^^^^^^^
14:42:46 [2020-08-04T18:42:46.283Z] [ERROR] NodeList cannot be resolved to a type
14:42:46 [2020-08-04T18:42:46.283Z] [ERROR] /home/jenkins/agent/workspace/tracecompass-master-jdk11/tmf/org.eclipse.tracecompass.tmf.ui/src/org/eclipse/tracecompass/internal/tmf/ui/project/wizards/tracepkg/importexport/ManifestReader.java:[187] 
14:42:46 [2020-08-04T18:42:46.283Z] [ERROR] 	Node bookmarksNode = bookmarksElements.item(j);
14:42:46 [2020-08-04T18:42:46.283Z] [ERROR] 	^^^^
14:42:46 [2020-08-04T18:42:46.283Z] [ERROR] Node cannot be resolved to a type
14:42:46 [2020-08-04T18:42:46.283Z] [ERROR] /home/jenkins/agent/workspace/tracecompass-master-jdk11/tmf/org.eclipse.tracecompass.tmf.ui/src/org/eclipse/tracecompass/internal/tmf/ui/project/wizards/tracepkg/importexport/ManifestReader.java:[188] 
14:42:46 [2020-08-04T18:42:46.283Z] [ERROR] 	if (bookmarksNode.getNodeType() == Node.ELEMENT_NODE) {
14:42:46 [2020-08-04T18:42:46.283Z] [ERROR] 	                                   ^^^^
14:42:46 [2020-08-04T18:42:46.283Z] [ERROR] Node cannot be resolved to a variable
14:42:46 [2020-08-04T18:42:46.283Z] [ERROR] /home/jenkins/agent/workspace/tracecompass-master-jdk11/tmf/org.eclipse.tracecompass.tmf.ui/src/org/eclipse/tracecompass/internal/tmf/ui/project/wizards/tracepkg/importexport/ManifestReader.java:[189] 
14:42:46 [2020-08-04T18:42:46.283Z] [ERROR] 	NodeList bookmarkElements = traceElement.getElementsByTagName(ITracePackageConstants.BOOKMARK_ELEMENT);
14:42:46 [2020-08-04T18:42:46.283Z] [ERROR] 	^^^^^^^^
14:42:46 [2020-08-04T18:42:46.283Z] [ERROR] NodeList cannot be resolved to a type
14:42:46 [2020-08-04T18:42:46.283Z] [ERROR] /home/jenkins/agent/workspace/tracecompass-master-jdk11/tmf/org.eclipse.tracecompass.tmf.ui/src/org/eclipse/tracecompass/internal/tmf/ui/project/wizards/tracepkg/importexport/ManifestReader.java:[191] 
14:42:46 [2020-08-04T18:42:46.283Z] [ERROR] 	Node bookmarkNode = bookmarkElements.item(k);
14:42:46 [2020-08-04T18:42:46.283Z] [ERROR] 	^^^^
14:42:46 [2020-08-04T18:42:46.283Z] [ERROR] Node cannot be resolved to a type
14:42:46 [2020-08-04T18:42:46.283Z] [ERROR] /home/jenkins/agent/workspace/tracecompass-master-jdk11/tmf/org.eclipse.tracecompass.tmf.ui/src/org/eclipse/tracecompass/internal/tmf/ui/project/wizards/tracepkg/importexport/ManifestReader.java:[192] 
14:42:46 [2020-08-04T18:42:46.283Z] [ERROR] 	if (bookmarkNode.getNodeType() == Node.ELEMENT_NODE) {
14:42:46 [2020-08-04T18:42:46.283Z] [ERROR] 	                                  ^^^^
14:42:46 [2020-08-04T18:42:46.283Z] [ERROR] Node cannot be resolved to a variable
14:42:46 [2020-08-04T18:42:46.283Z] [ERROR] /home/jenkins/agent/workspace/tracecompass-master-jdk11/tmf/org.eclipse.tracecompass.tmf.ui/src/org/eclipse/tracecompass/internal/tmf/ui/project/wizards/tracepkg/importexport/ManifestReader.java:[193] 
14:42:46 [2020-08-04T18:42:46.283Z] [ERROR] 	Element bookmarkElement = (Element) bookmarkNode;
14:42:46 [2020-08-04T18:42:46.283Z] [ERROR] 	^^^^^^^
14:42:46 [2020-08-04T18:42:46.283Z] [ERROR] Element cannot be resolved to a type
14:42:46 [2020-08-04T18:42:46.283Z] [ERROR] /home/jenkins/agent/workspace/tracecompass-master-jdk11/tmf/org.eclipse.tracecompass.tmf.ui/src/org/eclipse/tracecompass/internal/tmf/ui/project/wizards/tracepkg/importexport/ManifestReader.java:[193] 
14:42:46 [2020-08-04T18:42:46.283Z] [ERROR] 	Element bookmarkElement = (Element) bookmarkNode;
14:42:46 [2020-08-04T18:42:46.283Z] [ERROR] 	                           ^^^^^^^
14:42:46 [2020-08-04T18:42:46.283Z] [ERROR] Element cannot be resolved to a type
14:42:46 [2020-08-04T18:42:46.283Z] [ERROR] /home/jenkins/agent/workspace/tracecompass-master-jdk11/tmf/org.eclipse.tracecompass.tmf.ui/src/org/eclipse/tracecompass/internal/tmf/ui/project/wizards/tracepkg/importexport/ManifestReader.java:[194] 
14:42:46 [2020-08-04T18:42:46.283Z] [ERROR] 	NamedNodeMap attributesMap = bookmarkElement.getAttributes();
14:42:46 [2020-08-04T18:42:46.283Z] [ERROR] 	^^^^^^^^^^^^
14:42:46 [2020-08-04T18:42:46.283Z] [ERROR] NamedNodeMap cannot be resolved to a type
14:42:46 [2020-08-04T18:42:46.283Z] [ERROR] /home/jenkins/agent/workspace/tracecompass-master-jdk11/tmf/org.eclipse.tracecompass.tmf.ui/src/org/eclipse/tracecompass/internal/tmf/ui/project/wizards/tracepkg/importexport/ManifestReader.java:[197] 
14:42:46 [2020-08-04T18:42:46.283Z] [ERROR] 	Node item = attributesMap.item(l);
14:42:46 [2020-08-04T18:42:46.283Z] [ERROR] 	^^^^
14:42:46 [2020-08-04T18:42:46.283Z] [ERROR] Node cannot be resolved to a type
14:42:46 [2020-08-04T18:42:46.283Z] [ERROR] /home/jenkins/agent/workspace/tracecompass-master-jdk11/tmf/org.eclipse.tracecompass.tmf.ui/src/org/eclipse/tracecompass/tmf/ui/views/filter/FilterView.java:[21] 
14:42:46 [2020-08-04T18:42:46.283Z] [ERROR] 	import javax.xml.parsers.ParserConfigurationException;
14:42:46 [2020-08-04T18:42:46.283Z] [ERROR] 	       ^^^^^^^^^^^^^^^^^
14:42:46 [2020-08-04T18:42:46.283Z] [ERROR] The package javax.xml.parsers is accessible from more than one module: <unnamed>, java.xml
14:42:46 [2020-08-04T18:42:46.283Z] [ERROR] /home/jenkins/agent/workspace/tracecompass-master-jdk11/tmf/org.eclipse.tracecompass.tmf.ui/src/org/eclipse/tracecompass/tmf/ui/views/filter/FilterView.java:[50] 
14:42:46 [2020-08-04T18:42:46.283Z] [ERROR] 	import org.xml.sax.SAXException;
14:42:46 [2020-08-04T18:42:46.283Z] [ERROR] 	       ^^^^^^^^^^^
14:42:46 [2020-08-04T18:42:46.283Z] [ERROR] The package org.xml.sax is accessible from more than one module: <unnamed>, java.xml
14:42:46 [2020-08-04T18:42:46.283Z] [ERROR] /home/jenkins/agent/workspace/tracecompass-master-jdk11/tmf/org.eclipse.tracecompass.tmf.ui/src/org/eclipse/tracecompass/tmf/ui/views/filter/FilterView.java:[278] 
14:42:46 [2020-08-04T18:42:46.283Z] [ERROR] 	} catch (ParserConfigurationException e) {
14:42:46 [2020-08-04T18:42:46.283Z] [ERROR] 	         ^^^^^^^^^^^^^^^^^^^^^^^^^^^^
14:42:46 [2020-08-04T18:42:46.283Z] [ERROR] ParserConfigurationException cannot be resolved to a type
14:42:46 [2020-08-04T18:42:46.283Z] [ERROR] /home/jenkins/agent/workspace/tracecompass-master-jdk11/tmf/org.eclipse.tracecompass.tmf.ui/src/org/eclipse/tracecompass/tmf/ui/views/filter/FilterView.java:[301] 
14:42:46 [2020-08-04T18:42:46.283Z] [ERROR] 	} catch (SAXException e) {
14:42:46 [2020-08-04T18:42:46.283Z] [ERROR] 	         ^^^^^^^^^^^^
14:42:46 [2020-08-04T18:42:46.283Z] [ERROR] SAXException cannot be resolved to a type
14:42:46 [2020-08-04T18:42:46.283Z] [ERROR] /home/jenkins/agent/workspace/tracecompass-master-jdk11/tmf/org.eclipse.tracecompass.tmf.ui/src/org/eclipse/tracecompass/internal/tmf/ui/project/wizards/tracepkg/importexport/TracePackageExtractManifestOperation.java:[94] 
14:42:46 [2020-08-04T18:42:46.283Z] [ERROR] 	elements = ManifestReader.loadElementsFromManifest(inputStream);
14:42:46 [2020-08-04T18:42:46.283Z] [ERROR] 	                          ^^^^^^^^^^^^^^^^^^^^^^^^
14:42:46 [2020-08-04T18:42:46.283Z] [ERROR] The method loadElementsFromManifest(InputStream) from the type ManifestReader refers to the missing type SAXException
14:42:46 [2020-08-04T18:42:46.283Z] [ERROR] /home/jenkins/agent/workspace/tracecompass-master-jdk11/tmf/org.eclipse.tracecompass.tmf.ui/src/org/eclipse/tracecompass/internal/tmf/ui/project/wizards/tracepkg/importexport/TracePackageExportOperation.java:[25] 
14:42:46 [2020-08-04T18:42:46.283Z] [ERROR] 	import javax.xml.transform.OutputKeys;
14:42:46 [2020-08-04T18:42:46.283Z] [ERROR] 	       ^^^^^^^^^^^^^^^^^^^
14:42:46 [2020-08-04T18:42:46.283Z] [ERROR] The package javax.xml.transform is accessible from more than one module: <unnamed>, java.xml
14:42:46 [2020-08-04T18:42:46.283Z] [ERROR] /home/jenkins/agent/workspace/tracecompass-master-jdk11/tmf/org.eclipse.tracecompass.tmf.ui/src/org/eclipse/tracecompass/internal/tmf/ui/project/wizards/tracepkg/importexport/TracePackageExportOperation.java:[26] 
14:42:46 [2020-08-04T18:42:46.283Z] [ERROR] 	import javax.xml.transform.Transformer;
14:42:46 [2020-08-04T18:42:46.283Z] [ERROR] 	       ^^^^^^^^^^^^^^^^^^^
14:42:46 [2020-08-04T18:42:46.283Z] [ERROR] The package javax.xml.transform is accessible from more than one module: <unnamed>, java.xml
14:42:46 [2020-08-04T18:42:46.283Z] [ERROR] /home/jenkins/agent/workspace/tracecompass-master-jdk11/tmf/org.eclipse.tracecompass.tmf.ui/src/org/eclipse/tracecompass/internal/tmf/ui/project/wizards/tracepkg/importexport/TracePackageExportOperation.java:[27] 
14:42:46 [2020-08-04T18:42:46.283Z] [ERROR] 	import javax.xml.transform.dom.DOMSource;
14:42:46 [2020-08-04T18:42:46.283Z] [ERROR] 	       ^^^^^^^^^^^^^^^^^^^^^^^
14:42:46 [2020-08-04T18:42:46.283Z] [ERROR] The package javax.xml.transform.dom is accessible from more than one module: <unnamed>, java.xml
14:42:46 [2020-08-04T18:42:46.283Z] [ERROR] /home/jenkins/agent/workspace/tracecompass-master-jdk11/tmf/org.eclipse.tracecompass.tmf.ui/src/org/eclipse/tracecompass/internal/tmf/ui/project/wizards/tracepkg/importexport/TracePackageExportOperation.java:[28] 
14:42:46 [2020-08-04T18:42:46.283Z] [ERROR] 	import javax.xml.transform.stream.StreamResult;
14:42:46 [2020-08-04T18:42:46.283Z] [ERROR] 	       ^^^^^^^^^^^^^^^^^^^^^^^^^^
14:42:46 [2020-08-04T18:42:46.283Z] [ERROR] The package javax.xml.transform.stream is accessible from more than one module: <unnamed>, java.xml
14:42:46 [2020-08-04T18:42:46.283Z] [ERROR] /home/jenkins/agent/workspace/tracecompass-master-jdk11/tmf/org.eclipse.tracecompass.tmf.ui/src/org/eclipse/tracecompass/internal/tmf/ui/project/wizards/tracepkg/importexport/TracePackageExportOperation.java:[59] 
14:42:46 [2020-08-04T18:42:46.283Z] [ERROR] 	import org.w3c.dom.Document;
14:42:46 [2020-08-04T18:42:46.283Z] [ERROR] 	       ^^^^^^^^^^^
14:42:46 [2020-08-04T18:42:46.283Z] [ERROR] The package org.w3c.dom is accessible from more than one module: <unnamed>, java.xml
14:42:46 [2020-08-04T18:42:46.283Z] [ERROR] /home/jenkins/agent/workspace/tracecompass-master-jdk11/tmf/org.eclipse.tracecompass.tmf.ui/src/org/eclipse/tracecompass/internal/tmf/ui/project/wizards/tracepkg/importexport/TracePackageExportOperation.java:[60] 
14:42:46 [2020-08-04T18:42:46.283Z] [ERROR] 	import org.w3c.dom.Element;
14:42:46 [2020-08-04T18:42:46.283Z] [ERROR] 	       ^^^^^^^^^^^
14:42:46 [2020-08-04T18:42:46.283Z] [ERROR] The package org.w3c.dom is accessible from more than one module: <unnamed>, java.xml
14:42:46 [2020-08-04T18:42:46.283Z] [ERROR] /home/jenkins/agent/workspace/tracecompass-master-jdk11/tmf/org.eclipse.tracecompass.tmf.ui/src/org/eclipse/tracecompass/internal/tmf/ui/project/wizards/tracepkg/importexport/TracePackageExportOperation.java:[61] 
14:42:46 [2020-08-04T18:42:46.283Z] [ERROR] 	import org.w3c.dom.Node;
14:42:46 [2020-08-04T18:42:46.283Z] [ERROR] 	       ^^^^^^^^^^^
14:42:46 [2020-08-04T18:42:46.283Z] [ERROR] The package org.w3c.dom is accessible from more than one module: <unnamed>, java.xml
14:42:46 [2020-08-04T18:42:46.283Z] [ERROR] /home/jenkins/agent/workspace/tracecompass-master-jdk11/tmf/org.eclipse.tracecompass.tmf.ui/src/org/eclipse/tracecompass/internal/tmf/ui/project/wizards/tracepkg/importexport/TracePackageExportOperation.java:[116] 
14:42:46 [2020-08-04T18:42:46.283Z] [ERROR] 	Document doc = XmlUtils.newSafeDocumentBuilderFactory().newDocumentBuilder().newDocument();
14:42:46 [2020-08-04T18:42:46.283Z] [ERROR] 	^^^^^^^^
14:42:46 [2020-08-04T18:42:46.283Z] [ERROR] Document cannot be resolved to a type
14:42:46 [2020-08-04T18:42:46.283Z] [ERROR] /home/jenkins/agent/workspace/tracecompass-master-jdk11/tmf/org.eclipse.tracecompass.tmf.ui/src/org/eclipse/tracecompass/internal/tmf/ui/project/wizards/tracepkg/importexport/TracePackageExportOperation.java:[117] 
14:42:46 [2020-08-04T18:42:46.283Z] [ERROR] 	Element createElement = doc.createElement(ITracePackageConstants.TMF_EXPORT_ELEMENT);
14:42:46 [2020-08-04T18:42:46.283Z] [ERROR] 	^^^^^^^
14:42:46 [2020-08-04T18:42:46.283Z] [ERROR] Element cannot be resolved to a type
14:42:46 [2020-08-04T18:42:46.283Z] [ERROR] /home/jenkins/agent/workspace/tracecompass-master-jdk11/tmf/org.eclipse.tracecompass.tmf.ui/src/org/eclipse/tracecompass/internal/tmf/ui/project/wizards/tracepkg/importexport/TracePackageExportOperation.java:[118] 
14:42:46 [2020-08-04T18:42:46.283Z] [ERROR] 	Node tmfNode = doc.appendChild(createElement);
14:42:46 [2020-08-04T18:42:46.283Z] [ERROR] 	^^^^
14:42:46 [2020-08-04T18:42:46.283Z] [ERROR] Node cannot be resolved to a type
14:42:46 [2020-08-04T18:42:46.283Z] [ERROR] /home/jenkins/agent/workspace/tracecompass-master-jdk11/tmf/org.eclipse.tracecompass.tmf.ui/src/org/eclipse/tracecompass/internal/tmf/ui/project/wizards/tracepkg/importexport/TracePackageExportOperation.java:[134] 
14:42:46 [2020-08-04T18:42:46.283Z] [ERROR] 	Transformer transformer = XmlUtils.newSecureTransformer();
14:42:46 [2020-08-04T18:42:46.283Z] [ERROR] 	^^^^^^^^^^^
14:42:46 [2020-08-04T18:42:46.283Z] [ERROR] Transformer cannot be resolved to a type
14:42:46 [2020-08-04T18:42:46.283Z] [ERROR] /home/jenkins/agent/workspace/tracecompass-master-jdk11/tmf/org.eclipse.tracecompass.tmf.ui/src/org/eclipse/tracecompass/internal/tmf/ui/project/wizards/tracepkg/importexport/TracePackageExportOperation.java:[135] 
14:42:46 [2020-08-04T18:42:46.283Z] [ERROR] 	transformer.setOutputProperty(OutputKeys.INDENT, "yes"); //$NON-NLS-1$
14:42:46 [2020-08-04T18:42:46.283Z] [ERROR] 	                              ^^^^^^^^^^
14:42:46 [2020-08-04T18:42:46.283Z] [ERROR] OutputKeys cannot be resolved to a variable
14:42:46 [2020-08-04T18:42:46.283Z] [ERROR] /home/jenkins/agent/workspace/tracecompass-master-jdk11/tmf/org.eclipse.tracecompass.tmf.ui/src/org/eclipse/tracecompass/internal/tmf/ui/project/wizards/tracepkg/importexport/TracePackageExportOperation.java:[137] 
14:42:46 [2020-08-04T18:42:46.283Z] [ERROR] 	DOMSource source = new DOMSource(doc);
14:42:46 [2020-08-04T18:42:46.283Z] [ERROR] 	^^^^^^^^^
14:42:46 [2020-08-04T18:42:46.283Z] [ERROR] DOMSource cannot be resolved to a type
14:42:46 [2020-08-04T18:42:46.284Z] [ERROR] /home/jenkins/agent/workspace/tracecompass-master-jdk11/tmf/org.eclipse.tracecompass.tmf.ui/src/org/eclipse/tracecompass/internal/tmf/ui/project/wizards/tracepkg/importexport/TracePackageExportOperation.java:[137] 
14:42:46 [2020-08-04T18:42:46.284Z] [ERROR] 	DOMSource source = new DOMSource(doc);
14:42:46 [2020-08-04T18:42:46.284Z] [ERROR] 	                       ^^^^^^^^^
14:42:46 [2020-08-04T18:42:46.284Z] [ERROR] DOMSource cannot be resolved to a type
14:42:46 [2020-08-04T18:42:46.284Z] [ERROR] /home/jenkins/agent/workspace/tracecompass-master-jdk11/tmf/org.eclipse.tracecompass.tmf.ui/src/org/eclipse/tracecompass/internal/tmf/ui/project/wizards/tracepkg/importexport/TracePackageExportOperation.java:[139] 
14:42:46 [2020-08-04T18:42:46.284Z] [ERROR] 	StreamResult result = new StreamResult(buffer);
14:42:46 [2020-08-04T18:42:46.284Z] [ERROR] 	^^^^^^^^^^^^
14:42:46 [2020-08-04T18:42:46.284Z] [ERROR] StreamResult cannot be resolved to a type
14:42:46 [2020-08-04T18:42:46.284Z] [ERROR] /home/jenkins/agent/workspace/tracecompass-master-jdk11/tmf/org.eclipse.tracecompass.tmf.ui/src/org/eclipse/tracecompass/internal/tmf/ui/project/wizards/tracepkg/importexport/TracePackageExportOperation.java:[139] 
14:42:46 [2020-08-04T18:42:46.284Z] [ERROR] 	StreamResult result = new StreamResult(buffer);
14:42:46 [2020-08-04T18:42:46.284Z] [ERROR] 	                          ^^^^^^^^^^^^
14:42:46 [2020-08-04T18:42:46.284Z] [ERROR] StreamResult cannot be resolved to a type
14:42:46 [2020-08-04T18:42:46.284Z] [ERROR] /home/jenkins/agent/workspace/tracecompass-master-jdk11/tmf/org.eclipse.tracecompass.tmf.ui/src/org/eclipse/tracecompass/internal/tmf/ui/project/wizards/tracepkg/importexport/TracePackageExportOperation.java:[170] 
14:42:46 [2020-08-04T18:42:46.284Z] [ERROR] 	private void exportTrace(IProgressMonitor monitor, Node tmfNode, TracePackageTraceElement tracePackageElement) throws InterruptedException, CoreException {
14:42:46 [2020-08-04T18:42:46.284Z] [ERROR] 	                                                   ^^^^
14:42:46 [2020-08-04T18:42:46.284Z] [ERROR] Node cannot be resolved to a type
14:42:46 [2020-08-04T18:42:46.284Z] [ERROR] /home/jenkins/agent/workspace/tracecompass-master-jdk11/tmf/org.eclipse.tracecompass.tmf.ui/src/org/eclipse/tracecompass/internal/tmf/ui/project/wizards/tracepkg/importexport/TracePackageExportOperation.java:[174] 
14:42:46 [2020-08-04T18:42:46.284Z] [ERROR] 	private void exportExperiment(IProgressMonitor monitor, Node tmfNode, TracePackageExperimentElement experimentPackageElement) throws InterruptedException, CoreException {
14:42:46 [2020-08-04T18:42:46.284Z] [ERROR] 	                                                        ^^^^
14:42:46 [2020-08-04T18:42:46.284Z] [ERROR] Node cannot be resolved to a type
14:42:46 [2020-08-04T18:42:46.284Z] [ERROR] /home/jenkins/agent/workspace/tracecompass-master-jdk11/tmf/org.eclipse.tracecompass.tmf.ui/src/org/eclipse/tracecompass/internal/tmf/ui/project/wizards/tracepkg/importexport/TracePackageExportOperation.java:[175] 
14:42:46 [2020-08-04T18:42:46.284Z] [ERROR] 	Node expNode = exportCommon(monitor, tmfNode, experimentPackageElement, ITracePackageConstants.EXPERIMENT_ELEMENT);
14:42:46 [2020-08-04T18:42:46.284Z] [ERROR] 	^^^^
14:42:46 [2020-08-04T18:42:46.284Z] [ERROR] Node cannot be resolved to a type
14:42:46 [2020-08-04T18:42:46.284Z] [ERROR] /home/jenkins/agent/workspace/tracecompass-master-jdk11/tmf/org.eclipse.tracecompass.tmf.ui/src/org/eclipse/tracecompass/internal/tmf/ui/project/wizards/tracepkg/importexport/TracePackageExportOperation.java:[178] 
14:42:46 [2020-08-04T18:42:46.284Z] [ERROR] 	Element expTraceXmlElement = expNode.getOwnerDocument().createElement(ITracePackageConstants.EXP_TRACE_ELEMENT);
14:42:46 [2020-08-04T18:42:46.284Z] [ERROR] 	^^^^^^^
14:42:46 [2020-08-04T18:42:46.284Z] [ERROR] Element cannot be resolved to a type
14:42:46 [2020-08-04T18:42:46.284Z] [ERROR] /home/jenkins/agent/workspace/tracecompass-master-jdk11/tmf/org.eclipse.tracecompass.tmf.ui/src/org/eclipse/tracecompass/internal/tmf/ui/project/wizards/tracepkg/importexport/TracePackageExportOperation.java:[184] 
14:42:46 [2020-08-04T18:42:46.284Z] [ERROR] 	private Node exportCommon(IProgressMonitor monitor, Node tmfNode, TracePackageTraceElement tracePackageElement, String elementString) throws InterruptedException, CoreException {
14:42:46 [2020-08-04T18:42:46.284Z] [ERROR] 	        ^^^^
14:42:46 [2020-08-04T18:42:46.284Z] [ERROR] Node cannot be resolved to a type
14:42:46 [2020-08-04T18:42:46.284Z] [ERROR] /home/jenkins/agent/workspace/tracecompass-master-jdk11/tmf/org.eclipse.tracecompass.tmf.ui/src/org/eclipse/tracecompass/internal/tmf/ui/project/wizards/tracepkg/importexport/TracePackageExportOperation.java:[184] 
14:42:46 [2020-08-04T18:42:46.284Z] [ERROR] 	private Node exportCommon(IProgressMonitor monitor, Node tmfNode, TracePackageTraceElement tracePackageElement, String elementString) throws InterruptedException, CoreException {
14:42:46 [2020-08-04T18:42:46.284Z] [ERROR] 	                                                    ^^^^
14:42:46 [2020-08-04T18:42:46.284Z] [ERROR] Node cannot be resolved to a type
14:42:46 [2020-08-04T18:42:46.284Z] [ERROR] /home/jenkins/agent/workspace/tracecompass-master-jdk11/tmf/org.eclipse.tracecompass.tmf.ui/src/org/eclipse/tracecompass/internal/tmf/ui/project/wizards/tracepkg/importexport/TracePackageExportOperation.java:[186] 
14:42:46 [2020-08-04T18:42:46.284Z] [ERROR] 	Element commonXmlElement = tmfNode.getOwnerDocument().createElement(elementString);
14:42:46 [2020-08-04T18:42:46.284Z] [ERROR] 	^^^^^^^
14:42:46 [2020-08-04T18:42:46.284Z] [ERROR] Element cannot be resolved to a type
14:42:46 [2020-08-04T18:42:46.284Z] [ERROR] /home/jenkins/agent/workspace/tracecompass-master-jdk11/tmf/org.eclipse.tracecompass.tmf.ui/src/org/eclipse/tracecompass/internal/tmf/ui/project/wizards/tracepkg/importexport/TracePackageExportOperation.java:[189] 
14:42:46 [2020-08-04T18:42:46.284Z] [ERROR] 	Node commonNode = tmfNode.appendChild(commonXmlElement);
14:42:46 [2020-08-04T18:42:46.284Z] [ERROR] 	^^^^
14:42:46 [2020-08-04T18:42:46.284Z] [ERROR] Node cannot be resolved to a type
14:42:46 [2020-08-04T18:42:46.284Z] [ERROR] /home/jenkins/agent/workspace/tracecompass-master-jdk11/tmf/org.eclipse.tracecompass.tmf.ui/src/org/eclipse/tracecompass/internal/tmf/ui/project/wizards/tracepkg/importexport/TracePackageExportOperation.java:[209] 
14:42:46 [2020-08-04T18:42:46.284Z] [ERROR] 	private void exportSupplementaryFiles(IProgressMonitor monitor, Node commonNode, TmfCommonProjectElement commonElement, TracePackageSupplFilesElement element) throws InterruptedException, CoreException {
14:42:46 [2020-08-04T18:42:46.284Z] [ERROR] 	                                                                ^^^^
14:42:46 [2020-08-04T18:42:46.284Z] [ERROR] Node cannot be resolved to a type
14:42:46 [2020-08-04T18:42:46.284Z] [ERROR] /home/jenkins/agent/workspace/tracecompass-master-jdk11/tmf/org.eclipse.tracecompass.tmf.ui/src/org/eclipse/tracecompass/internal/tmf/ui/project/wizards/tracepkg/importexport/TracePackageExportOperation.java:[210] 
14:42:46 [2020-08-04T18:42:46.284Z] [ERROR] 	Document doc = commonNode.getOwnerDocument();
14:42:46 [2020-08-04T18:42:46.284Z] [ERROR] 	^^^^^^^^
14:42:46 [2020-08-04T18:42:46.284Z] [ERROR] Document cannot be resolved to a type
14:42:46 [2020-08-04T18:42:46.284Z] [ERROR] /home/jenkins/agent/workspace/tracecompass-master-jdk11/tmf/org.eclipse.tracecompass.tmf.ui/src/org/eclipse/tracecompass/internal/tmf/ui/project/wizards/tracepkg/importexport/TracePackageExportOperation.java:[228] 
14:42:46 [2020-08-04T18:42:46.284Z] [ERROR] 	Element suppFileElement = doc.createElement(ITracePackageConstants.SUPPLEMENTARY_FILE_ELEMENT);
14:42:46 [2020-08-04T18:42:46.284Z] [ERROR] 	^^^^^^^
14:42:46 [2020-08-04T18:42:46.284Z] [ERROR] Element cannot be resolved to a type
14:42:46 [2020-08-04T18:42:46.284Z] [ERROR] /home/jenkins/agent/workspace/tracecompass-master-jdk11/tmf/org.eclipse.tracecompass.tmf.ui/src/org/eclipse/tracecompass/internal/tmf/ui/project/wizards/tracepkg/importexport/TracePackageExportOperation.java:[239] 
14:42:46 [2020-08-04T18:42:46.284Z] [ERROR] 	private void exportTraceFiles(IProgressMonitor monitor, Node traceNode, TracePackageFilesElement element) throws CoreException {
14:42:46 [2020-08-04T18:42:46.284Z] [ERROR] 	                                                        ^^^^
14:42:46 [2020-08-04T18:42:46.284Z] [ERROR] Node cannot be resolved to a type
14:42:46 [2020-08-04T18:42:46.284Z] [ERROR] /home/jenkins/agent/workspace/tracecompass-master-jdk11/tmf/org.eclipse.tracecompass.tmf.ui/src/org/eclipse/tracecompass/internal/tmf/ui/project/wizards/tracepkg/importexport/TracePackageExportOperation.java:[240] 
14:42:46 [2020-08-04T18:42:46.284Z] [ERROR] 	Document doc = traceNode.getOwnerDocument();
14:42:46 [2020-08-04T18:42:46.284Z] [ERROR] 	^^^^^^^^
14:42:46 [2020-08-04T18:42:46.284Z] [ERROR] Document cannot be resolved to a type
14:42:46 [2020-08-04T18:42:46.284Z] [ERROR] /home/jenkins/agent/workspace/tracecompass-master-jdk11/tmf/org.eclipse.tracecompass.tmf.ui/src/org/eclipse/tracecompass/internal/tmf/ui/project/wizards/tracepkg/importexport/TracePackageExportOperation.java:[258] 
14:42:46 [2020-08-04T18:42:46.284Z] [ERROR] 	Element fileElement = doc.createElement(ITracePackageConstants.TRACE_FILE_ELEMENT);
14:42:46 [2020-08-04T18:42:46.284Z] [ERROR] 	^^^^^^^
14:42:46 [2020-08-04T18:42:46.284Z] [ERROR] Element cannot be resolved to a type
14:42:46 [2020-08-04T18:42:46.284Z] [ERROR] /home/jenkins/agent/workspace/tracecompass-master-jdk11/tmf/org.eclipse.tracecompass.tmf.ui/src/org/eclipse/tracecompass/internal/tmf/ui/project/wizards/tracepkg/importexport/TracePackageExportOperation.java:[294] 
14:42:46 [2020-08-04T18:42:46.284Z] [ERROR] 	private static void exportBookmarks(IProgressMonitor monitor, Node commonNode, TracePackageBookmarkElement element) throws CoreException, InterruptedException {
14:42:46 [2020-08-04T18:42:46.284Z] [ERROR] 	                                                              ^^^^
14:42:46 [2020-08-04T18:42:46.284Z] [ERROR] Node cannot be resolved to a type
14:42:46 [2020-08-04T18:42:46.284Z] [ERROR] /home/jenkins/agent/workspace/tracecompass-master-jdk11/tmf/org.eclipse.tracecompass.tmf.ui/src/org/eclipse/tracecompass/internal/tmf/ui/project/wizards/tracepkg/importexport/TracePackageExportOperation.java:[295] 
14:42:46 [2020-08-04T18:42:46.284Z] [ERROR] 	Document doc = commonNode.getOwnerDocument();
14:42:46 [2020-08-04T18:42:46.284Z] [ERROR] 	^^^^^^^^
14:42:46 [2020-08-04T18:42:46.284Z] [ERROR] Document cannot be resolved to a type
14:42:46 [2020-08-04T18:42:46.284Z] [ERROR] /home/jenkins/agent/workspace/tracecompass-master-jdk11/tmf/org.eclipse.tracecompass.tmf.ui/src/org/eclipse/tracecompass/internal/tmf/ui/project/wizards/tracepkg/importexport/TracePackageExportOperation.java:[300] 
14:42:46 [2020-08-04T18:42:46.284Z] [ERROR] 	Element bookmarksXmlElement = doc.createElement(ITracePackageConstants.BOOKMARKS_ELEMENT);
14:42:46 [2020-08-04T18:42:46.284Z] [ERROR] 	^^^^^^^
14:42:46 [2020-08-04T18:42:46.284Z] [ERROR] Element cannot be resolved to a type
14:42:46 [2020-08-04T18:42:46.284Z] [ERROR] /home/jenkins/agent/workspace/tracecompass-master-jdk11/tmf/org.eclipse.tracecompass.tmf.ui/src/org/eclipse/tracecompass/internal/tmf/ui/project/wizards/tracepkg/importexport/TracePackageExportOperation.java:[301] 
14:42:46 [2020-08-04T18:42:46.284Z] [ERROR] 	Node bookmarksNode = commonNode.appendChild(bookmarksXmlElement);
14:42:46 [2020-08-04T18:42:46.284Z] [ERROR] 	^^^^
14:42:46 [2020-08-04T18:42:46.284Z] [ERROR] Node cannot be resolved to a type
14:42:46 [2020-08-04T18:42:46.284Z] [ERROR] /home/jenkins/agent/workspace/tracecompass-master-jdk11/tmf/org.eclipse.tracecompass.tmf.ui/src/org/eclipse/tracecompass/internal/tmf/ui/project/wizards/tracepkg/importexport/TracePackageExportOperation.java:[306] 
14:42:46 [2020-08-04T18:42:46.284Z] [ERROR] 	Element singleBookmarkXmlElement = doc.createElement(ITracePackageConstants.BOOKMARK_ELEMENT);
14:42:46 [2020-08-04T18:42:46.284Z] [ERROR] 	^^^^^^^
14:42:46 [2020-08-04T18:42:46.284Z] [ERROR] Element cannot be resolved to a type
14:42:46 [2020-08-04T18:42:46.284Z] [ERROR] /home/jenkins/agent/workspace/tracecompass-master-jdk11/tmf/org.eclipse.tracecompass.tmf.ui/src/org/eclipse/tracecompass/internal/tmf/ui/parsers/wizards/CustomXmlParserInputWizardPage.java:[29] 
14:42:46 [2020-08-04T18:42:46.284Z] [ERROR] 	import javax.xml.parsers.DocumentBuilder;
14:42:46 [2020-08-04T18:42:46.284Z] [ERROR] 	       ^^^^^^^^^^^^^^^^^
14:42:46 [2020-08-04T18:42:46.284Z] [ERROR] The package javax.xml.parsers is accessible from more than one module: <unnamed>, java.xml
14:42:46 [2020-08-04T18:42:46.284Z] [ERROR] /home/jenkins/agent/workspace/tracecompass-master-jdk11/tmf/org.eclipse.tracecompass.tmf.ui/src/org/eclipse/tracecompass/internal/tmf/ui/parsers/wizards/CustomXmlParserInputWizardPage.java:[30] 
14:42:46 [2020-08-04T18:42:46.284Z] [ERROR] 	import javax.xml.parsers.ParserConfigurationException;
14:42:46 [2020-08-04T18:42:46.284Z] [ERROR] 	       ^^^^^^^^^^^^^^^^^
14:42:46 [2020-08-04T18:42:46.284Z] [ERROR] The package javax.xml.parsers is accessible from more than one module: <unnamed>, java.xml
14:42:46 [2020-08-04T18:42:46.284Z] [ERROR] /home/jenkins/agent/workspace/tracecompass-master-jdk11/tmf/org.eclipse.tracecompass.tmf.ui/src/org/eclipse/tracecompass/internal/tmf/ui/parsers/wizards/CustomXmlParserInputWizardPage.java:[91] 
14:42:46 [2020-08-04T18:42:46.284Z] [ERROR] 	import org.w3c.dom.Document;
14:42:46 [2020-08-04T18:42:46.284Z] [ERROR] 	       ^^^^^^^^^^^
14:42:46 [2020-08-04T18:42:46.284Z] [ERROR] The package org.w3c.dom is accessible from more than one module: <unnamed>, java.xml
14:42:46 [2020-08-04T18:42:46.284Z] [ERROR] /home/jenkins/agent/workspace/tracecompass-master-jdk11/tmf/org.eclipse.tracecompass.tmf.ui/src/org/eclipse/tracecompass/internal/tmf/ui/parsers/wizards/CustomXmlParserInputWizardPage.java:[92] 
14:42:46 [2020-08-04T18:42:46.284Z] [ERROR] 	import org.w3c.dom.Element;
14:42:46 [2020-08-04T18:42:46.284Z] [ERROR] 	       ^^^^^^^^^^^
14:42:46 [2020-08-04T18:42:46.284Z] [ERROR] The package org.w3c.dom is accessible from more than one module: <unnamed>, java.xml
14:42:46 [2020-08-04T18:42:46.284Z] [ERROR] /home/jenkins/agent/workspace/tracecompass-master-jdk11/tmf/org.eclipse.tracecompass.tmf.ui/src/org/eclipse/tracecompass/internal/tmf/ui/parsers/wizards/CustomXmlParserInputWizardPage.java:[93] 
14:42:46 [2020-08-04T18:42:46.284Z] [ERROR] 	import org.w3c.dom.NamedNodeMap;
14:42:46 [2020-08-04T18:42:46.284Z] [ERROR] 	       ^^^^^^^^^^^
14:42:46 [2020-08-04T18:42:46.284Z] [ERROR] The package org.w3c.dom is accessible from more than one module: <unnamed>, java.xml
14:42:46 [2020-08-04T18:42:46.285Z] [ERROR] /home/jenkins/agent/workspace/tracecompass-master-jdk11/tmf/org.eclipse.tracecompass.tmf.ui/src/org/eclipse/tracecompass/internal/tmf/ui/parsers/wizards/CustomXmlParserInputWizardPage.java:[94] 
14:42:46 [2020-08-04T18:42:46.285Z] [ERROR] 	import org.w3c.dom.Node;
14:42:46 [2020-08-04T18:42:46.285Z] [ERROR] 	       ^^^^^^^^^^^
14:42:46 [2020-08-04T18:42:46.285Z] [ERROR] The package org.w3c.dom is accessible from more than one module: <unnamed>, java.xml
14:42:46 [2020-08-04T18:42:46.285Z] [ERROR] /home/jenkins/agent/workspace/tracecompass-master-jdk11/tmf/org.eclipse.tracecompass.tmf.ui/src/org/eclipse/tracecompass/internal/tmf/ui/parsers/wizards/CustomXmlParserInputWizardPage.java:[95] 
14:42:46 [2020-08-04T18:42:46.285Z] [ERROR] 	import org.w3c.dom.NodeList;
14:42:46 [2020-08-04T18:42:46.285Z] [ERROR] 	       ^^^^^^^^^^^
14:42:46 [2020-08-04T18:42:46.285Z] [ERROR] The package org.w3c.dom is accessible from more than one module: <unnamed>, java.xml
14:42:46 [2020-08-04T18:42:46.285Z] [ERROR] /home/jenkins/agent/workspace/tracecompass-master-jdk11/tmf/org.eclipse.tracecompass.tmf.ui/src/org/eclipse/tracecompass/internal/tmf/ui/parsers/wizards/CustomXmlParserInputWizardPage.java:[96] 
14:42:46 [2020-08-04T18:42:46.285Z] [ERROR] 	import org.xml.sax.EntityResolver;
14:42:46 [2020-08-04T18:42:46.285Z] [ERROR] 	       ^^^^^^^^^^^
14:42:46 [2020-08-04T18:42:46.285Z] [ERROR] The package org.xml.sax is accessible from more than one module: <unnamed>, java.xml
14:42:46 [2020-08-04T18:42:46.285Z] [ERROR] /home/jenkins/agent/workspace/tracecompass-master-jdk11/tmf/org.eclipse.tracecompass.tmf.ui/src/org/eclipse/tracecompass/internal/tmf/ui/parsers/wizards/CustomXmlParserInputWizardPage.java:[97] 
14:42:46 [2020-08-04T18:42:46.285Z] [ERROR] 	import org.xml.sax.ErrorHandler;
14:42:46 [2020-08-04T18:42:46.285Z] [ERROR] 	       ^^^^^^^^^^^
14:42:46 [2020-08-04T18:42:46.285Z] [ERROR] The package org.xml.sax is accessible from more than one module: <unnamed>, java.xml
14:42:46 [2020-08-04T18:42:46.285Z] [ERROR] /home/jenkins/agent/workspace/tracecompass-master-jdk11/tmf/org.eclipse.tracecompass.tmf.ui/src/org/eclipse/tracecompass/internal/tmf/ui/parsers/wizards/CustomXmlParserInputWizardPage.java:[98] 
14:42:46 [2020-08-04T18:42:46.285Z] [ERROR] 	import org.xml.sax.InputSource;
14:42:46 [2020-08-04T18:42:46.285Z] [ERROR] 	       ^^^^^^^^^^^
14:42:46 [2020-08-04T18:42:46.285Z] [ERROR] The package org.xml.sax is accessible from more than one module: <unnamed>, java.xml
14:42:46 [2020-08-04T18:42:46.285Z] [ERROR] /home/jenkins/agent/workspace/tracecompass-master-jdk11/tmf/org.eclipse.tracecompass.tmf.ui/src/org/eclipse/tracecompass/internal/tmf/ui/parsers/wizards/CustomXmlParserInputWizardPage.java:[99] 
14:42:46 [2020-08-04T18:42:46.285Z] [ERROR] 	import org.xml.sax.SAXException;
14:42:46 [2020-08-04T18:42:46.285Z] [ERROR] 	       ^^^^^^^^^^^
14:42:46 [2020-08-04T18:42:46.285Z] [ERROR] The package org.xml.sax is accessible from more than one module: <unnamed>, java.xml
14:42:46 [2020-08-04T18:42:46.285Z] [ERROR] /home/jenkins/agent/workspace/tracecompass-master-jdk11/tmf/org.eclipse.tracecompass.tmf.ui/src/org/eclipse/tracecompass/internal/tmf/ui/parsers/wizards/CustomXmlParserInputWizardPage.java:[100] 
14:42:46 [2020-08-04T18:42:46.285Z] [ERROR] 	import org.xml.sax.SAXParseException;
14:42:46 [2020-08-04T18:42:46.285Z] [ERROR] 	       ^^^^^^^^^^^
14:42:46 [2020-08-04T18:42:46.285Z] [ERROR] The package org.xml.sax is accessible from more than one module: <unnamed>, java.xml
14:42:46 [2020-08-04T18:42:46.285Z] [ERROR] /home/jenkins/agent/workspace/tracecompass-master-jdk11/tmf/org.eclipse.tracecompass.tmf.ui/src/org/eclipse/tracecompass/internal/tmf/ui/parsers/wizards/CustomXmlParserInputWizardPage.java:[152] 
14:42:46 [2020-08-04T18:42:46.285Z] [ERROR] 	private Element documentElement;
14:42:46 [2020-08-04T18:42:46.285Z] [ERROR] 	        ^^^^^^^
14:42:46 [2020-08-04T18:42:46.285Z] [ERROR] Element cannot be resolved to a type
14:42:46 [2020-08-04T18:42:46.285Z] [ERROR] /home/jenkins/agent/workspace/tracecompass-master-jdk11/tmf/org.eclipse.tracecompass.tmf.ui/src/org/eclipse/tracecompass/internal/tmf/ui/parsers/wizards/CustomXmlParserInputWizardPage.java:[754] 
14:42:46 [2020-08-04T18:42:46.285Z] [ERROR] 	DocumentBuilder db = XmlUtils.newSafeDocumentBuilderFactory().newDocumentBuilder();
14:42:46 [2020-08-04T18:42:46.285Z] [ERROR] 	^^^^^^^^^^^^^^^
14:42:46 [2020-08-04T18:42:46.285Z] [ERROR] DocumentBuilder cannot be resolved to a type
14:42:46 [2020-08-04T18:42:46.285Z] [ERROR] /home/jenkins/agent/workspace/tracecompass-master-jdk11/tmf/org.eclipse.tracecompass.tmf.ui/src/org/eclipse/tracecompass/internal/tmf/ui/parsers/wizards/CustomXmlParserInputWizardPage.java:[757] 
14:42:46 [2020-08-04T18:42:46.285Z] [ERROR] 	EntityResolver resolver = (publicId, systemId) -> {
14:42:46 [2020-08-04T18:42:46.285Z] [ERROR] 	^^^^^^^^^^^^^^
14:42:46 [2020-08-04T18:42:46.285Z] [ERROR] EntityResolver cannot be resolved to a type
14:42:46 [2020-08-04T18:42:46.285Z] [ERROR] /home/jenkins/agent/workspace/tracecompass-master-jdk11/tmf/org.eclipse.tracecompass.tmf.ui/src/org/eclipse/tracecompass/internal/tmf/ui/parsers/wizards/CustomXmlParserInputWizardPage.java:[757] 
14:42:46 [2020-08-04T18:42:46.285Z] [ERROR] 	EntityResolver resolver = (publicId, systemId) -> {
14:42:46 [2020-08-04T18:42:46.285Z] [ERROR] 	                          ^^^^^^^^^^^^^^^^^^^^^^^
14:42:46 [2020-08-04T18:42:46.285Z] [ERROR] The target type of this expression must be a functional interface
14:42:46 [2020-08-04T18:42:46.285Z] [ERROR] /home/jenkins/agent/workspace/tracecompass-master-jdk11/tmf/org.eclipse.tracecompass.tmf.ui/src/org/eclipse/tracecompass/internal/tmf/ui/parsers/wizards/CustomXmlParserInputWizardPage.java:[765] 
14:42:46 [2020-08-04T18:42:46.285Z] [ERROR] 	db.setErrorHandler(new ErrorHandler() {
14:42:46 [2020-08-04T18:42:46.285Z] [ERROR] 	                       ^^^^^^^^^^^^
14:42:46 [2020-08-04T18:42:46.285Z] [ERROR] ErrorHandler cannot be resolved to a type
14:42:46 [2020-08-04T18:42:46.285Z] [ERROR] /home/jenkins/agent/workspace/tracecompass-master-jdk11/tmf/org.eclipse.tracecompass.tmf.ui/src/org/eclipse/tracecompass/internal/tmf/ui/parsers/wizards/CustomXmlParserInputWizardPage.java:[767] 
14:42:46 [2020-08-04T18:42:46.285Z] [ERROR] 	public void error(SAXParseException saxparseexception) throws SAXException {
14:42:46 [2020-08-04T18:42:46.285Z] [ERROR] 	                  ^^^^^^^^^^^^^^^^^
14:42:46 [2020-08-04T18:42:46.285Z] [ERROR] SAXParseException cannot be resolved to a type
14:42:46 [2020-08-04T18:42:46.285Z] [ERROR] /home/jenkins/agent/workspace/tracecompass-master-jdk11/tmf/org.eclipse.tracecompass.tmf.ui/src/org/eclipse/tracecompass/internal/tmf/ui/parsers/wizards/CustomXmlParserInputWizardPage.java:[767] 
14:42:46 [2020-08-04T18:42:46.285Z] [ERROR] 	public void error(SAXParseException saxparseexception) throws SAXException {
14:42:46 [2020-08-04T18:42:46.285Z] [ERROR] 	                                                              ^^^^^^^^^^^^
14:42:46 [2020-08-04T18:42:46.285Z] [ERROR] SAXException cannot be resolved to a type
14:42:46 [2020-08-04T18:42:46.285Z] [ERROR] /home/jenkins/agent/workspace/tracecompass-master-jdk11/tmf/org.eclipse.tracecompass.tmf.ui/src/org/eclipse/tracecompass/internal/tmf/ui/parsers/wizards/CustomXmlParserInputWizardPage.java:[772] 
14:42:46 [2020-08-04T18:42:46.285Z] [ERROR] 	public void warning(SAXParseException saxparseexception) throws SAXException {
14:42:46 [2020-08-04T18:42:46.285Z] [ERROR] 	                    ^^^^^^^^^^^^^^^^^
14:42:46 [2020-08-04T18:42:46.285Z] [ERROR] SAXParseException cannot be resolved to a type
14:42:46 [2020-08-04T18:42:46.285Z] [ERROR] /home/jenkins/agent/workspace/tracecompass-master-jdk11/tmf/org.eclipse.tracecompass.tmf.ui/src/org/eclipse/tracecompass/internal/tmf/ui/parsers/wizards/CustomXmlParserInputWizardPage.java:[772] 
14:42:46 [2020-08-04T18:42:46.285Z] [ERROR] 	public void warning(SAXParseException saxparseexception) throws SAXException {
14:42:46 [2020-08-04T18:42:46.285Z] [ERROR] 	                                                                ^^^^^^^^^^^^
14:42:46 [2020-08-04T18:42:46.285Z] [ERROR] SAXException cannot be resolved to a type
14:42:46 [2020-08-04T18:42:46.285Z] [ERROR] /home/jenkins/agent/workspace/tracecompass-master-jdk11/tmf/org.eclipse.tracecompass.tmf.ui/src/org/eclipse/tracecompass/internal/tmf/ui/parsers/wizards/CustomXmlParserInputWizardPage.java:[777] 
14:42:46 [2020-08-04T18:42:46.285Z] [ERROR] 	public void fatalError(SAXParseException saxparseexception) throws SAXException {
14:42:46 [2020-08-04T18:42:46.285Z] [ERROR] 	                       ^^^^^^^^^^^^^^^^^
14:42:46 [2020-08-04T18:42:46.285Z] [ERROR] SAXParseException cannot be resolved to a type
14:42:46 [2020-08-04T18:42:46.285Z] [ERROR] /home/jenkins/agent/workspace/tracecompass-master-jdk11/tmf/org.eclipse.tracecompass.tmf.ui/src/org/eclipse/tracecompass/internal/tmf/ui/parsers/wizards/CustomXmlParserInputWizardPage.java:[777] 
14:42:46 [2020-08-04T18:42:46.285Z] [ERROR] 	public void fatalError(SAXParseException saxparseexception) throws SAXException {
14:42:46 [2020-08-04T18:42:46.285Z] [ERROR] 	                                                                   ^^^^^^^^^^^^
14:42:46 [2020-08-04T18:42:46.285Z] [ERROR] SAXException cannot be resolved to a type
14:42:46 [2020-08-04T18:42:46.285Z] [ERROR] /home/jenkins/agent/workspace/tracecompass-master-jdk11/tmf/org.eclipse.tracecompass.tmf.ui/src/org/eclipse/tracecompass/internal/tmf/ui/parsers/wizards/CustomXmlParserInputWizardPage.java:[788] 
14:42:46 [2020-08-04T18:42:46.285Z] [ERROR] 	Document doc = null;
14:42:46 [2020-08-04T18:42:46.285Z] [ERROR] 	^^^^^^^^
14:42:46 [2020-08-04T18:42:46.285Z] [ERROR] Document cannot be resolved to a type
14:42:46 [2020-08-04T18:42:46.285Z] [ERROR] /home/jenkins/agent/workspace/tracecompass-master-jdk11/tmf/org.eclipse.tracecompass.tmf.ui/src/org/eclipse/tracecompass/internal/tmf/ui/parsers/wizards/CustomXmlParserInputWizardPage.java:[790] 
14:42:46 [2020-08-04T18:42:46.285Z] [ERROR] 	documentElement = doc.getDocumentElement();
14:42:46 [2020-08-04T18:42:46.285Z] [ERROR] 	^^^^^^^^^^^^^^^
14:42:46 [2020-08-04T18:42:46.285Z] [ERROR] Element cannot be resolved to a type
14:42:46 [2020-08-04T18:42:46.285Z] [ERROR] /home/jenkins/agent/workspace/tracecompass-master-jdk11/tmf/org.eclipse.tracecompass.tmf.ui/src/org/eclipse/tracecompass/internal/tmf/ui/parsers/wizards/CustomXmlParserInputWizardPage.java:[791] 
14:42:46 [2020-08-04T18:42:46.285Z] [ERROR] 	} catch (ParserConfigurationException e) {
14:42:46 [2020-08-04T18:42:46.285Z] [ERROR] 	         ^^^^^^^^^^^^^^^^^^^^^^^^^^^^
14:42:46 [2020-08-04T18:42:46.285Z] [ERROR] ParserConfigurationException cannot be resolved to a type
14:42:46 [2020-08-04T18:42:46.285Z] [ERROR] /home/jenkins/agent/workspace/tracecompass-master-jdk11/tmf/org.eclipse.tracecompass.tmf.ui/src/org/eclipse/tracecompass/internal/tmf/ui/parsers/wizards/CustomXmlParserInputWizardPage.java:[793] 
14:42:46 [2020-08-04T18:42:46.285Z] [ERROR] 	documentElement = null;
14:42:46 [2020-08-04T18:42:46.285Z] [ERROR] 	^^^^^^^^^^^^^^^
14:42:46 [2020-08-04T18:42:46.285Z] [ERROR] Element cannot be resolved to a type
14:42:46 [2020-08-04T18:42:46.285Z] [ERROR] /home/jenkins/agent/workspace/tracecompass-master-jdk11/tmf/org.eclipse.tracecompass.tmf.ui/src/org/eclipse/tracecompass/internal/tmf/ui/parsers/wizards/CustomXmlParserInputWizardPage.java:[794] 
14:42:46 [2020-08-04T18:42:46.285Z] [ERROR] 	} catch (SAXException e) {
14:42:46 [2020-08-04T18:42:46.285Z] [ERROR] 	         ^^^^^^^^^^^^
14:42:46 [2020-08-04T18:42:46.285Z] [ERROR] SAXException cannot be resolved to a type
14:42:46 [2020-08-04T18:42:46.285Z] [ERROR] /home/jenkins/agent/workspace/tracecompass-master-jdk11/tmf/org.eclipse.tracecompass.tmf.ui/src/org/eclipse/tracecompass/internal/tmf/ui/parsers/wizards/CustomXmlParserInputWizardPage.java:[795] 
14:42:46 [2020-08-04T18:42:46.285Z] [ERROR] 	documentElement = null;
14:42:46 [2020-08-04T18:42:46.285Z] [ERROR] 	^^^^^^^^^^^^^^^
14:42:46 [2020-08-04T18:42:46.285Z] [ERROR] Element cannot be resolved to a type
14:42:46 [2020-08-04T18:42:46.285Z] [ERROR] /home/jenkins/agent/workspace/tracecompass-master-jdk11/tmf/org.eclipse.tracecompass.tmf.ui/src/org/eclipse/tracecompass/internal/tmf/ui/parsers/wizards/CustomXmlParserInputWizardPage.java:[798] 
14:42:46 [2020-08-04T18:42:46.285Z] [ERROR] 	documentElement = null;
14:42:46 [2020-08-04T18:42:46.285Z] [ERROR] 	^^^^^^^^^^^^^^^
14:42:46 [2020-08-04T18:42:46.285Z] [ERROR] Element cannot be resolved to a type
14:42:46 [2020-08-04T18:42:46.285Z] [ERROR] /home/jenkins/agent/workspace/tracecompass-master-jdk11/tmf/org.eclipse.tracecompass.tmf.ui/src/org/eclipse/tracecompass/internal/tmf/ui/parsers/wizards/CustomXmlParserInputWizardPage.java:[1134] 
14:42:46 [2020-08-04T18:42:46.285Z] [ERROR] 	Element element = getPreviewElement(inputElement);
14:42:46 [2020-08-04T18:42:46.285Z] [ERROR] 	^^^^^^^
14:42:46 [2020-08-04T18:42:46.285Z] [ERROR] Element cannot be resolved to a type
14:42:46 [2020-08-04T18:42:46.285Z] [ERROR] /home/jenkins/agent/workspace/tracecompass-master-jdk11/tmf/org.eclipse.tracecompass.tmf.ui/src/org/eclipse/tracecompass/internal/tmf/ui/parsers/wizards/CustomXmlParserInputWizardPage.java:[1134] 
14:42:46 [2020-08-04T18:42:46.285Z] [ERROR] 	Element element = getPreviewElement(inputElement);
14:42:46 [2020-08-04T18:42:46.285Z] [ERROR] 	                  ^^^^^^^^^^^^^^^^^
14:42:46 [2020-08-04T18:42:46.285Z] [ERROR] The method getPreviewElement(CustomXmlInputElement) from the type CustomXmlParserInputWizardPage refers to the missing type Element
14:42:46 [2020-08-04T18:42:46.285Z] [ERROR] /home/jenkins/agent/workspace/tracecompass-master-jdk11/tmf/org.eclipse.tracecompass.tmf.ui/src/org/eclipse/tracecompass/internal/tmf/ui/parsers/wizards/CustomXmlParserInputWizardPage.java:[1527] 
14:42:46 [2020-08-04T18:42:46.285Z] [ERROR] 	private Element getPreviewElement(CustomXmlInputElement inputElement) {
14:42:46 [2020-08-04T18:42:46.285Z] [ERROR] 	        ^^^^^^^
14:42:46 [2020-08-04T18:42:46.285Z] [ERROR] Element cannot be resolved to a type
14:42:46 [2020-08-04T18:42:46.285Z] [ERROR] /home/jenkins/agent/workspace/tracecompass-master-jdk11/tmf/org.eclipse.tracecompass.tmf.ui/src/org/eclipse/tracecompass/internal/tmf/ui/parsers/wizards/CustomXmlParserInputWizardPage.java:[1529] 
14:42:46 [2020-08-04T18:42:46.285Z] [ERROR] 	Element element = documentElement;
14:42:46 [2020-08-04T18:42:46.285Z] [ERROR] 	^^^^^^^
14:42:46 [2020-08-04T18:42:46.285Z] [ERROR] Element cannot be resolved to a type
14:42:46 [2020-08-04T18:42:46.286Z] [ERROR] /home/jenkins/agent/workspace/tracecompass-master-jdk11/tmf/org.eclipse.tracecompass.tmf.ui/src/org/eclipse/tracecompass/internal/tmf/ui/parsers/wizards/CustomXmlParserInputWizardPage.java:[1529] 
14:42:46 [2020-08-04T18:42:46.286Z] [ERROR] 	Element element = documentElement;
14:42:46 [2020-08-04T18:42:46.286Z] [ERROR] 	                  ^^^^^^^^^^^^^^^
14:42:46 [2020-08-04T18:42:46.286Z] [ERROR] Element cannot be resolved to a type
14:42:46 [2020-08-04T18:42:46.286Z] [ERROR] /home/jenkins/agent/workspace/tracecompass-master-jdk11/tmf/org.eclipse.tracecompass.tmf.ui/src/org/eclipse/tracecompass/internal/tmf/ui/parsers/wizards/CustomXmlParserInputWizardPage.java:[1531] 
14:42:46 [2020-08-04T18:42:46.286Z] [ERROR] 	if (!documentElement.getNodeName().equals(definition.rootInputElement.getElementName())) {
14:42:46 [2020-08-04T18:42:46.286Z] [ERROR] 	     ^^^^^^^^^^^^^^^
14:42:46 [2020-08-04T18:42:46.286Z] [ERROR] Element cannot be resolved to a type
14:42:46 [2020-08-04T18:42:46.286Z] [ERROR] /home/jenkins/agent/workspace/tracecompass-master-jdk11/tmf/org.eclipse.tracecompass.tmf.ui/src/org/eclipse/tracecompass/internal/tmf/ui/parsers/wizards/CustomXmlParserInputWizardPage.java:[1540] 
14:42:46 [2020-08-04T18:42:46.286Z] [ERROR] 	NodeList childList = element.getChildNodes();
14:42:46 [2020-08-04T18:42:46.286Z] [ERROR] 	^^^^^^^^
14:42:46 [2020-08-04T18:42:46.286Z] [ERROR] NodeList cannot be resolved to a type
14:42:46 [2020-08-04T18:42:46.286Z] [ERROR] /home/jenkins/agent/workspace/tracecompass-master-jdk11/tmf/org.eclipse.tracecompass.tmf.ui/src/org/eclipse/tracecompass/internal/tmf/ui/parsers/wizards/CustomXmlParserInputWizardPage.java:[1543] 
14:42:46 [2020-08-04T18:42:46.286Z] [ERROR] 	Node child = childList.item(j);
14:42:46 [2020-08-04T18:42:46.286Z] [ERROR] 	^^^^
14:42:46 [2020-08-04T18:42:46.286Z] [ERROR] Node cannot be resolved to a type
14:42:46 [2020-08-04T18:42:46.286Z] [ERROR] /home/jenkins/agent/workspace/tracecompass-master-jdk11/tmf/org.eclipse.tracecompass.tmf.ui/src/org/eclipse/tracecompass/internal/tmf/ui/parsers/wizards/CustomXmlParserInputWizardPage.java:[1544] 
14:42:46 [2020-08-04T18:42:46.286Z] [ERROR] 	if (child instanceof Element && child.getNodeName().equals(elementNames.get(i))) {
14:42:46 [2020-08-04T18:42:46.286Z] [ERROR] 	                     ^^^^^^^
14:42:46 [2020-08-04T18:42:46.286Z] [ERROR] Element cannot be resolved to a type
14:42:46 [2020-08-04T18:42:46.286Z] [ERROR] /home/jenkins/agent/workspace/tracecompass-master-jdk11/tmf/org.eclipse.tracecompass.tmf.ui/src/org/eclipse/tracecompass/internal/tmf/ui/parsers/wizards/CustomXmlParserInputWizardPage.java:[1545] 
14:42:46 [2020-08-04T18:42:46.286Z] [ERROR] 	element = (Element) child;
14:42:46 [2020-08-04T18:42:46.286Z] [ERROR] 	           ^^^^^^^
14:42:46 [2020-08-04T18:42:46.286Z] [ERROR] Element cannot be resolved to a type
14:42:46 [2020-08-04T18:42:46.286Z] [ERROR] /home/jenkins/agent/workspace/tracecompass-master-jdk11/tmf/org.eclipse.tracecompass.tmf.ui/src/org/eclipse/tracecompass/internal/tmf/ui/parsers/wizards/CustomXmlParserInputWizardPage.java:[1562] 
14:42:46 [2020-08-04T18:42:46.286Z] [ERROR] 	if (documentElement != null) {
14:42:46 [2020-08-04T18:42:46.286Z] [ERROR] 	    ^^^^^^^^^^^^^^^
14:42:46 [2020-08-04T18:42:46.286Z] [ERROR] Element cannot be resolved to a type
14:42:46 [2020-08-04T18:42:46.286Z] [ERROR] /home/jenkins/agent/workspace/tracecompass-master-jdk11/tmf/org.eclipse.tracecompass.tmf.ui/src/org/eclipse/tracecompass/internal/tmf/ui/parsers/wizards/CustomXmlParserInputWizardPage.java:[1563] 
14:42:46 [2020-08-04T18:42:46.286Z] [ERROR] 	return documentElement.getNodeName();
14:42:46 [2020-08-04T18:42:46.286Z] [ERROR] 	       ^^^^^^^^^^^^^^^
14:42:46 [2020-08-04T18:42:46.286Z] [ERROR] Element cannot be resolved to a type
14:42:46 [2020-08-04T18:42:46.286Z] [ERROR] /home/jenkins/agent/workspace/tracecompass-master-jdk11/tmf/org.eclipse.tracecompass.tmf.ui/src/org/eclipse/tracecompass/internal/tmf/ui/parsers/wizards/CustomXmlParserInputWizardPage.java:[1566] 
14:42:46 [2020-08-04T18:42:46.286Z] [ERROR] 	Element element = getPreviewElement(inputElement);
14:42:46 [2020-08-04T18:42:46.286Z] [ERROR] 	^^^^^^^
14:42:46 [2020-08-04T18:42:46.286Z] [ERROR] Element cannot be resolved to a type
14:42:46 [2020-08-04T18:42:46.286Z] [ERROR] /home/jenkins/agent/workspace/tracecompass-master-jdk11/tmf/org.eclipse.tracecompass.tmf.ui/src/org/eclipse/tracecompass/internal/tmf/ui/parsers/wizards/CustomXmlParserInputWizardPage.java:[1566] 
14:42:46 [2020-08-04T18:42:46.286Z] [ERROR] 	Element element = getPreviewElement(inputElement);
14:42:46 [2020-08-04T18:42:46.286Z] [ERROR] 	                  ^^^^^^^^^^^^^^^^^
14:42:46 [2020-08-04T18:42:46.286Z] [ERROR] The method getPreviewElement(CustomXmlInputElement) from the type CustomXmlParserInputWizardPage refers to the missing type Element
14:42:46 [2020-08-04T18:42:46.286Z] [ERROR] /home/jenkins/agent/workspace/tracecompass-master-jdk11/tmf/org.eclipse.tracecompass.tmf.ui/src/org/eclipse/tracecompass/internal/tmf/ui/parsers/wizards/CustomXmlParserInputWizardPage.java:[1568] 
14:42:46 [2020-08-04T18:42:46.286Z] [ERROR] 	NodeList childNodes = element.getChildNodes();
14:42:46 [2020-08-04T18:42:46.286Z] [ERROR] 	^^^^^^^^
14:42:46 [2020-08-04T18:42:46.286Z] [ERROR] NodeList cannot be resolved to a type
14:42:46 [2020-08-04T18:42:46.286Z] [ERROR] /home/jenkins/agent/workspace/tracecompass-master-jdk11/tmf/org.eclipse.tracecompass.tmf.ui/src/org/eclipse/tracecompass/internal/tmf/ui/parsers/wizards/CustomXmlParserInputWizardPage.java:[1570] 
14:42:46 [2020-08-04T18:42:46.286Z] [ERROR] 	Node node = childNodes.item(i);
14:42:46 [2020-08-04T18:42:46.286Z] [ERROR] 	^^^^
14:42:46 [2020-08-04T18:42:46.286Z] [ERROR] Node cannot be resolved to a type
14:42:46 [2020-08-04T18:42:46.286Z] [ERROR] /home/jenkins/agent/workspace/tracecompass-master-jdk11/tmf/org.eclipse.tracecompass.tmf.ui/src/org/eclipse/tracecompass/internal/tmf/ui/parsers/wizards/CustomXmlParserInputWizardPage.java:[1571] 
14:42:46 [2020-08-04T18:42:46.286Z] [ERROR] 	if (node instanceof Element) {
14:42:46 [2020-08-04T18:42:46.286Z] [ERROR] 	                    ^^^^^^^
14:42:46 [2020-08-04T18:42:46.286Z] [ERROR] Element cannot be resolved to a type
14:42:46 [2020-08-04T18:42:46.286Z] [ERROR] /home/jenkins/agent/workspace/tracecompass-master-jdk11/tmf/org.eclipse.tracecompass.tmf.ui/src/org/eclipse/tracecompass/internal/tmf/ui/parsers/wizards/CustomXmlParserInputWizardPage.java:[1592] 
14:42:46 [2020-08-04T18:42:46.286Z] [ERROR] 	Element element = getPreviewElement(inputElement);
14:42:46 [2020-08-04T18:42:46.286Z] [ERROR] 	^^^^^^^
14:42:46 [2020-08-04T18:42:46.286Z] [ERROR] Element cannot be resolved to a type
14:42:46 [2020-08-04T18:42:46.286Z] [ERROR] /home/jenkins/agent/workspace/tracecompass-master-jdk11/tmf/org.eclipse.tracecompass.tmf.ui/src/org/eclipse/tracecompass/internal/tmf/ui/parsers/wizards/CustomXmlParserInputWizardPage.java:[1592] 
14:42:46 [2020-08-04T18:42:46.286Z] [ERROR] 	Element element = getPreviewElement(inputElement);
14:42:46 [2020-08-04T18:42:46.286Z] [ERROR] 	                  ^^^^^^^^^^^^^^^^^
14:42:46 [2020-08-04T18:42:46.286Z] [ERROR] The method getPreviewElement(CustomXmlInputElement) from the type CustomXmlParserInputWizardPage refers to the missing type Element
14:42:46 [2020-08-04T18:42:46.286Z] [ERROR] /home/jenkins/agent/workspace/tracecompass-master-jdk11/tmf/org.eclipse.tracecompass.tmf.ui/src/org/eclipse/tracecompass/internal/tmf/ui/parsers/wizards/CustomXmlParserInputWizardPage.java:[1594] 
14:42:46 [2020-08-04T18:42:46.286Z] [ERROR] 	NamedNodeMap attributeMap = element.getAttributes();
14:42:46 [2020-08-04T18:42:46.286Z] [ERROR] 	^^^^^^^^^^^^
14:42:46 [2020-08-04T18:42:46.286Z] [ERROR] NamedNodeMap cannot be resolved to a type
14:42:46 [2020-08-04T18:42:46.286Z] [ERROR] /home/jenkins/agent/workspace/tracecompass-master-jdk11/tmf/org.eclipse.tracecompass.tmf.ui/src/org/eclipse/tracecompass/internal/tmf/ui/parsers/wizards/CustomXmlParserInputWizardPage.java:[1596] 
14:42:46 [2020-08-04T18:42:46.286Z] [ERROR] 	Node node = attributeMap.item(i);
14:42:46 [2020-08-04T18:42:46.286Z] [ERROR] 	^^^^
14:42:46 [2020-08-04T18:42:46.286Z] [ERROR] Node cannot be resolved to a type
14:42:46 [2020-08-04T18:42:46.286Z] [ERROR] 187 problems (187 errors)
14:42:46 [2020-08-04T18:42:46.286Z] [ERROR] -> [Help 1]
14:42:46 [2020-08-04T18:42:46.286Z] [ERROR] 
14:42:46 [2020-08-04T18:42:46.286Z] [ERROR] To see the full stack trace of the errors, re-run Maven with the -e switch.
14:42:46 [2020-08-04T18:42:46.286Z] [ERROR] Re-run Maven using the -X switch to enable full debug logging.
14:42:46 [2020-08-04T18:42:46.286Z] [ERROR] 
14:42:46 [2020-08-04T18:42:46.286Z] [ERROR] For more information about the errors and possible solutions, please read the following articles:
14:42:46 [2020-08-04T18:42:46.286Z] [ERROR] [Help 1] http://cwiki.apache.org/confluence/display/MAVEN/MojoFailureException
14:42:46 [2020-08-04T18:42:46.286Z] [ERROR] 
14:42:46 [2020-08-04T18:42:46.286Z] [ERROR] After correcting the problems, you can resume the build with the command
14:42:46 [2020-08-04T18:42:46.286Z] [ERROR]   mvn <args> -rf :org.eclipse.tracecompass.tmf.ui