Console Output

Skipping 5,553 KB.. Full Log
16:17:08 [2020-07-24T20:17:08.984Z] 	at java.base/jdk.internal.reflect.NativeMethodAccessorImpl.invoke(NativeMethodAccessorImpl.java:62)
16:17:08 [2020-07-24T20:17:08.984Z] 	at java.base/jdk.internal.reflect.DelegatingMethodAccessorImpl.invoke(DelegatingMethodAccessorImpl.java:43)
16:17:08 [2020-07-24T20:17:08.984Z] 	at java.base/java.lang.reflect.Method.invoke(Method.java:566)
16:17:08 [2020-07-24T20:17:08.984Z] 	at org.apache.maven.surefire.util.ReflectionUtils.invokeMethodWithArray2(ReflectionUtils.java:206)
16:17:08 [2020-07-24T20:17:08.984Z] 	at org.apache.maven.surefire.booter.ProviderFactory$ProviderProxy.invoke(ProviderFactory.java:161)
16:17:08 [2020-07-24T20:17:08.984Z] 	at org.apache.maven.surefire.booter.ProviderFactory.invokeProvider(ProviderFactory.java:84)
16:17:08 [2020-07-24T20:17:08.984Z] 	at org.eclipse.tycho.surefire.osgibooter.OsgiSurefireBooter.run(OsgiSurefireBooter.java:110)
16:17:08 [2020-07-24T20:17:08.984Z] 	at org.eclipse.tycho.surefire.osgibooter.HeadlessTestApplication.run(HeadlessTestApplication.java:21)
16:17:08 [2020-07-24T20:17:08.984Z] 	at java.base/jdk.internal.reflect.NativeMethodAccessorImpl.invoke0(Native Method)
16:17:08 [2020-07-24T20:17:08.984Z] 	at java.base/jdk.internal.reflect.NativeMethodAccessorImpl.invoke(NativeMethodAccessorImpl.java:62)
16:17:08 [2020-07-24T20:17:08.984Z] 	at java.base/jdk.internal.reflect.DelegatingMethodAccessorImpl.invoke(DelegatingMethodAccessorImpl.java:43)
16:17:08 [2020-07-24T20:17:08.984Z] 	at java.base/java.lang.reflect.Method.invoke(Method.java:566)
16:17:08 [2020-07-24T20:17:08.984Z] 	at org.eclipse.equinox.internal.app.EclipseAppContainer.callMethodWithException(EclipseAppContainer.java:593)
16:17:08 [2020-07-24T20:17:08.984Z] 	at org.eclipse.equinox.internal.app.EclipseAppHandle.run(EclipseAppHandle.java:205)
16:17:08 [2020-07-24T20:17:08.984Z] 	at org.eclipse.core.runtime.internal.adaptor.EclipseAppLauncher.runApplication(EclipseAppLauncher.java:137)
16:17:08 [2020-07-24T20:17:08.984Z] 	at org.eclipse.core.runtime.internal.adaptor.EclipseAppLauncher.start(EclipseAppLauncher.java:107)
16:17:08 [2020-07-24T20:17:08.984Z] 	at org.eclipse.core.runtime.adaptor.EclipseStarter.run(EclipseStarter.java:401)
16:17:08 [2020-07-24T20:17:08.984Z] 	at org.eclipse.core.runtime.adaptor.EclipseStarter.run(EclipseStarter.java:255)
16:17:08 [2020-07-24T20:17:08.984Z] 	at java.base/jdk.internal.reflect.NativeMethodAccessorImpl.invoke0(Native Method)
16:17:08 [2020-07-24T20:17:08.984Z] 	at java.base/jdk.internal.reflect.NativeMethodAccessorImpl.invoke(NativeMethodAccessorImpl.java:62)
16:17:08 [2020-07-24T20:17:08.984Z] 	at java.base/jdk.internal.reflect.DelegatingMethodAccessorImpl.invoke(DelegatingMethodAccessorImpl.java:43)
16:17:08 [2020-07-24T20:17:08.984Z] 	at java.base/java.lang.reflect.Method.invoke(Method.java:566)
16:17:08 [2020-07-24T20:17:08.984Z] 	at org.eclipse.equinox.launcher.Main.invokeFramework(Main.java:657)
16:17:08 [2020-07-24T20:17:08.984Z] 	at org.eclipse.equinox.launcher.Main.basicRun(Main.java:594)
16:17:08 [2020-07-24T20:17:08.984Z] 	at org.eclipse.equinox.launcher.Main.run(Main.java:1447)
16:17:08 [2020-07-24T20:17:08.984Z] 	at org.eclipse.equinox.launcher.Main.main(Main.java:1420)
16:17:08 [2020-07-24T20:17:08.984Z] 
16:17:08 [2020-07-24T20:17:08.984Z] testFormatIllegalArgument[37: null - Toto](org.eclipse.tracecompass.common.core.tests.format.DecimalUnitFormatTest)  Time elapsed: 0 s
16:17:08 [2020-07-24T20:17:08.984Z] testParseObject[37: null - Toto](org.eclipse.tracecompass.common.core.tests.format.DecimalUnitFormatTest)  Time elapsed: 0 s
16:17:08 [2020-07-24T20:17:08.984Z] testFormat[37: null - Toto](org.eclipse.tracecompass.common.core.tests.format.DecimalUnitFormatTest)  Time elapsed: 0 s
16:17:08 [2020-07-24T20:17:08.984Z] testParseObject2[37: null - Toto](org.eclipse.tracecompass.common.core.tests.format.DecimalUnitFormatTest)  Time elapsed: 0 s
16:17:08 [2020-07-24T20:17:08.984Z] testFormatIllegalArgument[38: null - 1.2 s](org.eclipse.tracecompass.common.core.tests.format.DecimalUnitFormatTest)  Time elapsed: 0 s
16:17:08 [2020-07-24T20:17:08.984Z] testParseObject[38: null - 1.2 s](org.eclipse.tracecompass.common.core.tests.format.DecimalUnitFormatTest)  Time elapsed: 0 s
16:17:08 [2020-07-24T20:17:08.984Z] testFormat[38: null - 1.2 s](org.eclipse.tracecompass.common.core.tests.format.DecimalUnitFormatTest)  Time elapsed: 0 s
16:17:08 [2020-07-24T20:17:08.984Z] testParseObject2[38: null - 1.2 s](org.eclipse.tracecompass.common.core.tests.format.DecimalUnitFormatTest)  Time elapsed: 0 s
16:17:08 [2020-07-24T20:17:08.984Z] testFormatIllegalArgument[39: null - 1.2 ms](org.eclipse.tracecompass.common.core.tests.format.DecimalUnitFormatTest)  Time elapsed: 0.001 s
16:17:08 [2020-07-24T20:17:08.984Z] testParseObject[39: null - 1.2 ms](org.eclipse.tracecompass.common.core.tests.format.DecimalUnitFormatTest)  Time elapsed: 0 s
16:17:08 [2020-07-24T20:17:08.984Z] testFormat[39: null - 1.2 ms](org.eclipse.tracecompass.common.core.tests.format.DecimalUnitFormatTest)  Time elapsed: 0 s
16:17:08 [2020-07-24T20:17:08.984Z] testParseObject2[39: null - 1.2 ms](org.eclipse.tracecompass.common.core.tests.format.DecimalUnitFormatTest)  Time elapsed: 0 s
16:17:08 [2020-07-24T20:17:08.984Z] testFormatIllegalArgument[40: null - ∞ k](org.eclipse.tracecompass.common.core.tests.format.DecimalUnitFormatTest)  Time elapsed: 0 s
16:17:08 [2020-07-24T20:17:08.984Z] testParseObject[40: null - ∞ k](org.eclipse.tracecompass.common.core.tests.format.DecimalUnitFormatTest)  Time elapsed: 0 s
16:17:08 [2020-07-24T20:17:08.984Z] testFormat[40: null - ∞ k](org.eclipse.tracecompass.common.core.tests.format.DecimalUnitFormatTest)  Time elapsed: 0 s
16:17:08 [2020-07-24T20:17:08.984Z] testParseObject2[40: null - ∞ k](org.eclipse.tracecompass.common.core.tests.format.DecimalUnitFormatTest)  Time elapsed: 0 s
16:17:08 [2020-07-24T20:17:08.984Z] testFormatIllegalArgument[41: null - -∞ p](org.eclipse.tracecompass.common.core.tests.format.DecimalUnitFormatTest)  Time elapsed: 0 s
16:17:08 [2020-07-24T20:17:08.984Z] testParseObject[41: null - -∞ p](org.eclipse.tracecompass.common.core.tests.format.DecimalUnitFormatTest)  Time elapsed: 0 s
16:17:08 [2020-07-24T20:17:08.984Z] testFormat[41: null - -∞ p](org.eclipse.tracecompass.common.core.tests.format.DecimalUnitFormatTest)  Time elapsed: 0 s
16:17:08 [2020-07-24T20:17:08.984Z] testParseObject2[41: null - -∞ p](org.eclipse.tracecompass.common.core.tests.format.DecimalUnitFormatTest)  Time elapsed: 0 s
16:17:08 [2020-07-24T20:17:08.984Z] testFormatIllegalArgument[42: null - �M](org.eclipse.tracecompass.common.core.tests.format.DecimalUnitFormatTest)  Time elapsed: 0 s
16:17:08 [2020-07-24T20:17:08.984Z] testParseObject[42: null - �M](org.eclipse.tracecompass.common.core.tests.format.DecimalUnitFormatTest)  Time elapsed: 0.001 s  <<< ERROR!
16:17:08 [2020-07-24T20:17:08.984Z] java.text.ParseException: Format.parseObject(String) failed
16:17:08 [2020-07-24T20:17:08.984Z] 	at java.base/java.text.Format.parseObject(Format.java:247)
16:17:08 [2020-07-24T20:17:08.984Z] 	at org.eclipse.tracecompass.common.core.tests.format.FormatTestBase.testParseObject(FormatTestBase.java:91)
16:17:08 [2020-07-24T20:17:08.984Z] 	at jdk.internal.reflect.GeneratedMethodAccessor8.invoke(Unknown Source)
16:17:08 [2020-07-24T20:17:08.984Z] 	at java.base/jdk.internal.reflect.DelegatingMethodAccessorImpl.invoke(DelegatingMethodAccessorImpl.java:43)
16:17:08 [2020-07-24T20:17:08.984Z] 	at java.base/java.lang.reflect.Method.invoke(Method.java:566)
16:17:08 [2020-07-24T20:17:08.984Z] 	at org.junit.runners.model.FrameworkMethod$1.runReflectiveCall(FrameworkMethod.java:59)
16:17:08 [2020-07-24T20:17:08.984Z] 	at org.junit.internal.runners.model.ReflectiveCallable.run(ReflectiveCallable.java:12)
16:17:08 [2020-07-24T20:17:08.984Z] 	at org.junit.runners.model.FrameworkMethod.invokeExplosively(FrameworkMethod.java:56)
16:17:08 [2020-07-24T20:17:08.984Z] 	at org.junit.internal.runners.statements.InvokeMethod.evaluate(InvokeMethod.java:17)
16:17:08 [2020-07-24T20:17:08.984Z] 	at org.junit.runners.ParentRunner$3.evaluate(ParentRunner.java:306)
16:17:08 [2020-07-24T20:17:08.984Z] 	at org.junit.runners.BlockJUnit4ClassRunner$1.evaluate(BlockJUnit4ClassRunner.java:100)
16:17:08 [2020-07-24T20:17:08.984Z] 	at org.junit.runners.ParentRunner.runLeaf(ParentRunner.java:366)
16:17:08 [2020-07-24T20:17:08.984Z] 	at org.junit.runners.BlockJUnit4ClassRunner.runChild(BlockJUnit4ClassRunner.java:103)
16:17:08 [2020-07-24T20:17:08.984Z] 	at org.junit.runners.BlockJUnit4ClassRunner.runChild(BlockJUnit4ClassRunner.java:63)
16:17:08 [2020-07-24T20:17:08.984Z] 	at org.junit.runners.ParentRunner$4.run(ParentRunner.java:331)
16:17:08 [2020-07-24T20:17:08.984Z] 	at org.junit.runners.ParentRunner$1.schedule(ParentRunner.java:79)
16:17:08 [2020-07-24T20:17:08.984Z] 	at org.junit.runners.ParentRunner.runChildren(ParentRunner.java:329)
16:17:08 [2020-07-24T20:17:08.984Z] 	at org.junit.runners.ParentRunner.access$100(ParentRunner.java:66)
16:17:08 [2020-07-24T20:17:08.984Z] 	at org.junit.runners.ParentRunner$2.evaluate(ParentRunner.java:293)
16:17:08 [2020-07-24T20:17:08.984Z] 	at org.junit.runners.ParentRunner.run(ParentRunner.java:413)
16:17:08 [2020-07-24T20:17:08.984Z] 	at org.junit.runners.Suite.runChild(Suite.java:128)
16:17:08 [2020-07-24T20:17:08.984Z] 	at org.junit.runners.Suite.runChild(Suite.java:27)
16:17:08 [2020-07-24T20:17:08.984Z] 	at org.junit.runners.ParentRunner$4.run(ParentRunner.java:331)
16:17:08 [2020-07-24T20:17:08.984Z] 	at org.junit.runners.ParentRunner$1.schedule(ParentRunner.java:79)
16:17:08 [2020-07-24T20:17:08.984Z] 	at org.junit.runners.ParentRunner.runChildren(ParentRunner.java:329)
16:17:08 [2020-07-24T20:17:08.984Z] 	at org.junit.runners.ParentRunner.access$100(ParentRunner.java:66)
16:17:08 [2020-07-24T20:17:08.984Z] 	at org.junit.runners.ParentRunner$2.evaluate(ParentRunner.java:293)
16:17:08 [2020-07-24T20:17:08.984Z] 	at org.junit.runners.ParentRunner$3.evaluate(ParentRunner.java:306)
16:17:08 [2020-07-24T20:17:08.984Z] 	at org.junit.runners.ParentRunner.run(ParentRunner.java:413)
16:17:08 [2020-07-24T20:17:08.984Z] 	at org.apache.maven.surefire.junit4.JUnit4Provider.execute(JUnit4Provider.java:365)
16:17:08 [2020-07-24T20:17:08.984Z] 	at org.apache.maven.surefire.junit4.JUnit4Provider.executeWithRerun(JUnit4Provider.java:273)
16:17:08 [2020-07-24T20:17:08.984Z] 	at org.apache.maven.surefire.junit4.JUnit4Provider.executeTestSet(JUnit4Provider.java:238)
16:17:08 [2020-07-24T20:17:08.984Z] 	at org.apache.maven.surefire.junit4.JUnit4Provider.invoke(JUnit4Provider.java:159)
16:17:08 [2020-07-24T20:17:08.984Z] 	at java.base/jdk.internal.reflect.NativeMethodAccessorImpl.invoke0(Native Method)
16:17:08 [2020-07-24T20:17:08.984Z] 	at java.base/jdk.internal.reflect.NativeMethodAccessorImpl.invoke(NativeMethodAccessorImpl.java:62)
16:17:08 [2020-07-24T20:17:08.984Z] 	at java.base/jdk.internal.reflect.DelegatingMethodAccessorImpl.invoke(DelegatingMethodAccessorImpl.java:43)
16:17:08 [2020-07-24T20:17:08.984Z] 	at java.base/java.lang.reflect.Method.invoke(Method.java:566)
16:17:08 [2020-07-24T20:17:08.984Z] 	at org.apache.maven.surefire.util.ReflectionUtils.invokeMethodWithArray2(ReflectionUtils.java:206)
16:17:08 [2020-07-24T20:17:08.984Z] 	at org.apache.maven.surefire.booter.ProviderFactory$ProviderProxy.invoke(ProviderFactory.java:161)
16:17:08 [2020-07-24T20:17:08.984Z] 	at org.apache.maven.surefire.booter.ProviderFactory.invokeProvider(ProviderFactory.java:84)
16:17:08 [2020-07-24T20:17:08.984Z] 	at org.eclipse.tycho.surefire.osgibooter.OsgiSurefireBooter.run(OsgiSurefireBooter.java:110)
16:17:08 [2020-07-24T20:17:08.984Z] 	at org.eclipse.tycho.surefire.osgibooter.HeadlessTestApplication.run(HeadlessTestApplication.java:21)
16:17:08 [2020-07-24T20:17:08.984Z] 	at java.base/jdk.internal.reflect.NativeMethodAccessorImpl.invoke0(Native Method)
16:17:08 [2020-07-24T20:17:08.984Z] 	at java.base/jdk.internal.reflect.NativeMethodAccessorImpl.invoke(NativeMethodAccessorImpl.java:62)
16:17:08 [2020-07-24T20:17:08.984Z] 	at java.base/jdk.internal.reflect.DelegatingMethodAccessorImpl.invoke(DelegatingMethodAccessorImpl.java:43)
16:17:08 [2020-07-24T20:17:08.984Z] 	at java.base/java.lang.reflect.Method.invoke(Method.java:566)
16:17:08 [2020-07-24T20:17:08.984Z] 	at org.eclipse.equinox.internal.app.EclipseAppContainer.callMethodWithException(EclipseAppContainer.java:593)
16:17:08 [2020-07-24T20:17:08.984Z] 	at org.eclipse.equinox.internal.app.EclipseAppHandle.run(EclipseAppHandle.java:205)
16:17:08 [2020-07-24T20:17:08.984Z] 	at org.eclipse.core.runtime.internal.adaptor.EclipseAppLauncher.runApplication(EclipseAppLauncher.java:137)
16:17:08 [2020-07-24T20:17:08.984Z] 	at org.eclipse.core.runtime.internal.adaptor.EclipseAppLauncher.start(EclipseAppLauncher.java:107)
16:17:08 [2020-07-24T20:17:08.984Z] 	at org.eclipse.core.runtime.adaptor.EclipseStarter.run(EclipseStarter.java:401)
16:17:08 [2020-07-24T20:17:08.984Z] 	at org.eclipse.core.runtime.adaptor.EclipseStarter.run(EclipseStarter.java:255)
16:17:08 [2020-07-24T20:17:08.984Z] 	at java.base/jdk.internal.reflect.NativeMethodAccessorImpl.invoke0(Native Method)
16:17:08 [2020-07-24T20:17:08.984Z] 	at java.base/jdk.internal.reflect.NativeMethodAccessorImpl.invoke(NativeMethodAccessorImpl.java:62)
16:17:08 [2020-07-24T20:17:08.984Z] 	at java.base/jdk.internal.reflect.DelegatingMethodAccessorImpl.invoke(DelegatingMethodAccessorImpl.java:43)
16:17:08 [2020-07-24T20:17:08.984Z] 	at java.base/java.lang.reflect.Method.invoke(Method.java:566)
16:17:08 [2020-07-24T20:17:08.984Z] 	at org.eclipse.equinox.launcher.Main.invokeFramework(Main.java:657)
16:17:08 [2020-07-24T20:17:08.984Z] 	at org.eclipse.equinox.launcher.Main.basicRun(Main.java:594)
16:17:08 [2020-07-24T20:17:08.984Z] 	at org.eclipse.equinox.launcher.Main.run(Main.java:1447)
16:17:08 [2020-07-24T20:17:08.984Z] 	at org.eclipse.equinox.launcher.Main.main(Main.java:1420)
16:17:08 [2020-07-24T20:17:08.984Z] 
16:17:08 [2020-07-24T20:17:08.984Z] testFormat[42: null - �M](org.eclipse.tracecompass.common.core.tests.format.DecimalUnitFormatTest)  Time elapsed: 0 s
16:17:08 [2020-07-24T20:17:08.984Z] testParseObject2[42: null - �M](org.eclipse.tracecompass.common.core.tests.format.DecimalUnitFormatTest)  Time elapsed: 0 s  <<< FAILURE!
16:17:08 [2020-07-24T20:17:08.984Z] java.lang.AssertionError: parseObject with pos value expected:<NaN> but was:<null>
16:17:08 [2020-07-24T20:17:08.984Z] 	at org.junit.Assert.fail(Assert.java:89)
16:17:08 [2020-07-24T20:17:08.984Z] 	at org.junit.Assert.failNotEquals(Assert.java:835)
16:17:08 [2020-07-24T20:17:08.984Z] 	at org.junit.Assert.assertEquals(Assert.java:120)
16:17:08 [2020-07-24T20:17:08.984Z] 	at org.eclipse.tracecompass.common.core.tests.format.FormatTestBase.testParseObject2(FormatTestBase.java:111)
16:17:08 [2020-07-24T20:17:08.984Z] 	at jdk.internal.reflect.GeneratedMethodAccessor10.invoke(Unknown Source)
16:17:08 [2020-07-24T20:17:08.984Z] 	at java.base/jdk.internal.reflect.DelegatingMethodAccessorImpl.invoke(DelegatingMethodAccessorImpl.java:43)
16:17:08 [2020-07-24T20:17:08.984Z] 	at java.base/java.lang.reflect.Method.invoke(Method.java:566)
16:17:08 [2020-07-24T20:17:08.985Z] 	at org.junit.runners.model.FrameworkMethod$1.runReflectiveCall(FrameworkMethod.java:59)
16:17:08 [2020-07-24T20:17:08.985Z] 	at org.junit.internal.runners.model.ReflectiveCallable.run(ReflectiveCallable.java:12)
16:17:08 [2020-07-24T20:17:08.985Z] 	at org.junit.runners.model.FrameworkMethod.invokeExplosively(FrameworkMethod.java:56)
16:17:08 [2020-07-24T20:17:08.985Z] 	at org.junit.internal.runners.statements.InvokeMethod.evaluate(InvokeMethod.java:17)
16:17:08 [2020-07-24T20:17:08.985Z] 	at org.junit.runners.ParentRunner$3.evaluate(ParentRunner.java:306)
16:17:08 [2020-07-24T20:17:08.985Z] 	at org.junit.runners.BlockJUnit4ClassRunner$1.evaluate(BlockJUnit4ClassRunner.java:100)
16:17:08 [2020-07-24T20:17:08.985Z] 	at org.junit.runners.ParentRunner.runLeaf(ParentRunner.java:366)
16:17:08 [2020-07-24T20:17:08.985Z] 	at org.junit.runners.BlockJUnit4ClassRunner.runChild(BlockJUnit4ClassRunner.java:103)
16:17:08 [2020-07-24T20:17:08.985Z] 	at org.junit.runners.BlockJUnit4ClassRunner.runChild(BlockJUnit4ClassRunner.java:63)
16:17:08 [2020-07-24T20:17:08.985Z] 	at org.junit.runners.ParentRunner$4.run(ParentRunner.java:331)
16:17:08 [2020-07-24T20:17:08.985Z] 	at org.junit.runners.ParentRunner$1.schedule(ParentRunner.java:79)
16:17:08 [2020-07-24T20:17:08.985Z] 	at org.junit.runners.ParentRunner.runChildren(ParentRunner.java:329)
16:17:08 [2020-07-24T20:17:08.985Z] 	at org.junit.runners.ParentRunner.access$100(ParentRunner.java:66)
16:17:08 [2020-07-24T20:17:08.985Z] 	at org.junit.runners.ParentRunner$2.evaluate(ParentRunner.java:293)
16:17:08 [2020-07-24T20:17:08.985Z] 	at org.junit.runners.ParentRunner.run(ParentRunner.java:413)
16:17:08 [2020-07-24T20:17:08.985Z] 	at org.junit.runners.Suite.runChild(Suite.java:128)
16:17:08 [2020-07-24T20:17:08.985Z] 	at org.junit.runners.Suite.runChild(Suite.java:27)
16:17:08 [2020-07-24T20:17:08.985Z] 	at org.junit.runners.ParentRunner$4.run(ParentRunner.java:331)
16:17:08 [2020-07-24T20:17:08.985Z] 	at org.junit.runners.ParentRunner$1.schedule(ParentRunner.java:79)
16:17:08 [2020-07-24T20:17:08.985Z] 	at org.junit.runners.ParentRunner.runChildren(ParentRunner.java:329)
16:17:08 [2020-07-24T20:17:08.985Z] 	at org.junit.runners.ParentRunner.access$100(ParentRunner.java:66)
16:17:08 [2020-07-24T20:17:08.985Z] 	at org.junit.runners.ParentRunner$2.evaluate(ParentRunner.java:293)
16:17:08 [2020-07-24T20:17:08.985Z] 	at org.junit.runners.ParentRunner$3.evaluate(ParentRunner.java:306)
16:17:08 [2020-07-24T20:17:08.985Z] 	at org.junit.runners.ParentRunner.run(ParentRunner.java:413)
16:17:08 [2020-07-24T20:17:08.985Z] 	at org.apache.maven.surefire.junit4.JUnit4Provider.execute(JUnit4Provider.java:365)
16:17:08 [2020-07-24T20:17:08.985Z] 	at org.apache.maven.surefire.junit4.JUnit4Provider.executeWithRerun(JUnit4Provider.java:273)
16:17:08 [2020-07-24T20:17:08.985Z] 	at org.apache.maven.surefire.junit4.JUnit4Provider.executeTestSet(JUnit4Provider.java:238)
16:17:08 [2020-07-24T20:17:08.985Z] 	at org.apache.maven.surefire.junit4.JUnit4Provider.invoke(JUnit4Provider.java:159)
16:17:08 [2020-07-24T20:17:08.985Z] 	at java.base/jdk.internal.reflect.NativeMethodAccessorImpl.invoke0(Native Method)
16:17:08 [2020-07-24T20:17:08.985Z] 	at java.base/jdk.internal.reflect.NativeMethodAccessorImpl.invoke(NativeMethodAccessorImpl.java:62)
16:17:08 [2020-07-24T20:17:08.985Z] 	at java.base/jdk.internal.reflect.DelegatingMethodAccessorImpl.invoke(DelegatingMethodAccessorImpl.java:43)
16:17:08 [2020-07-24T20:17:08.985Z] 	at java.base/java.lang.reflect.Method.invoke(Method.java:566)
16:17:08 [2020-07-24T20:17:08.985Z] 	at org.apache.maven.surefire.util.ReflectionUtils.invokeMethodWithArray2(ReflectionUtils.java:206)
16:17:08 [2020-07-24T20:17:08.985Z] 	at org.apache.maven.surefire.booter.ProviderFactory$ProviderProxy.invoke(ProviderFactory.java:161)
16:17:08 [2020-07-24T20:17:08.985Z] 	at org.apache.maven.surefire.booter.ProviderFactory.invokeProvider(ProviderFactory.java:84)
16:17:08 [2020-07-24T20:17:08.985Z] 	at org.eclipse.tycho.surefire.osgibooter.OsgiSurefireBooter.run(OsgiSurefireBooter.java:110)
16:17:08 [2020-07-24T20:17:08.985Z] 	at org.eclipse.tycho.surefire.osgibooter.HeadlessTestApplication.run(HeadlessTestApplication.java:21)
16:17:08 [2020-07-24T20:17:08.985Z] 	at java.base/jdk.internal.reflect.NativeMethodAccessorImpl.invoke0(Native Method)
16:17:08 [2020-07-24T20:17:08.985Z] 	at java.base/jdk.internal.reflect.NativeMethodAccessorImpl.invoke(NativeMethodAccessorImpl.java:62)
16:17:08 [2020-07-24T20:17:08.985Z] 	at java.base/jdk.internal.reflect.DelegatingMethodAccessorImpl.invoke(DelegatingMethodAccessorImpl.java:43)
16:17:08 [2020-07-24T20:17:08.985Z] 	at java.base/java.lang.reflect.Method.invoke(Method.java:566)
16:17:08 [2020-07-24T20:17:08.985Z] 	at org.eclipse.equinox.internal.app.EclipseAppContainer.callMethodWithException(EclipseAppContainer.java:593)
16:17:08 [2020-07-24T20:17:08.985Z] 	at org.eclipse.equinox.internal.app.EclipseAppHandle.run(EclipseAppHandle.java:205)
16:17:08 [2020-07-24T20:17:08.985Z] 	at org.eclipse.core.runtime.internal.adaptor.EclipseAppLauncher.runApplication(EclipseAppLauncher.java:137)
16:17:08 [2020-07-24T20:17:08.985Z] 	at org.eclipse.core.runtime.internal.adaptor.EclipseAppLauncher.start(EclipseAppLauncher.java:107)
16:17:08 [2020-07-24T20:17:08.985Z] 	at org.eclipse.core.runtime.adaptor.EclipseStarter.run(EclipseStarter.java:401)
16:17:08 [2020-07-24T20:17:08.985Z] 	at org.eclipse.core.runtime.adaptor.EclipseStarter.run(EclipseStarter.java:255)
16:17:08 [2020-07-24T20:17:08.985Z] 	at java.base/jdk.internal.reflect.NativeMethodAccessorImpl.invoke0(Native Method)
16:17:08 [2020-07-24T20:17:08.985Z] 	at java.base/jdk.internal.reflect.NativeMethodAccessorImpl.invoke(NativeMethodAccessorImpl.java:62)
16:17:08 [2020-07-24T20:17:08.985Z] 	at java.base/jdk.internal.reflect.DelegatingMethodAccessorImpl.invoke(DelegatingMethodAccessorImpl.java:43)
16:17:08 [2020-07-24T20:17:08.985Z] 	at java.base/java.lang.reflect.Method.invoke(Method.java:566)
16:17:08 [2020-07-24T20:17:08.985Z] 	at org.eclipse.equinox.launcher.Main.invokeFramework(Main.java:657)
16:17:08 [2020-07-24T20:17:08.985Z] 	at org.eclipse.equinox.launcher.Main.basicRun(Main.java:594)
16:17:08 [2020-07-24T20:17:08.985Z] 	at org.eclipse.equinox.launcher.Main.run(Main.java:1447)
16:17:08 [2020-07-24T20:17:08.985Z] 	at org.eclipse.equinox.launcher.Main.main(Main.java:1420)
16:17:08 [2020-07-24T20:17:08.985Z] 
16:17:08 [2020-07-24T20:17:08.985Z] testFormatIllegalArgument[43: null - 1.2 m  ](org.eclipse.tracecompass.common.core.tests.format.DecimalUnitFormatTest)  Time elapsed: 0 s
16:17:08 [2020-07-24T20:17:08.985Z] testParseObject[43: null - 1.2 m  ](org.eclipse.tracecompass.common.core.tests.format.DecimalUnitFormatTest)  Time elapsed: 0 s
16:17:08 [2020-07-24T20:17:08.985Z] testFormat[43: null - 1.2 m  ](org.eclipse.tracecompass.common.core.tests.format.DecimalUnitFormatTest)  Time elapsed: 0 s
16:17:08 [2020-07-24T20:17:08.985Z] testParseObject2[43: null - 1.2 m  ](org.eclipse.tracecompass.common.core.tests.format.DecimalUnitFormatTest)  Time elapsed: 0 s
16:17:08 [2020-07-24T20:17:08.985Z] Running org.eclipse.tracecompass.common.core.tests.format.DataSpeedFormatTest
16:17:09 [2020-07-24T20:17:09.243Z] Tests run: 100, Failures: 0, Errors: 0, Skipped: 0, Time elapsed: 0.066 s - in org.eclipse.tracecompass.common.core.tests.format.DataSpeedFormatTest
16:17:09 [2020-07-24T20:17:09.243Z] testParseObject[0: 0 - 0 B/s](org.eclipse.tracecompass.common.core.tests.format.DataSpeedFormatTest)  Time elapsed: 0 s
16:17:09 [2020-07-24T20:17:09.243Z] testFormatIllegalArgument[0: 0 - 0 B/s](org.eclipse.tracecompass.common.core.tests.format.DataSpeedFormatTest)  Time elapsed: 0 s
16:17:09 [2020-07-24T20:17:09.243Z] testFormat[0: 0 - 0 B/s](org.eclipse.tracecompass.common.core.tests.format.DataSpeedFormatTest)  Time elapsed: 0 s
16:17:09 [2020-07-24T20:17:09.243Z] testParseObject2[0: 0 - 0 B/s](org.eclipse.tracecompass.common.core.tests.format.DataSpeedFormatTest)  Time elapsed: 0 s
16:17:09 [2020-07-24T20:17:09.243Z] testParseObject[1: 3 - 3 B/s](org.eclipse.tracecompass.common.core.tests.format.DataSpeedFormatTest)  Time elapsed: 0 s
16:17:09 [2020-07-24T20:17:09.243Z] testFormatIllegalArgument[1: 3 - 3 B/s](org.eclipse.tracecompass.common.core.tests.format.DataSpeedFormatTest)  Time elapsed: 0 s
16:17:09 [2020-07-24T20:17:09.243Z] testFormat[1: 3 - 3 B/s](org.eclipse.tracecompass.common.core.tests.format.DataSpeedFormatTest)  Time elapsed: 0 s
16:17:09 [2020-07-24T20:17:09.243Z] testParseObject2[1: 3 - 3 B/s](org.eclipse.tracecompass.common.core.tests.format.DataSpeedFormatTest)  Time elapsed: 0 s
16:17:09 [2020-07-24T20:17:09.243Z] testParseObject[2: 975 - 975 B/s](org.eclipse.tracecompass.common.core.tests.format.DataSpeedFormatTest)  Time elapsed: 0 s
16:17:09 [2020-07-24T20:17:09.243Z] testFormatIllegalArgument[2: 975 - 975 B/s](org.eclipse.tracecompass.common.core.tests.format.DataSpeedFormatTest)  Time elapsed: 0 s
16:17:09 [2020-07-24T20:17:09.243Z] testFormat[2: 975 - 975 B/s](org.eclipse.tracecompass.common.core.tests.format.DataSpeedFormatTest)  Time elapsed: 0 s
16:17:09 [2020-07-24T20:17:09.244Z] testParseObject2[2: 975 - 975 B/s](org.eclipse.tracecompass.common.core.tests.format.DataSpeedFormatTest)  Time elapsed: 0 s
16:17:09 [2020-07-24T20:17:09.244Z] testParseObject[3: 1,024 - 1 KB/s](org.eclipse.tracecompass.common.core.tests.format.DataSpeedFormatTest)  Time elapsed: 0 s
16:17:09 [2020-07-24T20:17:09.244Z] testFormatIllegalArgument[3: 1,024 - 1 KB/s](org.eclipse.tracecompass.common.core.tests.format.DataSpeedFormatTest)  Time elapsed: 0 s
16:17:09 [2020-07-24T20:17:09.244Z] testFormat[3: 1,024 - 1 KB/s](org.eclipse.tracecompass.common.core.tests.format.DataSpeedFormatTest)  Time elapsed: 0 s
16:17:09 [2020-07-24T20:17:09.244Z] testParseObject2[3: 1,024 - 1 KB/s](org.eclipse.tracecompass.common.core.tests.format.DataSpeedFormatTest)  Time elapsed: 0 s
16:17:09 [2020-07-24T20:17:09.244Z] testParseObject[4: 1,048,576 - 1 MB/s](org.eclipse.tracecompass.common.core.tests.format.DataSpeedFormatTest)  Time elapsed: 0 s
16:17:09 [2020-07-24T20:17:09.244Z] testFormatIllegalArgument[4: 1,048,576 - 1 MB/s](org.eclipse.tracecompass.common.core.tests.format.DataSpeedFormatTest)  Time elapsed: 0.001 s
16:17:09 [2020-07-24T20:17:09.244Z] testFormat[4: 1,048,576 - 1 MB/s](org.eclipse.tracecompass.common.core.tests.format.DataSpeedFormatTest)  Time elapsed: 0 s
16:17:09 [2020-07-24T20:17:09.244Z] testParseObject2[4: 1,048,576 - 1 MB/s](org.eclipse.tracecompass.common.core.tests.format.DataSpeedFormatTest)  Time elapsed: 0 s
16:17:09 [2020-07-24T20:17:09.244Z] testParseObject[5: 1,073,741,824 - 1 GB/s](org.eclipse.tracecompass.common.core.tests.format.DataSpeedFormatTest)  Time elapsed: 0 s
16:17:09 [2020-07-24T20:17:09.244Z] testFormatIllegalArgument[5: 1,073,741,824 - 1 GB/s](org.eclipse.tracecompass.common.core.tests.format.DataSpeedFormatTest)  Time elapsed: 0 s
16:17:09 [2020-07-24T20:17:09.244Z] testFormat[5: 1,073,741,824 - 1 GB/s](org.eclipse.tracecompass.common.core.tests.format.DataSpeedFormatTest)  Time elapsed: 0 s
16:17:09 [2020-07-24T20:17:09.244Z] testParseObject2[5: 1,073,741,824 - 1 GB/s](org.eclipse.tracecompass.common.core.tests.format.DataSpeedFormatTest)  Time elapsed: 0 s
16:17:09 [2020-07-24T20:17:09.244Z] testParseObject[6: 1,099,511,627,776 - 1 TB/s](org.eclipse.tracecompass.common.core.tests.format.DataSpeedFormatTest)  Time elapsed: 0 s
16:17:09 [2020-07-24T20:17:09.244Z] testFormatIllegalArgument[6: 1,099,511,627,776 - 1 TB/s](org.eclipse.tracecompass.common.core.tests.format.DataSpeedFormatTest)  Time elapsed: 0 s
16:17:09 [2020-07-24T20:17:09.244Z] testFormat[6: 1,099,511,627,776 - 1 TB/s](org.eclipse.tracecompass.common.core.tests.format.DataSpeedFormatTest)  Time elapsed: 0 s
16:17:09 [2020-07-24T20:17:09.244Z] testParseObject2[6: 1,099,511,627,776 - 1 TB/s](org.eclipse.tracecompass.common.core.tests.format.DataSpeedFormatTest)  Time elapsed: 0 s
16:17:09 [2020-07-24T20:17:09.244Z] testParseObject[7: 4,096 - 4 KB/s](org.eclipse.tracecompass.common.core.tests.format.DataSpeedFormatTest)  Time elapsed: 0.001 s
16:17:09 [2020-07-24T20:17:09.244Z] testFormatIllegalArgument[7: 4,096 - 4 KB/s](org.eclipse.tracecompass.common.core.tests.format.DataSpeedFormatTest)  Time elapsed: 0 s
16:17:09 [2020-07-24T20:17:09.244Z] testFormat[7: 4,096 - 4 KB/s](org.eclipse.tracecompass.common.core.tests.format.DataSpeedFormatTest)  Time elapsed: 0 s
16:17:09 [2020-07-24T20:17:09.244Z] testParseObject2[7: 4,096 - 4 KB/s](org.eclipse.tracecompass.common.core.tests.format.DataSpeedFormatTest)  Time elapsed: 0 s
16:17:09 [2020-07-24T20:17:09.244Z] testParseObject[8: -4,096 - -4 KB/s](org.eclipse.tracecompass.common.core.tests.format.DataSpeedFormatTest)  Time elapsed: 0 s
16:17:09 [2020-07-24T20:17:09.244Z] testFormatIllegalArgument[8: -4,096 - -4 KB/s](org.eclipse.tracecompass.common.core.tests.format.DataSpeedFormatTest)  Time elapsed: 0 s
16:17:09 [2020-07-24T20:17:09.244Z] testFormat[8: -4,096 - -4 KB/s](org.eclipse.tracecompass.common.core.tests.format.DataSpeedFormatTest)  Time elapsed: 0 s
16:17:09 [2020-07-24T20:17:09.244Z] testParseObject2[8: -4,096 - -4 KB/s](org.eclipse.tracecompass.common.core.tests.format.DataSpeedFormatTest)  Time elapsed: 0 s
16:17:09 [2020-07-24T20:17:09.244Z] testParseObject[9: 4,096 - 4 KB/s](org.eclipse.tracecompass.common.core.tests.format.DataSpeedFormatTest)  Time elapsed: 0 s
16:17:09 [2020-07-24T20:17:09.244Z] testFormatIllegalArgument[9: 4,096 - 4 KB/s](org.eclipse.tracecompass.common.core.tests.format.DataSpeedFormatTest)  Time elapsed: 0 s
16:17:09 [2020-07-24T20:17:09.244Z] testFormat[9: 4,096 - 4 KB/s](org.eclipse.tracecompass.common.core.tests.format.DataSpeedFormatTest)  Time elapsed: 0 s
16:17:09 [2020-07-24T20:17:09.244Z] testParseObject2[9: 4,096 - 4 KB/s](org.eclipse.tracecompass.common.core.tests.format.DataSpeedFormatTest)  Time elapsed: 0 s
16:17:09 [2020-07-24T20:17:09.244Z] testParseObject[10: 4,096 - 4 KB/s](org.eclipse.tracecompass.common.core.tests.format.DataSpeedFormatTest)  Time elapsed: 0.001 s
16:17:09 [2020-07-24T20:17:09.244Z] testFormatIllegalArgument[10: 4,096 - 4 KB/s](org.eclipse.tracecompass.common.core.tests.format.DataSpeedFormatTest)  Time elapsed: 0 s
16:17:09 [2020-07-24T20:17:09.244Z] testFormat[10: 4,096 - 4 KB/s](org.eclipse.tracecompass.common.core.tests.format.DataSpeedFormatTest)  Time elapsed: 0 s
16:17:09 [2020-07-24T20:17:09.244Z] testParseObject2[10: 4,096 - 4 KB/s](org.eclipse.tracecompass.common.core.tests.format.DataSpeedFormatTest)  Time elapsed: 0 s
16:17:09 [2020-07-24T20:17:09.244Z] testParseObject[11: 12,345,678 - 11.774 MB/s](org.eclipse.tracecompass.common.core.tests.format.DataSpeedFormatTest)  Time elapsed: 0 s
16:17:09 [2020-07-24T20:17:09.244Z] testFormatIllegalArgument[11: 12,345,678 - 11.774 MB/s](org.eclipse.tracecompass.common.core.tests.format.DataSpeedFormatTest)  Time elapsed: 0 s
16:17:09 [2020-07-24T20:17:09.244Z] testFormat[11: 12,345,678 - 11.774 MB/s](org.eclipse.tracecompass.common.core.tests.format.DataSpeedFormatTest)  Time elapsed: 0 s
16:17:09 [2020-07-24T20:17:09.244Z] testParseObject2[11: 12,345,678 - 11.774 MB/s](org.eclipse.tracecompass.common.core.tests.format.DataSpeedFormatTest)  Time elapsed: 0 s
16:17:09 [2020-07-24T20:17:09.244Z] testParseObject[12: 2,147,483,647 - 2 GB/s](org.eclipse.tracecompass.common.core.tests.format.DataSpeedFormatTest)  Time elapsed: 0 s
16:17:09 [2020-07-24T20:17:09.244Z] testFormatIllegalArgument[12: 2,147,483,647 - 2 GB/s](org.eclipse.tracecompass.common.core.tests.format.DataSpeedFormatTest)  Time elapsed: 0 s
16:17:09 [2020-07-24T20:17:09.244Z] testFormat[12: 2,147,483,647 - 2 GB/s](org.eclipse.tracecompass.common.core.tests.format.DataSpeedFormatTest)  Time elapsed: 0 s
16:17:09 [2020-07-24T20:17:09.244Z] testParseObject2[12: 2,147,483,647 - 2 GB/s](org.eclipse.tracecompass.common.core.tests.format.DataSpeedFormatTest)  Time elapsed: 0 s
16:17:09 [2020-07-24T20:17:09.244Z] testParseObject[13: -2,147,483,648 - -2 GB/s](org.eclipse.tracecompass.common.core.tests.format.DataSpeedFormatTest)  Time elapsed: 0 s
16:17:09 [2020-07-24T20:17:09.244Z] testFormatIllegalArgument[13: -2,147,483,648 - -2 GB/s](org.eclipse.tracecompass.common.core.tests.format.DataSpeedFormatTest)  Time elapsed: 0 s
16:17:09 [2020-07-24T20:17:09.244Z] testFormat[13: -2,147,483,648 - -2 GB/s](org.eclipse.tracecompass.common.core.tests.format.DataSpeedFormatTest)  Time elapsed: 0 s
16:17:09 [2020-07-24T20:17:09.244Z] testParseObject2[13: -2,147,483,648 - -2 GB/s](org.eclipse.tracecompass.common.core.tests.format.DataSpeedFormatTest)  Time elapsed: 0 s
16:17:09 [2020-07-24T20:17:09.244Z] testParseObject[14: 9,223,372,036,854,775,807 - 8388608 TB/s](org.eclipse.tracecompass.common.core.tests.format.DataSpeedFormatTest)  Time elapsed: 0 s
16:17:09 [2020-07-24T20:17:09.244Z] testFormatIllegalArgument[14: 9,223,372,036,854,775,807 - 8388608 TB/s](org.eclipse.tracecompass.common.core.tests.format.DataSpeedFormatTest)  Time elapsed: 0 s
16:17:09 [2020-07-24T20:17:09.244Z] testFormat[14: 9,223,372,036,854,775,807 - 8388608 TB/s](org.eclipse.tracecompass.common.core.tests.format.DataSpeedFormatTest)  Time elapsed: 0 s
16:17:09 [2020-07-24T20:17:09.244Z] testParseObject2[14: 9,223,372,036,854,775,807 - 8388608 TB/s](org.eclipse.tracecompass.common.core.tests.format.DataSpeedFormatTest)  Time elapsed: 0 s
16:17:09 [2020-07-24T20:17:09.244Z] testParseObject[15: 98,765,432.123 - 94.19 MB/s](org.eclipse.tracecompass.common.core.tests.format.DataSpeedFormatTest)  Time elapsed: 0 s
16:17:09 [2020-07-24T20:17:09.244Z] testFormatIllegalArgument[15: 98,765,432.123 - 94.19 MB/s](org.eclipse.tracecompass.common.core.tests.format.DataSpeedFormatTest)  Time elapsed: 0.001 s
16:17:09 [2020-07-24T20:17:09.244Z] testFormat[15: 98,765,432.123 - 94.19 MB/s](org.eclipse.tracecompass.common.core.tests.format.DataSpeedFormatTest)  Time elapsed: 0 s
16:17:09 [2020-07-24T20:17:09.244Z] testParseObject2[15: 98,765,432.123 - 94.19 MB/s](org.eclipse.tracecompass.common.core.tests.format.DataSpeedFormatTest)  Time elapsed: 0 s
16:17:09 [2020-07-24T20:17:09.244Z] testParseObject[16: -98,765,432.123 - -94.19 MB/s](org.eclipse.tracecompass.common.core.tests.format.DataSpeedFormatTest)  Time elapsed: 0 s
16:17:09 [2020-07-24T20:17:09.244Z] testFormatIllegalArgument[16: -98,765,432.123 - -94.19 MB/s](org.eclipse.tracecompass.common.core.tests.format.DataSpeedFormatTest)  Time elapsed: 0 s
16:17:09 [2020-07-24T20:17:09.244Z] testFormat[16: -98,765,432.123 - -94.19 MB/s](org.eclipse.tracecompass.common.core.tests.format.DataSpeedFormatTest)  Time elapsed: 0 s
16:17:09 [2020-07-24T20:17:09.244Z] testParseObject2[16: -98,765,432.123 - -94.19 MB/s](org.eclipse.tracecompass.common.core.tests.format.DataSpeedFormatTest)  Time elapsed: 0 s
16:17:09 [2020-07-24T20:17:09.244Z] testParseObject[17: 555,555,555,555 - 517.401 GB/s](org.eclipse.tracecompass.common.core.tests.format.DataSpeedFormatTest)  Time elapsed: 0 s
16:17:09 [2020-07-24T20:17:09.244Z] testFormatIllegalArgument[17: 555,555,555,555 - 517.401 GB/s](org.eclipse.tracecompass.common.core.tests.format.DataSpeedFormatTest)  Time elapsed: 0 s
16:17:09 [2020-07-24T20:17:09.244Z] testFormat[17: 555,555,555,555 - 517.401 GB/s](org.eclipse.tracecompass.common.core.tests.format.DataSpeedFormatTest)  Time elapsed: 0 s
16:17:09 [2020-07-24T20:17:09.244Z] testParseObject2[17: 555,555,555,555 - 517.401 GB/s](org.eclipse.tracecompass.common.core.tests.format.DataSpeedFormatTest)  Time elapsed: 0 s
16:17:09 [2020-07-24T20:17:09.244Z] testParseObject[18: 555,555,555,555,555 - 505.275 TB/s](org.eclipse.tracecompass.common.core.tests.format.DataSpeedFormatTest)  Time elapsed: 0 s
16:17:09 [2020-07-24T20:17:09.244Z] testFormatIllegalArgument[18: 555,555,555,555,555 - 505.275 TB/s](org.eclipse.tracecompass.common.core.tests.format.DataSpeedFormatTest)  Time elapsed: 0 s
16:17:09 [2020-07-24T20:17:09.244Z] testFormat[18: 555,555,555,555,555 - 505.275 TB/s](org.eclipse.tracecompass.common.core.tests.format.DataSpeedFormatTest)  Time elapsed: 0 s
16:17:09 [2020-07-24T20:17:09.244Z] testParseObject2[18: 555,555,555,555,555 - 505.275 TB/s](org.eclipse.tracecompass.common.core.tests.format.DataSpeedFormatTest)  Time elapsed: 0 s
16:17:09 [2020-07-24T20:17:09.244Z] testParseObject[19: null - 1234 TPotato](org.eclipse.tracecompass.common.core.tests.format.DataSpeedFormatTest)  Time elapsed: 0 s
16:17:09 [2020-07-24T20:17:09.244Z] testFormatIllegalArgument[19: null - 1234 TPotato](org.eclipse.tracecompass.common.core.tests.format.DataSpeedFormatTest)  Time elapsed: 0 s
16:17:09 [2020-07-24T20:17:09.244Z] testFormat[19: null - 1234 TPotato](org.eclipse.tracecompass.common.core.tests.format.DataSpeedFormatTest)  Time elapsed: 0 s
16:17:09 [2020-07-24T20:17:09.244Z] testParseObject2[19: null - 1234 TPotato](org.eclipse.tracecompass.common.core.tests.format.DataSpeedFormatTest)  Time elapsed: 0 s
16:17:09 [2020-07-24T20:17:09.244Z] testParseObject[20: null - .0001 MB/s](org.eclipse.tracecompass.common.core.tests.format.DataSpeedFormatTest)  Time elapsed: 0.001 s
16:17:09 [2020-07-24T20:17:09.244Z] testFormatIllegalArgument[20: null - .0001 MB/s](org.eclipse.tracecompass.common.core.tests.format.DataSpeedFormatTest)  Time elapsed: 0 s
16:17:09 [2020-07-24T20:17:09.244Z] testFormat[20: null - .0001 MB/s](org.eclipse.tracecompass.common.core.tests.format.DataSpeedFormatTest)  Time elapsed: 0 s
16:17:09 [2020-07-24T20:17:09.244Z] testParseObject2[20: null - .0001 MB/s](org.eclipse.tracecompass.common.core.tests.format.DataSpeedFormatTest)  Time elapsed: 0 s
16:17:09 [2020-07-24T20:17:09.244Z] testParseObject[21: null - 1KB/s](org.eclipse.tracecompass.common.core.tests.format.DataSpeedFormatTest)  Time elapsed: 0 s
16:17:09 [2020-07-24T20:17:09.244Z] testFormatIllegalArgument[21: null - 1KB/s](org.eclipse.tracecompass.common.core.tests.format.DataSpeedFormatTest)  Time elapsed: 0 s
16:17:09 [2020-07-24T20:17:09.244Z] testFormat[21: null - 1KB/s](org.eclipse.tracecompass.common.core.tests.format.DataSpeedFormatTest)  Time elapsed: 0 s
16:17:09 [2020-07-24T20:17:09.244Z] testParseObject2[21: null - 1KB/s](org.eclipse.tracecompass.common.core.tests.format.DataSpeedFormatTest)  Time elapsed: 0 s
16:17:09 [2020-07-24T20:17:09.244Z] testParseObject[22: null - 1KB/s   ](org.eclipse.tracecompass.common.core.tests.format.DataSpeedFormatTest)  Time elapsed: 0 s
16:17:09 [2020-07-24T20:17:09.244Z] testFormatIllegalArgument[22: null - 1KB/s   ](org.eclipse.tracecompass.common.core.tests.format.DataSpeedFormatTest)  Time elapsed: 0 s
16:17:09 [2020-07-24T20:17:09.244Z] testFormat[22: null - 1KB/s   ](org.eclipse.tracecompass.common.core.tests.format.DataSpeedFormatTest)  Time elapsed: 0 s
16:17:09 [2020-07-24T20:17:09.244Z] testParseObject2[22: null - 1KB/s   ](org.eclipse.tracecompass.common.core.tests.format.DataSpeedFormatTest)  Time elapsed: 0 s
16:17:09 [2020-07-24T20:17:09.244Z] testParseObject[23: null - 1KB/s  potato](org.eclipse.tracecompass.common.core.tests.format.DataSpeedFormatTest)  Time elapsed: 0 s
16:17:09 [2020-07-24T20:17:09.244Z] testFormatIllegalArgument[23: null - 1KB/s  potato](org.eclipse.tracecompass.common.core.tests.format.DataSpeedFormatTest)  Time elapsed: 0.001 s
16:17:09 [2020-07-24T20:17:09.244Z] testFormat[23: null - 1KB/s  potato](org.eclipse.tracecompass.common.core.tests.format.DataSpeedFormatTest)  Time elapsed: 0 s
16:17:09 [2020-07-24T20:17:09.244Z] testParseObject2[23: null - 1KB/s  potato](org.eclipse.tracecompass.common.core.tests.format.DataSpeedFormatTest)  Time elapsed: 0 s
16:17:09 [2020-07-24T20:17:09.245Z] testParseObject[24: null - 1 KB](org.eclipse.tracecompass.common.core.tests.format.DataSpeedFormatTest)  Time elapsed: 0 s
16:17:09 [2020-07-24T20:17:09.245Z] testFormatIllegalArgument[24: null - 1 KB](org.eclipse.tracecompass.common.core.tests.format.DataSpeedFormatTest)  Time elapsed: 0 s
16:17:09 [2020-07-24T20:17:09.245Z] testFormat[24: null - 1 KB](org.eclipse.tracecompass.common.core.tests.format.DataSpeedFormatTest)  Time elapsed: 0 s
16:17:09 [2020-07-24T20:17:09.245Z] testParseObject2[24: null - 1 KB](org.eclipse.tracecompass.common.core.tests.format.DataSpeedFormatTest)  Time elapsed: 0 s
16:17:09 [2020-07-24T20:17:09.245Z] Running org.eclipse.tracecompass.common.core.tests.format.DecimalWithUnitPrefixFormatTest
16:17:09 [2020-07-24T20:17:09.245Z] Tests run: 152, Failures: 0, Errors: 0, Skipped: 0, Time elapsed: 0.015 s - in org.eclipse.tracecompass.common.core.tests.format.DecimalWithUnitPrefixFormatTest
16:17:09 [2020-07-24T20:17:09.245Z] testParseObject[0: 0 - 0 rabbit](org.eclipse.tracecompass.common.core.tests.format.DecimalWithUnitPrefixFormatTest)  Time elapsed: 0 s
16:17:09 [2020-07-24T20:17:09.245Z] testFormatIllegalArgument[0: 0 - 0 rabbit](org.eclipse.tracecompass.common.core.tests.format.DecimalWithUnitPrefixFormatTest)  Time elapsed: 0 s
16:17:09 [2020-07-24T20:17:09.245Z] testFormat[0: 0 - 0 rabbit](org.eclipse.tracecompass.common.core.tests.format.DecimalWithUnitPrefixFormatTest)  Time elapsed: 0 s
16:17:09 [2020-07-24T20:17:09.245Z] testParseObject2[0: 0 - 0 rabbit](org.eclipse.tracecompass.common.core.tests.format.DecimalWithUnitPrefixFormatTest)  Time elapsed: 0 s
16:17:09 [2020-07-24T20:17:09.245Z] testParseObject[1: 3 - 3 rabbit](org.eclipse.tracecompass.common.core.tests.format.DecimalWithUnitPrefixFormatTest)  Time elapsed: 0 s
16:17:09 [2020-07-24T20:17:09.245Z] testFormatIllegalArgument[1: 3 - 3 rabbit](org.eclipse.tracecompass.common.core.tests.format.DecimalWithUnitPrefixFormatTest)  Time elapsed: 0 s
16:17:09 [2020-07-24T20:17:09.245Z] testFormat[1: 3 - 3 rabbit](org.eclipse.tracecompass.common.core.tests.format.DecimalWithUnitPrefixFormatTest)  Time elapsed: 0 s
16:17:09 [2020-07-24T20:17:09.245Z] testParseObject2[1: 3 - 3 rabbit](org.eclipse.tracecompass.common.core.tests.format.DecimalWithUnitPrefixFormatTest)  Time elapsed: 0 s
16:17:09 [2020-07-24T20:17:09.245Z] testParseObject[2: 975 - 975 rabbit](org.eclipse.tracecompass.common.core.tests.format.DecimalWithUnitPrefixFormatTest)  Time elapsed: 0 s
16:17:09 [2020-07-24T20:17:09.245Z] testFormatIllegalArgument[2: 975 - 975 rabbit](org.eclipse.tracecompass.common.core.tests.format.DecimalWithUnitPrefixFormatTest)  Time elapsed: 0 s
16:17:09 [2020-07-24T20:17:09.245Z] testFormat[2: 975 - 975 rabbit](org.eclipse.tracecompass.common.core.tests.format.DecimalWithUnitPrefixFormatTest)  Time elapsed: 0 s
16:17:09 [2020-07-24T20:17:09.245Z] testParseObject2[2: 975 - 975 rabbit](org.eclipse.tracecompass.common.core.tests.format.DecimalWithUnitPrefixFormatTest)  Time elapsed: 0 s
16:17:09 [2020-07-24T20:17:09.245Z] testParseObject[3: 1,000 - 1 krabbit](org.eclipse.tracecompass.common.core.tests.format.DecimalWithUnitPrefixFormatTest)  Time elapsed: 0 s
16:17:09 [2020-07-24T20:17:09.245Z] testFormatIllegalArgument[3: 1,000 - 1 krabbit](org.eclipse.tracecompass.common.core.tests.format.DecimalWithUnitPrefixFormatTest)  Time elapsed: 0 s
16:17:09 [2020-07-24T20:17:09.245Z] testFormat[3: 1,000 - 1 krabbit](org.eclipse.tracecompass.common.core.tests.format.DecimalWithUnitPrefixFormatTest)  Time elapsed: 0 s
16:17:09 [2020-07-24T20:17:09.245Z] testParseObject2[3: 1,000 - 1 krabbit](org.eclipse.tracecompass.common.core.tests.format.DecimalWithUnitPrefixFormatTest)  Time elapsed: 0.001 s
16:17:09 [2020-07-24T20:17:09.245Z] testParseObject[4: 1,000,000 - 1 Mrabbit](org.eclipse.tracecompass.common.core.tests.format.DecimalWithUnitPrefixFormatTest)  Time elapsed: 0 s
16:17:09 [2020-07-24T20:17:09.245Z] testFormatIllegalArgument[4: 1,000,000 - 1 Mrabbit](org.eclipse.tracecompass.common.core.tests.format.DecimalWithUnitPrefixFormatTest)  Time elapsed: 0 s
16:17:09 [2020-07-24T20:17:09.245Z] testFormat[4: 1,000,000 - 1 Mrabbit](org.eclipse.tracecompass.common.core.tests.format.DecimalWithUnitPrefixFormatTest)  Time elapsed: 0 s
16:17:09 [2020-07-24T20:17:09.245Z] testParseObject2[4: 1,000,000 - 1 Mrabbit](org.eclipse.tracecompass.common.core.tests.format.DecimalWithUnitPrefixFormatTest)  Time elapsed: 0 s
16:17:09 [2020-07-24T20:17:09.245Z] testParseObject[5: 1,000,000,000 - 1 Grabbit](org.eclipse.tracecompass.common.core.tests.format.DecimalWithUnitPrefixFormatTest)  Time elapsed: 0 s
16:17:09 [2020-07-24T20:17:09.245Z] testFormatIllegalArgument[5: 1,000,000,000 - 1 Grabbit](org.eclipse.tracecompass.common.core.tests.format.DecimalWithUnitPrefixFormatTest)  Time elapsed: 0 s
16:17:09 [2020-07-24T20:17:09.245Z] testFormat[5: 1,000,000,000 - 1 Grabbit](org.eclipse.tracecompass.common.core.tests.format.DecimalWithUnitPrefixFormatTest)  Time elapsed: 0 s
16:17:09 [2020-07-24T20:17:09.245Z] testParseObject2[5: 1,000,000,000 - 1 Grabbit](org.eclipse.tracecompass.common.core.tests.format.DecimalWithUnitPrefixFormatTest)  Time elapsed: 0 s
16:17:09 [2020-07-24T20:17:09.245Z] testParseObject[6: 1,000,000,000,000 - 1 Trabbit](org.eclipse.tracecompass.common.core.tests.format.DecimalWithUnitPrefixFormatTest)  Time elapsed: 0 s
16:17:09 [2020-07-24T20:17:09.245Z] testFormatIllegalArgument[6: 1,000,000,000,000 - 1 Trabbit](org.eclipse.tracecompass.common.core.tests.format.DecimalWithUnitPrefixFormatTest)  Time elapsed: 0 s
16:17:09 [2020-07-24T20:17:09.245Z] testFormat[6: 1,000,000,000,000 - 1 Trabbit](org.eclipse.tracecompass.common.core.tests.format.DecimalWithUnitPrefixFormatTest)  Time elapsed: 0 s
16:17:09 [2020-07-24T20:17:09.245Z] testParseObject2[6: 1,000,000,000,000 - 1 Trabbit](org.eclipse.tracecompass.common.core.tests.format.DecimalWithUnitPrefixFormatTest)  Time elapsed: 0.001 s
16:17:09 [2020-07-24T20:17:09.245Z] testParseObject[7: 4,000 - 4 krabbit](org.eclipse.tracecompass.common.core.tests.format.DecimalWithUnitPrefixFormatTest)  Time elapsed: 0 s
16:17:09 [2020-07-24T20:17:09.245Z] testFormatIllegalArgument[7: 4,000 - 4 krabbit](org.eclipse.tracecompass.common.core.tests.format.DecimalWithUnitPrefixFormatTest)  Time elapsed: 0 s
16:17:09 [2020-07-24T20:17:09.245Z] testFormat[7: 4,000 - 4 krabbit](org.eclipse.tracecompass.common.core.tests.format.DecimalWithUnitPrefixFormatTest)  Time elapsed: 0 s
16:17:09 [2020-07-24T20:17:09.245Z] testParseObject2[7: 4,000 - 4 krabbit](org.eclipse.tracecompass.common.core.tests.format.DecimalWithUnitPrefixFormatTest)  Time elapsed: 0 s
16:17:09 [2020-07-24T20:17:09.245Z] testParseObject[8: -4,000 - -4 krabbit](org.eclipse.tracecompass.common.core.tests.format.DecimalWithUnitPrefixFormatTest)  Time elapsed: 0 s
16:17:09 [2020-07-24T20:17:09.245Z] testFormatIllegalArgument[8: -4,000 - -4 krabbit](org.eclipse.tracecompass.common.core.tests.format.DecimalWithUnitPrefixFormatTest)  Time elapsed: 0 s
16:17:09 [2020-07-24T20:17:09.245Z] testFormat[8: -4,000 - -4 krabbit](org.eclipse.tracecompass.common.core.tests.format.DecimalWithUnitPrefixFormatTest)  Time elapsed: 0 s
16:17:09 [2020-07-24T20:17:09.245Z] testParseObject2[8: -4,000 - -4 krabbit](org.eclipse.tracecompass.common.core.tests.format.DecimalWithUnitPrefixFormatTest)  Time elapsed: 0 s
16:17:09 [2020-07-24T20:17:09.245Z] testParseObject[9: 4,000 - 4 krabbit](org.eclipse.tracecompass.common.core.tests.format.DecimalWithUnitPrefixFormatTest)  Time elapsed: 0 s
16:17:09 [2020-07-24T20:17:09.245Z] testFormatIllegalArgument[9: 4,000 - 4 krabbit](org.eclipse.tracecompass.common.core.tests.format.DecimalWithUnitPrefixFormatTest)  Time elapsed: 0 s
16:17:09 [2020-07-24T20:17:09.245Z] testFormat[9: 4,000 - 4 krabbit](org.eclipse.tracecompass.common.core.tests.format.DecimalWithUnitPrefixFormatTest)  Time elapsed: 0 s
16:17:09 [2020-07-24T20:17:09.245Z] testParseObject2[9: 4,000 - 4 krabbit](org.eclipse.tracecompass.common.core.tests.format.DecimalWithUnitPrefixFormatTest)  Time elapsed: 0 s
16:17:09 [2020-07-24T20:17:09.245Z] testParseObject[10: 4,000 - 4 krabbit](org.eclipse.tracecompass.common.core.tests.format.DecimalWithUnitPrefixFormatTest)  Time elapsed: 0 s
16:17:09 [2020-07-24T20:17:09.245Z] testFormatIllegalArgument[10: 4,000 - 4 krabbit](org.eclipse.tracecompass.common.core.tests.format.DecimalWithUnitPrefixFormatTest)  Time elapsed: 0 s
16:17:09 [2020-07-24T20:17:09.245Z] testFormat[10: 4,000 - 4 krabbit](org.eclipse.tracecompass.common.core.tests.format.DecimalWithUnitPrefixFormatTest)  Time elapsed: 0.001 s
16:17:09 [2020-07-24T20:17:09.245Z] testParseObject2[10: 4,000 - 4 krabbit](org.eclipse.tracecompass.common.core.tests.format.DecimalWithUnitPrefixFormatTest)  Time elapsed: 0 s
16:17:09 [2020-07-24T20:17:09.245Z] testParseObject[11: 12,345,678 - 12.346 Mrabbit](org.eclipse.tracecompass.common.core.tests.format.DecimalWithUnitPrefixFormatTest)  Time elapsed: 0 s
16:17:09 [2020-07-24T20:17:09.245Z] testFormatIllegalArgument[11: 12,345,678 - 12.346 Mrabbit](org.eclipse.tracecompass.common.core.tests.format.DecimalWithUnitPrefixFormatTest)  Time elapsed: 0 s
16:17:09 [2020-07-24T20:17:09.245Z] testFormat[11: 12,345,678 - 12.346 Mrabbit](org.eclipse.tracecompass.common.core.tests.format.DecimalWithUnitPrefixFormatTest)  Time elapsed: 0 s
16:17:09 [2020-07-24T20:17:09.245Z] testParseObject2[11: 12,345,678 - 12.346 Mrabbit](org.eclipse.tracecompass.common.core.tests.format.DecimalWithUnitPrefixFormatTest)  Time elapsed: 0 s
16:17:09 [2020-07-24T20:17:09.245Z] testParseObject[12: 2,147,483,647 - 2.147 Grabbit](org.eclipse.tracecompass.common.core.tests.format.DecimalWithUnitPrefixFormatTest)  Time elapsed: 0 s
16:17:09 [2020-07-24T20:17:09.245Z] testFormatIllegalArgument[12: 2,147,483,647 - 2.147 Grabbit](org.eclipse.tracecompass.common.core.tests.format.DecimalWithUnitPrefixFormatTest)  Time elapsed: 0 s
16:17:09 [2020-07-24T20:17:09.245Z] testFormat[12: 2,147,483,647 - 2.147 Grabbit](org.eclipse.tracecompass.common.core.tests.format.DecimalWithUnitPrefixFormatTest)  Time elapsed: 0 s
16:17:09 [2020-07-24T20:17:09.245Z] testParseObject2[12: 2,147,483,647 - 2.147 Grabbit](org.eclipse.tracecompass.common.core.tests.format.DecimalWithUnitPrefixFormatTest)  Time elapsed: 0 s
16:17:09 [2020-07-24T20:17:09.245Z] testParseObject[13: -2,147,483,648 - -2.147 Grabbit](org.eclipse.tracecompass.common.core.tests.format.DecimalWithUnitPrefixFormatTest)  Time elapsed: 0 s
16:17:09 [2020-07-24T20:17:09.245Z] testFormatIllegalArgument[13: -2,147,483,648 - -2.147 Grabbit](org.eclipse.tracecompass.common.core.tests.format.DecimalWithUnitPrefixFormatTest)  Time elapsed: 0 s
16:17:09 [2020-07-24T20:17:09.245Z] testFormat[13: -2,147,483,648 - -2.147 Grabbit](org.eclipse.tracecompass.common.core.tests.format.DecimalWithUnitPrefixFormatTest)  Time elapsed: 0.001 s
16:17:09 [2020-07-24T20:17:09.245Z] testParseObject2[13: -2,147,483,648 - -2.147 Grabbit](org.eclipse.tracecompass.common.core.tests.format.DecimalWithUnitPrefixFormatTest)  Time elapsed: 0 s
16:17:09 [2020-07-24T20:17:09.245Z] testParseObject[14: 9,223,372,036,854,775,807 - 9223372.037 Trabbit](org.eclipse.tracecompass.common.core.tests.format.DecimalWithUnitPrefixFormatTest)  Time elapsed: 0 s
16:17:09 [2020-07-24T20:17:09.245Z] testFormatIllegalArgument[14: 9,223,372,036,854,775,807 - 9223372.037 Trabbit](org.eclipse.tracecompass.common.core.tests.format.DecimalWithUnitPrefixFormatTest)  Time elapsed: 0 s
16:17:09 [2020-07-24T20:17:09.245Z] testFormat[14: 9,223,372,036,854,775,807 - 9223372.037 Trabbit](org.eclipse.tracecompass.common.core.tests.format.DecimalWithUnitPrefixFormatTest)  Time elapsed: 0 s
16:17:09 [2020-07-24T20:17:09.245Z] testParseObject2[14: 9,223,372,036,854,775,807 - 9223372.037 Trabbit](org.eclipse.tracecompass.common.core.tests.format.DecimalWithUnitPrefixFormatTest)  Time elapsed: 0 s
16:17:09 [2020-07-24T20:17:09.245Z] testParseObject[15: 98,765,432.123 - 98.765 Mrabbit](org.eclipse.tracecompass.common.core.tests.format.DecimalWithUnitPrefixFormatTest)  Time elapsed: 0 s
16:17:09 [2020-07-24T20:17:09.245Z] testFormatIllegalArgument[15: 98,765,432.123 - 98.765 Mrabbit](org.eclipse.tracecompass.common.core.tests.format.DecimalWithUnitPrefixFormatTest)  Time elapsed: 0 s
16:17:09 [2020-07-24T20:17:09.245Z] testFormat[15: 98,765,432.123 - 98.765 Mrabbit](org.eclipse.tracecompass.common.core.tests.format.DecimalWithUnitPrefixFormatTest)  Time elapsed: 0 s
16:17:09 [2020-07-24T20:17:09.245Z] testParseObject2[15: 98,765,432.123 - 98.765 Mrabbit](org.eclipse.tracecompass.common.core.tests.format.DecimalWithUnitPrefixFormatTest)  Time elapsed: 0 s
16:17:09 [2020-07-24T20:17:09.245Z] testParseObject[16: -98,765,432.123 - -98.765 Mrabbit](org.eclipse.tracecompass.common.core.tests.format.DecimalWithUnitPrefixFormatTest)  Time elapsed: 0.001 s
16:17:09 [2020-07-24T20:17:09.245Z] testFormatIllegalArgument[16: -98,765,432.123 - -98.765 Mrabbit](org.eclipse.tracecompass.common.core.tests.format.DecimalWithUnitPrefixFormatTest)  Time elapsed: 0 s
16:17:09 [2020-07-24T20:17:09.245Z] testFormat[16: -98,765,432.123 - -98.765 Mrabbit](org.eclipse.tracecompass.common.core.tests.format.DecimalWithUnitPrefixFormatTest)  Time elapsed: 0 s
16:17:09 [2020-07-24T20:17:09.245Z] testParseObject2[16: -98,765,432.123 - -98.765 Mrabbit](org.eclipse.tracecompass.common.core.tests.format.DecimalWithUnitPrefixFormatTest)  Time elapsed: 0 s
16:17:09 [2020-07-24T20:17:09.245Z] testParseObject[17: 555,555,555,555 - 555.556 Grabbit](org.eclipse.tracecompass.common.core.tests.format.DecimalWithUnitPrefixFormatTest)  Time elapsed: 0 s
16:17:09 [2020-07-24T20:17:09.245Z] testFormatIllegalArgument[17: 555,555,555,555 - 555.556 Grabbit](org.eclipse.tracecompass.common.core.tests.format.DecimalWithUnitPrefixFormatTest)  Time elapsed: 0 s
16:17:09 [2020-07-24T20:17:09.245Z] testFormat[17: 555,555,555,555 - 555.556 Grabbit](org.eclipse.tracecompass.common.core.tests.format.DecimalWithUnitPrefixFormatTest)  Time elapsed: 0 s
16:17:09 [2020-07-24T20:17:09.245Z] testParseObject2[17: 555,555,555,555 - 555.556 Grabbit](org.eclipse.tracecompass.common.core.tests.format.DecimalWithUnitPrefixFormatTest)  Time elapsed: 0 s
16:17:09 [2020-07-24T20:17:09.245Z] testParseObject[18: 555,555,555,555,555 - 555.556 Trabbit](org.eclipse.tracecompass.common.core.tests.format.DecimalWithUnitPrefixFormatTest)  Time elapsed: 0 s
16:17:09 [2020-07-24T20:17:09.245Z] testFormatIllegalArgument[18: 555,555,555,555,555 - 555.556 Trabbit](org.eclipse.tracecompass.common.core.tests.format.DecimalWithUnitPrefixFormatTest)  Time elapsed: 0 s
16:17:09 [2020-07-24T20:17:09.245Z] testFormat[18: 555,555,555,555,555 - 555.556 Trabbit](org.eclipse.tracecompass.common.core.tests.format.DecimalWithUnitPrefixFormatTest)  Time elapsed: 0 s
16:17:09 [2020-07-24T20:17:09.245Z] testParseObject2[18: 555,555,555,555,555 - 555.556 Trabbit](org.eclipse.tracecompass.common.core.tests.format.DecimalWithUnitPrefixFormatTest)  Time elapsed: 0.001 s
16:17:09 [2020-07-24T20:17:09.245Z] testParseObject[19: 100,100,000 - 100.1 Mrabbit](org.eclipse.tracecompass.common.core.tests.format.DecimalWithUnitPrefixFormatTest)  Time elapsed: 0 s
16:17:09 [2020-07-24T20:17:09.245Z] testFormatIllegalArgument[19: 100,100,000 - 100.1 Mrabbit](org.eclipse.tracecompass.common.core.tests.format.DecimalWithUnitPrefixFormatTest)  Time elapsed: 0 s
16:17:09 [2020-07-24T20:17:09.245Z] testFormat[19: 100,100,000 - 100.1 Mrabbit](org.eclipse.tracecompass.common.core.tests.format.DecimalWithUnitPrefixFormatTest)  Time elapsed: 0 s
16:17:09 [2020-07-24T20:17:09.245Z] testParseObject2[19: 100,100,000 - 100.1 Mrabbit](org.eclipse.tracecompass.common.core.tests.format.DecimalWithUnitPrefixFormatTest)  Time elapsed: 0 s
16:17:09 [2020-07-24T20:17:09.245Z] testParseObject[20: 0.1 - 100 mrabbit](org.eclipse.tracecompass.common.core.tests.format.DecimalWithUnitPrefixFormatTest)  Time elapsed: 0 s
16:17:09 [2020-07-24T20:17:09.245Z] testFormatIllegalArgument[20: 0.1 - 100 mrabbit](org.eclipse.tracecompass.common.core.tests.format.DecimalWithUnitPrefixFormatTest)  Time elapsed: 0 s
16:17:09 [2020-07-24T20:17:09.246Z] testFormat[20: 0.1 - 100 mrabbit](org.eclipse.tracecompass.common.core.tests.format.DecimalWithUnitPrefixFormatTest)  Time elapsed: 0 s
16:17:09 [2020-07-24T20:17:09.246Z] testParseObject2[20: 0.1 - 100 mrabbit](org.eclipse.tracecompass.common.core.tests.format.DecimalWithUnitPrefixFormatTest)  Time elapsed: 0 s
16:17:09 [2020-07-24T20:17:09.246Z] testParseObject[21: 0.001 - 1 mrabbit](org.eclipse.tracecompass.common.core.tests.format.DecimalWithUnitPrefixFormatTest)  Time elapsed: 0 s
16:17:09 [2020-07-24T20:17:09.246Z] testFormatIllegalArgument[21: 0.001 - 1 mrabbit](org.eclipse.tracecompass.common.core.tests.format.DecimalWithUnitPrefixFormatTest)  Time elapsed: 0 s
16:17:09 [2020-07-24T20:17:09.246Z] testFormat[21: 0.001 - 1 mrabbit](org.eclipse.tracecompass.common.core.tests.format.DecimalWithUnitPrefixFormatTest)  Time elapsed: 0 s
16:17:09 [2020-07-24T20:17:09.246Z] testParseObject2[21: 0.001 - 1 mrabbit](org.eclipse.tracecompass.common.core.tests.format.DecimalWithUnitPrefixFormatTest)  Time elapsed: 0 s
16:17:09 [2020-07-24T20:17:09.246Z] testParseObject[22: 0 - 1 µrabbit](org.eclipse.tracecompass.common.core.tests.format.DecimalWithUnitPrefixFormatTest)  Time elapsed: 0 s
16:17:09 [2020-07-24T20:17:09.246Z] testFormatIllegalArgument[22: 0 - 1 µrabbit](org.eclipse.tracecompass.common.core.tests.format.DecimalWithUnitPrefixFormatTest)  Time elapsed: 0 s
16:17:09 [2020-07-24T20:17:09.246Z] testFormat[22: 0 - 1 µrabbit](org.eclipse.tracecompass.common.core.tests.format.DecimalWithUnitPrefixFormatTest)  Time elapsed: 0 s
16:17:09 [2020-07-24T20:17:09.246Z] testParseObject2[22: 0 - 1 µrabbit](org.eclipse.tracecompass.common.core.tests.format.DecimalWithUnitPrefixFormatTest)  Time elapsed: 0.001 s
16:17:09 [2020-07-24T20:17:09.246Z] testParseObject[23: 0 - 1 nrabbit](org.eclipse.tracecompass.common.core.tests.format.DecimalWithUnitPrefixFormatTest)  Time elapsed: 0 s
16:17:09 [2020-07-24T20:17:09.246Z] testFormatIllegalArgument[23: 0 - 1 nrabbit](org.eclipse.tracecompass.common.core.tests.format.DecimalWithUnitPrefixFormatTest)  Time elapsed: 0 s
16:17:09 [2020-07-24T20:17:09.246Z] testFormat[23: 0 - 1 nrabbit](org.eclipse.tracecompass.common.core.tests.format.DecimalWithUnitPrefixFormatTest)  Time elapsed: 0 s
16:17:09 [2020-07-24T20:17:09.246Z] testParseObject2[23: 0 - 1 nrabbit](org.eclipse.tracecompass.common.core.tests.format.DecimalWithUnitPrefixFormatTest)  Time elapsed: 0 s
16:17:09 [2020-07-24T20:17:09.246Z] testParseObject[24: 0 - 1 prabbit](org.eclipse.tracecompass.common.core.tests.format.DecimalWithUnitPrefixFormatTest)  Time elapsed: 0 s
16:17:09 [2020-07-24T20:17:09.246Z] testFormatIllegalArgument[24: 0 - 1 prabbit](org.eclipse.tracecompass.common.core.tests.format.DecimalWithUnitPrefixFormatTest)  Time elapsed: 0 s
16:17:09 [2020-07-24T20:17:09.246Z] testFormat[24: 0 - 1 prabbit](org.eclipse.tracecompass.common.core.tests.format.DecimalWithUnitPrefixFormatTest)  Time elapsed: 0 s
16:17:09 [2020-07-24T20:17:09.246Z] testParseObject2[24: 0 - 1 prabbit](org.eclipse.tracecompass.common.core.tests.format.DecimalWithUnitPrefixFormatTest)  Time elapsed: 0 s
16:17:09 [2020-07-24T20:17:09.246Z] testParseObject[25: -0.04 - -40 mrabbit](org.eclipse.tracecompass.common.core.tests.format.DecimalWithUnitPrefixFormatTest)  Time elapsed: 0 s
16:17:09 [2020-07-24T20:17:09.246Z] testFormatIllegalArgument[25: -0.04 - -40 mrabbit](org.eclipse.tracecompass.common.core.tests.format.DecimalWithUnitPrefixFormatTest)  Time elapsed: 0 s
16:17:09 [2020-07-24T20:17:09.246Z] testFormat[25: -0.04 - -40 mrabbit](org.eclipse.tracecompass.common.core.tests.format.DecimalWithUnitPrefixFormatTest)  Time elapsed: 0 s
16:17:09 [2020-07-24T20:17:09.246Z] testParseObject2[25: -0.04 - -40 mrabbit](org.eclipse.tracecompass.common.core.tests.format.DecimalWithUnitPrefixFormatTest)  Time elapsed: 0 s
16:17:09 [2020-07-24T20:17:09.246Z] testParseObject[26: 0.002 - 2 mrabbit](org.eclipse.tracecompass.common.core.tests.format.DecimalWithUnitPrefixFormatTest)  Time elapsed: 0 s
16:17:09 [2020-07-24T20:17:09.246Z] testFormatIllegalArgument[26: 0.002 - 2 mrabbit](org.eclipse.tracecompass.common.core.tests.format.DecimalWithUnitPrefixFormatTest)  Time elapsed: 0 s
16:17:09 [2020-07-24T20:17:09.246Z] testFormat[26: 0.002 - 2 mrabbit](org.eclipse.tracecompass.common.core.tests.format.DecimalWithUnitPrefixFormatTest)  Time elapsed: 0 s
16:17:09 [2020-07-24T20:17:09.246Z] testParseObject2[26: 0.002 - 2 mrabbit](org.eclipse.tracecompass.common.core.tests.format.DecimalWithUnitPrefixFormatTest)  Time elapsed: 0.001 s
16:17:09 [2020-07-24T20:17:09.246Z] testParseObject[27: 0.056 - 55.5 mrabbit](org.eclipse.tracecompass.common.core.tests.format.DecimalWithUnitPrefixFormatTest)  Time elapsed: 0 s
16:17:09 [2020-07-24T20:17:09.246Z] testFormatIllegalArgument[27: 0.056 - 55.5 mrabbit](org.eclipse.tracecompass.common.core.tests.format.DecimalWithUnitPrefixFormatTest)  Time elapsed: 0 s
16:17:09 [2020-07-24T20:17:09.246Z] testFormat[27: 0.056 - 55.5 mrabbit](org.eclipse.tracecompass.common.core.tests.format.DecimalWithUnitPrefixFormatTest)  Time elapsed: 0 s
16:17:09 [2020-07-24T20:17:09.246Z] testParseObject2[27: 0.056 - 55.5 mrabbit](org.eclipse.tracecompass.common.core.tests.format.DecimalWithUnitPrefixFormatTest)  Time elapsed: 0 s
16:17:09 [2020-07-24T20:17:09.246Z] testParseObject[28: 0 - 492.837 µrabbit](org.eclipse.tracecompass.common.core.tests.format.DecimalWithUnitPrefixFormatTest)  Time elapsed: 0 s
16:17:09 [2020-07-24T20:17:09.246Z] testFormatIllegalArgument[28: 0 - 492.837 µrabbit](org.eclipse.tracecompass.common.core.tests.format.DecimalWithUnitPrefixFormatTest)  Time elapsed: 0 s
16:17:09 [2020-07-24T20:17:09.246Z] testFormat[28: 0 - 492.837 µrabbit](org.eclipse.tracecompass.common.core.tests.format.DecimalWithUnitPrefixFormatTest)  Time elapsed: 0 s
16:17:09 [2020-07-24T20:17:09.246Z] testParseObject2[28: 0 - 492.837 µrabbit](org.eclipse.tracecompass.common.core.tests.format.DecimalWithUnitPrefixFormatTest)  Time elapsed: 0 s
16:17:09 [2020-07-24T20:17:09.246Z] testParseObject[29: 0 - 251 nrabbit](org.eclipse.tracecompass.common.core.tests.format.DecimalWithUnitPrefixFormatTest)  Time elapsed: 0 s
16:17:09 [2020-07-24T20:17:09.246Z] testFormatIllegalArgument[29: 0 - 251 nrabbit](org.eclipse.tracecompass.common.core.tests.format.DecimalWithUnitPrefixFormatTest)  Time elapsed: 0 s
16:17:09 [2020-07-24T20:17:09.246Z] testFormat[29: 0 - 251 nrabbit](org.eclipse.tracecompass.common.core.tests.format.DecimalWithUnitPrefixFormatTest)  Time elapsed: 0 s
16:17:09 [2020-07-24T20:17:09.246Z] testParseObject2[29: 0 - 251 nrabbit](org.eclipse.tracecompass.common.core.tests.format.DecimalWithUnitPrefixFormatTest)  Time elapsed: 0 s
16:17:09 [2020-07-24T20:17:09.246Z] testParseObject[30: 0 - 43 prabbit](org.eclipse.tracecompass.common.core.tests.format.DecimalWithUnitPrefixFormatTest)  Time elapsed: 0 s
16:17:09 [2020-07-24T20:17:09.246Z] testFormatIllegalArgument[30: 0 - 43 prabbit](org.eclipse.tracecompass.common.core.tests.format.DecimalWithUnitPrefixFormatTest)  Time elapsed: 0 s
16:17:09 [2020-07-24T20:17:09.246Z] testFormat[30: 0 - 43 prabbit](org.eclipse.tracecompass.common.core.tests.format.DecimalWithUnitPrefixFormatTest)  Time elapsed: 0 s
16:17:09 [2020-07-24T20:17:09.246Z] testParseObject2[30: 0 - 43 prabbit](org.eclipse.tracecompass.common.core.tests.format.DecimalWithUnitPrefixFormatTest)  Time elapsed: 0 s
16:17:09 [2020-07-24T20:17:09.246Z] testParseObject[31: 0 - 45.643 nrabbit](org.eclipse.tracecompass.common.core.tests.format.DecimalWithUnitPrefixFormatTest)  Time elapsed: 0 s
16:17:09 [2020-07-24T20:17:09.246Z] testFormatIllegalArgument[31: 0 - 45.643 nrabbit](org.eclipse.tracecompass.common.core.tests.format.DecimalWithUnitPrefixFormatTest)  Time elapsed: 0 s
16:17:09 [2020-07-24T20:17:09.246Z] testFormat[31: 0 - 45.643 nrabbit](org.eclipse.tracecompass.common.core.tests.format.DecimalWithUnitPrefixFormatTest)  Time elapsed: 0 s
16:17:09 [2020-07-24T20:17:09.246Z] testParseObject2[31: 0 - 45.643 nrabbit](org.eclipse.tracecompass.common.core.tests.format.DecimalWithUnitPrefixFormatTest)  Time elapsed: 0 s
16:17:09 [2020-07-24T20:17:09.246Z] testParseObject[32: null - 1234 TPotato](org.eclipse.tracecompass.common.core.tests.format.DecimalWithUnitPrefixFormatTest)  Time elapsed: 0 s
16:17:09 [2020-07-24T20:17:09.246Z] testFormatIllegalArgument[32: null - 1234 TPotato](org.eclipse.tracecompass.common.core.tests.format.DecimalWithUnitPrefixFormatTest)  Time elapsed: 0 s
16:17:09 [2020-07-24T20:17:09.246Z] testFormat[32: null - 1234 TPotato](org.eclipse.tracecompass.common.core.tests.format.DecimalWithUnitPrefixFormatTest)  Time elapsed: 0 s
16:17:09 [2020-07-24T20:17:09.246Z] testParseObject2[32: null - 1234 TPotato](org.eclipse.tracecompass.common.core.tests.format.DecimalWithUnitPrefixFormatTest)  Time elapsed: 0 s
16:17:09 [2020-07-24T20:17:09.246Z] testParseObject[33: null - .0001 Mrabbit](org.eclipse.tracecompass.common.core.tests.format.DecimalWithUnitPrefixFormatTest)  Time elapsed: 0 s
16:17:09 [2020-07-24T20:17:09.246Z] testFormatIllegalArgument[33: null - .0001 Mrabbit](org.eclipse.tracecompass.common.core.tests.format.DecimalWithUnitPrefixFormatTest)  Time elapsed: 0 s
16:17:09 [2020-07-24T20:17:09.246Z] testFormat[33: null - .0001 Mrabbit](org.eclipse.tracecompass.common.core.tests.format.DecimalWithUnitPrefixFormatTest)  Time elapsed: 0 s
16:17:09 [2020-07-24T20:17:09.246Z] testParseObject2[33: null - .0001 Mrabbit](org.eclipse.tracecompass.common.core.tests.format.DecimalWithUnitPrefixFormatTest)  Time elapsed: 0 s
16:17:09 [2020-07-24T20:17:09.246Z] testParseObject[34: null - 1krabbit](org.eclipse.tracecompass.common.core.tests.format.DecimalWithUnitPrefixFormatTest)  Time elapsed: 0 s
16:17:09 [2020-07-24T20:17:09.246Z] testFormatIllegalArgument[34: null - 1krabbit](org.eclipse.tracecompass.common.core.tests.format.DecimalWithUnitPrefixFormatTest)  Time elapsed: 0 s
16:17:09 [2020-07-24T20:17:09.246Z] testFormat[34: null - 1krabbit](org.eclipse.tracecompass.common.core.tests.format.DecimalWithUnitPrefixFormatTest)  Time elapsed: 0 s
16:17:09 [2020-07-24T20:17:09.246Z] testParseObject2[34: null - 1krabbit](org.eclipse.tracecompass.common.core.tests.format.DecimalWithUnitPrefixFormatTest)  Time elapsed: 0.001 s
16:17:09 [2020-07-24T20:17:09.246Z] testParseObject[35: null - 1krabbit   ](org.eclipse.tracecompass.common.core.tests.format.DecimalWithUnitPrefixFormatTest)  Time elapsed: 0 s
16:17:09 [2020-07-24T20:17:09.246Z] testFormatIllegalArgument[35: null - 1krabbit   ](org.eclipse.tracecompass.common.core.tests.format.DecimalWithUnitPrefixFormatTest)  Time elapsed: 0 s
16:17:09 [2020-07-24T20:17:09.246Z] testFormat[35: null - 1krabbit   ](org.eclipse.tracecompass.common.core.tests.format.DecimalWithUnitPrefixFormatTest)  Time elapsed: 0 s
16:17:09 [2020-07-24T20:17:09.246Z] testParseObject2[35: null - 1krabbit   ](org.eclipse.tracecompass.common.core.tests.format.DecimalWithUnitPrefixFormatTest)  Time elapsed: 0 s
16:17:09 [2020-07-24T20:17:09.246Z] testParseObject[36: null - 1 Krabbit   ](org.eclipse.tracecompass.common.core.tests.format.DecimalWithUnitPrefixFormatTest)  Time elapsed: 0 s
16:17:09 [2020-07-24T20:17:09.246Z] testFormatIllegalArgument[36: null - 1 Krabbit   ](org.eclipse.tracecompass.common.core.tests.format.DecimalWithUnitPrefixFormatTest)  Time elapsed: 0 s
16:17:09 [2020-07-24T20:17:09.246Z] testFormat[36: null - 1 Krabbit   ](org.eclipse.tracecompass.common.core.tests.format.DecimalWithUnitPrefixFormatTest)  Time elapsed: 0 s
16:17:09 [2020-07-24T20:17:09.246Z] testParseObject2[36: null - 1 Krabbit   ](org.eclipse.tracecompass.common.core.tests.format.DecimalWithUnitPrefixFormatTest)  Time elapsed: 0 s
16:17:09 [2020-07-24T20:17:09.246Z] testParseObject[37: null - 1krabbit  potato](org.eclipse.tracecompass.common.core.tests.format.DecimalWithUnitPrefixFormatTest)  Time elapsed: 0 s
16:17:09 [2020-07-24T20:17:09.246Z] testFormatIllegalArgument[37: null - 1krabbit  potato](org.eclipse.tracecompass.common.core.tests.format.DecimalWithUnitPrefixFormatTest)  Time elapsed: 0 s
16:17:09 [2020-07-24T20:17:09.246Z] testFormat[37: null - 1krabbit  potato](org.eclipse.tracecompass.common.core.tests.format.DecimalWithUnitPrefixFormatTest)  Time elapsed: 0 s
16:17:09 [2020-07-24T20:17:09.246Z] testParseObject2[37: null - 1krabbit  potato](org.eclipse.tracecompass.common.core.tests.format.DecimalWithUnitPrefixFormatTest)  Time elapsed: 0 s
16:17:09 [2020-07-24T20:17:09.246Z] Running org.eclipse.tracecompass.common.core.tests.format.DecimalUnitFormatFactorTest
16:17:09 [2020-07-24T20:17:09.246Z] Tests run: 13, Failures: 0, Errors: 0, Skipped: 0, Time elapsed: 0.061 s - in org.eclipse.tracecompass.common.core.tests.format.DecimalUnitFormatFactorTest
16:17:09 [2020-07-24T20:17:09.246Z] testFormat[0: 0](org.eclipse.tracecompass.common.core.tests.format.DecimalUnitFormatFactorTest)  Time elapsed: 0.001 s
16:17:09 [2020-07-24T20:17:09.246Z] testFormat[1: 3](org.eclipse.tracecompass.common.core.tests.format.DecimalUnitFormatFactorTest)  Time elapsed: 0 s
16:17:09 [2020-07-24T20:17:09.246Z] testFormat[2: 975](org.eclipse.tracecompass.common.core.tests.format.DecimalUnitFormatFactorTest)  Time elapsed: 0 s
16:17:09 [2020-07-24T20:17:09.246Z] testFormat[3: 1,000](org.eclipse.tracecompass.common.core.tests.format.DecimalUnitFormatFactorTest)  Time elapsed: 0 s
16:17:09 [2020-07-24T20:17:09.246Z] testFormat[4: 4,000](org.eclipse.tracecompass.common.core.tests.format.DecimalUnitFormatFactorTest)  Time elapsed: 0 s
16:17:09 [2020-07-24T20:17:09.246Z] testFormat[5: -4,000](org.eclipse.tracecompass.common.core.tests.format.DecimalUnitFormatFactorTest)  Time elapsed: 0 s
16:17:09 [2020-07-24T20:17:09.246Z] testFormat[6: -0.04](org.eclipse.tracecompass.common.core.tests.format.DecimalUnitFormatFactorTest)  Time elapsed: 0 s
16:17:09 [2020-07-24T20:17:09.246Z] testFormat[7: 0.002](org.eclipse.tracecompass.common.core.tests.format.DecimalUnitFormatFactorTest)  Time elapsed: 0 s
16:17:09 [2020-07-24T20:17:09.246Z] testFormat[8: 0.056](org.eclipse.tracecompass.common.core.tests.format.DecimalUnitFormatFactorTest)  Time elapsed: 0 s
16:17:09 [2020-07-24T20:17:09.246Z] testFormat[9: 0](org.eclipse.tracecompass.common.core.tests.format.DecimalUnitFormatFactorTest)  Time elapsed: 0 s
16:17:09 [2020-07-24T20:17:09.246Z] testFormat[10: 0](org.eclipse.tracecompass.common.core.tests.format.DecimalUnitFormatFactorTest)  Time elapsed: 0 s
16:17:09 [2020-07-24T20:17:09.246Z] testFormat[11: ∞](org.eclipse.tracecompass.common.core.tests.format.DecimalUnitFormatFactorTest)  Time elapsed: 0 s
16:17:09 [2020-07-24T20:17:09.246Z] testFormat[12: 179,769,313,486,231,570,000,000,000,000,000,000,000,000,000,000,000,000,000,000,000,000,000,000,000,000,000,000,000,000,000,000,000,000,000,000,000,000,000,000,000,000,000,000,000,000,000,000,000,000,000,000,000,000,000,000,000,000,000,000,000,000,000,000,000,000,000,000,000,000,000,000,000,000,000,000,000,000,000,000,000,000,000,000,000,000,000,000,000,000,000,000,000,000,000,000,000,000,000,000,000,000,000](org.eclipse.tracecompass.common.core.tests.format.DecimalUnitFormatFactorTest)  Time elapsed: 0 s
16:17:09 [2020-07-24T20:17:09.246Z] Running org.eclipse.tracecompass.common.core.tests.format.SubSecondTimeWithUnitFormatTest
16:17:09 [2020-07-24T20:17:09.246Z] Tests run: 92, Failures: 0, Errors: 0, Skipped: 0, Time elapsed: 0.008 s - in org.eclipse.tracecompass.common.core.tests.format.SubSecondTimeWithUnitFormatTest
16:17:09 [2020-07-24T20:17:09.246Z] testParseObject[0: 0 - 0](org.eclipse.tracecompass.common.core.tests.format.SubSecondTimeWithUnitFormatTest)  Time elapsed: 0 s
16:17:09 [2020-07-24T20:17:09.246Z] testFormatIllegalArgument[0: 0 - 0](org.eclipse.tracecompass.common.core.tests.format.SubSecondTimeWithUnitFormatTest)  Time elapsed: 0 s
16:17:09 [2020-07-24T20:17:09.247Z] testFormat[0: 0 - 0](org.eclipse.tracecompass.common.core.tests.format.SubSecondTimeWithUnitFormatTest)  Time elapsed: 0 s
16:17:09 [2020-07-24T20:17:09.247Z] testParseObject2[0: 0 - 0](org.eclipse.tracecompass.common.core.tests.format.SubSecondTimeWithUnitFormatTest)  Time elapsed: 0 s
16:17:09 [2020-07-24T20:17:09.247Z] testParseObject[1: 3 - 3 ns](org.eclipse.tracecompass.common.core.tests.format.SubSecondTimeWithUnitFormatTest)  Time elapsed: 0 s
16:17:09 [2020-07-24T20:17:09.247Z] testFormatIllegalArgument[1: 3 - 3 ns](org.eclipse.tracecompass.common.core.tests.format.SubSecondTimeWithUnitFormatTest)  Time elapsed: 0 s
16:17:09 [2020-07-24T20:17:09.247Z] testFormat[1: 3 - 3 ns](org.eclipse.tracecompass.common.core.tests.format.SubSecondTimeWithUnitFormatTest)  Time elapsed: 0 s
16:17:09 [2020-07-24T20:17:09.247Z] testParseObject2[1: 3 - 3 ns](org.eclipse.tracecompass.common.core.tests.format.SubSecondTimeWithUnitFormatTest)  Time elapsed: 0 s
16:17:09 [2020-07-24T20:17:09.247Z] testParseObject[2: 1,975 - 1.975 µs](org.eclipse.tracecompass.common.core.tests.format.SubSecondTimeWithUnitFormatTest)  Time elapsed: 0 s
16:17:09 [2020-07-24T20:17:09.247Z] testFormatIllegalArgument[2: 1,975 - 1.975 µs](org.eclipse.tracecompass.common.core.tests.format.SubSecondTimeWithUnitFormatTest)  Time elapsed: 0 s
16:17:09 [2020-07-24T20:17:09.247Z] testFormat[2: 1,975 - 1.975 µs](org.eclipse.tracecompass.common.core.tests.format.SubSecondTimeWithUnitFormatTest)  Time elapsed: 0 s
16:17:09 [2020-07-24T20:17:09.247Z] testParseObject2[2: 1,975 - 1.975 µs](org.eclipse.tracecompass.common.core.tests.format.SubSecondTimeWithUnitFormatTest)  Time elapsed: 0 s
16:17:09 [2020-07-24T20:17:09.247Z] testParseObject[3: 200,000,000 - 200 ms](org.eclipse.tracecompass.common.core.tests.format.SubSecondTimeWithUnitFormatTest)  Time elapsed: 0 s
16:17:09 [2020-07-24T20:17:09.247Z] testFormatIllegalArgument[3: 200,000,000 - 200 ms](org.eclipse.tracecompass.common.core.tests.format.SubSecondTimeWithUnitFormatTest)  Time elapsed: 0 s
16:17:09 [2020-07-24T20:17:09.247Z] testFormat[3: 200,000,000 - 200 ms](org.eclipse.tracecompass.common.core.tests.format.SubSecondTimeWithUnitFormatTest)  Time elapsed: 0.001 s
16:17:09 [2020-07-24T20:17:09.247Z] testParseObject2[3: 200,000,000 - 200 ms](org.eclipse.tracecompass.common.core.tests.format.SubSecondTimeWithUnitFormatTest)  Time elapsed: 0 s
16:17:09 [2020-07-24T20:17:09.247Z] testParseObject[4: -200,000,000 - -200 ms](org.eclipse.tracecompass.common.core.tests.format.SubSecondTimeWithUnitFormatTest)  Time elapsed: 0 s
16:17:09 [2020-07-24T20:17:09.247Z] testFormatIllegalArgument[4: -200,000,000 - -200 ms](org.eclipse.tracecompass.common.core.tests.format.SubSecondTimeWithUnitFormatTest)  Time elapsed: 0 s
16:17:09 [2020-07-24T20:17:09.247Z] testFormat[4: -200,000,000 - -200 ms](org.eclipse.tracecompass.common.core.tests.format.SubSecondTimeWithUnitFormatTest)  Time elapsed: 0 s
16:17:09 [2020-07-24T20:17:09.247Z] testParseObject2[4: -200,000,000 - -200 ms](org.eclipse.tracecompass.common.core.tests.format.SubSecondTimeWithUnitFormatTest)  Time elapsed: 0 s
16:17:09 [2020-07-24T20:17:09.247Z] testParseObject[5: 200,000,000 - 200 ms](org.eclipse.tracecompass.common.core.tests.format.SubSecondTimeWithUnitFormatTest)  Time elapsed: 0 s
16:17:09 [2020-07-24T20:17:09.247Z] testFormatIllegalArgument[5: 200,000,000 - 200 ms](org.eclipse.tracecompass.common.core.tests.format.SubSecondTimeWithUnitFormatTest)  Time elapsed: 0 s
16:17:09 [2020-07-24T20:17:09.247Z] testFormat[5: 200,000,000 - 200 ms](org.eclipse.tracecompass.common.core.tests.format.SubSecondTimeWithUnitFormatTest)  Time elapsed: 0 s
16:17:09 [2020-07-24T20:17:09.247Z] testParseObject2[5: 200,000,000 - 200 ms](org.eclipse.tracecompass.common.core.tests.format.SubSecondTimeWithUnitFormatTest)  Time elapsed: 0 s
16:17:09 [2020-07-24T20:17:09.247Z] testParseObject[6: 200,000,000 - 200 ms](org.eclipse.tracecompass.common.core.tests.format.SubSecondTimeWithUnitFormatTest)  Time elapsed: 0 s
16:17:09 [2020-07-24T20:17:09.247Z] testFormatIllegalArgument[6: 200,000,000 - 200 ms](org.eclipse.tracecompass.common.core.tests.format.SubSecondTimeWithUnitFormatTest)  Time elapsed: 0 s
16:17:09 [2020-07-24T20:17:09.247Z] testFormat[6: 200,000,000 - 200 ms](org.eclipse.tracecompass.common.core.tests.format.SubSecondTimeWithUnitFormatTest)  Time elapsed: 0 s
16:17:09 [2020-07-24T20:17:09.247Z] testParseObject2[6: 200,000,000 - 200 ms](org.eclipse.tracecompass.common.core.tests.format.SubSecondTimeWithUnitFormatTest)  Time elapsed: 0 s
16:17:09 [2020-07-24T20:17:09.247Z] testParseObject[7: 2,100,000,000 - 2.1 s](org.eclipse.tracecompass.common.core.tests.format.SubSecondTimeWithUnitFormatTest)  Time elapsed: 0 s
16:17:09 [2020-07-24T20:17:09.247Z] testFormatIllegalArgument[7: 2,100,000,000 - 2.1 s](org.eclipse.tracecompass.common.core.tests.format.SubSecondTimeWithUnitFormatTest)  Time elapsed: 0 s
16:17:09 [2020-07-24T20:17:09.247Z] testFormat[7: 2,100,000,000 - 2.1 s](org.eclipse.tracecompass.common.core.tests.format.SubSecondTimeWithUnitFormatTest)  Time elapsed: 0 s
16:17:09 [2020-07-24T20:17:09.247Z] testParseObject2[7: 2,100,000,000 - 2.1 s](org.eclipse.tracecompass.common.core.tests.format.SubSecondTimeWithUnitFormatTest)  Time elapsed: 0 s
16:17:09 [2020-07-24T20:17:09.247Z] testParseObject[8: 314,159,264 - 314.159 ms](org.eclipse.tracecompass.common.core.tests.format.SubSecondTimeWithUnitFormatTest)  Time elapsed: 0 s
16:17:09 [2020-07-24T20:17:09.247Z] testFormatIllegalArgument[8: 314,159,264 - 314.159 ms](org.eclipse.tracecompass.common.core.tests.format.SubSecondTimeWithUnitFormatTest)  Time elapsed: 0 s
16:17:09 [2020-07-24T20:17:09.247Z] testFormat[8: 314,159,264 - 314.159 ms](org.eclipse.tracecompass.common.core.tests.format.SubSecondTimeWithUnitFormatTest)  Time elapsed: 0 s
16:17:09 [2020-07-24T20:17:09.247Z] testParseObject2[8: 314,159,264 - 314.159 ms](org.eclipse.tracecompass.common.core.tests.format.SubSecondTimeWithUnitFormatTest)  Time elapsed: 0 s
16:17:09 [2020-07-24T20:17:09.247Z] testParseObject[9: 200,001,000 - 200.001 ms](org.eclipse.tracecompass.common.core.tests.format.SubSecondTimeWithUnitFormatTest)  Time elapsed: 0 s
16:17:09 [2020-07-24T20:17:09.247Z] testFormatIllegalArgument[9: 200,001,000 - 200.001 ms](org.eclipse.tracecompass.common.core.tests.format.SubSecondTimeWithUnitFormatTest)  Time elapsed: 0 s
16:17:09 [2020-07-24T20:17:09.247Z] testFormat[9: 200,001,000 - 200.001 ms](org.eclipse.tracecompass.common.core.tests.format.SubSecondTimeWithUnitFormatTest)  Time elapsed: 0 s
16:17:09 [2020-07-24T20:17:09.247Z] testParseObject2[9: 200,001,000 - 200.001 ms](org.eclipse.tracecompass.common.core.tests.format.SubSecondTimeWithUnitFormatTest)  Time elapsed: 0 s
16:17:09 [2020-07-24T20:17:09.247Z] testParseObject[10: 200,000,100 - 200 ms](org.eclipse.tracecompass.common.core.tests.format.SubSecondTimeWithUnitFormatTest)  Time elapsed: 0 s
16:17:09 [2020-07-24T20:17:09.247Z] testFormatIllegalArgument[10: 200,000,100 - 200 ms](org.eclipse.tracecompass.common.core.tests.format.SubSecondTimeWithUnitFormatTest)  Time elapsed: 0 s
16:17:09 [2020-07-24T20:17:09.247Z] testFormat[10: 200,000,100 - 200 ms](org.eclipse.tracecompass.common.core.tests.format.SubSecondTimeWithUnitFormatTest)  Time elapsed: 0 s
16:17:09 [2020-07-24T20:17:09.247Z] testParseObject2[10: 200,000,100 - 200 ms](org.eclipse.tracecompass.common.core.tests.format.SubSecondTimeWithUnitFormatTest)  Time elapsed: 0 s
16:17:09 [2020-07-24T20:17:09.247Z] testParseObject[11: null - 200ms](org.eclipse.tracecompass.common.core.tests.format.SubSecondTimeWithUnitFormatTest)  Time elapsed: 0.001 s
16:17:09 [2020-07-24T20:17:09.247Z] testFormatIllegalArgument[11: null - 200ms](org.eclipse.tracecompass.common.core.tests.format.SubSecondTimeWithUnitFormatTest)  Time elapsed: 0 s
16:17:09 [2020-07-24T20:17:09.247Z] testFormat[11: null - 200ms](org.eclipse.tracecompass.common.core.tests.format.SubSecondTimeWithUnitFormatTest)  Time elapsed: 0 s
16:17:09 [2020-07-24T20:17:09.247Z] testParseObject2[11: null - 200ms](org.eclipse.tracecompass.common.core.tests.format.SubSecondTimeWithUnitFormatTest)  Time elapsed: 0 s
16:17:09 [2020-07-24T20:17:09.247Z] testParseObject[12: null - 200ms  ](org.eclipse.tracecompass.common.core.tests.format.SubSecondTimeWithUnitFormatTest)  Time elapsed: 0 s
16:17:09 [2020-07-24T20:17:09.247Z] testFormatIllegalArgument[12: null - 200ms  ](org.eclipse.tracecompass.common.core.tests.format.SubSecondTimeWithUnitFormatTest)  Time elapsed: 0 s
16:17:09 [2020-07-24T20:17:09.247Z] testFormat[12: null - 200ms  ](org.eclipse.tracecompass.common.core.tests.format.SubSecondTimeWithUnitFormatTest)  Time elapsed: 0 s
16:17:09 [2020-07-24T20:17:09.247Z] testParseObject2[12: null - 200ms  ](org.eclipse.tracecompass.common.core.tests.format.SubSecondTimeWithUnitFormatTest)  Time elapsed: 0 s
16:17:09 [2020-07-24T20:17:09.247Z] testParseObject[13: null - 200     ms](org.eclipse.tracecompass.common.core.tests.format.SubSecondTimeWithUnitFormatTest)  Time elapsed: 0 s
16:17:09 [2020-07-24T20:17:09.247Z] testFormatIllegalArgument[13: null - 200     ms](org.eclipse.tracecompass.common.core.tests.format.SubSecondTimeWithUnitFormatTest)  Time elapsed: 0 s
16:17:09 [2020-07-24T20:17:09.247Z] testFormat[13: null - 200     ms](org.eclipse.tracecompass.common.core.tests.format.SubSecondTimeWithUnitFormatTest)  Time elapsed: 0 s
16:17:09 [2020-07-24T20:17:09.247Z] testParseObject2[13: null - 200     ms](org.eclipse.tracecompass.common.core.tests.format.SubSecondTimeWithUnitFormatTest)  Time elapsed: 0 s
16:17:09 [2020-07-24T20:17:09.247Z] testParseObject[14: null - 1.5ms](org.eclipse.tracecompass.common.core.tests.format.SubSecondTimeWithUnitFormatTest)  Time elapsed: 0 s
16:17:09 [2020-07-24T20:17:09.247Z] testFormatIllegalArgument[14: null - 1.5ms](org.eclipse.tracecompass.common.core.tests.format.SubSecondTimeWithUnitFormatTest)  Time elapsed: 0 s
16:17:09 [2020-07-24T20:17:09.247Z] testFormat[14: null - 1.5ms](org.eclipse.tracecompass.common.core.tests.format.SubSecondTimeWithUnitFormatTest)  Time elapsed: 0 s
16:17:09 [2020-07-24T20:17:09.247Z] testParseObject2[14: null - 1.5ms](org.eclipse.tracecompass.common.core.tests.format.SubSecondTimeWithUnitFormatTest)  Time elapsed: 0 s
16:17:09 [2020-07-24T20:17:09.247Z] testParseObject[15: null - 1.5us](org.eclipse.tracecompass.common.core.tests.format.SubSecondTimeWithUnitFormatTest)  Time elapsed: 0 s
16:17:09 [2020-07-24T20:17:09.247Z] testFormatIllegalArgument[15: null - 1.5us](org.eclipse.tracecompass.common.core.tests.format.SubSecondTimeWithUnitFormatTest)  Time elapsed: 0 s
16:17:09 [2020-07-24T20:17:09.247Z] testFormat[15: null - 1.5us](org.eclipse.tracecompass.common.core.tests.format.SubSecondTimeWithUnitFormatTest)  Time elapsed: 0 s
16:17:09 [2020-07-24T20:17:09.254Z] testParseObject2[15: null - 1.5us](org.eclipse.tracecompass.common.core.tests.format.SubSecondTimeWithUnitFormatTest)  Time elapsed: 0 s
16:17:09 [2020-07-24T20:17:09.254Z] testParseObject[16: null - 1.5µs](org.eclipse.tracecompass.common.core.tests.format.SubSecondTimeWithUnitFormatTest)  Time elapsed: 0.001 s
16:17:09 [2020-07-24T20:17:09.254Z] testFormatIllegalArgument[16: null - 1.5µs](org.eclipse.tracecompass.common.core.tests.format.SubSecondTimeWithUnitFormatTest)  Time elapsed: 0 s
16:17:09 [2020-07-24T20:17:09.254Z] testFormat[16: null - 1.5µs](org.eclipse.tracecompass.common.core.tests.format.SubSecondTimeWithUnitFormatTest)  Time elapsed: 0 s
16:17:09 [2020-07-24T20:17:09.254Z] testParseObject2[16: null - 1.5µs](org.eclipse.tracecompass.common.core.tests.format.SubSecondTimeWithUnitFormatTest)  Time elapsed: 0 s
16:17:09 [2020-07-24T20:17:09.254Z] testParseObject[17: null - 1.5usdt](org.eclipse.tracecompass.common.core.tests.format.SubSecondTimeWithUnitFormatTest)  Time elapsed: 0 s
16:17:09 [2020-07-24T20:17:09.254Z] testFormatIllegalArgument[17: null - 1.5usdt](org.eclipse.tracecompass.common.core.tests.format.SubSecondTimeWithUnitFormatTest)  Time elapsed: 0 s
16:17:09 [2020-07-24T20:17:09.254Z] testFormat[17: null - 1.5usdt](org.eclipse.tracecompass.common.core.tests.format.SubSecondTimeWithUnitFormatTest)  Time elapsed: 0 s
16:17:09 [2020-07-24T20:17:09.254Z] testParseObject2[17: null - 1.5usdt](org.eclipse.tracecompass.common.core.tests.format.SubSecondTimeWithUnitFormatTest)  Time elapsed: 0 s
16:17:09 [2020-07-24T20:17:09.254Z] testParseObject[18: null - 1.5hello](org.eclipse.tracecompass.common.core.tests.format.SubSecondTimeWithUnitFormatTest)  Time elapsed: 0 s
16:17:09 [2020-07-24T20:17:09.254Z] testFormatIllegalArgument[18: null - 1.5hello](org.eclipse.tracecompass.common.core.tests.format.SubSecondTimeWithUnitFormatTest)  Time elapsed: 0 s
16:17:09 [2020-07-24T20:17:09.254Z] testFormat[18: null - 1.5hello](org.eclipse.tracecompass.common.core.tests.format.SubSecondTimeWithUnitFormatTest)  Time elapsed: 0 s
16:17:09 [2020-07-24T20:17:09.254Z] testParseObject2[18: null - 1.5hello](org.eclipse.tracecompass.common.core.tests.format.SubSecondTimeWithUnitFormatTest)  Time elapsed: 0 s
16:17:09 [2020-07-24T20:17:09.254Z] testParseObject[19: null - 15](org.eclipse.tracecompass.common.core.tests.format.SubSecondTimeWithUnitFormatTest)  Time elapsed: 0 s
16:17:09 [2020-07-24T20:17:09.254Z] testFormatIllegalArgument[19: null - 15](org.eclipse.tracecompass.common.core.tests.format.SubSecondTimeWithUnitFormatTest)  Time elapsed: 0 s
16:17:09 [2020-07-24T20:17:09.254Z] testFormat[19: null - 15](org.eclipse.tracecompass.common.core.tests.format.SubSecondTimeWithUnitFormatTest)  Time elapsed: 0 s
16:17:09 [2020-07-24T20:17:09.254Z] testParseObject2[19: null - 15](org.eclipse.tracecompass.common.core.tests.format.SubSecondTimeWithUnitFormatTest)  Time elapsed: 0 s
16:17:09 [2020-07-24T20:17:09.254Z] testParseObject[20: null - hello](org.eclipse.tracecompass.common.core.tests.format.SubSecondTimeWithUnitFormatTest)  Time elapsed: 0 s
16:17:09 [2020-07-24T20:17:09.254Z] testFormatIllegalArgument[20: null - hello](org.eclipse.tracecompass.common.core.tests.format.SubSecondTimeWithUnitFormatTest)  Time elapsed: 0 s
16:17:09 [2020-07-24T20:17:09.254Z] testFormat[20: null - hello](org.eclipse.tracecompass.common.core.tests.format.SubSecondTimeWithUnitFormatTest)  Time elapsed: 0 s
16:17:09 [2020-07-24T20:17:09.254Z] testParseObject2[20: null - hello](org.eclipse.tracecompass.common.core.tests.format.SubSecondTimeWithUnitFormatTest)  Time elapsed: 0 s
16:17:09 [2020-07-24T20:17:09.254Z] testParseObject[21: null - 0.000001s](org.eclipse.tracecompass.common.core.tests.format.SubSecondTimeWithUnitFormatTest)  Time elapsed: 0 s
16:17:09 [2020-07-24T20:17:09.254Z] testFormatIllegalArgument[21: null - 0.000001s](org.eclipse.tracecompass.common.core.tests.format.SubSecondTimeWithUnitFormatTest)  Time elapsed: 0 s
16:17:09 [2020-07-24T20:17:09.254Z] testFormat[21: null - 0.000001s](org.eclipse.tracecompass.common.core.tests.format.SubSecondTimeWithUnitFormatTest)  Time elapsed: 0 s
16:17:09 [2020-07-24T20:17:09.254Z] testParseObject2[21: null - 0.000001s](org.eclipse.tracecompass.common.core.tests.format.SubSecondTimeWithUnitFormatTest)  Time elapsed: 0 s
16:17:09 [2020-07-24T20:17:09.254Z] testParseObject[22: null - .000001s](org.eclipse.tracecompass.common.core.tests.format.SubSecondTimeWithUnitFormatTest)  Time elapsed: 0 s
16:17:09 [2020-07-24T20:17:09.254Z] testFormatIllegalArgument[22: null - .000001s](org.eclipse.tracecompass.common.core.tests.format.SubSecondTimeWithUnitFormatTest)  Time elapsed: 0 s
16:17:09 [2020-07-24T20:17:09.254Z] testFormat[22: null - .000001s](org.eclipse.tracecompass.common.core.tests.format.SubSecondTimeWithUnitFormatTest)  Time elapsed: 0 s
16:17:09 [2020-07-24T20:17:09.254Z] testParseObject2[22: null - .000001s](org.eclipse.tracecompass.common.core.tests.format.SubSecondTimeWithUnitFormatTest)  Time elapsed: 0 s
16:17:09 [2020-07-24T20:17:09.254Z] Running org.eclipse.tracecompass.common.core.tests.format.DataSizeFormatTest
16:17:09 [2020-07-24T20:17:09.254Z] Tests run: 96, Failures: 0, Errors: 0, Skipped: 0, Time elapsed: 0.009 s - in org.eclipse.tracecompass.common.core.tests.format.DataSizeFormatTest
16:17:09 [2020-07-24T20:17:09.254Z] testParseObject[0: 0 - 0 B](org.eclipse.tracecompass.common.core.tests.format.DataSizeFormatTest)  Time elapsed: 0 s
16:17:09 [2020-07-24T20:17:09.254Z] testFormatIllegalArgument[0: 0 - 0 B](org.eclipse.tracecompass.common.core.tests.format.DataSizeFormatTest)  Time elapsed: 0.001 s
16:17:09 [2020-07-24T20:17:09.254Z] testFormat[0: 0 - 0 B](org.eclipse.tracecompass.common.core.tests.format.DataSizeFormatTest)  Time elapsed: 0 s
16:17:09 [2020-07-24T20:17:09.254Z] testParseObject2[0: 0 - 0 B](org.eclipse.tracecompass.common.core.tests.format.DataSizeFormatTest)  Time elapsed: 0 s
16:17:09 [2020-07-24T20:17:09.254Z] testParseObject[1: 3 - 3 B](org.eclipse.tracecompass.common.core.tests.format.DataSizeFormatTest)  Time elapsed: 0 s
16:17:09 [2020-07-24T20:17:09.254Z] testFormatIllegalArgument[1: 3 - 3 B](org.eclipse.tracecompass.common.core.tests.format.DataSizeFormatTest)  Time elapsed: 0 s
16:17:09 [2020-07-24T20:17:09.254Z] testFormat[1: 3 - 3 B](org.eclipse.tracecompass.common.core.tests.format.DataSizeFormatTest)  Time elapsed: 0 s
16:17:09 [2020-07-24T20:17:09.254Z] testParseObject2[1: 3 - 3 B](org.eclipse.tracecompass.common.core.tests.format.DataSizeFormatTest)  Time elapsed: 0 s
16:17:09 [2020-07-24T20:17:09.254Z] testParseObject[2: 975 - 975 B](org.eclipse.tracecompass.common.core.tests.format.DataSizeFormatTest)  Time elapsed: 0 s
16:17:09 [2020-07-24T20:17:09.254Z] testFormatIllegalArgument[2: 975 - 975 B](org.eclipse.tracecompass.common.core.tests.format.DataSizeFormatTest)  Time elapsed: 0 s
16:17:09 [2020-07-24T20:17:09.254Z] testFormat[2: 975 - 975 B](org.eclipse.tracecompass.common.core.tests.format.DataSizeFormatTest)  Time elapsed: 0 s
16:17:09 [2020-07-24T20:17:09.254Z] testParseObject2[2: 975 - 975 B](org.eclipse.tracecompass.common.core.tests.format.DataSizeFormatTest)  Time elapsed: 0 s
16:17:09 [2020-07-24T20:17:09.254Z] testParseObject[3: 1,024 - 1 KB](org.eclipse.tracecompass.common.core.tests.format.DataSizeFormatTest)  Time elapsed: 0 s
16:17:09 [2020-07-24T20:17:09.254Z] testFormatIllegalArgument[3: 1,024 - 1 KB](org.eclipse.tracecompass.common.core.tests.format.DataSizeFormatTest)  Time elapsed: 0 s
16:17:09 [2020-07-24T20:17:09.254Z] testFormat[3: 1,024 - 1 KB](org.eclipse.tracecompass.common.core.tests.format.DataSizeFormatTest)  Time elapsed: 0 s
16:17:09 [2020-07-24T20:17:09.254Z] testParseObject2[3: 1,024 - 1 KB](org.eclipse.tracecompass.common.core.tests.format.DataSizeFormatTest)  Time elapsed: 0 s
16:17:09 [2020-07-24T20:17:09.254Z] testParseObject[4: 1,048,576 - 1 MB](org.eclipse.tracecompass.common.core.tests.format.DataSizeFormatTest)  Time elapsed: 0.001 s
16:17:09 [2020-07-24T20:17:09.254Z] testFormatIllegalArgument[4: 1,048,576 - 1 MB](org.eclipse.tracecompass.common.core.tests.format.DataSizeFormatTest)  Time elapsed: 0 s
16:17:09 [2020-07-24T20:17:09.254Z] testFormat[4: 1,048,576 - 1 MB](org.eclipse.tracecompass.common.core.tests.format.DataSizeFormatTest)  Time elapsed: 0 s
16:17:09 [2020-07-24T20:17:09.254Z] testParseObject2[4: 1,048,576 - 1 MB](org.eclipse.tracecompass.common.core.tests.format.DataSizeFormatTest)  Time elapsed: 0 s
16:17:09 [2020-07-24T20:17:09.254Z] testParseObject[5: 1,073,741,824 - 1 GB](org.eclipse.tracecompass.common.core.tests.format.DataSizeFormatTest)  Time elapsed: 0 s
16:17:09 [2020-07-24T20:17:09.254Z] testFormatIllegalArgument[5: 1,073,741,824 - 1 GB](org.eclipse.tracecompass.common.core.tests.format.DataSizeFormatTest)  Time elapsed: 0 s
16:17:09 [2020-07-24T20:17:09.254Z] testFormat[5: 1,073,741,824 - 1 GB](org.eclipse.tracecompass.common.core.tests.format.DataSizeFormatTest)  Time elapsed: 0 s
16:17:09 [2020-07-24T20:17:09.254Z] testParseObject2[5: 1,073,741,824 - 1 GB](org.eclipse.tracecompass.common.core.tests.format.DataSizeFormatTest)  Time elapsed: 0 s
16:17:09 [2020-07-24T20:17:09.254Z] testParseObject[6: 1,099,511,627,776 - 1 TB](org.eclipse.tracecompass.common.core.tests.format.DataSizeFormatTest)  Time elapsed: 0 s
16:17:09 [2020-07-24T20:17:09.254Z] testFormatIllegalArgument[6: 1,099,511,627,776 - 1 TB](org.eclipse.tracecompass.common.core.tests.format.DataSizeFormatTest)  Time elapsed: 0 s
16:17:09 [2020-07-24T20:17:09.254Z] testFormat[6: 1,099,511,627,776 - 1 TB](org.eclipse.tracecompass.common.core.tests.format.DataSizeFormatTest)  Time elapsed: 0 s
16:17:09 [2020-07-24T20:17:09.254Z] testParseObject2[6: 1,099,511,627,776 - 1 TB](org.eclipse.tracecompass.common.core.tests.format.DataSizeFormatTest)  Time elapsed: 0 s
16:17:09 [2020-07-24T20:17:09.254Z] testParseObject[7: 4,096 - 4 KB](org.eclipse.tracecompass.common.core.tests.format.DataSizeFormatTest)  Time elapsed: 0 s
16:17:09 [2020-07-24T20:17:09.254Z] testFormatIllegalArgument[7: 4,096 - 4 KB](org.eclipse.tracecompass.common.core.tests.format.DataSizeFormatTest)  Time elapsed: 0 s
16:17:09 [2020-07-24T20:17:09.254Z] testFormat[7: 4,096 - 4 KB](org.eclipse.tracecompass.common.core.tests.format.DataSizeFormatTest)  Time elapsed: 0 s
16:17:09 [2020-07-24T20:17:09.254Z] testParseObject2[7: 4,096 - 4 KB](org.eclipse.tracecompass.common.core.tests.format.DataSizeFormatTest)  Time elapsed: 0.001 s
16:17:09 [2020-07-24T20:17:09.254Z] testParseObject[8: -4,096 - -4 KB](org.eclipse.tracecompass.common.core.tests.format.DataSizeFormatTest)  Time elapsed: 0 s
16:17:09 [2020-07-24T20:17:09.254Z] testFormatIllegalArgument[8: -4,096 - -4 KB](org.eclipse.tracecompass.common.core.tests.format.DataSizeFormatTest)  Time elapsed: 0 s
16:17:09 [2020-07-24T20:17:09.254Z] testFormat[8: -4,096 - -4 KB](org.eclipse.tracecompass.common.core.tests.format.DataSizeFormatTest)  Time elapsed: 0 s
16:17:09 [2020-07-24T20:17:09.254Z] testParseObject2[8: -4,096 - -4 KB](org.eclipse.tracecompass.common.core.tests.format.DataSizeFormatTest)  Time elapsed: 0 s
16:17:09 [2020-07-24T20:17:09.254Z] testParseObject[9: 4,096 - 4 KB](org.eclipse.tracecompass.common.core.tests.format.DataSizeFormatTest)  Time elapsed: 0 s
16:17:09 [2020-07-24T20:17:09.254Z] testFormatIllegalArgument[9: 4,096 - 4 KB](org.eclipse.tracecompass.common.core.tests.format.DataSizeFormatTest)  Time elapsed: 0 s
16:17:09 [2020-07-24T20:17:09.254Z] testFormat[9: 4,096 - 4 KB](org.eclipse.tracecompass.common.core.tests.format.DataSizeFormatTest)  Time elapsed: 0 s
16:17:09 [2020-07-24T20:17:09.254Z] testParseObject2[9: 4,096 - 4 KB](org.eclipse.tracecompass.common.core.tests.format.DataSizeFormatTest)  Time elapsed: 0 s
16:17:09 [2020-07-24T20:17:09.254Z] testParseObject[10: 4,096 - 4 KB](org.eclipse.tracecompass.common.core.tests.format.DataSizeFormatTest)  Time elapsed: 0 s
16:17:09 [2020-07-24T20:17:09.254Z] testFormatIllegalArgument[10: 4,096 - 4 KB](org.eclipse.tracecompass.common.core.tests.format.DataSizeFormatTest)  Time elapsed: 0 s
16:17:09 [2020-07-24T20:17:09.254Z] testFormat[10: 4,096 - 4 KB](org.eclipse.tracecompass.common.core.tests.format.DataSizeFormatTest)  Time elapsed: 0 s
16:17:09 [2020-07-24T20:17:09.254Z] testParseObject2[10: 4,096 - 4 KB](org.eclipse.tracecompass.common.core.tests.format.DataSizeFormatTest)  Time elapsed: 0 s
16:17:09 [2020-07-24T20:17:09.254Z] testParseObject[11: 12,345,678 - 11.774 MB](org.eclipse.tracecompass.common.core.tests.format.DataSizeFormatTest)  Time elapsed: 0 s
16:17:09 [2020-07-24T20:17:09.254Z] testFormatIllegalArgument[11: 12,345,678 - 11.774 MB](org.eclipse.tracecompass.common.core.tests.format.DataSizeFormatTest)  Time elapsed: 0 s
16:17:09 [2020-07-24T20:17:09.254Z] testFormat[11: 12,345,678 - 11.774 MB](org.eclipse.tracecompass.common.core.tests.format.DataSizeFormatTest)  Time elapsed: 0 s
16:17:09 [2020-07-24T20:17:09.255Z] testParseObject2[11: 12,345,678 - 11.774 MB](org.eclipse.tracecompass.common.core.tests.format.DataSizeFormatTest)  Time elapsed: 0.001 s
16:17:09 [2020-07-24T20:17:09.255Z] testParseObject[12: 2,147,483,647 - 2 GB](org.eclipse.tracecompass.common.core.tests.format.DataSizeFormatTest)  Time elapsed: 0 s
16:17:09 [2020-07-24T20:17:09.255Z] testFormatIllegalArgument[12: 2,147,483,647 - 2 GB](org.eclipse.tracecompass.common.core.tests.format.DataSizeFormatTest)  Time elapsed: 0 s
16:17:09 [2020-07-24T20:17:09.255Z] testFormat[12: 2,147,483,647 - 2 GB](org.eclipse.tracecompass.common.core.tests.format.DataSizeFormatTest)  Time elapsed: 0 s
16:17:09 [2020-07-24T20:17:09.255Z] testParseObject2[12: 2,147,483,647 - 2 GB](org.eclipse.tracecompass.common.core.tests.format.DataSizeFormatTest)  Time elapsed: 0 s
16:17:09 [2020-07-24T20:17:09.255Z] testParseObject[13: -2,147,483,648 - -2 GB](org.eclipse.tracecompass.common.core.tests.format.DataSizeFormatTest)  Time elapsed: 0 s
16:17:09 [2020-07-24T20:17:09.255Z] testFormatIllegalArgument[13: -2,147,483,648 - -2 GB](org.eclipse.tracecompass.common.core.tests.format.DataSizeFormatTest)  Time elapsed: 0 s
16:17:09 [2020-07-24T20:17:09.255Z] testFormat[13: -2,147,483,648 - -2 GB](org.eclipse.tracecompass.common.core.tests.format.DataSizeFormatTest)  Time elapsed: 0 s
16:17:09 [2020-07-24T20:17:09.255Z] testParseObject2[13: -2,147,483,648 - -2 GB](org.eclipse.tracecompass.common.core.tests.format.DataSizeFormatTest)  Time elapsed: 0 s
16:17:09 [2020-07-24T20:17:09.255Z] testParseObject[14: 9,223,372,036,854,775,807 - 8388608 TB](org.eclipse.tracecompass.common.core.tests.format.DataSizeFormatTest)  Time elapsed: 0 s
16:17:09 [2020-07-24T20:17:09.255Z] testFormatIllegalArgument[14: 9,223,372,036,854,775,807 - 8388608 TB](org.eclipse.tracecompass.common.core.tests.format.DataSizeFormatTest)  Time elapsed: 0 s
16:17:09 [2020-07-24T20:17:09.255Z] testFormat[14: 9,223,372,036,854,775,807 - 8388608 TB](org.eclipse.tracecompass.common.core.tests.format.DataSizeFormatTest)  Time elapsed: 0 s
16:17:09 [2020-07-24T20:17:09.255Z] testParseObject2[14: 9,223,372,036,854,775,807 - 8388608 TB](org.eclipse.tracecompass.common.core.tests.format.DataSizeFormatTest)  Time elapsed: 0 s
16:17:09 [2020-07-24T20:17:09.255Z] testParseObject[15: 98,765,432.123 - 94.19 MB](org.eclipse.tracecompass.common.core.tests.format.DataSizeFormatTest)  Time elapsed: 0 s
16:17:09 [2020-07-24T20:17:09.255Z] testFormatIllegalArgument[15: 98,765,432.123 - 94.19 MB](org.eclipse.tracecompass.common.core.tests.format.DataSizeFormatTest)  Time elapsed: 0 s
16:17:09 [2020-07-24T20:17:09.255Z] testFormat[15: 98,765,432.123 - 94.19 MB](org.eclipse.tracecompass.common.core.tests.format.DataSizeFormatTest)  Time elapsed: 0 s
16:17:09 [2020-07-24T20:17:09.255Z] testParseObject2[15: 98,765,432.123 - 94.19 MB](org.eclipse.tracecompass.common.core.tests.format.DataSizeFormatTest)  Time elapsed: 0 s
16:17:09 [2020-07-24T20:17:09.255Z] testParseObject[16: -98,765,432.123 - -94.19 MB](org.eclipse.tracecompass.common.core.tests.format.DataSizeFormatTest)  Time elapsed: 0 s
16:17:09 [2020-07-24T20:17:09.255Z] testFormatIllegalArgument[16: -98,765,432.123 - -94.19 MB](org.eclipse.tracecompass.common.core.tests.format.DataSizeFormatTest)  Time elapsed: 0 s
16:17:09 [2020-07-24T20:17:09.255Z] testFormat[16: -98,765,432.123 - -94.19 MB](org.eclipse.tracecompass.common.core.tests.format.DataSizeFormatTest)  Time elapsed: 0 s
16:17:09 [2020-07-24T20:17:09.255Z] testParseObject2[16: -98,765,432.123 - -94.19 MB](org.eclipse.tracecompass.common.core.tests.format.DataSizeFormatTest)  Time elapsed: 0 s
16:17:09 [2020-07-24T20:17:09.255Z] testParseObject[17: 555,555,555,555 - 517.401 GB](org.eclipse.tracecompass.common.core.tests.format.DataSizeFormatTest)  Time elapsed: 0 s
16:17:09 [2020-07-24T20:17:09.255Z] testFormatIllegalArgument[17: 555,555,555,555 - 517.401 GB](org.eclipse.tracecompass.common.core.tests.format.DataSizeFormatTest)  Time elapsed: 0 s
16:17:09 [2020-07-24T20:17:09.255Z] testFormat[17: 555,555,555,555 - 517.401 GB](org.eclipse.tracecompass.common.core.tests.format.DataSizeFormatTest)  Time elapsed: 0 s
16:17:09 [2020-07-24T20:17:09.255Z] testParseObject2[17: 555,555,555,555 - 517.401 GB](org.eclipse.tracecompass.common.core.tests.format.DataSizeFormatTest)  Time elapsed: 0 s
16:17:09 [2020-07-24T20:17:09.255Z] testParseObject[18: 555,555,555,555,555 - 505.275 TB](org.eclipse.tracecompass.common.core.tests.format.DataSizeFormatTest)  Time elapsed: 0 s
16:17:09 [2020-07-24T20:17:09.255Z] testFormatIllegalArgument[18: 555,555,555,555,555 - 505.275 TB](org.eclipse.tracecompass.common.core.tests.format.DataSizeFormatTest)  Time elapsed: 0 s
16:17:09 [2020-07-24T20:17:09.255Z] testFormat[18: 555,555,555,555,555 - 505.275 TB](org.eclipse.tracecompass.common.core.tests.format.DataSizeFormatTest)  Time elapsed: 0 s
16:17:09 [2020-07-24T20:17:09.255Z] testParseObject2[18: 555,555,555,555,555 - 505.275 TB](org.eclipse.tracecompass.common.core.tests.format.DataSizeFormatTest)  Time elapsed: 0 s
16:17:09 [2020-07-24T20:17:09.255Z] testParseObject[19: null - 1234 TPotato](org.eclipse.tracecompass.common.core.tests.format.DataSizeFormatTest)  Time elapsed: 0 s
16:17:09 [2020-07-24T20:17:09.255Z] testFormatIllegalArgument[19: null - 1234 TPotato](org.eclipse.tracecompass.common.core.tests.format.DataSizeFormatTest)  Time elapsed: 0 s
16:17:09 [2020-07-24T20:17:09.255Z] testFormat[19: null - 1234 TPotato](org.eclipse.tracecompass.common.core.tests.format.DataSizeFormatTest)  Time elapsed: 0 s
16:17:09 [2020-07-24T20:17:09.255Z] testParseObject2[19: null - 1234 TPotato](org.eclipse.tracecompass.common.core.tests.format.DataSizeFormatTest)  Time elapsed: 0 s
16:17:09 [2020-07-24T20:17:09.255Z] testParseObject[20: null - .0001 MB](org.eclipse.tracecompass.common.core.tests.format.DataSizeFormatTest)  Time elapsed: 0 s
16:17:09 [2020-07-24T20:17:09.255Z] testFormatIllegalArgument[20: null - .0001 MB](org.eclipse.tracecompass.common.core.tests.format.DataSizeFormatTest)  Time elapsed: 0 s
16:17:09 [2020-07-24T20:17:09.255Z] testFormat[20: null - .0001 MB](org.eclipse.tracecompass.common.core.tests.format.DataSizeFormatTest)  Time elapsed: 0 s
16:17:09 [2020-07-24T20:17:09.255Z] testParseObject2[20: null - .0001 MB](org.eclipse.tracecompass.common.core.tests.format.DataSizeFormatTest)  Time elapsed: 0 s
16:17:09 [2020-07-24T20:17:09.255Z] testParseObject[21: null - 1KB](org.eclipse.tracecompass.common.core.tests.format.DataSizeFormatTest)  Time elapsed: 0 s
16:17:09 [2020-07-24T20:17:09.255Z] testFormatIllegalArgument[21: null - 1KB](org.eclipse.tracecompass.common.core.tests.format.DataSizeFormatTest)  Time elapsed: 0 s
16:17:09 [2020-07-24T20:17:09.255Z] testFormat[21: null - 1KB](org.eclipse.tracecompass.common.core.tests.format.DataSizeFormatTest)  Time elapsed: 0 s
16:17:09 [2020-07-24T20:17:09.255Z] testParseObject2[21: null - 1KB](org.eclipse.tracecompass.common.core.tests.format.DataSizeFormatTest)  Time elapsed: 0 s
16:17:09 [2020-07-24T20:17:09.255Z] testParseObject[22: null - 1KB   ](org.eclipse.tracecompass.common.core.tests.format.DataSizeFormatTest)  Time elapsed: 0 s
16:17:09 [2020-07-24T20:17:09.255Z] testFormatIllegalArgument[22: null - 1KB   ](org.eclipse.tracecompass.common.core.tests.format.DataSizeFormatTest)  Time elapsed: 0 s
16:17:09 [2020-07-24T20:17:09.255Z] testFormat[22: null - 1KB   ](org.eclipse.tracecompass.common.core.tests.format.DataSizeFormatTest)  Time elapsed: 0 s
16:17:09 [2020-07-24T20:17:09.255Z] testParseObject2[22: null - 1KB   ](org.eclipse.tracecompass.common.core.tests.format.DataSizeFormatTest)  Time elapsed: 0 s
16:17:09 [2020-07-24T20:17:09.255Z] testParseObject[23: null - 1KB  potato](org.eclipse.tracecompass.common.core.tests.format.DataSizeFormatTest)  Time elapsed: 0.001 s
16:17:09 [2020-07-24T20:17:09.255Z] testFormatIllegalArgument[23: null - 1KB  potato](org.eclipse.tracecompass.common.core.tests.format.DataSizeFormatTest)  Time elapsed: 0 s
16:17:09 [2020-07-24T20:17:09.255Z] testFormat[23: null - 1KB  potato](org.eclipse.tracecompass.common.core.tests.format.DataSizeFormatTest)  Time elapsed: 0 s
16:17:09 [2020-07-24T20:17:09.255Z] testParseObject2[23: null - 1KB  potato](org.eclipse.tracecompass.common.core.tests.format.DataSizeFormatTest)  Time elapsed: 0 s
16:17:09 [2020-07-24T20:17:09.255Z] Running org.eclipse.tracecompass.common.core.tests.xml.TestXmlUtils
16:17:09 [2020-07-24T20:17:09.255Z] [Fatal Error] :2:10: DOCTYPE is disallowed when the feature "http://apache.org/xml/features/disallow-doctype-decl" set to true.
16:17:09 [2020-07-24T20:17:09.511Z] [Fatal Error] :1:10: DOCTYPE is disallowed when the feature "http://apache.org/xml/features/disallow-doctype-decl" set to true.
16:17:09 [2020-07-24T20:17:09.511Z] Tests run: 8, Failures: 0, Errors: 0, Skipped: 1, Time elapsed: 0.235 s - in org.eclipse.tracecompass.common.core.tests.xml.TestXmlUtils
16:17:09 [2020-07-24T20:17:09.511Z] testSafeValidate(org.eclipse.tracecompass.common.core.tests.xml.TestXmlUtils)  Time elapsed: 0.09 s
16:17:09 [2020-07-24T20:17:09.511Z] testXmlInjection(org.eclipse.tracecompass.common.core.tests.xml.TestXmlUtils) skipped
16:17:09 [2020-07-24T20:17:09.511Z] testBillionLaughs(org.eclipse.tracecompass.common.core.tests.xml.TestXmlUtils)  Time elapsed: 0.008 s
16:17:09 [2020-07-24T20:17:09.511Z] testNewSafeSchemaFactory(org.eclipse.tracecompass.common.core.tests.xml.TestXmlUtils)  Time elapsed: 0.002 s
16:17:09 [2020-07-24T20:17:09.511Z] newSafeXmlStreamReader(org.eclipse.tracecompass.common.core.tests.xml.TestXmlUtils)  Time elapsed: 0.129 s
16:17:09 [2020-07-24T20:17:09.511Z] testRecursiveEntityReference(org.eclipse.tracecompass.common.core.tests.xml.TestXmlUtils)  Time elapsed: 0.002 s
16:17:09 [2020-07-24T20:17:09.511Z] testAttackValidate(org.eclipse.tracecompass.common.core.tests.xml.TestXmlUtils)  Time elapsed: 0.001 s
16:17:09 [2020-07-24T20:17:09.511Z] testNewSafeSaxParserFactory(org.eclipse.tracecompass.common.core.tests.xml.TestXmlUtils)  Time elapsed: 0.001 s
16:17:09 [2020-07-24T20:17:09.511Z] Running org.eclipse.tracecompass.common.core.tests.math.SaturatedArithmeticTest
16:17:09 [2020-07-24T20:17:09.511Z] Tests run: 15, Failures: 0, Errors: 0, Skipped: 0, Time elapsed: 0.001 s - in org.eclipse.tracecompass.common.core.tests.math.SaturatedArithmeticTest
16:17:09 [2020-07-24T20:17:09.511Z] testSameSign(org.eclipse.tracecompass.common.core.tests.math.SaturatedArithmeticTest)  Time elapsed: 0 s
16:17:09 [2020-07-24T20:17:09.511Z] testAdd100L(org.eclipse.tracecompass.common.core.tests.math.SaturatedArithmeticTest)  Time elapsed: 0 s
16:17:09 [2020-07-24T20:17:09.511Z] testAdd0L(org.eclipse.tracecompass.common.core.tests.math.SaturatedArithmeticTest)  Time elapsed: 0 s
16:17:09 [2020-07-24T20:17:09.511Z] testMult0(org.eclipse.tracecompass.common.core.tests.math.SaturatedArithmeticTest)  Time elapsed: 0 s
16:17:09 [2020-07-24T20:17:09.511Z] testMult1(org.eclipse.tracecompass.common.core.tests.math.SaturatedArithmeticTest)  Time elapsed: 0 s
16:17:09 [2020-07-24T20:17:09.511Z] testAdd0(org.eclipse.tracecompass.common.core.tests.math.SaturatedArithmeticTest)  Time elapsed: 0 s
16:17:09 [2020-07-24T20:17:09.511Z] testMultLimit(org.eclipse.tracecompass.common.core.tests.math.SaturatedArithmeticTest)  Time elapsed: 0 s
16:17:09 [2020-07-24T20:17:09.511Z] testAddLimit(org.eclipse.tracecompass.common.core.tests.math.SaturatedArithmeticTest)  Time elapsed: 0 s
16:17:09 [2020-07-24T20:17:09.511Z] testMultLimitL(org.eclipse.tracecompass.common.core.tests.math.SaturatedArithmeticTest)  Time elapsed: 0 s
16:17:09 [2020-07-24T20:17:09.511Z] testAddLimitL(org.eclipse.tracecompass.common.core.tests.math.SaturatedArithmeticTest)  Time elapsed: 0 s
16:17:09 [2020-07-24T20:17:09.511Z] testMult100(org.eclipse.tracecompass.common.core.tests.math.SaturatedArithmeticTest)  Time elapsed: 0 s
16:17:09 [2020-07-24T20:17:09.511Z] testAdd100(org.eclipse.tracecompass.common.core.tests.math.SaturatedArithmeticTest)  Time elapsed: 0 s
16:17:09 [2020-07-24T20:17:09.511Z] testMult100L(org.eclipse.tracecompass.common.core.tests.math.SaturatedArithmeticTest)  Time elapsed: 0 s
16:17:09 [2020-07-24T20:17:09.511Z] testMult0L(org.eclipse.tracecompass.common.core.tests.math.SaturatedArithmeticTest)  Time elapsed: 0 s
16:17:09 [2020-07-24T20:17:09.511Z] testMult1L(org.eclipse.tracecompass.common.core.tests.math.SaturatedArithmeticTest)  Time elapsed: 0 s
16:17:09 [2020-07-24T20:17:09.511Z] Running org.eclipse.tracecompass.common.core.tests.collect.BufferedBlockingQueueTest
16:17:09 [2020-07-24T20:17:09.511Z] Tests run: 13, Failures: 0, Errors: 0, Skipped: 0, Time elapsed: 0.026 s - in org.eclipse.tracecompass.common.core.tests.collect.BufferedBlockingQueueTest
16:17:09 [2020-07-24T20:17:09.511Z] testIteratorContents(org.eclipse.tracecompass.common.core.tests.collect.BufferedBlockingQueueTest)  Time elapsed: 0.011 s
16:17:09 [2020-07-24T20:17:09.511Z] testOddInsertions(org.eclipse.tracecompass.common.core.tests.collect.BufferedBlockingQueueTest)  Time elapsed: 0.006 s
16:17:09 [2020-07-24T20:17:09.511Z] testMultiThread(org.eclipse.tracecompass.common.core.tests.collect.BufferedBlockingQueueTest)  Time elapsed: 0.001 s
16:17:09 [2020-07-24T20:17:09.511Z] testConcurrentIteration(org.eclipse.tracecompass.common.core.tests.collect.BufferedBlockingQueueTest)  Time elapsed: 0.003 s
16:17:09 [2020-07-24T20:17:09.511Z] testSingleInsertion(org.eclipse.tracecompass.common.core.tests.collect.BufferedBlockingQueueTest)  Time elapsed: 0 s
16:17:09 [2020-07-24T20:17:09.511Z] testBlockingPeek(org.eclipse.tracecompass.common.core.tests.collect.BufferedBlockingQueueTest)  Time elapsed: 0.001 s
16:17:09 [2020-07-24T20:17:09.511Z] testInvalidConstructor1(org.eclipse.tracecompass.common.core.tests.collect.BufferedBlockingQueueTest)  Time elapsed: 0 s
16:17:09 [2020-07-24T20:17:09.511Z] testInvalidConstructor2(org.eclipse.tracecompass.common.core.tests.collect.BufferedBlockingQueueTest)  Time elapsed: 0.001 s
16:17:09 [2020-07-24T20:17:09.511Z] testInvalidConstructor4(org.eclipse.tracecompass.common.core.tests.collect.BufferedBlockingQueueTest)  Time elapsed: 0 s
16:17:09 [2020-07-24T20:17:09.511Z] testInvalidConstructor5(org.eclipse.tracecompass.common.core.tests.collect.BufferedBlockingQueueTest)  Time elapsed: 0 s
16:17:09 [2020-07-24T20:17:09.511Z] testIsEmpty(org.eclipse.tracecompass.common.core.tests.collect.BufferedBlockingQueueTest)  Time elapsed: 0 s
16:17:09 [2020-07-24T20:17:09.511Z] testSimpleInsertion(org.eclipse.tracecompass.common.core.tests.collect.BufferedBlockingQueueTest)  Time elapsed: 0.001 s
16:17:09 [2020-07-24T20:17:09.511Z] testLargeInsertion(org.eclipse.tracecompass.common.core.tests.collect.BufferedBlockingQueueTest)  Time elapsed: 0 s
16:17:09 [2020-07-24T20:17:09.511Z] Running org.eclipse.tracecompass.common.core.tests.ObjectUtilsTest
16:17:09 [2020-07-24T20:17:09.511Z] Tests run: 2, Failures: 0, Errors: 0, Skipped: 0, Time elapsed: 0.002 s - in org.eclipse.tracecompass.common.core.tests.ObjectUtilsTest
16:17:09 [2020-07-24T20:17:09.511Z] testDeepHashCode(org.eclipse.tracecompass.common.core.tests.ObjectUtilsTest)  Time elapsed: 0.001 s
16:17:09 [2020-07-24T20:17:09.511Z] testDeepEquals(org.eclipse.tracecompass.common.core.tests.ObjectUtilsTest)  Time elapsed: 0 s
16:17:09 [2020-07-24T20:17:09.511Z] Running org.eclipse.tracecompass.common.core.tests.log.LoggerTest
16:17:09 [2020-07-24T20:17:09.511Z] Jul 24, 2020 8:17:09 PM org.eclipse.tracecompass.common.core.log.TraceCompassLogUtils$FlowScopeLog <init>
16:17:09 [2020-07-24T20:17:09.511Z] WARNING: {"ts":"9697251017661.156","ph":"B","tid":1,"pid":1,"name":"foo"}
16:17:09 [2020-07-24T20:17:09.511Z] Jul 24, 2020 8:17:09 PM org.eclipse.tracecompass.common.core.log.TraceCompassLogUtils$FlowScopeLog <init>
16:17:09 [2020-07-24T20:17:09.511Z] WARNING: {"ts":"9697251017661.156","ph":"s","tid":1,"pid":1,"name":"foo","cat":"mydog","id":"0x1"}
16:17:09 [2020-07-24T20:17:09.511Z] Jul 24, 2020 8:17:09 PM org.eclipse.tracecompass.common.core.log.TraceCompassLogUtils$FlowScopeLog close
16:17:09 [2020-07-24T20:17:09.511Z] WARNING: {"ts":"9697251026127.191","ph":"E","tid":1,"pid":1}
16:17:09 [2020-07-24T20:17:09.511Z] Jul 24, 2020 8:17:09 PM org.eclipse.tracecompass.common.core.log.TraceCompassLogUtils$FlowScopeLog <init>
16:17:09 [2020-07-24T20:17:09.511Z] WARNING: {"ts":"9697251026925.297","ph":"B","tid":1,"pid":1,"name":"foo"}
16:17:09 [2020-07-24T20:17:09.511Z] Jul 24, 2020 8:17:09 PM org.eclipse.tracecompass.common.core.log.TraceCompassLogUtils$FlowScopeLog <init>
16:17:09 [2020-07-24T20:17:09.511Z] WARNING: {"ts":"9697251026925.297","ph":"s","tid":1,"pid":1,"name":"foo","cat":"myspider","id":"0x2"}
16:17:09 [2020-07-24T20:17:09.511Z] Jul 24, 2020 8:17:09 PM org.eclipse.tracecompass.common.core.log.TraceCompassLogUtils$FlowScopeLog close
16:17:09 [2020-07-24T20:17:09.511Z] WARNING: {"ts":"9697251028020.312","ph":"E","tid":1,"pid":1}
16:17:09 [2020-07-24T20:17:09.511Z] Jul 24, 2020 8:17:09 PM org.eclipse.tracecompass.common.core.log.TraceCompassLogUtils$FlowScopeLog <init>
16:17:09 [2020-07-24T20:17:09.511Z] WARNING: {"ts":"9697251030999.62","ph":"B","tid":1,"pid":1,"name":"foo"}
16:17:09 [2020-07-24T20:17:09.511Z] Jul 24, 2020 8:17:09 PM org.eclipse.tracecompass.common.core.log.TraceCompassLogUtils$FlowScopeLog <init>
16:17:09 [2020-07-24T20:17:09.511Z] WARNING: {"ts":"9697251030999.62","ph":"s","tid":1,"pid":1,"name":"foo","cat":"null","id":"0x3"}
16:17:09 [2020-07-24T20:17:09.511Z] Jul 24, 2020 8:17:09 PM org.eclipse.tracecompass.common.core.log.TraceCompassLogUtils$FlowScopeLog close
16:17:09 [2020-07-24T20:17:09.512Z] WARNING: {"ts":"9697251031568.316","ph":"E","tid":1,"pid":1}
16:17:09 [2020-07-24T20:17:09.512Z] Jul 24, 2020 8:17:09 PM org.eclipse.tracecompass.common.core.log.TraceCompassLogUtils$ScopeLog <init>
16:17:09 [2020-07-24T20:17:09.512Z] WARNING: {"ts":"9697251032279.932","ph":"B","tid":1,"pid":1,"name":"foo"}
16:17:09 [2020-07-24T20:17:09.512Z] Jul 24, 2020 8:17:09 PM org.eclipse.tracecompass.common.core.log.TraceCompassLogUtils$ScopeLog close
16:17:09 [2020-07-24T20:17:09.512Z] WARNING: {"ts":"9697251033274.057","ph":"E","tid":1,"pid":1}
16:17:09 [2020-07-24T20:17:09.512Z] Jul 24, 2020 8:17:09 PM org.eclipse.tracecompass.common.core.log.TraceCompassLogUtils$FlowScopeLog <init>
16:17:09 [2020-07-24T20:17:09.512Z] WARNING: {"ts":"9697251035078.68","ph":"B","tid":1,"pid":1,"name":"foo"}
16:17:09 [2020-07-24T20:17:09.512Z] Jul 24, 2020 8:17:09 PM org.eclipse.tracecompass.common.core.log.TraceCompassLogUtils$FlowScopeLog <init>
16:17:09 [2020-07-24T20:17:09.512Z] WARNING: {"ts":"9697251035078.68","ph":"s","tid":1,"pid":1,"name":"foo","cat":"myspider","id":"0x5"}
16:17:09 [2020-07-24T20:17:09.512Z] Jul 24, 2020 8:17:09 PM org.eclipse.tracecompass.common.core.log.TraceCompassLogUtils$FlowScopeLog close
16:17:09 [2020-07-24T20:17:09.512Z] WARNING: {"ts":"9697251035611.352","ph":"E","tid":1,"pid":1}
16:17:09 [2020-07-24T20:17:09.512Z] Jul 24, 2020 8:17:09 PM org.eclipse.tracecompass.common.core.log.TraceCompassLogUtils$ScopeLog <init>
16:17:09 [2020-07-24T20:17:09.512Z] INFO: {"ts":"9697251039517.254","ph":"B","tid":1,"pid":1,"name":"foo"}
16:17:09 [2020-07-24T20:17:09.512Z] Jul 24, 2020 8:17:09 PM org.eclipse.tracecompass.common.core.log.TraceCompassLogUtils$ScopeLog <init>
16:17:09 [2020-07-24T20:17:09.512Z] INFO: {"ts":"9697251039760.4","ph":"B","tid":1,"pid":1,"name":"bar"}
16:17:09 [2020-07-24T20:17:09.512Z] Jul 24, 2020 8:17:09 PM org.eclipse.tracecompass.common.core.log.TraceCompassLogUtils$ScopeLog close
16:17:09 [2020-07-24T20:17:09.512Z] INFO: {"ts":"9697251039998.572","ph":"E","tid":1,"pid":1}
16:17:09 [2020-07-24T20:17:09.512Z] Jul 24, 2020 8:17:09 PM org.eclipse.tracecompass.common.core.log.TraceCompassLogUtils$ScopeLog close
16:17:09 [2020-07-24T20:17:09.512Z] INFO: {"ts":"9697251040209.834","ph":"E","tid":1,"pid":1}
16:17:09 [2020-07-24T20:17:09.512Z] Jul 24, 2020 8:17:09 PM org.eclipse.tracecompass.common.core.log.TraceCompassLogUtils$ScopeLog <init>
16:17:09 [2020-07-24T20:17:09.512Z] WARNING: {"ts":"9697251040858.572","ph":"B","tid":1,"pid":1,"name":"foo","args":{"Pen:Pineapple":"Apple:Pen"}}
16:17:09 [2020-07-24T20:17:09.512Z] Jul 24, 2020 8:17:09 PM org.eclipse.tracecompass.common.core.log.TraceCompassLogUtils$ScopeLog close
16:17:09 [2020-07-24T20:17:09.512Z] WARNING: {"ts":"9697251041136.174","ph":"E","tid":1,"pid":1}
16:17:09 [2020-07-24T20:17:09.512Z] Jul 24, 2020 8:17:09 PM org.eclipse.tracecompass.common.core.log.TraceCompassLogUtils$ScopeLog <init>
16:17:09 [2020-07-24T20:17:09.512Z] WARNING: {"ts":"9697251041370.02","ph":"B","tid":1,"pid":1,"name":"foo","args":{"msg":"Pen:Pineapple:Apple:Pen"}}
16:17:09 [2020-07-24T20:17:09.512Z] Jul 24, 2020 8:17:09 PM org.eclipse.tracecompass.common.core.log.TraceCompassLogUtils$ScopeLog close
16:17:09 [2020-07-24T20:17:09.512Z] WARNING: {"ts":"9697251041584.5","ph":"E","tid":1,"pid":1}
16:17:09 [2020-07-24T20:17:09.512Z] Jul 24, 2020 8:17:09 PM org.eclipse.tracecompass.common.core.log.TraceCompassLogUtils$ScopeLog <init>
16:17:09 [2020-07-24T20:17:09.512Z] WARNING: {"ts":"9697251041936.998","ph":"B","tid":1,"pid":1,"name":"foo","args":{"pen":"pineapple","apple":"pen","number_of_badgers":12}}
16:17:09 [2020-07-24T20:17:09.512Z] Jul 24, 2020 8:17:09 PM org.eclipse.tracecompass.common.core.log.TraceCompassLogUtils$ScopeLog close
16:17:09 [2020-07-24T20:17:09.512Z] WARNING: {"ts":"9697251042154.08","ph":"E","tid":1,"pid":1}
16:17:09 [2020-07-24T20:17:09.512Z] Jul 24, 2020 8:17:09 PM org.eclipse.tracecompass.common.core.log.TraceCompassLogUtils$ScopeLog <init>
16:17:09 [2020-07-24T20:17:09.512Z] WARNING: {"ts":"9697251042680.348","ph":"B","tid":1,"pid":1,"name":"foo"}
16:17:09 [2020-07-24T20:17:09.512Z] Jul 24, 2020 8:17:09 PM org.eclipse.tracecompass.common.core.log.TraceCompassLogUtils$ScopeLog close
16:17:09 [2020-07-24T20:17:09.512Z] WARNING: {"ts":"9697251043192.416","ph":"E","tid":1,"pid":1}
16:17:09 [2020-07-24T20:17:09.512Z] Jul 24, 2020 8:17:09 PM org.eclipse.tracecompass.common.core.log.TraceCompassLogUtils$FlowScopeLog <init>
16:17:09 [2020-07-24T20:17:09.512Z] WARNING: {"ts":"9697251101255.572","ph":"B","tid":1,"pid":1,"name":"foo"}
16:17:09 [2020-07-24T20:17:09.512Z] Jul 24, 2020 8:17:09 PM org.eclipse.tracecompass.common.core.log.TraceCompassLogUtils$FlowScopeLog <init>
16:17:09 [2020-07-24T20:17:09.512Z] WARNING: {"ts":"9697251101255.572","ph":"s","tid":1,"pid":1,"name":"foo","cat":"mydog","id":"0x6"}
16:17:09 [2020-07-24T20:17:09.512Z] Jul 24, 2020 8:17:09 PM org.eclipse.tracecompass.common.core.log.TraceCompassLogUtils$FlowScopeLog close
16:17:09 [2020-07-24T20:17:09.512Z] WARNING: {"ts":"9697251102180.174","ph":"E","tid":1,"pid":1}
16:17:09 [2020-07-24T20:17:09.512Z] Jul 24, 2020 8:17:09 PM org.eclipse.tracecompass.common.core.log.TraceCompassLogUtils traceInstant
16:17:09 [2020-07-24T20:17:09.512Z] INFO: {"ts":"9697251103041.623","ph":"i","tid":1,"pid":1,"name":"test null value","args":{"nullvalue":"null"}}
16:17:09 [2020-07-24T20:17:09.512Z] Jul 24, 2020 8:17:09 PM org.eclipse.tracecompass.common.core.log.TraceCompassLogUtils traceInstant
16:17:09 [2020-07-24T20:17:09.512Z] INFO: {"ts":"9697251103538.73","ph":"i","tid":1,"pid":1,"name":"test null key","args":{"null":"value"}}
16:17:09 [2020-07-24T20:17:09.512Z] Jul 24, 2020 8:17:09 PM org.eclipse.tracecompass.common.core.log.TraceCompassLogUtils$ScopeLog <init>
16:17:09 [2020-07-24T20:17:09.512Z] INFO: {"ts":"9697251103917.469","ph":"B","tid":1,"pid":1,"name":"foo"}
16:17:09 [2020-07-24T20:17:09.512Z] Jul 24, 2020 8:17:09 PM org.eclipse.tracecompass.common.core.log.TraceCompassLogUtils$ScopeLog <init>
16:17:09 [2020-07-24T20:17:09.512Z] INFO: {"ts":"9697251104122.893","ph":"B","tid":1,"pid":1,"name":"bar"}
16:17:09 [2020-07-24T20:17:09.512Z] Jul 24, 2020 8:17:09 PM org.eclipse.tracecompass.common.core.log.TraceCompassLogUtils$ScopeLog close
16:17:09 [2020-07-24T20:17:09.512Z] INFO: {"ts":"9697251104306.074","ph":"E","tid":1,"pid":1}
16:17:09 [2020-07-24T20:17:09.512Z] Jul 24, 2020 8:17:09 PM org.eclipse.tracecompass.common.core.log.TraceCompassLogUtils$ScopeLog close
16:17:09 [2020-07-24T20:17:09.512Z] INFO: {"ts":"9697251104488.365","ph":"E","tid":1,"pid":1}
16:17:09 [2020-07-24T20:17:09.512Z] Jul 24, 2020 8:17:09 PM org.eclipse.tracecompass.common.core.log.TraceCompassLogUtils$FlowScopeLog <init>
16:17:09 [2020-07-24T20:17:09.512Z] WARNING: {"ts":"9697251104942.732","ph":"B","tid":1,"pid":1,"name":"foo"}
16:17:09 [2020-07-24T20:17:09.512Z] Jul 24, 2020 8:17:09 PM org.eclipse.tracecompass.common.core.log.TraceCompassLogUtils$FlowScopeLog <init>
16:17:09 [2020-07-24T20:17:09.512Z] WARNING: {"ts":"9697251104942.732","ph":"s","tid":1,"pid":1,"name":"foo","cat":"myspider","id":"0x7"}
16:17:09 [2020-07-24T20:17:09.512Z] Jul 24, 2020 8:17:09 PM org.eclipse.tracecompass.common.core.log.TraceCompassLogUtils$FlowScopeLog close
16:17:09 [2020-07-24T20:17:09.512Z] WARNING: {"ts":"9697251105403.268","ph":"E","tid":1,"pid":1}
16:17:09 [2020-07-24T20:17:09.512Z] Jul 24, 2020 8:17:09 PM org.eclipse.tracecompass.common.core.log.TraceCompassLogUtils$ScopeLog <init>
16:17:09 [2020-07-24T20:17:09.512Z] INFO: {"ts":"9697251107957.535","ph":"B","tid":1,"pid":1,"name":"world"}
16:17:09 [2020-07-24T20:17:09.512Z] Jul 24, 2020 8:17:09 PM org.eclipse.tracecompass.common.core.log.TraceCompassLogUtils$ScopeLog close
16:17:09 [2020-07-24T20:17:09.512Z] INFO: {"ts":"9697251108152.914","ph":"E","tid":1,"pid":1}
16:17:09 [2020-07-24T20:17:09.512Z] Tests run: 23, Failures: 0, Errors: 0, Skipped: 0, Time elapsed: 0.095 s - in org.eclipse.tracecompass.common.core.tests.log.LoggerTest
16:17:09 [2020-07-24T20:17:09.512Z] testFlowLogLevels(org.eclipse.tracecompass.common.core.tests.log.LoggerTest)  Time elapsed: 0.012 s
16:17:09 [2020-07-24T20:17:09.512Z] testFlowWithData(org.eclipse.tracecompass.common.core.tests.log.LoggerTest)  Time elapsed: 0.001 s
16:17:09 [2020-07-24T20:17:09.512Z] testObjectLifespan(org.eclipse.tracecompass.common.core.tests.log.LoggerTest)  Time elapsed: 0.002 s
16:17:09 [2020-07-24T20:17:09.512Z] testFlowBuilderNoExtra(org.eclipse.tracecompass.common.core.tests.log.LoggerTest)  Time elapsed: 0.001 s
16:17:09 [2020-07-24T20:17:09.512Z] testNestingWithData(org.eclipse.tracecompass.common.core.tests.log.LoggerTest)  Time elapsed: 0.002 s
16:17:09 [2020-07-24T20:17:09.512Z] testFlowFiltered(org.eclipse.tracecompass.common.core.tests.log.LoggerTest)  Time elapsed: 0.001 s
16:17:09 [2020-07-24T20:17:09.512Z] testFlowBuilderCatThenParent(org.eclipse.tracecompass.common.core.tests.log.LoggerTest)  Time elapsed: 0.001 s
16:17:09 [2020-07-24T20:17:09.512Z] testNestingFiltered(org.eclipse.tracecompass.common.core.tests.log.LoggerTest)  Time elapsed: 0.001 s
16:17:09 [2020-07-24T20:17:09.512Z] testAsyncMessages(org.eclipse.tracecompass.common.core.tests.log.LoggerTest)  Time elapsed: 0.002 s
16:17:09 [2020-07-24T20:17:09.512Z] testNestingException(org.eclipse.tracecompass.common.core.tests.log.LoggerTest)  Time elapsed: 0.002 s
16:17:09 [2020-07-24T20:17:09.512Z] testAttributeFailRepeatedArgs(org.eclipse.tracecompass.common.core.tests.log.LoggerTest)  Time elapsed: 0 s
16:17:09 [2020-07-24T20:17:09.512Z] testAttributes(org.eclipse.tracecompass.common.core.tests.log.LoggerTest)  Time elapsed: 0.002 s
16:17:09 [2020-07-24T20:17:09.512Z] testNestingLogLevels(org.eclipse.tracecompass.common.core.tests.log.LoggerTest)  Time elapsed: 0.001 s
16:17:09 [2020-07-24T20:17:09.512Z] testCounter(org.eclipse.tracecompass.common.core.tests.log.LoggerTest)  Time elapsed: 0.057 s
16:17:09 [2020-07-24T20:17:09.512Z] testFlowWithUnsetParent(org.eclipse.tracecompass.common.core.tests.log.LoggerTest)  Time elapsed: 0.002 s
16:17:09 [2020-07-24T20:17:09.512Z] testNullArguments(org.eclipse.tracecompass.common.core.tests.log.LoggerTest)  Time elapsed: 0.001 s
16:17:09 [2020-07-24T20:17:09.512Z] testNesting(org.eclipse.tracecompass.common.core.tests.log.LoggerTest)  Time elapsed: 0.001 s
16:17:09 [2020-07-24T20:17:09.512Z] testFlowBuilderParentThenCat(org.eclipse.tracecompass.common.core.tests.log.LoggerTest)  Time elapsed: 0.001 s
16:17:09 [2020-07-24T20:17:09.512Z] testMarker(org.eclipse.tracecompass.common.core.tests.log.LoggerTest)  Time elapsed: 0.001 s
16:17:09 [2020-07-24T20:17:09.512Z] testInstant(org.eclipse.tracecompass.common.core.tests.log.LoggerTest)  Time elapsed: 0 s
16:17:09 [2020-07-24T20:17:09.512Z] testCollectionLifespan(org.eclipse.tracecompass.common.core.tests.log.LoggerTest)  Time elapsed: 0.001 s
16:17:09 [2020-07-24T20:17:09.512Z] testHelloWorld(org.eclipse.tracecompass.common.core.tests.log.LoggerTest)  Time elapsed: 0 s
16:17:09 [2020-07-24T20:17:09.512Z] testAttributeFail3Args(org.eclipse.tracecompass.common.core.tests.log.LoggerTest)  Time elapsed: 0.001 s
16:17:09 [2020-07-24T20:17:09.512Z] Running org.eclipse.tracecompass.common.core.tests.NonNullUtilsTest
16:17:09 [2020-07-24T20:17:09.769Z] Tests run: 6, Failures: 0, Errors: 0, Skipped: 0, Time elapsed: 0.003 s - in org.eclipse.tracecompass.common.core.tests.NonNullUtilsTest
16:17:09 [2020-07-24T20:17:09.769Z] testCheckContentsArrayNullElement(org.eclipse.tracecompass.common.core.tests.NonNullUtilsTest)  Time elapsed: 0 s
16:17:09 [2020-07-24T20:17:09.769Z] testCheckContentsArray(org.eclipse.tracecompass.common.core.tests.NonNullUtilsTest)  Time elapsed: 0.001 s
16:17:09 [2020-07-24T20:17:09.769Z] testCheckContentsArrayNullRef(org.eclipse.tracecompass.common.core.tests.NonNullUtilsTest)  Time elapsed: 0 s
16:17:09 [2020-07-24T20:17:09.769Z] testCheckContentsStreamNullElement(org.eclipse.tracecompass.common.core.tests.NonNullUtilsTest)  Time elapsed: 0 s
16:17:09 [2020-07-24T20:17:09.769Z] testCheckContentsStreamNullRef(org.eclipse.tracecompass.common.core.tests.NonNullUtilsTest)  Time elapsed: 0 s
16:17:09 [2020-07-24T20:17:09.769Z] testCheckContentsStream(org.eclipse.tracecompass.common.core.tests.NonNullUtilsTest)  Time elapsed: 0 s
16:17:09 [2020-07-24T20:17:09.769Z] 
16:17:09 [2020-07-24T20:17:09.769Z] Results:
16:17:09 [2020-07-24T20:17:09.769Z] 
16:17:09 [2020-07-24T20:17:09.769Z] Failures: 
16:17:09 [2020-07-24T20:17:09.769Z]   DecimalUnitFormatTest>FormatTestBase.testFormat:78 format value expected:<[�]> but was:<[NaN]>
16:17:09 [2020-07-24T20:17:09.769Z]   DecimalUnitFormatTest>FormatTestBase.testParseObject2:111 parseObject with pos value expected:<NaN> but was:<null>
16:17:09 [2020-07-24T20:17:09.769Z]   DecimalUnitFormatTest>FormatTestBase.testParseObject2:111 parseObject with pos value expected:<NaN> but was:<null>
16:17:09 [2020-07-24T20:17:09.769Z] Errors: 
16:17:09 [2020-07-24T20:17:09.769Z]   DecimalUnitFormatTest>FormatTestBase.testParseObject:91 » Parse Format.parseOb...
16:17:09 [2020-07-24T20:17:09.769Z]   DecimalUnitFormatTest>FormatTestBase.testParseObject:91 » Parse Format.parseOb...
16:17:09 [2020-07-24T20:17:09.769Z] 
16:17:09 [2020-07-24T20:17:09.769Z] Tests run: 696, Failures: 3, Errors: 2, Skipped: 1
16:17:09 [2020-07-24T20:17:09.769Z] 
16:17:10 [2020-07-24T20:17:10.331Z] [INFO] ------------------------------------------------------------------------
16:17:10 [2020-07-24T20:17:10.331Z] [INFO] Reactor Summary:
16:17:10 [2020-07-24T20:17:10.331Z] [INFO] 
16:17:10 [2020-07-24T20:17:10.331Z] [INFO] Trace Compass Parent 6.0.0-SNAPSHOT ................ SUCCESS [ 58.052 s]
16:17:10 [2020-07-24T20:17:10.331Z] [INFO] Trace Compass Tracetype-agnostic Analyses Parent 6.0.0-SNAPSHOT SUCCESS [  0.007 s]
16:17:10 [2020-07-24T20:17:10.331Z] [INFO] Trace Compass Common Utilities Parent 6.0.0-SNAPSHOT SUCCESS [  0.006 s]
16:17:10 [2020-07-24T20:17:10.331Z] [INFO] org.eclipse.tracecompass.common.core 4.3.0-SNAPSHOT  SUCCESS [ 19.099 s]
16:17:10 [2020-07-24T20:17:10.331Z] [INFO] Trace Compass State System Parent 6.0.0-SNAPSHOT ... SUCCESS [  0.007 s]
16:17:10 [2020-07-24T20:17:10.331Z] [INFO] org.eclipse.tracecompass.datastore.core 1.2.1-SNAPSHOT SUCCESS [  3.610 s]
16:17:10 [2020-07-24T20:17:10.331Z] [INFO] org.eclipse.tracecompass.segmentstore.core 3.0.0-SNAPSHOT SUCCESS [  2.995 s]
16:17:10 [2020-07-24T20:17:10.331Z] [INFO] org.eclipse.tracecompass.statesystem.core 5.0.0-SNAPSHOT SUCCESS [  3.588 s]
16:17:10 [2020-07-24T20:17:10.331Z] [INFO] Trace Compass TMF Parent 6.0.0-SNAPSHOT ............ SUCCESS [  0.007 s]
16:17:10 [2020-07-24T20:17:10.331Z] [INFO] Trace Compass Filter Parser 1.0.5-SNAPSHOT ......... SUCCESS [  2.708 s]
16:17:10 [2020-07-24T20:17:10.331Z] [INFO] org.eclipse.tracecompass.tmf.core 6.1.0-SNAPSHOT ... SUCCESS [  8.586 s]
16:17:10 [2020-07-24T20:17:10.331Z] [INFO] org.eclipse.tracecompass.analysis.counters.core 2.0.4-SNAPSHOT SUCCESS [  2.664 s]
16:17:10 [2020-07-24T20:17:10.331Z] [INFO] Trace Compass CTF Support Parent 6.0.0-SNAPSHOT .... SUCCESS [  0.006 s]
16:17:10 [2020-07-24T20:17:10.331Z] [INFO] Trace Compass CTF Parser Plug-in 1.0.5-SNAPSHOT .... SUCCESS [  7.423 s]
16:17:10 [2020-07-24T20:17:10.331Z] [INFO] org.eclipse.tracecompass.ctf.core 4.0.3-SNAPSHOT ... SUCCESS [  4.118 s]
16:17:10 [2020-07-24T20:17:10.331Z] [INFO] Trace Compass CTF Core Tests Plug-in 1.0.8-SNAPSHOT  SUCCESS [ 37.958 s]
16:17:10 [2020-07-24T20:17:10.331Z] [INFO] org.eclipse.tracecompass.statesystem.core.tests 1.0.12-SNAPSHOT SUCCESS [ 13.815 s]
16:17:10 [2020-07-24T20:17:10.331Z] [INFO] org.eclipse.tracecompass.tmf.core.tests 1.0.13-SNAPSHOT SUCCESS [04:42 min]
16:17:10 [2020-07-24T20:17:10.331Z] [INFO] org.eclipse.tracecompass.tmf.ctf.core 4.2.1-SNAPSHOT SUCCESS [  3.371 s]
16:17:10 [2020-07-24T20:17:10.331Z] [INFO] org.eclipse.tracecompass.tmf.ctf.core.tests 1.0.11-SNAPSHOT SUCCESS [03:32 min]
16:17:10 [2020-07-24T20:17:10.331Z] [INFO] org.eclipse.tracecompass.analysis.counters.core.tests 1.0.0-SNAPSHOT SUCCESS [  7.298 s]
16:17:10 [2020-07-24T20:17:10.331Z] [INFO] org.eclipse.tracecompass.tmf.ui 6.1.0-SNAPSHOT ..... SUCCESS [ 13.984 s]
16:17:10 [2020-07-24T20:17:10.331Z] [INFO] org.eclipse.tracecompass.analysis.counters.ui 1.0.0-SNAPSHOT SUCCESS [  2.544 s]
16:17:10 [2020-07-24T20:17:10.331Z] [INFO] org.eclipse.tracecompass.tmf.ui.tests 1.0.14-SNAPSHOT SUCCESS [02:35 min]
16:17:10 [2020-07-24T20:17:10.331Z] [INFO] org.eclipse.tracecompass.tmf.ui.swtbot.tests 1.0.13-SNAPSHOT SUCCESS [04:39 min]
16:17:10 [2020-07-24T20:17:10.331Z] [INFO] org.eclipse.tracecompass.analysis.graph.core 2.1.6-SNAPSHOT SUCCESS [  3.481 s]
16:17:10 [2020-07-24T20:17:10.331Z] [INFO] org.eclipse.tracecompass.tmf.chart.core 1.0.3-SNAPSHOT SUCCESS [  2.630 s]
16:17:10 [2020-07-24T20:17:10.331Z] [INFO] org.eclipse.tracecompass.analysis.lami.core 1.1.2-SNAPSHOT SUCCESS [  2.848 s]
16:17:10 [2020-07-24T20:17:10.331Z] [INFO] org.eclipse.tracecompass.analysis.timing.core 5.2.0-SNAPSHOT SUCCESS [  2.869 s]
16:17:10 [2020-07-24T20:17:10.331Z] [INFO] org.eclipse.tracecompass.analysis.os.linux.core 5.0.0-SNAPSHOT SUCCESS [  3.702 s]
16:17:10 [2020-07-24T20:17:10.331Z] [INFO] Trace Compass LTTng Support Parent 6.0.0-SNAPSHOT .. SUCCESS [  0.006 s]
16:17:10 [2020-07-24T20:17:10.331Z] [INFO] org.eclipse.tracecompass.lttng2.common.core 1.1.2-SNAPSHOT SUCCESS [  2.449 s]
16:17:10 [2020-07-24T20:17:10.331Z] [INFO] org.eclipse.tracecompass.tmf.analysis.xml.core 4.0.0-SNAPSHOT SUCCESS [  3.889 s]
16:17:10 [2020-07-24T20:17:10.331Z] [INFO] org.eclipse.tracecompass.lttng2.kernel.core 3.0.4-SNAPSHOT SUCCESS [  2.794 s]
16:17:10 [2020-07-24T20:17:10.331Z] [INFO] org.eclipse.tracecompass.analysis.counters.ui.swtbot.tests 1.0.0-SNAPSHOT SUCCESS [01:27 min]
16:17:10 [2020-07-24T20:17:10.331Z] [INFO] org.eclipse.tracecompass.analysis.graph.core.tests 1.0.5-SNAPSHOT SUCCESS [  8.475 s]
16:17:10 [2020-07-24T20:17:10.331Z] [INFO] org.eclipse.tracecompass.analysis.graph.ui 1.0.10-SNAPSHOT SUCCESS [  2.899 s]
16:17:10 [2020-07-24T20:17:10.331Z] [INFO] org.eclipse.tracecompass.analysis.lami.core.tests 1.0.3-SNAPSHOT SUCCESS [  6.801 s]
16:17:10 [2020-07-24T20:17:10.331Z] [INFO] org.eclipse.tracecompass.tmf.chart.ui 1.0.10-SNAPSHOT SUCCESS [  2.983 s]
16:17:10 [2020-07-24T20:17:10.331Z] [INFO] org.eclipse.tracecompass.analysis.lami.ui 1.1.3-SNAPSHOT SUCCESS [  2.829 s]
16:17:10 [2020-07-24T20:17:10.331Z] [INFO] org.eclipse.tracecompass.tmf.chart.core.tests 1.0.2-SNAPSHOT SUCCESS [  7.002 s]
16:17:10 [2020-07-24T20:17:10.331Z] [INFO] org.eclipse.tracecompass.tmf.chart.ui.swtbot.tests 1.0.5-SNAPSHOT SUCCESS [ 13.696 s]
16:17:10 [2020-07-24T20:17:10.331Z] [INFO] org.eclipse.tracecompass.analysis.lami.ui.swtbot.tests 1.0.5-SNAPSHOT SUCCESS [ 22.507 s]
16:17:10 [2020-07-24T20:17:10.331Z] [INFO] org.eclipse.tracecompass.analysis.os.linux.core.tests 1.0.13-SNAPSHOT SUCCESS [01:59 min]
16:17:10 [2020-07-24T20:17:10.331Z] [INFO] org.eclipse.tracecompass.analysis.timing.ui 4.2.0-SNAPSHOT SUCCESS [  3.542 s]
16:17:10 [2020-07-24T20:17:10.331Z] [INFO] org.eclipse.tracecompass.analysis.os.linux.ui 4.0.0-SNAPSHOT SUCCESS [  3.239 s]
16:17:10 [2020-07-24T20:17:10.331Z] [INFO] org.eclipse.tracecompass.analysis.os.linux.ui.tests 1.0.8-SNAPSHOT SUCCESS [ 12.311 s]
16:17:10 [2020-07-24T20:17:10.331Z] [INFO] org.eclipse.tracecompass.analysis.timing.core.tests 1.0.5-SNAPSHOT SUCCESS [ 11.936 s]
16:17:10 [2020-07-24T20:17:10.331Z] [INFO] org.eclipse.tracecompass.analysis.timing.ui.swtbot.tests 1.0.9-SNAPSHOT SUCCESS [ 39.271 s]
16:17:10 [2020-07-24T20:17:10.331Z] [INFO] org.eclipse.tracecompass.analysis.os.linux.ui.swtbot.tests 1.0.14-SNAPSHOT SUCCESS [01:10 min]
16:17:10 [2020-07-24T20:17:10.331Z] [INFO] org.eclipse.tracecompass.analysis.profiling.core 2.0.0-SNAPSHOT SUCCESS [  2.905 s]
16:17:10 [2020-07-24T20:17:10.331Z] [INFO] org.eclipse.tracecompass.analysis.profiling.core.tests 1.0.4-SNAPSHOT SUCCESS [ 30.405 s]
16:17:10 [2020-07-24T20:17:10.331Z] [INFO] org.eclipse.tracecompass.analysis.profiling.ui 2.1.0-SNAPSHOT SUCCESS [  2.803 s]
16:17:10 [2020-07-24T20:17:10.331Z] [INFO] org.eclipse.tracecompass.analysis.profiling.ui.swtbot.tests 1.0.4-SNAPSHOT SUCCESS [ 14.283 s]
16:17:10 [2020-07-24T20:17:10.331Z] [INFO] Trace Compass BTF Support Parent 6.0.0-SNAPSHOT .... SUCCESS [  0.012 s]
16:17:10 [2020-07-24T20:17:10.331Z] [INFO] org.eclipse.tracecompass.btf.core 2.2.2-SNAPSHOT ... SUCCESS [  2.887 s]
16:17:10 [2020-07-24T20:17:10.331Z] [INFO] Trace Compass Documentation 6.0.0-SNAPSHOT ......... SUCCESS [  0.006 s]
16:17:10 [2020-07-24T20:17:10.331Z] [INFO] Trace Compass Developer Guide 6.0.0-SNAPSHOT ....... SUCCESS [ 23.800 s]
16:17:10 [2020-07-24T20:17:10.331Z] [INFO] org.eclipse.tracecompass.tmf.analysis.xml.ui 2.1.12-SNAPSHOT SUCCESS [  2.892 s]
16:17:10 [2020-07-24T20:17:10.331Z] [INFO] org.eclipse.tracecompass.tmf 6.0.0-SNAPSHOT ........ SUCCESS [  2.580 s]
16:17:10 [2020-07-24T20:17:10.331Z] [INFO] org.eclipse.tracecompass.btf.ui 1.0.3-SNAPSHOT ..... SUCCESS [  2.459 s]
16:17:10 [2020-07-24T20:17:10.331Z] [INFO] org.eclipse.tracecompass.btf 6.0.0-SNAPSHOT ........ SUCCESS [  2.190 s]
16:17:10 [2020-07-24T20:17:10.331Z] [INFO] org.eclipse.tracecompass.btf.core.tests 1.0.2-SNAPSHOT SUCCESS [  7.497 s]
16:17:10 [2020-07-24T20:17:10.331Z] [INFO] org.eclipse.tracecompass.common.core.tests 1.1.8-SNAPSHOT FAILURE [  7.048 s]
16:17:10 [2020-07-24T20:17:10.331Z] [INFO] org.eclipse.tracecompass.ctf 6.0.0-SNAPSHOT ........ SKIPPED
16:17:10 [2020-07-24T20:17:10.331Z] [INFO] org.eclipse.tracecompass.ctf.parser.tests 1.0.2-SNAPSHOT SKIPPED
16:17:10 [2020-07-24T20:17:10.331Z] [INFO] org.eclipse.tracecompass.tmf.ctf 6.0.0-SNAPSHOT .... SKIPPED
16:17:10 [2020-07-24T20:17:10.331Z] [INFO] org.eclipse.tracecompass.tmf.ctf.ui.swtbot.tests 1.0.10-SNAPSHOT SKIPPED
16:17:10 [2020-07-24T20:17:10.331Z] [INFO] Trace Compass User Guide 6.0.0-SNAPSHOT ............ SKIPPED
16:17:10 [2020-07-24T20:17:10.331Z] [INFO] Trace Compass GDB Tracepoint Analysis User Guide 6.0.0-SNAPSHOT SKIPPED
16:17:10 [2020-07-24T20:17:10.331Z] [INFO] Trace Compass RCP User Guide 6.0.0-SNAPSHOT ........ SKIPPED
16:17:10 [2020-07-24T20:17:10.331Z] [INFO] Trace Compass Pcap User Guide 6.0.0-SNAPSHOT ....... SKIPPED
16:17:10 [2020-07-24T20:17:10.331Z] [INFO] org.eclipse.tracecompass.examples 1.0.6-SNAPSHOT ... SKIPPED
16:17:10 [2020-07-24T20:17:10.331Z] [INFO] Trace Compass GDB Tracepoint Analysis Parent 6.0.0-SNAPSHOT SKIPPED
16:17:10 [2020-07-24T20:17:10.331Z] [INFO] org.eclipse.tracecompass.gdbtrace.core 1.0.6-SNAPSHOT SKIPPED
16:17:10 [2020-07-24T20:17:10.331Z] [INFO] org.eclipse.tracecompass.gdbtrace.ui 1.1.3-SNAPSHOT  SKIPPED
16:17:10 [2020-07-24T20:17:10.331Z] [INFO] org.eclipse.tracecompass.gdbtrace 6.0.0-SNAPSHOT ... SKIPPED
16:17:10 [2020-07-24T20:17:10.331Z] [INFO] org.eclipse.tracecompass.gdbtrace.core.tests 1.0.1-SNAPSHOT SKIPPED
16:17:10 [2020-07-24T20:17:10.331Z] [INFO] org.eclipse.tracecompass.gdbtrace.ui.tests 1.0.1-SNAPSHOT SKIPPED
16:17:10 [2020-07-24T20:17:10.331Z] [INFO] org.eclipse.tracecompass.lttng2.common.core.tests 1.0.1-SNAPSHOT SKIPPED
16:17:10 [2020-07-24T20:17:10.331Z] [INFO] org.eclipse.tracecompass.lttng2.control.core 1.2.4-SNAPSHOT SKIPPED
16:17:10 [2020-07-24T20:17:10.331Z] [INFO] org.eclipse.tracecompass.tmf.remote.core 2.0.4-SNAPSHOT SKIPPED
16:17:10 [2020-07-24T20:17:10.331Z] [INFO] org.eclipse.tracecompass.tmf.remote.ui 1.0.8-SNAPSHOT SKIPPED
16:17:10 [2020-07-24T20:17:10.331Z] [INFO] org.eclipse.tracecompass.lttng2.control.ui 1.2.11-SNAPSHOT SKIPPED
16:17:10 [2020-07-24T20:17:10.331Z] [INFO] org.eclipse.tracecompass.lttng2.control 6.0.0-SNAPSHOT SKIPPED
16:17:10 [2020-07-24T20:17:10.331Z] [INFO] org.eclipse.tracecompass.lttng2.control.core.tests 1.1.2-SNAPSHOT SKIPPED
16:17:10 [2020-07-24T20:17:10.331Z] [INFO] org.eclipse.tracecompass.tmf.remote.core.tests 1.0.1-SNAPSHOT SKIPPED
16:17:10 [2020-07-24T20:17:10.331Z] [INFO] org.eclipse.tracecompass.lttng2.control.ui.tests 2.0.4-SNAPSHOT SKIPPED
16:17:10 [2020-07-24T20:17:10.331Z] [INFO] org.eclipse.tracecompass.lttng2.control.ui.swtbot.tests 1.0.7-SNAPSHOT SKIPPED
16:17:10 [2020-07-24T20:17:10.331Z] [INFO] org.eclipse.tracecompass.lttng2.kernel.ui 2.0.1-SNAPSHOT SKIPPED
16:17:10 [2020-07-24T20:17:10.331Z] [INFO] org.eclipse.tracecompass.lttng2.kernel 6.0.0-SNAPSHOT SKIPPED
16:17:10 [2020-07-24T20:17:10.331Z] [INFO] org.eclipse.tracecompass.tmf.analysis.xml.core.tests 1.0.12-SNAPSHOT SKIPPED
16:17:10 [2020-07-24T20:17:10.331Z] [INFO] org.eclipse.tracecompass.lttng2.kernel.core.tests 2.0.1-SNAPSHOT SKIPPED
16:17:10 [2020-07-24T20:17:10.331Z] [INFO] org.eclipse.tracecompass.lttng2.kernel.ui.swtbot.tests 1.0.14-SNAPSHOT SKIPPED
16:17:10 [2020-07-24T20:17:10.331Z] [INFO] org.eclipse.tracecompass.lttng2.ust.core 5.0.0-SNAPSHOT SKIPPED
16:17:10 [2020-07-24T20:17:10.331Z] [INFO] org.eclipse.tracecompass.lttng2.ust.ui 3.0.8-SNAPSHOT SKIPPED
16:17:10 [2020-07-24T20:17:10.331Z] [INFO] org.eclipse.tracecompass.lttng2.ust 6.0.0-SNAPSHOT . SKIPPED
16:17:10 [2020-07-24T20:17:10.331Z] [INFO] org.eclipse.tracecompass.lttng2.ust.core.tests 1.0.11-SNAPSHOT SKIPPED
16:17:10 [2020-07-24T20:17:10.331Z] [INFO] org.eclipse.tracecompass.lttng2.ust.ui.tests 1.0.1-SNAPSHOT SKIPPED
16:17:10 [2020-07-24T20:17:10.331Z] [INFO] org.eclipse.tracecompass.lttng2.ust.ui.swtbot.tests 1.0.13-SNAPSHOT SKIPPED
16:17:10 [2020-07-24T20:17:10.331Z] [INFO] Trace Compass Pcap Format Support Parent 6.0.0-SNAPSHOT SKIPPED
16:17:10 [2020-07-24T20:17:10.331Z] [INFO] org.eclipse.tracecompass.pcap.core 1.1.2-SNAPSHOT .. SKIPPED
16:17:10 [2020-07-24T20:17:10.331Z] [INFO] Trace Compass Pcap Parser Core Tests Plug-in 1.0.4-SNAPSHOT SKIPPED
16:17:10 [2020-07-24T20:17:10.331Z] [INFO] org.eclipse.tracecompass.tmf.pcap.core 1.0.4-SNAPSHOT SKIPPED
16:17:10 [2020-07-24T20:17:10.331Z] [INFO] org.eclipse.tracecompass.tmf.pcap.ui 1.1.3-SNAPSHOT  SKIPPED
16:17:10 [2020-07-24T20:17:10.331Z] [INFO] org.eclipse.tracecompass.tmf.pcap 6.0.0-SNAPSHOT ... SKIPPED
16:17:10 [2020-07-24T20:17:10.331Z] [INFO] org.eclipse.tracecompass.tmf.pcap.core.tests 1.0.2-SNAPSHOT SKIPPED
16:17:10 [2020-07-24T20:17:10.331Z] [INFO] org.eclipse.tracecompass.tmf.pcap.ui.swtbot.tests 1.0.1-SNAPSHOT SKIPPED
16:17:10 [2020-07-24T20:17:10.331Z] [INFO] Trace Compass RCP Parent 6.0.0-SNAPSHOT ............ SKIPPED
16:17:10 [2020-07-24T20:17:10.331Z] [INFO] Trace Compass RCP Branding plug-in 6.0.0-SNAPSHOT .. SKIPPED
16:17:10 [2020-07-24T20:17:10.331Z] [INFO] Trace Compass RCP Branding Feature 6.0.0-SNAPSHOT .. SKIPPED
16:17:10 [2020-07-24T20:17:10.331Z] [INFO] org.eclipse.tracecompass.tmf.cli.core 1.0.1-SNAPSHOT SKIPPED
16:17:10 [2020-07-24T20:17:10.331Z] [INFO] org.eclipse.tracecompass.rcp.ui 6.0.0-SNAPSHOT ..... SKIPPED
16:17:10 [2020-07-24T20:17:10.331Z] [INFO] Trace Compass RCP Feature 6.0.0-SNAPSHOT ........... SKIPPED
16:17:10 [2020-07-24T20:17:10.331Z] [INFO] org.eclipse.tracecompass.tmf.cli.core.tests 1.0.1-SNAPSHOT SKIPPED
16:17:10 [2020-07-24T20:17:10.331Z] [INFO] org.eclipse.tracecompass.rcp.ui.tests 2.0.3-SNAPSHOT SKIPPED
16:17:10 [2020-07-24T20:17:10.331Z] [INFO] org.eclipse.tracecompass.rcp.incubator.ui 1.0.1-SNAPSHOT SKIPPED
16:17:10 [2020-07-24T20:17:10.331Z] [INFO] org.eclipse.tracecompass.rcp.incubator 6.0.0-SNAPSHOT SKIPPED
16:17:10 [2020-07-24T20:17:10.331Z] [INFO] Trace Compass Json trace Parent 6.0.0-SNAPSHOT ..... SKIPPED
16:17:10 [2020-07-24T20:17:10.331Z] [INFO] org.eclipse.tracecompass.jsontrace.core 1.0.0-SNAPSHOT SKIPPED
16:17:10 [2020-07-24T20:17:10.331Z] [INFO] org.eclipse.tracecompass.jsontrace 6.0.0-SNAPSHOT .. SKIPPED
16:17:10 [2020-07-24T20:17:10.331Z] [INFO] org.eclipse.tracecompass.tmf.cli 6.0.0-SNAPSHOT .... SKIPPED
16:17:10 [2020-07-24T20:17:10.331Z] [INFO] Trace Compass RCP Product 6.0.0-SNAPSHOT ........... SKIPPED
16:17:10 [2020-07-24T20:17:10.331Z] [INFO] Trace Compass Release Engineering Parent 6.0.0-SNAPSHOT SKIPPED
16:17:10 [2020-07-24T20:17:10.331Z] [INFO] Trace Compass Target Platform 6.0.0-SNAPSHOT ....... SKIPPED
16:17:10 [2020-07-24T20:17:10.331Z] [INFO] org.eclipse.tracecompass.integration.swtbot.tests 1.0.11-SNAPSHOT SKIPPED
16:17:10 [2020-07-24T20:17:10.331Z] [INFO] org.eclipse.tracecompass.datastore.core.tests 1.0.5-SNAPSHOT SKIPPED
16:17:10 [2020-07-24T20:17:10.331Z] [INFO] org.eclipse.tracecompass.segmentstore.core.tests 1.0.4-SNAPSHOT SKIPPED
16:17:10 [2020-07-24T20:17:10.332Z] [INFO] org.eclipse.tracecompass.tmf.analysis.xml.ui.swtbot.tests 1.0.11-SNAPSHOT SKIPPED
16:17:10 [2020-07-24T20:17:10.332Z] [INFO] org.eclipse.tracecompass.tmf.analysis.xml.ui.tests 1.0.3-SNAPSHOT SKIPPED
16:17:10 [2020-07-24T20:17:10.332Z] [INFO] org.eclipse.tracecompass.tmf.chart.ui.tests 1.0.1-SNAPSHOT SKIPPED
16:17:10 [2020-07-24T20:17:10.332Z] [INFO] org.eclipse.tracecompass.tmf.remote.ui.swtbot.tests 1.0.8-SNAPSHOT SKIPPED
16:17:10 [2020-07-24T20:17:10.332Z] [INFO] org.eclipse.tracecompass.tmf.remote.ui.tests 1.0.1-SNAPSHOT SKIPPED
16:17:10 [2020-07-24T20:17:10.332Z] [INFO] Trace Compass All Tests 1.0.9-SNAPSHOT ............. SKIPPED
16:17:10 [2020-07-24T20:17:10.332Z] [INFO] org.eclipse.tracecompass.testing 6.0.0-SNAPSHOT .... SKIPPED
16:17:10 [2020-07-24T20:17:10.332Z] [INFO] org.eclipse.tracecompass.tmf.remote 6.0.0-SNAPSHOT . SKIPPED
16:17:10 [2020-07-24T20:17:10.332Z] [INFO] Trace Compass Repository 6.0.0-SNAPSHOT ............ SKIPPED
16:17:10 [2020-07-24T20:17:10.332Z] [INFO] org.eclipse.tracecompass.jsontrace.core.tests 1.0.2-SNAPSHOT SKIPPED
16:17:10 [2020-07-24T20:17:10.332Z] [INFO] ------------------------------------------------------------------------
16:17:10 [2020-07-24T20:17:10.332Z] [INFO] BUILD FAILURE
16:17:10 [2020-07-24T20:17:10.332Z] [INFO] ------------------------------------------------------------------------
16:17:10 [2020-07-24T20:17:10.332Z] [INFO] Total time:  33:29 min
16:17:10 [2020-07-24T20:17:10.332Z] [INFO] Finished at: 2020-07-24T20:17:10Z
16:17:10 [2020-07-24T20:17:10.332Z] [INFO] ------------------------------------------------------------------------
16:17:10 [2020-07-24T20:17:10.332Z] [ERROR] Failed to execute goal org.eclipse.tycho:tycho-surefire-plugin:1.3.0:test (default-test) on project org.eclipse.tracecompass.common.core.tests: There are test failures.
16:17:10 [2020-07-24T20:17:10.332Z] [ERROR] 
16:17:10 [2020-07-24T20:17:10.332Z] [ERROR] Please refer to /home/jenkins/agent/workspace/tracecompass-master-jdk11/common/org.eclipse.tracecompass.common.core.tests/target/surefire-reports for the individual test results.
16:17:10 [2020-07-24T20:17:10.332Z] [ERROR] -> [Help 1]
16:17:10 [2020-07-24T20:17:10.332Z] [ERROR] 
16:17:10 [2020-07-24T20:17:10.332Z] [ERROR] To see the full stack trace of the errors, re-run Maven with the -e switch.
16:17:10 [2020-07-24T20:17:10.332Z] [ERROR] Re-run Maven using the -X switch to enable full debug logging.
16:17:10 [2020-07-24T20:17:10.332Z] [ERROR] 
16:17:10 [2020-07-24T20:17:10.332Z] [ERROR] For more information about the errors and possible solutions, please read the following articles:
16:17:10 [2020-07-24T20:17:10.332Z] [ERROR] [Help 1] http://cwiki.apache.org/confluence/display/MAVEN/MojoFailureException
16:17:10 [2020-07-24T20:17:10.332Z] [ERROR] 
16:17:10 [2020-07-24T20:17:10.332Z] [ERROR] After correcting the problems, you can resume the build with the command
16:17:10 [2020-07-24T20:17:10.332Z] [ERROR]   mvn <args> -rf :org.eclipse.tracecompass.common.core.tests
16:17:11 [2020-07-24T20:17:11.953Z] [Pipeline] }
16:17:12 [2020-07-24T20:17:12.213Z] [Pipeline] // container
16:17:12 [2020-07-24T20:17:12.604Z] Post stage
16:17:13 [2020-07-24T20:17:13.470Z] [Pipeline] container
16:17:13 [2020-07-24T20:17:13.471Z] [Pipeline] {
16:17:14 [2020-07-24T20:17:14.094Z] [Pipeline] sh
16:17:16 [2020-07-24T20:17:16.424Z] + echo */*tests/screenshots/*.jpeg,*/*tests/target/work/data/.metadata/.log
16:17:16 [2020-07-24T20:17:16.424Z] */*tests/screenshots/*.jpeg,*/*tests/target/work/data/.metadata/.log
16:17:16 [2020-07-24T20:17:16.675Z] [Pipeline] junit
16:17:16 [2020-07-24T20:17:16.679Z] Recording test results
16:17:26 [2020-07-24T20:17:26.477Z] [Pipeline] archiveArtifacts
16:17:26 [2020-07-24T20:17:26.499Z] Archiving artifacts
16:17:28 [2020-07-24T20:17:28.377Z] [Pipeline] }
16:17:28 [2020-07-24T20:17:28.639Z] [Pipeline] // container
16:17:30 [2020-07-24T20:17:30.266Z] [Pipeline] }
16:17:30 [2020-07-24T20:17:30.517Z] [Pipeline] // withEnv
16:17:30 [2020-07-24T20:17:30.885Z] [Pipeline] }
16:17:31 [2020-07-24T20:17:31.146Z] [Pipeline] // stage
16:17:31 [2020-07-24T20:17:31.972Z] [Pipeline] stage
16:17:31 [2020-07-24T20:17:31.974Z] [Pipeline] { (Deploy Site)
16:17:32 [2020-07-24T20:17:32.856Z] Stage "Deploy Site" skipped due to earlier failure(s)
16:17:32 [2020-07-24T20:17:32.856Z] [Pipeline] }
16:17:33 [2020-07-24T20:17:33.106Z] [Pipeline] // stage
16:17:33 [2020-07-24T20:17:33.858Z] [Pipeline] stage
16:17:33 [2020-07-24T20:17:33.859Z] [Pipeline] { (Deploy RCP)
16:17:34 [2020-07-24T20:17:34.722Z] Stage "Deploy RCP" skipped due to earlier failure(s)
16:17:34 [2020-07-24T20:17:34.723Z] [Pipeline] }
16:17:34 [2020-07-24T20:17:34.974Z] [Pipeline] // stage
16:17:35 [2020-07-24T20:17:35.729Z] [Pipeline] stage
16:17:35 [2020-07-24T20:17:35.731Z] [Pipeline] { (Deploy Doc)
16:17:36 [2020-07-24T20:17:36.590Z] Stage "Deploy Doc" skipped due to earlier failure(s)
16:17:36 [2020-07-24T20:17:36.590Z] [Pipeline] }
16:17:36 [2020-07-24T20:17:36.832Z] [Pipeline] // stage
16:17:37 [2020-07-24T20:17:37.550Z] [Pipeline] stage
16:17:37 [2020-07-24T20:17:37.552Z] [Pipeline] { (Declarative: Post Actions)
16:17:40 [2020-07-24T20:17:40.619Z] [Pipeline] container
16:17:40 [2020-07-24T20:17:40.620Z] [Pipeline] {
16:17:41 [2020-07-24T20:17:41.254Z] [Pipeline] emailext
16:17:41 [2020-07-24T20:17:41.317Z] Not sending mail to unregistered user patrick.tasse@gmail.com because your SCM claimed this was associated with a user ID ‘patrick tasse' which your security realm does not recognize; you may need changes in your SCM plugin
16:17:41 [2020-07-24T20:17:41.440Z] Sending email to: bernd.hufmann@ericsson.com patrick.tasse@gmail.com matthew.khouzam@ericsson.com gbastien@versatic.net simon.delisle@ericsson.com
16:17:41 [2020-07-24T20:17:41.755Z] [Pipeline] }
16:17:42 [2020-07-24T20:17:42.021Z] [Pipeline] // container
16:17:42 [2020-07-24T20:17:42.634Z] [Pipeline] }
16:17:42 [2020-07-24T20:17:42.888Z] [Pipeline] // stage
16:17:43 [2020-07-24T20:17:43.270Z] [Pipeline] }
16:17:43 [2020-07-24T20:17:43.528Z] [Pipeline] // withEnv
16:17:43 [2020-07-24T20:17:43.902Z] [Pipeline] }
16:17:44 [2020-07-24T20:17:44.162Z] [Pipeline] // timeout
16:17:44 [2020-07-24T20:17:44.540Z] [Pipeline] }
16:17:44 [2020-07-24T20:17:44.788Z] [Pipeline] // timestamps
16:17:45 [2020-07-24T20:17:45.164Z] [Pipeline] }
16:17:45 [2020-07-24T20:17:45.424Z] [Pipeline] // withEnv
16:17:45 [2020-07-24T20:17:45.815Z] [Pipeline] }
16:17:46 [2020-07-24T20:17:46.061Z] [Pipeline] // container
16:17:46 [2020-07-24T20:17:46.440Z] [Pipeline] }
16:17:46 [2020-07-24T20:17:46.700Z] [Pipeline] // withEnv
16:17:47 [2020-07-24T20:17:47.080Z] [Pipeline] }
16:17:47 [2020-07-24T20:17:47.334Z] [Pipeline] // node
16:17:47 [2020-07-24T20:17:47.716Z] [Pipeline] }
16:17:47 [2020-07-24T20:17:47.972Z] [Pipeline] // podTemplate
16:17:48 [2020-07-24T20:17:48.357Z] [Pipeline] End of Pipeline
16:17:48 [2020-07-24T20:17:48.507Z] ERROR: script returned exit code 1
16:17:48 [2020-07-24T20:17:48.507Z] Finished: FAILURE