Console Output

Skipping 1,642 KB.. Full Log
6:04.993Z] testDefaults(org.eclipse.tracecompass.tmf.core.tests.filter.TmfFilterContainsNodeTest)  Time elapsed: 0 s
10:06:04 [2020-07-24T14:06:04.993Z] testReplaceChild(org.eclipse.tracecompass.tmf.core.tests.filter.TmfFilterContainsNodeTest)  Time elapsed: 0 s
10:06:04 [2020-07-24T14:06:04.993Z] testRemove(org.eclipse.tracecompass.tmf.core.tests.filter.TmfFilterContainsNodeTest)  Time elapsed: 0 s
10:06:04 [2020-07-24T14:06:04.993Z] Running org.eclipse.tracecompass.tmf.core.tests.filter.TmfFilterNodeTest
10:06:04 [2020-07-24T14:06:04.993Z] Tests run: 11, Failures: 0, Errors: 0, Skipped: 0, Time elapsed: 0.001 s - in org.eclipse.tracecompass.tmf.core.tests.filter.TmfFilterNodeTest
10:06:04 [2020-07-24T14:06:04.993Z] testGetValidChildren(org.eclipse.tracecompass.tmf.core.tests.filter.TmfFilterNodeTest)  Time elapsed: 0 s
10:06:04 [2020-07-24T14:06:04.993Z] testGetName(org.eclipse.tracecompass.tmf.core.tests.filter.TmfFilterNodeTest)  Time elapsed: 0 s
10:06:04 [2020-07-24T14:06:04.993Z] testGetFilterName(org.eclipse.tracecompass.tmf.core.tests.filter.TmfFilterNodeTest)  Time elapsed: 0 s
10:06:04 [2020-07-24T14:06:04.993Z] testMatches(org.eclipse.tracecompass.tmf.core.tests.filter.TmfFilterNodeTest)  Time elapsed: 0 s
10:06:04 [2020-07-24T14:06:04.993Z] testGetChild(org.eclipse.tracecompass.tmf.core.tests.filter.TmfFilterNodeTest)  Time elapsed: 0 s
10:06:04 [2020-07-24T14:06:04.993Z] testClone(org.eclipse.tracecompass.tmf.core.tests.filter.TmfFilterNodeTest)  Time elapsed: 0.001 s
10:06:04 [2020-07-24T14:06:04.993Z] testRemoveChild(org.eclipse.tracecompass.tmf.core.tests.filter.TmfFilterNodeTest)  Time elapsed: 0 s
10:06:04 [2020-07-24T14:06:04.993Z] testAddChild(org.eclipse.tracecompass.tmf.core.tests.filter.TmfFilterNodeTest)  Time elapsed: 0 s
10:06:04 [2020-07-24T14:06:04.993Z] testDefaults(org.eclipse.tracecompass.tmf.core.tests.filter.TmfFilterNodeTest)  Time elapsed: 0 s
10:06:04 [2020-07-24T14:06:04.993Z] testReplaceChild(org.eclipse.tracecompass.tmf.core.tests.filter.TmfFilterNodeTest)  Time elapsed: 0 s
10:06:04 [2020-07-24T14:06:04.993Z] testRemove(org.eclipse.tracecompass.tmf.core.tests.filter.TmfFilterNodeTest)  Time elapsed: 0 s
10:06:04 [2020-07-24T14:06:04.993Z] Running org.eclipse.tracecompass.tmf.core.tests.filter.parser.ElementResolverFilterTest
10:06:04 [2020-07-24T14:06:04.993Z] Tests run: 13, Failures: 0, Errors: 0, Skipped: 0, Time elapsed: 0.012 s - in org.eclipse.tracecompass.tmf.core.tests.filter.parser.ElementResolverFilterTest
10:06:04 [2020-07-24T14:06:04.993Z] testLogicalOperator(org.eclipse.tracecompass.tmf.core.tests.filter.parser.ElementResolverFilterTest)  Time elapsed: 0.001 s
10:06:04 [2020-07-24T14:06:04.993Z] testContainsOperator(org.eclipse.tracecompass.tmf.core.tests.filter.parser.ElementResolverFilterTest)  Time elapsed: 0.001 s
10:06:04 [2020-07-24T14:06:04.993Z] testEqualsOperator(org.eclipse.tracecompass.tmf.core.tests.filter.parser.ElementResolverFilterTest)  Time elapsed: 0 s
10:06:04 [2020-07-24T14:06:04.993Z] testRegex(org.eclipse.tracecompass.tmf.core.tests.filter.parser.ElementResolverFilterTest)  Time elapsed: 0.001 s
10:06:04 [2020-07-24T14:06:04.993Z] testNotOperator(org.eclipse.tracecompass.tmf.core.tests.filter.parser.ElementResolverFilterTest)  Time elapsed: 0.001 s
10:06:04 [2020-07-24T14:06:04.993Z] testComplexFilter(org.eclipse.tracecompass.tmf.core.tests.filter.parser.ElementResolverFilterTest)  Time elapsed: 0.001 s
10:06:04 [2020-07-24T14:06:04.993Z] testFilterWithNumber(org.eclipse.tracecompass.tmf.core.tests.filter.parser.ElementResolverFilterTest)  Time elapsed: 0.003 s
10:06:04 [2020-07-24T14:06:04.993Z] testLessThanOperator(org.eclipse.tracecompass.tmf.core.tests.filter.parser.ElementResolverFilterTest)  Time elapsed: 0 s
10:06:04 [2020-07-24T14:06:04.993Z] testPresentOperator(org.eclipse.tracecompass.tmf.core.tests.filter.parser.ElementResolverFilterTest)  Time elapsed: 0 s
10:06:04 [2020-07-24T14:06:04.993Z] testMatchesOperator(org.eclipse.tracecompass.tmf.core.tests.filter.parser.ElementResolverFilterTest)  Time elapsed: 0.001 s
10:06:04 [2020-07-24T14:06:04.993Z] testNotEqualsOperator(org.eclipse.tracecompass.tmf.core.tests.filter.parser.ElementResolverFilterTest)  Time elapsed: 0 s
10:06:04 [2020-07-24T14:06:04.993Z] testInvalid(org.eclipse.tracecompass.tmf.core.tests.filter.parser.ElementResolverFilterTest)  Time elapsed: 0.001 s
10:06:04 [2020-07-24T14:06:04.993Z] testGreaterThanOperator(org.eclipse.tracecompass.tmf.core.tests.filter.parser.ElementResolverFilterTest)  Time elapsed: 0 s
10:06:04 [2020-07-24T14:06:04.993Z] Running org.eclipse.tracecompass.tmf.core.tests.filter.TmfFilterCompareNodeTest
10:06:04 [2020-07-24T14:06:04.993Z] Tests run: 12, Failures: 0, Errors: 0, Skipped: 0, Time elapsed: 0.002 s - in org.eclipse.tracecompass.tmf.core.tests.filter.TmfFilterCompareNodeTest
10:06:04 [2020-07-24T14:06:04.993Z] testMatchesTimestamp(org.eclipse.tracecompass.tmf.core.tests.filter.TmfFilterCompareNodeTest)  Time elapsed: 0.001 s
10:06:04 [2020-07-24T14:06:04.993Z] testGetValidChildren(org.eclipse.tracecompass.tmf.core.tests.filter.TmfFilterCompareNodeTest)  Time elapsed: 0 s
10:06:04 [2020-07-24T14:06:04.993Z] testMatchesAlpha(org.eclipse.tracecompass.tmf.core.tests.filter.TmfFilterCompareNodeTest)  Time elapsed: 0 s
10:06:04 [2020-07-24T14:06:04.993Z] testGetName(org.eclipse.tracecompass.tmf.core.tests.filter.TmfFilterCompareNodeTest)  Time elapsed: 0 s
10:06:04 [2020-07-24T14:06:04.993Z] testMatchesNum(org.eclipse.tracecompass.tmf.core.tests.filter.TmfFilterCompareNodeTest)  Time elapsed: 0 s
10:06:04 [2020-07-24T14:06:04.993Z] testGetChild(org.eclipse.tracecompass.tmf.core.tests.filter.TmfFilterCompareNodeTest)  Time elapsed: 0 s
10:06:04 [2020-07-24T14:06:04.993Z] testClone(org.eclipse.tracecompass.tmf.core.tests.filter.TmfFilterCompareNodeTest)  Time elapsed: 0 s
10:06:04 [2020-07-24T14:06:04.993Z] testRemoveChild(org.eclipse.tracecompass.tmf.core.tests.filter.TmfFilterCompareNodeTest)  Time elapsed: 0 s
10:06:04 [2020-07-24T14:06:04.993Z] testAddChild(org.eclipse.tracecompass.tmf.core.tests.filter.TmfFilterCompareNodeTest)  Time elapsed: 0 s
10:06:04 [2020-07-24T14:06:04.993Z] testDefaults(org.eclipse.tracecompass.tmf.core.tests.filter.TmfFilterCompareNodeTest)  Time elapsed: 0 s
10:06:04 [2020-07-24T14:06:04.993Z] testReplaceChild(org.eclipse.tracecompass.tmf.core.tests.filter.TmfFilterCompareNodeTest)  Time elapsed: 0 s
10:06:04 [2020-07-24T14:06:04.993Z] testRemove(org.eclipse.tracecompass.tmf.core.tests.filter.TmfFilterCompareNodeTest)  Time elapsed: 0 s
10:06:04 [2020-07-24T14:06:04.993Z] Running org.eclipse.tracecompass.tmf.core.tests.filter.TmfFilterMatchesNodeTest
10:06:04 [2020-07-24T14:06:04.993Z] Tests run: 10, Failures: 0, Errors: 0, Skipped: 0, Time elapsed: 0.002 s - in org.eclipse.tracecompass.tmf.core.tests.filter.TmfFilterMatchesNodeTest
10:06:04 [2020-07-24T14:06:04.993Z] testGetValidChildren(org.eclipse.tracecompass.tmf.core.tests.filter.TmfFilterMatchesNodeTest)  Time elapsed: 0 s
10:06:04 [2020-07-24T14:06:04.993Z] testGetName(org.eclipse.tracecompass.tmf.core.tests.filter.TmfFilterMatchesNodeTest)  Time elapsed: 0 s
10:06:04 [2020-07-24T14:06:04.993Z] testMatches(org.eclipse.tracecompass.tmf.core.tests.filter.TmfFilterMatchesNodeTest)  Time elapsed: 0 s
10:06:04 [2020-07-24T14:06:04.993Z] testGetChild(org.eclipse.tracecompass.tmf.core.tests.filter.TmfFilterMatchesNodeTest)  Time elapsed: 0 s
10:06:04 [2020-07-24T14:06:04.993Z] testClone(org.eclipse.tracecompass.tmf.core.tests.filter.TmfFilterMatchesNodeTest)  Time elapsed: 0 s
10:06:04 [2020-07-24T14:06:04.993Z] testRemoveChild(org.eclipse.tracecompass.tmf.core.tests.filter.TmfFilterMatchesNodeTest)  Time elapsed: 0 s
10:06:04 [2020-07-24T14:06:04.993Z] testAddChild(org.eclipse.tracecompass.tmf.core.tests.filter.TmfFilterMatchesNodeTest)  Time elapsed: 0 s
10:06:04 [2020-07-24T14:06:04.993Z] testDefaults(org.eclipse.tracecompass.tmf.core.tests.filter.TmfFilterMatchesNodeTest)  Time elapsed: 0.001 s
10:06:04 [2020-07-24T14:06:04.993Z] testReplaceChild(org.eclipse.tracecompass.tmf.core.tests.filter.TmfFilterMatchesNodeTest)  Time elapsed: 0 s
10:06:04 [2020-07-24T14:06:04.993Z] testRemove(org.eclipse.tracecompass.tmf.core.tests.filter.TmfFilterMatchesNodeTest)  Time elapsed: 0 s
10:06:04 [2020-07-24T14:06:04.993Z] Running org.eclipse.tracecompass.tmf.core.tests.filter.TmfFilterOrNodeTest
10:06:04 [2020-07-24T14:06:04.993Z] Tests run: 10, Failures: 0, Errors: 0, Skipped: 0, Time elapsed: 0.001 s - in org.eclipse.tracecompass.tmf.core.tests.filter.TmfFilterOrNodeTest
10:06:04 [2020-07-24T14:06:04.993Z] testGetValidChildren(org.eclipse.tracecompass.tmf.core.tests.filter.TmfFilterOrNodeTest)  Time elapsed: 0 s
10:06:04 [2020-07-24T14:06:04.993Z] testGetName(org.eclipse.tracecompass.tmf.core.tests.filter.TmfFilterOrNodeTest)  Time elapsed: 0 s
10:06:04 [2020-07-24T14:06:04.993Z] testMatches(org.eclipse.tracecompass.tmf.core.tests.filter.TmfFilterOrNodeTest)  Time elapsed: 0 s
10:06:04 [2020-07-24T14:06:04.993Z] testGetChild(org.eclipse.tracecompass.tmf.core.tests.filter.TmfFilterOrNodeTest)  Time elapsed: 0 s
10:06:04 [2020-07-24T14:06:04.993Z] testClone(org.eclipse.tracecompass.tmf.core.tests.filter.TmfFilterOrNodeTest)  Time elapsed: 0 s
10:06:04 [2020-07-24T14:06:04.993Z] testRemoveChild(org.eclipse.tracecompass.tmf.core.tests.filter.TmfFilterOrNodeTest)  Time elapsed: 0 s
10:06:04 [2020-07-24T14:06:04.993Z] testAddChild(org.eclipse.tracecompass.tmf.core.tests.filter.TmfFilterOrNodeTest)  Time elapsed: 0 s
10:06:04 [2020-07-24T14:06:04.993Z] testDefaults(org.eclipse.tracecompass.tmf.core.tests.filter.TmfFilterOrNodeTest)  Time elapsed: 0 s
10:06:04 [2020-07-24T14:06:04.993Z] testReplaceChild(org.eclipse.tracecompass.tmf.core.tests.filter.TmfFilterOrNodeTest)  Time elapsed: 0 s
10:06:04 [2020-07-24T14:06:04.993Z] testRemove(org.eclipse.tracecompass.tmf.core.tests.filter.TmfFilterOrNodeTest)  Time elapsed: 0 s
10:06:04 [2020-07-24T14:06:04.993Z] Running org.eclipse.tracecompass.tmf.core.tests.filter.TmfFilterRootNodeTest
10:06:04 [2020-07-24T14:06:04.994Z] Tests run: 10, Failures: 0, Errors: 0, Skipped: 0, Time elapsed: 0.001 s - in org.eclipse.tracecompass.tmf.core.tests.filter.TmfFilterRootNodeTest
10:06:04 [2020-07-24T14:06:04.994Z] testGetValidChildren(org.eclipse.tracecompass.tmf.core.tests.filter.TmfFilterRootNodeTest)  Time elapsed: 0 s
10:06:04 [2020-07-24T14:06:04.994Z] testGetName(org.eclipse.tracecompass.tmf.core.tests.filter.TmfFilterRootNodeTest)  Time elapsed: 0 s
10:06:04 [2020-07-24T14:06:04.994Z] testMatches(org.eclipse.tracecompass.tmf.core.tests.filter.TmfFilterRootNodeTest)  Time elapsed: 0 s
10:06:04 [2020-07-24T14:06:04.994Z] testGetChild(org.eclipse.tracecompass.tmf.core.tests.filter.TmfFilterRootNodeTest)  Time elapsed: 0.001 s
10:06:04 [2020-07-24T14:06:04.994Z] testClone(org.eclipse.tracecompass.tmf.core.tests.filter.TmfFilterRootNodeTest)  Time elapsed: 0 s
10:06:04 [2020-07-24T14:06:04.994Z] testRemoveChild(org.eclipse.tracecompass.tmf.core.tests.filter.TmfFilterRootNodeTest)  Time elapsed: 0 s
10:06:04 [2020-07-24T14:06:04.994Z] testAddChild(org.eclipse.tracecompass.tmf.core.tests.filter.TmfFilterRootNodeTest)  Time elapsed: 0 s
10:06:04 [2020-07-24T14:06:04.994Z] testDefaults(org.eclipse.tracecompass.tmf.core.tests.filter.TmfFilterRootNodeTest)  Time elapsed: 0 s
10:06:04 [2020-07-24T14:06:04.994Z] testReplaceChild(org.eclipse.tracecompass.tmf.core.tests.filter.TmfFilterRootNodeTest)  Time elapsed: 0 s
10:06:04 [2020-07-24T14:06:04.994Z] testRemove(org.eclipse.tracecompass.tmf.core.tests.filter.TmfFilterRootNodeTest)  Time elapsed: 0 s
10:06:04 [2020-07-24T14:06:04.994Z] Running org.eclipse.tracecompass.tmf.core.tests.dataprovider.DataProviderParameterTest
10:06:04 [2020-07-24T14:06:04.994Z] Tests run: 4, Failures: 0, Errors: 0, Skipped: 0, Time elapsed: 0.002 s - in org.eclipse.tracecompass.tmf.core.tests.dataprovider.DataProviderParameterTest
10:06:04 [2020-07-24T14:06:04.994Z] testExtractSelectedItems(org.eclipse.tracecompass.tmf.core.tests.dataprovider.DataProviderParameterTest)  Time elapsed: 0 s
10:06:04 [2020-07-24T14:06:04.994Z] testExtractBoolean(org.eclipse.tracecompass.tmf.core.tests.dataprovider.DataProviderParameterTest)  Time elapsed: 0 s
10:06:04 [2020-07-24T14:06:04.994Z] testExtractTimeRequested(org.eclipse.tracecompass.tmf.core.tests.dataprovider.DataProviderParameterTest)  Time elapsed: 0.001 s
10:06:04 [2020-07-24T14:06:04.994Z] testExtractLongList(org.eclipse.tracecompass.tmf.core.tests.dataprovider.DataProviderParameterTest)  Time elapsed: 0 s
10:06:04 [2020-07-24T14:06:04.994Z] Running org.eclipse.tracecompass.tmf.core.tests.dataprovider.FetchParametersTest
10:06:04 [2020-07-24T14:06:04.994Z] Tests run: 3, Failures: 0, Errors: 0, Skipped: 0, Time elapsed: 0.003 s - in org.eclipse.tracecompass.tmf.core.tests.dataprovider.FetchParametersTest
10:06:04 [2020-07-24T14:06:04.994Z] testSelectionTimeQuery(org.eclipse.tracecompass.tmf.core.tests.dataprovider.FetchParametersTest)  Time elapsed: 0.002 s
10:06:04 [2020-07-24T14:06:04.994Z] testTimeQuery(org.eclipse.tracecompass.tmf.core.tests.dataprovider.FetchParametersTest)  Time elapsed: 0 s
10:06:04 [2020-07-24T14:06:04.994Z] testVirtualTableQuery(org.eclipse.tracecompass.tmf.core.tests.dataprovider.FetchParametersTest)  Time elapsed: 0 s
10:06:04 [2020-07-24T14:06:04.994Z] Running org.eclipse.tracecompass.tmf.core.tests.synchronization.TsTransformTest
10:06:04 [2020-07-24T14:06:04.994Z] Tests run: 5, Failures: 0, Errors: 0, Skipped: 0, Time elapsed: 0.001 s - in org.eclipse.tracecompass.tmf.core.tests.synchronization.TsTransformTest
10:06:04 [2020-07-24T14:06:04.994Z] testComposition(org.eclipse.tracecompass.tmf.core.tests.synchronization.TsTransformTest)  Time elapsed: 0.001 s
10:06:04 [2020-07-24T14:06:04.994Z] testEqualityConstantTransform(org.eclipse.tracecompass.tmf.core.tests.synchronization.TsTransformTest)  Time elapsed: 0 s
10:06:04 [2020-07-24T14:06:04.994Z] testLinearTransform(org.eclipse.tracecompass.tmf.core.tests.synchronization.TsTransformTest)  Time elapsed: 0 s
10:06:04 [2020-07-24T14:06:04.994Z] testIdentityTransform(org.eclipse.tracecompass.tmf.core.tests.synchronization.TsTransformTest)  Time elapsed: 0 s
10:06:04 [2020-07-24T14:06:04.994Z] testEquality(org.eclipse.tracecompass.tmf.core.tests.synchronization.TsTransformTest)  Time elapsed: 0 s
10:06:04 [2020-07-24T14:06:04.994Z] Running org.eclipse.tracecompass.tmf.core.tests.synchronization.TsTransformFactoryTest
10:06:04 [2020-07-24T14:06:04.994Z] Tests run: 4, Failures: 0, Errors: 0, Skipped: 0, Time elapsed: 0.001 s - in org.eclipse.tracecompass.tmf.core.tests.synchronization.TsTransformFactoryTest
10:06:04 [2020-07-24T14:06:04.994Z] transformSlope(org.eclipse.tracecompass.tmf.core.tests.synchronization.TsTransformFactoryTest)  Time elapsed: 0 s
10:06:04 [2020-07-24T14:06:04.994Z] testToString(org.eclipse.tracecompass.tmf.core.tests.synchronization.TsTransformFactoryTest)  Time elapsed: 0 s
10:06:04 [2020-07-24T14:06:04.994Z] transformIdentity(org.eclipse.tracecompass.tmf.core.tests.synchronization.TsTransformFactoryTest)  Time elapsed: 0 s
10:06:04 [2020-07-24T14:06:04.994Z] transformOffset(org.eclipse.tracecompass.tmf.core.tests.synchronization.TsTransformFactoryTest)  Time elapsed: 0 s
10:06:04 [2020-07-24T14:06:04.994Z] Running org.eclipse.tracecompass.tmf.core.tests.synchronization.TsTransformFastTest
10:06:04 [2020-07-24T14:06:04.994Z] Tests run: 12, Failures: 0, Errors: 0, Skipped: 0, Time elapsed: 0.505 s - in org.eclipse.tracecompass.tmf.core.tests.synchronization.TsTransformFastTest
10:06:04 [2020-07-24T14:06:04.994Z] testFastTransformSlopeAndOffset[Factory=Object](org.eclipse.tracecompass.tmf.core.tests.synchronization.TsTransformFastTest)  Time elapsed: 0.006 s
10:06:04 [2020-07-24T14:06:04.994Z] testFastTransformSlope[Factory=Object](org.eclipse.tracecompass.tmf.core.tests.synchronization.TsTransformFastTest)  Time elapsed: 0.09 s
10:06:04 [2020-07-24T14:06:04.994Z] testFastTransformArguments[Factory=Object](org.eclipse.tracecompass.tmf.core.tests.synchronization.TsTransformFastTest)  Time elapsed: 0 s
10:06:04 [2020-07-24T14:06:04.994Z] testFLTRepeatability[Factory=Object](org.eclipse.tracecompass.tmf.core.tests.synchronization.TsTransformFastTest)  Time elapsed: 0.001 s
10:06:04 [2020-07-24T14:06:04.994Z] testFastTransformPrecision[Factory=Object](org.eclipse.tracecompass.tmf.core.tests.synchronization.TsTransformFastTest)  Time elapsed: 0.188 s
10:06:04 [2020-07-24T14:06:04.994Z] testFLTEquivalence[Factory=Object](org.eclipse.tracecompass.tmf.core.tests.synchronization.TsTransformFastTest)  Time elapsed: 0.001 s
10:06:04 [2020-07-24T14:06:04.994Z] testFastTransformSlopeAndOffset[Factory=Deserialized](org.eclipse.tracecompass.tmf.core.tests.synchronization.TsTransformFastTest)  Time elapsed: 0.098 s
10:06:04 [2020-07-24T14:06:04.994Z] testFastTransformSlope[Factory=Deserialized](org.eclipse.tracecompass.tmf.core.tests.synchronization.TsTransformFastTest)  Time elapsed: 0.025 s
10:06:04 [2020-07-24T14:06:04.994Z] testFastTransformArguments[Factory=Deserialized](org.eclipse.tracecompass.tmf.core.tests.synchronization.TsTransformFastTest)  Time elapsed: 0 s
10:06:04 [2020-07-24T14:06:04.994Z] testFLTRepeatability[Factory=Deserialized](org.eclipse.tracecompass.tmf.core.tests.synchronization.TsTransformFastTest)  Time elapsed: 0.001 s
10:06:04 [2020-07-24T14:06:04.994Z] testFastTransformPrecision[Factory=Deserialized](org.eclipse.tracecompass.tmf.core.tests.synchronization.TsTransformFastTest)  Time elapsed: 0.093 s
10:06:04 [2020-07-24T14:06:04.994Z] testFLTEquivalence[Factory=Deserialized](org.eclipse.tracecompass.tmf.core.tests.synchronization.TsTransformFastTest)  Time elapsed: 0.001 s
10:06:04 [2020-07-24T14:06:04.994Z] Running org.eclipse.tracecompass.tmf.core.tests.synchronization.SyncTest
10:06:04 [2020-07-24T14:06:04.994Z] Tests run: 4, Failures: 0, Errors: 0, Skipped: 0, Time elapsed: 0.01 s - in org.eclipse.tracecompass.tmf.core.tests.synchronization.SyncTest
10:06:04 [2020-07-24T14:06:04.994Z] testOneHull(org.eclipse.tracecompass.tmf.core.tests.synchronization.SyncTest)  Time elapsed: 0.002 s
10:06:04 [2020-07-24T14:06:04.994Z] testFullyIncrementalSerialization(org.eclipse.tracecompass.tmf.core.tests.synchronization.SyncTest)  Time elapsed: 0.007 s
10:06:04 [2020-07-24T14:06:04.994Z] testFullyIncremental(org.eclipse.tracecompass.tmf.core.tests.synchronization.SyncTest)  Time elapsed: 0.001 s
10:06:04 [2020-07-24T14:06:04.994Z] testDisjoint(org.eclipse.tracecompass.tmf.core.tests.synchronization.SyncTest)  Time elapsed: 0 s
10:06:04 [2020-07-24T14:06:04.994Z] Running org.eclipse.tracecompass.tmf.core.tests.synchronization.TimeOffsetTest
10:06:10 [2020-07-24T14:06:10.239Z] Tests run: 4, Failures: 0, Errors: 0, Skipped: 0, Time elapsed: 4.904 s - in org.eclipse.tracecompass.tmf.core.tests.synchronization.TimeOffsetTest
10:06:10 [2020-07-24T14:06:10.239Z] testNegativeOffset(org.eclipse.tracecompass.tmf.core.tests.synchronization.TimeOffsetTest)  Time elapsed: 1.309 s
10:06:10 [2020-07-24T14:06:10.239Z] testPositiveOffset(org.eclipse.tracecompass.tmf.core.tests.synchronization.TimeOffsetTest)  Time elapsed: 1.205 s
10:06:10 [2020-07-24T14:06:10.239Z] testNoOffset(org.eclipse.tracecompass.tmf.core.tests.synchronization.TimeOffsetTest)  Time elapsed: 1.193 s
10:06:10 [2020-07-24T14:06:10.239Z] testClearOffset(org.eclipse.tracecompass.tmf.core.tests.synchronization.TimeOffsetTest)  Time elapsed: 1.197 s
10:06:10 [2020-07-24T14:06:10.239Z] Running org.eclipse.tracecompass.tmf.core.tests.uml2sd.TmfSyncSequenceDiagramEventTest
10:06:10 [2020-07-24T14:06:10.239Z] Tests run: 1, Failures: 0, Errors: 0, Skipped: 0, Time elapsed: 0.001 s - in org.eclipse.tracecompass.tmf.core.tests.uml2sd.TmfSyncSequenceDiagramEventTest
10:06:10 [2020-07-24T14:06:10.239Z] testTmfSyncSequenceDiagramEvent(org.eclipse.tracecompass.tmf.core.tests.uml2sd.TmfSyncSequenceDiagramEventTest)  Time elapsed: 0.001 s
10:06:10 [2020-07-24T14:06:10.239Z] Running org.eclipse.tracecompass.tmf.core.tests.uml2sd.TmfAsyncSequenceDiagramEventTest
10:06:10 [2020-07-24T14:06:10.239Z] Tests run: 1, Failures: 0, Errors: 0, Skipped: 0, Time elapsed: 0.001 s - in org.eclipse.tracecompass.tmf.core.tests.uml2sd.TmfAsyncSequenceDiagramEventTest
10:06:10 [2020-07-24T14:06:10.239Z] testTmfAsyncSequenceDiagramEvent(org.eclipse.tracecompass.tmf.core.tests.uml2sd.TmfAsyncSequenceDiagramEventTest)  Time elapsed: 0.001 s
10:06:10 [2020-07-24T14:06:10.239Z] Running org.eclipse.tracecompass.tmf.core.tests.request.TmfEventRequestTest
10:06:10 [2020-07-24T14:06:10.239Z] Tests run: 14, Failures: 0, Errors: 0, Skipped: 0, Time elapsed: 0.004 s - in org.eclipse.tracecompass.tmf.core.tests.request.TmfEventRequestTest
10:06:10 [2020-07-24T14:06:10.239Z] testDone(org.eclipse.tracecompass.tmf.core.tests.request.TmfEventRequestTest)  Time elapsed: 0.001 s
10:06:10 [2020-07-24T14:06:10.239Z] testFail(org.eclipse.tracecompass.tmf.core.tests.request.TmfEventRequestTest)  Time elapsed: 0 s
10:06:10 [2020-07-24T14:06:10.239Z] testTmfEventRequestWithDependencyLevel(org.eclipse.tracecompass.tmf.core.tests.request.TmfEventRequestTest)  Time elapsed: 0 s
10:06:10 [2020-07-24T14:06:10.239Z] testToString(org.eclipse.tracecompass.tmf.core.tests.request.TmfEventRequestTest)  Time elapsed: 0.001 s
10:06:10 [2020-07-24T14:06:10.239Z] testTmfEventRequestTimeRangeNbRequestedBlocksize(org.eclipse.tracecompass.tmf.core.tests.request.TmfEventRequestTest)  Time elapsed: 0 s
10:06:10 [2020-07-24T14:06:10.239Z] testWaitForStartAfterDone(org.eclipse.tracecompass.tmf.core.tests.request.TmfEventRequestTest)  Time elapsed: 0 s
10:06:10 [2020-07-24T14:06:10.239Z] testTmfEventRequestTimeRangeNbRequested(org.eclipse.tracecompass.tmf.core.tests.request.TmfEventRequestTest)  Time elapsed: 0 s
10:06:10 [2020-07-24T14:06:10.239Z] testTmfEventRequestTimeRange(org.eclipse.tracecompass.tmf.core.tests.request.TmfEventRequestTest)  Time elapsed: 0.001 s
10:06:10 [2020-07-24T14:06:10.239Z] testWaitForStartBeforeStart(org.eclipse.tracecompass.tmf.core.tests.request.TmfEventRequestTest)  Time elapsed: 0 s
10:06:10 [2020-07-24T14:06:10.239Z] testWaitForStartAfterStart(org.eclipse.tracecompass.tmf.core.tests.request.TmfEventRequestTest)  Time elapsed: 0 s
10:06:10 [2020-07-24T14:06:10.239Z] testCancel(org.eclipse.tracecompass.tmf.core.tests.request.TmfEventRequestTest)  Time elapsed: 0.001 s
10:06:10 [2020-07-24T14:06:10.239Z] testEquals(org.eclipse.tracecompass.tmf.core.tests.request.TmfEventRequestTest)  Time elapsed: 0 s
10:06:10 [2020-07-24T14:06:10.239Z] testTmfEventRequest(org.eclipse.tracecompass.tmf.core.tests.request.TmfEventRequestTest)  Time elapsed: 0 s
10:06:10 [2020-07-24T14:06:10.239Z] testWaitForStartAfterCancel(org.eclipse.tracecompass.tmf.core.tests.request.TmfEventRequestTest)  Time elapsed: 0 s
10:06:10 [2020-07-24T14:06:10.239Z] Running org.eclipse.tracecompass.tmf.core.tests.request.TmfEventRequestIntegrationTest
10:06:11 [2020-07-24T14:06:11.605Z] 
10:06:11 [2020-07-24T14:06:11.605Z] !ENTRY org.eclipse.tracecompass.tmf.core 4 0 2020-07-24 14:06:11.431
10:06:11 [2020-07-24T14:06:11.605Z] !MESSAGE An uncaught exception happened on request [TmfEventRequestIntegrationTest$2(481,ITmfEvent,BACKGROUND,TmfTimeRange [fStartTime=00:12:43.145 224 192, fEndTime=23:47:16.854 775 807],0,2,0)]: null
10:06:12 [2020-07-24T14:06:12.970Z] 
10:06:12 [2020-07-24T14:06:12.970Z] !ENTRY org.eclipse.tracecompass.tmf.core 4 0 2020-07-24 14:06:12.533
10:06:12 [2020-07-24T14:06:12.970Z] !MESSAGE An uncaught exception happened on request [TmfEventRequestIntegrationTest$1(483,ITmfEvent,BACKGROUND,TmfTimeRange [fStartTime=00:12:43.145 224 192, fEndTime=23:47:16.854 775 807],0,2,0)]: null
10:06:12 [2020-07-24T14:06:12.970Z] Tests run: 2, Failures: 0, Errors: 0, Skipped: 0, Time elapsed: 3.306 s - in org.eclipse.tracecompass.tmf.core.tests.request.TmfEventRequestIntegrationTest
10:06:12 [2020-07-24T14:06:12.970Z] testRequestException(org.eclipse.tracecompass.tmf.core.tests.request.TmfEventRequestIntegrationTest)  Time elapsed: 1.013 s
10:06:12 [2020-07-24T14:06:12.970Z] testSingleRequestException(org.eclipse.tracecompass.tmf.core.tests.request.TmfEventRequestIntegrationTest)  Time elapsed: 1.102 s
10:06:12 [2020-07-24T14:06:12.970Z] Running org.eclipse.tracecompass.tmf.core.tests.request.TmfCoalescedEventRequestTest
10:06:13 [2020-07-24T14:06:13.897Z] Tests run: 13, Failures: 0, Errors: 0, Skipped: 0, Time elapsed: 1.124 s - in org.eclipse.tracecompass.tmf.core.tests.request.TmfCoalescedEventRequestTest
10:06:13 [2020-07-24T14:06:13.897Z] testIsCompatible(org.eclipse.tracecompass.tmf.core.tests.request.TmfCoalescedEventRequestTest)  Time elapsed: 0 s
10:06:13 [2020-07-24T14:06:13.897Z] testTmfCoalescedEventRequestIndexNbEventsBlocksize(org.eclipse.tracecompass.tmf.core.tests.request.TmfCoalescedEventRequestTest)  Time elapsed: 0 s
10:06:13 [2020-07-24T14:06:13.897Z] testDone(org.eclipse.tracecompass.tmf.core.tests.request.TmfCoalescedEventRequestTest)  Time elapsed: 0 s
10:06:13 [2020-07-24T14:06:13.897Z] testFail(org.eclipse.tracecompass.tmf.core.tests.request.TmfCoalescedEventRequestTest)  Time elapsed: 0.001 s
10:06:13 [2020-07-24T14:06:13.897Z] testCancelCoalescedRequest(org.eclipse.tracecompass.tmf.core.tests.request.TmfCoalescedEventRequestTest)  Time elapsed: 0.279 s
10:06:13 [2020-07-24T14:06:13.897Z] testToString(org.eclipse.tracecompass.tmf.core.tests.request.TmfCoalescedEventRequestTest)  Time elapsed: 0 s
10:06:13 [2020-07-24T14:06:13.897Z] testAddEvent1(org.eclipse.tracecompass.tmf.core.tests.request.TmfCoalescedEventRequestTest)  Time elapsed: 0 s
10:06:13 [2020-07-24T14:06:13.897Z] testAddEvent2(org.eclipse.tracecompass.tmf.core.tests.request.TmfCoalescedEventRequestTest)  Time elapsed: 0 s
10:06:13 [2020-07-24T14:06:13.897Z] testSingleTimeRequest(org.eclipse.tracecompass.tmf.core.tests.request.TmfCoalescedEventRequestTest)  Time elapsed: 0.104 s
10:06:13 [2020-07-24T14:06:13.897Z] testIsCompatibleDependency(org.eclipse.tracecompass.tmf.core.tests.request.TmfCoalescedEventRequestTest)  Time elapsed: 0 s
10:06:13 [2020-07-24T14:06:13.897Z] testCoalescedRequest(org.eclipse.tracecompass.tmf.core.tests.request.TmfCoalescedEventRequestTest)  Time elapsed: 0.74 s
10:06:13 [2020-07-24T14:06:13.897Z] testCancel(org.eclipse.tracecompass.tmf.core.tests.request.TmfCoalescedEventRequestTest)  Time elapsed: 0 s
10:06:13 [2020-07-24T14:06:13.897Z] testEquals(org.eclipse.tracecompass.tmf.core.tests.request.TmfCoalescedEventRequestTest)  Time elapsed: 0 s
10:06:13 [2020-07-24T14:06:13.897Z] Running org.eclipse.tracecompass.tmf.core.tests.component.TmfProviderManagerTest
10:06:13 [2020-07-24T14:06:13.897Z] Tests run: 5, Failures: 0, Errors: 0, Skipped: 0, Time elapsed: 0.003 s - in org.eclipse.tracecompass.tmf.core.tests.component.TmfProviderManagerTest
10:06:13 [2020-07-24T14:06:13.897Z] testGetProvider(org.eclipse.tracecompass.tmf.core.tests.component.TmfProviderManagerTest)  Time elapsed: 0.002 s
10:06:13 [2020-07-24T14:06:13.897Z] testRegister_0(org.eclipse.tracecompass.tmf.core.tests.component.TmfProviderManagerTest)  Time elapsed: 0 s
10:06:13 [2020-07-24T14:06:13.897Z] testRegister_Unregister_1(org.eclipse.tracecompass.tmf.core.tests.component.TmfProviderManagerTest)  Time elapsed: 0 s
10:06:13 [2020-07-24T14:06:13.897Z] testRegister_Unregister_2(org.eclipse.tracecompass.tmf.core.tests.component.TmfProviderManagerTest)  Time elapsed: 0 s
10:06:13 [2020-07-24T14:06:13.897Z] testRegister_Unregister_3(org.eclipse.tracecompass.tmf.core.tests.component.TmfProviderManagerTest)  Time elapsed: 0.001 s
10:06:13 [2020-07-24T14:06:13.897Z] Running org.eclipse.tracecompass.tmf.core.tests.component.TmfEventProviderCoalescingTest
10:06:20 [2020-07-24T14:06:20.429Z] Tests run: 10, Failures: 0, Errors: 0, Skipped: 0, Time elapsed: 6.387 s - in org.eclipse.tracecompass.tmf.core.tests.component.TmfEventProviderCoalescingTest
10:06:20 [2020-07-24T14:06:20.429Z] testChildrenFirstCoalescing2(org.eclipse.tracecompass.tmf.core.tests.component.TmfEventProviderCoalescingTest)  Time elapsed: 0.46 s
10:06:20 [2020-07-24T14:06:20.429Z] testTraceDependencyBackground(org.eclipse.tracecompass.tmf.core.tests.component.TmfEventProviderCoalescingTest)  Time elapsed: 0.481 s
10:06:20 [2020-07-24T14:06:20.429Z] testChildrenFirstCoalescing(org.eclipse.tracecompass.tmf.core.tests.component.TmfEventProviderCoalescingTest)  Time elapsed: 0.41 s
10:06:20 [2020-07-24T14:06:20.429Z] testMultipleRequestsCoalescing(org.eclipse.tracecompass.tmf.core.tests.component.TmfEventProviderCoalescingTest)  Time elapsed: 0.413 s
10:06:20 [2020-07-24T14:06:20.429Z] testChildFirstDependencyBackground(org.eclipse.tracecompass.tmf.core.tests.component.TmfEventProviderCoalescingTest)  Time elapsed: 0.897 s
10:06:20 [2020-07-24T14:06:20.429Z] testParentDependencyBackground(org.eclipse.tracecompass.tmf.core.tests.component.TmfEventProviderCoalescingTest)  Time elapsed: 0.945 s
10:06:20 [2020-07-24T14:06:20.429Z] testMixedOrderCoalescing(org.eclipse.tracecompass.tmf.core.tests.component.TmfEventProviderCoalescingTest)  Time elapsed: 0.45 s
10:06:20 [2020-07-24T14:06:20.429Z] testMixedCoalescing2(org.eclipse.tracecompass.tmf.core.tests.component.TmfEventProviderCoalescingTest)  Time elapsed: 0.402 s
10:06:20 [2020-07-24T14:06:20.429Z] testParentFirstCoalescing(org.eclipse.tracecompass.tmf.core.tests.component.TmfEventProviderCoalescingTest)  Time elapsed: 0 s
10:06:20 [2020-07-24T14:06:20.429Z] testTraceDependencyForeground(org.eclipse.tracecompass.tmf.core.tests.component.TmfEventProviderCoalescingTest)  Time elapsed: 0.48 s
10:06:20 [2020-07-24T14:06:20.429Z] Running org.eclipse.tracecompass.tmf.core.tests.component.TmfEventProviderTest
10:06:28 [2020-07-24T14:06:28.511Z] Tests run: 6, Failures: 0, Errors: 0, Skipped: 0, Time elapsed: 7.616 s - in org.eclipse.tracecompass.tmf.core.tests.component.TmfEventProviderTest
10:06:28 [2020-07-24T14:06:28.512Z] testGetPlainEvents(org.eclipse.tracecompass.tmf.core.tests.component.TmfEventProviderTest)  Time elapsed: 1.222 s
10:06:28 [2020-07-24T14:06:28.512Z] testGetSyntheticEvents_TimeRange(org.eclipse.tracecompass.tmf.core.tests.component.TmfEventProviderTest)  Time elapsed: 1.304 s
10:06:28 [2020-07-24T14:06:28.512Z] testGetProviders(org.eclipse.tracecompass.tmf.core.tests.component.TmfEventProviderTest)  Time elapsed: 1.223 s
10:06:28 [2020-07-24T14:06:28.512Z] testCancelRequests(org.eclipse.tracecompass.tmf.core.tests.component.TmfEventProviderTest)  Time elapsed: 1.218 s
10:06:28 [2020-07-24T14:06:28.512Z] testGetSyntheticEvents_EqualBlockSizes(org.eclipse.tracecompass.tmf.core.tests.component.TmfEventProviderTest)  Time elapsed: 1.425 s
10:06:28 [2020-07-24T14:06:28.512Z] testGetProviders2(org.eclipse.tracecompass.tmf.core.tests.component.TmfEventProviderTest)  Time elapsed: 1.223 s
10:06:28 [2020-07-24T14:06:28.512Z] Running org.eclipse.tracecompass.tmf.core.tests.statesystem.mipmap.TmfMipmapStateProviderTest
10:06:28 [2020-07-24T14:06:28.767Z] Tests run: 11, Failures: 0, Errors: 0, Skipped: 0, Time elapsed: 1.055 s - in org.eclipse.tracecompass.tmf.core.tests.statesystem.mipmap.TmfMipmapStateProviderTest
10:06:28 [2020-07-24T14:06:28.767Z] testQueryMipAvg(org.eclipse.tracecompass.tmf.core.tests.statesystem.mipmap.TmfMipmapStateProviderTest)  Time elapsed: 0.018 s
10:06:28 [2020-07-24T14:06:28.767Z] testQueryMipMax(org.eclipse.tracecompass.tmf.core.tests.statesystem.mipmap.TmfMipmapStateProviderTest)  Time elapsed: 0.016 s
10:06:28 [2020-07-24T14:06:28.767Z] testQueryMipMin(org.eclipse.tracecompass.tmf.core.tests.statesystem.mipmap.TmfMipmapStateProviderTest)  Time elapsed: 0.011 s
10:06:28 [2020-07-24T14:06:28.767Z] testQuery(org.eclipse.tracecompass.tmf.core.tests.statesystem.mipmap.TmfMipmapStateProviderTest)  Time elapsed: 0.009 s
10:06:28 [2020-07-24T14:06:28.767Z] testQueryValuesOnClose(org.eclipse.tracecompass.tmf.core.tests.statesystem.mipmap.TmfMipmapStateProviderTest)  Time elapsed: 0.001 s
10:06:28 [2020-07-24T14:06:28.767Z] testQueryValuesOnStart(org.eclipse.tracecompass.tmf.core.tests.statesystem.mipmap.TmfMipmapStateProviderTest)  Time elapsed: 0.009 s
10:06:28 [2020-07-24T14:06:28.767Z] testQueryMipmapRangeAvg(org.eclipse.tracecompass.tmf.core.tests.statesystem.mipmap.TmfMipmapStateProviderTest)  Time elapsed: 0.18 s
10:06:28 [2020-07-24T14:06:28.767Z] testQueryMipmapRangeMax(org.eclipse.tracecompass.tmf.core.tests.statesystem.mipmap.TmfMipmapStateProviderTest)  Time elapsed: 0.152 s
10:06:28 [2020-07-24T14:06:28.767Z] testQueryMipmapRangeMin(org.eclipse.tracecompass.tmf.core.tests.statesystem.mipmap.TmfMipmapStateProviderTest)  Time elapsed: 0.149 s
10:06:28 [2020-07-24T14:06:28.767Z] testMaxLevel(org.eclipse.tracecompass.tmf.core.tests.statesystem.mipmap.TmfMipmapStateProviderTest)  Time elapsed: 0.008 s
10:06:28 [2020-07-24T14:06:28.767Z] testQueryEventField(org.eclipse.tracecompass.tmf.core.tests.statesystem.mipmap.TmfMipmapStateProviderTest)  Time elapsed: 0.008 s
10:06:28 [2020-07-24T14:06:28.767Z] Running org.eclipse.tracecompass.tmf.core.tests.statesystem.mipmap.TmfMipmapStateProviderWeightedTest
10:06:29 [2020-07-24T14:06:29.023Z] Tests run: 6, Failures: 0, Errors: 0, Skipped: 0, Time elapsed: 0.204 s - in org.eclipse.tracecompass.tmf.core.tests.statesystem.mipmap.TmfMipmapStateProviderWeightedTest
10:06:29 [2020-07-24T14:06:29.023Z] testQueryMipmapRangeMinInteger(org.eclipse.tracecompass.tmf.core.tests.statesystem.mipmap.TmfMipmapStateProviderWeightedTest)  Time elapsed: 0 s
10:06:29 [2020-07-24T14:06:29.023Z] testQueryMipmapRangeMaxDouble(org.eclipse.tracecompass.tmf.core.tests.statesystem.mipmap.TmfMipmapStateProviderWeightedTest)  Time elapsed: 0.001 s
10:06:29 [2020-07-24T14:06:29.023Z] testQueryMipmapRangeAvgDouble(org.eclipse.tracecompass.tmf.core.tests.statesystem.mipmap.TmfMipmapStateProviderWeightedTest)  Time elapsed: 0 s
10:06:29 [2020-07-24T14:06:29.023Z] testQueryMipmapRangeAvgInteger(org.eclipse.tracecompass.tmf.core.tests.statesystem.mipmap.TmfMipmapStateProviderWeightedTest)  Time elapsed: 0.001 s
10:06:29 [2020-07-24T14:06:29.023Z] testQueryMipmapRangeMinDouble(org.eclipse.tracecompass.tmf.core.tests.statesystem.mipmap.TmfMipmapStateProviderWeightedTest)  Time elapsed: 0 s
10:06:29 [2020-07-24T14:06:29.023Z] testQueryMipmapRangeMaxInteger(org.eclipse.tracecompass.tmf.core.tests.statesystem.mipmap.TmfMipmapStateProviderWeightedTest)  Time elapsed: 0 s
10:06:29 [2020-07-24T14:06:29.023Z] Running org.eclipse.tracecompass.tmf.core.tests.statesystem.ExperimentStateSystemModuleTest
10:06:30 [2020-07-24T14:06:30.389Z] Tests run: 2, Failures: 0, Errors: 0, Skipped: 0, Time elapsed: 1.428 s - in org.eclipse.tracecompass.tmf.core.tests.statesystem.ExperimentStateSystemModuleTest
10:06:30 [2020-07-24T14:06:30.389Z] testSsModule(org.eclipse.tracecompass.tmf.core.tests.statesystem.ExperimentStateSystemModuleTest)  Time elapsed: 1.39 s
10:06:30 [2020-07-24T14:06:30.389Z] testInitialization(org.eclipse.tracecompass.tmf.core.tests.statesystem.ExperimentStateSystemModuleTest)  Time elapsed: 0.038 s
10:06:30 [2020-07-24T14:06:30.389Z] Running org.eclipse.tracecompass.tmf.core.tests.statesystem.StateSystemAnalysisModuleTest
10:06:32 [2020-07-24T14:06:32.905Z] 
10:06:32 [2020-07-24T14:06:32.905Z] !ENTRY org.eclipse.tracecompass.tmf.core 4 2 2020-07-24 14:06:32.602
10:06:32 [2020-07-24T14:06:32.905Z] !MESSAGE Problems occurred when invoking code from plug-in: "org.eclipse.tracecompass.tmf.core".
10:06:32 [2020-07-24T14:06:32.905Z] !STACK 0
10:06:32 [2020-07-24T14:06:32.905Z] java.lang.IllegalArgumentException: Expected exception: should be caught by the analysis itself
10:06:32 [2020-07-24T14:06:32.905Z] 	at org.eclipse.tracecompass.tmf.core.tests.statesystem.StateSystemAnalysisModuleTest$BreakingTest.eventHandle(StateSystemAnalysisModuleTest.java:81)
10:06:32 [2020-07-24T14:06:32.905Z] 	at org.eclipse.tracecompass.tmf.core.statesystem.AbstractTmfStateProvider$EventProcessor.run(AbstractTmfStateProvider.java:336)
10:06:32 [2020-07-24T14:06:32.905Z] 	at org.eclipse.core.runtime.SafeRunner.run(SafeRunner.java:45)
10:06:32 [2020-07-24T14:06:32.905Z] 	at org.eclipse.tracecompass.tmf.core.statesystem.AbstractTmfStateProvider.lambda$2(AbstractTmfStateProvider.java:147)
10:06:32 [2020-07-24T14:06:32.905Z] 	at java.base/java.lang.Thread.run(Thread.java:834)
10:06:33 [2020-07-24T14:06:33.833Z] 
10:06:33 [2020-07-24T14:06:33.833Z] !ENTRY org.eclipse.tracecompass.tmf.core 4 2 2020-07-24 14:06:33.701
10:06:33 [2020-07-24T14:06:33.833Z] !MESSAGE Problems occurred when invoking code from plug-in: "org.eclipse.tracecompass.tmf.core".
10:06:33 [2020-07-24T14:06:33.833Z] !STACK 0
10:06:33 [2020-07-24T14:06:33.833Z] java.lang.IllegalArgumentException: Expected exception: should be caught by either the analysis or the event request
10:06:33 [2020-07-24T14:06:33.833Z] 	at org.eclipse.tracecompass.tmf.core.tests.statesystem.StateSystemAnalysisModuleTest$BreakingTest.eventHandle(StateSystemAnalysisModuleTest.java:81)
10:06:33 [2020-07-24T14:06:33.833Z] 	at org.eclipse.tracecompass.tmf.core.statesystem.AbstractTmfStateProvider$EventProcessor.run(AbstractTmfStateProvider.java:336)
10:06:33 [2020-07-24T14:06:33.833Z] 	at org.eclipse.core.runtime.SafeRunner.run(SafeRunner.java:45)
10:06:33 [2020-07-24T14:06:33.833Z] 	at org.eclipse.tracecompass.tmf.core.statesystem.AbstractTmfStateProvider.lambda$2(AbstractTmfStateProvider.java:147)
10:06:33 [2020-07-24T14:06:33.833Z] 	at java.base/java.lang.Thread.run(Thread.java:834)
10:06:35 [2020-07-24T14:06:35.200Z] 
10:06:35 [2020-07-24T14:06:35.200Z] !ENTRY org.eclipse.tracecompass.tmf.core 4 2 2020-07-24 14:06:34.801
10:06:35 [2020-07-24T14:06:35.200Z] !MESSAGE Problems occurred when invoking code from plug-in: "org.eclipse.tracecompass.tmf.core".
10:06:35 [2020-07-24T14:06:35.200Z] !STACK 0
10:06:35 [2020-07-24T14:06:35.200Z] java.lang.IllegalArgumentException: Expected exception: should be caught by the event request thread
10:06:35 [2020-07-24T14:06:35.200Z] 	at org.eclipse.tracecompass.tmf.core.tests.statesystem.StateSystemAnalysisModuleTest$BreakingTest.eventHandle(StateSystemAnalysisModuleTest.java:81)
10:06:35 [2020-07-24T14:06:35.200Z] 	at org.eclipse.tracecompass.tmf.core.statesystem.AbstractTmfStateProvider$EventProcessor.run(AbstractTmfStateProvider.java:336)
10:06:35 [2020-07-24T14:06:35.200Z] 	at org.eclipse.core.runtime.SafeRunner.run(SafeRunner.java:45)
10:06:35 [2020-07-24T14:06:35.200Z] 	at org.eclipse.tracecompass.tmf.core.statesystem.AbstractTmfStateProvider.lambda$2(AbstractTmfStateProvider.java:147)
10:06:35 [2020-07-24T14:06:35.200Z] 	at java.base/java.lang.Thread.run(Thread.java:834)
10:06:35 [2020-07-24T14:06:35.200Z] 
10:06:35 [2020-07-24T14:06:35.200Z] !ENTRY org.eclipse.tracecompass.tmf.core 4 0 2020-07-24 14:06:34.801
10:06:35 [2020-07-24T14:06:35.201Z] !MESSAGE An uncaught exception happened on request [TestStateSystemModule$TestStateSystemRequest(700,ITmfEvent,BACKGROUND,TmfTimeRange [fStartTime=00:12:43.145 224 192, fEndTime=23:47:16.854 775 807],0,2147483647,0)]: Expected exception: should be caught by the event request thread
10:06:37 [2020-07-24T14:06:37.092Z] 
10:06:37 [2020-07-24T14:06:37.092Z] !ENTRY org.eclipse.tracecompass.tmf.core 4 0 2020-07-24 14:06:37.017
10:06:37 [2020-07-24T14:06:37.092Z] !MESSAGE An uncaught exception happened on request [TestStateSystemModule$TestStateSystemRequest(707,ITmfEvent,BACKGROUND,TmfTimeRange [fStartTime=00:12:43.145 224 192, fEndTime=23:47:16.854 775 807],0,2147483647,0)]: This exception is desired and part of the test
10:06:38 [2020-07-24T14:06:38.458Z] 
10:06:38 [2020-07-24T14:06:38.459Z] !ENTRY org.eclipse.tracecompass.tmf.core 4 0 2020-07-24 14:06:38.139
10:06:38 [2020-07-24T14:06:38.459Z] !MESSAGE Unexpected error executing analysis with trace analysis_dependency.xml
10:06:38 [2020-07-24T14:06:38.459Z] !STACK 0
10:06:38 [2020-07-24T14:06:38.459Z] java.lang.IllegalStateException: This exception happens before initialization
10:06:38 [2020-07-24T14:06:38.459Z] 	at org.eclipse.tracecompass.tmf.core.tests.statesystem.StateSystemAnalysisModuleTest$4.executeAnalysis(StateSystemAnalysisModuleTest.java:455)
10:06:38 [2020-07-24T14:06:38.459Z] 	at org.eclipse.tracecompass.tmf.core.analysis.TmfAbstractAnalysisModule$1.run(TmfAbstractAnalysisModule.java:394)
10:06:38 [2020-07-24T14:06:38.459Z] 	at org.eclipse.core.internal.jobs.Worker.run(Worker.java:63)
10:06:38 [2020-07-24T14:06:38.459Z] 
10:06:38 [2020-07-24T14:06:38.459Z] !ENTRY org.eclipse.tracecompass.tmf.core 4 0 2020-07-24 14:06:38.140
10:06:38 [2020-07-24T14:06:38.459Z] !MESSAGE Exception executing analysis
10:06:38 [2020-07-24T14:06:38.459Z] !STACK 0
10:06:38 [2020-07-24T14:06:38.459Z] java.lang.IllegalStateException: This exception happens before initialization
10:06:38 [2020-07-24T14:06:38.459Z] 	at org.eclipse.tracecompass.tmf.core.tests.statesystem.StateSystemAnalysisModuleTest$4.executeAnalysis(StateSystemAnalysisModuleTest.java:455)
10:06:38 [2020-07-24T14:06:38.459Z] 	at org.eclipse.tracecompass.tmf.core.analysis.TmfAbstractAnalysisModule$1.run(TmfAbstractAnalysisModule.java:394)
10:06:38 [2020-07-24T14:06:38.459Z] 	at org.eclipse.core.internal.jobs.Worker.run(Worker.java:63)
10:06:39 [2020-07-24T14:06:39.386Z] Tests run: 10, Failures: 0, Errors: 0, Skipped: 1, Time elapsed: 8.882 s - in org.eclipse.tracecompass.tmf.core.tests.statesystem.StateSystemAnalysisModuleTest
10:06:39 [2020-07-24T14:06:39.387Z] testProperties(org.eclipse.tracecompass.tmf.core.tests.statesystem.StateSystemAnalysisModuleTest)  Time elapsed: 0.008 s
10:06:39 [2020-07-24T14:06:39.387Z] testIsQueryable(org.eclipse.tracecompass.tmf.core.tests.statesystem.StateSystemAnalysisModuleTest)  Time elapsed: 1.111 s
10:06:39 [2020-07-24T14:06:39.387Z] testFaultyStateProvider(org.eclipse.tracecompass.tmf.core.tests.statesystem.StateSystemAnalysisModuleTest)  Time elapsed: 3.31 s
10:06:39 [2020-07-24T14:06:39.387Z] testIsQueryableCancel(org.eclipse.tracecompass.tmf.core.tests.statesystem.StateSystemAnalysisModuleTest) skipped
10:06:39 [2020-07-24T14:06:39.387Z] testReReadFullAnalysis(org.eclipse.tracecompass.tmf.core.tests.statesystem.StateSystemAnalysisModuleTest)  Time elapsed: 1.109 s
10:06:39 [2020-07-24T14:06:39.387Z] testRequestFailure(org.eclipse.tracecompass.tmf.core.tests.statesystem.StateSystemAnalysisModuleTest)  Time elapsed: 1.109 s
10:06:39 [2020-07-24T14:06:39.387Z] testSsModule(org.eclipse.tracecompass.tmf.core.tests.statesystem.StateSystemAnalysisModuleTest)  Time elapsed: 1.11 s
10:06:39 [2020-07-24T14:06:39.387Z] testInitialization(org.eclipse.tracecompass.tmf.core.tests.statesystem.StateSystemAnalysisModuleTest)  Time elapsed: 0.005 s
10:06:39 [2020-07-24T14:06:39.387Z] testFailBeforeInitialization(org.eclipse.tracecompass.tmf.core.tests.statesystem.StateSystemAnalysisModuleTest)  Time elapsed: 0.008 s
10:06:39 [2020-07-24T14:06:39.387Z] testFutureEvents(org.eclipse.tracecompass.tmf.core.tests.statesystem.StateSystemAnalysisModuleTest)  Time elapsed: 1.11 s
10:06:39 [2020-07-24T14:06:39.387Z] Running org.eclipse.tracecompass.tmf.core.tests.statesystem.AttributePoolTest
10:06:39 [2020-07-24T14:06:39.387Z] Tests run: 8, Failures: 0, Errors: 0, Skipped: 0, Time elapsed: 0.001 s - in org.eclipse.tracecompass.tmf.core.tests.statesystem.AttributePoolTest
10:06:39 [2020-07-24T14:06:39.387Z] testSimplePool(org.eclipse.tracecompass.tmf.core.tests.statesystem.AttributePoolTest)  Time elapsed: 0.001 s
10:06:39 [2020-07-24T14:06:39.387Z] testConstructorBad2(org.eclipse.tracecompass.tmf.core.tests.statesystem.AttributePoolTest)  Time elapsed: 0 s
10:06:39 [2020-07-24T14:06:39.387Z] testConstructorGood(org.eclipse.tracecompass.tmf.core.tests.statesystem.AttributePoolTest)  Time elapsed: 0 s
10:06:39 [2020-07-24T14:06:39.387Z] testRecycleWrongQuark(org.eclipse.tracecompass.tmf.core.tests.statesystem.AttributePoolTest)  Time elapsed: 0 s
10:06:39 [2020-07-24T14:06:39.387Z] testRecycleChildQuark(org.eclipse.tracecompass.tmf.core.tests.statesystem.AttributePoolTest)  Time elapsed: 0 s
10:06:39 [2020-07-24T14:06:39.387Z] testPoolWithSubTree(org.eclipse.tracecompass.tmf.core.tests.statesystem.AttributePoolTest)  Time elapsed: 0 s
10:06:39 [2020-07-24T14:06:39.387Z] testConstructorBad(org.eclipse.tracecompass.tmf.core.tests.statesystem.AttributePoolTest)  Time elapsed: 0 s
10:06:39 [2020-07-24T14:06:39.387Z] testPriorityPool(org.eclipse.tracecompass.tmf.core.tests.statesystem.AttributePoolTest)  Time elapsed: 0 s
10:06:39 [2020-07-24T14:06:39.387Z] Running org.eclipse.tracecompass.tmf.core.tests.io.BufferedRandomAccessFileTest
10:06:39 [2020-07-24T14:06:39.387Z] Tests run: 4, Failures: 0, Errors: 0, Skipped: 0, Time elapsed: 0.037 s - in org.eclipse.tracecompass.tmf.core.tests.io.BufferedRandomAccessFileTest
10:06:39 [2020-07-24T14:06:39.387Z] testSeekAndWrite(org.eclipse.tracecompass.tmf.core.tests.io.BufferedRandomAccessFileTest)  Time elapsed: 0.002 s
10:06:39 [2020-07-24T14:06:39.387Z] testRead(org.eclipse.tracecompass.tmf.core.tests.io.BufferedRandomAccessFileTest)  Time elapsed: 0.001 s
10:06:39 [2020-07-24T14:06:39.387Z] testReadLine(org.eclipse.tracecompass.tmf.core.tests.io.BufferedRandomAccessFileTest)  Time elapsed: 0 s
10:06:39 [2020-07-24T14:06:39.387Z] testSeekAndRead(org.eclipse.tracecompass.tmf.core.tests.io.BufferedRandomAccessFileTest)  Time elapsed: 0.034 s
10:06:39 [2020-07-24T14:06:39.387Z] Running org.eclipse.tracecompass.tmf.core.tests.io.ResourceUtilTest
10:06:39 [2020-07-24T14:06:39.951Z] Tests run: 14, Failures: 0, Errors: 0, Skipped: 0, Time elapsed: 0.384 s - in org.eclipse.tracecompass.tmf.core.tests.io.ResourceUtilTest
10:06:39 [2020-07-24T14:06:39.951Z] testCopyResource[0: (P/SomeProject)](org.eclipse.tracecompass.tmf.core.tests.io.ResourceUtilTest)  Time elapsed: 0.097 s
10:06:39 [2020-07-24T14:06:39.951Z] testGetLocationUri[0: (P/SomeProject)](org.eclipse.tracecompass.tmf.core.tests.io.ResourceUtilTest)  Time elapsed: 0 s
10:06:39 [2020-07-24T14:06:39.951Z] testCreateSymbolicLink[0: (P/SomeProject)](org.eclipse.tracecompass.tmf.core.tests.io.ResourceUtilTest)  Time elapsed: 0.064 s
10:06:39 [2020-07-24T14:06:39.951Z] testGetLocation[0: (P/SomeProject)](org.eclipse.tracecompass.tmf.core.tests.io.ResourceUtilTest)  Time elapsed: 0.002 s
10:06:39 [2020-07-24T14:06:39.951Z] testDeleteResource[0: (P/SomeProject)](org.eclipse.tracecompass.tmf.core.tests.io.ResourceUtilTest)  Time elapsed: 0.021 s
10:06:39 [2020-07-24T14:06:39.951Z] testDeleteIfBrokenSymbolicLink[0: (P/SomeProject)](org.eclipse.tracecompass.tmf.core.tests.io.ResourceUtilTest)  Time elapsed: 0.004 s
10:06:39 [2020-07-24T14:06:39.951Z] testIsSymbolicLink[0: (P/SomeProject)](org.eclipse.tracecompass.tmf.core.tests.io.ResourceUtilTest)  Time elapsed: 0.002 s
10:06:39 [2020-07-24T14:06:39.951Z] testCopyResource[1: (P/SomeOtherProject)](org.eclipse.tracecompass.tmf.core.tests.io.ResourceUtilTest)  Time elapsed: 0.124 s
10:06:39 [2020-07-24T14:06:39.951Z] testGetLocationUri[1: (P/SomeOtherProject)](org.eclipse.tracecompass.tmf.core.tests.io.ResourceUtilTest)  Time elapsed: 0 s
10:06:39 [2020-07-24T14:06:39.951Z] testCreateSymbolicLink[1: (P/SomeOtherProject)](org.eclipse.tracecompass.tmf.core.tests.io.ResourceUtilTest)  Time elapsed: 0.012 s
10:06:39 [2020-07-24T14:06:39.951Z] testGetLocation[1: (P/SomeOtherProject)](org.eclipse.tracecompass.tmf.core.tests.io.ResourceUtilTest)  Time elapsed: 0.001 s
10:06:39 [2020-07-24T14:06:39.951Z] testDeleteResource[1: (P/SomeOtherProject)](org.eclipse.tracecompass.tmf.core.tests.io.ResourceUtilTest)  Time elapsed: 0.039 s
10:06:39 [2020-07-24T14:06:39.951Z] testDeleteIfBrokenSymbolicLink[1: (P/SomeOtherProject)](org.eclipse.tracecompass.tmf.core.tests.io.ResourceUtilTest)  Time elapsed: 0.005 s
10:06:39 [2020-07-24T14:06:39.951Z] testIsSymbolicLink[1: (P/SomeOtherProject)](org.eclipse.tracecompass.tmf.core.tests.io.ResourceUtilTest)  Time elapsed: 0.001 s
10:06:39 [2020-07-24T14:06:39.951Z] Running org.eclipse.tracecompass.tmf.core.tests.model.TmfTraceCoreUtilsTest
10:06:39 [2020-07-24T14:06:39.951Z] Tests run: 1, Failures: 0, Errors: 0, Skipped: 0, Time elapsed: 0 s - in org.eclipse.tracecompass.tmf.core.tests.model.TmfTraceCoreUtilsTest
10:06:39 [2020-07-24T14:06:39.951Z] testValidateName(org.eclipse.tracecompass.tmf.core.tests.model.TmfTraceCoreUtilsTest)  Time elapsed: 0 s
10:06:39 [2020-07-24T14:06:39.951Z] Running org.eclipse.tracecompass.tmf.core.tests.signal.TmfSignalManagerTest
10:06:39 [2020-07-24T14:06:39.951Z] Tests run: 6, Failures: 0, Errors: 0, Skipped: 0, Time elapsed: 0.014 s - in org.eclipse.tracecompass.tmf.core.tests.signal.TmfSignalManagerTest
10:06:39 [2020-07-24T14:06:39.951Z] testInboundBlacklisting(org.eclipse.tracecompass.tmf.core.tests.signal.TmfSignalManagerTest)  Time elapsed: 0.001 s
10:06:39 [2020-07-24T14:06:39.951Z] testBroadcastAsync(org.eclipse.tracecompass.tmf.core.tests.signal.TmfSignalManagerTest)  Time elapsed: 0.002 s
10:06:39 [2020-07-24T14:06:39.951Z] testSendReceive(org.eclipse.tracecompass.tmf.core.tests.signal.TmfSignalManagerTest)  Time elapsed: 0.001 s
10:06:39 [2020-07-24T14:06:39.951Z] testConcurrentSignals(org.eclipse.tracecompass.tmf.core.tests.signal.TmfSignalManagerTest)  Time elapsed: 0.009 s
10:06:39 [2020-07-24T14:06:39.951Z] testOutboundBlacklisting(org.eclipse.tracecompass.tmf.core.tests.signal.TmfSignalManagerTest)  Time elapsed: 0 s
10:06:39 [2020-07-24T14:06:39.951Z] testNestedSignals(org.eclipse.tracecompass.tmf.core.tests.signal.TmfSignalManagerTest)  Time elapsed: 0 s
10:06:39 [2020-07-24T14:06:39.951Z] Running org.eclipse.tracecompass.tmf.core.tests.signal.TmfSignalThrottlerTest
10:06:57 [2020-07-24T14:06:57.995Z] Tests run: 3, Failures: 0, Errors: 0, Skipped: 0, Time elapsed: 16.042 s - in org.eclipse.tracecompass.tmf.core.tests.signal.TmfSignalThrottlerTest
10:06:57 [2020-07-24T14:06:57.995Z] testDelay(org.eclipse.tracecompass.tmf.core.tests.signal.TmfSignalThrottlerTest)  Time elapsed: 6.041 s
10:06:57 [2020-07-24T14:06:57.996Z] testOneChannel(org.eclipse.tracecompass.tmf.core.tests.signal.TmfSignalThrottlerTest)  Time elapsed: 5 s
10:06:57 [2020-07-24T14:06:57.996Z] testMultipleChannels(org.eclipse.tracecompass.tmf.core.tests.signal.TmfSignalThrottlerTest)  Time elapsed: 5 s
10:06:57 [2020-07-24T14:06:57.996Z] Running org.eclipse.tracecompass.tmf.core.tests.markers.MarkerSetTest
10:06:57 [2020-07-24T14:06:57.996Z] Tests run: 2, Failures: 0, Errors: 0, Skipped: 0, Time elapsed: 0.005 s - in org.eclipse.tracecompass.tmf.core.tests.markers.MarkerSetTest
10:06:57 [2020-07-24T14:06:57.996Z] testAddMarker(org.eclipse.tracecompass.tmf.core.tests.markers.MarkerSetTest)  Time elapsed: 0.003 s
10:06:57 [2020-07-24T14:06:57.996Z] testConstructor(org.eclipse.tracecompass.tmf.core.tests.markers.MarkerSetTest)  Time elapsed: 0 s
10:06:57 [2020-07-24T14:06:57.996Z] Running org.eclipse.tracecompass.tmf.core.tests.markers.MarkerTest
10:06:57 [2020-07-24T14:06:57.996Z] Tests run: 3, Failures: 0, Errors: 0, Skipped: 0, Time elapsed: 0.001 s - in org.eclipse.tracecompass.tmf.core.tests.markers.MarkerTest
10:06:57 [2020-07-24T14:06:57.996Z] testAddSegment(org.eclipse.tracecompass.tmf.core.tests.markers.MarkerTest)  Time elapsed: 0 s
10:06:57 [2020-07-24T14:06:57.996Z] testAddSubMarker(org.eclipse.tracecompass.tmf.core.tests.markers.MarkerTest)  Time elapsed: 0 s
10:06:57 [2020-07-24T14:06:57.996Z] testConstructor(org.eclipse.tracecompass.tmf.core.tests.markers.MarkerTest)  Time elapsed: 0.001 s
10:06:57 [2020-07-24T14:06:57.996Z] Running org.eclipse.tracecompass.tmf.core.tests.markers.MarkerConfigXmlParserTest
10:06:57 [2020-07-24T14:06:57.996Z] 
10:06:57 [2020-07-24T14:06:57.996Z] !ENTRY org.eclipse.tracecompass.tmf.core 4 0 2020-07-24 14:06:55.790
10:06:57 [2020-07-24T14:06:57.996Z] !MESSAGE Error parsing /tmp/markers12131512501598547459xml
10:06:57 [2020-07-24T14:06:57.996Z] !STACK 0
10:06:57 [2020-07-24T14:06:57.996Z] org.xml.sax.SAXParseException; systemId: file:/tmp/markers12131512501598547459xml; lineNumber: 1; columnNumber: 201; cvc-datatype-valid.1.2.1: 'abc' is not a valid value for 'double'.
10:06:57 [2020-07-24T14:06:57.996Z] 	at java.xml/com.sun.org.apache.xerces.internal.util.ErrorHandlerWrapper.createSAXParseException(ErrorHandlerWrapper.java:204)
10:06:57 [2020-07-24T14:06:57.996Z] 	at java.xml/com.sun.org.apache.xerces.internal.util.ErrorHandlerWrapper.error(ErrorHandlerWrapper.java:135)
10:06:57 [2020-07-24T14:06:57.996Z] 	at java.xml/com.sun.org.apache.xerces.internal.impl.XMLErrorReporter.reportError(XMLErrorReporter.java:396)
10:06:57 [2020-07-24T14:06:57.996Z] 	at java.xml/com.sun.org.apache.xerces.internal.impl.XMLErrorReporter.reportError(XMLErrorReporter.java:327)
10:06:57 [2020-07-24T14:06:57.996Z] 	at java.xml/com.sun.org.apache.xerces.internal.impl.XMLErrorReporter.reportError(XMLErrorReporter.java:284)
10:06:57 [2020-07-24T14:06:57.996Z] 	at java.xml/com.sun.org.apache.xerces.internal.impl.xs.XMLSchemaValidator$XSIErrorReporter.reportError(XMLSchemaValidator.java:511)
10:06:57 [2020-07-24T14:06:57.996Z] 	at java.xml/com.sun.org.apache.xerces.internal.impl.xs.XMLSchemaValidator.reportSchemaError(XMLSchemaValidator.java:3587)
10:06:57 [2020-07-24T14:06:57.996Z] 	at java.xml/com.sun.org.apache.xerces.internal.impl.xs.XMLSchemaValidator.processOneAttribute(XMLSchemaValidator.java:3107)
10:06:57 [2020-07-24T14:06:57.996Z] 	at java.xml/com.sun.org.apache.xerces.internal.impl.xs.XMLSchemaValidator.processAttributes(XMLSchemaValidator.java:3051)
10:06:57 [2020-07-24T14:06:57.996Z] 	at java.xml/com.sun.org.apache.xerces.internal.impl.xs.XMLSchemaValidator.handleStartElement(XMLSchemaValidator.java:2286)
10:06:57 [2020-07-24T14:06:57.996Z] 	at java.xml/com.sun.org.apache.xerces.internal.impl.xs.XMLSchemaValidator.startElement(XMLSchemaValidator.java:829)
10:06:57 [2020-07-24T14:06:57.996Z] 	at java.xml/com.sun.org.apache.xerces.internal.impl.XMLNSDocumentScannerImpl.scanStartElement(XMLNSDocumentScannerImpl.java:374)
10:06:57 [2020-07-24T14:06:57.996Z] 	at java.xml/com.sun.org.apache.xerces.internal.impl.XMLDocumentFragmentScannerImpl$FragmentContentDriver.next(XMLDocumentFragmentScannerImpl.java:2708)
10:06:57 [2020-07-24T14:06:57.996Z] 	at java.xml/com.sun.org.apache.xerces.internal.impl.XMLDocumentScannerImpl.next(XMLDocumentScannerImpl.java:605)
10:06:57 [2020-07-24T14:06:57.996Z] 	at java.xml/com.sun.org.apache.xerces.internal.impl.XMLNSDocumentScannerImpl.next(XMLNSDocumentScannerImpl.java:112)
10:06:57 [2020-07-24T14:06:57.996Z] 	at java.xml/com.sun.org.apache.xerces.internal.impl.XMLDocumentFragmentScannerImpl.scanDocument(XMLDocumentFragmentScannerImpl.java:534)
10:06:57 [2020-07-24T14:06:57.996Z] 	at java.xml/com.sun.org.apache.xerces.internal.parsers.XML11Configuration.parse(XML11Configuration.java:888)
10:06:57 [2020-07-24T14:06:57.996Z] 	at java.xml/com.sun.org.apache.xerces.internal.parsers.XML11Configuration.parse(XML11Configuration.java:824)
10:06:57 [2020-07-24T14:06:57.996Z] 	at java.xml/com.sun.org.apache.xerces.internal.parsers.XMLParser.parse(XMLParser.java:141)
10:06:57 [2020-07-24T14:06:57.996Z] 	at java.xml/com.sun.org.apache.xerces.internal.parsers.DOMParser.parse(DOMParser.java:246)
10:06:57 [2020-07-24T14:06:57.996Z] 	at java.xml/com.sun.org.apache.xerces.internal.jaxp.DocumentBuilderImpl.parse(DocumentBuilderImpl.java:339)
10:06:57 [2020-07-24T14:06:57.996Z] 	at java.xml/javax.xml.parsers.DocumentBuilder.parse(DocumentBuilder.java:206)
10:06:57 [2020-07-24T14:06:57.996Z] 	at org.eclipse.tracecompass.internal.tmf.core.markers.MarkerConfigXmlParser.parse(MarkerConfigXmlParser.java:172)
10:06:57 [2020-07-24T14:06:57.996Z] 	at org.eclipse.tracecompass.tmf.core.tests.markers.MarkerConfigXmlParserTest.testParseInvalidContent(MarkerConfigXmlParserTest.java:307)
10:06:57 [2020-07-24T14:06:57.996Z] 	at org.eclipse.tracecompass.tmf.core.tests.markers.MarkerConfigXmlParserTest.testParseInvalidContent(MarkerConfigXmlParserTest.java:290)
10:06:57 [2020-07-24T14:06:57.996Z] 	at java.base/jdk.internal.reflect.NativeMethodAccessorImpl.invoke0(Native Method)
10:06:57 [2020-07-24T14:06:57.996Z] 	at java.base/jdk.internal.reflect.NativeMethodAccessorImpl.invoke(NativeMethodAccessorImpl.java:62)
10:06:57 [2020-07-24T14:06:57.996Z] 	at java.base/jdk.internal.reflect.DelegatingMethodAccessorImpl.invoke(DelegatingMethodAccessorImpl.java:43)
10:06:57 [2020-07-24T14:06:57.996Z] 	at java.base/java.lang.reflect.Method.invoke(Method.java:566)
10:06:57 [2020-07-24T14:06:57.996Z] 	at org.junit.runners.model.FrameworkMethod$1.runReflectiveCall(FrameworkMethod.java:59)
10:06:57 [2020-07-24T14:06:57.996Z] 	at org.junit.internal.runners.model.ReflectiveCallable.run(ReflectiveCallable.java:12)
10:06:57 [2020-07-24T14:06:57.996Z] 	at org.junit.runners.model.FrameworkMethod.invokeExplosively(FrameworkMethod.java:56)
10:06:57 [2020-07-24T14:06:57.996Z] 	at org.junit.internal.runners.statements.InvokeMethod.evaluate(InvokeMethod.java:17)
10:06:57 [2020-07-24T14:06:57.996Z] 	at org.junit.runners.ParentRunner$3.evaluate(ParentRunner.java:306)
10:06:57 [2020-07-24T14:06:57.996Z] 	at org.junit.runners.BlockJUnit4ClassRunner$1.evaluate(BlockJUnit4ClassRunner.java:100)
10:06:57 [2020-07-24T14:06:57.996Z] 	at org.junit.runners.ParentRunner.runLeaf(ParentRunner.java:366)
10:06:57 [2020-07-24T14:06:57.996Z] 	at org.junit.runners.BlockJUnit4ClassRunner.runChild(BlockJUnit4ClassRunner.java:103)
10:06:57 [2020-07-24T14:06:57.996Z] 	at org.junit.runners.BlockJUnit4ClassRunner.runChild(BlockJUnit4ClassRunner.java:63)
10:06:57 [2020-07-24T14:06:57.996Z] 	at org.junit.runners.ParentRunner$4.run(ParentRunner.java:331)
10:06:57 [2020-07-24T14:06:57.996Z] 	at org.junit.runners.ParentRunner$1.schedule(ParentRunner.java:79)
10:06:57 [2020-07-24T14:06:57.996Z] 	at org.junit.runners.ParentRunner.runChildren(ParentRunner.java:329)
10:06:57 [2020-07-24T14:06:57.996Z] 	at org.junit.runners.ParentRunner.access$100(ParentRunner.java:66)
10:06:57 [2020-07-24T14:06:57.996Z] 	at org.junit.runners.ParentRunner$2.evaluate(ParentRunner.java:293)
10:06:57 [2020-07-24T14:06:57.996Z] 	at org.junit.runners.ParentRunner$3.evaluate(ParentRunner.java:306)
10:06:57 [2020-07-24T14:06:57.996Z] 	at org.junit.runners.ParentRunner.run(ParentRunner.java:413)
10:06:57 [2020-07-24T14:06:57.996Z] 	at org.apache.maven.surefire.junit4.JUnit4Provider.execute(JUnit4Provider.java:365)
10:06:57 [2020-07-24T14:06:57.996Z] 	at org.apache.maven.surefire.junit4.JUnit4Provider.executeWithRerun(JUnit4Provider.java:273)
10:06:57 [2020-07-24T14:06:57.996Z] 	at org.apache.maven.surefire.junit4.JUnit4Provider.executeTestSet(JUnit4Provider.java:238)
10:06:57 [2020-07-24T14:06:57.996Z] 	at org.apache.maven.surefire.junit4.JUnit4Provider.invoke(JUnit4Provider.java:159)
10:06:57 [2020-07-24T14:06:57.996Z] 	at java.base/jdk.internal.reflect.NativeMethodAccessorImpl.invoke0(Native Method)
10:06:57 [2020-07-24T14:06:57.996Z] 	at java.base/jdk.internal.reflect.NativeMethodAccessorImpl.invoke(NativeMethodAccessorImpl.java:62)
10:06:57 [2020-07-24T14:06:57.996Z] 	at java.base/jdk.internal.reflect.DelegatingMethodAccessorImpl.invoke(DelegatingMethodAccessorImpl.java:43)
10:06:57 [2020-07-24T14:06:57.996Z] 	at java.base/java.lang.reflect.Method.invoke(Method.java:566)
10:06:57 [2020-07-24T14:06:57.996Z] 	at org.apache.maven.surefire.util.ReflectionUtils.invokeMethodWithArray2(ReflectionUtils.java:206)
10:06:57 [2020-07-24T14:06:57.996Z] 	at org.apache.maven.surefire.booter.ProviderFactory$ProviderProxy.invoke(ProviderFactory.java:161)
10:06:57 [2020-07-24T14:06:57.996Z] 	at org.apache.maven.surefire.booter.ProviderFactory.invokeProvider(ProviderFactory.java:84)
10:06:57 [2020-07-24T14:06:57.996Z] 	at org.eclipse.tycho.surefire.osgibooter.OsgiSurefireBooter.run(OsgiSurefireBooter.java:110)
10:06:57 [2020-07-24T14:06:57.996Z] 	at org.eclipse.tycho.surefire.osgibooter.HeadlessTestApplication.run(HeadlessTestApplication.java:21)
10:06:57 [2020-07-24T14:06:57.996Z] 	at java.base/jdk.internal.reflect.NativeMethodAccessorImpl.invoke0(Native Method)
10:06:57 [2020-07-24T14:06:57.996Z] 	at java.base/jdk.internal.reflect.NativeMethodAccessorImpl.invoke(NativeMethodAccessorImpl.java:62)
10:06:57 [2020-07-24T14:06:57.996Z] 	at java.base/jdk.internal.reflect.DelegatingMethodAccessorImpl.invoke(DelegatingMethodAccessorImpl.java:43)
10:06:57 [2020-07-24T14:06:57.996Z] 	at java.base/java.lang.reflect.Method.invoke(Method.java:566)
10:06:57 [2020-07-24T14:06:57.996Z] 	at org.eclipse.equinox.internal.app.EclipseAppContainer.callMethodWithException(EclipseAppContainer.java:593)
10:06:57 [2020-07-24T14:06:57.996Z] 	at org.eclipse.equinox.internal.app.EclipseAppHandle.run(EclipseAppHandle.java:205)
10:06:57 [2020-07-24T14:06:57.996Z] 	at org.eclipse.core.runtime.internal.adaptor.EclipseAppLauncher.runApplication(EclipseAppLauncher.java:137)
10:06:57 [2020-07-24T14:06:57.996Z] 	at org.eclipse.core.runtime.internal.adaptor.EclipseAppLauncher.start(EclipseAppLauncher.java:107)
10:06:57 [2020-07-24T14:06:57.996Z] 	at org.eclipse.core.runtime.adaptor.EclipseStarter.run(EclipseStarter.java:401)
10:06:57 [2020-07-24T14:06:57.996Z] 	at org.eclipse.core.runtime.adaptor.EclipseStarter.run(EclipseStarter.java:255)
10:06:57 [2020-07-24T14:06:57.996Z] 	at java.base/jdk.internal.reflect.NativeMethodAccessorImpl.invoke0(Native Method)
10:06:57 [2020-07-24T14:06:57.996Z] 	at java.base/jdk.internal.reflect.NativeMethodAccessorImpl.invoke(NativeMethodAccessorImpl.java:62)
10:06:57 [2020-07-24T14:06:57.996Z] 	at java.base/jdk.internal.reflect.DelegatingMethodAccessorImpl.invoke(DelegatingMethodAccessorImpl.java:43)
10:06:57 [2020-07-24T14:06:57.996Z] 	at java.base/java.lang.reflect.Method.invoke(Method.java:566)
10:06:57 [2020-07-24T14:06:57.996Z] 	at org.eclipse.equinox.launcher.Main.invokeFramework(Main.java:657)
10:06:57 [2020-07-24T14:06:57.996Z] 	at org.eclipse.equinox.launcher.Main.basicRun(Main.java:594)
10:06:57 [2020-07-24T14:06:57.996Z] 	at org.eclipse.equinox.launcher.Main.run(Main.java:1447)
10:06:57 [2020-07-24T14:06:57.996Z] 	at org.eclipse.equinox.launcher.Main.main(Main.java:1420)
10:06:57 [2020-07-24T14:06:57.996Z] 
10:06:57 [2020-07-24T14:06:57.996Z] !ENTRY org.eclipse.tracecompass.tmf.core 4 0 2020-07-24 14:06:55.793
10:06:57 [2020-07-24T14:06:57.996Z] !MESSAGE Error parsing /tmp/markers15046947204278159972xml
10:06:57 [2020-07-24T14:06:57.996Z] !STACK 0
10:06:57 [2020-07-24T14:06:57.996Z] org.xml.sax.SAXParseException; systemId: file:/tmp/markers15046947204278159972xml; lineNumber: 1; columnNumber: 199; cvc-minExclusive-valid: Value '0' is not facet-valid with respect to minExclusive '0.0E1' for type 'period_type'.
10:06:57 [2020-07-24T14:06:57.996Z] 	at java.xml/com.sun.org.apache.xerces.internal.util.ErrorHandlerWrapper.createSAXParseException(ErrorHandlerWrapper.java:204)
10:06:57 [2020-07-24T14:06:57.996Z] 	at java.xml/com.sun.org.apache.xerces.internal.util.ErrorHandlerWrapper.error(ErrorHandlerWrapper.java:135)
10:06:57 [2020-07-24T14:06:57.996Z] 	at java.xml/com.sun.org.apache.xerces.internal.impl.XMLErrorReporter.reportError(XMLErrorReporter.java:396)
10:06:57 [2020-07-24T14:06:57.996Z] 	at java.xml/com.sun.org.apache.xerces.internal.impl.XMLErrorReporter.reportError(XMLErrorReporter.java:327)
10:06:57 [2020-07-24T14:06:57.996Z] 	at java.xml/com.sun.org.apache.xerces.internal.impl.XMLErrorReporter.reportError(XMLErrorReporter.java:284)
10:06:57 [2020-07-24T14:06:57.996Z] 	at java.xml/com.sun.org.apache.xerces.internal.impl.xs.XMLSchemaValidator$XSIErrorReporter.reportError(XMLSchemaValidator.java:511)
10:06:57 [2020-07-24T14:06:57.996Z] 	at java.xml/com.sun.org.apache.xerces.internal.impl.xs.XMLSchemaValidator.reportSchemaError(XMLSchemaValidator.java:3587)
10:06:57 [2020-07-24T14:06:57.996Z] 	at java.xml/com.sun.org.apache.xerces.internal.impl.xs.XMLSchemaValidator.processOneAttribute(XMLSchemaValidator.java:3107)
10:06:57 [2020-07-24T14:06:57.996Z] 	at java.xml/com.sun.org.apache.xerces.internal.impl.xs.XMLSchemaValidator.processAttributes(XMLSchemaValidator.java:3051)
10:06:57 [2020-07-24T14:06:57.996Z] 	at java.xml/com.sun.org.apache.xerces.internal.impl.xs.XMLSchemaValidator.handleStartElement(XMLSchemaValidator.java:2286)
10:06:57 [2020-07-24T14:06:57.996Z] 	at java.xml/com.sun.org.apache.xerces.internal.impl.xs.XMLSchemaValidator.startElement(XMLSchemaValidator.java:829)
10:06:57 [2020-07-24T14:06:57.997Z] 	at java.xml/com.sun.org.apache.xerces.internal.impl.XMLNSDocumentScannerImpl.scanStartElement(XMLNSDocumentScannerImpl.java:374)
10:06:57 [2020-07-24T14:06:57.997Z] 	at java.xml/com.sun.org.apache.xerces.internal.impl.XMLDocumentFragmentScannerImpl$FragmentContentDriver.next(XMLDocumentFragmentScannerImpl.java:2708)
10:06:57 [2020-07-24T14:06:57.997Z] 	at java.xml/com.sun.org.apache.xerces.internal.impl.XMLDocumentScannerImpl.next(XMLDocumentScannerImpl.java:605)
10:06:57 [2020-07-24T14:06:57.997Z] 	at java.xml/com.sun.org.apache.xerces.internal.impl.XMLNSDocumentScannerImpl.next(XMLNSDocumentScannerImpl.java:112)
10:06:57 [2020-07-24T14:06:57.997Z] 	at java.xml/com.sun.org.apache.xerces.internal.impl.XMLDocumentFragmentScannerImpl.scanDocument(XMLDocumentFragmentScannerImpl.java:534)
10:06:57 [2020-07-24T14:06:57.997Z] 	at java.xml/com.sun.org.apache.xerces.internal.parsers.XML11Configuration.parse(XML11Configuration.java:888)
10:06:57 [2020-07-24T14:06:57.997Z] 	at java.xml/com.sun.org.apache.xerces.internal.parsers.XML11Configuration.parse(XML11Configuration.java:824)
10:06:57 [2020-07-24T14:06:57.997Z] 	at java.xml/com.sun.org.apache.xerces.internal.parsers.XMLParser.parse(XMLParser.java:141)
10:06:57 [2020-07-24T14:06:57.997Z] 	at java.xml/com.sun.org.apache.xerces.internal.parsers.DOMParser.parse(DOMParser.java:246)
10:06:57 [2020-07-24T14:06:57.997Z] 	at java.xml/com.sun.org.apache.xerces.internal.jaxp.DocumentBuilderImpl.parse(DocumentBuilderImpl.java:339)
10:06:57 [2020-07-24T14:06:57.997Z] 	at java.xml/javax.xml.parsers.DocumentBuilder.parse(DocumentBuilder.java:206)
10:06:57 [2020-07-24T14:06:57.997Z] 	at org.eclipse.tracecompass.internal.tmf.core.markers.MarkerConfigXmlParser.parse(MarkerConfigXmlParser.java:172)
10:06:57 [2020-07-24T14:06:57.997Z] 	at org.eclipse.tracecompass.tmf.core.tests.markers.MarkerConfigXmlParserTest.testParseInvalidContent(MarkerConfigXmlParserTest.java:307)
10:06:57 [2020-07-24T14:06:57.997Z] 	at org.eclipse.tracecompass.tmf.core.tests.markers.MarkerConfigXmlParserTest.testParseInvalidContent(MarkerConfigXmlParserTest.java:291)
10:06:57 [2020-07-24T14:06:57.997Z] 	at java.base/jdk.internal.reflect.NativeMethodAccessorImpl.invoke0(Native Method)
10:06:57 [2020-07-24T14:06:57.997Z] 	at java.base/jdk.internal.reflect.NativeMethodAccessorImpl.invoke(NativeMethodAccessorImpl.java:62)
10:06:57 [2020-07-24T14:06:57.997Z] 	at java.base/jdk.internal.reflect.DelegatingMethodAccessorImpl.invoke(DelegatingMethodAccessorImpl.java:43)
10:06:57 [2020-07-24T14:06:57.997Z] 	at java.base/java.lang.reflect.Method.invoke(Method.java:566)
10:06:57 [2020-07-24T14:06:57.997Z] 	at org.junit.runners.model.FrameworkMethod$1.runReflectiveCall(FrameworkMethod.java:59)
10:06:57 [2020-07-24T14:06:57.997Z] 	at org.junit.internal.runners.model.ReflectiveCallable.run(ReflectiveCallable.java:12)
10:06:57 [2020-07-24T14:06:57.997Z] 	at org.junit.runners.model.FrameworkMethod.invokeExplosively(FrameworkMethod.java:56)
10:06:57 [2020-07-24T14:06:57.997Z] 	at org.junit.internal.runners.statements.InvokeMethod.evaluate(InvokeMethod.java:17)
10:06:57 [2020-07-24T14:06:57.997Z] 	at org.junit.runners.ParentRunner$3.evaluate(ParentRunner.java:306)
10:06:57 [2020-07-24T14:06:57.997Z] 	at org.junit.runners.BlockJUnit4ClassRunner$1.evaluate(BlockJUnit4ClassRunner.java:100)
10:06:57 [2020-07-24T14:06:57.997Z] 	at org.junit.runners.ParentRunner.runLeaf(ParentRunner.java:366)
10:06:57 [2020-07-24T14:06:57.997Z] 	at org.junit.runners.BlockJUnit4ClassRunner.runChild(BlockJUnit4ClassRunner.java:103)
10:06:57 [2020-07-24T14:06:57.997Z] 	at org.junit.runners.BlockJUnit4ClassRunner.runChild(BlockJUnit4ClassRunner.java:63)
10:06:57 [2020-07-24T14:06:57.997Z] 	at org.junit.runners.ParentRunner$4.run(ParentRunner.java:331)
10:06:57 [2020-07-24T14:06:57.997Z] 	at org.junit.runners.ParentRunner$1.schedule(ParentRunner.java:79)
10:06:57 [2020-07-24T14:06:57.997Z] 	at org.junit.runners.ParentRunner.runChildren(ParentRunner.java:329)
10:06:57 [2020-07-24T14:06:57.997Z] 	at org.junit.runners.ParentRunner.access$100(ParentRunner.java:66)
10:06:57 [2020-07-24T14:06:57.997Z] 	at org.junit.runners.ParentRunner$2.evaluate(ParentRunner.java:293)
10:06:57 [2020-07-24T14:06:57.997Z] 	at org.junit.runners.ParentRunner$3.evaluate(ParentRunner.java:306)
10:06:57 [2020-07-24T14:06:57.997Z] 	at org.junit.runners.ParentRunner.run(ParentRunner.java:413)
10:06:57 [2020-07-24T14:06:57.997Z] 	at org.apache.maven.surefire.junit4.JUnit4Provider.execute(JUnit4Provider.java:365)
10:06:57 [2020-07-24T14:06:57.997Z] 	at org.apache.maven.surefire.junit4.JUnit4Provider.executeWithRerun(JUnit4Provider.java:273)
10:06:57 [2020-07-24T14:06:57.997Z] 	at org.apache.maven.surefire.junit4.JUnit4Provider.executeTestSet(JUnit4Provider.java:238)
10:06:57 [2020-07-24T14:06:57.997Z] 	at org.apache.maven.surefire.junit4.JUnit4Provider.invoke(JUnit4Provider.java:159)
10:06:57 [2020-07-24T14:06:57.997Z] 	at java.base/jdk.internal.reflect.NativeMethodAccessorImpl.invoke0(Native Method)
10:06:57 [2020-07-24T14:06:57.997Z] 	at java.base/jdk.internal.reflect.NativeMethodAccessorImpl.invoke(NativeMethodAccessorImpl.java:62)
10:06:57 [2020-07-24T14:06:57.997Z] 	at java.base/jdk.internal.reflect.DelegatingMethodAccessorImpl.invoke(DelegatingMethodAccessorImpl.java:43)
10:06:57 [2020-07-24T14:06:57.997Z] 	at java.base/java.lang.reflect.Method.invoke(Method.java:566)
10:06:57 [2020-07-24T14:06:57.997Z] 	at org.apache.maven.surefire.util.ReflectionUtils.invokeMethodWithArray2(ReflectionUtils.java:206)
10:06:57 [2020-07-24T14:06:57.997Z] 	at org.apache.maven.surefire.booter.ProviderFactory$ProviderProxy.invoke(ProviderFactory.java:161)
10:06:57 [2020-07-24T14:06:57.997Z] 	at org.apache.maven.surefire.booter.ProviderFactory.invokeProvider(ProviderFactory.java:84)
10:06:57 [2020-07-24T14:06:57.997Z] 	at org.eclipse.tycho.surefire.osgibooter.OsgiSurefireBooter.run(OsgiSurefireBooter.java:110)
10:06:57 [2020-07-24T14:06:57.997Z] 	at org.eclipse.tycho.surefire.osgibooter.HeadlessTestApplication.run(HeadlessTestApplication.java:21)
10:06:57 [2020-07-24T14:06:57.997Z] 	at java.base/jdk.internal.reflect.NativeMethodAccessorImpl.invoke0(Native Method)
10:06:57 [2020-07-24T14:06:57.997Z] 	at java.base/jdk.internal.reflect.NativeMethodAccessorImpl.invoke(NativeMethodAccessorImpl.java:62)
10:06:57 [2020-07-24T14:06:57.997Z] 	at java.base/jdk.internal.reflect.DelegatingMethodAccessorImpl.invoke(DelegatingMethodAccessorImpl.java:43)
10:06:57 [2020-07-24T14:06:57.997Z] 	at java.base/java.lang.reflect.Method.invoke(Method.java:566)
10:06:57 [2020-07-24T14:06:57.997Z] 	at org.eclipse.equinox.internal.app.EclipseAppContainer.callMethodWithException(EclipseAppContainer.java:593)
10:06:57 [2020-07-24T14:06:57.997Z] 	at org.eclipse.equinox.internal.app.EclipseAppHandle.run(EclipseAppHandle.java:205)
10:06:57 [2020-07-24T14:06:57.997Z] 	at org.eclipse.core.runtime.internal.adaptor.EclipseAppLauncher.runApplication(EclipseAppLauncher.java:137)
10:06:57 [2020-07-24T14:06:57.997Z] 	at org.eclipse.core.runtime.internal.adaptor.EclipseAppLauncher.start(EclipseAppLauncher.java:107)
10:06:57 [2020-07-24T14:06:57.997Z] 	at org.eclipse.core.runtime.adaptor.EclipseStarter.run(EclipseStarter.java:401)
10:06:57 [2020-07-24T14:06:57.997Z] 	at org.eclipse.core.runtime.adaptor.EclipseStarter.run(EclipseStarter.java:255)
10:06:57 [2020-07-24T14:06:57.997Z] 	at java.base/jdk.internal.reflect.NativeMethodAccessorImpl.invoke0(Native Method)
10:06:57 [2020-07-24T14:06:57.997Z] 	at java.base/jdk.internal.reflect.NativeMethodAccessorImpl.invoke(NativeMethodAccessorImpl.java:62)
10:06:57 [2020-07-24T14:06:57.997Z] 	at java.base/jdk.internal.reflect.DelegatingMethodAccessorImpl.invoke(DelegatingMethodAccessorImpl.java:43)
10:06:57 [2020-07-24T14:06:57.997Z] 	at java.base/java.lang.reflect.Method.invoke(Method.java:566)
10:06:57 [2020-07-24T14:06:57.997Z] 	at org.eclipse.equinox.launcher.Main.invokeFramework(Main.java:657)
10:06:57 [2020-07-24T14:06:57.997Z] 	at org.eclipse.equinox.launcher.Main.basicRun(Main.java:594)
10:06:57 [2020-07-24T14:06:57.997Z] 	at org.eclipse.equinox.launcher.Main.run(Main.java:1447)
10:06:57 [2020-07-24T14:06:57.997Z] 	at org.eclipse.equinox.launcher.Main.main(Main.java:1420)
10:06:57 [2020-07-24T14:06:57.997Z] 
10:06:57 [2020-07-24T14:06:57.997Z] !ENTRY org.eclipse.tracecompass.tmf.core 4 0 2020-07-24 14:06:55.797
10:06:57 [2020-07-24T14:06:57.997Z] !MESSAGE Error parsing /tmp/markers10291878588435409782xml
10:06:57 [2020-07-24T14:06:57.997Z] !STACK 0
10:06:57 [2020-07-24T14:06:57.997Z] org.xml.sax.SAXParseException; systemId: file:/tmp/markers10291878588435409782xml; lineNumber: 1; columnNumber: 200; cvc-minExclusive-valid: Value '-1' is not facet-valid with respect to minExclusive '0.0E1' for type 'period_type'.
10:06:57 [2020-07-24T14:06:57.997Z] 	at java.xml/com.sun.org.apache.xerces.internal.util.ErrorHandlerWrapper.createSAXParseException(ErrorHandlerWrapper.java:204)
10:06:57 [2020-07-24T14:06:57.997Z] 	at java.xml/com.sun.org.apache.xerces.internal.util.ErrorHandlerWrapper.error(ErrorHandlerWrapper.java:135)
10:06:57 [2020-07-24T14:06:57.997Z] 	at java.xml/com.sun.org.apache.xerces.internal.impl.XMLErrorReporter.reportError(XMLErrorReporter.java:396)
10:06:57 [2020-07-24T14:06:57.997Z] 	at java.xml/com.sun.org.apache.xerces.internal.impl.XMLErrorReporter.reportError(XMLErrorReporter.java:327)
10:06:57 [2020-07-24T14:06:57.997Z] 	at java.xml/com.sun.org.apache.xerces.internal.impl.XMLErrorReporter.reportError(XMLErrorReporter.java:284)
10:06:57 [2020-07-24T14:06:57.997Z] 	at java.xml/com.sun.org.apache.xerces.internal.impl.xs.XMLSchemaValidator$XSIErrorReporter.reportError(XMLSchemaValidator.java:511)
10:06:57 [2020-07-24T14:06:57.997Z] 	at java.xml/com.sun.org.apache.xerces.internal.impl.xs.XMLSchemaValidator.reportSchemaError(XMLSchemaValidator.java:3587)
10:06:57 [2020-07-24T14:06:57.997Z] 	at java.xml/com.sun.org.apache.xerces.internal.impl.xs.XMLSchemaValidator.processOneAttribute(XMLSchemaValidator.java:3107)
10:06:57 [2020-07-24T14:06:57.997Z] 	at java.xml/com.sun.org.apache.xerces.internal.impl.xs.XMLSchemaValidator.processAttributes(XMLSchemaValidator.java:3051)
10:06:57 [2020-07-24T14:06:57.997Z] 	at java.xml/com.sun.org.apache.xerces.internal.impl.xs.XMLSchemaValidator.handleStartElement(XMLSchemaValidator.java:2286)
10:06:57 [2020-07-24T14:06:57.997Z] 	at java.xml/com.sun.org.apache.xerces.internal.impl.xs.XMLSchemaValidator.startElement(XMLSchemaValidator.java:829)
10:06:57 [2020-07-24T14:06:57.997Z] 	at java.xml/com.sun.org.apache.xerces.internal.impl.XMLNSDocumentScannerImpl.scanStartElement(XMLNSDocumentScannerImpl.java:374)
10:06:57 [2020-07-24T14:06:57.997Z] 	at java.xml/com.sun.org.apache.xerces.internal.impl.XMLDocumentFragmentScannerImpl$FragmentContentDriver.next(XMLDocumentFragmentScannerImpl.java:2708)
10:06:57 [2020-07-24T14:06:57.997Z] 	at java.xml/com.sun.org.apache.xerces.internal.impl.XMLDocumentScannerImpl.next(XMLDocumentScannerImpl.java:605)
10:06:57 [2020-07-24T14:06:57.997Z] 	at java.xml/com.sun.org.apache.xerces.internal.impl.XMLNSDocumentScannerImpl.next(XMLNSDocumentScannerImpl.java:112)
10:06:57 [2020-07-24T14:06:57.997Z] 	at java.xml/com.sun.org.apache.xerces.internal.impl.XMLDocumentFragmentScannerImpl.scanDocument(XMLDocumentFragmentScannerImpl.java:534)
10:06:57 [2020-07-24T14:06:57.997Z] 	at java.xml/com.sun.org.apache.xerces.internal.parsers.XML11Configuration.parse(XML11Configuration.java:888)
10:06:57 [2020-07-24T14:06:57.997Z] 	at java.xml/com.sun.org.apache.xerces.internal.parsers.XML11Configuration.parse(XML11Configuration.java:824)
10:06:57 [2020-07-24T14:06:57.997Z] 	at java.xml/com.sun.org.apache.xerces.internal.parsers.XMLParser.parse(XMLParser.java:141)
10:06:57 [2020-07-24T14:06:57.997Z] 	at java.xml/com.sun.org.apache.xerces.internal.parsers.DOMParser.parse(DOMParser.java:246)
10:06:57 [2020-07-24T14:06:57.997Z] 	at java.xml/com.sun.org.apache.xerces.internal.jaxp.DocumentBuilderImpl.parse(DocumentBuilderImpl.java:339)
10:06:57 [2020-07-24T14:06:57.997Z] 	at java.xml/javax.xml.parsers.DocumentBuilder.parse(DocumentBuilder.java:206)
10:06:57 [2020-07-24T14:06:57.997Z] 	at org.eclipse.tracecompass.internal.tmf.core.markers.MarkerConfigXmlParser.parse(MarkerConfigXmlParser.java:172)
10:06:57 [2020-07-24T14:06:57.997Z] 	at org.eclipse.tracecompass.tmf.core.tests.markers.MarkerConfigXmlParserTest.testParseInvalidContent(MarkerConfigXmlParserTest.java:307)
10:06:57 [2020-07-24T14:06:57.997Z] 	at org.eclipse.tracecompass.tmf.core.tests.markers.MarkerConfigXmlParserTest.testParseInvalidContent(MarkerConfigXmlParserTest.java:292)
10:06:57 [2020-07-24T14:06:57.997Z] 	at java.base/jdk.internal.reflect.NativeMethodAccessorImpl.invoke0(Native Method)
10:06:57 [2020-07-24T14:06:57.997Z] 	at java.base/jdk.internal.reflect.NativeMethodAccessorImpl.invoke(NativeMethodAccessorImpl.java:62)
10:06:57 [2020-07-24T14:06:57.997Z] 	at java.base/jdk.internal.reflect.DelegatingMethodAccessorImpl.invoke(DelegatingMethodAccessorImpl.java:43)
10:06:57 [2020-07-24T14:06:57.997Z] 	at java.base/java.lang.reflect.Method.invoke(Method.java:566)
10:06:57 [2020-07-24T14:06:57.997Z] 	at org.junit.runners.model.FrameworkMethod$1.runReflectiveCall(FrameworkMethod.java:59)
10:06:57 [2020-07-24T14:06:57.997Z] 	at org.junit.internal.runners.model.ReflectiveCallable.run(ReflectiveCallable.java:12)
10:06:57 [2020-07-24T14:06:57.997Z] 	at org.junit.runners.model.FrameworkMethod.invokeExplosively(FrameworkMethod.java:56)
10:06:57 [2020-07-24T14:06:57.997Z] 	at org.junit.internal.runners.statements.InvokeMethod.evaluate(InvokeMethod.java:17)
10:06:57 [2020-07-24T14:06:57.997Z] 	at org.junit.runners.ParentRunner$3.evaluate(ParentRunner.java:306)
10:06:57 [2020-07-24T14:06:57.997Z] 	at org.junit.runners.BlockJUnit4ClassRunner$1.evaluate(BlockJUnit4ClassRunner.java:100)
10:06:57 [2020-07-24T14:06:57.997Z] 	at org.junit.runners.ParentRunner.runLeaf(ParentRunner.java:366)
10:06:57 [2020-07-24T14:06:57.997Z] 	at org.junit.runners.BlockJUnit4ClassRunner.runChild(BlockJUnit4ClassRunner.java:103)
10:06:57 [2020-07-24T14:06:57.997Z] 	at org.junit.runners.BlockJUnit4ClassRunner.runChild(BlockJUnit4ClassRunner.java:63)
10:06:57 [2020-07-24T14:06:57.997Z] 	at org.junit.runners.ParentRunner$4.run(ParentRunner.java:331)
10:06:57 [2020-07-24T14:06:57.997Z] 	at org.junit.runners.ParentRunner$1.schedule(ParentRunner.java:79)
10:06:57 [2020-07-24T14:06:57.997Z] 	at org.junit.runners.ParentRunner.runChildren(ParentRunner.java:329)
10:06:57 [2020-07-24T14:06:57.997Z] 	at org.junit.runners.ParentRunner.access$100(ParentRunner.java:66)
10:06:57 [2020-07-24T14:06:57.997Z] 	at org.junit.runners.ParentRunner$2.evaluate(ParentRunner.java:293)
10:06:57 [2020-07-24T14:06:57.997Z] 	at org.junit.runners.ParentRunner$3.evaluate(ParentRunner.java:306)
10:06:57 [2020-07-24T14:06:57.997Z] 	at org.junit.runners.ParentRunner.run(ParentRunner.java:413)
10:06:57 [2020-07-24T14:06:57.997Z] 	at org.apache.maven.surefire.junit4.JUnit4Provider.execute(JUnit4Provider.java:365)
10:06:57 [2020-07-24T14:06:57.997Z] 	at org.apache.maven.surefire.junit4.JUnit4Provider.executeWithRerun(JUnit4Provider.java:273)
10:06:57 [2020-07-24T14:06:57.997Z] 	at org.apache.maven.surefire.junit4.JUnit4Provider.executeTestSet(JUnit4Provider.java:238)
10:06:57 [2020-07-24T14:06:57.997Z] 	at org.apache.maven.surefire.junit4.JUnit4Provider.invoke(JUnit4Provider.java:159)
10:06:57 [2020-07-24T14:06:57.997Z] 	at java.base/jdk.internal.reflect.NativeMethodAccessorImpl.invoke0(Native Method)
10:06:57 [2020-07-24T14:06:57.997Z] 	at java.base/jdk.internal.reflect.NativeMethodAccessorImpl.invoke(NativeMethodAccessorImpl.java:62)
10:06:57 [2020-07-24T14:06:57.997Z] 	at java.base/jdk.internal.reflect.DelegatingMethodAccessorImpl.invoke(DelegatingMethodAccessorImpl.java:43)
10:06:57 [2020-07-24T14:06:57.997Z] 	at java.base/java.lang.reflect.Method.invoke(Method.java:566)
10:06:57 [2020-07-24T14:06:57.997Z] 	at org.apache.maven.surefire.util.ReflectionUtils.invokeMethodWithArray2(ReflectionUtils.java:206)
10:06:57 [2020-07-24T14:06:57.997Z] 	at org.apache.maven.surefire.booter.ProviderFactory$ProviderProxy.invoke(ProviderFactory.java:161)
10:06:57 [2020-07-24T14:06:57.998Z] 	at org.apache.maven.surefire.booter.ProviderFactory.invokeProvider(ProviderFactory.java:84)
10:06:57 [2020-07-24T14:06:57.998Z] 	at org.eclipse.tycho.surefire.osgibooter.OsgiSurefireBooter.run(OsgiSurefireBooter.java:110)
10:06:57 [2020-07-24T14:06:57.998Z] 	at org.eclipse.tycho.surefire.osgibooter.HeadlessTestApplication.run(HeadlessTestApplication.java:21)
10:06:57 [2020-07-24T14:06:57.998Z] 	at java.base/jdk.internal.reflect.NativeMethodAccessorImpl.invoke0(Native Method)
10:06:57 [2020-07-24T14:06:57.998Z] 	at java.base/jdk.internal.reflect.NativeMethodAccessorImpl.invoke(NativeMethodAccessorImpl.java:62)
10:06:57 [2020-07-24T14:06:57.998Z] 	at java.base/jdk.internal.reflect.DelegatingMethodAccessorImpl.invoke(DelegatingMethodAccessorImpl.java:43)
10:06:57 [2020-07-24T14:06:57.998Z] 	at java.base/java.lang.reflect.Method.invoke(Method.java:566)
10:06:57 [2020-07-24T14:06:57.998Z] 	at org.eclipse.equinox.internal.app.EclipseAppContainer.callMethodWithException(EclipseAppContainer.java:593)
10:06:57 [2020-07-24T14:06:57.998Z] 	at org.eclipse.equinox.internal.app.EclipseAppHandle.run(EclipseAppHandle.java:205)
10:06:57 [2020-07-24T14:06:57.998Z] 	at org.eclipse.core.runtime.internal.adaptor.EclipseAppLauncher.runApplication(EclipseAppLauncher.java:137)
10:06:57 [2020-07-24T14:06:57.998Z] 	at org.eclipse.core.runtime.internal.adaptor.EclipseAppLauncher.start(EclipseAppLauncher.java:107)
10:06:57 [2020-07-24T14:06:57.998Z] 	at org.eclipse.core.runtime.adaptor.EclipseStarter.run(EclipseStarter.java:401)
10:06:57 [2020-07-24T14:06:57.998Z] 	at org.eclipse.core.runtime.adaptor.EclipseStarter.run(EclipseStarter.java:255)
10:06:57 [2020-07-24T14:06:57.998Z] 	at java.base/jdk.internal.reflect.NativeMethodAccessorImpl.invoke0(Native Method)
10:06:57 [2020-07-24T14:06:57.998Z] 	at java.base/jdk.internal.reflect.NativeMethodAccessorImpl.invoke(NativeMethodAccessorImpl.java:62)
10:06:57 [2020-07-24T14:06:57.998Z] 	at java.base/jdk.internal.reflect.DelegatingMethodAccessorImpl.invoke(DelegatingMethodAccessorImpl.java:43)
10:06:57 [2020-07-24T14:06:57.998Z] 	at java.base/java.lang.reflect.Method.invoke(Method.java:566)
10:06:57 [2020-07-24T14:06:57.998Z] 	at org.eclipse.equinox.launcher.Main.invokeFramework(Main.java:657)
10:06:57 [2020-07-24T14:06:57.998Z] 	at org.eclipse.equinox.launcher.Main.basicRun(Main.java:594)
10:06:57 [2020-07-24T14:06:57.998Z] 	at org.eclipse.equinox.launcher.Main.run(Main.java:1447)
10:06:57 [2020-07-24T14:06:57.998Z] 	at org.eclipse.equinox.launcher.Main.main(Main.java:1420)
10:06:57 [2020-07-24T14:06:57.998Z] 
10:06:57 [2020-07-24T14:06:57.998Z] !ENTRY org.eclipse.tracecompass.tmf.core 4 0 2020-07-24 14:06:55.800
10:06:57 [2020-07-24T14:06:57.998Z] !MESSAGE Error parsing /tmp/markers5964486380777765600xml
10:06:57 [2020-07-24T14:06:57.998Z] !STACK 0
10:06:57 [2020-07-24T14:06:57.998Z] org.xml.sax.SAXParseException; systemId: file:/tmp/markers5964486380777765600xml; lineNumber: 1; columnNumber: 204; cvc-enumeration-valid: Value 'qwerty' is not facet-valid with respect to enumeration '[ms, us, ns, cycles]'. It must be a value from the enumeration.
10:06:57 [2020-07-24T14:06:57.998Z] 	at java.xml/com.sun.org.apache.xerces.internal.util.ErrorHandlerWrapper.createSAXParseException(ErrorHandlerWrapper.java:204)
10:06:57 [2020-07-24T14:06:57.998Z] 	at java.xml/com.sun.org.apache.xerces.internal.util.ErrorHandlerWrapper.error(ErrorHandlerWrapper.java:135)
10:06:57 [2020-07-24T14:06:57.998Z] 	at java.xml/com.sun.org.apache.xerces.internal.impl.XMLErrorReporter.reportError(XMLErrorReporter.java:396)
10:06:57 [2020-07-24T14:06:57.998Z] 	at java.xml/com.sun.org.apache.xerces.internal.impl.XMLErrorReporter.reportError(XMLErrorReporter.java:327)
10:06:57 [2020-07-24T14:06:57.998Z] 	at java.xml/com.sun.org.apache.xerces.internal.impl.XMLErrorReporter.reportError(XMLErrorReporter.java:284)
10:06:57 [2020-07-24T14:06:57.998Z] 	at java.xml/com.sun.org.apache.xerces.internal.impl.xs.XMLSchemaValidator$XSIErrorReporter.reportError(XMLSchemaValidator.java:511)
10:06:57 [2020-07-24T14:06:57.998Z] 	at java.xml/com.sun.org.apache.xerces.internal.impl.xs.XMLSchemaValidator.reportSchemaError(XMLSchemaValidator.java:3587)
10:06:57 [2020-07-24T14:06:57.998Z] 	at java.xml/com.sun.org.apache.xerces.internal.impl.xs.XMLSchemaValidator.processOneAttribute(XMLSchemaValidator.java:3107)
10:06:57 [2020-07-24T14:06:57.998Z] 	at java.xml/com.sun.org.apache.xerces.internal.impl.xs.XMLSchemaValidator.processAttributes(XMLSchemaValidator.java:3051)
10:06:57 [2020-07-24T14:06:57.998Z] 	at java.xml/com.sun.org.apache.xerces.internal.impl.xs.XMLSchemaValidator.handleStartElement(XMLSchemaValidator.java:2286)
10:06:57 [2020-07-24T14:06:57.998Z] 	at java.xml/com.sun.org.apache.xerces.internal.impl.xs.XMLSchemaValidator.startElement(XMLSchemaValidator.java:829)
10:06:57 [2020-07-24T14:06:57.998Z] 	at java.xml/com.sun.org.apache.xerces.internal.impl.XMLNSDocumentScannerImpl.scanStartElement(XMLNSDocumentScannerImpl.java:374)
10:06:57 [2020-07-24T14:06:57.998Z] 	at java.xml/com.sun.org.apache.xerces.internal.impl.XMLDocumentFragmentScannerImpl$FragmentContentDriver.next(XMLDocumentFragmentScannerImpl.java:2708)
10:06:57 [2020-07-24T14:06:57.998Z] 	at java.xml/com.sun.org.apache.xerces.internal.impl.XMLDocumentScannerImpl.next(XMLDocumentScannerImpl.java:605)
10:06:57 [2020-07-24T14:06:57.998Z] 	at java.xml/com.sun.org.apache.xerces.internal.impl.XMLNSDocumentScannerImpl.next(XMLNSDocumentScannerImpl.java:112)
10:06:57 [2020-07-24T14:06:57.998Z] 	at java.xml/com.sun.org.apache.xerces.internal.impl.XMLDocumentFragmentScannerImpl.scanDocument(XMLDocumentFragmentScannerImpl.java:534)
10:06:57 [2020-07-24T14:06:57.998Z] 	at java.xml/com.sun.org.apache.xerces.internal.parsers.XML11Configuration.parse(XML11Configuration.java:888)
10:06:57 [2020-07-24T14:06:57.998Z] 	at java.xml/com.sun.org.apache.xerces.internal.parsers.XML11Configuration.parse(XML11Configuration.java:824)
10:06:57 [2020-07-24T14:06:57.998Z] 	at java.xml/com.sun.org.apache.xerces.internal.parsers.XMLParser.parse(XMLParser.java:141)
10:06:57 [2020-07-24T14:06:57.998Z] 	at java.xml/com.sun.org.apache.xerces.internal.parsers.DOMParser.parse(DOMParser.java:246)
10:06:57 [2020-07-24T14:06:57.998Z] 	at java.xml/com.sun.org.apache.xerces.internal.jaxp.DocumentBuilderImpl.parse(DocumentBuilderImpl.java:339)
10:06:57 [2020-07-24T14:06:57.998Z] 	at java.xml/javax.xml.parsers.DocumentBuilder.parse(DocumentBuilder.java:206)
10:06:57 [2020-07-24T14:06:57.998Z] 	at org.eclipse.tracecompass.internal.tmf.core.markers.MarkerConfigXmlParser.parse(MarkerConfigXmlParser.java:172)
10:06:57 [2020-07-24T14:06:57.998Z] 	at org.eclipse.tracecompass.tmf.core.tests.markers.MarkerConfigXmlParserTest.testParseInvalidContent(MarkerConfigXmlParserTest.java:307)
10:06:57 [2020-07-24T14:06:57.998Z] 	at org.eclipse.tracecompass.tmf.core.tests.markers.MarkerConfigXmlParserTest.testParseInvalidContent(MarkerConfigXmlParserTest.java:293)
10:06:57 [2020-07-24T14:06:57.998Z] 	at java.base/jdk.internal.reflect.NativeMethodAccessorImpl.invoke0(Native Method)
10:06:57 [2020-07-24T14:06:57.998Z] 	at java.base/jdk.internal.reflect.NativeMethodAccessorImpl.invoke(NativeMethodAccessorImpl.java:62)
10:06:57 [2020-07-24T14:06:57.998Z] 	at java.base/jdk.internal.reflect.DelegatingMethodAccessorImpl.invoke(DelegatingMethodAccessorImpl.java:43)
10:06:57 [2020-07-24T14:06:57.998Z] 	at java.base/java.lang.reflect.Method.invoke(Method.java:566)
10:06:57 [2020-07-24T14:06:57.998Z] 	at org.junit.runners.model.FrameworkMethod$1.runReflectiveCall(FrameworkMethod.java:59)
10:06:57 [2020-07-24T14:06:57.998Z] 	at org.junit.internal.runners.model.ReflectiveCallable.run(ReflectiveCallable.java:12)
10:06:57 [2020-07-24T14:06:57.998Z] 	at org.junit.runners.model.FrameworkMethod.invokeExplosively(FrameworkMethod.java:56)
10:06:57 [2020-07-24T14:06:57.998Z] 	at org.junit.internal.runners.statements.InvokeMethod.evaluate(InvokeMethod.java:17)
10:06:57 [2020-07-24T14:06:57.998Z] 	at org.junit.runners.ParentRunner$3.evaluate(ParentRunner.java:306)
10:06:57 [2020-07-24T14:06:57.998Z] 	at org.junit.runners.BlockJUnit4ClassRunner$1.evaluate(BlockJUnit4ClassRunner.java:100)
10:06:57 [2020-07-24T14:06:57.998Z] 	at org.junit.runners.ParentRunner.runLeaf(ParentRunner.java:366)
10:06:57 [2020-07-24T14:06:57.998Z] 	at org.junit.runners.BlockJUnit4ClassRunner.runChild(BlockJUnit4ClassRunner.java:103)
10:06:57 [2020-07-24T14:06:57.998Z] 	at org.junit.runners.BlockJUnit4ClassRunner.runChild(BlockJUnit4ClassRunner.java:63)
10:06:57 [2020-07-24T14:06:57.998Z] 	at org.junit.runners.ParentRunner$4.run(ParentRunner.java:331)
10:06:57 [2020-07-24T14:06:57.998Z] 	at org.junit.runners.ParentRunner$1.schedule(ParentRunner.java:79)
10:06:57 [2020-07-24T14:06:57.998Z] 	at org.junit.runners.ParentRunner.runChildren(ParentRunner.java:329)
10:06:57 [2020-07-24T14:06:57.998Z] 	at org.junit.runners.ParentRunner.access$100(ParentRunner.java:66)
10:06:57 [2020-07-24T14:06:57.998Z] 	at org.junit.runners.ParentRunner$2.evaluate(ParentRunner.java:293)
10:06:57 [2020-07-24T14:06:57.998Z] 	at org.junit.runners.ParentRunner$3.evaluate(ParentRunner.java:306)
10:06:57 [2020-07-24T14:06:57.998Z] 	at org.junit.runners.ParentRunner.run(ParentRunner.java:413)
10:06:57 [2020-07-24T14:06:57.998Z] 	at org.apache.maven.surefire.junit4.JUnit4Provider.execute(JUnit4Provider.java:365)
10:06:57 [2020-07-24T14:06:57.998Z] 	at org.apache.maven.surefire.junit4.JUnit4Provider.executeWithRerun(JUnit4Provider.java:273)
10:06:57 [2020-07-24T14:06:57.998Z] 	at org.apache.maven.surefire.junit4.JUnit4Provider.executeTestSet(JUnit4Provider.java:238)
10:06:57 [2020-07-24T14:06:57.998Z] 	at org.apache.maven.surefire.junit4.JUnit4Provider.invoke(JUnit4Provider.java:159)
10:06:57 [2020-07-24T14:06:57.998Z] 	at java.base/jdk.internal.reflect.NativeMethodAccessorImpl.invoke0(Native Method)
10:06:57 [2020-07-24T14:06:57.998Z] 	at java.base/jdk.internal.reflect.NativeMethodAccessorImpl.invoke(NativeMethodAccessorImpl.java:62)
10:06:57 [2020-07-24T14:06:57.998Z] 	at java.base/jdk.internal.reflect.DelegatingMethodAccessorImpl.invoke(DelegatingMethodAccessorImpl.java:43)
10:06:57 [2020-07-24T14:06:57.998Z] 	at java.base/java.lang.reflect.Method.invoke(Method.java:566)
10:06:57 [2020-07-24T14:06:57.998Z] 	at org.apache.maven.surefire.util.ReflectionUtils.invokeMethodWithArray2(ReflectionUtils.java:206)
10:06:57 [2020-07-24T14:06:57.998Z] 	at org.apache.maven.surefire.booter.ProviderFactory$ProviderProxy.invoke(ProviderFactory.java:161)
10:06:57 [2020-07-24T14:06:57.998Z] 	at org.apache.maven.surefire.booter.ProviderFactory.invokeProvider(ProviderFactory.java:84)
10:06:57 [2020-07-24T14:06:57.998Z] 	at org.eclipse.tycho.surefire.osgibooter.OsgiSurefireBooter.run(OsgiSurefireBooter.java:110)
10:06:57 [2020-07-24T14:06:57.998Z] 	at org.eclipse.tycho.surefire.osgibooter.HeadlessTestApplication.run(HeadlessTestApplication.java:21)
10:06:57 [2020-07-24T14:06:57.998Z] 	at java.base/jdk.internal.reflect.NativeMethodAccessorImpl.invoke0(Native Method)
10:06:57 [2020-07-24T14:06:57.998Z] 	at java.base/jdk.internal.reflect.NativeMethodAccessorImpl.invoke(NativeMethodAccessorImpl.java:62)
10:06:57 [2020-07-24T14:06:57.998Z] 	at java.base/jdk.internal.reflect.DelegatingMethodAccessorImpl.invoke(DelegatingMethodAccessorImpl.java:43)
10:06:57 [2020-07-24T14:06:57.998Z] 	at java.base/java.lang.reflect.Method.invoke(Method.java:566)
10:06:57 [2020-07-24T14:06:57.998Z] 	at org.eclipse.equinox.internal.app.EclipseAppContainer.callMethodWithException(EclipseAppContainer.java:593)
10:06:57 [2020-07-24T14:06:57.998Z] 	at org.eclipse.equinox.internal.app.EclipseAppHandle.run(EclipseAppHandle.java:205)
10:06:57 [2020-07-24T14:06:57.998Z] 	at org.eclipse.core.runtime.internal.adaptor.EclipseAppLauncher.runApplication(EclipseAppLauncher.java:137)
10:06:57 [2020-07-24T14:06:57.998Z] 	at org.eclipse.core.runtime.internal.adaptor.EclipseAppLauncher.start(EclipseAppLauncher.java:107)
10:06:57 [2020-07-24T14:06:57.998Z] 	at org.eclipse.core.runtime.adaptor.EclipseStarter.run(EclipseStarter.java:401)
10:06:57 [2020-07-24T14:06:57.998Z] 	at org.eclipse.core.runtime.adaptor.EclipseStarter.run(EclipseStarter.java:255)
10:06:57 [2020-07-24T14:06:57.998Z] 	at java.base/jdk.internal.reflect.NativeMethodAccessorImpl.invoke0(Native Method)
10:06:57 [2020-07-24T14:06:57.998Z] 	at java.base/jdk.internal.reflect.NativeMethodAccessorImpl.invoke(NativeMethodAccessorImpl.java:62)
10:06:57 [2020-07-24T14:06:57.998Z] 	at java.base/jdk.internal.reflect.DelegatingMethodAccessorImpl.invoke(DelegatingMethodAccessorImpl.java:43)
10:06:57 [2020-07-24T14:06:57.998Z] 	at java.base/java.lang.reflect.Method.invoke(Method.java:566)
10:06:57 [2020-07-24T14:06:57.998Z] 	at org.eclipse.equinox.launcher.Main.invokeFramework(Main.java:657)
10:06:57 [2020-07-24T14:06:57.998Z] 	at org.eclipse.equinox.launcher.Main.basicRun(Main.java:594)
10:06:57 [2020-07-24T14:06:57.998Z] 	at org.eclipse.equinox.launcher.Main.run(Main.java:1447)
10:06:57 [2020-07-24T14:06:57.998Z] 	at org.eclipse.equinox.launcher.Main.main(Main.java:1420)
10:06:57 [2020-07-24T14:06:57.998Z] 
10:06:57 [2020-07-24T14:06:57.998Z] !ENTRY org.eclipse.tracecompass.tmf.core 4 0 2020-07-24 14:06:55.804
10:06:57 [2020-07-24T14:06:57.998Z] !MESSAGE Error parsing /tmp/markers16602775220978348303xml
10:06:57 [2020-07-24T14:06:57.998Z] !STACK 0
10:06:57 [2020-07-24T14:06:57.998Z] java.lang.IllegalArgumentException: Invalid range: [4095..0]
10:06:57 [2020-07-24T14:06:57.998Z] 	at com.google.common.collect.Range.<init>(Range.java:357)
10:06:57 [2020-07-24T14:06:57.998Z] 	at com.google.common.collect.Range.create(Range.java:155)
10:06:57 [2020-07-24T14:06:57.998Z] 	at com.google.common.collect.Range.closed(Range.java:180)
10:06:57 [2020-07-24T14:06:57.998Z] 	at org.eclipse.tracecompass.internal.tmf.core.markers.MarkerConfigXmlParser.parseRange(MarkerConfigXmlParser.java:310)
10:06:57 [2020-07-24T14:06:57.998Z] 	at org.eclipse.tracecompass.internal.tmf.core.markers.MarkerConfigXmlParser.getMarkers(MarkerConfigXmlParser.java:215)
10:06:57 [2020-07-24T14:06:57.998Z] 	at org.eclipse.tracecompass.internal.tmf.core.markers.MarkerConfigXmlParser.parse(MarkerConfigXmlParser.java:186)
10:06:57 [2020-07-24T14:06:57.998Z] 	at org.eclipse.tracecompass.tmf.core.tests.markers.MarkerConfigXmlParserTest.testParseInvalidContent(MarkerConfigXmlParserTest.java:307)
10:06:57 [2020-07-24T14:06:57.998Z] 	at org.eclipse.tracecompass.tmf.core.tests.markers.MarkerConfigXmlParserTest.testParseInvalidContent(MarkerConfigXmlParserTest.java:294)
10:06:57 [2020-07-24T14:06:57.998Z] 	at java.base/jdk.internal.reflect.NativeMethodAccessorImpl.invoke0(Native Method)
10:06:57 [2020-07-24T14:06:57.998Z] 	at java.base/jdk.internal.reflect.NativeMethodAccessorImpl.invoke(NativeMethodAccessorImpl.java:62)
10:06:57 [2020-07-24T14:06:57.998Z] 	at java.base/jdk.internal.reflect.DelegatingMethodAccessorImpl.invoke(DelegatingMethodAccessorImpl.java:43)
10:06:57 [2020-07-24T14:06:57.998Z] 	at java.base/java.lang.reflect.Method.invoke(Method.java:566)
10:06:57 [2020-07-24T14:06:57.998Z] 	at org.junit.runners.model.FrameworkMethod$1.runReflectiveCall(FrameworkMethod.java:59)
10:06:57 [2020-07-24T14:06:57.998Z] 	at org.junit.internal.runners.model.ReflectiveCallable.run(ReflectiveCallable.java:12)
10:06:57 [2020-07-24T14:06:57.998Z] 	at org.junit.runners.model.FrameworkMethod.invokeExplosively(FrameworkMethod.java:56)
10:06:57 [2020-07-24T14:06:57.998Z] 	at org.junit.internal.runners.statements.InvokeMethod.evaluate(InvokeMethod.java:17)
10:06:57 [2020-07-24T14:06:57.998Z] 	at org.junit.runners.ParentRunner$3.evaluate(ParentRunner.java:306)
10:06:57 [2020-07-24T14:06:57.998Z] 	at org.junit.runners.BlockJUnit4ClassRunner$1.evaluate(BlockJUnit4ClassRunner.java:100)
10:06:57 [2020-07-24T14:06:57.998Z] 	at org.junit.runners.ParentRunner.runLeaf(ParentRunner.java:366)
10:06:57 [2020-07-24T14:06:57.998Z] 	at org.junit.runners.BlockJUnit4ClassRunner.runChild(BlockJUnit4ClassRunner.java:103)
10:06:57 [2020-07-24T14:06:57.998Z] 	at org.junit.runners.BlockJUnit4ClassRunner.runChild(BlockJUnit4ClassRunner.java:63)
10:06:57 [2020-07-24T14:06:57.998Z] 	at org.junit.runners.ParentRunner$4.run(ParentRunner.java:331)
10:06:57 [2020-07-24T14:06:57.998Z] 	at org.junit.runners.ParentRunner$1.schedule(ParentRunner.java:79)
10:06:57 [2020-07-24T14:06:57.999Z] 	at org.junit.runners.ParentRunner.runChildren(ParentRunner.java:329)
10:06:57 [2020-07-24T14:06:57.999Z] 	at org.junit.runners.ParentRunner.access$100(ParentRunner.java:66)
10:06:57 [2020-07-24T14:06:57.999Z] 	at org.junit.runners.ParentRunner$2.evaluate(ParentRunner.java:293)
10:06:57 [2020-07-24T14:06:57.999Z] 	at org.junit.runners.ParentRunner$3.evaluate(ParentRunner.java:306)
10:06:57 [2020-07-24T14:06:57.999Z] 	at org.junit.runners.ParentRunner.run(ParentRunner.java:413)
10:06:57 [2020-07-24T14:06:57.999Z] 	at org.apache.maven.surefire.junit4.JUnit4Provider.execute(JUnit4Provider.java:365)
10:06:57 [2020-07-24T14:06:57.999Z] 	at org.apache.maven.surefire.junit4.JUnit4Provider.executeWithRerun(JUnit4Provider.java:273)
10:06:57 [2020-07-24T14:06:57.999Z] 	at org.apache.maven.surefire.junit4.JUnit4Provider.executeTestSet(JUnit4Provider.java:238)
10:06:57 [2020-07-24T14:06:57.999Z] 	at org.apache.maven.surefire.junit4.JUnit4Provider.invoke(JUnit4Provider.java:159)
10:06:57 [2020-07-24T14:06:57.999Z] 	at java.base/jdk.internal.reflect.NativeMethodAccessorImpl.invoke0(Native Method)
10:06:57 [2020-07-24T14:06:57.999Z] 	at java.base/jdk.internal.reflect.NativeMethodAccessorImpl.invoke(NativeMethodAccessorImpl.java:62)
10:06:57 [2020-07-24T14:06:57.999Z] 	at java.base/jdk.internal.reflect.DelegatingMethodAccessorImpl.invoke(DelegatingMethodAccessorImpl.java:43)
10:06:57 [2020-07-24T14:06:57.999Z] 	at java.base/java.lang.reflect.Method.invoke(Method.java:566)
10:06:57 [2020-07-24T14:06:57.999Z] 	at org.apache.maven.surefire.util.ReflectionUtils.invokeMethodWithArray2(ReflectionUtils.java:206)
10:06:57 [2020-07-24T14:06:57.999Z] 	at org.apache.maven.surefire.booter.ProviderFactory$ProviderProxy.invoke(ProviderFactory.java:161)
10:06:57 [2020-07-24T14:06:57.999Z] 	at org.apache.maven.surefire.booter.ProviderFactory.invokeProvider(ProviderFactory.java:84)
10:06:57 [2020-07-24T14:06:57.999Z] 	at org.eclipse.tycho.surefire.osgibooter.OsgiSurefireBooter.run(OsgiSurefireBooter.java:110)
10:06:57 [2020-07-24T14:06:57.999Z] 	at org.eclipse.tycho.surefire.osgibooter.HeadlessTestApplication.run(HeadlessTestApplication.java:21)
10:06:57 [2020-07-24T14:06:57.999Z] 	at java.base/jdk.internal.reflect.NativeMethodAccessorImpl.invoke0(Native Method)
10:06:57 [2020-07-24T14:06:57.999Z] 	at java.base/jdk.internal.reflect.NativeMethodAccessorImpl.invoke(NativeMethodAccessorImpl.java:62)
10:06:57 [2020-07-24T14:06:57.999Z] 	at java.base/jdk.internal.reflect.DelegatingMethodAccessorImpl.invoke(DelegatingMethodAccessorImpl.java:43)
10:06:57 [2020-07-24T14:06:57.999Z] 	at java.base/java.lang.reflect.Method.invoke(Method.java:566)
10:06:57 [2020-07-24T14:06:57.999Z] 	at org.eclipse.equinox.internal.app.EclipseAppContainer.callMethodWithException(EclipseAppContainer.java:593)
10:06:57 [2020-07-24T14:06:57.999Z] 	at org.eclipse.equinox.internal.app.EclipseAppHandle.run(EclipseAppHandle.java:205)
10:06:57 [2020-07-24T14:06:57.999Z] 	at org.eclipse.core.runtime.internal.adaptor.EclipseAppLauncher.runApplication(EclipseAppLauncher.java:137)
10:06:57 [2020-07-24T14:06:57.999Z] 	at org.eclipse.core.runtime.internal.adaptor.EclipseAppLauncher.start(EclipseAppLauncher.java:107)
10:06:57 [2020-07-24T14:06:57.999Z] 	at org.eclipse.core.runtime.adaptor.EclipseStarter.run(EclipseStarter.java:401)
10:06:57 [2020-07-24T14:06:57.999Z] 	at org.eclipse.core.runtime.adaptor.EclipseStarter.run(EclipseStarter.java:255)
10:06:57 [2020-07-24T14:06:57.999Z] 	at java.base/jdk.internal.reflect.NativeMethodAccessorImpl.invoke0(Native Method)
10:06:57 [2020-07-24T14:06:57.999Z] 	at java.base/jdk.internal.reflect.NativeMethodAccessorImpl.invoke(NativeMethodAccessorImpl.java:62)
10:06:57 [2020-07-24T14:06:57.999Z] 	at java.base/jdk.internal.reflect.DelegatingMethodAccessorImpl.invoke(DelegatingMethodAccessorImpl.java:43)
10:06:57 [2020-07-24T14:06:57.999Z] 	at java.base/java.lang.reflect.Method.invoke(Method.java:566)
10:06:57 [2020-07-24T14:06:57.999Z] 	at org.eclipse.equinox.launcher.Main.invokeFramework(Main.java:657)
10:06:57 [2020-07-24T14:06:57.999Z] 	at org.eclipse.equinox.launcher.Main.basicRun(Main.java:594)
10:06:57 [2020-07-24T14:06:57.999Z] 	at org.eclipse.equinox.launcher.Main.run(Main.java:1447)
10:06:57 [2020-07-24T14:06:57.999Z] 	at org.eclipse.equinox.launcher.Main.main(Main.java:1420)
10:06:57 [2020-07-24T14:06:57.999Z] 
10:06:57 [2020-07-24T14:06:57.999Z] !ENTRY org.eclipse.tracecompass.tmf.core 4 0 2020-07-24 14:06:55.807
10:06:57 [2020-07-24T14:06:57.999Z] !MESSAGE Error parsing /tmp/markers4713988583889754417xml
10:06:57 [2020-07-24T14:06:57.999Z] !STACK 0
10:06:57 [2020-07-24T14:06:57.999Z] org.xml.sax.SAXParseException; systemId: file:/tmp/markers4713988583889754417xml; lineNumber: 1; columnNumber: 202; cvc-datatype-valid.1.2.1: 'abc' is not a valid value for 'integer'.
10:06:57 [2020-07-24T14:06:57.999Z] 	at java.xml/com.sun.org.apache.xerces.internal.util.ErrorHandlerWrapper.createSAXParseException(ErrorHandlerWrapper.java:204)
10:06:57 [2020-07-24T14:06:57.999Z] 	at java.xml/com.sun.org.apache.xerces.internal.util.ErrorHandlerWrapper.error(ErrorHandlerWrapper.java:135)
10:06:57 [2020-07-24T14:06:57.999Z] 	at java.xml/com.sun.org.apache.xerces.internal.impl.XMLErrorReporter.reportError(XMLErrorReporter.java:396)
10:06:57 [2020-07-24T14:06:57.999Z] 	at java.xml/com.sun.org.apache.xerces.internal.impl.XMLErrorReporter.reportError(XMLErrorReporter.java:327)
10:06:57 [2020-07-24T14:06:57.999Z] 	at java.xml/com.sun.org.apache.xerces.internal.impl.XMLErrorReporter.reportError(XMLErrorReporter.java:284)
10:06:57 [2020-07-24T14:06:57.999Z] 	at java.xml/com.sun.org.apache.xerces.internal.impl.xs.XMLSchemaValidator$XSIErrorReporter.reportError(XMLSchemaValidator.java:511)
10:06:57 [2020-07-24T14:06:57.999Z] 	at java.xml/com.sun.org.apache.xerces.internal.impl.xs.XMLSchemaValidator.reportSchemaError(XMLSchemaValidator.java:3587)
10:06:57 [2020-07-24T14:06:57.999Z] 	at java.xml/com.sun.org.apache.xerces.internal.impl.xs.XMLSchemaValidator.processOneAttribute(XMLSchemaValidator.java:3107)
10:06:57 [2020-07-24T14:06:57.999Z] 	at java.xml/com.sun.org.apache.xerces.internal.impl.xs.XMLSchemaValidator.processAttributes(XMLSchemaValidator.java:3051)
10:06:57 [2020-07-24T14:06:57.999Z] 	at java.xml/com.sun.org.apache.xerces.internal.impl.xs.XMLSchemaValidator.handleStartElement(XMLSchemaValidator.java:2286)
10:06:57 [2020-07-24T14:06:57.999Z] 	at java.xml/com.sun.org.apache.xerces.internal.impl.xs.XMLSchemaValidator.startElement(XMLSchemaValidator.java:829)
10:06:57 [2020-07-24T14:06:57.999Z] 	at java.xml/com.sun.org.apache.xerces.internal.impl.XMLNSDocumentScannerImpl.scanStartElement(XMLNSDocumentScannerImpl.java:374)
10:06:57 [2020-07-24T14:06:57.999Z] 	at java.xml/com.sun.org.apache.xerces.internal.impl.XMLDocumentFragmentScannerImpl$FragmentContentDriver.next(XMLDocumentFragmentScannerImpl.java:2708)
10:06:57 [2020-07-24T14:06:57.999Z] 	at java.xml/com.sun.org.apache.xerces.internal.impl.XMLDocumentScannerImpl.next(XMLDocumentScannerImpl.java:605)
10:06:57 [2020-07-24T14:06:57.999Z] 	at java.xml/com.sun.org.apache.xerces.internal.impl.XMLNSDocumentScannerImpl.next(XMLNSDocumentScannerImpl.java:112)
10:06:57 [2020-07-24T14:06:57.999Z] 	at java.xml/com.sun.org.apache.xerces.internal.impl.XMLDocumentFragmentScannerImpl.scanDocument(XMLDocumentFragmentScannerImpl.java:534)
10:06:57 [2020-07-24T14:06:57.999Z] 	at java.xml/com.sun.org.apache.xerces.internal.parsers.XML11Configuration.parse(XML11Configuration.java:888)
10:06:57 [2020-07-24T14:06:57.999Z] 	at java.xml/com.sun.org.apache.xerces.internal.parsers.XML11Configuration.parse(XML11Configuration.java:824)
10:06:57 [2020-07-24T14:06:57.999Z] 	at java.xml/com.sun.org.apache.xerces.internal.parsers.XMLParser.parse(XMLParser.java:141)
10:06:57 [2020-07-24T14:06:57.999Z] 	at java.xml/com.sun.org.apache.xerces.internal.parsers.DOMParser.parse(DOMParser.java:246)
10:06:57 [2020-07-24T14:06:57.999Z] 	at java.xml/com.sun.org.apache.xerces.internal.jaxp.DocumentBuilderImpl.parse(DocumentBuilderImpl.java:339)
10:06:57 [2020-07-24T14:06:57.999Z] 	at java.xml/javax.xml.parsers.DocumentBuilder.parse(DocumentBuilder.java:206)
10:06:57 [2020-07-24T14:06:57.999Z] 	at org.eclipse.tracecompass.internal.tmf.core.markers.MarkerConfigXmlParser.parse(MarkerConfigXmlParser.java:172)
10:06:57 [2020-07-24T14:06:57.999Z] 	at org.eclipse.tracecompass.tmf.core.tests.markers.MarkerConfigXmlParserTest.testParseInvalidContent(MarkerConfigXmlParserTest.java:307)
10:06:57 [2020-07-24T14:06:57.999Z] 	at org.eclipse.tracecompass.tmf.core.tests.markers.MarkerConfigXmlParserTest.testParseInvalidContent(MarkerConfigXmlParserTest.java:295)
10:06:57 [2020-07-24T14:06:57.999Z] 	at java.base/jdk.internal.reflect.NativeMethodAccessorImpl.invoke0(Native Method)
10:06:57 [2020-07-24T14:06:57.999Z] 	at java.base/jdk.internal.reflect.NativeMethodAccessorImpl.invoke(NativeMethodAccessorImpl.java:62)
10:06:57 [2020-07-24T14:06:57.999Z] 	at java.base/jdk.internal.reflect.DelegatingMethodAccessorImpl.invoke(DelegatingMethodAccessorImpl.java:43)
10:06:57 [2020-07-24T14:06:57.999Z] 	at java.base/java.lang.reflect.Method.invoke(Method.java:566)
10:06:57 [2020-07-24T14:06:57.999Z] 	at org.junit.runners.model.FrameworkMethod$1.runReflectiveCall(FrameworkMethod.java:59)
10:06:57 [2020-07-24T14:06:57.999Z] 	at org.junit.internal.runners.model.ReflectiveCallable.run(ReflectiveCallable.java:12)
10:06:57 [2020-07-24T14:06:57.999Z] 	at org.junit.runners.model.FrameworkMethod.invokeExplosively(FrameworkMethod.java:56)
10:06:57 [2020-07-24T14:06:57.999Z] 	at org.junit.internal.runners.statements.InvokeMethod.evaluate(InvokeMethod.java:17)
10:06:57 [2020-07-24T14:06:57.999Z] 	at org.junit.runners.ParentRunner$3.evaluate(ParentRunner.java:306)
10:06:57 [2020-07-24T14:06:57.999Z] 	at org.junit.runners.BlockJUnit4ClassRunner$1.evaluate(BlockJUnit4ClassRunner.java:100)
10:06:57 [2020-07-24T14:06:57.999Z] 	at org.junit.runners.ParentRunner.runLeaf(ParentRunner.java:366)
10:06:57 [2020-07-24T14:06:57.999Z] 	at org.junit.runners.BlockJUnit4ClassRunner.runChild(BlockJUnit4ClassRunner.java:103)
10:06:57 [2020-07-24T14:06:57.999Z] 	at org.junit.runners.BlockJUnit4ClassRunner.runChild(BlockJUnit4ClassRunner.java:63)
10:06:57 [2020-07-24T14:06:57.999Z] 	at org.junit.runners.ParentRunner$4.run(ParentRunner.java:331)
10:06:57 [2020-07-24T14:06:57.999Z] 	at org.junit.runners.ParentRunner$1.schedule(ParentRunner.java:79)
10:06:57 [2020-07-24T14:06:57.999Z] 	at org.junit.runners.ParentRunner.runChildren(ParentRunner.java:329)
10:06:57 [2020-07-24T14:06:57.999Z] 	at org.junit.runners.ParentRunner.access$100(ParentRunner.java:66)
10:06:57 [2020-07-24T14:06:57.999Z] 	at org.junit.runners.ParentRunner$2.evaluate(ParentRunner.java:293)
10:06:57 [2020-07-24T14:06:57.999Z] 	at org.junit.runners.ParentRunner$3.evaluate(ParentRunner.java:306)
10:06:57 [2020-07-24T14:06:57.999Z] 	at org.junit.runners.ParentRunner.run(ParentRunner.java:413)
10:06:57 [2020-07-24T14:06:57.999Z] 	at org.apache.maven.surefire.junit4.JUnit4Provider.execute(JUnit4Provider.java:365)
10:06:57 [2020-07-24T14:06:57.999Z] 	at org.apache.maven.surefire.junit4.JUnit4Provider.executeWithRerun(JUnit4Provider.java:273)
10:06:57 [2020-07-24T14:06:57.999Z] 	at org.apache.maven.surefire.junit4.JUnit4Provider.executeTestSet(JUnit4Provider.java:238)
10:06:57 [2020-07-24T14:06:57.999Z] 	at org.apache.maven.surefire.junit4.JUnit4Provider.invoke(JUnit4Provider.java:159)
10:06:57 [2020-07-24T14:06:57.999Z] 	at java.base/jdk.internal.reflect.NativeMethodAccessorImpl.invoke0(Native Method)
10:06:57 [2020-07-24T14:06:57.999Z] 	at java.base/jdk.internal.reflect.NativeMethodAccessorImpl.invoke(NativeMethodAccessorImpl.java:62)
10:06:57 [2020-07-24T14:06:57.999Z] 	at java.base/jdk.internal.reflect.DelegatingMethodAccessorImpl.invoke(DelegatingMethodAccessorImpl.java:43)
10:06:57 [2020-07-24T14:06:57.999Z] 	at java.base/java.lang.reflect.Method.invoke(Method.java:566)
10:06:57 [2020-07-24T14:06:57.999Z] 	at org.apache.maven.surefire.util.ReflectionUtils.invokeMethodWithArray2(ReflectionUtils.java:206)
10:06:57 [2020-07-24T14:06:57.999Z] 	at org.apache.maven.surefire.booter.ProviderFactory$ProviderProxy.invoke(ProviderFactory.java:161)
10:06:57 [2020-07-24T14:06:57.999Z] 	at org.apache.maven.surefire.booter.ProviderFactory.invokeProvider(ProviderFactory.java:84)
10:06:57 [2020-07-24T14:06:57.999Z] 	at org.eclipse.tycho.surefire.osgibooter.OsgiSurefireBooter.run(OsgiSurefireBooter.java:110)
10:06:57 [2020-07-24T14:06:57.999Z] 	at org.eclipse.tycho.surefire.osgibooter.HeadlessTestApplication.run(HeadlessTestApplication.java:21)
10:06:57 [2020-07-24T14:06:57.999Z] 	at java.base/jdk.internal.reflect.NativeMethodAccessorImpl.invoke0(Native Method)
10:06:57 [2020-07-24T14:06:57.999Z] 	at java.base/jdk.internal.reflect.NativeMethodAccessorImpl.invoke(NativeMethodAccessorImpl.java:62)
10:06:57 [2020-07-24T14:06:57.999Z] 	at java.base/jdk.internal.reflect.DelegatingMethodAccessorImpl.invoke(DelegatingMethodAccessorImpl.java:43)
10:06:57 [2020-07-24T14:06:57.999Z] 	at java.base/java.lang.reflect.Method.invoke(Method.java:566)
10:06:57 [2020-07-24T14:06:57.999Z] 	at org.eclipse.equinox.internal.app.EclipseAppContainer.callMethodWithException(EclipseAppContainer.java:593)
10:06:57 [2020-07-24T14:06:57.999Z] 	at org.eclipse.equinox.internal.app.EclipseAppHandle.run(EclipseAppHandle.java:205)
10:06:57 [2020-07-24T14:06:57.999Z] 	at org.eclipse.core.runtime.internal.adaptor.EclipseAppLauncher.runApplication(EclipseAppLauncher.java:137)
10:06:57 [2020-07-24T14:06:57.999Z] 	at org.eclipse.core.runtime.internal.adaptor.EclipseAppLauncher.start(EclipseAppLauncher.java:107)
10:06:57 [2020-07-24T14:06:57.999Z] 	at org.eclipse.core.runtime.adaptor.EclipseStarter.run(EclipseStarter.java:401)
10:06:57 [2020-07-24T14:06:57.999Z] 	at org.eclipse.core.runtime.adaptor.EclipseStarter.run(EclipseStarter.java:255)
10:06:57 [2020-07-24T14:06:57.999Z] 	at java.base/jdk.internal.reflect.NativeMethodAccessorImpl.invoke0(Native Method)
10:06:57 [2020-07-24T14:06:57.999Z] 	at java.base/jdk.internal.reflect.NativeMethodAccessorImpl.invoke(NativeMethodAccessorImpl.java:62)
10:06:57 [2020-07-24T14:06:57.999Z] 	at java.base/jdk.internal.reflect.DelegatingMethodAccessorImpl.invoke(DelegatingMethodAccessorImpl.java:43)
10:06:57 [2020-07-24T14:06:57.999Z] 	at java.base/java.lang.reflect.Method.invoke(Method.java:566)
10:06:57 [2020-07-24T14:06:57.999Z] 	at org.eclipse.equinox.launcher.Main.invokeFramework(Main.java:657)
10:06:57 [2020-07-24T14:06:57.999Z] 	at org.eclipse.equinox.launcher.Main.basicRun(Main.java:594)
10:06:57 [2020-07-24T14:06:57.999Z] 	at org.eclipse.equinox.launcher.Main.run(Main.java:1447)
10:06:57 [2020-07-24T14:06:57.999Z] 	at org.eclipse.equinox.launcher.Main.main(Main.java:1420)
10:06:57 [2020-07-24T14:06:57.999Z] 
10:06:57 [2020-07-24T14:06:57.999Z] !ENTRY org.eclipse.tracecompass.tmf.core 4 0 2020-07-24 14:06:55.811
10:06:57 [2020-07-24T14:06:57.999Z] !MESSAGE Error parsing /tmp/markers14170835316407940261xml
10:06:57 [2020-07-24T14:06:57.999Z] !STACK 0
10:06:57 [2020-07-24T14:06:57.999Z] java.lang.IllegalArgumentException: Invalid range: [4095..0]
10:06:57 [2020-07-24T14:06:57.999Z] 	at com.google.common.collect.Range.<init>(Range.java:357)
10:06:57 [2020-07-24T14:06:57.999Z] 	at com.google.common.collect.Range.create(Range.java:155)
10:06:57 [2020-07-24T14:06:57.999Z] 	at com.google.common.collect.Range.closed(Range.java:180)
10:06:57 [2020-07-24T14:06:57.999Z] 	at org.eclipse.tracecompass.internal.tmf.core.markers.MarkerConfigXmlParser.parseRange(MarkerConfigXmlParser.java:310)
10:06:57 [2020-07-24T14:06:57.999Z] 	at org.eclipse.tracecompass.internal.tmf.core.markers.MarkerConfigXmlParser.getMarkers(MarkerConfigXmlParser.java:215)
10:06:57 [2020-07-24T14:06:57.999Z] 	at org.eclipse.tracecompass.internal.tmf.core.markers.MarkerConfigXmlParser.parse(MarkerConfigXmlParser.java:186)
10:06:57 [2020-07-24T14:06:57.999Z] 	at org.eclipse.tracecompass.tmf.core.tests.markers.MarkerConfigXmlParserTest.testParseInvalidContent(MarkerConfigXmlParserTest.java:307)
10:06:57 [2020-07-24T14:06:57.999Z] 	at org.eclipse.tracecompass.tmf.core.tests.markers.MarkerConfigXmlParserTest.testParseInvalidContent(MarkerConfigXmlParserTest.java:296)
10:06:57 [2020-07-24T14:06:57.999Z] 	at java.base/jdk.internal.reflect.NativeMethodAccessorImpl.invoke0(Native Method)
10:06:58 [2020-07-24T14:06:58.000Z] 	at java.base/jdk.internal.reflect.NativeMethodAccessorImpl.invoke(NativeMethodAccessorImpl.java:62)
10:06:58 [2020-07-24T14:06:58.000Z] 	at java.base/jdk.internal.reflect.DelegatingMethodAccessorImpl.invoke(DelegatingMethodAccessorImpl.java:43)
10:06:58 [2020-07-24T14:06:58.000Z] 	at java.base/java.lang.reflect.Method.invoke(Method.java:566)
10:06:58 [2020-07-24T14:06:58.000Z] 	at org.junit.runners.model.FrameworkMethod$1.runReflectiveCall(FrameworkMethod.java:59)
10:06:58 [2020-07-24T14:06:58.000Z] 	at org.junit.internal.runners.model.ReflectiveCallable.run(ReflectiveCallable.java:12)
10:06:58 [2020-07-24T14:06:58.000Z] 	at org.junit.runners.model.FrameworkMethod.invokeExplosively(FrameworkMethod.java:56)
10:06:58 [2020-07-24T14:06:58.000Z] 	at org.junit.internal.runners.statements.InvokeMethod.evaluate(InvokeMethod.java:17)
10:06:58 [2020-07-24T14:06:58.000Z] 	at org.junit.runners.ParentRunner$3.evaluate(ParentRunner.java:306)
10:06:58 [2020-07-24T14:06:58.000Z] 	at org.junit.runners.BlockJUnit4ClassRunner$1.evaluate(BlockJUnit4ClassRunner.java:100)
10:06:58 [2020-07-24T14:06:58.000Z] 	at org.junit.runners.ParentRunner.runLeaf(ParentRunner.java:366)
10:06:58 [2020-07-24T14:06:58.000Z] 	at org.junit.runners.BlockJUnit4ClassRunner.runChild(BlockJUnit4ClassRunner.java:103)
10:06:58 [2020-07-24T14:06:58.000Z] 	at org.junit.runners.BlockJUnit4ClassRunner.runChild(BlockJUnit4ClassRunner.java:63)
10:06:58 [2020-07-24T14:06:58.000Z] 	at org.junit.runners.ParentRunner$4.run(ParentRunner.java:331)
10:06:58 [2020-07-24T14:06:58.000Z] 	at org.junit.runners.ParentRunner$1.schedule(ParentRunner.java:79)
10:06:58 [2020-07-24T14:06:58.000Z] 	at org.junit.runners.ParentRunner.runChildren(ParentRunner.java:329)
10:06:58 [2020-07-24T14:06:58.000Z] 	at org.junit.runners.ParentRunner.access$100(ParentRunner.java:66)
10:06:58 [2020-07-24T14:06:58.000Z] 	at org.junit.runners.ParentRunner$2.evaluate(ParentRunner.java:293)
10:06:58 [2020-07-24T14:06:58.000Z] 	at org.junit.runners.ParentRunner$3.evaluate(ParentRunner.java:306)
10:06:58 [2020-07-24T14:06:58.000Z] 	at org.junit.runners.ParentRunner.run(ParentRunner.java:413)
10:06:58 [2020-07-24T14:06:58.000Z] 	at org.apache.maven.surefire.junit4.JUnit4Provider.execute(JUnit4Provider.java:365)
10:06:58 [2020-07-24T14:06:58.000Z] 	at org.apache.maven.surefire.junit4.JUnit4Provider.executeWithRerun(JUnit4Provider.java:273)
10:06:58 [2020-07-24T14:06:58.000Z] 	at org.apache.maven.surefire.junit4.JUnit4Provider.executeTestSet(JUnit4Provider.java:238)
10:06:58 [2020-07-24T14:06:58.000Z] 	at org.apache.maven.surefire.junit4.JUnit4Provider.invoke(JUnit4Provider.java:159)
10:06:58 [2020-07-24T14:06:58.000Z] 	at java.base/jdk.internal.reflect.NativeMethodAccessorImpl.invoke0(Native Method)
10:06:58 [2020-07-24T14:06:58.000Z] 	at java.base/jdk.internal.reflect.NativeMethodAccessorImpl.invoke(NativeMethodAccessorImpl.java:62)
10:06:58 [2020-07-24T14:06:58.000Z] 	at java.base/jdk.internal.reflect.DelegatingMethodAccessorImpl.invoke(DelegatingMethodAccessorImpl.java:43)
10:06:58 [2020-07-24T14:06:58.000Z] 	at java.base/java.lang.reflect.Method.invoke(Method.java:566)
10:06:58 [2020-07-24T14:06:58.000Z] 	at org.apache.maven.surefire.util.ReflectionUtils.invokeMethodWithArray2(ReflectionUtils.java:206)
10:06:58 [2020-07-24T14:06:58.000Z] 	at org.apache.maven.surefire.booter.ProviderFactory$ProviderProxy.invoke(ProviderFactory.java:161)
10:06:58 [2020-07-24T14:06:58.000Z] 	at org.apache.maven.surefire.booter.ProviderFactory.invokeProvider(ProviderFactory.java:84)
10:06:58 [2020-07-24T14:06:58.000Z] 	at org.eclipse.tycho.surefire.osgibooter.OsgiSurefireBooter.run(OsgiSurefireBooter.java:110)
10:06:58 [2020-07-24T14:06:58.000Z] 	at org.eclipse.tycho.surefire.osgibooter.HeadlessTestApplication.run(HeadlessTestApplication.java:21)
10:06:58 [2020-07-24T14:06:58.000Z] 	at java.base/jdk.internal.reflect.NativeMethodAccessorImpl.invoke0(Native Method)
10:06:58 [2020-07-24T14:06:58.000Z] 	at java.base/jdk.internal.reflect.NativeMethodAccessorImpl.invoke(NativeMethodAccessorImpl.java:62)
10:06:58 [2020-07-24T14:06:58.000Z] 	at java.base/jdk.internal.reflect.DelegatingMethodAccessorImpl.invoke(DelegatingMethodAccessorImpl.java:43)
10:06:58 [2020-07-24T14:06:58.000Z] 	at java.base/java.lang.reflect.Method.invoke(Method.java:566)
10:06:58 [2020-07-24T14:06:58.000Z] 	at org.eclipse.equinox.internal.app.EclipseAppContainer.callMethodWithException(EclipseAppContainer.java:593)
10:06:58 [2020-07-24T14:06:58.000Z] 	at org.eclipse.equinox.internal.app.EclipseAppHandle.run(EclipseAppHandle.java:205)
10:06:58 [2020-07-24T14:06:58.000Z] 	at org.eclipse.core.runtime.internal.adaptor.EclipseAppLauncher.runApplication(EclipseAppLauncher.java:137)
10:06:58 [2020-07-24T14:06:58.000Z] 	at org.eclipse.core.runtime.internal.adaptor.EclipseAppLauncher.start(EclipseAppLauncher.java:107)
10:06:58 [2020-07-24T14:06:58.000Z] 	at org.eclipse.core.runtime.adaptor.EclipseStarter.run(EclipseStarter.java:401)
10:06:58 [2020-07-24T14:06:58.000Z] 	at org.eclipse.core.runtime.adaptor.EclipseStarter.run(EclipseStarter.java:255)
10:06:58 [2020-07-24T14:06:58.000Z] 	at java.base/jdk.internal.reflect.NativeMethodAccessorImpl.invoke0(Native Method)
10:06:58 [2020-07-24T14:06:58.000Z] 	at java.base/jdk.internal.reflect.NativeMethodAccessorImpl.invoke(NativeMethodAccessorImpl.java:62)
10:06:58 [2020-07-24T14:06:58.000Z] 	at java.base/jdk.internal.reflect.DelegatingMethodAccessorImpl.invoke(DelegatingMethodAccessorImpl.java:43)
10:06:58 [2020-07-24T14:06:58.000Z] 	at java.base/java.lang.reflect.Method.invoke(Method.java:566)
10:06:58 [2020-07-24T14:06:58.000Z] 	at org.eclipse.equinox.launcher.Main.invokeFramework(Main.java:657)
10:06:58 [2020-07-24T14:06:58.000Z] 	at org.eclipse.equinox.launcher.Main.basicRun(Main.java:594)
10:06:58 [2020-07-24T14:06:58.000Z] 	at org.eclipse.equinox.launcher.Main.run(Main.java:1447)
10:06:58 [2020-07-24T14:06:58.000Z] 	at org.eclipse.equinox.launcher.Main.main(Main.java:1420)
10:06:58 [2020-07-24T14:06:58.000Z] 
10:06:58 [2020-07-24T14:06:58.000Z] !ENTRY org.eclipse.tracecompass.tmf.core 4 0 2020-07-24 14:06:55.813
10:06:58 [2020-07-24T14:06:58.000Z] !MESSAGE Error parsing /tmp/markers14490063945800166035xml
10:06:58 [2020-07-24T14:06:58.000Z] !STACK 0
10:06:58 [2020-07-24T14:06:58.000Z] org.xml.sax.SAXParseException; systemId: file:/tmp/markers14490063945800166035xml; lineNumber: 1; columnNumber: 256; cvc-complex-type.2.4.b: The content of element 'segments' is not complete. One of '{segment}' is expected.
10:06:58 [2020-07-24T14:06:58.000Z] 	at java.xml/com.sun.org.apache.xerces.internal.util.ErrorHandlerWrapper.createSAXParseException(ErrorHandlerWrapper.java:204)
10:06:58 [2020-07-24T14:06:58.000Z] 	at java.xml/com.sun.org.apache.xerces.internal.util.ErrorHandlerWrapper.error(ErrorHandlerWrapper.java:135)
10:06:58 [2020-07-24T14:06:58.000Z] 	at java.xml/com.sun.org.apache.xerces.internal.impl.XMLErrorReporter.reportError(XMLErrorReporter.java:396)
10:06:58 [2020-07-24T14:06:58.000Z] 	at java.xml/com.sun.org.apache.xerces.internal.impl.XMLErrorReporter.reportError(XMLErrorReporter.java:327)
10:06:58 [2020-07-24T14:06:58.000Z] 	at java.xml/com.sun.org.apache.xerces.internal.impl.XMLErrorReporter.reportError(XMLErrorReporter.java:284)
10:06:58 [2020-07-24T14:06:58.000Z] 	at java.xml/com.sun.org.apache.xerces.internal.impl.xs.XMLSchemaValidator$XSIErrorReporter.reportError(XMLSchemaValidator.java:511)
10:06:58 [2020-07-24T14:06:58.000Z] 	at java.xml/com.sun.org.apache.xerces.internal.impl.xs.XMLSchemaValidator.reportSchemaError(XMLSchemaValidator.java:3587)
10:06:58 [2020-07-24T14:06:58.000Z] 	at java.xml/com.sun.org.apache.xerces.internal.impl.xs.XMLSchemaValidator.elementLocallyValidComplexType(XMLSchemaValidator.java:3506)
10:06:58 [2020-07-24T14:06:58.000Z] 	at java.xml/com.sun.org.apache.xerces.internal.impl.xs.XMLSchemaValidator.elementLocallyValidType(XMLSchemaValidator.java:3432)
10:06:58 [2020-07-24T14:06:58.000Z] 	at java.xml/com.sun.org.apache.xerces.internal.impl.xs.XMLSchemaValidator.processElementContent(XMLSchemaValidator.java:3334)
10:06:58 [2020-07-24T14:06:58.000Z] 	at java.xml/com.sun.org.apache.xerces.internal.impl.xs.XMLSchemaValidator.handleEndElement(XMLSchemaValidator.java:2372)
10:06:58 [2020-07-24T14:06:58.000Z] 	at java.xml/com.sun.org.apache.xerces.internal.impl.xs.XMLSchemaValidator.endElement(XMLSchemaValidator.java:943)
10:06:58 [2020-07-24T14:06:58.000Z] 	at java.xml/com.sun.org.apache.xerces.internal.impl.XMLDocumentFragmentScannerImpl.scanEndElement(XMLDocumentFragmentScannerImpl.java:1716)
10:06:58 [2020-07-24T14:06:58.000Z] 	at java.xml/com.sun.org.apache.xerces.internal.impl.XMLDocumentFragmentScannerImpl$FragmentContentDriver.next(XMLDocumentFragmentScannerImpl.java:2881)
10:06:58 [2020-07-24T14:06:58.000Z] 	at java.xml/com.sun.org.apache.xerces.internal.impl.XMLDocumentScannerImpl.next(XMLDocumentScannerImpl.java:605)
10:06:58 [2020-07-24T14:06:58.000Z] 	at java.xml/com.sun.org.apache.xerces.internal.impl.XMLNSDocumentScannerImpl.next(XMLNSDocumentScannerImpl.java:112)
10:06:58 [2020-07-24T14:06:58.000Z] 	at java.xml/com.sun.org.apache.xerces.internal.impl.XMLDocumentFragmentScannerImpl.scanDocument(XMLDocumentFragmentScannerImpl.java:534)
10:06:58 [2020-07-24T14:06:58.000Z] 	at java.xml/com.sun.org.apache.xerces.internal.parsers.XML11Configuration.parse(XML11Configuration.java:888)
10:06:58 [2020-07-24T14:06:58.000Z] 	at java.xml/com.sun.org.apache.xerces.internal.parsers.XML11Configuration.parse(XML11Configuration.java:824)
10:06:58 [2020-07-24T14:06:58.001Z] 	at java.xml/com.sun.org.apache.xerces.internal.parsers.XMLParser.parse(XMLParser.java:141)
10:06:58 [2020-07-24T14:06:58.001Z] 	at java.xml/com.sun.org.apache.xerces.internal.parsers.DOMParser.parse(DOMParser.java:246)
10:06:58 [2020-07-24T14:06:58.001Z] 	at java.xml/com.sun.org.apache.xerces.internal.jaxp.DocumentBuilderImpl.parse(DocumentBuilderImpl.java:339)
10:06:58 [2020-07-24T14:06:58.001Z] 	at java.xml/javax.xml.parsers.DocumentBuilder.parse(DocumentBuilder.java:206)
10:06:58 [2020-07-24T14:06:58.001Z] 	at org.eclipse.tracecompass.internal.tmf.core.markers.MarkerConfigXmlParser.parse(MarkerConfigXmlParser.java:172)
10:06:58 [2020-07-24T14:06:58.001Z] 	at org.eclipse.tracecompass.tmf.core.tests.markers.MarkerConfigXmlParserTest.testParseInvalidContent(MarkerConfigXmlParserTest.java:307)
10:06:58 [2020-07-24T14:06:58.001Z] 	at org.eclipse.tracecompass.tmf.core.tests.markers.MarkerConfigXmlParserTest.testParseInvalidContent(MarkerConfigXmlParserTest.java:297)
10:06:58 [2020-07-24T14:06:58.001Z] 	at java.base/jdk.internal.reflect.NativeMethodAccessorImpl.invoke0(Native Method)
10:06:58 [2020-07-24T14:06:58.001Z] 	at java.base/jdk.internal.reflect.NativeMethodAccessorImpl.invoke(NativeMethodAccessorImpl.java:62)
10:06:58 [2020-07-24T14:06:58.001Z] 	at java.base/jdk.internal.reflect.DelegatingMethodAccessorImpl.invoke(DelegatingMethodAccessorImpl.java:43)
10:06:58 [2020-07-24T14:06:58.001Z] 	at java.base/java.lang.reflect.Method.invoke(Method.java:566)
10:06:58 [2020-07-24T14:06:58.001Z] 	at org.junit.runners.model.FrameworkMethod$1.runReflectiveCall(FrameworkMethod.java:59)
10:06:58 [2020-07-24T14:06:58.001Z] 	at org.junit.internal.runners.model.ReflectiveCallable.run(ReflectiveCallable.java:12)
10:06:58 [2020-07-24T14:06:58.001Z] 	at org.junit.runners.model.FrameworkMethod.invokeExplosively(FrameworkMethod.java:56)
10:06:58 [2020-07-24T14:06:58.001Z] 	at org.junit.internal.runners.statements.InvokeMethod.evaluate(InvokeMethod.java:17)
10:06:58 [2020-07-24T14:06:58.001Z] 	at org.junit.runners.ParentRunner$3.evaluate(ParentRunner.java:306)
10:06:58 [2020-07-24T14:06:58.001Z] 	at org.junit.runners.BlockJUnit4ClassRunner$1.evaluate(BlockJUnit4ClassRunner.java:100)
10:06:58 [2020-07-24T14:06:58.001Z] 	at org.junit.runners.ParentRunner.runLeaf(ParentRunner.java:366)
10:06:58 [2020-07-24T14:06:58.001Z] 	at org.junit.runners.BlockJUnit4ClassRunner.runChild(BlockJUnit4ClassRunner.java:103)
10:06:58 [2020-07-24T14:06:58.001Z] 	at org.junit.runners.BlockJUnit4ClassRunner.runChild(BlockJUnit4ClassRunner.java:63)
10:06:58 [2020-07-24T14:06:58.001Z] 	at org.junit.runners.ParentRunner$4.run(ParentRunner.java:331)
10:06:58 [2020-07-24T14:06:58.001Z] 	at org.junit.runners.ParentRunner$1.schedule(ParentRunner.java:79)
10:06:58 [2020-07-24T14:06:58.001Z] 	at org.junit.runners.ParentRunner.runChildren(ParentRunner.java:329)
10:06:58 [2020-07-24T14:06:58.001Z] 	at org.junit.runners.ParentRunner.access$100(ParentRunner.java:66)
10:06:58 [2020-07-24T14:06:58.001Z] 	at org.junit.runners.ParentRunner$2.evaluate(ParentRunner.java:293)
10:06:58 [2020-07-24T14:06:58.001Z] 	at org.junit.runners.ParentRunner$3.evaluate(ParentRunner.java:306)
10:06:58 [2020-07-24T14:06:58.001Z] 	at org.junit.runners.ParentRunner.run(ParentRunner.java:413)
10:06:58 [2020-07-24T14:06:58.001Z] 	at org.apache.maven.surefire.junit4.JUnit4Provider.execute(JUnit4Provider.java:365)
10:06:58 [2020-07-24T14:06:58.001Z] 	at org.apache.maven.surefire.junit4.JUnit4Provider.executeWithRerun(JUnit4Provider.java:273)
10:06:58 [2020-07-24T14:06:58.001Z] 	at org.apache.maven.surefire.junit4.JUnit4Provider.executeTestSet(JUnit4Provider.java:238)
10:06:58 [2020-07-24T14:06:58.001Z] 	at org.apache.maven.surefire.junit4.JUnit4Provider.invoke(JUnit4Provider.java:159)
10:06:58 [2020-07-24T14:06:58.001Z] 	at java.base/jdk.internal.reflect.NativeMethodAccessorImpl.invoke0(Native Method)
10:06:58 [2020-07-24T14:06:58.001Z] 	at java.base/jdk.internal.reflect.NativeMethodAccessorImpl.invoke(NativeMethodAccessorImpl.java:62)
10:06:58 [2020-07-24T14:06:58.001Z] 	at java.base/jdk.internal.reflect.DelegatingMethodAccessorImpl.invoke(DelegatingMethodAccessorImpl.java:43)
10:06:58 [2020-07-24T14:06:58.001Z] 	at java.base/java.lang.reflect.Method.invoke(Method.java:566)
10:06:58 [2020-07-24T14:06:58.001Z] 	at org.apache.maven.surefire.util.ReflectionUtils.invokeMethodWithArray2(ReflectionUtils.java:206)
10:06:58 [2020-07-24T14:06:58.001Z] 	at org.apache.maven.surefire.booter.ProviderFactory$ProviderProxy.invoke(ProviderFactory.java:161)
10:06:58 [2020-07-24T14:06:58.001Z] 	at org.apache.maven.surefire.booter.ProviderFactory.invokeProvider(ProviderFactory.java:84)
10:06:58 [2020-07-24T14:06:58.001Z] 	at org.eclipse.tycho.surefire.osgibooter.OsgiSurefireBooter.run(OsgiSurefireBooter.java:110)
10:06:58 [2020-07-24T14:06:58.001Z] 	at org.eclipse.tycho.surefire.osgibooter.HeadlessTestApplication.run(HeadlessTestApplication.java:21)
10:06:58 [2020-07-24T14:06:58.001Z] 	at java.base/jdk.internal.reflect.NativeMethodAccessorImpl.invoke0(Native Method)
10:06:58 [2020-07-24T14:06:58.001Z] 	at java.base/jdk.internal.reflect.NativeMethodAccessorImpl.invoke(NativeMethodAccessorImpl.java:62)
10:06:58 [2020-07-24T14:06:58.001Z] 	at java.base/jdk.internal.reflect.DelegatingMethodAccessorImpl.invoke(DelegatingMethodAccessorImpl.java:43)
10:06:58 [2020-07-24T14:06:58.001Z] 	at java.base/java.lang.reflect.Method.invoke(Method.java:566)
10:06:58 [2020-07-24T14:06:58.001Z] 	at org.eclipse.equinox.internal.app.EclipseAppContainer.callMethodWithException(EclipseAppContainer.java:593)
10:06:58 [2020-07-24T14:06:58.001Z] 	at org.eclipse.equinox.internal.app.EclipseAppHandle.run(EclipseAppHandle.java:205)
10:06:58 [2020-07-24T14:06:58.001Z] 	at org.eclipse.core.runtime.internal.adaptor.EclipseAppLauncher.runApplication(EclipseAppLauncher.java:137)
10:06:58 [2020-07-24T14:06:58.001Z] 	at org.eclipse.core.runtime.internal.adaptor.EclipseAppLauncher.start(EclipseAppLauncher.java:107)
10:06:58 [2020-07-24T14:06:58.001Z] 	at org.eclipse.core.runtime.adaptor.EclipseStarter.run(EclipseStarter.java:401)
10:06:58 [2020-07-24T14:06:58.001Z] 	at org.eclipse.core.runtime.adaptor.EclipseStarter.run(EclipseStarter.java:255)
10:06:58 [2020-07-24T14:06:58.001Z] 	at java.base/jdk.internal.reflect.NativeMethodAccessorImpl.invoke0(Native Method)
10:06:58 [2020-07-24T14:06:58.001Z] 	at java.base/jdk.internal.reflect.NativeMethodAccessorImpl.invoke(NativeMethodAccessorImpl.java:62)
10:06:58 [2020-07-24T14:06:58.001Z] 	at java.base/jdk.internal.reflect.DelegatingMethodAccessorImpl.invoke(DelegatingMethodAccessorImpl.java:43)
10:06:58 [2020-07-24T14:06:58.001Z] 	at java.base/java.lang.reflect.Method.invoke(Method.java:566)
10:06:58 [2020-07-24T14:06:58.001Z] 	at org.eclipse.equinox.launcher.Main.invokeFramework(Main.java:657)
10:06:58 [2020-07-24T14:06:58.001Z] 	at org.eclipse.equinox.launcher.Main.basicRun(Main.java:594)
10:06:58 [2020-07-24T14:06:58.001Z] 	at org.eclipse.equinox.launcher.Main.run(Main.java:1447)
10:06:58 [2020-07-24T14:06:58.001Z] 	at org.eclipse.equinox.launcher.Main.main(Main.java:1420)
10:06:58 [2020-07-24T14:06:58.001Z] 
10:06:58 [2020-07-24T14:06:58.001Z] !ENTRY org.eclipse.tracecompass.tmf.core 4 0 2020-07-24 14:06:55.816
10:06:58 [2020-07-24T14:06:58.001Z] !MESSAGE Error parsing /tmp/markers3473055561047411579xml
10:06:58 [2020-07-24T14:06:58.001Z] !STACK 0
10:06:58 [2020-07-24T14:06:58.001Z] org.xml.sax.SAXParseException; systemId: file:/tmp/markers3473055561047411579xml; lineNumber: 1; columnNumber: 323; cvc-minExclusive-valid: Value '0' is not facet-valid with respect to minExclusive '0' for type 'length_type'.
10:06:58 [2020-07-24T14:06:58.001Z] 	at java.xml/com.sun.org.apache.xerces.internal.util.ErrorHandlerWrapper.createSAXParseException(ErrorHandlerWrapper.java:204)
10:06:58 [2020-07-24T14:06:58.001Z] 	at java.xml/com.sun.org.apache.xerces.internal.util.ErrorHandlerWrapper.error(ErrorHandlerWrapper.java:135)
10:06:58 [2020-07-24T14:06:58.001Z] 	at java.xml/com.sun.org.apache.xerces.internal.impl.XMLErrorReporter.reportError(XMLErrorReporter.java:396)
10:06:58 [2020-07-24T14:06:58.001Z] 	at java.xml/com.sun.org.apache.xerces.internal.impl.XMLErrorReporter.reportError(XMLErrorReporter.java:327)
10:06:58 [2020-07-24T14:06:58.001Z] 	at java.xml/com.sun.org.apache.xerces.internal.impl.XMLErrorReporter.reportError(XMLErrorReporter.java:284)
10:06:58 [2020-07-24T14:06:58.001Z] 	at java.xml/com.sun.org.apache.xerces.internal.impl.xs.XMLSchemaValidator$XSIErrorReporter.reportError(XMLSchemaValidator.java:511)
10:06:58 [2020-07-24T14:06:58.001Z] 	at java.xml/com.sun.org.apache.xerces.internal.impl.xs.XMLSchemaValidator.reportSchemaError(XMLSchemaValidator.java:3587)
10:06:58 [2020-07-24T14:06:58.001Z] 	at java.xml/com.sun.org.apache.xerces.internal.impl.xs.XMLSchemaValidator.processOneAttribute(XMLSchemaValidator.java:3107)
10:06:58 [2020-07-24T14:06:58.001Z] 	at java.xml/com.sun.org.apache.xerces.internal.impl.xs.XMLSchemaValidator.processAttributes(XMLSchemaValidator.java:3051)
10:06:58 [2020-07-24T14:06:58.001Z] 	at java.xml/com.sun.org.apache.xerces.internal.impl.xs.XMLSchemaValidator.handleStartElement(XMLSchemaValidator.java:2286)
10:06:58 [2020-07-24T14:06:58.001Z] 	at java.xml/com.sun.org.apache.xerces.internal.impl.xs.XMLSchemaValidator.emptyElement(XMLSchemaValidator.java:849)
10:06:58 [2020-07-24T14:06:58.001Z] 	at java.xml/com.sun.org.apache.xerces.internal.impl.XMLNSDocumentScannerImpl.scanStartElement(XMLNSDocumentScannerImpl.java:351)
10:06:58 [2020-07-24T14:06:58.001Z] 	at java.xml/com.sun.org.apache.xerces.internal.impl.XMLDocumentFragmentScannerImpl$FragmentContentDriver.next(XMLDocumentFragmentScannerImpl.java:2708)
10:06:58 [2020-07-24T14:06:58.001Z] 	at java.xml/com.sun.org.apache.xerces.internal.impl.XMLDocumentScannerImpl.next(XMLDocumentScannerImpl.java:605)
10:06:58 [2020-07-24T14:06:58.001Z] 	at java.xml/com.sun.org.apache.xerces.internal.impl.XMLNSDocumentScannerImpl.next(XMLNSDocumentScannerImpl.java:112)
10:06:58 [2020-07-24T14:06:58.001Z] 	at java.xml/com.sun.org.apache.xerces.internal.impl.XMLDocumentFragmentScannerImpl.scanDocument(XMLDocumentFragmentScannerImpl.java:534)
10:06:58 [2020-07-24T14:06:58.001Z] 	at java.xml/com.sun.org.apache.xerces.internal.parsers.XML11Configuration.parse(XML11Configuration.java:888)
10:06:58 [2020-07-24T14:06:58.001Z] 	at java.xml/com.sun.org.apache.xerces.internal.parsers.XML11Configuration.parse(XML11Configuration.java:824)
10:06:58 [2020-07-24T14:06:58.001Z] 	at java.xml/com.sun.org.apache.xerces.internal.parsers.XMLParser.parse(XMLParser.java:141)
10:06:58 [2020-07-24T14:06:58.001Z] 	at java.xml/com.sun.org.apache.xerces.internal.parsers.DOMParser.parse(DOMParser.java:246)
10:06:58 [2020-07-24T14:06:58.001Z] 	at java.xml/com.sun.org.apache.xerces.internal.jaxp.DocumentBuilderImpl.parse(DocumentBuilderImpl.java:339)
10:06:58 [2020-07-24T14:06:58.001Z] 	at java.xml/javax.xml.parsers.DocumentBuilder.parse(DocumentBuilder.java:206)
10:06:58 [2020-07-24T14:06:58.001Z] 	at org.eclipse.tracecompass.internal.tmf.core.markers.MarkerConfigXmlParser.parse(MarkerConfigXmlParser.java:172)
10:06:58 [2020-07-24T14:06:58.001Z] 	at org.eclipse.tracecompass.tmf.core.tests.markers.MarkerConfigXmlParserTest.testParseInvalidContent(MarkerConfigXmlParserTest.java:307)
10:06:58 [2020-07-24T14:06:58.001Z] 	at org.eclipse.tracecompass.tmf.core.tests.markers.MarkerConfigXmlParserTest.testParseInvalidContent(MarkerConfigXmlParserTest.java:298)
10:06:58 [2020-07-24T14:06:58.001Z] 	at java.base/jdk.internal.reflect.NativeMethodAccessorImpl.invoke0(Native Method)
10:06:58 [2020-07-24T14:06:58.001Z] 	at java.base/jdk.internal.reflect.NativeMethodAccessorImpl.invoke(NativeMethodAccessorImpl.java:62)
10:06:58 [2020-07-24T14:06:58.001Z] 	at java.base/jdk.internal.reflect.DelegatingMethodAccessorImpl.invoke(DelegatingMethodAccessorImpl.java:43)
10:06:58 [2020-07-24T14:06:58.001Z] 	at java.base/java.lang.reflect.Method.invoke(Method.java:566)
10:06:58 [2020-07-24T14:06:58.001Z] 	at org.junit.runners.model.FrameworkMethod$1.runReflectiveCall(FrameworkMethod.java:59)
10:06:58 [2020-07-24T14:06:58.001Z] 	at org.junit.internal.runners.model.ReflectiveCallable.run(ReflectiveCallable.java:12)
10:06:58 [2020-07-24T14:06:58.001Z] 	at org.junit.runners.model.FrameworkMethod.invokeExplosively(FrameworkMethod.java:56)
10:06:58 [2020-07-24T14:06:58.001Z] 	at org.junit.internal.runners.statements.InvokeMethod.evaluate(InvokeMethod.java:17)
10:06:58 [2020-07-24T14:06:58.001Z] 	at org.junit.runners.ParentRunner$3.evaluate(ParentRunner.java:306)
10:06:58 [2020-07-24T14:06:58.001Z] 	at org.junit.runners.BlockJUnit4ClassRunner$1.evaluate(BlockJUnit4ClassRunner.java:100)
10:06:58 [2020-07-24T14:06:58.001Z] 	at org.junit.runners.ParentRunner.runLeaf(ParentRunner.java:366)
10:06:58 [2020-07-24T14:06:58.001Z] 	at org.junit.runners.BlockJUnit4ClassRunner.runChild(BlockJUnit4ClassRunner.java:103)
10:06:58 [2020-07-24T14:06:58.001Z] 	at org.junit.runners.BlockJUnit4ClassRunner.runChild(BlockJUnit4ClassRunner.java:63)
10:06:58 [2020-07-24T14:06:58.001Z] 	at org.junit.runners.ParentRunner$4.run(ParentRunner.java:331)
10:06:58 [2020-07-24T14:06:58.001Z] 	at org.junit.runners.ParentRunner$1.schedule(ParentRunner.java:79)
10:06:58 [2020-07-24T14:06:58.001Z] 	at org.junit.runners.ParentRunner.runChildren(ParentRunner.java:329)
10:06:58 [2020-07-24T14:06:58.001Z] 	at org.junit.runners.ParentRunner.access$100(ParentRunner.java:66)
10:06:58 [2020-07-24T14:06:58.001Z] 	at org.junit.runners.ParentRunner$2.evaluate(ParentRunner.java:293)
10:06:58 [2020-07-24T14:06:58.001Z] 	at org.junit.runners.ParentRunner$3.evaluate(ParentRunner.java:306)
10:06:58 [2020-07-24T14:06:58.001Z] 	at org.junit.runners.ParentRunner.run(ParentRunner.java:413)
10:06:58 [2020-07-24T14:06:58.001Z] 	at org.apache.maven.surefire.junit4.JUnit4Provider.execute(JUnit4Provider.java:365)
10:06:58 [2020-07-24T14:06:58.001Z] 	at org.apache.maven.surefire.junit4.JUnit4Provider.executeWithRerun(JUnit4Provider.java:273)
10:06:58 [2020-07-24T14:06:58.001Z] 	at org.apache.maven.surefire.junit4.JUnit4Provider.executeTestSet(JUnit4Provider.java:238)
10:06:58 [2020-07-24T14:06:58.001Z] 	at org.apache.maven.surefire.junit4.JUnit4Provider.invoke(JUnit4Provider.java:159)
10:06:58 [2020-07-24T14:06:58.001Z] 	at java.base/jdk.internal.reflect.NativeMethodAccessorImpl.invoke0(Native Method)
10:06:58 [2020-07-24T14:06:58.001Z] 	at java.base/jdk.internal.reflect.NativeMethodAccessorImpl.invoke(NativeMethodAccessorImpl.java:62)
10:06:58 [2020-07-24T14:06:58.001Z] 	at java.base/jdk.internal.reflect.DelegatingMethodAccessorImpl.invoke(DelegatingMethodAccessorImpl.java:43)
10:06:58 [2020-07-24T14:06:58.001Z] 	at java.base/java.lang.reflect.Method.invoke(Method.java:566)
10:06:58 [2020-07-24T14:06:58.001Z] 	at org.apache.maven.surefire.util.ReflectionUtils.invokeMethodWithArray2(ReflectionUtils.java:206)
10:06:58 [2020-07-24T14:06:58.001Z] 	at org.apache.maven.surefire.booter.ProviderFactory$ProviderProxy.invoke(ProviderFactory.java:161)
10:06:58 [2020-07-24T14:06:58.001Z] 	at org.apache.maven.surefire.booter.ProviderFactory.invokeProvider(ProviderFactory.java:84)
10:06:58 [2020-07-24T14:06:58.001Z] 	at org.eclipse.tycho.surefire.osgibooter.OsgiSurefireBooter.run(OsgiSurefireBooter.java:110)
10:06:58 [2020-07-24T14:06:58.001Z] 	at org.eclipse.tycho.surefire.osgibooter.HeadlessTestApplication.run(HeadlessTestApplication.java:21)
10:06:58 [2020-07-24T14:06:58.001Z] 	at java.base/jdk.internal.reflect.NativeMethodAccessorImpl.invoke0(Native Method)
10:06:58 [2020-07-24T14:06:58.002Z] 	at java.base/jdk.internal.reflect.NativeMethodAccessorImpl.invoke(NativeMethodAccessorImpl.java:62)
10:06:58 [2020-07-24T14:06:58.002Z] 	at java.base/jdk.internal.reflect.DelegatingMethodAccessorImpl.invoke(DelegatingMethodAccessorImpl.java:43)
10:06:58 [2020-07-24T14:06:58.002Z] 	at java.base/java.lang.reflect.Method.invoke(Method.java:566)
10:06:58 [2020-07-24T14:06:58.002Z] 	at org.eclipse.equinox.internal.app.EclipseAppContainer.callMethodWithException(EclipseAppContainer.java:593)
10:06:58 [2020-07-24T14:06:58.002Z] 	at org.eclipse.equinox.internal.app.EclipseAppHandle.run(EclipseAppHandle.java:205)
10:06:58 [2020-07-24T14:06:58.002Z] 	at org.eclipse.core.runtime.internal.adaptor.EclipseAppLauncher.runApplication(EclipseAppLauncher.java:137)
10:06:58 [2020-07-24T14:06:58.002Z] 	at org.eclipse.core.runtime.internal.adaptor.EclipseAppLauncher.start(EclipseAppLauncher.java:107)
10:06:58 [2020-07-24T14:06:58.002Z] 	at org.eclipse.core.runtime.adaptor.EclipseStarter.run(EclipseStarter.java:401)
10:06:58 [2020-07-24T14:06:58.002Z] 	at org.eclipse.core.runtime.adaptor.EclipseStarter.run(EclipseStarter.java:255)
10:06:58 [2020-07-24T14:06:58.002Z] 	at java.base/jdk.internal.reflect.NativeMethodAccessorImpl.invoke0(Native Method)
10:06:58 [2020-07-24T14:06:58.002Z] 	at java.base/jdk.internal.reflect.NativeMethodAccessorImpl.invoke(NativeMethodAccessorImpl.java:62)
10:06:58 [2020-07-24T14:06:58.002Z] 	at java.base/jdk.internal.reflect.DelegatingMethodAccessorImpl.invoke(DelegatingMethodAccessorImpl.java:43)
10:06:58 [2020-07-24T14:06:58.002Z] 	at java.base/java.lang.reflect.Method.invoke(Method.java:566)
10:06:58 [2020-07-24T14:06:58.002Z] 	at org.eclipse.equinox.launcher.Main.invokeFramework(Main.java:657)
10:06:58 [2020-07-24T14:06:58.002Z] 	at org.eclipse.equinox.launcher.Main.basicRun(Main.java:594)
10:06:58 [2020-07-24T14:06:58.002Z] 	at org.eclipse.equinox.launcher.Main.run(Main.java:1447)
10:06:58 [2020-07-24T14:06:58.002Z] 	at org.eclipse.equinox.launcher.Main.main(Main.java:1420)
10:06:58 [2020-07-24T14:06:58.002Z] Tests run: 4, Failures: 0, Errors: 0, Skipped: 0, Time elapsed: 0.095 s - in org.eclipse.tracecompass.tmf.core.tests.markers.MarkerConfigXmlParserTest
10:06:58 [2020-07-24T14:06:58.002Z] testParseInvalidContent(org.eclipse.tracecompass.tmf.core.tests.markers.MarkerConfigXmlParserTest)  Time elapsed: 0.085 s
10:06:58 [2020-07-24T14:06:58.002Z] testExtensionPoint(org.eclipse.tracecompass.tmf.core.tests.markers.MarkerConfigXmlParserTest)  Time elapsed: 0.005 s
10:06:58 [2020-07-24T14:06:58.002Z] testParse(org.eclipse.tracecompass.tmf.core.tests.markers.MarkerConfigXmlParserTest)  Time elapsed: 0.003 s
10:06:58 [2020-07-24T14:06:58.002Z] testParseInvalidFile(org.eclipse.tracecompass.tmf.core.tests.markers.MarkerConfigXmlParserTest)  Time elapsed: 0.002 s
10:06:58 [2020-07-24T14:06:58.002Z] Running org.eclipse.tracecompass.tmf.core.tests.segment.SegmentAspectTest
10:06:58 [2020-07-24T14:06:58.002Z] Tests run: 2, Failures: 0, Errors: 0, Skipped: 0, Time elapsed: 0.002 s - in org.eclipse.tracecompass.tmf.core.tests.segment.SegmentAspectTest
10:06:58 [2020-07-24T14:06:58.002Z] aspectResolveTest(org.eclipse.tracecompass.tmf.core.tests.segment.SegmentAspectTest)  Time elapsed: 0.001 s
10:06:58 [2020-07-24T14:06:58.002Z] aspectTypeTest(org.eclipse.tracecompass.tmf.core.tests.segment.SegmentAspectTest)  Time elapsed: 0 s
10:06:58 [2020-07-24T14:06:58.002Z] Running org.eclipse.tracecompass.tmf.core.tests.symbols.MappingFileTest
10:06:58 [2020-07-24T14:06:58.002Z] 
10:06:58 [2020-07-24T14:06:58.002Z] !ENTRY org.eclipse.cdt.core.native 4 0 2020-07-24 14:06:56.334
10:06:58 [2020-07-24T14:06:58.002Z] !MESSAGE no spawner in java.library.path: [/usr/java/packages/lib, /usr/lib64, /lib64, /lib, /usr/lib]
10:06:58 [2020-07-24T14:06:58.002Z] Tests run: 5, Failures: 0, Errors: 0, Skipped: 0, Time elapsed: 0.486 s - in org.eclipse.tracecompass.tmf.core.tests.symbols.MappingFileTest
10:06:58 [2020-07-24T14:06:58.002Z] testExtremeValues(org.eclipse.tracecompass.tmf.core.tests.symbols.MappingFileTest)  Time elapsed: 0.463 s
10:06:58 [2020-07-24T14:06:58.002Z] testValidTextFile(org.eclipse.tracecompass.tmf.core.tests.symbols.MappingFileTest)  Time elapsed: 0.011 s
10:06:58 [2020-07-24T14:06:58.002Z] testGettingSymbolMapFile(org.eclipse.tracecompass.tmf.core.tests.symbols.MappingFileTest)  Time elapsed: 0.003 s
10:06:58 [2020-07-24T14:06:58.002Z] testInvalidFiles(org.eclipse.tracecompass.tmf.core.tests.symbols.MappingFileTest)  Time elapsed: 0 s
10:06:58 [2020-07-24T14:06:58.002Z] testGettingSymbolWithSize(org.eclipse.tracecompass.tmf.core.tests.symbols.MappingFileTest)  Time elapsed: 0.009 s
10:06:58 [2020-07-24T14:06:58.002Z] Running org.eclipse.tracecompass.tmf.core.tests.symbols.FunctionNameMapperTest
10:06:58 [2020-07-24T14:06:58.002Z] Tests run: 3, Failures: 0, Errors: 0, Skipped: 0, Time elapsed: 0.005 s - in org.eclipse.tracecompass.tmf.core.tests.symbols.FunctionNameMapperTest
10:06:58 [2020-07-24T14:06:58.002Z] testMapFileWithSize(org.eclipse.tracecompass.tmf.core.tests.symbols.FunctionNameMapperTest)  Time elapsed: 0.002 s
10:06:58 [2020-07-24T14:06:58.002Z] testGuessingFileType(org.eclipse.tracecompass.tmf.core.tests.symbols.FunctionNameMapperTest)  Time elapsed: 0 s
10:06:58 [2020-07-24T14:06:58.002Z] testNmFile(org.eclipse.tracecompass.tmf.core.tests.symbols.FunctionNameMapperTest)  Time elapsed: 0.002 s
10:06:58 [2020-07-24T14:06:58.002Z] Running org.eclipse.tracecompass.tmf.core.tests.symbols.SymbolProviderManagerTest
10:06:58 [2020-07-24T14:06:58.002Z] Tests run: 1, Failures: 0, Errors: 0, Skipped: 0, Time elapsed: 0.003 s - in org.eclipse.tracecompass.tmf.core.tests.symbols.SymbolProviderManagerTest
10:06:58 [2020-07-24T14:06:58.002Z] testGetterForExperiment(org.eclipse.tracecompass.tmf.core.tests.symbols.SymbolProviderManagerTest)  Time elapsed: 0.003 s
10:06:58 [2020-07-24T14:06:58.002Z] Running org.eclipse.tracecompass.tmf.core.tests.util.PairTest
10:06:58 [2020-07-24T14:06:58.002Z] Tests run: 8, Failures: 0, Errors: 0, Skipped: 0, Time elapsed: 0.001 s - in org.eclipse.tracecompass.tmf.core.tests.util.PairTest
10:06:58 [2020-07-24T14:06:58.002Z] testAccessors(org.eclipse.tracecompass.tmf.core.tests.util.PairTest)  Time elapsed: 0 s
10:06:58 [2020-07-24T14:06:58.002Z] testToString(org.eclipse.tracecompass.tmf.core.tests.util.PairTest)  Time elapsed: 0 s
10:06:58 [2020-07-24T14:06:58.002Z] testEqualsNull(org.eclipse.tracecompass.tmf.core.tests.util.PairTest)  Time elapsed: 0 s
10:06:58 [2020-07-24T14:06:58.002Z] testEqualsDifferentObj(org.eclipse.tracecompass.tmf.core.tests.util.PairTest)  Time elapsed: 0.001 s
10:06:58 [2020-07-24T14:06:58.002Z] testEqualsSymmetry(org.eclipse.tracecompass.tmf.core.tests.util.PairTest)  Time elapsed: 0 s
10:06:58 [2020-07-24T14:06:58.002Z] testHashCode(org.eclipse.tracecompass.tmf.core.tests.util.PairTest)  Time elapsed: 0 s
10:06:58 [2020-07-24T14:06:58.002Z] testEqualsTransivity(org.eclipse.tracecompass.tmf.core.tests.util.PairTest)  Time elapsed: 0 s
10:06:58 [2020-07-24T14:06:58.002Z] testEqualsReflexivity(org.eclipse.tracecompass.tmf.core.tests.util.PairTest)  Time elapsed: 0 s
10:06:58 [2020-07-24T14:06:58.002Z] Running org.eclipse.tracecompass.tmf.core.tests.TmfCorePluginTest
10:06:58 [2020-07-24T14:06:58.002Z] Tests run: 2, Failures: 0, Errors: 0, Skipped: 0, Time elapsed: 0 s - in org.eclipse.tracecompass.tmf.core.tests.TmfCorePluginTest
10:06:58 [2020-07-24T14:06:58.002Z] testTmfCorePluginId(org.eclipse.tracecompass.tmf.core.tests.TmfCorePluginTest)  Time elapsed: 0 s
10:06:58 [2020-07-24T14:06:58.002Z] testGetDefault(org.eclipse.tracecompass.tmf.core.tests.TmfCorePluginTest)  Time elapsed: 0 s
10:06:58 [2020-07-24T14:06:58.002Z] 
10:06:58 [2020-07-24T14:06:58.002Z] Results:
10:06:58 [2020-07-24T14:06:58.002Z] 
10:06:58 [2020-07-24T14:06:58.002Z] Failures: 
10:06:58 [2020-07-24T14:06:58.002Z]   TextTraceTest.testBounds:289->testReadingBounds:299 readStart expected:<Jan[] 1 01:01:01> but was:<Jan[.] 1 01:01:01>
10:06:58 [2020-07-24T14:06:58.002Z]   TextTraceTest.testTraceParsing:201 getTimestamp expected:<Jan[] 1 01:01:01> but was:<Jan[.] 1 01:01:01>
10:06:58 [2020-07-24T14:06:58.002Z] Errors: 
10:06:58 [2020-07-24T14:06:58.002Z]   TmfTimestampFormatTest.testParseDateTime:279 » Parse Unparseable date: "Mon"
10:06:58 [2020-07-24T14:06:58.002Z]   TmfTimestampFormatTest.testParseDateTimeWithRef:415 » Parse Unparseable date: ...
10:06:58 [2020-07-24T14:06:58.002Z] 
10:06:58 [2020-07-24T14:06:58.002Z] Tests run: 836, Failures: 2, Errors: 2, Skipped: 1
10:06:58 [2020-07-24T14:06:58.002Z] 
10:06:58 [2020-07-24T14:06:58.002Z] 
10:06:58 [2020-07-24T14:06:58.002Z] !ENTRY org.eclipse.core.resources 2 10035 2020-07-24 14:06:56.475
10:06:58 [2020-07-24T14:06:58.002Z] !MESSAGE The workspace will exit with unsaved changes in this session.
10:06:58 [2020-07-24T14:06:58.002Z] [INFO] ------------------------------------------------------------------------
10:06:58 [2020-07-24T14:06:58.002Z] [INFO] Reactor Summary:
10:06:58 [2020-07-24T14:06:58.002Z] [INFO] 
10:06:58 [2020-07-24T14:06:58.002Z] [INFO] Trace Compass Parent 6.0.0-SNAPSHOT ................ SUCCESS [ 34.122 s]
10:06:58 [2020-07-24T14:06:58.002Z] [INFO] Trace Compass Tracetype-agnostic Analyses Parent 6.0.0-SNAPSHOT SUCCESS [  0.035 s]
10:06:58 [2020-07-24T14:06:58.002Z] [INFO] Trace Compass Common Utilities Parent 6.0.0-SNAPSHOT SUCCESS [  0.005 s]
10:06:58 [2020-07-24T14:06:58.002Z] [INFO] org.eclipse.tracecompass.common.core 4.3.0-SNAPSHOT  SUCCESS [ 17.664 s]
10:06:58 [2020-07-24T14:06:58.002Z] [INFO] Trace Compass State System Parent 6.0.0-SNAPSHOT ... SUCCESS [  0.006 s]
10:06:58 [2020-07-24T14:06:58.002Z] [INFO] org.eclipse.tracecompass.datastore.core 1.2.1-SNAPSHOT SUCCESS [  1.272 s]
10:06:58 [2020-07-24T14:06:58.002Z] [INFO] org.eclipse.tracecompass.segmentstore.core 3.0.0-SNAPSHOT SUCCESS [  0.817 s]
10:06:58 [2020-07-24T14:06:58.002Z] [INFO] org.eclipse.tracecompass.statesystem.core 5.0.0-SNAPSHOT SUCCESS [  1.317 s]
10:06:58 [2020-07-24T14:06:58.002Z] [INFO] Trace Compass TMF Parent 6.0.0-SNAPSHOT ............ SUCCESS [  0.007 s]
10:06:58 [2020-07-24T14:06:58.002Z] [INFO] Trace Compass Filter Parser 1.0.5-SNAPSHOT ......... SUCCESS [  8.250 s]
10:06:58 [2020-07-24T14:06:58.002Z] [INFO] org.eclipse.tracecompass.tmf.core 6.1.0-SNAPSHOT ... SUCCESS [  5.456 s]
10:06:58 [2020-07-24T14:06:58.002Z] [INFO] org.eclipse.tracecompass.analysis.counters.core 2.0.4-SNAPSHOT SUCCESS [  0.493 s]
10:06:58 [2020-07-24T14:06:58.002Z] [INFO] Trace Compass CTF Support Parent 6.0.0-SNAPSHOT .... SUCCESS [  0.005 s]
10:06:58 [2020-07-24T14:06:58.002Z] [INFO] Trace Compass CTF Parser Plug-in 1.0.5-SNAPSHOT .... SUCCESS [  5.754 s]
10:06:58 [2020-07-24T14:06:58.002Z] [INFO] org.eclipse.tracecompass.ctf.core 4.0.3-SNAPSHOT ... SUCCESS [  1.214 s]
10:06:58 [2020-07-24T14:06:58.002Z] [INFO] Trace Compass CTF Core Tests Plug-in 1.0.8-SNAPSHOT  SUCCESS [ 39.185 s]
10:06:58 [2020-07-24T14:06:58.002Z] [INFO] org.eclipse.tracecompass.statesystem.core.tests 1.0.12-SNAPSHOT SUCCESS [ 12.288 s]
10:06:58 [2020-07-24T14:06:58.002Z] [INFO] org.eclipse.tracecompass.tmf.core.tests 1.0.13-SNAPSHOT FAILURE [04:41 min]
10:06:58 [2020-07-24T14:06:58.002Z] [INFO] org.eclipse.tracecompass.tmf.ctf.core 4.2.1-SNAPSHOT SKIPPED
10:06:58 [2020-07-24T14:06:58.002Z] [INFO] org.eclipse.tracecompass.tmf.ctf.core.tests 1.0.11-SNAPSHOT SKIPPED
10:06:58 [2020-07-24T14:06:58.002Z] [INFO] org.eclipse.tracecompass.analysis.counters.core.tests 1.0.0-SNAPSHOT SKIPPED
10:06:58 [2020-07-24T14:06:58.002Z] [INFO] org.eclipse.tracecompass.tmf.ui 6.1.0-SNAPSHOT ..... SKIPPED
10:06:58 [2020-07-24T14:06:58.002Z] [INFO] org.eclipse.tracecompass.analysis.counters.ui 1.0.0-SNAPSHOT SKIPPED
10:06:58 [2020-07-24T14:06:58.002Z] [INFO] org.eclipse.tracecompass.tmf.ui.tests 1.0.14-SNAPSHOT SKIPPED
10:06:58 [2020-07-24T14:06:58.002Z] [INFO] org.eclipse.tracecompass.tmf.ui.swtbot.tests 1.0.13-SNAPSHOT SKIPPED
10:06:58 [2020-07-24T14:06:58.002Z] [INFO] org.eclipse.tracecompass.analysis.graph.core 2.1.6-SNAPSHOT SKIPPED
10:06:58 [2020-07-24T14:06:58.002Z] [INFO] org.eclipse.tracecompass.tmf.chart.core 1.0.3-SNAPSHOT SKIPPED
10:06:58 [2020-07-24T14:06:58.002Z] [INFO] org.eclipse.tracecompass.analysis.lami.core 1.1.2-SNAPSHOT SKIPPED
10:06:58 [2020-07-24T14:06:58.002Z] [INFO] org.eclipse.tracecompass.analysis.timing.core 5.2.0-SNAPSHOT SKIPPED
10:06:58 [2020-07-24T14:06:58.002Z] [INFO] org.eclipse.tracecompass.analysis.os.linux.core 5.0.0-SNAPSHOT SKIPPED
10:06:58 [2020-07-24T14:06:58.002Z] [INFO] Trace Compass LTTng Support Parent 6.0.0-SNAPSHOT .. SKIPPED
10:06:58 [2020-07-24T14:06:58.002Z] [INFO] org.eclipse.tracecompass.lttng2.common.core 1.1.2-SNAPSHOT SKIPPED
10:06:58 [2020-07-24T14:06:58.002Z] [INFO] org.eclipse.tracecompass.tmf.analysis.xml.core 4.0.0-SNAPSHOT SKIPPED
10:06:58 [2020-07-24T14:06:58.002Z] [INFO] org.eclipse.tracecompass.lttng2.kernel.core 3.0.4-SNAPSHOT SKIPPED
10:06:58 [2020-07-24T14:06:58.002Z] [INFO] org.eclipse.tracecompass.analysis.counters.ui.swtbot.tests 1.0.0-SNAPSHOT SKIPPED
10:06:58 [2020-07-24T14:06:58.002Z] [INFO] org.eclipse.tracecompass.analysis.graph.core.tests 1.0.5-SNAPSHOT SKIPPED
10:06:58 [2020-07-24T14:06:58.002Z] [INFO] org.eclipse.tracecompass.analysis.graph.ui 1.0.10-SNAPSHOT SKIPPED
10:06:58 [2020-07-24T14:06:58.002Z] [INFO] org.eclipse.tracecompass.analysis.lami.core.tests 1.0.3-SNAPSHOT SKIPPED
10:06:58 [2020-07-24T14:06:58.002Z] [INFO] org.eclipse.tracecompass.tmf.chart.ui 1.0.10-SNAPSHOT SKIPPED
10:06:58 [2020-07-24T14:06:58.002Z] [INFO] org.eclipse.tracecompass.analysis.lami.ui 1.1.3-SNAPSHOT SKIPPED
10:06:58 [2020-07-24T14:06:58.002Z] [INFO] org.eclipse.tracecompass.tmf.chart.core.tests 1.0.2-SNAPSHOT SKIPPED
10:06:58 [2020-07-24T14:06:58.002Z] [INFO] org.eclipse.tracecompass.tmf.chart.ui.swtbot.tests 1.0.5-SNAPSHOT SKIPPED
10:06:58 [2020-07-24T14:06:58.002Z] [INFO] org.eclipse.tracecompass.analysis.lami.ui.swtbot.tests 1.0.5-SNAPSHOT SKIPPED
10:06:58 [2020-07-24T14:06:58.002Z] [INFO] org.eclipse.tracecompass.analysis.os.linux.core.tests 1.0.13-SNAPSHOT SKIPPED
10:06:58 [2020-07-24T14:06:58.002Z] [INFO] org.eclipse.tracecompass.analysis.timing.ui 4.2.0-SNAPSHOT SKIPPED
10:06:58 [2020-07-24T14:06:58.002Z] [INFO] org.eclipse.tracecompass.analysis.os.linux.ui 4.0.0-SNAPSHOT SKIPPED
10:06:58 [2020-07-24T14:06:58.002Z] [INFO] org.eclipse.tracecompass.analysis.os.linux.ui.tests 1.0.8-SNAPSHOT SKIPPED
10:06:58 [2020-07-24T14:06:58.002Z] [INFO] org.eclipse.tracecompass.analysis.timing.core.tests 1.0.5-SNAPSHOT SKIPPED
10:06:58 [2020-07-24T14:06:58.002Z] [INFO] org.eclipse.tracecompass.analysis.timing.ui.swtbot.tests 1.0.9-SNAPSHOT SKIPPED
10:06:58 [2020-07-24T14:06:58.002Z] [INFO] org.eclipse.tracecompass.analysis.os.linux.ui.swtbot.tests 1.0.14-SNAPSHOT SKIPPED
10:06:58 [2020-07-24T14:06:58.002Z] [INFO] org.eclipse.tracecompass.analysis.profiling.core 2.0.0-SNAPSHOT SKIPPED
10:06:58 [2020-07-24T14:06:58.002Z] [INFO] org.eclipse.tracecompass.analysis.profiling.core.tests 1.0.4-SNAPSHOT SKIPPED
10:06:58 [2020-07-24T14:06:58.002Z] [INFO] org.eclipse.tracecompass.analysis.profiling.ui 2.1.0-SNAPSHOT SKIPPED
10:06:58 [2020-07-24T14:06:58.003Z] [INFO] org.eclipse.tracecompass.analysis.profiling.ui.swtbot.tests 1.0.4-SNAPSHOT SKIPPED
10:06:58 [2020-07-24T14:06:58.003Z] [INFO] Trace Compass BTF Support Parent 6.0.0-SNAPSHOT .... SKIPPED
10:06:58 [2020-07-24T14:06:58.003Z] [INFO] org.eclipse.tracecompass.btf.core 2.2.2-SNAPSHOT ... SKIPPED
10:06:58 [2020-07-24T14:06:58.003Z] [INFO] Trace Compass Documentation 6.0.0-SNAPSHOT ......... SKIPPED
10:06:58 [2020-07-24T14:06:58.003Z] [INFO] Trace Compass Developer Guide 6.0.0-SNAPSHOT ....... SKIPPED
10:06:58 [2020-07-24T14:06:58.003Z] [INFO] org.eclipse.tracecompass.tmf.analysis.xml.ui 2.1.12-SNAPSHOT SKIPPED
10:06:58 [2020-07-24T14:06:58.003Z] [INFO] org.eclipse.tracecompass.tmf 6.0.0-SNAPSHOT ........ SKIPPED
10:06:58 [2020-07-24T14:06:58.003Z] [INFO] org.eclipse.tracecompass.btf.ui 1.0.3-SNAPSHOT ..... SKIPPED
10:06:58 [2020-07-24T14:06:58.003Z] [INFO] org.eclipse.tracecompass.btf 6.0.0-SNAPSHOT ........ SKIPPED
10:06:58 [2020-07-24T14:06:58.003Z] [INFO] org.eclipse.tracecompass.btf.core.tests 1.0.2-SNAPSHOT SKIPPED
10:06:58 [2020-07-24T14:06:58.003Z] [INFO] org.eclipse.tracecompass.common.core.tests 1.1.8-SNAPSHOT SKIPPED
10:06:58 [2020-07-24T14:06:58.003Z] [INFO] org.eclipse.tracecompass.ctf 6.0.0-SNAPSHOT ........ SKIPPED
10:06:58 [2020-07-24T14:06:58.003Z] [INFO] org.eclipse.tracecompass.ctf.parser.tests 1.0.2-SNAPSHOT SKIPPED
10:06:58 [2020-07-24T14:06:58.003Z] [INFO] org.eclipse.tracecompass.tmf.ctf 6.0.0-SNAPSHOT .... SKIPPED
10:06:58 [2020-07-24T14:06:58.003Z] [INFO] org.eclipse.tracecompass.tmf.ctf.ui.swtbot.tests 1.0.10-SNAPSHOT SKIPPED
10:06:58 [2020-07-24T14:06:58.003Z] [INFO] Trace Compass User Guide 6.0.0-SNAPSHOT ............ SKIPPED
10:06:58 [2020-07-24T14:06:58.003Z] [INFO] Trace Compass GDB Tracepoint Analysis User Guide 6.0.0-SNAPSHOT SKIPPED
10:06:58 [2020-07-24T14:06:58.003Z] [INFO] Trace Compass RCP User Guide 6.0.0-SNAPSHOT ........ SKIPPED
10:06:58 [2020-07-24T14:06:58.003Z] [INFO] Trace Compass Pcap User Guide 6.0.0-SNAPSHOT ....... SKIPPED
10:06:58 [2020-07-24T14:06:58.003Z] [INFO] org.eclipse.tracecompass.examples 1.0.6-SNAPSHOT ... SKIPPED
10:06:58 [2020-07-24T14:06:58.003Z] [INFO] Trace Compass GDB Tracepoint Analysis Parent 6.0.0-SNAPSHOT SKIPPED
10:06:58 [2020-07-24T14:06:58.003Z] [INFO] org.eclipse.tracecompass.gdbtrace.core 1.0.6-SNAPSHOT SKIPPED
10:06:58 [2020-07-24T14:06:58.003Z] [INFO] org.eclipse.tracecompass.gdbtrace.ui 1.1.3-SNAPSHOT  SKIPPED
10:06:58 [2020-07-24T14:06:58.003Z] [INFO] org.eclipse.tracecompass.gdbtrace 6.0.0-SNAPSHOT ... SKIPPED
10:06:58 [2020-07-24T14:06:58.003Z] [INFO] org.eclipse.tracecompass.gdbtrace.core.tests 1.0.1-SNAPSHOT SKIPPED
10:06:58 [2020-07-24T14:06:58.003Z] [INFO] org.eclipse.tracecompass.gdbtrace.ui.tests 1.0.1-SNAPSHOT SKIPPED
10:06:58 [2020-07-24T14:06:58.003Z] [INFO] org.eclipse.tracecompass.lttng2.common.core.tests 1.0.1-SNAPSHOT SKIPPED
10:06:58 [2020-07-24T14:06:58.003Z] [INFO] org.eclipse.tracecompass.lttng2.control.core 1.2.4-SNAPSHOT SKIPPED
10:06:58 [2020-07-24T14:06:58.003Z] [INFO] org.eclipse.tracecompass.tmf.remote.core 2.0.4-SNAPSHOT SKIPPED
10:06:58 [2020-07-24T14:06:58.003Z] [INFO] org.eclipse.tracecompass.tmf.remote.ui 1.0.8-SNAPSHOT SKIPPED
10:06:58 [2020-07-24T14:06:58.003Z] [INFO] org.eclipse.tracecompass.lttng2.control.ui 1.2.11-SNAPSHOT SKIPPED
10:06:58 [2020-07-24T14:06:58.003Z] [INFO] org.eclipse.tracecompass.lttng2.control 6.0.0-SNAPSHOT SKIPPED
10:06:58 [2020-07-24T14:06:58.003Z] [INFO] org.eclipse.tracecompass.lttng2.control.core.tests 1.1.2-SNAPSHOT SKIPPED
10:06:58 [2020-07-24T14:06:58.003Z] [INFO] org.eclipse.tracecompass.tmf.remote.core.tests 1.0.1-SNAPSHOT SKIPPED
10:06:58 [2020-07-24T14:06:58.003Z] [INFO] org.eclipse.tracecompass.lttng2.control.ui.tests 2.0.4-SNAPSHOT SKIPPED
10:06:58 [2020-07-24T14:06:58.003Z] [INFO] org.eclipse.tracecompass.lttng2.control.ui.swtbot.tests 1.0.7-SNAPSHOT SKIPPED
10:06:58 [2020-07-24T14:06:58.003Z] [INFO] org.eclipse.tracecompass.lttng2.kernel.ui 2.0.1-SNAPSHOT SKIPPED
10:06:58 [2020-07-24T14:06:58.003Z] [INFO] org.eclipse.tracecompass.lttng2.kernel 6.0.0-SNAPSHOT SKIPPED
10:06:58 [2020-07-24T14:06:58.003Z] [INFO] org.eclipse.tracecompass.tmf.analysis.xml.core.tests 1.0.12-SNAPSHOT SKIPPED
10:06:58 [2020-07-24T14:06:58.003Z] [INFO] org.eclipse.tracecompass.lttng2.kernel.core.tests 2.0.1-SNAPSHOT SKIPPED
10:06:58 [2020-07-24T14:06:58.003Z] [INFO] org.eclipse.tracecompass.lttng2.kernel.ui.swtbot.tests 1.0.14-SNAPSHOT SKIPPED
10:06:58 [2020-07-24T14:06:58.003Z] [INFO] org.eclipse.tracecompass.lttng2.ust.core 5.0.0-SNAPSHOT SKIPPED
10:06:58 [2020-07-24T14:06:58.003Z] [INFO] org.eclipse.tracecompass.lttng2.ust.ui 3.0.8-SNAPSHOT SKIPPED
10:06:58 [2020-07-24T14:06:58.003Z] [INFO] org.eclipse.tracecompass.lttng2.ust 6.0.0-SNAPSHOT . SKIPPED
10:06:58 [2020-07-24T14:06:58.003Z] [INFO] org.eclipse.tracecompass.lttng2.ust.core.tests 1.0.11-SNAPSHOT SKIPPED
10:06:58 [2020-07-24T14:06:58.003Z] [INFO] org.eclipse.tracecompass.lttng2.ust.ui.tests 1.0.1-SNAPSHOT SKIPPED
10:06:58 [2020-07-24T14:06:58.003Z] [INFO] org.eclipse.tracecompass.lttng2.ust.ui.swtbot.tests 1.0.13-SNAPSHOT SKIPPED
10:06:58 [2020-07-24T14:06:58.003Z] [INFO] Trace Compass Pcap Format Support Parent 6.0.0-SNAPSHOT SKIPPED
10:06:58 [2020-07-24T14:06:58.003Z] [INFO] org.eclipse.tracecompass.pcap.core 1.1.2-SNAPSHOT .. SKIPPED
10:06:58 [2020-07-24T14:06:58.003Z] [INFO] Trace Compass Pcap Parser Core Tests Plug-in 1.0.4-SNAPSHOT SKIPPED
10:06:58 [2020-07-24T14:06:58.003Z] [INFO] org.eclipse.tracecompass.tmf.pcap.core 1.0.4-SNAPSHOT SKIPPED
10:06:58 [2020-07-24T14:06:58.003Z] [INFO] org.eclipse.tracecompass.tmf.pcap.ui 1.1.3-SNAPSHOT  SKIPPED
10:06:58 [2020-07-24T14:06:58.003Z] [INFO] org.eclipse.tracecompass.tmf.pcap 6.0.0-SNAPSHOT ... SKIPPED
10:06:58 [2020-07-24T14:06:58.003Z] [INFO] org.eclipse.tracecompass.tmf.pcap.core.tests 1.0.2-SNAPSHOT SKIPPED
10:06:58 [2020-07-24T14:06:58.003Z] [INFO] org.eclipse.tracecompass.tmf.pcap.ui.swtbot.tests 1.0.1-SNAPSHOT SKIPPED
10:06:58 [2020-07-24T14:06:58.003Z] [INFO] Trace Compass RCP Parent 6.0.0-SNAPSHOT ............ SKIPPED
10:06:58 [2020-07-24T14:06:58.003Z] [INFO] Trace Compass RCP Branding plug-in 6.0.0-SNAPSHOT .. SKIPPED
10:06:58 [2020-07-24T14:06:58.003Z] [INFO] Trace Compass RCP Branding Feature 6.0.0-SNAPSHOT .. SKIPPED
10:06:58 [2020-07-24T14:06:58.003Z] [INFO] org.eclipse.tracecompass.tmf.cli.core 1.0.1-SNAPSHOT SKIPPED
10:06:58 [2020-07-24T14:06:58.003Z] [INFO] org.eclipse.tracecompass.rcp.ui 6.0.0-SNAPSHOT ..... SKIPPED
10:06:58 [2020-07-24T14:06:58.003Z] [INFO] Trace Compass RCP Feature 6.0.0-SNAPSHOT ........... SKIPPED
10:06:58 [2020-07-24T14:06:58.003Z] [INFO] org.eclipse.tracecompass.tmf.cli.core.tests 1.0.1-SNAPSHOT SKIPPED
10:06:58 [2020-07-24T14:06:58.003Z] [INFO] org.eclipse.tracecompass.rcp.ui.tests 2.0.3-SNAPSHOT SKIPPED
10:06:58 [2020-07-24T14:06:58.003Z] [INFO] org.eclipse.tracecompass.rcp.incubator.ui 1.0.1-SNAPSHOT SKIPPED
10:06:58 [2020-07-24T14:06:58.003Z] [INFO] org.eclipse.tracecompass.rcp.incubator 6.0.0-SNAPSHOT SKIPPED
10:06:58 [2020-07-24T14:06:58.003Z] [INFO] Trace Compass Json trace Parent 6.0.0-SNAPSHOT ..... SKIPPED
10:06:58 [2020-07-24T14:06:58.003Z] [INFO] org.eclipse.tracecompass.jsontrace.core 1.0.0-SNAPSHOT SKIPPED
10:06:58 [2020-07-24T14:06:58.003Z] [INFO] org.eclipse.tracecompass.jsontrace 6.0.0-SNAPSHOT .. SKIPPED
10:06:58 [2020-07-24T14:06:58.003Z] [INFO] org.eclipse.tracecompass.tmf.cli 6.0.0-SNAPSHOT .... SKIPPED
10:06:58 [2020-07-24T14:06:58.003Z] [INFO] Trace Compass RCP Product 6.0.0-SNAPSHOT ........... SKIPPED
10:06:58 [2020-07-24T14:06:58.003Z] [INFO] Trace Compass Release Engineering Parent 6.0.0-SNAPSHOT SKIPPED
10:06:58 [2020-07-24T14:06:58.003Z] [INFO] Trace Compass Target Platform 6.0.0-SNAPSHOT ....... SKIPPED
10:06:58 [2020-07-24T14:06:58.003Z] [INFO] org.eclipse.tracecompass.integration.swtbot.tests 1.0.11-SNAPSHOT SKIPPED
10:06:58 [2020-07-24T14:06:58.003Z] [INFO] org.eclipse.tracecompass.datastore.core.tests 1.0.5-SNAPSHOT SKIPPED
10:06:58 [2020-07-24T14:06:58.003Z] [INFO] org.eclipse.tracecompass.segmentstore.core.tests 1.0.4-SNAPSHOT SKIPPED
10:06:58 [2020-07-24T14:06:58.003Z] [INFO] org.eclipse.tracecompass.tmf.analysis.xml.ui.swtbot.tests 1.0.11-SNAPSHOT SKIPPED
10:06:58 [2020-07-24T14:06:58.003Z] [INFO] org.eclipse.tracecompass.tmf.analysis.xml.ui.tests 1.0.3-SNAPSHOT SKIPPED
10:06:58 [2020-07-24T14:06:58.003Z] [INFO] org.eclipse.tracecompass.tmf.chart.ui.tests 1.0.1-SNAPSHOT SKIPPED
10:06:58 [2020-07-24T14:06:58.003Z] [INFO] org.eclipse.tracecompass.tmf.remote.ui.swtbot.tests 1.0.8-SNAPSHOT SKIPPED
10:06:58 [2020-07-24T14:06:58.003Z] [INFO] org.eclipse.tracecompass.tmf.remote.ui.tests 1.0.1-SNAPSHOT SKIPPED
10:06:58 [2020-07-24T14:06:58.003Z] [INFO] Trace Compass All Tests 1.0.9-SNAPSHOT ............. SKIPPED
10:06:58 [2020-07-24T14:06:58.003Z] [INFO] org.eclipse.tracecompass.testing 6.0.0-SNAPSHOT .... SKIPPED
10:06:58 [2020-07-24T14:06:58.003Z] [INFO] org.eclipse.tracecompass.tmf.remote 6.0.0-SNAPSHOT . SKIPPED
10:06:58 [2020-07-24T14:06:58.003Z] [INFO] Trace Compass Repository 6.0.0-SNAPSHOT ............ SKIPPED
10:06:58 [2020-07-24T14:06:58.003Z] [INFO] org.eclipse.tracecompass.jsontrace.core.tests 1.0.2-SNAPSHOT SKIPPED
10:06:58 [2020-07-24T14:06:58.003Z] [INFO] ------------------------------------------------------------------------
10:06:58 [2020-07-24T14:06:58.003Z] [INFO] BUILD FAILURE
10:06:58 [2020-07-24T14:06:58.003Z] [INFO] ------------------------------------------------------------------------
10:06:58 [2020-07-24T14:06:58.003Z] [INFO] Total time:  12:42 min
10:06:58 [2020-07-24T14:06:58.003Z] [INFO] Finished at: 2020-07-24T14:06:56Z
10:06:58 [2020-07-24T14:06:58.003Z] [INFO] ------------------------------------------------------------------------
10:06:58 [2020-07-24T14:06:58.003Z] [ERROR] Failed to execute goal org.eclipse.tycho:tycho-surefire-plugin:1.3.0:test (default-test) on project org.eclipse.tracecompass.tmf.core.tests: There are test failures.
10:06:58 [2020-07-24T14:06:58.003Z] [ERROR] 
10:06:58 [2020-07-24T14:06:58.003Z] [ERROR] Please refer to /home/jenkins/agent/workspace/tracecompass-master-jdk11/tmf/org.eclipse.tracecompass.tmf.core.tests/target/surefire-reports for the individual test results.
10:06:58 [2020-07-24T14:06:58.003Z] [ERROR] -> [Help 1]
10:06:58 [2020-07-24T14:06:58.003Z] [ERROR] 
10:06:58 [2020-07-24T14:06:58.003Z] [ERROR] To see the full stack trace of the errors, re-run Maven with the -e switch.
10:06:58 [2020-07-24T14:06:58.003Z] [ERROR] Re-run Maven using the -X switch to enable full debug logging.
10:06:58 [2020-07-24T14:06:58.003Z] [ERROR] 
10:06:58 [2020-07-24T14:06:58.003Z] [ERROR] For more information about the errors and possible solutions, please read the following articles:
10:06:58 [2020-07-24T14:06:58.003Z] [ERROR] [Help 1] http://cwiki.apache.org/confluence/display/MAVEN/MojoFailureException
10:06:58 [2020-07-24T14:06:58.003Z] [ERROR] 
10:06:58 [2020-07-24T14:06:58.003Z] [ERROR] After correcting the problems, you can resume the build with the command
10:06:58 [2020-07-24T14:06:58.003Z] [ERROR]   mvn <args> -rf :org.eclipse.tracecompass.tmf.core.tests