SuccessConsole Output

Skipping 13,421 KB.. Full Log
021-06-11T14:59:33.013Z] DEBUG - matched Table with text "", using matcher: (of type 'Table')
10:59:33 [2021-06-11T14:59:33.013Z] DEBUG - Attempting to set focus on (of type 'Table')
10:59:33 [2021-06-11T14:59:33.013Z] DEBUG - Attempting to set focus on (of type 'Table')
10:59:33 [2021-06-11T14:59:33.013Z] DEBUG - Selecting rows [0] in (of type 'Table')
10:59:33 [2021-06-11T14:59:33.013Z] DEBUG - Sent event MouseEnter [6]: MouseEvent{Table {} time=-74065055 data=null button=0 stateMask=0x0 x=0 y=0 count=0} to (of type 'Table')
10:59:33 [2021-06-11T14:59:33.013Z] DEBUG - Sent event MouseMove [5]: MouseEvent{Table {} time=-74065055 data=null button=0 stateMask=0x0 x=0 y=0 count=0} to (of type 'Table')
10:59:33 [2021-06-11T14:59:33.013Z] DEBUG - Sent event Activate [26]: ShellEvent{Table {} time=-74065055 data=null doit=true} to (of type 'Table')
10:59:33 [2021-06-11T14:59:33.013Z] DEBUG - Sent event FocusIn [15]: FocusEvent{Table {} time=-74065055 data=null} to (of type 'Table')
10:59:33 [2021-06-11T14:59:33.013Z] DEBUG - Sent event MouseDown [3]: MouseEvent{TableItem {test_invalid} time=-74065054 data=null button=1 stateMask=0x0 x=66 y=12 count=1} to (of type 'Table')
10:59:33 [2021-06-11T14:59:33.013Z] 
10:59:33 [2021-06-11T14:59:33.013Z] !ENTRY org.eclipse.tracecompass.tmf.analysis.xml.core 4 0 2021-06-11 14:59:32.840
10:59:33 [2021-06-11T14:59:33.013Z] !MESSAGE XML Parsing error at line 6: cvc-complex-type.2.4.a: Invalid content was found starting with element 'element'. One of '{timeGraphView, xyView, stateProvider, pattern, extra}' is expected.
10:59:33 [2021-06-11T14:59:33.013Z] DEBUG - Sent event Selection [13]: SelectionEvent{Table {} time=-74065054 data=null item=TableItem {test_invalid} detail=0 x=0 y=0 width=0 height=0 stateMask=0x80000 text=null doit=true} to (of type 'Table')
10:59:33 [2021-06-11T14:59:33.013Z] DEBUG - Sent event MouseUp [4]: MouseEvent{TableItem {test_invalid} time=-74065039 data=null button=1 stateMask=0x80000 x=66 y=12 count=1} to (of type 'Table')
10:59:33 [2021-06-11T14:59:33.013Z] DEBUG - matched Button with text "Import", using matcher: of type 'Button'
10:59:33 [2021-06-11T14:59:33.013Z] DEBUG - matched Button with text "Export", using matcher: of type 'Button'
10:59:33 [2021-06-11T14:59:33.013Z] DEBUG - matched Button with text "Edit...", using matcher: of type 'Button'
10:59:33 [2021-06-11T14:59:33.013Z] DEBUG - matched Button with text "Delete", using matcher: of type 'Button'
10:59:33 [2021-06-11T14:59:33.013Z] DEBUG - matched Button with text "Delete", using matcher: with mnemonic 'Delete'
10:59:33 [2021-06-11T14:59:33.013Z] DEBUG - matched Button with text "Delete", using matcher: with style 'SWT.PUSH'
10:59:33 [2021-06-11T14:59:33.013Z] DEBUG - matched Button with text "Delete", using matcher: (of type 'Button' and with mnemonic 'Delete' and with style 'SWT.PUSH')
10:59:33 [2021-06-11T14:59:33.013Z] DEBUG - matched Button with text "Check selected", using matcher: of type 'Button'
10:59:33 [2021-06-11T14:59:33.013Z] DEBUG - matched Button with text "Check all", using matcher: of type 'Button'
10:59:33 [2021-06-11T14:59:33.013Z] DEBUG - matched Button with text "Uncheck selected", using matcher: of type 'Button'
10:59:33 [2021-06-11T14:59:33.013Z] DEBUG - matched Button with text "Uncheck all", using matcher: of type 'Button'
10:59:33 [2021-06-11T14:59:33.013Z] DEBUG - matched Button with text "Restore &Defaults", using matcher: of type 'Button'
10:59:33 [2021-06-11T14:59:33.013Z] DEBUG - matched Button with text "&Apply", using matcher: of type 'Button'
10:59:33 [2021-06-11T14:59:33.013Z] DEBUG - matched Button with text "Cancel", using matcher: of type 'Button'
10:59:33 [2021-06-11T14:59:33.013Z] DEBUG - matched Button with text "Apply and Close", using matcher: of type 'Button'
10:59:33 [2021-06-11T14:59:33.013Z] DEBUG - Clicking on Delete
10:59:33 [2021-06-11T14:59:33.014Z] DEBUG - Sent event MouseEnter [6]: MouseEvent{Button {Delete} time=-74065035 data=null button=0 stateMask=0x0 x=0 y=0 count=0} to (of type 'Button' and with mnemonic 'Delete' and with style 'SWT.PUSH')
10:59:33 [2021-06-11T14:59:33.014Z] DEBUG - Sent event MouseMove [5]: MouseEvent{Button {Delete} time=-74065035 data=null button=0 stateMask=0x0 x=0 y=0 count=0} to (of type 'Button' and with mnemonic 'Delete' and with style 'SWT.PUSH')
10:59:33 [2021-06-11T14:59:33.014Z] DEBUG - Sent event Activate [26]: ShellEvent{Button {Delete} time=-74065035 data=null doit=true} to (of type 'Button' and with mnemonic 'Delete' and with style 'SWT.PUSH')
10:59:33 [2021-06-11T14:59:33.014Z] DEBUG - Sent event FocusIn [15]: FocusEvent{Button {Delete} time=-74065035 data=null} to (of type 'Button' and with mnemonic 'Delete' and with style 'SWT.PUSH')
10:59:33 [2021-06-11T14:59:33.014Z] DEBUG - Sent event MouseDown [3]: MouseEvent{Button {Delete} time=-74065035 data=null button=0 stateMask=0x0 x=0 y=0 count=0} to (of type 'Button' and with mnemonic 'Delete' and with style 'SWT.PUSH')
10:59:33 [2021-06-11T14:59:33.014Z] DEBUG - Sent event MouseUp [4]: MouseEvent{Button {Delete} time=-74065034 data=null button=0 stateMask=0x0 x=0 y=0 count=0} to (of type 'Button' and with mnemonic 'Delete' and with style 'SWT.PUSH')
10:59:33 [2021-06-11T14:59:33.014Z] DEBUG - Sent event MouseHover [32]: MouseEvent{Button {Delete} time=-74064947 data=null button=0 stateMask=0x0 x=0 y=0 count=0} to (of type 'Button' and with mnemonic 'Delete' and with style 'SWT.PUSH')
10:59:33 [2021-06-11T14:59:33.014Z] DEBUG - Sent event MouseMove [5]: MouseEvent{Button {Delete} time=-74064946 data=null button=0 stateMask=0x0 x=0 y=0 count=0} to (of type 'Button' and with mnemonic 'Delete' and with style 'SWT.PUSH')
10:59:33 [2021-06-11T14:59:33.014Z] DEBUG - Sent event MouseExit [7]: MouseEvent{Button {Delete} time=-74064946 data=null button=0 stateMask=0x0 x=0 y=0 count=0} to (of type 'Button' and with mnemonic 'Delete' and with style 'SWT.PUSH')
10:59:33 [2021-06-11T14:59:33.014Z] DEBUG - Sent event Deactivate [27]: ShellEvent{Button {Delete} time=-74064946 data=null doit=true} to (of type 'Button' and with mnemonic 'Delete' and with style 'SWT.PUSH')
10:59:33 [2021-06-11T14:59:33.014Z] DEBUG - Sent event FocusOut [16]: FocusEvent{Button {Delete} time=-74064946 data=null} to (of type 'Button' and with mnemonic 'Delete' and with style 'SWT.PUSH')
10:59:33 [2021-06-11T14:59:33.014Z] DEBUG - Clicked on Delete
10:59:33 [2021-06-11T14:59:33.014Z] DEBUG - matched Shell with text "Delete XML file(s)", using matcher: with text 'Delete XML file(s)'
10:59:33 [2021-06-11T14:59:33.014Z] DEBUG - Sent event Activate [26]: ShellEvent{Shell {Delete XML file(s)} time=-74064945 data=null doit=true} to Shell with text {Delete XML file(s)}
10:59:33 [2021-06-11T14:59:33.014Z] DEBUG - matched Button with text "&No", using matcher: of type 'Button'
10:59:33 [2021-06-11T14:59:33.014Z] DEBUG - matched Button with text "&Yes", using matcher: of type 'Button'
10:59:33 [2021-06-11T14:59:33.014Z] DEBUG - matched Button with text "&Yes", using matcher: with mnemonic 'Yes'
10:59:33 [2021-06-11T14:59:33.014Z] DEBUG - matched Button with text "&Yes", using matcher: with style 'SWT.PUSH'
10:59:33 [2021-06-11T14:59:33.014Z] DEBUG - matched Button with text "&Yes", using matcher: (of type 'Button' and with mnemonic 'Yes' and with style 'SWT.PUSH')
10:59:33 [2021-06-11T14:59:33.014Z] DEBUG - Clicking on &Yes
10:59:33 [2021-06-11T14:59:33.014Z] DEBUG - Sent event MouseEnter [6]: MouseEvent{Button {&Yes} time=-74064945 data=null button=0 stateMask=0x0 x=0 y=0 count=0} to (of type 'Button' and with mnemonic 'Yes' and with style 'SWT.PUSH')
10:59:33 [2021-06-11T14:59:33.014Z] DEBUG - Sent event MouseMove [5]: MouseEvent{Button {&Yes} time=-74064945 data=null button=0 stateMask=0x0 x=0 y=0 count=0} to (of type 'Button' and with mnemonic 'Yes' and with style 'SWT.PUSH')
10:59:33 [2021-06-11T14:59:33.014Z] DEBUG - Sent event Activate [26]: ShellEvent{Button {&Yes} time=-74064945 data=null doit=true} to (of type 'Button' and with mnemonic 'Yes' and with style 'SWT.PUSH')
10:59:33 [2021-06-11T14:59:33.014Z] DEBUG - Sent event FocusIn [15]: FocusEvent{Button {&Yes} time=-74064945 data=null} to (of type 'Button' and with mnemonic 'Yes' and with style 'SWT.PUSH')
10:59:33 [2021-06-11T14:59:33.014Z] DEBUG - Sent event MouseDown [3]: MouseEvent{Button {&Yes} time=-74064944 data=null button=0 stateMask=0x0 x=0 y=0 count=0} to (of type 'Button' and with mnemonic 'Yes' and with style 'SWT.PUSH')
10:59:33 [2021-06-11T14:59:33.014Z] DEBUG - Sent event MouseUp [4]: MouseEvent{Button {&Yes} time=-74064944 data=null button=0 stateMask=0x0 x=0 y=0 count=0} to (of type 'Button' and with mnemonic 'Yes' and with style 'SWT.PUSH')
10:59:33 [2021-06-11T14:59:33.014Z] DEBUG - Sent event Selection [13]: SelectionEvent{Button {&Yes} time=-74064944 data=null item=null detail=0 x=0 y=0 width=0 height=0 stateMask=0x0 text=null doit=true} to (of type 'Button' and with mnemonic 'Yes' and with style 'SWT.PUSH')
10:59:33 [2021-06-11T14:59:33.014Z] DEBUG - Sent event Selection [13]: SelectionEvent{Button {Delete} time=-74065034 data=null item=null detail=0 x=0 y=0 width=0 height=0 stateMask=0x0 text=null doit=true} to (of type 'Button' and with mnemonic 'Delete' and with style 'SWT.PUSH')
10:59:33 [2021-06-11T14:59:33.014Z] DEBUG - Clicked on 
10:59:33 [2021-06-11T14:59:33.014Z] DEBUG - matched Button with text "Import", using matcher: of type 'Button'
10:59:33 [2021-06-11T14:59:33.014Z] DEBUG - matched Button with text "Export", using matcher: of type 'Button'
10:59:33 [2021-06-11T14:59:33.014Z] DEBUG - matched Button with text "Edit...", using matcher: of type 'Button'
10:59:33 [2021-06-11T14:59:33.014Z] DEBUG - matched Button with text "Delete", using matcher: of type 'Button'
10:59:33 [2021-06-11T14:59:33.014Z] DEBUG - matched Button with text "Check selected", using matcher: of type 'Button'
10:59:33 [2021-06-11T14:59:33.014Z] DEBUG - matched Button with text "Check all", using matcher: of type 'Button'
10:59:33 [2021-06-11T14:59:33.014Z] DEBUG - matched Button with text "Uncheck selected", using matcher: of type 'Button'
10:59:33 [2021-06-11T14:59:33.014Z] DEBUG - matched Button with text "Uncheck all", using matcher: of type 'Button'
10:59:33 [2021-06-11T14:59:33.014Z] DEBUG - matched Button with text "Restore &Defaults", using matcher: of type 'Button'
10:59:33 [2021-06-11T14:59:33.014Z] DEBUG - matched Button with text "&Apply", using matcher: of type 'Button'
10:59:33 [2021-06-11T14:59:33.014Z] DEBUG - matched Button with text "Cancel", using matcher: of type 'Button'
10:59:33 [2021-06-11T14:59:33.014Z] DEBUG - matched Button with text "Apply and Close", using matcher: of type 'Button'
10:59:33 [2021-06-11T14:59:33.014Z] DEBUG - matched Button with text "Apply and Close", using matcher: with mnemonic 'Apply and Close'
10:59:33 [2021-06-11T14:59:33.014Z] DEBUG - matched Button with text "Apply and Close", using matcher: (with mnemonic 'Apply and Close' or with mnemonic 'OK')
10:59:33 [2021-06-11T14:59:33.014Z] DEBUG - matched Button with text "Apply and Close", using matcher: with style 'SWT.PUSH'
10:59:33 [2021-06-11T14:59:33.014Z] DEBUG - matched Button with text "Apply and Close", using matcher: (of type 'Button' and (with mnemonic 'Apply and Close' or with mnemonic 'OK') and with style 'SWT.PUSH')
10:59:33 [2021-06-11T14:59:33.014Z] DEBUG - Clicking on Apply and Close
10:59:33 [2021-06-11T14:59:33.014Z] DEBUG - Sent event MouseEnter [6]: MouseEvent{Button {Apply and Close} time=-74064914 data=null button=0 stateMask=0x0 x=0 y=0 count=0} to (of type 'Button' and (with mnemonic 'Apply and Close' or with mnemonic 'OK') and with style 'SWT.PUSH')
10:59:33 [2021-06-11T14:59:33.014Z] DEBUG - Sent event MouseMove [5]: MouseEvent{Button {Apply and Close} time=-74064914 data=null button=0 stateMask=0x0 x=0 y=0 count=0} to (of type 'Button' and (with mnemonic 'Apply and Close' or with mnemonic 'OK') and with style 'SWT.PUSH')
10:59:33 [2021-06-11T14:59:33.014Z] DEBUG - Sent event Activate [26]: ShellEvent{Button {Apply and Close} time=-74064914 data=null doit=true} to (of type 'Button' and (with mnemonic 'Apply and Close' or with mnemonic 'OK') and with style 'SWT.PUSH')
10:59:33 [2021-06-11T14:59:33.014Z] DEBUG - Sent event FocusIn [15]: FocusEvent{Button {Apply and Close} time=-74064913 data=null} to (of type 'Button' and (with mnemonic 'Apply and Close' or with mnemonic 'OK') and with style 'SWT.PUSH')
10:59:33 [2021-06-11T14:59:33.014Z] DEBUG - Sent event MouseDown [3]: MouseEvent{Button {Apply and Close} time=-74064913 data=null button=0 stateMask=0x0 x=0 y=0 count=0} to (of type 'Button' and (with mnemonic 'Apply and Close' or with mnemonic 'OK') and with style 'SWT.PUSH')
10:59:33 [2021-06-11T14:59:33.014Z] DEBUG - Sent event MouseUp [4]: MouseEvent{Button {Apply and Close} time=-74064912 data=null button=0 stateMask=0x0 x=0 y=0 count=0} to (of type 'Button' and (with mnemonic 'Apply and Close' or with mnemonic 'OK') and with style 'SWT.PUSH')
10:59:33 [2021-06-11T14:59:33.272Z] DEBUG - Sent event Selection [13]: SelectionEvent{Button {Apply and Close} time=-74064912 data=null item=null detail=0 x=0 y=0 width=0 height=0 stateMask=0x0 text=null doit=true} to (of type 'Button' and (with mnemonic 'Apply and Close' or with mnemonic 'OK') and with style 'SWT.PUSH')
10:59:33 [2021-06-11T14:59:33.272Z] DEBUG - Sent event Selection [13]: SelectionEvent{MenuItem {&Preferences} time=-74065451 data=null item=null detail=0 x=0 y=0 width=0 height=0 stateMask=0x0 text=null doit=true} to with mnemonic 'Preferences'
10:59:33 [2021-06-11T14:59:33.272Z] DEBUG - Clicked on 
10:59:33 [2021-06-11T14:59:33.272Z] Tests run: 9, Failures: 0, Errors: 0, Skipped: 0, Time elapsed: 17.673 s - in org.eclipse.tracecompass.tmf.analysis.xml.ui.swtbot.tests.preferences.XMLAnalysesManagerPreferencePageTest
10:59:33 [2021-06-11T14:59:33.272Z] testPreferencePageMenuBar(org.eclipse.tracecompass.tmf.analysis.xml.ui.swtbot.tests.preferences.XMLAnalysesManagerPreferencePageTest)  Time elapsed: 1.785 s
10:59:33 [2021-06-11T14:59:33.272Z] testImportInvalid(org.eclipse.tracecompass.tmf.analysis.xml.ui.swtbot.tests.preferences.XMLAnalysesManagerPreferencePageTest)  Time elapsed: 1.33 s
10:59:33 [2021-06-11T14:59:33.272Z] testPreferencePageContextMenu(org.eclipse.tracecompass.tmf.analysis.xml.ui.swtbot.tests.preferences.XMLAnalysesManagerPreferencePageTest)  Time elapsed: 3.064 s
10:59:33 [2021-06-11T14:59:33.272Z] testEdit(org.eclipse.tracecompass.tmf.analysis.xml.ui.swtbot.tests.preferences.XMLAnalysesManagerPreferencePageTest)  Time elapsed: 3.213 s
10:59:33 [2021-06-11T14:59:33.272Z] testImportValid(org.eclipse.tracecompass.tmf.analysis.xml.ui.swtbot.tests.preferences.XMLAnalysesManagerPreferencePageTest)  Time elapsed: 1.482 s
10:59:33 [2021-06-11T14:59:33.272Z] testCheckButtons(org.eclipse.tracecompass.tmf.analysis.xml.ui.swtbot.tests.preferences.XMLAnalysesManagerPreferencePageTest)  Time elapsed: 1.842 s
10:59:33 [2021-06-11T14:59:33.272Z] testDelete(org.eclipse.tracecompass.tmf.analysis.xml.ui.swtbot.tests.preferences.XMLAnalysesManagerPreferencePageTest)  Time elapsed: 2.182 s
10:59:33 [2021-06-11T14:59:33.272Z] testExport(org.eclipse.tracecompass.tmf.analysis.xml.ui.swtbot.tests.preferences.XMLAnalysesManagerPreferencePageTest)  Time elapsed: 1.323 s
10:59:33 [2021-06-11T14:59:33.272Z] testInvalidLabel(org.eclipse.tracecompass.tmf.analysis.xml.ui.swtbot.tests.preferences.XMLAnalysesManagerPreferencePageTest)  Time elapsed: 1.285 s
10:59:33 [2021-06-11T14:59:33.272Z] 
10:59:33 [2021-06-11T14:59:33.272Z] Results:
10:59:33 [2021-06-11T14:59:33.272Z] 
10:59:33 [2021-06-11T14:59:33.272Z] Tests run: 13, Failures: 0, Errors: 0, Skipped: 0
10:59:33 [2021-06-11T14:59:33.272Z] 
10:59:33 [2021-06-11T14:59:33.530Z] 
10:59:33 [2021-06-11T14:59:33.530Z] !ENTRY org.eclipse.core.resources 2 10035 2021-06-11 14:59:33.469
10:59:33 [2021-06-11T14:59:33.530Z] !MESSAGE The workspace will exit with unsaved changes in this session.
10:59:34 [2021-06-11T14:59:34.464Z] [INFO] All tests passed!
10:59:34 [2021-06-11T14:59:34.464Z] [INFO] 
10:59:34 [2021-06-11T14:59:34.464Z] [INFO] --- maven-install-plugin:2.5.2:install (default-install) @ org.eclipse.tracecompass.tmf.analysis.xml.ui.swtbot.tests ---
10:59:34 [2021-06-11T14:59:34.464Z] [INFO] Installing /home/jenkins/agent/workspace/tracecompass-master-2019-06/tmf/org.eclipse.tracecompass.tmf.analysis.xml.ui.swtbot.tests/target/org.eclipse.tracecompass.tmf.analysis.xml.ui.swtbot.tests-1.0.13-SNAPSHOT.jar to /home/jenkins/.m2/repository/org/eclipse/tracecompass/org.eclipse.tracecompass.tmf.analysis.xml.ui.swtbot.tests/1.0.13-SNAPSHOT/org.eclipse.tracecompass.tmf.analysis.xml.ui.swtbot.tests-1.0.13-SNAPSHOT.jar
10:59:34 [2021-06-11T14:59:34.464Z] [INFO] Installing /home/jenkins/agent/workspace/tracecompass-master-2019-06/tmf/org.eclipse.tracecompass.tmf.analysis.xml.ui.swtbot.tests/pom.xml to /home/jenkins/.m2/repository/org/eclipse/tracecompass/org.eclipse.tracecompass.tmf.analysis.xml.ui.swtbot.tests/1.0.13-SNAPSHOT/org.eclipse.tracecompass.tmf.analysis.xml.ui.swtbot.tests-1.0.13-SNAPSHOT.pom
10:59:34 [2021-06-11T14:59:34.464Z] [INFO] Installing /home/jenkins/agent/workspace/tracecompass-master-2019-06/tmf/org.eclipse.tracecompass.tmf.analysis.xml.ui.swtbot.tests/target/org.eclipse.tracecompass.tmf.analysis.xml.ui.swtbot.tests-1.0.13-SNAPSHOT-sources.jar to /home/jenkins/.m2/repository/org/eclipse/tracecompass/org.eclipse.tracecompass.tmf.analysis.xml.ui.swtbot.tests/1.0.13-SNAPSHOT/org.eclipse.tracecompass.tmf.analysis.xml.ui.swtbot.tests-1.0.13-SNAPSHOT-sources.jar
10:59:34 [2021-06-11T14:59:34.464Z] [INFO] Installing /home/jenkins/agent/workspace/tracecompass-master-2019-06/tmf/org.eclipse.tracecompass.tmf.analysis.xml.ui.swtbot.tests/target/org.eclipse.tracecompass.tmf.analysis.xml.ui.swtbot.tests-1.0.13-SNAPSHOT.jar.pack.gz to /home/jenkins/.m2/repository/org/eclipse/tracecompass/org.eclipse.tracecompass.tmf.analysis.xml.ui.swtbot.tests/1.0.13-SNAPSHOT/org.eclipse.tracecompass.tmf.analysis.xml.ui.swtbot.tests-1.0.13-SNAPSHOT-pack200.jar.pack.gz
10:59:34 [2021-06-11T14:59:34.464Z] [INFO] Installing /home/jenkins/agent/workspace/tracecompass-master-2019-06/tmf/org.eclipse.tracecompass.tmf.analysis.xml.ui.swtbot.tests/target/p2content.xml to /home/jenkins/.m2/repository/org/eclipse/tracecompass/org.eclipse.tracecompass.tmf.analysis.xml.ui.swtbot.tests/1.0.13-SNAPSHOT/org.eclipse.tracecompass.tmf.analysis.xml.ui.swtbot.tests-1.0.13-SNAPSHOT-p2metadata.xml
10:59:34 [2021-06-11T14:59:34.464Z] [INFO] Installing /home/jenkins/agent/workspace/tracecompass-master-2019-06/tmf/org.eclipse.tracecompass.tmf.analysis.xml.ui.swtbot.tests/target/p2artifacts.xml to /home/jenkins/.m2/repository/org/eclipse/tracecompass/org.eclipse.tracecompass.tmf.analysis.xml.ui.swtbot.tests/1.0.13-SNAPSHOT/org.eclipse.tracecompass.tmf.analysis.xml.ui.swtbot.tests-1.0.13-SNAPSHOT-p2artifacts.xml
10:59:34 [2021-06-11T14:59:34.464Z] [INFO] 
10:59:34 [2021-06-11T14:59:34.464Z] [INFO] --- tycho-p2-plugin:2.3.0:update-local-index (default-update-local-index) @ org.eclipse.tracecompass.tmf.analysis.xml.ui.swtbot.tests ---
10:59:34 [2021-06-11T14:59:34.464Z] [INFO] 
10:59:34 [2021-06-11T14:59:34.464Z] [INFO] --< org.eclipse.tracecompass:org.eclipse.tracecompass.tmf.analysis.xml.ui.tests >--
10:59:34 [2021-06-11T14:59:34.464Z] [INFO] Building org.eclipse.tracecompass.tmf.analysis.xml.ui.tests 1.0.4-SNAPSHOT [130/138]
10:59:34 [2021-06-11T14:59:34.464Z] [INFO] ------------------------[ eclipse-test-plugin ]-------------------------
10:59:34 [2021-06-11T14:59:34.464Z] [INFO] 
10:59:34 [2021-06-11T14:59:34.464Z] [INFO] --- maven-clean-plugin:3.0.0:clean (default-clean) @ org.eclipse.tracecompass.tmf.analysis.xml.ui.tests ---
10:59:34 [2021-06-11T14:59:34.464Z] [INFO] 
10:59:34 [2021-06-11T14:59:34.464Z] [INFO] --- tycho-packaging-plugin:2.3.0:build-qualifier (default-build-qualifier) @ org.eclipse.tracecompass.tmf.analysis.xml.ui.tests ---
10:59:34 [2021-06-11T14:59:34.464Z] [INFO] The project's OSGi version is 1.0.4.202106111356
10:59:34 [2021-06-11T14:59:34.464Z] [INFO] 
10:59:34 [2021-06-11T14:59:34.464Z] [INFO] --- tycho-packaging-plugin:2.3.0:validate-id (default-validate-id) @ org.eclipse.tracecompass.tmf.analysis.xml.ui.tests ---
10:59:34 [2021-06-11T14:59:34.464Z] [INFO] 
10:59:34 [2021-06-11T14:59:34.464Z] [INFO] --- tycho-packaging-plugin:2.3.0:validate-version (default-validate-version) @ org.eclipse.tracecompass.tmf.analysis.xml.ui.tests ---
10:59:34 [2021-06-11T14:59:34.464Z] [INFO] 
10:59:34 [2021-06-11T14:59:34.464Z] [INFO] --- maven-enforcer-plugin:3.0.0-M3:enforce (enforce-maven-version) @ org.eclipse.tracecompass.tmf.analysis.xml.ui.tests ---
10:59:34 [2021-06-11T14:59:34.464Z] [INFO] 
10:59:34 [2021-06-11T14:59:34.464Z] [INFO] --- maven-resources-plugin:3.0.2:resources (default-resources) @ org.eclipse.tracecompass.tmf.analysis.xml.ui.tests ---
10:59:34 [2021-06-11T14:59:34.464Z] [INFO] Using 'UTF-8' encoding to copy filtered resources.
10:59:34 [2021-06-11T14:59:34.464Z] [INFO] skip non existing resourceDirectory /home/jenkins/agent/workspace/tracecompass-master-2019-06/tmf/org.eclipse.tracecompass.tmf.analysis.xml.ui.tests/src/main/resources
10:59:34 [2021-06-11T14:59:34.464Z] [INFO] 
10:59:34 [2021-06-11T14:59:34.464Z] [INFO] --- tycho-compiler-plugin:2.3.0:compile (default-compile) @ org.eclipse.tracecompass.tmf.analysis.xml.ui.tests ---
10:59:34 [2021-06-11T14:59:34.464Z] [INFO] Compiling 3 source files to /home/jenkins/agent/workspace/tracecompass-master-2019-06/tmf/org.eclipse.tracecompass.tmf.analysis.xml.ui.tests/target/classes
10:59:34 [2021-06-11T14:59:34.464Z] [INFO] 
10:59:34 [2021-06-11T14:59:34.464Z] [INFO] --- maven-resources-plugin:3.0.2:testResources (default-testResources) @ org.eclipse.tracecompass.tmf.analysis.xml.ui.tests ---
10:59:34 [2021-06-11T14:59:34.465Z] [INFO] Using 'UTF-8' encoding to copy filtered resources.
10:59:34 [2021-06-11T14:59:34.465Z] [INFO] skip non existing resourceDirectory /home/jenkins/agent/workspace/tracecompass-master-2019-06/tmf/org.eclipse.tracecompass.tmf.analysis.xml.ui.tests/src/test/resources
10:59:34 [2021-06-11T14:59:34.465Z] [INFO] 
10:59:34 [2021-06-11T14:59:34.465Z] [INFO] --- tycho-source-plugin:2.3.0:plugin-source (plugin-source) @ org.eclipse.tracecompass.tmf.analysis.xml.ui.tests ---
10:59:34 [2021-06-11T14:59:34.465Z] [INFO] Building jar: /home/jenkins/agent/workspace/tracecompass-master-2019-06/tmf/org.eclipse.tracecompass.tmf.analysis.xml.ui.tests/target/org.eclipse.tracecompass.tmf.analysis.xml.ui.tests-1.0.4-SNAPSHOT-sources.jar
10:59:34 [2021-06-11T14:59:34.465Z] [INFO] 
10:59:34 [2021-06-11T14:59:34.465Z] [INFO] --- target-platform-configuration:2.3.0:target-platform (default-target-platform) @ org.eclipse.tracecompass.tmf.analysis.xml.ui.tests ---
10:59:34 [2021-06-11T14:59:34.465Z] [INFO] 
10:59:34 [2021-06-11T14:59:34.465Z] [INFO] --- tycho-packaging-plugin:2.3.0:package-plugin (default-package-plugin) @ org.eclipse.tracecompass.tmf.analysis.xml.ui.tests ---
10:59:34 [2021-06-11T14:59:34.465Z] [INFO] Building jar: /home/jenkins/agent/workspace/tracecompass-master-2019-06/tmf/org.eclipse.tracecompass.tmf.analysis.xml.ui.tests/target/org.eclipse.tracecompass.tmf.analysis.xml.ui.tests-1.0.4-SNAPSHOT.jar
10:59:34 [2021-06-11T14:59:34.722Z] [INFO] 
10:59:34 [2021-06-11T14:59:34.722Z] [INFO] --- tycho-p2-plugin:2.3.0:p2-metadata-default (default-p2-metadata-default) @ org.eclipse.tracecompass.tmf.analysis.xml.ui.tests ---
10:59:34 [2021-06-11T14:59:34.722Z] [INFO] 
10:59:34 [2021-06-11T14:59:34.722Z] [INFO] --- tycho-source-feature-plugin:2.3.0:source-feature (source-feature) @ org.eclipse.tracecompass.tmf.analysis.xml.ui.tests ---
10:59:34 [2021-06-11T14:59:34.722Z] [WARNING] Mojo tycho-source-feature-plugin:source-feature is replaced by the tycho-source-plugin:feature-source which offers equivalent and even enhanced functionality
10:59:34 [2021-06-11T14:59:34.722Z] [INFO] 
10:59:34 [2021-06-11T14:59:34.722Z] [INFO] --- tycho-pack200b-plugin:2.3.0:pack (pack200-pack) @ org.eclipse.tracecompass.tmf.analysis.xml.ui.tests ---
10:59:34 [2021-06-11T14:59:34.722Z] [WARNING] Pack200 actions are deprecated and scheduled for removal.
10:59:34 [2021-06-11T14:59:34.722Z] [INFO] Pack200 packing jar /home/jenkins/agent/workspace/tracecompass-master-2019-06/tmf/org.eclipse.tracecompass.tmf.analysis.xml.ui.tests/target/org.eclipse.tracecompass.tmf.analysis.xml.ui.tests-1.0.4-SNAPSHOT.jar
10:59:34 [2021-06-11T14:59:34.722Z] [INFO] 
10:59:34 [2021-06-11T14:59:34.722Z] [INFO] --- tycho-p2-plugin:2.3.0:p2-metadata (p2-metadata) @ org.eclipse.tracecompass.tmf.analysis.xml.ui.tests ---
10:59:34 [2021-06-11T14:59:34.722Z] [INFO] 
10:59:34 [2021-06-11T14:59:34.722Z] [INFO] --- tycho-surefire-plugin:2.3.0:test (default-test) @ org.eclipse.tracecompass.tmf.analysis.xml.ui.tests ---
10:59:34 [2021-06-11T14:59:34.993Z] [INFO] Executing Test Runtime with timeout 0, logs (if any) will be placed at: /home/jenkins/agent/workspace/tracecompass-master-2019-06/tmf/org.eclipse.tracecompass.tmf.analysis.xml.ui.tests/target/work/data/.metadata/.log
10:59:34 [2021-06-11T14:59:34.993Z] [INFO] Command line:
10:59:34 [2021-06-11T14:59:34.993Z] 	[/opt/tools/java/openjdk/jdk-11/11.0.2+9/bin/java, -Dosgi.noShutdown=false, -Dosgi.os=linux, -Dosgi.ws=gtk, -Dosgi.arch=x86_64, -Dorg.eclipse.swt.browser.DefaultType=mozilla, -Xms512m, -Xmx1024m, -Dosgi.clean=true, -jar, /home/jenkins/.m2/repository/p2/osgi/bundle/org.eclipse.equinox.launcher/1.5.400.v20190515-0925/org.eclipse.equinox.launcher-1.5.400.v20190515-0925.jar, -data, /home/jenkins/agent/workspace/tracecompass-master-2019-06/tmf/org.eclipse.tracecompass.tmf.analysis.xml.ui.tests/target/work/data, -install, /home/jenkins/agent/workspace/tracecompass-master-2019-06/tmf/org.eclipse.tracecompass.tmf.analysis.xml.ui.tests/target/work, -configuration, /home/jenkins/agent/workspace/tracecompass-master-2019-06/tmf/org.eclipse.tracecompass.tmf.analysis.xml.ui.tests/target/work/configuration, -application, org.eclipse.tycho.surefire.osgibooter.uitest, -testproperties, /home/jenkins/agent/workspace/tracecompass-master-2019-06/tmf/org.eclipse.tracecompass.tmf.analysis.xml.ui.tests/target/surefire.properties, -product, org.eclipse.platform.ide, -consoleLog]
10:59:34 [2021-06-11T14:59:34.993Z] Picked up _JAVA_OPTIONS: -Duser.home=/home/tracecompass
10:59:38 [2021-06-11T14:59:38.274Z] !SESSION 2021-06-11 14:59:35.146 -----------------------------------------------
10:59:38 [2021-06-11T14:59:38.274Z] eclipse.buildId=unknown
10:59:38 [2021-06-11T14:59:38.274Z] java.version=11.0.2
10:59:38 [2021-06-11T14:59:38.274Z] java.vendor=Oracle Corporation
10:59:38 [2021-06-11T14:59:38.274Z] BootLoader constants: OS=linux, ARCH=x86_64, WS=gtk, NL=en_US
10:59:38 [2021-06-11T14:59:38.274Z] Framework arguments:  -application org.eclipse.tycho.surefire.osgibooter.uitest -testproperties /home/jenkins/agent/workspace/tracecompass-master-2019-06/tmf/org.eclipse.tracecompass.tmf.analysis.xml.ui.tests/target/surefire.properties -product org.eclipse.platform.ide
10:59:38 [2021-06-11T14:59:38.274Z] Command-line arguments:  -data /home/jenkins/agent/workspace/tracecompass-master-2019-06/tmf/org.eclipse.tracecompass.tmf.analysis.xml.ui.tests/target/work/data -application org.eclipse.tycho.surefire.osgibooter.uitest -testproperties /home/jenkins/agent/workspace/tracecompass-master-2019-06/tmf/org.eclipse.tracecompass.tmf.analysis.xml.ui.tests/target/surefire.properties -product org.eclipse.platform.ide -consoleLog
10:59:38 [2021-06-11T14:59:38.274Z] 
10:59:38 [2021-06-11T14:59:38.274Z] !ENTRY org.eclipse.compare.win32 4 0 2021-06-11 14:59:37.947
10:59:38 [2021-06-11T14:59:38.274Z] !MESSAGE FrameworkEvent ERROR
10:59:38 [2021-06-11T14:59:38.274Z] !STACK 0
10:59:38 [2021-06-11T14:59:38.274Z] org.osgi.framework.BundleException: Could not resolve module: org.eclipse.compare.win32 [65]
10:59:38 [2021-06-11T14:59:38.274Z]   Unresolved requirement: Require-Capability: eclipse.platform; filter:="(osgi.os=win32)"
10:59:38 [2021-06-11T14:59:38.274Z] 
10:59:38 [2021-06-11T14:59:38.274Z] 	at org.eclipse.osgi.container.Module.start(Module.java:457)
10:59:38 [2021-06-11T14:59:38.274Z] 	at org.eclipse.osgi.container.ModuleContainer$ContainerStartLevel$1.run(ModuleContainer.java:1820)
10:59:38 [2021-06-11T14:59:38.274Z] 	at org.eclipse.osgi.internal.framework.EquinoxContainerAdaptor$2$1.execute(EquinoxContainerAdaptor.java:150)
10:59:38 [2021-06-11T14:59:38.274Z] 	at org.eclipse.osgi.container.ModuleContainer$ContainerStartLevel.incStartLevel(ModuleContainer.java:1813)
10:59:38 [2021-06-11T14:59:38.274Z] 	at org.eclipse.osgi.container.ModuleContainer$ContainerStartLevel.incStartLevel(ModuleContainer.java:1769)
10:59:38 [2021-06-11T14:59:38.274Z] 	at org.eclipse.osgi.container.ModuleContainer$ContainerStartLevel.doContainerStartLevel(ModuleContainer.java:1735)
10:59:38 [2021-06-11T14:59:38.274Z] 	at org.eclipse.osgi.container.ModuleContainer$ContainerStartLevel.dispatchEvent(ModuleContainer.java:1661)
10:59:38 [2021-06-11T14:59:38.274Z] 	at org.eclipse.osgi.container.ModuleContainer$ContainerStartLevel.dispatchEvent(ModuleContainer.java:1)
10:59:38 [2021-06-11T14:59:38.274Z] 	at org.eclipse.osgi.framework.eventmgr.EventManager.dispatchEvent(EventManager.java:234)
10:59:38 [2021-06-11T14:59:38.274Z] 	at org.eclipse.osgi.framework.eventmgr.EventManager$EventThread.run(EventManager.java:345)
10:59:38 [2021-06-11T14:59:38.274Z] 
10:59:38 [2021-06-11T14:59:38.274Z] !ENTRY org.eclipse.ecf.provider.filetransfer.httpclient45.win32 4 0 2021-06-11 14:59:38.075
10:59:38 [2021-06-11T14:59:38.274Z] !MESSAGE FrameworkEvent ERROR
10:59:38 [2021-06-11T14:59:38.274Z] !STACK 0
10:59:38 [2021-06-11T14:59:38.274Z] org.osgi.framework.BundleException: Could not resolve module: org.eclipse.ecf.provider.filetransfer.httpclient45.win32 [134]
10:59:38 [2021-06-11T14:59:38.274Z]   Unresolved requirement: Require-Capability: eclipse.platform; filter:="(osgi.os=win32)"
10:59:38 [2021-06-11T14:59:38.274Z]   Unresolved requirement: Import-Package: org.apache.http.impl.auth.win; version="[4.5.0,5.0.0)"
10:59:38 [2021-06-11T14:59:38.274Z]     -> Export-Package: org.apache.http.impl.auth.win; bundle-symbolic-name="org.apache.httpcomponents.httpclient.win"; bundle-version="4.5.6.v20190213-1947"; version="4.5.6"; x-internal:="true"; uses:="org.apache.http,org.apache.http.auth,org.apache.http.client,org.apache.http.impl.auth,org.apache.http.protocol,org.apache.http.util"
10:59:38 [2021-06-11T14:59:38.274Z]        org.apache.httpcomponents.httpclient.win [36]
10:59:38 [2021-06-11T14:59:38.274Z]          Unresolved requirement: Require-Capability: eclipse.platform; filter:="(osgi.os=win32)"
10:59:38 [2021-06-11T14:59:38.274Z] 
10:59:38 [2021-06-11T14:59:38.274Z] 	at org.eclipse.osgi.container.Module.start(Module.java:457)
10:59:38 [2021-06-11T14:59:38.274Z] 	at org.eclipse.osgi.container.ModuleContainer$ContainerStartLevel$1.run(ModuleContainer.java:1820)
10:59:38 [2021-06-11T14:59:38.274Z] 	at org.eclipse.osgi.internal.framework.EquinoxContainerAdaptor$2$1.execute(EquinoxContainerAdaptor.java:150)
10:59:38 [2021-06-11T14:59:38.274Z] 	at org.eclipse.osgi.container.ModuleContainer$ContainerStartLevel.incStartLevel(ModuleContainer.java:1813)
10:59:38 [2021-06-11T14:59:38.274Z] 	at org.eclipse.osgi.container.ModuleContainer$ContainerStartLevel.incStartLevel(ModuleContainer.java:1769)
10:59:38 [2021-06-11T14:59:38.274Z] 	at org.eclipse.osgi.container.ModuleContainer$ContainerStartLevel.doContainerStartLevel(ModuleContainer.java:1735)
10:59:38 [2021-06-11T14:59:38.274Z] 	at org.eclipse.osgi.container.ModuleContainer$ContainerStartLevel.dispatchEvent(ModuleContainer.java:1661)
10:59:38 [2021-06-11T14:59:38.274Z] 	at org.eclipse.osgi.container.ModuleContainer$ContainerStartLevel.dispatchEvent(ModuleContainer.java:1)
10:59:38 [2021-06-11T14:59:38.274Z] 	at org.eclipse.osgi.framework.eventmgr.EventManager.dispatchEvent(EventManager.java:234)
10:59:38 [2021-06-11T14:59:38.274Z] 	at org.eclipse.osgi.framework.eventmgr.EventManager$EventThread.run(EventManager.java:345)
10:59:40 [2021-06-11T14:59:40.173Z] SWT SessionManagerDBus: Failed to connect to org.gnome.SessionManager: Failed to execute child process “dbus-launch” (No such file or directory)
10:59:40 [2021-06-11T14:59:40.173Z] SWT SessionManagerDBus: Failed to connect to org.xfce.SessionManager: Failed to execute child process “dbus-launch” (No such file or directory)
10:59:46 [2021-06-11T14:59:46.729Z] SWT WebkitGDBus.java: Lost GDBus name. This should never occur
10:59:47 [2021-06-11T14:59:47.294Z] Running org.eclipse.tracecompass.tmf.analysis.xml.ui.tests.XmlAnalysisUiPluginTest
10:59:47 [2021-06-11T14:59:47.294Z] Tests run: 2, Failures: 0, Errors: 0, Skipped: 0, Time elapsed: 0.026 s - in org.eclipse.tracecompass.tmf.analysis.xml.ui.tests.XmlAnalysisUiPluginTest
10:59:47 [2021-06-11T14:59:47.294Z] testTmfCorePluginId(org.eclipse.tracecompass.tmf.analysis.xml.ui.tests.XmlAnalysisUiPluginTest)  Time elapsed: 0.001 s
10:59:47 [2021-06-11T14:59:47.294Z] testGetDefault(org.eclipse.tracecompass.tmf.analysis.xml.ui.tests.XmlAnalysisUiPluginTest)  Time elapsed: 0 s
10:59:47 [2021-06-11T14:59:47.294Z] Running org.eclipse.tracecompass.tmf.analysis.xml.ui.tests.module.XmlAnalysisOutputSourceTest
10:59:47 [2021-06-11T14:59:47.551Z] Tests run: 1, Failures: 0, Errors: 0, Skipped: 0, Time elapsed: 0.274 s - in org.eclipse.tracecompass.tmf.analysis.xml.ui.tests.module.XmlAnalysisOutputSourceTest
10:59:47 [2021-06-11T14:59:47.551Z] testBuiltinOutput(org.eclipse.tracecompass.tmf.analysis.xml.ui.tests.module.XmlAnalysisOutputSourceTest)  Time elapsed: 0.274 s
10:59:47 [2021-06-11T14:59:47.551Z] 
10:59:47 [2021-06-11T14:59:47.551Z] Results:
10:59:47 [2021-06-11T14:59:47.551Z] 
10:59:47 [2021-06-11T14:59:47.551Z] Tests run: 3, Failures: 0, Errors: 0, Skipped: 0
10:59:47 [2021-06-11T14:59:47.551Z] 
10:59:47 [2021-06-11T14:59:47.551Z] 
10:59:47 [2021-06-11T14:59:47.551Z] !ENTRY org.eclipse.tracecompass.tmf.core 4 0 2021-06-11 14:59:47.538
10:59:47 [2021-06-11T14:59:47.551Z] !MESSAGE Unexpected error executing analysis with trace 
10:59:47 [2021-06-11T14:59:47.551Z] !STACK 0
10:59:47 [2021-06-11T14:59:47.551Z] java.lang.NullPointerException
10:59:47 [2021-06-11T14:59:47.551Z] 	at java.base/java.io.File.<init>(File.java:276)
10:59:47 [2021-06-11T14:59:47.551Z] 	at org.eclipse.tracecompass.tmf.core.statesystem.TmfStateSystemAnalysisModule.loadInitialState(TmfStateSystemAnalysisModule.java:580)
10:59:47 [2021-06-11T14:59:47.551Z] 	at org.eclipse.tracecompass.tmf.core.statesystem.TmfStateSystemAnalysisModule.build(TmfStateSystemAnalysisModule.java:528)
10:59:47 [2021-06-11T14:59:47.551Z] 	at org.eclipse.tracecompass.tmf.core.statesystem.TmfStateSystemAnalysisModule.createFullHistory(TmfStateSystemAnalysisModule.java:376)
10:59:47 [2021-06-11T14:59:47.551Z] 	at org.eclipse.tracecompass.tmf.core.statesystem.TmfStateSystemAnalysisModule.executeAnalysis(TmfStateSystemAnalysisModule.java:282)
10:59:47 [2021-06-11T14:59:47.551Z] 	at org.eclipse.tracecompass.tmf.core.analysis.TmfAbstractAnalysisModule$1.run(TmfAbstractAnalysisModule.java:394)
10:59:47 [2021-06-11T14:59:47.551Z] 	at org.eclipse.core.internal.jobs.Worker.run(Worker.java:63)
10:59:47 [2021-06-11T14:59:47.551Z] 
10:59:47 [2021-06-11T14:59:47.551Z] !ENTRY org.eclipse.tracecompass.tmf.core 4 0 2021-06-11 14:59:47.539
10:59:47 [2021-06-11T14:59:47.551Z] !MESSAGE Unexpected error executing analysis with trace 
10:59:47 [2021-06-11T14:59:47.551Z] !STACK 0
10:59:47 [2021-06-11T14:59:47.551Z] java.lang.NullPointerException
10:59:47 [2021-06-11T14:59:47.551Z] 	at java.base/java.io.File.<init>(File.java:276)
10:59:47 [2021-06-11T14:59:47.551Z] 	at org.eclipse.tracecompass.tmf.core.statesystem.TmfStateSystemAnalysisModule.loadInitialState(TmfStateSystemAnalysisModule.java:580)
10:59:47 [2021-06-11T14:59:47.551Z] 	at org.eclipse.tracecompass.tmf.core.statesystem.TmfStateSystemAnalysisModule.build(TmfStateSystemAnalysisModule.java:528)
10:59:47 [2021-06-11T14:59:47.551Z] 	at org.eclipse.tracecompass.tmf.core.statesystem.TmfStateSystemAnalysisModule.createFullHistory(TmfStateSystemAnalysisModule.java:376)
10:59:47 [2021-06-11T14:59:47.551Z] 	at org.eclipse.tracecompass.tmf.core.statesystem.TmfStateSystemAnalysisModule.executeAnalysis(TmfStateSystemAnalysisModule.java:282)
10:59:47 [2021-06-11T14:59:47.551Z] 	at org.eclipse.tracecompass.tmf.core.analysis.TmfAbstractAnalysisModule$1.run(TmfAbstractAnalysisModule.java:394)
10:59:47 [2021-06-11T14:59:47.551Z] 	at org.eclipse.core.internal.jobs.Worker.run(Worker.java:63)
10:59:47 [2021-06-11T14:59:47.551Z] 
10:59:47 [2021-06-11T14:59:47.551Z] !ENTRY org.eclipse.tracecompass.tmf.core 4 0 2021-06-11 14:59:47.544
10:59:47 [2021-06-11T14:59:47.551Z] !MESSAGE Exception executing analysis
10:59:47 [2021-06-11T14:59:47.551Z] !STACK 0
10:59:47 [2021-06-11T14:59:47.551Z] java.lang.NullPointerException
10:59:47 [2021-06-11T14:59:47.551Z] 	at java.base/java.io.File.<init>(File.java:276)
10:59:47 [2021-06-11T14:59:47.551Z] 	at org.eclipse.tracecompass.tmf.core.statesystem.TmfStateSystemAnalysisModule.loadInitialState(TmfStateSystemAnalysisModule.java:580)
10:59:47 [2021-06-11T14:59:47.551Z] 	at org.eclipse.tracecompass.tmf.core.statesystem.TmfStateSystemAnalysisModule.build(TmfStateSystemAnalysisModule.java:528)
10:59:47 [2021-06-11T14:59:47.551Z] 	at org.eclipse.tracecompass.tmf.core.statesystem.TmfStateSystemAnalysisModule.createFullHistory(TmfStateSystemAnalysisModule.java:376)
10:59:47 [2021-06-11T14:59:47.551Z] 	at org.eclipse.tracecompass.tmf.core.statesystem.TmfStateSystemAnalysisModule.executeAnalysis(TmfStateSystemAnalysisModule.java:282)
10:59:47 [2021-06-11T14:59:47.551Z] 	at org.eclipse.tracecompass.tmf.core.analysis.TmfAbstractAnalysisModule$1.run(TmfAbstractAnalysisModule.java:394)
10:59:47 [2021-06-11T14:59:47.551Z] 	at org.eclipse.core.internal.jobs.Worker.run(Worker.java:63)
10:59:47 [2021-06-11T14:59:47.551Z] 
10:59:47 [2021-06-11T14:59:47.551Z] !ENTRY org.eclipse.tracecompass.tmf.core 4 0 2021-06-11 14:59:47.544
10:59:47 [2021-06-11T14:59:47.551Z] !MESSAGE Exception executing analysis
10:59:47 [2021-06-11T14:59:47.551Z] !STACK 0
10:59:47 [2021-06-11T14:59:47.551Z] java.lang.NullPointerException
10:59:47 [2021-06-11T14:59:47.551Z] 	at java.base/java.io.File.<init>(File.java:276)
10:59:47 [2021-06-11T14:59:47.551Z] 	at org.eclipse.tracecompass.tmf.core.statesystem.TmfStateSystemAnalysisModule.loadInitialState(TmfStateSystemAnalysisModule.java:580)
10:59:47 [2021-06-11T14:59:47.551Z] 	at org.eclipse.tracecompass.tmf.core.statesystem.TmfStateSystemAnalysisModule.build(TmfStateSystemAnalysisModule.java:528)
10:59:47 [2021-06-11T14:59:47.551Z] 	at org.eclipse.tracecompass.tmf.core.statesystem.TmfStateSystemAnalysisModule.createFullHistory(TmfStateSystemAnalysisModule.java:376)
10:59:47 [2021-06-11T14:59:47.551Z] 	at org.eclipse.tracecompass.tmf.core.statesystem.TmfStateSystemAnalysisModule.executeAnalysis(TmfStateSystemAnalysisModule.java:282)
10:59:47 [2021-06-11T14:59:47.551Z] 	at org.eclipse.tracecompass.tmf.core.analysis.TmfAbstractAnalysisModule$1.run(TmfAbstractAnalysisModule.java:394)
10:59:47 [2021-06-11T14:59:47.551Z] 	at org.eclipse.core.internal.jobs.Worker.run(Worker.java:63)
10:59:48 [2021-06-11T14:59:48.922Z] [INFO] All tests passed!
10:59:48 [2021-06-11T14:59:48.922Z] [INFO] 
10:59:48 [2021-06-11T14:59:48.923Z] [INFO] --- maven-install-plugin:2.5.2:install (default-install) @ org.eclipse.tracecompass.tmf.analysis.xml.ui.tests ---
10:59:48 [2021-06-11T14:59:48.923Z] [INFO] Installing /home/jenkins/agent/workspace/tracecompass-master-2019-06/tmf/org.eclipse.tracecompass.tmf.analysis.xml.ui.tests/target/org.eclipse.tracecompass.tmf.analysis.xml.ui.tests-1.0.4-SNAPSHOT.jar to /home/jenkins/.m2/repository/org/eclipse/tracecompass/org.eclipse.tracecompass.tmf.analysis.xml.ui.tests/1.0.4-SNAPSHOT/org.eclipse.tracecompass.tmf.analysis.xml.ui.tests-1.0.4-SNAPSHOT.jar
10:59:48 [2021-06-11T14:59:48.923Z] [INFO] Installing /home/jenkins/agent/workspace/tracecompass-master-2019-06/tmf/org.eclipse.tracecompass.tmf.analysis.xml.ui.tests/pom.xml to /home/jenkins/.m2/repository/org/eclipse/tracecompass/org.eclipse.tracecompass.tmf.analysis.xml.ui.tests/1.0.4-SNAPSHOT/org.eclipse.tracecompass.tmf.analysis.xml.ui.tests-1.0.4-SNAPSHOT.pom
10:59:48 [2021-06-11T14:59:48.923Z] [INFO] Installing /home/jenkins/agent/workspace/tracecompass-master-2019-06/tmf/org.eclipse.tracecompass.tmf.analysis.xml.ui.tests/target/org.eclipse.tracecompass.tmf.analysis.xml.ui.tests-1.0.4-SNAPSHOT-sources.jar to /home/jenkins/.m2/repository/org/eclipse/tracecompass/org.eclipse.tracecompass.tmf.analysis.xml.ui.tests/1.0.4-SNAPSHOT/org.eclipse.tracecompass.tmf.analysis.xml.ui.tests-1.0.4-SNAPSHOT-sources.jar
10:59:48 [2021-06-11T14:59:48.923Z] [INFO] Installing /home/jenkins/agent/workspace/tracecompass-master-2019-06/tmf/org.eclipse.tracecompass.tmf.analysis.xml.ui.tests/target/org.eclipse.tracecompass.tmf.analysis.xml.ui.tests-1.0.4-SNAPSHOT.jar.pack.gz to /home/jenkins/.m2/repository/org/eclipse/tracecompass/org.eclipse.tracecompass.tmf.analysis.xml.ui.tests/1.0.4-SNAPSHOT/org.eclipse.tracecompass.tmf.analysis.xml.ui.tests-1.0.4-SNAPSHOT-pack200.jar.pack.gz
10:59:48 [2021-06-11T14:59:48.923Z] [INFO] Installing /home/jenkins/agent/workspace/tracecompass-master-2019-06/tmf/org.eclipse.tracecompass.tmf.analysis.xml.ui.tests/target/p2content.xml to /home/jenkins/.m2/repository/org/eclipse/tracecompass/org.eclipse.tracecompass.tmf.analysis.xml.ui.tests/1.0.4-SNAPSHOT/org.eclipse.tracecompass.tmf.analysis.xml.ui.tests-1.0.4-SNAPSHOT-p2metadata.xml
10:59:48 [2021-06-11T14:59:48.923Z] [INFO] Installing /home/jenkins/agent/workspace/tracecompass-master-2019-06/tmf/org.eclipse.tracecompass.tmf.analysis.xml.ui.tests/target/p2artifacts.xml to /home/jenkins/.m2/repository/org/eclipse/tracecompass/org.eclipse.tracecompass.tmf.analysis.xml.ui.tests/1.0.4-SNAPSHOT/org.eclipse.tracecompass.tmf.analysis.xml.ui.tests-1.0.4-SNAPSHOT-p2artifacts.xml
10:59:48 [2021-06-11T14:59:48.923Z] [INFO] 
10:59:48 [2021-06-11T14:59:48.923Z] [INFO] --- tycho-p2-plugin:2.3.0:update-local-index (default-update-local-index) @ org.eclipse.tracecompass.tmf.analysis.xml.ui.tests ---
10:59:48 [2021-06-11T14:59:48.923Z] [INFO] 
10:59:48 [2021-06-11T14:59:48.923Z] [INFO] --< org.eclipse.tracecompass:org.eclipse.tracecompass.tmf.chart.ui.tests >--
10:59:48 [2021-06-11T14:59:48.923Z] [INFO] Building org.eclipse.tracecompass.tmf.chart.ui.tests 1.0.2-SNAPSHOT [131/138]
10:59:48 [2021-06-11T14:59:48.923Z] [INFO] ------------------------[ eclipse-test-plugin ]-------------------------
10:59:48 [2021-06-11T14:59:48.923Z] [INFO] 
10:59:48 [2021-06-11T14:59:48.923Z] [INFO] --- maven-clean-plugin:3.0.0:clean (default-clean) @ org.eclipse.tracecompass.tmf.chart.ui.tests ---
10:59:48 [2021-06-11T14:59:48.923Z] [INFO] 
10:59:48 [2021-06-11T14:59:48.923Z] [INFO] --- tycho-packaging-plugin:2.3.0:build-qualifier (default-build-qualifier) @ org.eclipse.tracecompass.tmf.chart.ui.tests ---
10:59:48 [2021-06-11T14:59:48.923Z] [INFO] The project's OSGi version is 1.0.2.202106111356
10:59:48 [2021-06-11T14:59:48.923Z] [INFO] 
10:59:48 [2021-06-11T14:59:48.923Z] [INFO] --- tycho-packaging-plugin:2.3.0:validate-id (default-validate-id) @ org.eclipse.tracecompass.tmf.chart.ui.tests ---
10:59:48 [2021-06-11T14:59:48.923Z] [INFO] 
10:59:48 [2021-06-11T14:59:48.923Z] [INFO] --- tycho-packaging-plugin:2.3.0:validate-version (default-validate-version) @ org.eclipse.tracecompass.tmf.chart.ui.tests ---
10:59:48 [2021-06-11T14:59:48.923Z] [INFO] 
10:59:48 [2021-06-11T14:59:48.923Z] [INFO] --- maven-enforcer-plugin:3.0.0-M3:enforce (enforce-maven-version) @ org.eclipse.tracecompass.tmf.chart.ui.tests ---
10:59:48 [2021-06-11T14:59:48.923Z] [INFO] 
10:59:48 [2021-06-11T14:59:48.923Z] [INFO] --- maven-resources-plugin:3.0.2:resources (default-resources) @ org.eclipse.tracecompass.tmf.chart.ui.tests ---
10:59:48 [2021-06-11T14:59:48.923Z] [INFO] Using 'UTF-8' encoding to copy filtered resources.
10:59:48 [2021-06-11T14:59:48.923Z] [INFO] skip non existing resourceDirectory /home/jenkins/agent/workspace/tracecompass-master-2019-06/tmf/org.eclipse.tracecompass.tmf.chart.ui.tests/src/main/resources
10:59:48 [2021-06-11T14:59:48.923Z] [INFO] 
10:59:48 [2021-06-11T14:59:48.923Z] [INFO] --- tycho-compiler-plugin:2.3.0:compile (default-compile) @ org.eclipse.tracecompass.tmf.chart.ui.tests ---
10:59:48 [2021-06-11T14:59:48.923Z] [INFO] Compiling 2 source files to /home/jenkins/agent/workspace/tracecompass-master-2019-06/tmf/org.eclipse.tracecompass.tmf.chart.ui.tests/target/classes
10:59:49 [2021-06-11T14:59:49.181Z] [INFO] 
10:59:49 [2021-06-11T14:59:49.181Z] [INFO] --- maven-resources-plugin:3.0.2:testResources (default-testResources) @ org.eclipse.tracecompass.tmf.chart.ui.tests ---
10:59:49 [2021-06-11T14:59:49.181Z] [INFO] Using 'UTF-8' encoding to copy filtered resources.
10:59:49 [2021-06-11T14:59:49.181Z] [INFO] skip non existing resourceDirectory /home/jenkins/agent/workspace/tracecompass-master-2019-06/tmf/org.eclipse.tracecompass.tmf.chart.ui.tests/src/test/resources
10:59:49 [2021-06-11T14:59:49.181Z] [INFO] 
10:59:49 [2021-06-11T14:59:49.181Z] [INFO] --- tycho-source-plugin:2.3.0:plugin-source (plugin-source) @ org.eclipse.tracecompass.tmf.chart.ui.tests ---
10:59:49 [2021-06-11T14:59:49.181Z] [INFO] Building jar: /home/jenkins/agent/workspace/tracecompass-master-2019-06/tmf/org.eclipse.tracecompass.tmf.chart.ui.tests/target/org.eclipse.tracecompass.tmf.chart.ui.tests-1.0.2-SNAPSHOT-sources.jar
10:59:49 [2021-06-11T14:59:49.181Z] [INFO] 
10:59:49 [2021-06-11T14:59:49.181Z] [INFO] --- target-platform-configuration:2.3.0:target-platform (default-target-platform) @ org.eclipse.tracecompass.tmf.chart.ui.tests ---
10:59:49 [2021-06-11T14:59:49.181Z] [INFO] 
10:59:49 [2021-06-11T14:59:49.181Z] [INFO] --- tycho-packaging-plugin:2.3.0:package-plugin (default-package-plugin) @ org.eclipse.tracecompass.tmf.chart.ui.tests ---
10:59:49 [2021-06-11T14:59:49.181Z] [INFO] Building jar: /home/jenkins/agent/workspace/tracecompass-master-2019-06/tmf/org.eclipse.tracecompass.tmf.chart.ui.tests/target/org.eclipse.tracecompass.tmf.chart.ui.tests-1.0.2-SNAPSHOT.jar
10:59:49 [2021-06-11T14:59:49.181Z] [INFO] 
10:59:49 [2021-06-11T14:59:49.181Z] [INFO] --- tycho-p2-plugin:2.3.0:p2-metadata-default (default-p2-metadata-default) @ org.eclipse.tracecompass.tmf.chart.ui.tests ---
10:59:49 [2021-06-11T14:59:49.181Z] [INFO] 
10:59:49 [2021-06-11T14:59:49.181Z] [INFO] --- tycho-source-feature-plugin:2.3.0:source-feature (source-feature) @ org.eclipse.tracecompass.tmf.chart.ui.tests ---
10:59:49 [2021-06-11T14:59:49.181Z] [WARNING] Mojo tycho-source-feature-plugin:source-feature is replaced by the tycho-source-plugin:feature-source which offers equivalent and even enhanced functionality
10:59:49 [2021-06-11T14:59:49.181Z] [INFO] 
10:59:49 [2021-06-11T14:59:49.181Z] [INFO] --- tycho-pack200b-plugin:2.3.0:pack (pack200-pack) @ org.eclipse.tracecompass.tmf.chart.ui.tests ---
10:59:49 [2021-06-11T14:59:49.181Z] [WARNING] Pack200 actions are deprecated and scheduled for removal.
10:59:49 [2021-06-11T14:59:49.181Z] [INFO] Pack200 packing jar /home/jenkins/agent/workspace/tracecompass-master-2019-06/tmf/org.eclipse.tracecompass.tmf.chart.ui.tests/target/org.eclipse.tracecompass.tmf.chart.ui.tests-1.0.2-SNAPSHOT.jar
10:59:49 [2021-06-11T14:59:49.181Z] [INFO] 
10:59:49 [2021-06-11T14:59:49.181Z] [INFO] --- tycho-p2-plugin:2.3.0:p2-metadata (p2-metadata) @ org.eclipse.tracecompass.tmf.chart.ui.tests ---
10:59:49 [2021-06-11T14:59:49.181Z] [INFO] 
10:59:49 [2021-06-11T14:59:49.181Z] [INFO] --- tycho-surefire-plugin:2.3.0:test (default-test) @ org.eclipse.tracecompass.tmf.chart.ui.tests ---
10:59:49 [2021-06-11T14:59:49.439Z] [INFO] Executing Test Runtime with timeout 0, logs (if any) will be placed at: /home/jenkins/agent/workspace/tracecompass-master-2019-06/tmf/org.eclipse.tracecompass.tmf.chart.ui.tests/target/work/data/.metadata/.log
10:59:49 [2021-06-11T14:59:49.439Z] [INFO] Command line:
10:59:49 [2021-06-11T14:59:49.439Z] 	[/opt/tools/java/openjdk/jdk-11/11.0.2+9/bin/java, -Dosgi.noShutdown=false, -Dosgi.os=linux, -Dosgi.ws=gtk, -Dosgi.arch=x86_64, -Dorg.eclipse.swt.browser.DefaultType=mozilla, -Xms512m, -Xmx1024m, -Dosgi.clean=true, -jar, /home/jenkins/.m2/repository/p2/osgi/bundle/org.eclipse.equinox.launcher/1.5.400.v20190515-0925/org.eclipse.equinox.launcher-1.5.400.v20190515-0925.jar, -data, /home/jenkins/agent/workspace/tracecompass-master-2019-06/tmf/org.eclipse.tracecompass.tmf.chart.ui.tests/target/work/data, -install, /home/jenkins/agent/workspace/tracecompass-master-2019-06/tmf/org.eclipse.tracecompass.tmf.chart.ui.tests/target/work, -configuration, /home/jenkins/agent/workspace/tracecompass-master-2019-06/tmf/org.eclipse.tracecompass.tmf.chart.ui.tests/target/work/configuration, -application, org.eclipse.tycho.surefire.osgibooter.uitest, -testproperties, /home/jenkins/agent/workspace/tracecompass-master-2019-06/tmf/org.eclipse.tracecompass.tmf.chart.ui.tests/target/surefire.properties, -product, org.eclipse.platform.ide, -consoleLog]
10:59:49 [2021-06-11T14:59:49.697Z] Picked up _JAVA_OPTIONS: -Duser.home=/home/tracecompass
10:59:52 [2021-06-11T14:59:52.979Z] !SESSION 2021-06-11 14:59:49.650 -----------------------------------------------
10:59:52 [2021-06-11T14:59:52.979Z] eclipse.buildId=unknown
10:59:52 [2021-06-11T14:59:52.979Z] java.version=11.0.2
10:59:52 [2021-06-11T14:59:52.979Z] java.vendor=Oracle Corporation
10:59:52 [2021-06-11T14:59:52.979Z] BootLoader constants: OS=linux, ARCH=x86_64, WS=gtk, NL=en_US
10:59:52 [2021-06-11T14:59:52.979Z] Framework arguments:  -application org.eclipse.tycho.surefire.osgibooter.uitest -testproperties /home/jenkins/agent/workspace/tracecompass-master-2019-06/tmf/org.eclipse.tracecompass.tmf.chart.ui.tests/target/surefire.properties -product org.eclipse.platform.ide
10:59:52 [2021-06-11T14:59:52.979Z] Command-line arguments:  -data /home/jenkins/agent/workspace/tracecompass-master-2019-06/tmf/org.eclipse.tracecompass.tmf.chart.ui.tests/target/work/data -application org.eclipse.tycho.surefire.osgibooter.uitest -testproperties /home/jenkins/agent/workspace/tracecompass-master-2019-06/tmf/org.eclipse.tracecompass.tmf.chart.ui.tests/target/surefire.properties -product org.eclipse.platform.ide -consoleLog
10:59:52 [2021-06-11T14:59:52.979Z] 
10:59:52 [2021-06-11T14:59:52.979Z] !ENTRY org.eclipse.compare.win32 4 0 2021-06-11 14:59:52.646
10:59:52 [2021-06-11T14:59:52.979Z] !MESSAGE FrameworkEvent ERROR
10:59:52 [2021-06-11T14:59:52.979Z] !STACK 0
10:59:52 [2021-06-11T14:59:52.979Z] org.osgi.framework.BundleException: Could not resolve module: org.eclipse.compare.win32 [65]
10:59:52 [2021-06-11T14:59:52.979Z]   Unresolved requirement: Require-Capability: eclipse.platform; filter:="(osgi.os=win32)"
10:59:52 [2021-06-11T14:59:52.979Z] 
10:59:52 [2021-06-11T14:59:52.979Z] 	at org.eclipse.osgi.container.Module.start(Module.java:457)
10:59:52 [2021-06-11T14:59:52.979Z] 	at org.eclipse.osgi.container.ModuleContainer$ContainerStartLevel$1.run(ModuleContainer.java:1820)
10:59:52 [2021-06-11T14:59:52.979Z] 	at org.eclipse.osgi.internal.framework.EquinoxContainerAdaptor$2$1.execute(EquinoxContainerAdaptor.java:150)
10:59:52 [2021-06-11T14:59:52.979Z] 	at org.eclipse.osgi.container.ModuleContainer$ContainerStartLevel.incStartLevel(ModuleContainer.java:1813)
10:59:52 [2021-06-11T14:59:52.979Z] 	at org.eclipse.osgi.container.ModuleContainer$ContainerStartLevel.incStartLevel(ModuleContainer.java:1769)
10:59:52 [2021-06-11T14:59:52.979Z] 	at org.eclipse.osgi.container.ModuleContainer$ContainerStartLevel.doContainerStartLevel(ModuleContainer.java:1735)
10:59:52 [2021-06-11T14:59:52.979Z] 	at org.eclipse.osgi.container.ModuleContainer$ContainerStartLevel.dispatchEvent(ModuleContainer.java:1661)
10:59:52 [2021-06-11T14:59:52.979Z] 	at org.eclipse.osgi.container.ModuleContainer$ContainerStartLevel.dispatchEvent(ModuleContainer.java:1)
10:59:52 [2021-06-11T14:59:52.979Z] 	at org.eclipse.osgi.framework.eventmgr.EventManager.dispatchEvent(EventManager.java:234)
10:59:52 [2021-06-11T14:59:52.979Z] 	at org.eclipse.osgi.framework.eventmgr.EventManager$EventThread.run(EventManager.java:345)
10:59:52 [2021-06-11T14:59:52.979Z] 
10:59:52 [2021-06-11T14:59:52.979Z] !ENTRY org.eclipse.ecf.provider.filetransfer.httpclient45.win32 4 0 2021-06-11 14:59:52.746
10:59:52 [2021-06-11T14:59:52.979Z] !MESSAGE FrameworkEvent ERROR
10:59:52 [2021-06-11T14:59:52.979Z] !STACK 0
10:59:52 [2021-06-11T14:59:52.979Z] org.osgi.framework.BundleException: Could not resolve module: org.eclipse.ecf.provider.filetransfer.httpclient45.win32 [134]
10:59:52 [2021-06-11T14:59:52.979Z]   Unresolved requirement: Require-Capability: eclipse.platform; filter:="(osgi.os=win32)"
10:59:52 [2021-06-11T14:59:52.979Z]   Unresolved requirement: Import-Package: org.apache.http.impl.auth.win; version="[4.5.0,5.0.0)"
10:59:52 [2021-06-11T14:59:52.979Z]     -> Export-Package: org.apache.http.impl.auth.win; bundle-symbolic-name="org.apache.httpcomponents.httpclient.win"; bundle-version="4.5.6.v20190213-1947"; version="4.5.6"; x-internal:="true"; uses:="org.apache.http,org.apache.http.auth,org.apache.http.client,org.apache.http.impl.auth,org.apache.http.protocol,org.apache.http.util"
10:59:52 [2021-06-11T14:59:52.979Z]        org.apache.httpcomponents.httpclient.win [36]
10:59:52 [2021-06-11T14:59:52.979Z]          Unresolved requirement: Require-Capability: eclipse.platform; filter:="(osgi.os=win32)"
10:59:52 [2021-06-11T14:59:52.979Z] 
10:59:52 [2021-06-11T14:59:52.979Z] 	at org.eclipse.osgi.container.Module.start(Module.java:457)
10:59:52 [2021-06-11T14:59:52.979Z] 	at org.eclipse.osgi.container.ModuleContainer$ContainerStartLevel$1.run(ModuleContainer.java:1820)
10:59:52 [2021-06-11T14:59:52.979Z] 	at org.eclipse.osgi.internal.framework.EquinoxContainerAdaptor$2$1.execute(EquinoxContainerAdaptor.java:150)
10:59:52 [2021-06-11T14:59:52.979Z] 	at org.eclipse.osgi.container.ModuleContainer$ContainerStartLevel.incStartLevel(ModuleContainer.java:1813)
10:59:52 [2021-06-11T14:59:52.979Z] 	at org.eclipse.osgi.container.ModuleContainer$ContainerStartLevel.incStartLevel(ModuleContainer.java:1769)
10:59:52 [2021-06-11T14:59:52.979Z] 	at org.eclipse.osgi.container.ModuleContainer$ContainerStartLevel.doContainerStartLevel(ModuleContainer.java:1735)
10:59:52 [2021-06-11T14:59:52.979Z] 	at org.eclipse.osgi.container.ModuleContainer$ContainerStartLevel.dispatchEvent(ModuleContainer.java:1661)
10:59:52 [2021-06-11T14:59:52.979Z] 	at org.eclipse.osgi.container.ModuleContainer$ContainerStartLevel.dispatchEvent(ModuleContainer.java:1)
10:59:52 [2021-06-11T14:59:52.979Z] 	at org.eclipse.osgi.framework.eventmgr.EventManager.dispatchEvent(EventManager.java:234)
10:59:52 [2021-06-11T14:59:52.979Z] 	at org.eclipse.osgi.framework.eventmgr.EventManager$EventThread.run(EventManager.java:345)
10:59:55 [2021-06-11T14:59:55.512Z] SWT SessionManagerDBus: Failed to connect to org.gnome.SessionManager: Failed to execute child process “dbus-launch” (No such file or directory)
10:59:55 [2021-06-11T14:59:55.512Z] SWT SessionManagerDBus: Failed to connect to org.xfce.SessionManager: Failed to execute child process “dbus-launch” (No such file or directory)
11:00:02 [2021-06-11T15:00:02.068Z] SWT WebkitGDBus.java: Lost GDBus name. This should never occur
11:00:03 [2021-06-11T15:00:03.000Z] Running org.eclipse.tracecompass.tmf.chart.ui.tests.data.ChartRangeTest
11:00:03 [2021-06-11T15:00:03.000Z] Tests run: 4, Failures: 0, Errors: 0, Skipped: 0, Time elapsed: 0.084 s - in org.eclipse.tracecompass.tmf.chart.ui.tests.data.ChartRangeTest
11:00:03 [2021-06-11T15:00:03.000Z] testClamp(org.eclipse.tracecompass.tmf.chart.ui.tests.data.ChartRangeTest)  Time elapsed: 0.006 s
11:00:03 [2021-06-11T15:00:03.000Z] testInvalidConstructor(org.eclipse.tracecompass.tmf.chart.ui.tests.data.ChartRangeTest)  Time elapsed: 0 s
11:00:03 [2021-06-11T15:00:03.000Z] testConstructor(org.eclipse.tracecompass.tmf.chart.ui.tests.data.ChartRangeTest)  Time elapsed: 0.001 s
11:00:03 [2021-06-11T15:00:03.000Z] testDefaultConstructor(org.eclipse.tracecompass.tmf.chart.ui.tests.data.ChartRangeTest)  Time elapsed: 0 s
11:00:03 [2021-06-11T15:00:03.000Z] 
11:00:03 [2021-06-11T15:00:03.000Z] Results:
11:00:03 [2021-06-11T15:00:03.000Z] 
11:00:03 [2021-06-11T15:00:03.000Z] Tests run: 4, Failures: 0, Errors: 0, Skipped: 0
11:00:03 [2021-06-11T15:00:03.000Z] 
11:00:04 [2021-06-11T15:00:04.374Z] [INFO] All tests passed!
11:00:04 [2021-06-11T15:00:04.374Z] [INFO] 
11:00:04 [2021-06-11T15:00:04.374Z] [INFO] --- maven-install-plugin:2.5.2:install (default-install) @ org.eclipse.tracecompass.tmf.chart.ui.tests ---
11:00:04 [2021-06-11T15:00:04.374Z] [INFO] Installing /home/jenkins/agent/workspace/tracecompass-master-2019-06/tmf/org.eclipse.tracecompass.tmf.chart.ui.tests/target/org.eclipse.tracecompass.tmf.chart.ui.tests-1.0.2-SNAPSHOT.jar to /home/jenkins/.m2/repository/org/eclipse/tracecompass/org.eclipse.tracecompass.tmf.chart.ui.tests/1.0.2-SNAPSHOT/org.eclipse.tracecompass.tmf.chart.ui.tests-1.0.2-SNAPSHOT.jar
11:00:04 [2021-06-11T15:00:04.374Z] [INFO] Installing /home/jenkins/agent/workspace/tracecompass-master-2019-06/tmf/org.eclipse.tracecompass.tmf.chart.ui.tests/pom.xml to /home/jenkins/.m2/repository/org/eclipse/tracecompass/org.eclipse.tracecompass.tmf.chart.ui.tests/1.0.2-SNAPSHOT/org.eclipse.tracecompass.tmf.chart.ui.tests-1.0.2-SNAPSHOT.pom
11:00:04 [2021-06-11T15:00:04.374Z] [INFO] Installing /home/jenkins/agent/workspace/tracecompass-master-2019-06/tmf/org.eclipse.tracecompass.tmf.chart.ui.tests/target/org.eclipse.tracecompass.tmf.chart.ui.tests-1.0.2-SNAPSHOT-sources.jar to /home/jenkins/.m2/repository/org/eclipse/tracecompass/org.eclipse.tracecompass.tmf.chart.ui.tests/1.0.2-SNAPSHOT/org.eclipse.tracecompass.tmf.chart.ui.tests-1.0.2-SNAPSHOT-sources.jar
11:00:04 [2021-06-11T15:00:04.374Z] [INFO] Installing /home/jenkins/agent/workspace/tracecompass-master-2019-06/tmf/org.eclipse.tracecompass.tmf.chart.ui.tests/target/org.eclipse.tracecompass.tmf.chart.ui.tests-1.0.2-SNAPSHOT.jar.pack.gz to /home/jenkins/.m2/repository/org/eclipse/tracecompass/org.eclipse.tracecompass.tmf.chart.ui.tests/1.0.2-SNAPSHOT/org.eclipse.tracecompass.tmf.chart.ui.tests-1.0.2-SNAPSHOT-pack200.jar.pack.gz
11:00:04 [2021-06-11T15:00:04.374Z] [INFO] Installing /home/jenkins/agent/workspace/tracecompass-master-2019-06/tmf/org.eclipse.tracecompass.tmf.chart.ui.tests/target/p2content.xml to /home/jenkins/.m2/repository/org/eclipse/tracecompass/org.eclipse.tracecompass.tmf.chart.ui.tests/1.0.2-SNAPSHOT/org.eclipse.tracecompass.tmf.chart.ui.tests-1.0.2-SNAPSHOT-p2metadata.xml
11:00:04 [2021-06-11T15:00:04.374Z] [INFO] Installing /home/jenkins/agent/workspace/tracecompass-master-2019-06/tmf/org.eclipse.tracecompass.tmf.chart.ui.tests/target/p2artifacts.xml to /home/jenkins/.m2/repository/org/eclipse/tracecompass/org.eclipse.tracecompass.tmf.chart.ui.tests/1.0.2-SNAPSHOT/org.eclipse.tracecompass.tmf.chart.ui.tests-1.0.2-SNAPSHOT-p2artifacts.xml
11:00:04 [2021-06-11T15:00:04.374Z] [INFO] 
11:00:04 [2021-06-11T15:00:04.374Z] [INFO] --- tycho-p2-plugin:2.3.0:update-local-index (default-update-local-index) @ org.eclipse.tracecompass.tmf.chart.ui.tests ---
11:00:04 [2021-06-11T15:00:04.374Z] [INFO] 
11:00:04 [2021-06-11T15:00:04.374Z] [INFO] --< org.eclipse.tracecompass:org.eclipse.tracecompass.tmf.remote.ui.swtbot.tests >--
11:00:04 [2021-06-11T15:00:04.374Z] [INFO] Building org.eclipse.tracecompass.tmf.remote.ui.swtbot.tests 1.0.9-SNAPSHOT [132/138]
11:00:04 [2021-06-11T15:00:04.374Z] [INFO] ------------------------[ eclipse-test-plugin ]-------------------------
11:00:04 [2021-06-11T15:00:04.374Z] [INFO] 
11:00:04 [2021-06-11T15:00:04.374Z] [INFO] --- maven-clean-plugin:3.0.0:clean (default-clean) @ org.eclipse.tracecompass.tmf.remote.ui.swtbot.tests ---
11:00:04 [2021-06-11T15:00:04.374Z] [INFO] 
11:00:04 [2021-06-11T15:00:04.374Z] [INFO] --- tycho-packaging-plugin:2.3.0:build-qualifier (default-build-qualifier) @ org.eclipse.tracecompass.tmf.remote.ui.swtbot.tests ---
11:00:04 [2021-06-11T15:00:04.374Z] [INFO] The project's OSGi version is 1.0.9.202106111356
11:00:04 [2021-06-11T15:00:04.374Z] [INFO] 
11:00:04 [2021-06-11T15:00:04.374Z] [INFO] --- tycho-packaging-plugin:2.3.0:validate-id (default-validate-id) @ org.eclipse.tracecompass.tmf.remote.ui.swtbot.tests ---
11:00:04 [2021-06-11T15:00:04.374Z] [INFO] 
11:00:04 [2021-06-11T15:00:04.374Z] [INFO] --- tycho-packaging-plugin:2.3.0:validate-version (default-validate-version) @ org.eclipse.tracecompass.tmf.remote.ui.swtbot.tests ---
11:00:04 [2021-06-11T15:00:04.374Z] [INFO] 
11:00:04 [2021-06-11T15:00:04.374Z] [INFO] --- maven-enforcer-plugin:3.0.0-M3:enforce (enforce-maven-version) @ org.eclipse.tracecompass.tmf.remote.ui.swtbot.tests ---
11:00:04 [2021-06-11T15:00:04.374Z] [INFO] 
11:00:04 [2021-06-11T15:00:04.374Z] [INFO] --- maven-resources-plugin:3.0.2:resources (default-resources) @ org.eclipse.tracecompass.tmf.remote.ui.swtbot.tests ---
11:00:04 [2021-06-11T15:00:04.374Z] [INFO] Using 'UTF-8' encoding to copy filtered resources.
11:00:04 [2021-06-11T15:00:04.374Z] [INFO] skip non existing resourceDirectory /home/jenkins/agent/workspace/tracecompass-master-2019-06/tmf/org.eclipse.tracecompass.tmf.remote.ui.swtbot.tests/src/main/resources
11:00:04 [2021-06-11T15:00:04.374Z] [INFO] 
11:00:04 [2021-06-11T15:00:04.374Z] [INFO] --- tycho-compiler-plugin:2.3.0:compile (default-compile) @ org.eclipse.tracecompass.tmf.remote.ui.swtbot.tests ---
11:00:04 [2021-06-11T15:00:04.374Z] [INFO] Compiling 2 source files to /home/jenkins/agent/workspace/tracecompass-master-2019-06/tmf/org.eclipse.tracecompass.tmf.remote.ui.swtbot.tests/target/classes
11:00:04 [2021-06-11T15:00:04.374Z] [INFO] 
11:00:04 [2021-06-11T15:00:04.374Z] [INFO] --- maven-resources-plugin:3.0.2:testResources (default-testResources) @ org.eclipse.tracecompass.tmf.remote.ui.swtbot.tests ---
11:00:04 [2021-06-11T15:00:04.374Z] [INFO] Using 'UTF-8' encoding to copy filtered resources.
11:00:04 [2021-06-11T15:00:04.374Z] [INFO] skip non existing resourceDirectory /home/jenkins/agent/workspace/tracecompass-master-2019-06/tmf/org.eclipse.tracecompass.tmf.remote.ui.swtbot.tests/src/test/resources
11:00:04 [2021-06-11T15:00:04.374Z] [INFO] 
11:00:04 [2021-06-11T15:00:04.374Z] [INFO] --- tycho-source-plugin:2.3.0:plugin-source (plugin-source) @ org.eclipse.tracecompass.tmf.remote.ui.swtbot.tests ---
11:00:04 [2021-06-11T15:00:04.374Z] [INFO] Building jar: /home/jenkins/agent/workspace/tracecompass-master-2019-06/tmf/org.eclipse.tracecompass.tmf.remote.ui.swtbot.tests/target/org.eclipse.tracecompass.tmf.remote.ui.swtbot.tests-1.0.9-SNAPSHOT-sources.jar
11:00:04 [2021-06-11T15:00:04.374Z] [INFO] 
11:00:04 [2021-06-11T15:00:04.374Z] [INFO] --- target-platform-configuration:2.3.0:target-platform (default-target-platform) @ org.eclipse.tracecompass.tmf.remote.ui.swtbot.tests ---
11:00:04 [2021-06-11T15:00:04.374Z] [INFO] 
11:00:04 [2021-06-11T15:00:04.374Z] [INFO] --- tycho-packaging-plugin:2.3.0:package-plugin (default-package-plugin) @ org.eclipse.tracecompass.tmf.remote.ui.swtbot.tests ---
11:00:04 [2021-06-11T15:00:04.374Z] [INFO] Building jar: /home/jenkins/agent/workspace/tracecompass-master-2019-06/tmf/org.eclipse.tracecompass.tmf.remote.ui.swtbot.tests/target/org.eclipse.tracecompass.tmf.remote.ui.swtbot.tests-1.0.9-SNAPSHOT.jar
11:00:04 [2021-06-11T15:00:04.635Z] [INFO] 
11:00:04 [2021-06-11T15:00:04.635Z] [INFO] --- tycho-p2-plugin:2.3.0:p2-metadata-default (default-p2-metadata-default) @ org.eclipse.tracecompass.tmf.remote.ui.swtbot.tests ---
11:00:04 [2021-06-11T15:00:04.635Z] [INFO] 
11:00:04 [2021-06-11T15:00:04.635Z] [INFO] --- tycho-source-feature-plugin:2.3.0:source-feature (source-feature) @ org.eclipse.tracecompass.tmf.remote.ui.swtbot.tests ---
11:00:04 [2021-06-11T15:00:04.635Z] [WARNING] Mojo tycho-source-feature-plugin:source-feature is replaced by the tycho-source-plugin:feature-source which offers equivalent and even enhanced functionality
11:00:04 [2021-06-11T15:00:04.635Z] [INFO] 
11:00:04 [2021-06-11T15:00:04.636Z] [INFO] --- tycho-pack200b-plugin:2.3.0:pack (pack200-pack) @ org.eclipse.tracecompass.tmf.remote.ui.swtbot.tests ---
11:00:04 [2021-06-11T15:00:04.636Z] [WARNING] Pack200 actions are deprecated and scheduled for removal.
11:00:04 [2021-06-11T15:00:04.636Z] [INFO] Pack200 packing jar /home/jenkins/agent/workspace/tracecompass-master-2019-06/tmf/org.eclipse.tracecompass.tmf.remote.ui.swtbot.tests/target/org.eclipse.tracecompass.tmf.remote.ui.swtbot.tests-1.0.9-SNAPSHOT.jar
11:00:04 [2021-06-11T15:00:04.636Z] [INFO] 
11:00:04 [2021-06-11T15:00:04.636Z] [INFO] --- tycho-p2-plugin:2.3.0:p2-metadata (p2-metadata) @ org.eclipse.tracecompass.tmf.remote.ui.swtbot.tests ---
11:00:04 [2021-06-11T15:00:04.636Z] [INFO] 
11:00:04 [2021-06-11T15:00:04.636Z] [INFO] --- tycho-surefire-plugin:2.3.0:test (default-test) @ org.eclipse.tracecompass.tmf.remote.ui.swtbot.tests ---
11:00:04 [2021-06-11T15:00:04.893Z] [INFO] Executing Test Runtime with timeout 0, logs (if any) will be placed at: /home/jenkins/agent/workspace/tracecompass-master-2019-06/tmf/org.eclipse.tracecompass.tmf.remote.ui.swtbot.tests/target/work/data/.metadata/.log
11:00:04 [2021-06-11T15:00:04.893Z] [INFO] Command line:
11:00:04 [2021-06-11T15:00:04.893Z] 	[/opt/tools/java/openjdk/jdk-11/11.0.2+9/bin/java, -Dosgi.noShutdown=false, -Dosgi.os=linux, -Dosgi.ws=gtk, -Dosgi.arch=x86_64, -Dorg.eclipse.swt.browser.DefaultType=mozilla, -Xms512m, -Xmx1024m, -Dosgi.clean=true, -jar, /home/jenkins/.m2/repository/p2/osgi/bundle/org.eclipse.equinox.launcher/1.5.400.v20190515-0925/org.eclipse.equinox.launcher-1.5.400.v20190515-0925.jar, -data, /home/jenkins/agent/workspace/tracecompass-master-2019-06/tmf/org.eclipse.tracecompass.tmf.remote.ui.swtbot.tests/target/work/data, -install, /home/jenkins/agent/workspace/tracecompass-master-2019-06/tmf/org.eclipse.tracecompass.tmf.remote.ui.swtbot.tests/target/work, -configuration, /home/jenkins/agent/workspace/tracecompass-master-2019-06/tmf/org.eclipse.tracecompass.tmf.remote.ui.swtbot.tests/target/work/configuration, -application, org.eclipse.tycho.surefire.osgibooter.uitest, -testproperties, /home/jenkins/agent/workspace/tracecompass-master-2019-06/tmf/org.eclipse.tracecompass.tmf.remote.ui.swtbot.tests/target/surefire.properties, -product, org.eclipse.platform.ide, -nouithread, -consoleLog]
11:00:04 [2021-06-11T15:00:04.893Z] Picked up _JAVA_OPTIONS: -Duser.home=/home/tracecompass
11:00:08 [2021-06-11T15:00:08.170Z] !SESSION 2021-06-11 15:00:05.029 -----------------------------------------------
11:00:08 [2021-06-11T15:00:08.170Z] eclipse.buildId=unknown
11:00:08 [2021-06-11T15:00:08.170Z] java.version=11.0.2
11:00:08 [2021-06-11T15:00:08.170Z] java.vendor=Oracle Corporation
11:00:08 [2021-06-11T15:00:08.170Z] BootLoader constants: OS=linux, ARCH=x86_64, WS=gtk, NL=en_US
11:00:08 [2021-06-11T15:00:08.170Z] Framework arguments:  -application org.eclipse.tycho.surefire.osgibooter.uitest -testproperties /home/jenkins/agent/workspace/tracecompass-master-2019-06/tmf/org.eclipse.tracecompass.tmf.remote.ui.swtbot.tests/target/surefire.properties -product org.eclipse.platform.ide -nouithread
11:00:08 [2021-06-11T15:00:08.170Z] Command-line arguments:  -data /home/jenkins/agent/workspace/tracecompass-master-2019-06/tmf/org.eclipse.tracecompass.tmf.remote.ui.swtbot.tests/target/work/data -application org.eclipse.tycho.surefire.osgibooter.uitest -testproperties /home/jenkins/agent/workspace/tracecompass-master-2019-06/tmf/org.eclipse.tracecompass.tmf.remote.ui.swtbot.tests/target/surefire.properties -product org.eclipse.platform.ide -nouithread -consoleLog
11:00:08 [2021-06-11T15:00:08.170Z] 
11:00:08 [2021-06-11T15:00:08.170Z] !ENTRY org.eclipse.compare.win32 4 0 2021-06-11 15:00:07.630
11:00:08 [2021-06-11T15:00:08.170Z] !MESSAGE FrameworkEvent ERROR
11:00:08 [2021-06-11T15:00:08.170Z] !STACK 0
11:00:08 [2021-06-11T15:00:08.170Z] org.osgi.framework.BundleException: Could not resolve module: org.eclipse.compare.win32 [65]
11:00:08 [2021-06-11T15:00:08.170Z]   Unresolved requirement: Require-Capability: eclipse.platform; filter:="(osgi.os=win32)"
11:00:08 [2021-06-11T15:00:08.170Z] 
11:00:08 [2021-06-11T15:00:08.170Z] 	at org.eclipse.osgi.container.Module.start(Module.java:457)
11:00:08 [2021-06-11T15:00:08.170Z] 	at org.eclipse.osgi.container.ModuleContainer$ContainerStartLevel$1.run(ModuleContainer.java:1820)
11:00:08 [2021-06-11T15:00:08.170Z] 	at org.eclipse.osgi.internal.framework.EquinoxContainerAdaptor$2$1.execute(EquinoxContainerAdaptor.java:150)
11:00:08 [2021-06-11T15:00:08.170Z] 	at org.eclipse.osgi.container.ModuleContainer$ContainerStartLevel.incStartLevel(ModuleContainer.java:1813)
11:00:08 [2021-06-11T15:00:08.170Z] 	at org.eclipse.osgi.container.ModuleContainer$ContainerStartLevel.incStartLevel(ModuleContainer.java:1769)
11:00:08 [2021-06-11T15:00:08.170Z] 	at org.eclipse.osgi.container.ModuleContainer$ContainerStartLevel.doContainerStartLevel(ModuleContainer.java:1735)
11:00:08 [2021-06-11T15:00:08.170Z] 	at org.eclipse.osgi.container.ModuleContainer$ContainerStartLevel.dispatchEvent(ModuleContainer.java:1661)
11:00:08 [2021-06-11T15:00:08.170Z] 	at org.eclipse.osgi.container.ModuleContainer$ContainerStartLevel.dispatchEvent(ModuleContainer.java:1)
11:00:08 [2021-06-11T15:00:08.170Z] 	at org.eclipse.osgi.framework.eventmgr.EventManager.dispatchEvent(EventManager.java:234)
11:00:08 [2021-06-11T15:00:08.170Z] 	at org.eclipse.osgi.framework.eventmgr.EventManager$EventThread.run(EventManager.java:345)
11:00:08 [2021-06-11T15:00:08.170Z] 
11:00:08 [2021-06-11T15:00:08.170Z] !ENTRY org.eclipse.ecf.provider.filetransfer.httpclient45.win32 4 0 2021-06-11 15:00:07.727
11:00:08 [2021-06-11T15:00:08.170Z] !MESSAGE FrameworkEvent ERROR
11:00:08 [2021-06-11T15:00:08.170Z] !STACK 0
11:00:08 [2021-06-11T15:00:08.170Z] org.osgi.framework.BundleException: Could not resolve module: org.eclipse.ecf.provider.filetransfer.httpclient45.win32 [134]
11:00:08 [2021-06-11T15:00:08.170Z]   Unresolved requirement: Require-Capability: eclipse.platform; filter:="(osgi.os=win32)"
11:00:08 [2021-06-11T15:00:08.170Z]   Unresolved requirement: Import-Package: org.apache.http.impl.auth.win; version="[4.5.0,5.0.0)"
11:00:08 [2021-06-11T15:00:08.170Z]     -> Export-Package: org.apache.http.impl.auth.win; bundle-symbolic-name="org.apache.httpcomponents.httpclient.win"; bundle-version="4.5.6.v20190213-1947"; version="4.5.6"; x-internal:="true"; uses:="org.apache.http,org.apache.http.auth,org.apache.http.client,org.apache.http.impl.auth,org.apache.http.protocol,org.apache.http.util"
11:00:08 [2021-06-11T15:00:08.170Z]        org.apache.httpcomponents.httpclient.win [36]
11:00:08 [2021-06-11T15:00:08.170Z]          Unresolved requirement: Require-Capability: eclipse.platform; filter:="(osgi.os=win32)"
11:00:08 [2021-06-11T15:00:08.170Z] 
11:00:08 [2021-06-11T15:00:08.170Z] 	at org.eclipse.osgi.container.Module.start(Module.java:457)
11:00:08 [2021-06-11T15:00:08.170Z] 	at org.eclipse.osgi.container.ModuleContainer$ContainerStartLevel$1.run(ModuleContainer.java:1820)
11:00:08 [2021-06-11T15:00:08.170Z] 	at org.eclipse.osgi.internal.framework.EquinoxContainerAdaptor$2$1.execute(EquinoxContainerAdaptor.java:150)
11:00:08 [2021-06-11T15:00:08.170Z] 	at org.eclipse.osgi.container.ModuleContainer$ContainerStartLevel.incStartLevel(ModuleContainer.java:1813)
11:00:08 [2021-06-11T15:00:08.170Z] 	at org.eclipse.osgi.container.ModuleContainer$ContainerStartLevel.incStartLevel(ModuleContainer.java:1769)
11:00:08 [2021-06-11T15:00:08.170Z] 	at org.eclipse.osgi.container.ModuleContainer$ContainerStartLevel.doContainerStartLevel(ModuleContainer.java:1735)
11:00:08 [2021-06-11T15:00:08.170Z] 	at org.eclipse.osgi.container.ModuleContainer$ContainerStartLevel.dispatchEvent(ModuleContainer.java:1661)
11:00:08 [2021-06-11T15:00:08.170Z] 	at org.eclipse.osgi.container.ModuleContainer$ContainerStartLevel.dispatchEvent(ModuleContainer.java:1)
11:00:08 [2021-06-11T15:00:08.170Z] 	at org.eclipse.osgi.framework.eventmgr.EventManager.dispatchEvent(EventManager.java:234)
11:00:08 [2021-06-11T15:00:08.170Z] 	at org.eclipse.osgi.framework.eventmgr.EventManager$EventThread.run(EventManager.java:345)
11:00:10 [2021-06-11T15:00:10.066Z] SWT SessionManagerDBus: Failed to connect to org.gnome.SessionManager: Failed to execute child process “dbus-launch” (No such file or directory)
11:00:10 [2021-06-11T15:00:10.066Z] SWT SessionManagerDBus: Failed to connect to org.xfce.SessionManager: Failed to execute child process “dbus-launch” (No such file or directory)
11:00:18 [2021-06-11T15:00:18.168Z] SWT WebkitGDBus.java: Lost GDBus name. This should never occur
11:00:18 [2021-06-11T15:00:18.168Z] 
11:00:18 [2021-06-11T15:00:18.168Z] !ENTRY org.eclipse.e4.ui.workbench 2 0 2021-06-11 15:00:16.744
11:00:18 [2021-06-11T15:00:18.169Z] !MESSAGE Removing part descriptor with the 'org.eclipse.tracecompass.tmf.ui.swtbot.tests.views.xychart.stub' id and the 'XY Chart View Stub' description. Points to the invalid 'bundleclass://org.eclipse.ui.workbench/org.eclipse.ui.internal.e4.compatibility.CompatibilityView' class.
11:00:18 [2021-06-11T15:00:18.169Z] Running org.eclipse.tracecompass.tmf.remote.ui.swtbot.tests.fetch.FetchRemoteTracesTest
11:00:18 [2021-06-11T15:00:18.169Z] Display size: 1440x900
11:00:18 [2021-06-11T15:00:18.169Z] OS version=5.10.19-200.fc33.x86_64
11:00:18 [2021-06-11T15:00:18.169Z] GTK version=3.22.30
11:00:18 [2021-06-11T15:00:18.169Z] GTK theme=Ambiance
11:00:18 [2021-06-11T15:00:18.169Z] LIBOVERLAY_SCROLLBAR=0
11:00:18 [2021-06-11T15:00:18.169Z] Time zone: Greenwich Mean Time
11:00:18 [2021-06-11T15:00:18.169Z] log4j:WARN No appenders could be found for logger (org.eclipse.swtbot.swt.finder.widgets.SWTBotShell).
11:00:18 [2021-06-11T15:00:18.169Z] log4j:WARN Please initialize the log4j system properly.
11:00:23 [2021-06-11T15:00:23.431Z] *** BUG ***
11:00:23 [2021-06-11T15:00:23.431Z] In pixman_region32_init_rect: Invalid rectangle passed
11:00:23 [2021-06-11T15:00:23.431Z] Set a breakpoint on '_pixman_log_error' to debug
11:00:23 [2021-06-11T15:00:23.431Z] 
11:00:23 [2021-06-11T15:00:23.431Z] *** BUG ***
11:00:23 [2021-06-11T15:00:23.431Z] In pixman_region32_init_rect: Invalid rectangle passed
11:00:23 [2021-06-11T15:00:23.431Z] Set a breakpoint on '_pixman_log_error' to debug
11:00:23 [2021-06-11T15:00:23.431Z] 
11:00:23 [2021-06-11T15:00:23.431Z] *** BUG ***
11:00:23 [2021-06-11T15:00:23.431Z] In pixman_region32_init_rect: Invalid rectangle passed
11:00:23 [2021-06-11T15:00:23.431Z] Set a breakpoint on '_pixman_log_error' to debug
11:00:23 [2021-06-11T15:00:23.431Z] 
11:01:44 [2021-06-11T15:01:44.859Z] 
11:01:44 [2021-06-11T15:01:44.859Z] !ENTRY org.eclipse.tracecompass.tmf.ui 4 0 2021-06-11 15:01:38.714
11:01:44 [2021-06-11T15:01:44.859Z] !MESSAGE Error connection to node 'ssh://anonymous@unknown.unknown.unknown'
11:01:44 [2021-06-11T15:01:44.859Z] !STACK 0
11:01:44 [2021-06-11T15:01:44.859Z] org.eclipse.core.commands.ExecutionException: Cannot connect Unknown
11:01:44 [2021-06-11T15:01:44.859Z] 	at org.eclipse.tracecompass.tmf.remote.core.proxy.RemoteSystemProxy.connect(RemoteSystemProxy.java:90)
11:01:44 [2021-06-11T15:01:44.859Z] 	at org.eclipse.tracecompass.internal.tmf.remote.ui.wizards.fetch.model.RemoteImportConnectionNodeElement.connect(RemoteImportConnectionNodeElement.java:143)
11:01:44 [2021-06-11T15:01:44.859Z] 	at org.eclipse.tracecompass.internal.tmf.remote.ui.wizards.fetch.RemoteFetchLogWizardRemotePage$6.run(RemoteFetchLogWizardRemotePage.java:392)
11:01:44 [2021-06-11T15:01:44.859Z] 	at org.eclipse.jface.operation.ModalContext$ModalContextThread.run(ModalContext.java:122)
11:01:44 [2021-06-11T15:01:44.859Z] Caused by: org.eclipse.remote.core.exception.RemoteConnectionException: Session.connect: java.net.UnknownHostException: unknown.unknown.unknown
11:01:44 [2021-06-11T15:01:44.859Z] 	at org.eclipse.remote.internal.jsch.core.JSchConnection.newSession(JSchConnection.java:803)
11:01:44 [2021-06-11T15:01:44.859Z] 	at org.eclipse.remote.internal.jsch.core.JSchConnection.open(JSchConnection.java:841)
11:01:44 [2021-06-11T15:01:44.859Z] 	at org.eclipse.remote.internal.jsch.core.JSchConnection.open(JSchConnection.java:814)
11:01:44 [2021-06-11T15:01:44.859Z] 	at org.eclipse.remote.internal.core.RemoteConnection.open(RemoteConnection.java:208)
11:01:44 [2021-06-11T15:01:44.859Z] 	at org.eclipse.tracecompass.tmf.remote.core.proxy.RemoteSystemProxy.connect(RemoteSystemProxy.java:86)
11:01:44 [2021-06-11T15:01:44.859Z] 	... 3 more
11:01:44 [2021-06-11T15:01:44.859Z] *** BUG ***
11:01:44 [2021-06-11T15:01:44.859Z] In pixman_region32_init_rect: Invalid rectangle passed
11:01:44 [2021-06-11T15:01:44.859Z] Set a breakpoint on '_pixman_log_error' to debug
11:01:44 [2021-06-11T15:01:44.859Z] 
11:01:44 [2021-06-11T15:01:44.859Z] *** BUG ***
11:01:44 [2021-06-11T15:01:44.859Z] In pixman_region32_init_rect: Invalid rectangle passed
11:01:44 [2021-06-11T15:01:44.859Z] Set a breakpoint on '_pixman_log_error' to debug
11:01:44 [2021-06-11T15:01:44.859Z] 
11:01:44 [2021-06-11T15:01:44.859Z] *** BUG ***
11:01:44 [2021-06-11T15:01:44.859Z] In pixman_region32_init_rect: Invalid rectangle passed
11:01:44 [2021-06-11T15:01:44.859Z] Set a breakpoint on '_pixman_log_error' to debug
11:01:44 [2021-06-11T15:01:44.859Z] 
11:01:46 [2021-06-11T15:01:46.236Z] *** BUG ***
11:01:46 [2021-06-11T15:01:46.237Z] In pixman_region32_init_rect: Invalid rectangle passed
11:01:46 [2021-06-11T15:01:46.237Z] Set a breakpoint on '_pixman_log_error' to debug
11:01:46 [2021-06-11T15:01:46.237Z] 
11:01:46 [2021-06-11T15:01:46.237Z] *** BUG ***
11:01:46 [2021-06-11T15:01:46.237Z] In pixman_region32_init_rect: Invalid rectangle passed
11:01:46 [2021-06-11T15:01:46.237Z] Set a breakpoint on '_pixman_log_error' to debug
11:01:46 [2021-06-11T15:01:46.237Z] 
11:01:46 [2021-06-11T15:01:46.237Z] *** BUG ***
11:01:46 [2021-06-11T15:01:46.237Z] In pixman_region32_init_rect: Invalid rectangle passed
11:01:46 [2021-06-11T15:01:46.237Z] Set a breakpoint on '_pixman_log_error' to debug
11:01:46 [2021-06-11T15:01:46.237Z] 
11:01:50 [2021-06-11T15:01:50.425Z] *** BUG ***
11:01:50 [2021-06-11T15:01:50.425Z] In pixman_region32_init_rect: Invalid rectangle passed
11:01:50 [2021-06-11T15:01:50.425Z] Set a breakpoint on '_pixman_log_error' to debug
11:01:50 [2021-06-11T15:01:50.425Z] 
11:02:00 [2021-06-11T15:02:00.395Z] Tests run: 20, Failures: 0, Errors: 0, Skipped: 1, Time elapsed: 101.402 s - in org.eclipse.tracecompass.tmf.remote.ui.swtbot.tests.fetch.FetchRemoteTracesTest
11:02:00 [2021-06-11T15:02:00.395Z] testImportNothing(org.eclipse.tracecompass.tmf.remote.ui.swtbot.tests.fetch.FetchRemoteTracesTest)  Time elapsed: 6.613 s
11:02:00 [2021-06-11T15:02:00.395Z] test_7_03(org.eclipse.tracecompass.tmf.remote.ui.swtbot.tests.fetch.FetchRemoteTracesTest)  Time elapsed: 2.605 s
11:02:00 [2021-06-11T15:02:00.395Z] test_8_04(org.eclipse.tracecompass.tmf.remote.ui.swtbot.tests.fetch.FetchRemoteTracesTest)  Time elapsed: 6.507 s
11:02:00 [2021-06-11T15:02:00.395Z] test_8_05(org.eclipse.tracecompass.tmf.remote.ui.swtbot.tests.fetch.FetchRemoteTracesTest)  Time elapsed: 14.779 s
11:02:00 [2021-06-11T15:02:00.395Z] test_8_06(org.eclipse.tracecompass.tmf.remote.ui.swtbot.tests.fetch.FetchRemoteTracesTest)  Time elapsed: 6.106 s
11:02:00 [2021-06-11T15:02:00.395Z] test_8_07(org.eclipse.tracecompass.tmf.remote.ui.swtbot.tests.fetch.FetchRemoteTracesTest)  Time elapsed: 6.196 s
11:02:00 [2021-06-11T15:02:00.395Z] test_8_08(org.eclipse.tracecompass.tmf.remote.ui.swtbot.tests.fetch.FetchRemoteTracesTest)  Time elapsed: 5.783 s
11:02:00 [2021-06-11T15:02:00.395Z] test_8_09(org.eclipse.tracecompass.tmf.remote.ui.swtbot.tests.fetch.FetchRemoteTracesTest)  Time elapsed: 4.434 s
11:02:00 [2021-06-11T15:02:00.395Z] test_8_10(org.eclipse.tracecompass.tmf.remote.ui.swtbot.tests.fetch.FetchRemoteTracesTest)  Time elapsed: 3.501 s
11:02:00 [2021-06-11T15:02:00.395Z] test_8_11(org.eclipse.tracecompass.tmf.remote.ui.swtbot.tests.fetch.FetchRemoteTracesTest)  Time elapsed: 4.476 s
11:02:00 [2021-06-11T15:02:00.395Z] test_8_12(org.eclipse.tracecompass.tmf.remote.ui.swtbot.tests.fetch.FetchRemoteTracesTest)  Time elapsed: 3.529 s
11:02:00 [2021-06-11T15:02:00.395Z] test_8_13(org.eclipse.tracecompass.tmf.remote.ui.swtbot.tests.fetch.FetchRemoteTracesTest)  Time elapsed: 4.496 s
11:02:00 [2021-06-11T15:02:00.395Z] test_8_14(org.eclipse.tracecompass.tmf.remote.ui.swtbot.tests.fetch.FetchRemoteTracesTest)  Time elapsed: 2.889 s
11:02:00 [2021-06-11T15:02:00.395Z] test_8_15(org.eclipse.tracecompass.tmf.remote.ui.swtbot.tests.fetch.FetchRemoteTracesTest)  Time elapsed: 4.48 s
11:02:00 [2021-06-11T15:02:00.395Z] test_9_01(org.eclipse.tracecompass.tmf.remote.ui.swtbot.tests.fetch.FetchRemoteTracesTest)  Time elapsed: 2.694 s
11:02:00 [2021-06-11T15:02:00.395Z] test_9_02(org.eclipse.tracecompass.tmf.remote.ui.swtbot.tests.fetch.FetchRemoteTracesTest) skipped
11:02:00 [2021-06-11T15:02:00.395Z] testImportOnlyOne(org.eclipse.tracecompass.tmf.remote.ui.swtbot.tests.fetch.FetchRemoteTracesTest)  Time elapsed: 4.587 s
11:02:00 [2021-06-11T15:02:00.395Z] testEmptyFile(org.eclipse.tracecompass.tmf.remote.ui.swtbot.tests.fetch.FetchRemoteTracesTest)  Time elapsed: 3.537 s
11:02:00 [2021-06-11T15:02:00.395Z] testImportAll(org.eclipse.tracecompass.tmf.remote.ui.swtbot.tests.fetch.FetchRemoteTracesTest)  Time elapsed: 7.177 s
11:02:00 [2021-06-11T15:02:00.395Z] testEditProfile(org.eclipse.tracecompass.tmf.remote.ui.swtbot.tests.fetch.FetchRemoteTracesTest)  Time elapsed: 2.504 s
11:02:00 [2021-06-11T15:02:00.395Z] 
11:02:00 [2021-06-11T15:02:00.395Z] Results:
11:02:00 [2021-06-11T15:02:00.395Z] 
11:02:00 [2021-06-11T15:02:00.395Z] Tests run: 20, Failures: 0, Errors: 0, Skipped: 1
11:02:00 [2021-06-11T15:02:00.395Z] 
11:02:00 [2021-06-11T15:02:00.395Z] 
11:02:00 [2021-06-11T15:02:00.395Z] !ENTRY org.eclipse.core.resources 2 10035 2021-06-11 15:01:59.069
11:02:00 [2021-06-11T15:02:00.395Z] !MESSAGE The workspace will exit with unsaved changes in this session.
11:02:00 [2021-06-11T15:02:00.395Z] [INFO] All tests passed!
11:02:00 [2021-06-11T15:02:00.395Z] [INFO] 
11:02:00 [2021-06-11T15:02:00.395Z] [INFO] --- maven-install-plugin:2.5.2:install (default-install) @ org.eclipse.tracecompass.tmf.remote.ui.swtbot.tests ---
11:02:00 [2021-06-11T15:02:00.395Z] [INFO] Installing /home/jenkins/agent/workspace/tracecompass-master-2019-06/tmf/org.eclipse.tracecompass.tmf.remote.ui.swtbot.tests/target/org.eclipse.tracecompass.tmf.remote.ui.swtbot.tests-1.0.9-SNAPSHOT.jar to /home/jenkins/.m2/repository/org/eclipse/tracecompass/org.eclipse.tracecompass.tmf.remote.ui.swtbot.tests/1.0.9-SNAPSHOT/org.eclipse.tracecompass.tmf.remote.ui.swtbot.tests-1.0.9-SNAPSHOT.jar
11:02:00 [2021-06-11T15:02:00.395Z] [INFO] Installing /home/jenkins/agent/workspace/tracecompass-master-2019-06/tmf/org.eclipse.tracecompass.tmf.remote.ui.swtbot.tests/pom.xml to /home/jenkins/.m2/repository/org/eclipse/tracecompass/org.eclipse.tracecompass.tmf.remote.ui.swtbot.tests/1.0.9-SNAPSHOT/org.eclipse.tracecompass.tmf.remote.ui.swtbot.tests-1.0.9-SNAPSHOT.pom
11:02:00 [2021-06-11T15:02:00.395Z] [INFO] Installing /home/jenkins/agent/workspace/tracecompass-master-2019-06/tmf/org.eclipse.tracecompass.tmf.remote.ui.swtbot.tests/target/org.eclipse.tracecompass.tmf.remote.ui.swtbot.tests-1.0.9-SNAPSHOT-sources.jar to /home/jenkins/.m2/repository/org/eclipse/tracecompass/org.eclipse.tracecompass.tmf.remote.ui.swtbot.tests/1.0.9-SNAPSHOT/org.eclipse.tracecompass.tmf.remote.ui.swtbot.tests-1.0.9-SNAPSHOT-sources.jar
11:02:00 [2021-06-11T15:02:00.395Z] [INFO] Installing /home/jenkins/agent/workspace/tracecompass-master-2019-06/tmf/org.eclipse.tracecompass.tmf.remote.ui.swtbot.tests/target/org.eclipse.tracecompass.tmf.remote.ui.swtbot.tests-1.0.9-SNAPSHOT.jar.pack.gz to /home/jenkins/.m2/repository/org/eclipse/tracecompass/org.eclipse.tracecompass.tmf.remote.ui.swtbot.tests/1.0.9-SNAPSHOT/org.eclipse.tracecompass.tmf.remote.ui.swtbot.tests-1.0.9-SNAPSHOT-pack200.jar.pack.gz
11:02:00 [2021-06-11T15:02:00.395Z] [INFO] Installing /home/jenkins/agent/workspace/tracecompass-master-2019-06/tmf/org.eclipse.tracecompass.tmf.remote.ui.swtbot.tests/target/p2content.xml to /home/jenkins/.m2/repository/org/eclipse/tracecompass/org.eclipse.tracecompass.tmf.remote.ui.swtbot.tests/1.0.9-SNAPSHOT/org.eclipse.tracecompass.tmf.remote.ui.swtbot.tests-1.0.9-SNAPSHOT-p2metadata.xml
11:02:00 [2021-06-11T15:02:00.395Z] [INFO] Installing /home/jenkins/agent/workspace/tracecompass-master-2019-06/tmf/org.eclipse.tracecompass.tmf.remote.ui.swtbot.tests/target/p2artifacts.xml to /home/jenkins/.m2/repository/org/eclipse/tracecompass/org.eclipse.tracecompass.tmf.remote.ui.swtbot.tests/1.0.9-SNAPSHOT/org.eclipse.tracecompass.tmf.remote.ui.swtbot.tests-1.0.9-SNAPSHOT-p2artifacts.xml
11:02:00 [2021-06-11T15:02:00.395Z] [INFO] 
11:02:00 [2021-06-11T15:02:00.395Z] [INFO] --- tycho-p2-plugin:2.3.0:update-local-index (default-update-local-index) @ org.eclipse.tracecompass.tmf.remote.ui.swtbot.tests ---
11:02:00 [2021-06-11T15:02:00.395Z] [INFO] 
11:02:00 [2021-06-11T15:02:00.395Z] [INFO] --< org.eclipse.tracecompass:org.eclipse.tracecompass.tmf.remote.ui.tests >--
11:02:00 [2021-06-11T15:02:00.395Z] [INFO] Building org.eclipse.tracecompass.tmf.remote.ui.tests 1.0.2-SNAPSHOT [133/138]
11:02:00 [2021-06-11T15:02:00.395Z] [INFO] ------------------------[ eclipse-test-plugin ]-------------------------
11:02:00 [2021-06-11T15:02:00.395Z] [INFO] 
11:02:00 [2021-06-11T15:02:00.395Z] [INFO] --- maven-clean-plugin:3.0.0:clean (default-clean) @ org.eclipse.tracecompass.tmf.remote.ui.tests ---
11:02:00 [2021-06-11T15:02:00.395Z] [INFO] 
11:02:00 [2021-06-11T15:02:00.395Z] [INFO] --- tycho-packaging-plugin:2.3.0:build-qualifier (default-build-qualifier) @ org.eclipse.tracecompass.tmf.remote.ui.tests ---
11:02:00 [2021-06-11T15:02:00.395Z] [INFO] The project's OSGi version is 1.0.2.202106111356
11:02:00 [2021-06-11T15:02:00.395Z] [INFO] 
11:02:00 [2021-06-11T15:02:00.395Z] [INFO] --- tycho-packaging-plugin:2.3.0:validate-id (default-validate-id) @ org.eclipse.tracecompass.tmf.remote.ui.tests ---
11:02:00 [2021-06-11T15:02:00.395Z] [INFO] 
11:02:00 [2021-06-11T15:02:00.395Z] [INFO] --- tycho-packaging-plugin:2.3.0:validate-version (default-validate-version) @ org.eclipse.tracecompass.tmf.remote.ui.tests ---
11:02:00 [2021-06-11T15:02:00.395Z] [INFO] 
11:02:00 [2021-06-11T15:02:00.395Z] [INFO] --- maven-enforcer-plugin:3.0.0-M3:enforce (enforce-maven-version) @ org.eclipse.tracecompass.tmf.remote.ui.tests ---
11:02:00 [2021-06-11T15:02:00.395Z] [INFO] 
11:02:00 [2021-06-11T15:02:00.395Z] [INFO] --- maven-resources-plugin:3.0.2:resources (default-resources) @ org.eclipse.tracecompass.tmf.remote.ui.tests ---
11:02:00 [2021-06-11T15:02:00.395Z] [INFO] Using 'UTF-8' encoding to copy filtered resources.
11:02:00 [2021-06-11T15:02:00.395Z] [INFO] skip non existing resourceDirectory /home/jenkins/agent/workspace/tracecompass-master-2019-06/tmf/org.eclipse.tracecompass.tmf.remote.ui.tests/src/main/resources
11:02:00 [2021-06-11T15:02:00.395Z] [INFO] 
11:02:00 [2021-06-11T15:02:00.395Z] [INFO] --- tycho-compiler-plugin:2.3.0:compile (default-compile) @ org.eclipse.tracecompass.tmf.remote.ui.tests ---
11:02:00 [2021-06-11T15:02:00.395Z] [INFO] Compiling 4 source files to /home/jenkins/agent/workspace/tracecompass-master-2019-06/tmf/org.eclipse.tracecompass.tmf.remote.ui.tests/target/classes
11:02:00 [2021-06-11T15:02:00.395Z] [INFO] 
11:02:00 [2021-06-11T15:02:00.395Z] [INFO] --- maven-resources-plugin:3.0.2:testResources (default-testResources) @ org.eclipse.tracecompass.tmf.remote.ui.tests ---
11:02:00 [2021-06-11T15:02:00.395Z] [INFO] Using 'UTF-8' encoding to copy filtered resources.
11:02:00 [2021-06-11T15:02:00.395Z] [INFO] skip non existing resourceDirectory /home/jenkins/agent/workspace/tracecompass-master-2019-06/tmf/org.eclipse.tracecompass.tmf.remote.ui.tests/src/test/resources
11:02:00 [2021-06-11T15:02:00.395Z] [INFO] 
11:02:00 [2021-06-11T15:02:00.395Z] [INFO] --- tycho-source-plugin:2.3.0:plugin-source (plugin-source) @ org.eclipse.tracecompass.tmf.remote.ui.tests ---
11:02:00 [2021-06-11T15:02:00.395Z] [INFO] Building jar: /home/jenkins/agent/workspace/tracecompass-master-2019-06/tmf/org.eclipse.tracecompass.tmf.remote.ui.tests/target/org.eclipse.tracecompass.tmf.remote.ui.tests-1.0.2-SNAPSHOT-sources.jar
11:02:00 [2021-06-11T15:02:00.395Z] [INFO] 
11:02:00 [2021-06-11T15:02:00.395Z] [INFO] --- target-platform-configuration:2.3.0:target-platform (default-target-platform) @ org.eclipse.tracecompass.tmf.remote.ui.tests ---
11:02:00 [2021-06-11T15:02:00.395Z] [INFO] 
11:02:00 [2021-06-11T15:02:00.395Z] [INFO] --- tycho-packaging-plugin:2.3.0:package-plugin (default-package-plugin) @ org.eclipse.tracecompass.tmf.remote.ui.tests ---
11:02:00 [2021-06-11T15:02:00.395Z] [INFO] Building jar: /home/jenkins/agent/workspace/tracecompass-master-2019-06/tmf/org.eclipse.tracecompass.tmf.remote.ui.tests/target/org.eclipse.tracecompass.tmf.remote.ui.tests-1.0.2-SNAPSHOT.jar
11:02:00 [2021-06-11T15:02:00.395Z] [INFO] 
11:02:00 [2021-06-11T15:02:00.395Z] [INFO] --- tycho-p2-plugin:2.3.0:p2-metadata-default (default-p2-metadata-default) @ org.eclipse.tracecompass.tmf.remote.ui.tests ---
11:02:00 [2021-06-11T15:02:00.395Z] [INFO] 
11:02:00 [2021-06-11T15:02:00.395Z] [INFO] --- tycho-source-feature-plugin:2.3.0:source-feature (source-feature) @ org.eclipse.tracecompass.tmf.remote.ui.tests ---
11:02:00 [2021-06-11T15:02:00.395Z] [WARNING] Mojo tycho-source-feature-plugin:source-feature is replaced by the tycho-source-plugin:feature-source which offers equivalent and even enhanced functionality
11:02:00 [2021-06-11T15:02:00.395Z] [INFO] 
11:02:00 [2021-06-11T15:02:00.395Z] [INFO] --- tycho-pack200b-plugin:2.3.0:pack (pack200-pack) @ org.eclipse.tracecompass.tmf.remote.ui.tests ---
11:02:00 [2021-06-11T15:02:00.395Z] [WARNING] Pack200 actions are deprecated and scheduled for removal.
11:02:00 [2021-06-11T15:02:00.395Z] [INFO] Pack200 packing jar /home/jenkins/agent/workspace/tracecompass-master-2019-06/tmf/org.eclipse.tracecompass.tmf.remote.ui.tests/target/org.eclipse.tracecompass.tmf.remote.ui.tests-1.0.2-SNAPSHOT.jar
11:02:00 [2021-06-11T15:02:00.395Z] [INFO] 
11:02:00 [2021-06-11T15:02:00.396Z] [INFO] --- tycho-p2-plugin:2.3.0:p2-metadata (p2-metadata) @ org.eclipse.tracecompass.tmf.remote.ui.tests ---
11:02:00 [2021-06-11T15:02:00.396Z] [INFO] 
11:02:00 [2021-06-11T15:02:00.396Z] [INFO] --- tycho-surefire-plugin:2.3.0:test (default-test) @ org.eclipse.tracecompass.tmf.remote.ui.tests ---
11:02:00 [2021-06-11T15:02:00.396Z] [INFO] Executing Test Runtime with timeout 0, logs (if any) will be placed at: /home/jenkins/agent/workspace/tracecompass-master-2019-06/tmf/org.eclipse.tracecompass.tmf.remote.ui.tests/target/work/data/.metadata/.log
11:02:00 [2021-06-11T15:02:00.396Z] [INFO] Command line:
11:02:00 [2021-06-11T15:02:00.396Z] 	[/opt/tools/java/openjdk/jdk-11/11.0.2+9/bin/java, -Dosgi.noShutdown=false, -Dosgi.os=linux, -Dosgi.ws=gtk, -Dosgi.arch=x86_64, -Dorg.eclipse.swt.browser.DefaultType=mozilla, -Xms512m, -Xmx1024m, -Dosgi.clean=true, -jar, /home/jenkins/.m2/repository/p2/osgi/bundle/org.eclipse.equinox.launcher/1.5.400.v20190515-0925/org.eclipse.equinox.launcher-1.5.400.v20190515-0925.jar, -data, /home/jenkins/agent/workspace/tracecompass-master-2019-06/tmf/org.eclipse.tracecompass.tmf.remote.ui.tests/target/work/data, -install, /home/jenkins/agent/workspace/tracecompass-master-2019-06/tmf/org.eclipse.tracecompass.tmf.remote.ui.tests/target/work, -configuration, /home/jenkins/agent/workspace/tracecompass-master-2019-06/tmf/org.eclipse.tracecompass.tmf.remote.ui.tests/target/work/configuration, -application, org.eclipse.tycho.surefire.osgibooter.uitest, -testproperties, /home/jenkins/agent/workspace/tracecompass-master-2019-06/tmf/org.eclipse.tracecompass.tmf.remote.ui.tests/target/surefire.properties, -product, org.eclipse.platform.ide, -consoleLog]
11:02:00 [2021-06-11T15:02:00.396Z] Picked up _JAVA_OPTIONS: -Duser.home=/home/tracecompass
11:02:02 [2021-06-11T15:02:02.932Z] !SESSION 2021-06-11 15:02:00.326 -----------------------------------------------
11:02:02 [2021-06-11T15:02:02.932Z] eclipse.buildId=unknown
11:02:02 [2021-06-11T15:02:02.932Z] java.version=11.0.2
11:02:02 [2021-06-11T15:02:02.932Z] java.vendor=Oracle Corporation
11:02:02 [2021-06-11T15:02:02.932Z] BootLoader constants: OS=linux, ARCH=x86_64, WS=gtk, NL=en_US
11:02:02 [2021-06-11T15:02:02.932Z] Framework arguments:  -application org.eclipse.tycho.surefire.osgibooter.uitest -testproperties /home/jenkins/agent/workspace/tracecompass-master-2019-06/tmf/org.eclipse.tracecompass.tmf.remote.ui.tests/target/surefire.properties -product org.eclipse.platform.ide
11:02:02 [2021-06-11T15:02:02.932Z] Command-line arguments:  -data /home/jenkins/agent/workspace/tracecompass-master-2019-06/tmf/org.eclipse.tracecompass.tmf.remote.ui.tests/target/work/data -application org.eclipse.tycho.surefire.osgibooter.uitest -testproperties /home/jenkins/agent/workspace/tracecompass-master-2019-06/tmf/org.eclipse.tracecompass.tmf.remote.ui.tests/target/surefire.properties -product org.eclipse.platform.ide -consoleLog
11:02:02 [2021-06-11T15:02:02.932Z] 
11:02:02 [2021-06-11T15:02:02.932Z] !ENTRY org.eclipse.compare.win32 4 0 2021-06-11 15:02:02.754
11:02:02 [2021-06-11T15:02:02.932Z] !MESSAGE FrameworkEvent ERROR
11:02:02 [2021-06-11T15:02:02.932Z] !STACK 0
11:02:02 [2021-06-11T15:02:02.932Z] org.osgi.framework.BundleException: Could not resolve module: org.eclipse.compare.win32 [65]
11:02:02 [2021-06-11T15:02:02.932Z]   Unresolved requirement: Require-Capability: eclipse.platform; filter:="(osgi.os=win32)"
11:02:02 [2021-06-11T15:02:02.932Z] 
11:02:02 [2021-06-11T15:02:02.932Z] 	at org.eclipse.osgi.container.Module.start(Module.java:457)
11:02:02 [2021-06-11T15:02:02.932Z] 	at org.eclipse.osgi.container.ModuleContainer$ContainerStartLevel$1.run(ModuleContainer.java:1820)
11:02:02 [2021-06-11T15:02:02.932Z] 	at org.eclipse.osgi.internal.framework.EquinoxContainerAdaptor$2$1.execute(EquinoxContainerAdaptor.java:150)
11:02:02 [2021-06-11T15:02:02.932Z] 	at org.eclipse.osgi.container.ModuleContainer$ContainerStartLevel.incStartLevel(ModuleContainer.java:1813)
11:02:02 [2021-06-11T15:02:02.932Z] 	at org.eclipse.osgi.container.ModuleContainer$ContainerStartLevel.incStartLevel(ModuleContainer.java:1769)
11:02:02 [2021-06-11T15:02:02.932Z] 	at org.eclipse.osgi.container.ModuleContainer$ContainerStartLevel.doContainerStartLevel(ModuleContainer.java:1735)
11:02:02 [2021-06-11T15:02:02.932Z] 	at org.eclipse.osgi.container.ModuleContainer$ContainerStartLevel.dispatchEvent(ModuleContainer.java:1661)
11:02:02 [2021-06-11T15:02:02.932Z] 	at org.eclipse.osgi.container.ModuleContainer$ContainerStartLevel.dispatchEvent(ModuleContainer.java:1)
11:02:02 [2021-06-11T15:02:02.932Z] 	at org.eclipse.osgi.framework.eventmgr.EventManager.dispatchEvent(EventManager.java:234)
11:02:02 [2021-06-11T15:02:02.932Z] 	at org.eclipse.osgi.framework.eventmgr.EventManager$EventThread.run(EventManager.java:345)
11:02:02 [2021-06-11T15:02:02.932Z] 
11:02:02 [2021-06-11T15:02:02.932Z] !ENTRY org.eclipse.ecf.provider.filetransfer.httpclient45.win32 4 0 2021-06-11 15:02:02.863
11:02:02 [2021-06-11T15:02:02.932Z] !MESSAGE FrameworkEvent ERROR
11:02:02 [2021-06-11T15:02:02.932Z] !STACK 0
11:02:02 [2021-06-11T15:02:02.932Z] org.osgi.framework.BundleException: Could not resolve module: org.eclipse.ecf.provider.filetransfer.httpclient45.win32 [134]
11:02:02 [2021-06-11T15:02:02.932Z]   Unresolved requirement: Require-Capability: eclipse.platform; filter:="(osgi.os=win32)"
11:02:02 [2021-06-11T15:02:02.932Z]   Unresolved requirement: Import-Package: org.apache.http.impl.auth.win; version="[4.5.0,5.0.0)"
11:02:02 [2021-06-11T15:02:02.932Z]     -> Export-Package: org.apache.http.impl.auth.win; bundle-symbolic-name="org.apache.httpcomponents.httpclient.win"; bundle-version="4.5.6.v20190213-1947"; version="4.5.6"; x-internal:="true"; uses:="org.apache.http,org.apache.http.auth,org.apache.http.client,org.apache.http.impl.auth,org.apache.http.protocol,org.apache.http.util"
11:02:02 [2021-06-11T15:02:02.932Z]        org.apache.httpcomponents.httpclient.win [36]
11:02:02 [2021-06-11T15:02:02.932Z]          Unresolved requirement: Require-Capability: eclipse.platform; filter:="(osgi.os=win32)"
11:02:02 [2021-06-11T15:02:02.932Z] 
11:02:02 [2021-06-11T15:02:02.932Z] 	at org.eclipse.osgi.container.Module.start(Module.java:457)
11:02:02 [2021-06-11T15:02:02.932Z] 	at org.eclipse.osgi.container.ModuleContainer$ContainerStartLevel$1.run(ModuleContainer.java:1820)
11:02:02 [2021-06-11T15:02:02.932Z] 	at org.eclipse.osgi.internal.framework.EquinoxContainerAdaptor$2$1.execute(EquinoxContainerAdaptor.java:150)
11:02:02 [2021-06-11T15:02:02.932Z] 	at org.eclipse.osgi.container.ModuleContainer$ContainerStartLevel.incStartLevel(ModuleContainer.java:1813)
11:02:02 [2021-06-11T15:02:02.932Z] 	at org.eclipse.osgi.container.ModuleContainer$ContainerStartLevel.incStartLevel(ModuleContainer.java:1769)
11:02:02 [2021-06-11T15:02:02.932Z] 	at org.eclipse.osgi.container.ModuleContainer$ContainerStartLevel.doContainerStartLevel(ModuleContainer.java:1735)
11:02:02 [2021-06-11T15:02:02.932Z] 	at org.eclipse.osgi.container.ModuleContainer$ContainerStartLevel.dispatchEvent(ModuleContainer.java:1661)
11:02:02 [2021-06-11T15:02:02.932Z] 	at org.eclipse.osgi.container.ModuleContainer$ContainerStartLevel.dispatchEvent(ModuleContainer.java:1)
11:02:02 [2021-06-11T15:02:02.932Z] 	at org.eclipse.osgi.framework.eventmgr.EventManager.dispatchEvent(EventManager.java:234)
11:02:02 [2021-06-11T15:02:02.932Z] 	at org.eclipse.osgi.framework.eventmgr.EventManager$EventThread.run(EventManager.java:345)
11:02:04 [2021-06-11T15:02:04.832Z] SWT SessionManagerDBus: Failed to connect to org.gnome.SessionManager: Failed to execute child process “dbus-launch” (No such file or directory)
11:02:04 [2021-06-11T15:02:04.832Z] SWT SessionManagerDBus: Failed to connect to org.xfce.SessionManager: Failed to execute child process “dbus-launch” (No such file or directory)
11:02:10 [2021-06-11T15:02:10.094Z] SWT WebkitGDBus.java: Lost GDBus name. This should never occur
11:02:11 [2021-06-11T15:02:11.030Z] Running org.eclipse.tracecompass.tmf.remote.ui.tests.fetch.RemoteImportProfilesReaderTest
11:02:11 [2021-06-11T15:02:11.289Z] Tests run: 5, Failures: 0, Errors: 0, Skipped: 0, Time elapsed: 0.216 s - in org.eclipse.tracecompass.tmf.remote.ui.tests.fetch.RemoteImportProfilesReaderTest
11:02:11 [2021-06-11T15:02:11.289Z] testLoadElements(org.eclipse.tracecompass.tmf.remote.ui.tests.fetch.RemoteImportProfilesReaderTest)  Time elapsed: 0.026 s
11:02:11 [2021-06-11T15:02:11.289Z] testValidateInvalidMissingFiles(org.eclipse.tracecompass.tmf.remote.ui.tests.fetch.RemoteImportProfilesReaderTest)  Time elapsed: 0.101 s
11:02:11 [2021-06-11T15:02:11.289Z] testValidateInvalidEmptyProfile(org.eclipse.tracecompass.tmf.remote.ui.tests.fetch.RemoteImportProfilesReaderTest)  Time elapsed: 0.004 s
11:02:11 [2021-06-11T15:02:11.289Z] testValidateInvalidMissingRoot(org.eclipse.tracecompass.tmf.remote.ui.tests.fetch.RemoteImportProfilesReaderTest)  Time elapsed: 0.003 s
11:02:11 [2021-06-11T15:02:11.289Z] testValidateValid(org.eclipse.tracecompass.tmf.remote.ui.tests.fetch.RemoteImportProfilesReaderTest)  Time elapsed: 0.004 s
11:02:11 [2021-06-11T15:02:11.289Z] Running org.eclipse.tracecompass.tmf.remote.ui.tests.fetch.RemoteImportProfilesWriterTest
11:02:11 [2021-06-11T15:02:11.549Z] Tests run: 1, Failures: 0, Errors: 0, Skipped: 0, Time elapsed: 0.124 s - in org.eclipse.tracecompass.tmf.remote.ui.tests.fetch.RemoteImportProfilesWriterTest
11:02:11 [2021-06-11T15:02:11.549Z] testValidateValid(org.eclipse.tracecompass.tmf.remote.ui.tests.fetch.RemoteImportProfilesWriterTest)  Time elapsed: 0.122 s
11:02:11 [2021-06-11T15:02:11.549Z] 
11:02:11 [2021-06-11T15:02:11.549Z] Results:
11:02:11 [2021-06-11T15:02:11.549Z] 
11:02:11 [2021-06-11T15:02:11.549Z] Tests run: 6, Failures: 0, Errors: 0, Skipped: 0
11:02:11 [2021-06-11T15:02:11.549Z] 
11:02:12 [2021-06-11T15:02:12.481Z] [INFO] All tests passed!
11:02:12 [2021-06-11T15:02:12.481Z] [INFO] 
11:02:12 [2021-06-11T15:02:12.481Z] [INFO] --- maven-install-plugin:2.5.2:install (default-install) @ org.eclipse.tracecompass.tmf.remote.ui.tests ---
11:02:12 [2021-06-11T15:02:12.481Z] [INFO] Installing /home/jenkins/agent/workspace/tracecompass-master-2019-06/tmf/org.eclipse.tracecompass.tmf.remote.ui.tests/target/org.eclipse.tracecompass.tmf.remote.ui.tests-1.0.2-SNAPSHOT.jar to /home/jenkins/.m2/repository/org/eclipse/tracecompass/org.eclipse.tracecompass.tmf.remote.ui.tests/1.0.2-SNAPSHOT/org.eclipse.tracecompass.tmf.remote.ui.tests-1.0.2-SNAPSHOT.jar
11:02:12 [2021-06-11T15:02:12.481Z] [INFO] Installing /home/jenkins/agent/workspace/tracecompass-master-2019-06/tmf/org.eclipse.tracecompass.tmf.remote.ui.tests/pom.xml to /home/jenkins/.m2/repository/org/eclipse/tracecompass/org.eclipse.tracecompass.tmf.remote.ui.tests/1.0.2-SNAPSHOT/org.eclipse.tracecompass.tmf.remote.ui.tests-1.0.2-SNAPSHOT.pom
11:02:12 [2021-06-11T15:02:12.481Z] [INFO] Installing /home/jenkins/agent/workspace/tracecompass-master-2019-06/tmf/org.eclipse.tracecompass.tmf.remote.ui.tests/target/org.eclipse.tracecompass.tmf.remote.ui.tests-1.0.2-SNAPSHOT-sources.jar to /home/jenkins/.m2/repository/org/eclipse/tracecompass/org.eclipse.tracecompass.tmf.remote.ui.tests/1.0.2-SNAPSHOT/org.eclipse.tracecompass.tmf.remote.ui.tests-1.0.2-SNAPSHOT-sources.jar
11:02:12 [2021-06-11T15:02:12.481Z] [INFO] Installing /home/jenkins/agent/workspace/tracecompass-master-2019-06/tmf/org.eclipse.tracecompass.tmf.remote.ui.tests/target/org.eclipse.tracecompass.tmf.remote.ui.tests-1.0.2-SNAPSHOT.jar.pack.gz to /home/jenkins/.m2/repository/org/eclipse/tracecompass/org.eclipse.tracecompass.tmf.remote.ui.tests/1.0.2-SNAPSHOT/org.eclipse.tracecompass.tmf.remote.ui.tests-1.0.2-SNAPSHOT-pack200.jar.pack.gz
11:02:12 [2021-06-11T15:02:12.481Z] [INFO] Installing /home/jenkins/agent/workspace/tracecompass-master-2019-06/tmf/org.eclipse.tracecompass.tmf.remote.ui.tests/target/p2content.xml to /home/jenkins/.m2/repository/org/eclipse/tracecompass/org.eclipse.tracecompass.tmf.remote.ui.tests/1.0.2-SNAPSHOT/org.eclipse.tracecompass.tmf.remote.ui.tests-1.0.2-SNAPSHOT-p2metadata.xml
11:02:12 [2021-06-11T15:02:12.481Z] [INFO] Installing /home/jenkins/agent/workspace/tracecompass-master-2019-06/tmf/org.eclipse.tracecompass.tmf.remote.ui.tests/target/p2artifacts.xml to /home/jenkins/.m2/repository/org/eclipse/tracecompass/org.eclipse.tracecompass.tmf.remote.ui.tests/1.0.2-SNAPSHOT/org.eclipse.tracecompass.tmf.remote.ui.tests-1.0.2-SNAPSHOT-p2artifacts.xml
11:02:12 [2021-06-11T15:02:12.481Z] [INFO] 
11:02:12 [2021-06-11T15:02:12.481Z] [INFO] --- tycho-p2-plugin:2.3.0:update-local-index (default-update-local-index) @ org.eclipse.tracecompass.tmf.remote.ui.tests ---
11:02:12 [2021-06-11T15:02:12.481Z] [INFO] 
11:02:12 [2021-06-11T15:02:12.481Z] [INFO] -----< org.eclipse.tracecompass:org.eclipse.tracecompass.alltests >-----
11:02:12 [2021-06-11T15:02:12.481Z] [INFO] Building Trace Compass All Tests 1.0.11-SNAPSHOT               [134/138]
11:02:12 [2021-06-11T15:02:12.481Z] [INFO] ------------------------[ eclipse-test-plugin ]-------------------------
11:02:12 [2021-06-11T15:02:12.741Z] [INFO] 
11:02:12 [2021-06-11T15:02:12.741Z] [INFO] --- maven-clean-plugin:3.0.0:clean (default-clean) @ org.eclipse.tracecompass.alltests ---
11:02:12 [2021-06-11T15:02:12.741Z] [INFO] 
11:02:12 [2021-06-11T15:02:12.741Z] [INFO] --- tycho-packaging-plugin:2.3.0:build-qualifier (default-build-qualifier) @ org.eclipse.tracecompass.alltests ---
11:02:12 [2021-06-11T15:02:12.741Z] [INFO] The project's OSGi version is 1.0.11.202106111356
11:02:12 [2021-06-11T15:02:12.741Z] [INFO] 
11:02:12 [2021-06-11T15:02:12.741Z] [INFO] --- tycho-packaging-plugin:2.3.0:validate-id (default-validate-id) @ org.eclipse.tracecompass.alltests ---
11:02:12 [2021-06-11T15:02:12.741Z] [INFO] 
11:02:12 [2021-06-11T15:02:12.741Z] [INFO] --- tycho-packaging-plugin:2.3.0:validate-version (default-validate-version) @ org.eclipse.tracecompass.alltests ---
11:02:12 [2021-06-11T15:02:12.741Z] [INFO] 
11:02:12 [2021-06-11T15:02:12.741Z] [INFO] --- maven-enforcer-plugin:3.0.0-M3:enforce (enforce-maven-version) @ org.eclipse.tracecompass.alltests ---
11:02:12 [2021-06-11T15:02:12.741Z] [INFO] 
11:02:12 [2021-06-11T15:02:12.741Z] [INFO] --- maven-resources-plugin:3.0.2:resources (default-resources) @ org.eclipse.tracecompass.alltests ---
11:02:12 [2021-06-11T15:02:12.741Z] [INFO] Using 'UTF-8' encoding to copy filtered resources.
11:02:12 [2021-06-11T15:02:12.741Z] [INFO] skip non existing resourceDirectory /home/jenkins/agent/workspace/tracecompass-master-2019-06/releng/org.eclipse.tracecompass.alltests/src/main/resources
11:02:12 [2021-06-11T15:02:12.741Z] [INFO] 
11:02:12 [2021-06-11T15:02:12.741Z] [INFO] --- tycho-compiler-plugin:2.3.0:compile (default-compile) @ org.eclipse.tracecompass.alltests ---
11:02:12 [2021-06-11T15:02:12.741Z] [INFO] Compiling 8 source files to /home/jenkins/agent/workspace/tracecompass-master-2019-06/releng/org.eclipse.tracecompass.alltests/target/classes
11:02:12 [2021-06-11T15:02:12.999Z] [INFO] 
11:02:13 [2021-06-11T15:02:13.000Z] [INFO] --- maven-resources-plugin:3.0.2:testResources (default-testResources) @ org.eclipse.tracecompass.alltests ---
11:02:13 [2021-06-11T15:02:13.000Z] [INFO] Using 'UTF-8' encoding to copy filtered resources.
11:02:13 [2021-06-11T15:02:13.000Z] [INFO] skip non existing resourceDirectory /home/jenkins/agent/workspace/tracecompass-master-2019-06/releng/org.eclipse.tracecompass.alltests/src/test/resources
11:02:13 [2021-06-11T15:02:13.000Z] [INFO] 
11:02:13 [2021-06-11T15:02:13.000Z] [INFO] --- tycho-source-plugin:2.3.0:plugin-source (plugin-source) @ org.eclipse.tracecompass.alltests ---
11:02:13 [2021-06-11T15:02:13.000Z] [INFO] Building jar: /home/jenkins/agent/workspace/tracecompass-master-2019-06/releng/org.eclipse.tracecompass.alltests/target/org.eclipse.tracecompass.alltests-1.0.11-SNAPSHOT-sources.jar
11:02:13 [2021-06-11T15:02:13.000Z] [INFO] 
11:02:13 [2021-06-11T15:02:13.000Z] [INFO] --- target-platform-configuration:2.3.0:target-platform (default-target-platform) @ org.eclipse.tracecompass.alltests ---
11:02:13 [2021-06-11T15:02:13.000Z] [INFO] 
11:02:13 [2021-06-11T15:02:13.000Z] [INFO] --- tycho-packaging-plugin:2.3.0:package-plugin (default-package-plugin) @ org.eclipse.tracecompass.alltests ---
11:02:13 [2021-06-11T15:02:13.000Z] [INFO] Building jar: /home/jenkins/agent/workspace/tracecompass-master-2019-06/releng/org.eclipse.tracecompass.alltests/target/org.eclipse.tracecompass.alltests-1.0.11-SNAPSHOT.jar
11:02:13 [2021-06-11T15:02:13.000Z] [INFO] 
11:02:13 [2021-06-11T15:02:13.000Z] [INFO] --- tycho-p2-plugin:2.3.0:p2-metadata-default (default-p2-metadata-default) @ org.eclipse.tracecompass.alltests ---
11:02:13 [2021-06-11T15:02:13.000Z] [INFO] 
11:02:13 [2021-06-11T15:02:13.000Z] [INFO] --- tycho-source-feature-plugin:2.3.0:source-feature (source-feature) @ org.eclipse.tracecompass.alltests ---
11:02:13 [2021-06-11T15:02:13.000Z] [WARNING] Mojo tycho-source-feature-plugin:source-feature is replaced by the tycho-source-plugin:feature-source which offers equivalent and even enhanced functionality
11:02:13 [2021-06-11T15:02:13.000Z] [INFO] 
11:02:13 [2021-06-11T15:02:13.000Z] [INFO] --- tycho-pack200b-plugin:2.3.0:pack (pack200-pack) @ org.eclipse.tracecompass.alltests ---
11:02:13 [2021-06-11T15:02:13.000Z] [WARNING] Pack200 actions are deprecated and scheduled for removal.
11:02:13 [2021-06-11T15:02:13.000Z] [INFO] Pack200 packing jar /home/jenkins/agent/workspace/tracecompass-master-2019-06/releng/org.eclipse.tracecompass.alltests/target/org.eclipse.tracecompass.alltests-1.0.11-SNAPSHOT.jar
11:02:13 [2021-06-11T15:02:13.257Z] [INFO] 
11:02:13 [2021-06-11T15:02:13.257Z] [INFO] --- tycho-p2-plugin:2.3.0:p2-metadata (p2-metadata) @ org.eclipse.tracecompass.alltests ---
11:02:13 [2021-06-11T15:02:13.257Z] [INFO] 
11:02:13 [2021-06-11T15:02:13.257Z] [INFO] --- tycho-surefire-plugin:2.3.0:test (default-test) @ org.eclipse.tracecompass.alltests ---
11:02:13 [2021-06-11T15:02:13.515Z] [INFO] Executing Test Runtime with timeout 0, logs (if any) will be placed at: /home/jenkins/agent/workspace/tracecompass-master-2019-06/releng/org.eclipse.tracecompass.alltests/target/work/data/.metadata/.log
11:02:13 [2021-06-11T15:02:13.515Z] [INFO] Command line:
11:02:13 [2021-06-11T15:02:13.515Z] 	[/opt/tools/java/openjdk/jdk-11/11.0.2+9/bin/java, -Dosgi.noShutdown=false, -Dosgi.os=linux, -Dosgi.ws=gtk, -Dosgi.arch=x86_64, -Dorg.eclipse.swt.browser.DefaultType=mozilla, -Xms512m, -Xmx1024m, -Dosgi.clean=true, -jar, /home/jenkins/.m2/repository/p2/osgi/bundle/org.eclipse.equinox.launcher/1.5.400.v20190515-0925/org.eclipse.equinox.launcher-1.5.400.v20190515-0925.jar, -data, /home/jenkins/agent/workspace/tracecompass-master-2019-06/releng/org.eclipse.tracecompass.alltests/target/work/data, -install, /home/jenkins/agent/workspace/tracecompass-master-2019-06/releng/org.eclipse.tracecompass.alltests/target/work, -configuration, /home/jenkins/agent/workspace/tracecompass-master-2019-06/releng/org.eclipse.tracecompass.alltests/target/work/configuration, -application, org.eclipse.tycho.surefire.osgibooter.headlesstest, -testproperties, /home/jenkins/agent/workspace/tracecompass-master-2019-06/releng/org.eclipse.tracecompass.alltests/target/surefire.properties, -product, org.eclipse.platform.ide, -consoleLog]
11:02:13 [2021-06-11T15:02:13.773Z] Picked up _JAVA_OPTIONS: -Duser.home=/home/tracecompass
11:02:17 [2021-06-11T15:02:17.052Z] !SESSION 2021-06-11 15:02:13.855 -----------------------------------------------
11:02:17 [2021-06-11T15:02:17.052Z] eclipse.buildId=unknown
11:02:17 [2021-06-11T15:02:17.053Z] java.version=11.0.2
11:02:17 [2021-06-11T15:02:17.053Z] java.vendor=Oracle Corporation
11:02:17 [2021-06-11T15:02:17.053Z] BootLoader constants: OS=linux, ARCH=x86_64, WS=gtk, NL=en_US
11:02:17 [2021-06-11T15:02:17.053Z] Framework arguments:  -application org.eclipse.tycho.surefire.osgibooter.headlesstest -testproperties /home/jenkins/agent/workspace/tracecompass-master-2019-06/releng/org.eclipse.tracecompass.alltests/target/surefire.properties -product org.eclipse.platform.ide
11:02:17 [2021-06-11T15:02:17.053Z] Command-line arguments:  -data /home/jenkins/agent/workspace/tracecompass-master-2019-06/releng/org.eclipse.tracecompass.alltests/target/work/data -application org.eclipse.tycho.surefire.osgibooter.headlesstest -testproperties /home/jenkins/agent/workspace/tracecompass-master-2019-06/releng/org.eclipse.tracecompass.alltests/target/surefire.properties -product org.eclipse.platform.ide -consoleLog
11:02:17 [2021-06-11T15:02:17.053Z] 
11:02:17 [2021-06-11T15:02:17.053Z] !ENTRY org.eclipse.compare.win32 4 0 2021-06-11 15:02:16.937
11:02:17 [2021-06-11T15:02:17.053Z] !MESSAGE FrameworkEvent ERROR
11:02:17 [2021-06-11T15:02:17.053Z] !STACK 0
11:02:17 [2021-06-11T15:02:17.053Z] org.osgi.framework.BundleException: Could not resolve module: org.eclipse.compare.win32 [85]
11:02:17 [2021-06-11T15:02:17.053Z]   Unresolved requirement: Require-Capability: eclipse.platform; filter:="(osgi.os=win32)"
11:02:17 [2021-06-11T15:02:17.053Z] 
11:02:17 [2021-06-11T15:02:17.053Z] 	at org.eclipse.osgi.container.Module.start(Module.java:457)
11:02:17 [2021-06-11T15:02:17.053Z] 	at org.eclipse.osgi.container.ModuleContainer$ContainerStartLevel$1.run(ModuleContainer.java:1820)
11:02:17 [2021-06-11T15:02:17.053Z] 	at org.eclipse.osgi.internal.framework.EquinoxContainerAdaptor$2$1.execute(EquinoxContainerAdaptor.java:150)
11:02:17 [2021-06-11T15:02:17.053Z] 	at org.eclipse.osgi.container.ModuleContainer$ContainerStartLevel.incStartLevel(ModuleContainer.java:1813)
11:02:17 [2021-06-11T15:02:17.053Z] 	at org.eclipse.osgi.container.ModuleContainer$ContainerStartLevel.incStartLevel(ModuleContainer.java:1769)
11:02:17 [2021-06-11T15:02:17.053Z] 	at org.eclipse.osgi.container.ModuleContainer$ContainerStartLevel.doContainerStartLevel(ModuleContainer.java:1735)
11:02:17 [2021-06-11T15:02:17.053Z] 	at org.eclipse.osgi.container.ModuleContainer$ContainerStartLevel.dispatchEvent(ModuleContainer.java:1661)
11:02:17 [2021-06-11T15:02:17.053Z] 	at org.eclipse.osgi.container.ModuleContainer$ContainerStartLevel.dispatchEvent(ModuleContainer.java:1)
11:02:17 [2021-06-11T15:02:17.053Z] 	at org.eclipse.osgi.framework.eventmgr.EventManager.dispatchEvent(EventManager.java:234)
11:02:17 [2021-06-11T15:02:17.053Z] 	at org.eclipse.osgi.framework.eventmgr.EventManager$EventThread.run(EventManager.java:345)
11:02:17 [2021-06-11T15:02:17.053Z] 
11:02:17 [2021-06-11T15:02:17.053Z] !ENTRY org.eclipse.ecf.provider.filetransfer.httpclient45.win32 4 0 2021-06-11 15:02:16.958
11:02:17 [2021-06-11T15:02:17.053Z] !MESSAGE FrameworkEvent ERROR
11:02:17 [2021-06-11T15:02:17.053Z] !STACK 0
11:02:17 [2021-06-11T15:02:17.053Z] org.osgi.framework.BundleException: Could not resolve module: org.eclipse.ecf.provider.filetransfer.httpclient45.win32 [149]
11:02:17 [2021-06-11T15:02:17.053Z]   Unresolved requirement: Require-Capability: eclipse.platform; filter:="(osgi.os=win32)"
11:02:17 [2021-06-11T15:02:17.053Z]   Unresolved requirement: Import-Package: org.apache.http.impl.auth.win; version="[4.5.0,5.0.0)"
11:02:17 [2021-06-11T15:02:17.053Z]     -> Export-Package: org.apache.http.impl.auth.win; bundle-symbolic-name="org.apache.httpcomponents.httpclient.win"; bundle-version="4.5.6.v20190213-1947"; version="4.5.6"; x-internal:="true"; uses:="org.apache.http,org.apache.http.auth,org.apache.http.client,org.apache.http.impl.auth,org.apache.http.protocol,org.apache.http.util"
11:02:17 [2021-06-11T15:02:17.053Z]        org.apache.httpcomponents.httpclient.win [36]
11:02:17 [2021-06-11T15:02:17.053Z]          Unresolved requirement: Require-Capability: eclipse.platform; filter:="(osgi.os=win32)"
11:02:17 [2021-06-11T15:02:17.053Z] 
11:02:17 [2021-06-11T15:02:17.053Z] 	at org.eclipse.osgi.container.Module.start(Module.java:457)
11:02:17 [2021-06-11T15:02:17.053Z] 	at org.eclipse.osgi.container.ModuleContainer$ContainerStartLevel$1.run(ModuleContainer.java:1820)
11:02:17 [2021-06-11T15:02:17.053Z] 	at org.eclipse.osgi.internal.framework.EquinoxContainerAdaptor$2$1.execute(EquinoxContainerAdaptor.java:150)
11:02:17 [2021-06-11T15:02:17.053Z] 	at org.eclipse.osgi.container.ModuleContainer$ContainerStartLevel.incStartLevel(ModuleContainer.java:1813)
11:02:17 [2021-06-11T15:02:17.053Z] 	at org.eclipse.osgi.container.ModuleContainer$ContainerStartLevel.incStartLevel(ModuleContainer.java:1769)
11:02:17 [2021-06-11T15:02:17.053Z] 	at org.eclipse.osgi.container.ModuleContainer$ContainerStartLevel.doContainerStartLevel(ModuleContainer.java:1735)
11:02:17 [2021-06-11T15:02:17.053Z] 	at org.eclipse.osgi.container.ModuleContainer$ContainerStartLevel.dispatchEvent(ModuleContainer.java:1661)
11:02:17 [2021-06-11T15:02:17.053Z] 	at org.eclipse.osgi.container.ModuleContainer$ContainerStartLevel.dispatchEvent(ModuleContainer.java:1)
11:02:17 [2021-06-11T15:02:17.053Z] 	at org.eclipse.osgi.framework.eventmgr.EventManager.dispatchEvent(EventManager.java:234)
11:02:17 [2021-06-11T15:02:17.053Z] 	at org.eclipse.osgi.framework.eventmgr.EventManager$EventThread.run(EventManager.java:345)
11:02:18 [2021-06-11T15:02:18.967Z] 
11:02:18 [2021-06-11T15:02:18.967Z] Results:
11:02:18 [2021-06-11T15:02:18.967Z] 
11:02:18 [2021-06-11T15:02:18.967Z] Tests run: 0, Failures: 0, Errors: 0, Skipped: 0
11:02:18 [2021-06-11T15:02:18.967Z] 
11:02:19 [2021-06-11T15:02:19.224Z] [WARNING] No tests found.
11:02:19 [2021-06-11T15:02:19.224Z] [INFO] 
11:02:19 [2021-06-11T15:02:19.224Z] [INFO] --- maven-install-plugin:2.5.2:install (default-install) @ org.eclipse.tracecompass.alltests ---
11:02:19 [2021-06-11T15:02:19.224Z] [INFO] Installing /home/jenkins/agent/workspace/tracecompass-master-2019-06/releng/org.eclipse.tracecompass.alltests/target/org.eclipse.tracecompass.alltests-1.0.11-SNAPSHOT.jar to /home/jenkins/.m2/repository/org/eclipse/tracecompass/org.eclipse.tracecompass.alltests/1.0.11-SNAPSHOT/org.eclipse.tracecompass.alltests-1.0.11-SNAPSHOT.jar
11:02:19 [2021-06-11T15:02:19.224Z] [INFO] Installing /home/jenkins/agent/workspace/tracecompass-master-2019-06/releng/org.eclipse.tracecompass.alltests/pom.xml to /home/jenkins/.m2/repository/org/eclipse/tracecompass/org.eclipse.tracecompass.alltests/1.0.11-SNAPSHOT/org.eclipse.tracecompass.alltests-1.0.11-SNAPSHOT.pom
11:02:19 [2021-06-11T15:02:19.224Z] [INFO] Installing /home/jenkins/agent/workspace/tracecompass-master-2019-06/releng/org.eclipse.tracecompass.alltests/target/org.eclipse.tracecompass.alltests-1.0.11-SNAPSHOT-sources.jar to /home/jenkins/.m2/repository/org/eclipse/tracecompass/org.eclipse.tracecompass.alltests/1.0.11-SNAPSHOT/org.eclipse.tracecompass.alltests-1.0.11-SNAPSHOT-sources.jar
11:02:19 [2021-06-11T15:02:19.224Z] [INFO] Installing /home/jenkins/agent/workspace/tracecompass-master-2019-06/releng/org.eclipse.tracecompass.alltests/target/org.eclipse.tracecompass.alltests-1.0.11-SNAPSHOT.jar.pack.gz to /home/jenkins/.m2/repository/org/eclipse/tracecompass/org.eclipse.tracecompass.alltests/1.0.11-SNAPSHOT/org.eclipse.tracecompass.alltests-1.0.11-SNAPSHOT-pack200.jar.pack.gz
11:02:19 [2021-06-11T15:02:19.224Z] [INFO] Installing /home/jenkins/agent/workspace/tracecompass-master-2019-06/releng/org.eclipse.tracecompass.alltests/target/p2content.xml to /home/jenkins/.m2/repository/org/eclipse/tracecompass/org.eclipse.tracecompass.alltests/1.0.11-SNAPSHOT/org.eclipse.tracecompass.alltests-1.0.11-SNAPSHOT-p2metadata.xml
11:02:19 [2021-06-11T15:02:19.224Z] [INFO] Installing /home/jenkins/agent/workspace/tracecompass-master-2019-06/releng/org.eclipse.tracecompass.alltests/target/p2artifacts.xml to /home/jenkins/.m2/repository/org/eclipse/tracecompass/org.eclipse.tracecompass.alltests/1.0.11-SNAPSHOT/org.eclipse.tracecompass.alltests-1.0.11-SNAPSHOT-p2artifacts.xml
11:02:19 [2021-06-11T15:02:19.224Z] [INFO] 
11:02:19 [2021-06-11T15:02:19.224Z] [INFO] --- tycho-p2-plugin:2.3.0:update-local-index (default-update-local-index) @ org.eclipse.tracecompass.alltests ---
11:02:19 [2021-06-11T15:02:19.224Z] [INFO] 
11:02:19 [2021-06-11T15:02:19.224Z] [INFO] -----< org.eclipse.tracecompass:org.eclipse.tracecompass.testing >------
11:02:19 [2021-06-11T15:02:19.224Z] [INFO] Building org.eclipse.tracecompass.testing 7.0.0-SNAPSHOT       [135/138]
11:02:19 [2021-06-11T15:02:19.224Z] [INFO] --------------------------[ eclipse-feature ]---------------------------
11:02:19 [2021-06-11T15:02:19.482Z] [INFO] 
11:02:19 [2021-06-11T15:02:19.482Z] [INFO] --- maven-clean-plugin:3.0.0:clean (default-clean) @ org.eclipse.tracecompass.testing ---
11:02:19 [2021-06-11T15:02:19.482Z] [INFO] Deleting /home/jenkins/agent/workspace/tracecompass-master-2019-06/releng/org.eclipse.tracecompass.testing/target
11:02:19 [2021-06-11T15:02:19.482Z] [INFO] 
11:02:19 [2021-06-11T15:02:19.482Z] [INFO] --- tycho-packaging-plugin:2.3.0:build-qualifier-aggregator (default-build-qualifier-aggregator) @ org.eclipse.tracecompass.testing ---
11:02:19 [2021-06-11T15:02:19.482Z] [INFO] The project's OSGi version is 7.0.0.202106111356
11:02:19 [2021-06-11T15:02:19.482Z] [INFO] 
11:02:19 [2021-06-11T15:02:19.482Z] [INFO] --- tycho-packaging-plugin:2.3.0:validate-id (default-validate-id) @ org.eclipse.tracecompass.testing ---
11:02:19 [2021-06-11T15:02:19.482Z] [INFO] 
11:02:19 [2021-06-11T15:02:19.482Z] [INFO] --- tycho-packaging-plugin:2.3.0:validate-version (default-validate-version) @ org.eclipse.tracecompass.testing ---
11:02:19 [2021-06-11T15:02:19.482Z] [INFO] 
11:02:19 [2021-06-11T15:02:19.483Z] [INFO] --- maven-enforcer-plugin:3.0.0-M3:enforce (enforce-maven-version) @ org.eclipse.tracecompass.testing ---
11:02:19 [2021-06-11T15:02:19.483Z] [INFO] 
11:02:19 [2021-06-11T15:02:19.483Z] [INFO] --- target-platform-configuration:2.3.0:target-platform (default-target-platform) @ org.eclipse.tracecompass.testing ---
11:02:19 [2021-06-11T15:02:19.483Z] [INFO] 
11:02:19 [2021-06-11T15:02:19.483Z] [INFO] --- tycho-source-plugin:2.3.0:plugin-source (plugin-source) @ org.eclipse.tracecompass.testing ---
11:02:19 [2021-06-11T15:02:19.483Z] [INFO] 
11:02:19 [2021-06-11T15:02:19.483Z] [INFO] --- tycho-packaging-plugin:2.3.0:package-feature (default-package-feature) @ org.eclipse.tracecompass.testing ---
11:02:19 [2021-06-11T15:02:19.483Z] [INFO] Building jar: /home/jenkins/agent/workspace/tracecompass-master-2019-06/releng/org.eclipse.tracecompass.testing/target/org.eclipse.tracecompass.testing-7.0.0-SNAPSHOT.jar
11:02:19 [2021-06-11T15:02:19.483Z] [INFO] 
11:02:19 [2021-06-11T15:02:19.483Z] [INFO] --- tycho-p2-plugin:2.3.0:p2-metadata-default (default-p2-metadata-default) @ org.eclipse.tracecompass.testing ---
11:02:19 [2021-06-11T15:02:19.483Z] [INFO] 
11:02:19 [2021-06-11T15:02:19.483Z] [INFO] --- tycho-p2-plugin:2.3.0:feature-p2-metadata (default-feature-p2-metadata) @ org.eclipse.tracecompass.testing ---
11:02:19 [2021-06-11T15:02:19.483Z] [INFO] 
11:02:19 [2021-06-11T15:02:19.483Z] [INFO] --- tycho-source-feature-plugin:2.3.0:source-feature (source-feature) @ org.eclipse.tracecompass.testing ---
11:02:19 [2021-06-11T15:02:19.483Z] [WARNING] Mojo tycho-source-feature-plugin:source-feature is replaced by the tycho-source-plugin:feature-source which offers equivalent and even enhanced functionality
11:02:19 [2021-06-11T15:02:19.740Z] [INFO] Building jar: /home/jenkins/agent/workspace/tracecompass-master-2019-06/releng/org.eclipse.tracecompass.testing/target/org.eclipse.tracecompass.testing-7.0.0-SNAPSHOT-sources-feature.jar
11:02:19 [2021-06-11T15:02:19.740Z] [INFO] 
11:02:19 [2021-06-11T15:02:19.740Z] [INFO] --- tycho-pack200b-plugin:2.3.0:pack (pack200-pack) @ org.eclipse.tracecompass.testing ---
11:02:19 [2021-06-11T15:02:19.740Z] [WARNING] Pack200 actions are deprecated and scheduled for removal.
11:02:19 [2021-06-11T15:02:19.740Z] [INFO] 
11:02:19 [2021-06-11T15:02:19.740Z] [INFO] --- tycho-p2-plugin:2.3.0:p2-metadata (p2-metadata) @ org.eclipse.tracecompass.testing ---
11:02:19 [2021-06-11T15:02:19.740Z] [INFO] 
11:02:19 [2021-06-11T15:02:19.740Z] [INFO] --- maven-install-plugin:2.5.2:install (default-install) @ org.eclipse.tracecompass.testing ---
11:02:19 [2021-06-11T15:02:19.740Z] [INFO] Installing /home/jenkins/agent/workspace/tracecompass-master-2019-06/releng/org.eclipse.tracecompass.testing/target/org.eclipse.tracecompass.testing-7.0.0-SNAPSHOT.jar to /home/jenkins/.m2/repository/org/eclipse/tracecompass/org.eclipse.tracecompass.testing/7.0.0-SNAPSHOT/org.eclipse.tracecompass.testing-7.0.0-SNAPSHOT.jar
11:02:19 [2021-06-11T15:02:19.740Z] [INFO] Installing /home/jenkins/agent/workspace/tracecompass-master-2019-06/releng/org.eclipse.tracecompass.testing/.polyglot.build.properties to /home/jenkins/.m2/repository/org/eclipse/tracecompass/org.eclipse.tracecompass.testing/7.0.0-SNAPSHOT/org.eclipse.tracecompass.testing-7.0.0-SNAPSHOT.pom
11:02:19 [2021-06-11T15:02:19.740Z] [INFO] Installing /home/jenkins/agent/workspace/tracecompass-master-2019-06/releng/org.eclipse.tracecompass.testing/target/org.eclipse.tracecompass.testing-7.0.0-SNAPSHOT-sources-feature.jar to /home/jenkins/.m2/repository/org/eclipse/tracecompass/org.eclipse.tracecompass.testing/7.0.0-SNAPSHOT/org.eclipse.tracecompass.testing-7.0.0-SNAPSHOT-sources-feature.jar
11:02:19 [2021-06-11T15:02:19.740Z] [INFO] Installing /home/jenkins/agent/workspace/tracecompass-master-2019-06/releng/org.eclipse.tracecompass.testing/target/p2content.xml to /home/jenkins/.m2/repository/org/eclipse/tracecompass/org.eclipse.tracecompass.testing/7.0.0-SNAPSHOT/org.eclipse.tracecompass.testing-7.0.0-SNAPSHOT-p2metadata.xml
11:02:19 [2021-06-11T15:02:19.740Z] [INFO] Installing /home/jenkins/agent/workspace/tracecompass-master-2019-06/releng/org.eclipse.tracecompass.testing/target/p2artifacts.xml to /home/jenkins/.m2/repository/org/eclipse/tracecompass/org.eclipse.tracecompass.testing/7.0.0-SNAPSHOT/org.eclipse.tracecompass.testing-7.0.0-SNAPSHOT-p2artifacts.xml
11:02:19 [2021-06-11T15:02:19.740Z] [INFO] 
11:02:19 [2021-06-11T15:02:19.740Z] [INFO] --- tycho-p2-plugin:2.3.0:update-local-index (default-update-local-index) @ org.eclipse.tracecompass.testing ---
11:02:19 [2021-06-11T15:02:19.740Z] [INFO] 
11:02:19 [2021-06-11T15:02:19.740Z] [INFO] ----< org.eclipse.tracecompass:org.eclipse.tracecompass.tmf.remote >----
11:02:19 [2021-06-11T15:02:19.740Z] [INFO] Building org.eclipse.tracecompass.tmf.remote 7.0.0-SNAPSHOT    [136/138]
11:02:19 [2021-06-11T15:02:19.740Z] [INFO] --------------------------[ eclipse-feature ]---------------------------
11:02:19 [2021-06-11T15:02:19.740Z] [INFO] 
11:02:19 [2021-06-11T15:02:19.740Z] [INFO] --- maven-clean-plugin:3.0.0:clean (default-clean) @ org.eclipse.tracecompass.tmf.remote ---
11:02:19 [2021-06-11T15:02:19.740Z] [INFO] Deleting /home/jenkins/agent/workspace/tracecompass-master-2019-06/tmf/org.eclipse.tracecompass.tmf.remote/target
11:02:19 [2021-06-11T15:02:19.740Z] [INFO] 
11:02:19 [2021-06-11T15:02:19.740Z] [INFO] --- tycho-packaging-plugin:2.3.0:build-qualifier-aggregator (default-build-qualifier-aggregator) @ org.eclipse.tracecompass.tmf.remote ---
11:02:19 [2021-06-11T15:02:19.740Z] [INFO] The project's OSGi version is 7.0.0.202106111356
11:02:19 [2021-06-11T15:02:19.740Z] [INFO] 
11:02:19 [2021-06-11T15:02:19.740Z] [INFO] --- tycho-packaging-plugin:2.3.0:validate-id (default-validate-id) @ org.eclipse.tracecompass.tmf.remote ---
11:02:19 [2021-06-11T15:02:19.740Z] [INFO] 
11:02:19 [2021-06-11T15:02:19.740Z] [INFO] --- tycho-packaging-plugin:2.3.0:validate-version (default-validate-version) @ org.eclipse.tracecompass.tmf.remote ---
11:02:19 [2021-06-11T15:02:19.740Z] [INFO] 
11:02:19 [2021-06-11T15:02:19.740Z] [INFO] --- maven-enforcer-plugin:3.0.0-M3:enforce (enforce-maven-version) @ org.eclipse.tracecompass.tmf.remote ---
11:02:19 [2021-06-11T15:02:19.740Z] [INFO] 
11:02:19 [2021-06-11T15:02:19.740Z] [INFO] --- target-platform-configuration:2.3.0:target-platform (default-target-platform) @ org.eclipse.tracecompass.tmf.remote ---
11:02:19 [2021-06-11T15:02:19.740Z] [INFO] 
11:02:19 [2021-06-11T15:02:19.740Z] [INFO] --- tycho-source-plugin:2.3.0:plugin-source (plugin-source) @ org.eclipse.tracecompass.tmf.remote ---
11:02:19 [2021-06-11T15:02:19.740Z] [INFO] 
11:02:19 [2021-06-11T15:02:19.740Z] [INFO] --- tycho-packaging-plugin:2.3.0:package-feature (default-package-feature) @ org.eclipse.tracecompass.tmf.remote ---
11:02:19 [2021-06-11T15:02:19.740Z] [INFO] Building jar: /home/jenkins/agent/workspace/tracecompass-master-2019-06/tmf/org.eclipse.tracecompass.tmf.remote/target/org.eclipse.tracecompass.tmf.remote-7.0.0-SNAPSHOT.jar
11:02:19 [2021-06-11T15:02:19.741Z] [INFO] 
11:02:19 [2021-06-11T15:02:19.741Z] [INFO] --- tycho-p2-plugin:2.3.0:p2-metadata-default (default-p2-metadata-default) @ org.eclipse.tracecompass.tmf.remote ---
11:02:19 [2021-06-11T15:02:19.741Z] [INFO] 
11:02:19 [2021-06-11T15:02:19.741Z] [INFO] --- tycho-p2-plugin:2.3.0:feature-p2-metadata (default-feature-p2-metadata) @ org.eclipse.tracecompass.tmf.remote ---
11:02:19 [2021-06-11T15:02:19.741Z] [INFO] 
11:02:19 [2021-06-11T15:02:19.741Z] [INFO] --- tycho-source-feature-plugin:2.3.0:source-feature (source-feature) @ org.eclipse.tracecompass.tmf.remote ---
11:02:19 [2021-06-11T15:02:19.741Z] [WARNING] Mojo tycho-source-feature-plugin:source-feature is replaced by the tycho-source-plugin:feature-source which offers equivalent and even enhanced functionality
11:02:19 [2021-06-11T15:02:19.741Z] [INFO] Building jar: /home/jenkins/agent/workspace/tracecompass-master-2019-06/tmf/org.eclipse.tracecompass.tmf.remote/target/org.eclipse.tracecompass.tmf.remote-7.0.0-SNAPSHOT-sources-feature.jar
11:02:19 [2021-06-11T15:02:19.741Z] [INFO] 
11:02:19 [2021-06-11T15:02:19.741Z] [INFO] --- tycho-pack200b-plugin:2.3.0:pack (pack200-pack) @ org.eclipse.tracecompass.tmf.remote ---
11:02:19 [2021-06-11T15:02:19.741Z] [WARNING] Pack200 actions are deprecated and scheduled for removal.
11:02:19 [2021-06-11T15:02:19.741Z] [INFO] 
11:02:19 [2021-06-11T15:02:19.741Z] [INFO] --- tycho-p2-plugin:2.3.0:p2-metadata (p2-metadata) @ org.eclipse.tracecompass.tmf.remote ---
11:02:19 [2021-06-11T15:02:19.741Z] [INFO] 
11:02:19 [2021-06-11T15:02:19.741Z] [INFO] --- maven-install-plugin:2.5.2:install (default-install) @ org.eclipse.tracecompass.tmf.remote ---
11:02:19 [2021-06-11T15:02:19.741Z] [INFO] Installing /home/jenkins/agent/workspace/tracecompass-master-2019-06/tmf/org.eclipse.tracecompass.tmf.remote/target/org.eclipse.tracecompass.tmf.remote-7.0.0-SNAPSHOT.jar to /home/jenkins/.m2/repository/org/eclipse/tracecompass/org.eclipse.tracecompass.tmf.remote/7.0.0-SNAPSHOT/org.eclipse.tracecompass.tmf.remote-7.0.0-SNAPSHOT.jar
11:02:19 [2021-06-11T15:02:19.741Z] [INFO] Installing /home/jenkins/agent/workspace/tracecompass-master-2019-06/tmf/org.eclipse.tracecompass.tmf.remote/.polyglot.build.properties to /home/jenkins/.m2/repository/org/eclipse/tracecompass/org.eclipse.tracecompass.tmf.remote/7.0.0-SNAPSHOT/org.eclipse.tracecompass.tmf.remote-7.0.0-SNAPSHOT.pom
11:02:19 [2021-06-11T15:02:19.741Z] [INFO] Installing /home/jenkins/agent/workspace/tracecompass-master-2019-06/tmf/org.eclipse.tracecompass.tmf.remote/target/org.eclipse.tracecompass.tmf.remote-7.0.0-SNAPSHOT-sources-feature.jar to /home/jenkins/.m2/repository/org/eclipse/tracecompass/org.eclipse.tracecompass.tmf.remote/7.0.0-SNAPSHOT/org.eclipse.tracecompass.tmf.remote-7.0.0-SNAPSHOT-sources-feature.jar
11:02:19 [2021-06-11T15:02:19.741Z] [INFO] Installing /home/jenkins/agent/workspace/tracecompass-master-2019-06/tmf/org.eclipse.tracecompass.tmf.remote/target/p2content.xml to /home/jenkins/.m2/repository/org/eclipse/tracecompass/org.eclipse.tracecompass.tmf.remote/7.0.0-SNAPSHOT/org.eclipse.tracecompass.tmf.remote-7.0.0-SNAPSHOT-p2metadata.xml
11:02:19 [2021-06-11T15:02:19.741Z] [INFO] Installing /home/jenkins/agent/workspace/tracecompass-master-2019-06/tmf/org.eclipse.tracecompass.tmf.remote/target/p2artifacts.xml to /home/jenkins/.m2/repository/org/eclipse/tracecompass/org.eclipse.tracecompass.tmf.remote/7.0.0-SNAPSHOT/org.eclipse.tracecompass.tmf.remote-7.0.0-SNAPSHOT-p2artifacts.xml
11:02:19 [2021-06-11T15:02:19.741Z] [INFO] 
11:02:19 [2021-06-11T15:02:19.741Z] [INFO] --- tycho-p2-plugin:2.3.0:update-local-index (default-update-local-index) @ org.eclipse.tracecompass.tmf.remote ---
11:02:19 [2021-06-11T15:02:19.741Z] [INFO] 
11:02:19 [2021-06-11T15:02:19.741Z] [INFO] ---< org.eclipse.tracecompass:org.eclipse.tracecompass.releng-site >----
11:02:19 [2021-06-11T15:02:19.741Z] [INFO] Building Trace Compass Repository 7.0.0-SNAPSHOT               [137/138]
11:02:19 [2021-06-11T15:02:19.741Z] [INFO] -------------------------[ eclipse-repository ]-------------------------
11:02:19 [2021-06-11T15:02:19.741Z] [INFO] 
11:02:19 [2021-06-11T15:02:19.741Z] [INFO] --- maven-clean-plugin:3.0.0:clean (default-clean) @ org.eclipse.tracecompass.releng-site ---
11:02:19 [2021-06-11T15:02:19.741Z] [INFO] 
11:02:19 [2021-06-11T15:02:19.741Z] [INFO] --- tycho-packaging-plugin:2.3.0:build-qualifier-aggregator (default-build-qualifier-aggregator) @ org.eclipse.tracecompass.releng-site ---
11:02:19 [2021-06-11T15:02:19.741Z] [INFO] The project's OSGi version is 7.0.0.202106111356
11:02:19 [2021-06-11T15:02:19.741Z] [INFO] 
11:02:19 [2021-06-11T15:02:19.741Z] [INFO] --- maven-enforcer-plugin:3.0.0-M3:enforce (enforce-maven-version) @ org.eclipse.tracecompass.releng-site ---
11:02:19 [2021-06-11T15:02:19.741Z] [INFO] 
11:02:19 [2021-06-11T15:02:19.741Z] [INFO] --- maven-clean-plugin:3.0.0:clean (default-clean-1) @ org.eclipse.tracecompass.releng-site ---
11:02:19 [2021-06-11T15:02:19.741Z] [INFO] 
11:02:19 [2021-06-11T15:02:19.741Z] [INFO] --- maven-resources-plugin:3.0.2:resources (default-resources) @ org.eclipse.tracecompass.releng-site ---
11:02:19 [2021-06-11T15:02:19.741Z] [INFO] Using 'UTF-8' encoding to copy filtered resources.
11:02:19 [2021-06-11T15:02:19.741Z] [INFO] skip non existing resourceDirectory /home/jenkins/agent/workspace/tracecompass-master-2019-06/releng/org.eclipse.tracecompass.releng-site/src/main/resources
11:02:19 [2021-06-11T15:02:19.741Z] [INFO] 
11:02:19 [2021-06-11T15:02:19.741Z] [INFO] --- target-platform-configuration:2.3.0:target-platform (default-target-platform) @ org.eclipse.tracecompass.releng-site ---
11:02:19 [2021-06-11T15:02:19.741Z] [INFO] 
11:02:19 [2021-06-11T15:02:19.741Z] [INFO] --- tycho-p2-publisher-plugin:2.3.0:publish-osgi-ee (default-publish-osgi-ee) @ org.eclipse.tracecompass.releng-site ---
11:02:19 [2021-06-11T15:02:19.741Z] [INFO] Published profile IUs: [config.a.jre.javase 11.0.0, a.jre.javase 11.0.0]
11:02:19 [2021-06-11T15:02:19.741Z] [INFO] Published profile IUs: [config.a.jre.javase 15.0.0, a.jre.javase 15.0.0]
11:02:19 [2021-06-11T15:02:19.741Z] [INFO] Published profile IUs: [config.a.jre.javase 16.0.0, a.jre.javase 16.0.0]
11:02:19 [2021-06-11T15:02:19.741Z] [INFO] 
11:02:19 [2021-06-11T15:02:19.741Z] [INFO] --- tycho-p2-publisher-plugin:2.3.0:publish-products (default-publish-products) @ org.eclipse.tracecompass.releng-site ---
11:02:19 [2021-06-11T15:02:19.741Z] [INFO] 
11:02:19 [2021-06-11T15:02:19.741Z] [INFO] --- tycho-p2-publisher-plugin:2.3.0:publish-categories (default-publish-categories) @ org.eclipse.tracecompass.releng-site ---
11:02:19 [2021-06-11T15:02:19.741Z] [INFO] 
11:02:19 [2021-06-11T15:02:19.741Z] [INFO] --- tycho-p2-publisher-plugin:2.3.0:attach-artifacts (default-attach-artifacts) @ org.eclipse.tracecompass.releng-site ---
11:02:19 [2021-06-11T15:02:19.741Z] [INFO] 
11:02:19 [2021-06-11T15:02:19.741Z] [INFO] --- tycho-p2-repository-plugin:2.3.0:assemble-repository (default-assemble-repository) @ org.eclipse.tracecompass.releng-site ---
11:02:20 [2021-06-11T15:02:20.306Z] [INFO] Fetching org.eclipse.cdt.dsf.gdb.ui_2.6.200.201906030422.jar.pack.gz from https://archive.eclipse.org/tools/cdt/releases/9.8/cdt-9.8.0/plugins/ (233.17kB)
11:02:20 [2021-06-11T15:02:20.306Z] [INFO] The user operation is waiting for background work to complete.
11:02:20 [2021-06-11T15:02:20.306Z] [INFO] Unpacking org.eclipse.cdt.dsf.gdb.ui_2.6.200.201906030422...
11:02:20 [2021-06-11T15:02:20.563Z] [INFO] Fetching org.eclipse.cdt.dsf.ui_2.5.100.201904261715.jar.pack.gz from https://archive.eclipse.org/tools/cdt/releases/9.8/cdt-9.8.0/plugins/ (367.22kB)
11:02:20 [2021-06-11T15:02:20.563Z] [INFO] The user operation is waiting for background work to complete.
11:02:20 [2021-06-11T15:02:20.563Z] [INFO] Unpacking org.eclipse.cdt.dsf.ui_2.5.100.201904261715...
11:02:21 [2021-06-11T15:02:21.128Z] [INFO] Fetching org.eclipse.tm.terminal.control_4.5.100.201901312304.jar from https://download.eclipse.org/releases/2019-06/201906191000/plugins/ (185.75kB)
11:02:27 [2021-06-11T15:02:27.681Z] [INFO] 
11:02:27 [2021-06-11T15:02:27.682Z] [INFO] --- tycho-source-plugin:2.3.0:plugin-source (plugin-source) @ org.eclipse.tracecompass.releng-site ---
11:02:27 [2021-06-11T15:02:27.682Z] [INFO] 
11:02:27 [2021-06-11T15:02:27.682Z] [INFO] --- tycho-p2-repository-plugin:2.3.0:archive-repository (default-archive-repository) @ org.eclipse.tracecompass.releng-site ---
11:02:27 [2021-06-11T15:02:27.682Z] [INFO] 
11:02:27 [2021-06-11T15:02:27.682Z] [INFO] --- tycho-source-feature-plugin:2.3.0:source-feature (source-feature) @ org.eclipse.tracecompass.releng-site ---
11:02:27 [2021-06-11T15:02:27.682Z] [WARNING] Mojo tycho-source-feature-plugin:source-feature is replaced by the tycho-source-plugin:feature-source which offers equivalent and even enhanced functionality
11:02:27 [2021-06-11T15:02:27.682Z] [INFO] 
11:02:27 [2021-06-11T15:02:27.682Z] [INFO] --- tycho-pack200b-plugin:2.3.0:pack (pack200-pack) @ org.eclipse.tracecompass.releng-site ---
11:02:27 [2021-06-11T15:02:27.682Z] [WARNING] Pack200 actions are deprecated and scheduled for removal.
11:02:27 [2021-06-11T15:02:27.682Z] [INFO] 
11:02:27 [2021-06-11T15:02:27.682Z] [INFO] --- tycho-p2-plugin:2.3.0:p2-metadata (p2-metadata) @ org.eclipse.tracecompass.releng-site ---
11:02:27 [2021-06-11T15:02:27.682Z] [INFO] 
11:02:27 [2021-06-11T15:02:27.682Z] [INFO] --- repository-utils:1.7.0:generate-repository-facade (generate-facade) @ org.eclipse.tracecompass.releng-site ---
11:02:28 [2021-06-11T15:02:28.614Z] [INFO] Building zip: /home/jenkins/agent/workspace/tracecompass-master-2019-06/releng/org.eclipse.tracecompass.releng-site/target/org.eclipse.tracecompass.releng-site-7.0.0-SNAPSHOT.zip
11:02:30 [2021-06-11T15:02:30.511Z] [INFO] 
11:02:30 [2021-06-11T15:02:30.511Z] [INFO] --- maven-install-plugin:2.5.2:install (default-install) @ org.eclipse.tracecompass.releng-site ---
11:02:30 [2021-06-11T15:02:30.511Z] [INFO] No primary artifact to install, installing attached artifacts instead.
11:02:30 [2021-06-11T15:02:30.511Z] [INFO] Installing /home/jenkins/agent/workspace/tracecompass-master-2019-06/releng/org.eclipse.tracecompass.releng-site/pom.xml to /home/jenkins/.m2/repository/org/eclipse/tracecompass/org.eclipse.tracecompass.releng-site/7.0.0-SNAPSHOT/org.eclipse.tracecompass.releng-site-7.0.0-SNAPSHOT.pom
11:02:30 [2021-06-11T15:02:30.511Z] [INFO] Installing /home/jenkins/agent/workspace/tracecompass-master-2019-06/releng/org.eclipse.tracecompass.releng-site/target/p2content.xml to /home/jenkins/.m2/repository/org/eclipse/tracecompass/org.eclipse.tracecompass.releng-site/7.0.0-SNAPSHOT/org.eclipse.tracecompass.releng-site-7.0.0-SNAPSHOT-p2metadata.xml
11:02:30 [2021-06-11T15:02:30.511Z] [INFO] Installing /home/jenkins/agent/workspace/tracecompass-master-2019-06/releng/org.eclipse.tracecompass.releng-site/target/p2artifacts.xml to /home/jenkins/.m2/repository/org/eclipse/tracecompass/org.eclipse.tracecompass.releng-site/7.0.0-SNAPSHOT/org.eclipse.tracecompass.releng-site-7.0.0-SNAPSHOT-p2artifacts.xml
11:02:30 [2021-06-11T15:02:30.511Z] [INFO] 
11:02:30 [2021-06-11T15:02:30.511Z] [INFO] --- tycho-p2-plugin:2.3.0:update-local-index (default-update-local-index) @ org.eclipse.tracecompass.releng-site ---
11:02:30 [2021-06-11T15:02:30.511Z] [INFO] 
11:02:30 [2021-06-11T15:02:30.511Z] [INFO] --< org.eclipse.tracecompass:org.eclipse.tracecompass.jsontrace.core.tests >--
11:02:30 [2021-06-11T15:02:30.511Z] [INFO] Building org.eclipse.tracecompass.jsontrace.core.tests 1.0.3-SNAPSHOT [138/138]
11:02:30 [2021-06-11T15:02:30.511Z] [INFO] ---------------------------[ eclipse-plugin ]---------------------------
11:02:30 [2021-06-11T15:02:30.511Z] [INFO] 
11:02:30 [2021-06-11T15:02:30.511Z] [INFO] --- maven-clean-plugin:3.0.0:clean (default-clean) @ org.eclipse.tracecompass.jsontrace.core.tests ---
11:02:30 [2021-06-11T15:02:30.511Z] [INFO] 
11:02:30 [2021-06-11T15:02:30.511Z] [INFO] --- tycho-packaging-plugin:2.3.0:build-qualifier (default-build-qualifier) @ org.eclipse.tracecompass.jsontrace.core.tests ---
11:02:30 [2021-06-11T15:02:30.511Z] [INFO] The project's OSGi version is 1.0.3.202106111356
11:02:30 [2021-06-11T15:02:30.511Z] [INFO] 
11:02:30 [2021-06-11T15:02:30.511Z] [INFO] --- tycho-packaging-plugin:2.3.0:validate-id (default-validate-id) @ org.eclipse.tracecompass.jsontrace.core.tests ---
11:02:30 [2021-06-11T15:02:30.511Z] [INFO] 
11:02:30 [2021-06-11T15:02:30.511Z] [INFO] --- tycho-packaging-plugin:2.3.0:validate-version (default-validate-version) @ org.eclipse.tracecompass.jsontrace.core.tests ---
11:02:30 [2021-06-11T15:02:30.511Z] [INFO] 
11:02:30 [2021-06-11T15:02:30.511Z] [INFO] --- maven-enforcer-plugin:3.0.0-M3:enforce (enforce-maven-version) @ org.eclipse.tracecompass.jsontrace.core.tests ---
11:02:30 [2021-06-11T15:02:30.511Z] [INFO] 
11:02:30 [2021-06-11T15:02:30.511Z] [INFO] --- maven-resources-plugin:3.0.2:resources (default-resources) @ org.eclipse.tracecompass.jsontrace.core.tests ---
11:02:30 [2021-06-11T15:02:30.511Z] [INFO] Using 'UTF-8' encoding to copy filtered resources.
11:02:30 [2021-06-11T15:02:30.511Z] [INFO] skip non existing resourceDirectory /home/jenkins/agent/workspace/tracecompass-master-2019-06/jsontrace/org.eclipse.tracecompass.jsontrace.core.tests/src/main/resources
11:02:30 [2021-06-11T15:02:30.511Z] [INFO] 
11:02:30 [2021-06-11T15:02:30.511Z] [INFO] --- tycho-compiler-plugin:2.3.0:compile (default-compile) @ org.eclipse.tracecompass.jsontrace.core.tests ---
11:02:30 [2021-06-11T15:02:30.511Z] [INFO] Compiling 3 source files to /home/jenkins/agent/workspace/tracecompass-master-2019-06/jsontrace/org.eclipse.tracecompass.jsontrace.core.tests/target/classes
11:02:30 [2021-06-11T15:02:30.769Z] [INFO] 
11:02:30 [2021-06-11T15:02:30.769Z] [INFO] --- maven-resources-plugin:3.0.2:testResources (default-testResources) @ org.eclipse.tracecompass.jsontrace.core.tests ---
11:02:30 [2021-06-11T15:02:30.769Z] [INFO] Using 'UTF-8' encoding to copy filtered resources.
11:02:30 [2021-06-11T15:02:30.769Z] [INFO] skip non existing resourceDirectory /home/jenkins/agent/workspace/tracecompass-master-2019-06/jsontrace/org.eclipse.tracecompass.jsontrace.core.tests/src/test/resources
11:02:30 [2021-06-11T15:02:30.769Z] [INFO] 
11:02:30 [2021-06-11T15:02:30.769Z] [INFO] --- tycho-source-plugin:2.3.0:plugin-source (plugin-source) @ org.eclipse.tracecompass.jsontrace.core.tests ---
11:02:30 [2021-06-11T15:02:30.769Z] [INFO] Building jar: /home/jenkins/agent/workspace/tracecompass-master-2019-06/jsontrace/org.eclipse.tracecompass.jsontrace.core.tests/target/org.eclipse.tracecompass.jsontrace.core.tests-1.0.3-SNAPSHOT-sources.jar
11:02:30 [2021-06-11T15:02:30.769Z] [INFO] 
11:02:30 [2021-06-11T15:02:30.769Z] [INFO] --- target-platform-configuration:2.3.0:target-platform (default-target-platform) @ org.eclipse.tracecompass.jsontrace.core.tests ---
11:02:30 [2021-06-11T15:02:30.769Z] [INFO] 
11:02:30 [2021-06-11T15:02:30.769Z] [INFO] --- tycho-packaging-plugin:2.3.0:package-plugin (default-package-plugin) @ org.eclipse.tracecompass.jsontrace.core.tests ---
11:02:30 [2021-06-11T15:02:30.769Z] [INFO] Building jar: /home/jenkins/agent/workspace/tracecompass-master-2019-06/jsontrace/org.eclipse.tracecompass.jsontrace.core.tests/target/org.eclipse.tracecompass.jsontrace.core.tests-1.0.3-SNAPSHOT.jar
11:02:30 [2021-06-11T15:02:30.769Z] [INFO] 
11:02:30 [2021-06-11T15:02:30.769Z] [INFO] --- tycho-p2-plugin:2.3.0:p2-metadata-default (default-p2-metadata-default) @ org.eclipse.tracecompass.jsontrace.core.tests ---
11:02:30 [2021-06-11T15:02:30.769Z] [INFO] 
11:02:30 [2021-06-11T15:02:30.769Z] [INFO] --- tycho-source-feature-plugin:2.3.0:source-feature (source-feature) @ org.eclipse.tracecompass.jsontrace.core.tests ---
11:02:30 [2021-06-11T15:02:30.769Z] [WARNING] Mojo tycho-source-feature-plugin:source-feature is replaced by the tycho-source-plugin:feature-source which offers equivalent and even enhanced functionality
11:02:30 [2021-06-11T15:02:30.769Z] [INFO] 
11:02:30 [2021-06-11T15:02:30.769Z] [INFO] --- tycho-pack200b-plugin:2.3.0:pack (pack200-pack) @ org.eclipse.tracecompass.jsontrace.core.tests ---
11:02:30 [2021-06-11T15:02:30.769Z] [WARNING] Pack200 actions are deprecated and scheduled for removal.
11:02:30 [2021-06-11T15:02:30.769Z] [INFO] Pack200 packing jar /home/jenkins/agent/workspace/tracecompass-master-2019-06/jsontrace/org.eclipse.tracecompass.jsontrace.core.tests/target/org.eclipse.tracecompass.jsontrace.core.tests-1.0.3-SNAPSHOT.jar
11:02:30 [2021-06-11T15:02:30.769Z] [INFO] 
11:02:30 [2021-06-11T15:02:30.769Z] [INFO] --- tycho-p2-plugin:2.3.0:p2-metadata (p2-metadata) @ org.eclipse.tracecompass.jsontrace.core.tests ---
11:02:30 [2021-06-11T15:02:30.770Z] [INFO] 
11:02:30 [2021-06-11T15:02:30.770Z] [INFO] --- maven-install-plugin:2.5.2:install (default-install) @ org.eclipse.tracecompass.jsontrace.core.tests ---
11:02:30 [2021-06-11T15:02:30.770Z] [INFO] Installing /home/jenkins/agent/workspace/tracecompass-master-2019-06/jsontrace/org.eclipse.tracecompass.jsontrace.core.tests/target/org.eclipse.tracecompass.jsontrace.core.tests-1.0.3-SNAPSHOT.jar to /home/jenkins/.m2/repository/org/eclipse/tracecompass/org.eclipse.tracecompass.jsontrace.core.tests/1.0.3-SNAPSHOT/org.eclipse.tracecompass.jsontrace.core.tests-1.0.3-SNAPSHOT.jar
11:02:30 [2021-06-11T15:02:30.770Z] [INFO] Installing /home/jenkins/agent/workspace/tracecompass-master-2019-06/jsontrace/org.eclipse.tracecompass.jsontrace.core.tests/pom.xml to /home/jenkins/.m2/repository/org/eclipse/tracecompass/org.eclipse.tracecompass.jsontrace.core.tests/1.0.3-SNAPSHOT/org.eclipse.tracecompass.jsontrace.core.tests-1.0.3-SNAPSHOT.pom
11:02:30 [2021-06-11T15:02:30.770Z] [INFO] Installing /home/jenkins/agent/workspace/tracecompass-master-2019-06/jsontrace/org.eclipse.tracecompass.jsontrace.core.tests/target/org.eclipse.tracecompass.jsontrace.core.tests-1.0.3-SNAPSHOT-sources.jar to /home/jenkins/.m2/repository/org/eclipse/tracecompass/org.eclipse.tracecompass.jsontrace.core.tests/1.0.3-SNAPSHOT/org.eclipse.tracecompass.jsontrace.core.tests-1.0.3-SNAPSHOT-sources.jar
11:02:30 [2021-06-11T15:02:30.770Z] [INFO] Installing /home/jenkins/agent/workspace/tracecompass-master-2019-06/jsontrace/org.eclipse.tracecompass.jsontrace.core.tests/target/org.eclipse.tracecompass.jsontrace.core.tests-1.0.3-SNAPSHOT.jar.pack.gz to /home/jenkins/.m2/repository/org/eclipse/tracecompass/org.eclipse.tracecompass.jsontrace.core.tests/1.0.3-SNAPSHOT/org.eclipse.tracecompass.jsontrace.core.tests-1.0.3-SNAPSHOT-pack200.jar.pack.gz
11:02:30 [2021-06-11T15:02:30.770Z] [INFO] Installing /home/jenkins/agent/workspace/tracecompass-master-2019-06/jsontrace/org.eclipse.tracecompass.jsontrace.core.tests/target/p2content.xml to /home/jenkins/.m2/repository/org/eclipse/tracecompass/org.eclipse.tracecompass.jsontrace.core.tests/1.0.3-SNAPSHOT/org.eclipse.tracecompass.jsontrace.core.tests-1.0.3-SNAPSHOT-p2metadata.xml
11:02:30 [2021-06-11T15:02:30.770Z] [INFO] Installing /home/jenkins/agent/workspace/tracecompass-master-2019-06/jsontrace/org.eclipse.tracecompass.jsontrace.core.tests/target/p2artifacts.xml to /home/jenkins/.m2/repository/org/eclipse/tracecompass/org.eclipse.tracecompass.jsontrace.core.tests/1.0.3-SNAPSHOT/org.eclipse.tracecompass.jsontrace.core.tests-1.0.3-SNAPSHOT-p2artifacts.xml
11:02:30 [2021-06-11T15:02:30.770Z] [INFO] 
11:02:30 [2021-06-11T15:02:30.770Z] [INFO] --- tycho-p2-plugin:2.3.0:update-local-index (default-update-local-index) @ org.eclipse.tracecompass.jsontrace.core.tests ---
11:02:30 [2021-06-11T15:02:30.770Z] [INFO] ------------------------------------------------------------------------
11:02:30 [2021-06-11T15:02:30.770Z] [INFO] Reactor Summary:
11:02:30 [2021-06-11T15:02:30.770Z] [INFO] 
11:02:30 [2021-06-11T15:02:30.770Z] [INFO] Trace Compass Parent 7.0.0-SNAPSHOT ................ SUCCESS [ 19.101 s]
11:02:30 [2021-06-11T15:02:30.770Z] [INFO] Trace Compass Tracetype-agnostic Analyses Parent 7.0.0-SNAPSHOT SUCCESS [  0.011 s]
11:02:30 [2021-06-11T15:02:30.770Z] [INFO] Trace Compass Common Utilities Parent 7.0.0-SNAPSHOT SUCCESS [  0.008 s]
11:02:30 [2021-06-11T15:02:30.770Z] [INFO] org.eclipse.tracecompass.common.core 4.3.0-SNAPSHOT  SUCCESS [ 21.503 s]
11:02:30 [2021-06-11T15:02:30.770Z] [INFO] Trace Compass State System Parent 7.0.0-SNAPSHOT ... SUCCESS [  0.010 s]
11:02:30 [2021-06-11T15:02:30.770Z] [INFO] org.eclipse.tracecompass.datastore.core 1.2.2-SNAPSHOT SUCCESS [  1.693 s]
11:02:30 [2021-06-11T15:02:30.770Z] [INFO] org.eclipse.tracecompass.segmentstore.core 3.0.1-SNAPSHOT SUCCESS [  1.003 s]
11:02:30 [2021-06-11T15:02:30.770Z] [INFO] org.eclipse.tracecompass.statesystem.core 5.0.3-SNAPSHOT SUCCESS [  1.382 s]
11:02:30 [2021-06-11T15:02:30.770Z] [INFO] Trace Compass TMF Parent 7.0.0-SNAPSHOT ............ SUCCESS [  0.010 s]
11:02:30 [2021-06-11T15:02:30.770Z] [INFO] Trace Compass Filter Parser 1.0.6-SNAPSHOT ......... SUCCESS [  0.512 s]
11:02:30 [2021-06-11T15:02:30.770Z] [INFO] org.eclipse.tracecompass.tmf.core 7.0.0-SNAPSHOT ... SUCCESS [  5.419 s]
11:02:30 [2021-06-11T15:02:30.770Z] [INFO] org.eclipse.tracecompass.analysis.counters.core 2.0.6-SNAPSHOT SUCCESS [  0.485 s]
11:02:30 [2021-06-11T15:02:30.770Z] [INFO] Trace Compass CTF Support Parent 7.0.0-SNAPSHOT .... SUCCESS [  0.060 s]
11:02:30 [2021-06-11T15:02:30.770Z] [INFO] Trace Compass CTF Parser Plug-in 1.0.6-SNAPSHOT .... SUCCESS [  8.526 s]
11:02:30 [2021-06-11T15:02:30.770Z] [INFO] org.eclipse.tracecompass.ctf.core 4.0.5-SNAPSHOT ... SUCCESS [  1.306 s]
11:02:30 [2021-06-11T15:02:30.770Z] [INFO] Trace Compass CTF Core Tests Plug-in 1.0.9-SNAPSHOT  SUCCESS [01:00 min]
11:02:30 [2021-06-11T15:02:30.770Z] [INFO] org.eclipse.tracecompass.statesystem.core.tests 1.0.13-SNAPSHOT SUCCESS [ 11.776 s]
11:02:30 [2021-06-11T15:02:30.770Z] [INFO] org.eclipse.tracecompass.tmf.core.tests 1.0.17-SNAPSHOT SUCCESS [05:16 min]
11:02:30 [2021-06-11T15:02:30.770Z] [INFO] org.eclipse.tracecompass.tmf.ctf.core 4.2.2-SNAPSHOT SUCCESS [  0.645 s]
11:02:30 [2021-06-11T15:02:30.770Z] [INFO] org.eclipse.tracecompass.tmf.ctf.core.tests 1.0.13-SNAPSHOT SUCCESS [04:22 min]
11:02:30 [2021-06-11T15:02:30.770Z] [INFO] org.eclipse.tracecompass.analysis.counters.core.tests 1.0.1-SNAPSHOT SUCCESS [  6.500 s]
11:02:30 [2021-06-11T15:02:30.770Z] [INFO] org.eclipse.tracecompass.tmf.ui 7.0.0-SNAPSHOT ..... SUCCESS [  7.124 s]
11:02:30 [2021-06-11T15:02:30.770Z] [INFO] org.eclipse.tracecompass.analysis.counters.ui 2.0.0-SNAPSHOT SUCCESS [  0.501 s]
11:02:30 [2021-06-11T15:02:30.770Z] [INFO] org.eclipse.tracecompass.tmf.ui.tests 1.0.16-SNAPSHOT SUCCESS [03:00 min]
11:02:30 [2021-06-11T15:02:30.770Z] [INFO] org.eclipse.tracecompass.tmf.ui.swtbot.tests 1.0.16-SNAPSHOT SUCCESS [05:32 min]
11:02:30 [2021-06-11T15:02:30.770Z] [INFO] org.eclipse.tracecompass.analysis.graph.core 3.0.0-SNAPSHOT SUCCESS [  0.552 s]
11:02:30 [2021-06-11T15:02:30.770Z] [INFO] org.eclipse.tracecompass.tmf.chart.core 1.0.4-SNAPSHOT SUCCESS [  0.389 s]
11:02:30 [2021-06-11T15:02:30.770Z] [INFO] org.eclipse.tracecompass.analysis.lami.core 1.1.3-SNAPSHOT SUCCESS [  0.531 s]
11:02:30 [2021-06-11T15:02:30.770Z] [INFO] org.eclipse.tracecompass.analysis.timing.core 5.2.1-SNAPSHOT SUCCESS [  0.499 s]
11:02:30 [2021-06-11T15:02:30.770Z] [INFO] org.eclipse.tracecompass.analysis.os.linux.core 6.0.0-SNAPSHOT SUCCESS [  1.269 s]
11:02:30 [2021-06-11T15:02:30.770Z] [INFO] Trace Compass LTTng Support Parent 7.0.0-SNAPSHOT .. SUCCESS [  0.008 s]
11:02:30 [2021-06-11T15:02:30.770Z] [INFO] org.eclipse.tracecompass.lttng2.common.core 1.1.3-SNAPSHOT SUCCESS [  0.301 s]
11:02:30 [2021-06-11T15:02:30.770Z] [INFO] org.eclipse.tracecompass.tmf.analysis.xml.core 4.0.2-SNAPSHOT SUCCESS [  1.077 s]
11:02:30 [2021-06-11T15:02:30.770Z] [INFO] org.eclipse.tracecompass.lttng2.kernel.core 3.0.5-SNAPSHOT SUCCESS [  0.516 s]
11:02:30 [2021-06-11T15:02:30.770Z] [INFO] org.eclipse.tracecompass.analysis.counters.ui.swtbot.tests 1.0.2-SNAPSHOT SUCCESS [01:34 min]
11:02:30 [2021-06-11T15:02:30.770Z] [INFO] org.eclipse.tracecompass.analysis.graph.core.tests 1.0.6-SNAPSHOT SUCCESS [ 10.134 s]
11:02:30 [2021-06-11T15:02:30.770Z] [INFO] org.eclipse.tracecompass.analysis.graph.ui 1.0.11-SNAPSHOT SUCCESS [  0.544 s]
11:02:30 [2021-06-11T15:02:30.770Z] [INFO] org.eclipse.tracecompass.analysis.lami.core.tests 1.0.4-SNAPSHOT SUCCESS [  7.014 s]
11:02:30 [2021-06-11T15:02:30.770Z] [INFO] org.eclipse.tracecompass.tmf.chart.ui 1.0.11-SNAPSHOT SUCCESS [  0.944 s]
11:02:30 [2021-06-11T15:02:30.770Z] [INFO] org.eclipse.tracecompass.analysis.lami.ui 1.1.5-SNAPSHOT SUCCESS [  1.008 s]
11:02:30 [2021-06-11T15:02:30.770Z] [INFO] org.eclipse.tracecompass.tmf.chart.core.tests 1.0.3-SNAPSHOT SUCCESS [  7.257 s]
11:02:30 [2021-06-11T15:02:30.770Z] [INFO] org.eclipse.tracecompass.tmf.chart.ui.swtbot.tests 1.0.6-SNAPSHOT SUCCESS [ 19.316 s]
11:02:30 [2021-06-11T15:02:30.770Z] [INFO] org.eclipse.tracecompass.analysis.lami.ui.swtbot.tests 1.0.6-SNAPSHOT SUCCESS [ 32.069 s]
11:02:30 [2021-06-11T15:02:30.770Z] [INFO] org.eclipse.tracecompass.analysis.os.linux.core.tests 1.0.15-SNAPSHOT SUCCESS [02:03 min]
11:02:30 [2021-06-11T15:02:30.770Z] [INFO] org.eclipse.tracecompass.analysis.timing.ui 5.0.0-SNAPSHOT SUCCESS [  0.968 s]
11:02:30 [2021-06-11T15:02:30.770Z] [INFO] org.eclipse.tracecompass.analysis.os.linux.ui 4.0.4-SNAPSHOT SUCCESS [  0.925 s]
11:02:30 [2021-06-11T15:02:30.770Z] [INFO] org.eclipse.tracecompass.analysis.os.linux.ui.tests 1.0.9-SNAPSHOT SUCCESS [ 16.843 s]
11:02:30 [2021-06-11T15:02:30.770Z] [INFO] org.eclipse.tracecompass.analysis.timing.core.tests 1.0.6-SNAPSHOT SUCCESS [ 15.996 s]
11:02:30 [2021-06-11T15:02:30.770Z] [INFO] org.eclipse.tracecompass.analysis.timing.ui.swtbot.tests 1.0.11-SNAPSHOT SUCCESS [01:02 min]
11:02:30 [2021-06-11T15:02:30.770Z] [INFO] org.eclipse.tracecompass.analysis.os.linux.ui.swtbot.tests 1.0.16-SNAPSHOT SUCCESS [01:40 min]
11:02:30 [2021-06-11T15:02:30.770Z] [INFO] org.eclipse.tracecompass.analysis.profiling.core 2.0.1-SNAPSHOT SUCCESS [  0.544 s]
11:02:30 [2021-06-11T15:02:30.770Z] [INFO] org.eclipse.tracecompass.analysis.profiling.core.tests 1.0.6-SNAPSHOT SUCCESS [ 40.715 s]
11:02:30 [2021-06-11T15:02:30.770Z] [INFO] org.eclipse.tracecompass.analysis.profiling.ui 2.1.3-SNAPSHOT SUCCESS [  0.638 s]
11:02:30 [2021-06-11T15:02:30.770Z] [INFO] org.eclipse.tracecompass.analysis.profiling.ui.swtbot.tests 1.0.6-SNAPSHOT SUCCESS [ 15.879 s]
11:02:30 [2021-06-11T15:02:30.770Z] [INFO] Trace Compass BTF Support Parent 7.0.0-SNAPSHOT .... SUCCESS [  0.007 s]
11:02:30 [2021-06-11T15:02:30.770Z] [INFO] org.eclipse.tracecompass.btf.core 3.0.0-SNAPSHOT ... SUCCESS [  0.264 s]
11:02:30 [2021-06-11T15:02:30.770Z] [INFO] Trace Compass Documentation 7.0.0-SNAPSHOT ......... SUCCESS [  0.045 s]
11:02:30 [2021-06-11T15:02:30.770Z] [INFO] Trace Compass Developer Guide 7.0.0-SNAPSHOT ....... SUCCESS [ 25.443 s]
11:02:30 [2021-06-11T15:02:30.770Z] [INFO] org.eclipse.tracecompass.tmf.analysis.xml.ui 2.1.15-SNAPSHOT SUCCESS [  0.770 s]
11:02:30 [2021-06-11T15:02:30.770Z] [INFO] org.eclipse.tracecompass.tmf 7.0.0-SNAPSHOT ........ SUCCESS [  0.543 s]
11:02:30 [2021-06-11T15:02:30.770Z] [INFO] org.eclipse.tracecompass.btf.ui 1.0.4-SNAPSHOT ..... SUCCESS [  0.386 s]
11:02:30 [2021-06-11T15:02:30.770Z] [INFO] org.eclipse.tracecompass.btf 7.0.0-SNAPSHOT ........ SUCCESS [  0.165 s]
11:02:30 [2021-06-11T15:02:30.770Z] [INFO] org.eclipse.tracecompass.btf.core.tests 1.0.3-SNAPSHOT SUCCESS [  5.857 s]
11:02:30 [2021-06-11T15:02:30.770Z] [INFO] org.eclipse.tracecompass.common.core.tests 1.1.9-SNAPSHOT SUCCESS [  5.960 s]
11:02:30 [2021-06-11T15:02:30.770Z] [INFO] org.eclipse.tracecompass.ctf 7.0.0-SNAPSHOT ........ SUCCESS [  0.082 s]
11:02:30 [2021-06-11T15:02:30.770Z] [INFO] org.eclipse.tracecompass.ctf.parser.tests 1.0.3-SNAPSHOT SUCCESS [  4.898 s]
11:02:30 [2021-06-11T15:02:30.770Z] [INFO] org.eclipse.tracecompass.tmf.ctf 7.0.0-SNAPSHOT .... SUCCESS [  0.102 s]
11:02:30 [2021-06-11T15:02:30.770Z] [INFO] org.eclipse.tracecompass.tmf.ctf.ui.swtbot.tests 1.0.11-SNAPSHOT SUCCESS [02:21 min]
11:02:30 [2021-06-11T15:02:30.770Z] [INFO] Trace Compass User Guide 7.0.0-SNAPSHOT ............ SUCCESS [  7.286 s]
11:02:30 [2021-06-11T15:02:30.770Z] [INFO] Trace Compass GDB Tracepoint Analysis User Guide 7.0.0-SNAPSHOT SUCCESS [  4.582 s]
11:02:30 [2021-06-11T15:02:30.770Z] [INFO] Trace Compass RCP User Guide 7.0.0-SNAPSHOT ........ SUCCESS [  4.278 s]
11:02:30 [2021-06-11T15:02:30.770Z] [INFO] Trace Compass Pcap User Guide 7.0.0-SNAPSHOT ....... SUCCESS [  4.341 s]
11:02:30 [2021-06-11T15:02:30.770Z] [INFO] org.eclipse.tracecompass.examples 1.0.7-SNAPSHOT ... SUCCESS [  0.504 s]
11:02:30 [2021-06-11T15:02:30.770Z] [INFO] Trace Compass GDB Tracepoint Analysis Parent 7.0.0-SNAPSHOT SUCCESS [  0.007 s]
11:02:30 [2021-06-11T15:02:30.770Z] [INFO] org.eclipse.tracecompass.gdbtrace.core 1.0.7-SNAPSHOT SUCCESS [  0.541 s]
11:02:30 [2021-06-11T15:02:30.770Z] [INFO] org.eclipse.tracecompass.gdbtrace.ui 1.1.4-SNAPSHOT  SUCCESS [  0.469 s]
11:02:30 [2021-06-11T15:02:30.770Z] [INFO] org.eclipse.tracecompass.gdbtrace 7.0.0-SNAPSHOT ... SUCCESS [  0.124 s]
11:02:30 [2021-06-11T15:02:30.770Z] [INFO] org.eclipse.tracecompass.gdbtrace.core.tests 1.0.2-SNAPSHOT SUCCESS [  5.631 s]
11:02:30 [2021-06-11T15:02:30.770Z] [INFO] org.eclipse.tracecompass.gdbtrace.ui.tests 1.0.2-SNAPSHOT SUCCESS [ 13.338 s]
11:02:30 [2021-06-11T15:02:30.770Z] [INFO] org.eclipse.tracecompass.lttng2.common.core.tests 1.0.2-SNAPSHOT SUCCESS [  5.060 s]
11:02:30 [2021-06-11T15:02:30.770Z] [INFO] org.eclipse.tracecompass.lttng2.control.core 1.2.5-SNAPSHOT SUCCESS [  0.456 s]
11:02:30 [2021-06-11T15:02:30.770Z] [INFO] org.eclipse.tracecompass.tmf.remote.core 2.0.5-SNAPSHOT SUCCESS [  0.287 s]
11:02:30 [2021-06-11T15:02:30.770Z] [INFO] org.eclipse.tracecompass.tmf.remote.ui 1.0.9-SNAPSHOT SUCCESS [  0.736 s]
11:02:30 [2021-06-11T15:02:30.770Z] [INFO] org.eclipse.tracecompass.lttng2.control.ui 1.2.12-SNAPSHOT SUCCESS [  1.403 s]
11:02:30 [2021-06-11T15:02:30.770Z] [INFO] org.eclipse.tracecompass.lttng2.control 7.0.0-SNAPSHOT SUCCESS [  0.172 s]
11:02:30 [2021-06-11T15:02:30.770Z] [INFO] org.eclipse.tracecompass.lttng2.control.core.tests 1.1.3-SNAPSHOT SUCCESS [  5.785 s]
11:02:30 [2021-06-11T15:02:30.770Z] [INFO] org.eclipse.tracecompass.tmf.remote.core.tests 1.0.2-SNAPSHOT SUCCESS [  5.886 s]
11:02:30 [2021-06-11T15:02:30.770Z] [INFO] org.eclipse.tracecompass.lttng2.control.ui.tests 2.0.5-SNAPSHOT SUCCESS [ 35.568 s]
11:02:30 [2021-06-11T15:02:30.770Z] [INFO] org.eclipse.tracecompass.lttng2.control.ui.swtbot.tests 1.0.8-SNAPSHOT SUCCESS [01:01 min]
11:02:30 [2021-06-11T15:02:30.770Z] [INFO] org.eclipse.tracecompass.lttng2.kernel.ui 2.0.2-SNAPSHOT SUCCESS [  0.355 s]
11:02:30 [2021-06-11T15:02:30.770Z] [INFO] org.eclipse.tracecompass.lttng2.kernel 7.0.0-SNAPSHOT SUCCESS [  0.219 s]
11:02:30 [2021-06-11T15:02:30.770Z] [INFO] org.eclipse.tracecompass.tmf.analysis.xml.core.tests 1.0.13-SNAPSHOT SUCCESS [ 40.915 s]
11:02:30 [2021-06-11T15:02:30.770Z] [INFO] org.eclipse.tracecompass.lttng2.kernel.core.tests 2.0.2-SNAPSHOT SUCCESS [01:04 min]
11:02:30 [2021-06-11T15:02:30.770Z] [INFO] org.eclipse.tracecompass.lttng2.kernel.ui.swtbot.tests 1.0.16-SNAPSHOT SUCCESS [04:39 min]
11:02:30 [2021-06-11T15:02:30.771Z] [INFO] org.eclipse.tracecompass.lttng2.ust.core 5.0.2-SNAPSHOT SUCCESS [  0.580 s]
11:02:30 [2021-06-11T15:02:30.771Z] [INFO] org.eclipse.tracecompass.lttng2.ust.ui 3.0.10-SNAPSHOT SUCCESS [  0.340 s]
11:02:30 [2021-06-11T15:02:30.771Z] [INFO] org.eclipse.tracecompass.lttng2.ust 7.0.0-SNAPSHOT . SUCCESS [  0.172 s]
11:02:30 [2021-06-11T15:02:30.771Z] [INFO] org.eclipse.tracecompass.lttng2.ust.core.tests 1.0.12-SNAPSHOT SUCCESS [ 31.101 s]
11:02:30 [2021-06-11T15:02:30.771Z] [INFO] org.eclipse.tracecompass.lttng2.ust.ui.tests 1.0.2-SNAPSHOT SUCCESS [ 12.761 s]
11:02:30 [2021-06-11T15:02:30.771Z] [INFO] org.eclipse.tracecompass.lttng2.ust.ui.swtbot.tests 1.0.15-SNAPSHOT SUCCESS [01:13 min]
11:02:30 [2021-06-11T15:02:30.771Z] [INFO] Trace Compass Pcap Format Support Parent 7.0.0-SNAPSHOT SUCCESS [  0.007 s]
11:02:30 [2021-06-11T15:02:30.771Z] [INFO] org.eclipse.tracecompass.pcap.core 1.1.3-SNAPSHOT .. SUCCESS [  0.330 s]
11:02:30 [2021-06-11T15:02:30.771Z] [INFO] Trace Compass Pcap Parser Core Tests Plug-in 1.0.5-SNAPSHOT SUCCESS [  9.000 s]
11:02:30 [2021-06-11T15:02:30.771Z] [INFO] org.eclipse.tracecompass.tmf.pcap.core 1.0.5-SNAPSHOT SUCCESS [  0.390 s]
11:02:30 [2021-06-11T15:02:30.771Z] [INFO] org.eclipse.tracecompass.tmf.pcap.ui 1.1.4-SNAPSHOT  SUCCESS [  0.568 s]
11:02:30 [2021-06-11T15:02:30.771Z] [INFO] org.eclipse.tracecompass.tmf.pcap 7.0.0-SNAPSHOT ... SUCCESS [  0.153 s]
11:02:30 [2021-06-11T15:02:30.771Z] [INFO] org.eclipse.tracecompass.tmf.pcap.core.tests 1.0.3-SNAPSHOT SUCCESS [  7.546 s]
11:02:30 [2021-06-11T15:02:30.771Z] [INFO] org.eclipse.tracecompass.tmf.pcap.ui.swtbot.tests 1.0.2-SNAPSHOT SUCCESS [ 33.334 s]
11:02:30 [2021-06-11T15:02:30.771Z] [INFO] Trace Compass RCP Parent 7.0.0-SNAPSHOT ............ SUCCESS [  0.008 s]
11:02:30 [2021-06-11T15:02:30.771Z] [INFO] Trace Compass RCP Branding plug-in 7.0.0-SNAPSHOT .. SUCCESS [  0.181 s]
11:02:30 [2021-06-11T15:02:30.771Z] [INFO] Trace Compass RCP Branding Feature 7.0.0-SNAPSHOT .. SUCCESS [  0.090 s]
11:02:30 [2021-06-11T15:02:30.771Z] [INFO] org.eclipse.tracecompass.tmf.cli.core 1.0.2-SNAPSHOT SUCCESS [  0.304 s]
11:02:30 [2021-06-11T15:02:30.771Z] [INFO] org.eclipse.tracecompass.rcp.ui 7.0.0-SNAPSHOT ..... SUCCESS [  0.427 s]
11:02:30 [2021-06-11T15:02:30.771Z] [INFO] Trace Compass RCP Feature 7.0.0-SNAPSHOT ........... SUCCESS [  0.690 s]
11:02:30 [2021-06-11T15:02:30.771Z] [INFO] org.eclipse.tracecompass.tmf.cli.core.tests 1.0.2-SNAPSHOT SUCCESS [  6.518 s]
11:02:30 [2021-06-11T15:02:30.771Z] [INFO] org.eclipse.tracecompass.rcp.ui.tests 2.0.4-SNAPSHOT SUCCESS [ 13.303 s]
11:02:30 [2021-06-11T15:02:30.771Z] [INFO] org.eclipse.tracecompass.rcp.incubator.ui 1.0.2-SNAPSHOT SUCCESS [  0.183 s]
11:02:30 [2021-06-11T15:02:30.771Z] [INFO] org.eclipse.tracecompass.rcp.incubator 7.0.0-SNAPSHOT SUCCESS [  0.091 s]
11:02:30 [2021-06-11T15:02:30.771Z] [INFO] Trace Compass Json trace Parent 7.0.0-SNAPSHOT ..... SUCCESS [  0.009 s]
11:02:30 [2021-06-11T15:02:30.771Z] [INFO] org.eclipse.tracecompass.jsontrace.core 1.0.3-SNAPSHOT SUCCESS [  0.208 s]
11:02:30 [2021-06-11T15:02:30.771Z] [INFO] org.eclipse.tracecompass.jsontrace 7.0.0-SNAPSHOT .. SUCCESS [  0.160 s]
11:02:30 [2021-06-11T15:02:30.771Z] [INFO] org.eclipse.tracecompass.tmf.cli 7.0.0-SNAPSHOT .... SUCCESS [  0.101 s]
11:02:30 [2021-06-11T15:02:30.771Z] [INFO] Trace Compass RCP Product 7.0.0-SNAPSHOT ........... SUCCESS [01:13 min]
11:02:30 [2021-06-11T15:02:30.771Z] [INFO] Trace Compass Release Engineering Parent 7.0.0-SNAPSHOT SUCCESS [  0.011 s]
11:02:30 [2021-06-11T15:02:30.771Z] [INFO] Trace Compass Target Platform 7.0.0-SNAPSHOT ....... SUCCESS [  6.614 s]
11:02:30 [2021-06-11T15:02:30.771Z] [INFO] org.eclipse.tracecompass.integration.swtbot.tests 1.0.12-SNAPSHOT SUCCESS [08:48 min]
11:02:30 [2021-06-11T15:02:30.771Z] [INFO] org.eclipse.tracecompass.datastore.core.tests 1.0.6-SNAPSHOT SUCCESS [  7.785 s]
11:02:30 [2021-06-11T15:02:30.771Z] [INFO] org.eclipse.tracecompass.segmentstore.core.tests 1.0.5-SNAPSHOT SUCCESS [  6.618 s]
11:02:30 [2021-06-11T15:02:30.771Z] [INFO] org.eclipse.tracecompass.tmf.analysis.xml.ui.swtbot.tests 1.0.13-SNAPSHOT SUCCESS [01:12 min]
11:02:30 [2021-06-11T15:02:30.771Z] [INFO] org.eclipse.tracecompass.tmf.analysis.xml.ui.tests 1.0.4-SNAPSHOT SUCCESS [ 14.613 s]
11:02:30 [2021-06-11T15:02:30.771Z] [INFO] org.eclipse.tracecompass.tmf.chart.ui.tests 1.0.2-SNAPSHOT SUCCESS [ 15.271 s]
11:02:30 [2021-06-11T15:02:30.771Z] [INFO] org.eclipse.tracecompass.tmf.remote.ui.swtbot.tests 1.0.9-SNAPSHOT SUCCESS [01:55 min]
11:02:30 [2021-06-11T15:02:30.771Z] [INFO] org.eclipse.tracecompass.tmf.remote.ui.tests 1.0.2-SNAPSHOT SUCCESS [ 12.896 s]
11:02:30 [2021-06-11T15:02:30.771Z] [INFO] Trace Compass All Tests 1.0.11-SNAPSHOT ............ SUCCESS [  6.742 s]
11:02:30 [2021-06-11T15:02:30.771Z] [INFO] org.eclipse.tracecompass.testing 7.0.0-SNAPSHOT .... SUCCESS [  0.326 s]
11:02:30 [2021-06-11T15:02:30.771Z] [INFO] org.eclipse.tracecompass.tmf.remote 7.0.0-SNAPSHOT . SUCCESS [  0.072 s]
11:02:30 [2021-06-11T15:02:30.771Z] [INFO] Trace Compass Repository 7.0.0-SNAPSHOT ............ SUCCESS [ 10.849 s]
11:02:30 [2021-06-11T15:02:30.771Z] [INFO] org.eclipse.tracecompass.jsontrace.core.tests 1.0.3-SNAPSHOT SUCCESS [  0.225 s]
11:02:30 [2021-06-11T15:02:30.771Z] [INFO] ------------------------------------------------------------------------
11:02:30 [2021-06-11T15:02:30.771Z] [INFO] BUILD SUCCESS
11:02:30 [2021-06-11T15:02:30.771Z] [INFO] ------------------------------------------------------------------------
11:02:30 [2021-06-11T15:02:30.771Z] [INFO] Total time:  01:05 h
11:02:30 [2021-06-11T15:02:30.771Z] [INFO] Finished at: 2021-06-11T15:02:30Z
11:02:30 [2021-06-11T15:02:30.771Z] [INFO] ------------------------------------------------------------------------