FailedConsole Output

Skipping 2,913 KB.. Full Log
7.430Z]            -> Bundle-SymbolicName: org.eclipse.tracecompass.tmf.core; bundle-version="6.1.0.202010090321"; singleton:="true"
05:43:27 [2020-10-14T09:43:27.430Z]   Unresolved requirement: Require-Bundle: org.eclipse.tracecompass.analysis.timing.core
05:43:27 [2020-10-14T09:43:27.430Z]     -> Bundle-SymbolicName: org.eclipse.tracecompass.analysis.timing.core; bundle-version="5.2.0.202010090321"; singleton:="true"
05:43:27 [2020-10-14T09:43:27.430Z]   Unresolved requirement: Require-Bundle: org.eclipse.tracecompass.lttng2.ust.core
05:43:27 [2020-10-14T09:43:27.430Z]     -> Bundle-SymbolicName: org.eclipse.tracecompass.lttng2.ust.core; bundle-version="5.0.1.202010090321"; singleton:="true"
05:43:27 [2020-10-14T09:43:27.430Z]        org.eclipse.tracecompass.lttng2.ust.core [235]
05:43:27 [2020-10-14T09:43:27.430Z]          Unresolved requirement: Require-Bundle: org.eclipse.tracecompass.analysis.os.linux.core
05:43:27 [2020-10-14T09:43:27.430Z]            -> Bundle-SymbolicName: org.eclipse.tracecompass.analysis.os.linux.core; bundle-version="5.0.1.202010090321"; singleton:="true"
05:43:27 [2020-10-14T09:43:27.430Z]          Unresolved requirement: Require-Bundle: org.eclipse.tracecompass.lttng2.control.core
05:43:27 [2020-10-14T09:43:27.430Z]            -> Bundle-SymbolicName: org.eclipse.tracecompass.lttng2.control.core; bundle-version="1.2.5.202010090321"; singleton:="true"
05:43:27 [2020-10-14T09:43:27.430Z]               org.eclipse.tracecompass.lttng2.control.core [240]
05:43:27 [2020-10-14T09:43:27.430Z]                 Unresolved requirement: Require-Bundle: org.eclipse.tracecompass.tmf.core
05:43:27 [2020-10-14T09:43:27.430Z]                   -> Bundle-SymbolicName: org.eclipse.tracecompass.tmf.core; bundle-version="6.1.0.202010090321"; singleton:="true"
05:43:27 [2020-10-14T09:43:27.430Z]                 Unresolved requirement: Require-Bundle: org.eclipse.tracecompass.tmf.ctf.core
05:43:27 [2020-10-14T09:43:27.430Z]                   -> Bundle-SymbolicName: org.eclipse.tracecompass.tmf.ctf.core; bundle-version="4.2.2.202010090321"; singleton:="true"
05:43:27 [2020-10-14T09:43:27.430Z]                      org.eclipse.tracecompass.tmf.ctf.core [233]
05:43:27 [2020-10-14T09:43:27.430Z]                        Unresolved requirement: Require-Bundle: org.eclipse.tracecompass.tmf.core
05:43:27 [2020-10-14T09:43:27.430Z]                          -> Bundle-SymbolicName: org.eclipse.tracecompass.tmf.core; bundle-version="6.1.0.202010090321"; singleton:="true"
05:43:27 [2020-10-14T09:43:27.430Z]          Unresolved requirement: Require-Bundle: org.eclipse.tracecompass.lttng2.common.core
05:43:27 [2020-10-14T09:43:27.430Z]            -> Bundle-SymbolicName: org.eclipse.tracecompass.lttng2.common.core; bundle-version="1.1.3.202010090321"; singleton:="true"
05:43:27 [2020-10-14T09:43:27.430Z]          Unresolved requirement: Require-Bundle: org.eclipse.tracecompass.analysis.timing.core
05:43:27 [2020-10-14T09:43:27.430Z]            -> Bundle-SymbolicName: org.eclipse.tracecompass.analysis.timing.core; bundle-version="5.2.0.202010090321"; singleton:="true"
05:43:27 [2020-10-14T09:43:27.430Z]          Unresolved requirement: Require-Bundle: org.eclipse.tracecompass.tmf.core
05:43:27 [2020-10-14T09:43:27.430Z]            -> Bundle-SymbolicName: org.eclipse.tracecompass.tmf.core; bundle-version="6.1.0.202010090321"; singleton:="true"
05:43:27 [2020-10-14T09:43:27.430Z]          Unresolved requirement: Require-Bundle: org.eclipse.tracecompass.tmf.ctf.core
05:43:27 [2020-10-14T09:43:27.430Z]            -> Bundle-SymbolicName: org.eclipse.tracecompass.tmf.ctf.core; bundle-version="4.2.2.202010090321"; singleton:="true"
05:43:27 [2020-10-14T09:43:27.430Z]          Unresolved requirement: Require-Bundle: org.eclipse.tracecompass.analysis.counters.core
05:43:27 [2020-10-14T09:43:27.430Z]            -> Bundle-SymbolicName: org.eclipse.tracecompass.analysis.counters.core; bundle-version="2.0.5.202010090321"; singleton:="true"
05:43:27 [2020-10-14T09:43:27.430Z]          Unresolved requirement: Require-Bundle: org.eclipse.tracecompass.analysis.profiling.core
05:43:27 [2020-10-14T09:43:27.430Z]            -> Bundle-SymbolicName: org.eclipse.tracecompass.analysis.profiling.core; bundle-version="2.0.1.202010090321"; singleton:="true"
05:43:27 [2020-10-14T09:43:27.430Z]               org.eclipse.tracecompass.analysis.profiling.core [226]
05:43:27 [2020-10-14T09:43:27.430Z]                 Unresolved requirement: Require-Bundle: org.eclipse.tracecompass.tmf.core
05:43:27 [2020-10-14T09:43:27.430Z]                   -> Bundle-SymbolicName: org.eclipse.tracecompass.tmf.core; bundle-version="6.1.0.202010090321"; singleton:="true"
05:43:27 [2020-10-14T09:43:27.430Z]                 Unresolved requirement: Require-Bundle: org.eclipse.cdt.core
05:43:27 [2020-10-14T09:43:27.430Z]                   -> Bundle-SymbolicName: org.eclipse.cdt.core; bundle-version="7.0.0.202009010132"; singleton:="true"
05:43:27 [2020-10-14T09:43:27.430Z]   Unresolved requirement: Require-Bundle: org.eclipse.tracecompass.tmf.ctf.core
05:43:27 [2020-10-14T09:43:27.430Z]     -> Bundle-SymbolicName: org.eclipse.tracecompass.tmf.ctf.core; bundle-version="4.2.2.202010090321"; singleton:="true"
05:43:27 [2020-10-14T09:43:27.430Z]   Unresolved requirement: Require-Bundle: org.eclipse.tracecompass.incubator.analysis.core
05:43:27 [2020-10-14T09:43:27.430Z]     -> Bundle-SymbolicName: org.eclipse.tracecompass.incubator.analysis.core; bundle-version="0.0.1.202010140930"; singleton:="true"
05:43:27 [2020-10-14T09:43:27.430Z]        org.eclipse.tracecompass.incubator.analysis.core [230]
05:43:27 [2020-10-14T09:43:27.430Z]          Unresolved requirement: Require-Bundle: org.eclipse.tracecompass.tmf.core
05:43:27 [2020-10-14T09:43:27.430Z]            -> Bundle-SymbolicName: org.eclipse.tracecompass.tmf.core; bundle-version="6.1.0.202010090321"; singleton:="true"
05:43:27 [2020-10-14T09:43:27.430Z]          Unresolved requirement: Require-Bundle: org.eclipse.tracecompass.analysis.timing.core
05:43:27 [2020-10-14T09:43:27.430Z]            -> Bundle-SymbolicName: org.eclipse.tracecompass.analysis.timing.core; bundle-version="5.2.0.202010090321"; singleton:="true"
05:43:27 [2020-10-14T09:43:27.430Z]          Unresolved requirement: Require-Bundle: org.eclipse.tracecompass.analysis.os.linux.core
05:43:27 [2020-10-14T09:43:27.430Z]            -> Bundle-SymbolicName: org.eclipse.tracecompass.analysis.os.linux.core; bundle-version="5.0.1.202010090321"; singleton:="true"
05:43:27 [2020-10-14T09:43:27.430Z]   Unresolved requirement: Require-Bundle: org.eclipse.tracecompass.tmf.core
05:43:27 [2020-10-14T09:43:27.430Z]     -> Bundle-SymbolicName: org.eclipse.tracecompass.tmf.core; bundle-version="6.1.0.202010090321"; singleton:="true"
05:43:27 [2020-10-14T09:43:27.431Z]   Unresolved requirement: Require-Bundle: org.eclipse.tracecompass.analysis.os.linux.core
05:43:27 [2020-10-14T09:43:27.431Z]     -> Bundle-SymbolicName: org.eclipse.tracecompass.analysis.os.linux.core; bundle-version="5.0.1.202010090321"; singleton:="true"
05:43:27 [2020-10-14T09:43:27.431Z]   Unresolved requirement: Require-Bundle: org.eclipse.tracecompass.analysis.profiling.core
05:43:27 [2020-10-14T09:43:27.431Z]     -> Bundle-SymbolicName: org.eclipse.tracecompass.analysis.profiling.core; bundle-version="2.0.1.202010090321"; singleton:="true"
05:43:27 [2020-10-14T09:43:27.431Z] 
05:43:27 [2020-10-14T09:43:27.431Z] 	at org.eclipse.osgi.container.Module.start(Module.java:463)
05:43:27 [2020-10-14T09:43:27.431Z] 	at org.eclipse.osgi.container.ModuleContainer$ContainerStartLevel$2.run(ModuleContainer.java:1845)
05:43:27 [2020-10-14T09:43:27.431Z] 	at org.eclipse.osgi.internal.framework.EquinoxContainerAdaptor$1$1.execute(EquinoxContainerAdaptor.java:136)
05:43:27 [2020-10-14T09:43:27.431Z] 	at org.eclipse.osgi.container.ModuleContainer$ContainerStartLevel.incStartLevel(ModuleContainer.java:1838)
05:43:27 [2020-10-14T09:43:27.431Z] 	at org.eclipse.osgi.container.ModuleContainer$ContainerStartLevel.incStartLevel(ModuleContainer.java:1779)
05:43:27 [2020-10-14T09:43:27.431Z] 	at org.eclipse.osgi.container.ModuleContainer$ContainerStartLevel.doContainerStartLevel(ModuleContainer.java:1743)
05:43:27 [2020-10-14T09:43:27.431Z] 	at org.eclipse.osgi.container.ModuleContainer$ContainerStartLevel.dispatchEvent(ModuleContainer.java:1665)
05:43:27 [2020-10-14T09:43:27.431Z] 	at org.eclipse.osgi.container.ModuleContainer$ContainerStartLevel.dispatchEvent(ModuleContainer.java:1)
05:43:27 [2020-10-14T09:43:27.431Z] 	at org.eclipse.osgi.framework.eventmgr.EventManager.dispatchEvent(EventManager.java:234)
05:43:27 [2020-10-14T09:43:27.431Z] 	at org.eclipse.osgi.framework.eventmgr.EventManager$EventThread.run(EventManager.java:345)
05:43:27 [2020-10-14T09:43:27.431Z] 
05:43:27 [2020-10-14T09:43:27.431Z] !ENTRY org.eclipse.tracecompass.tmf.analysis.xml.core 4 0 2020-10-14 09:43:27.339
05:43:27 [2020-10-14T09:43:27.431Z] !MESSAGE FrameworkEvent ERROR
05:43:27 [2020-10-14T09:43:27.431Z] !STACK 0
05:43:27 [2020-10-14T09:43:27.431Z] org.osgi.framework.BundleException: Could not resolve module: org.eclipse.tracecompass.tmf.analysis.xml.core [232]
05:43:27 [2020-10-14T09:43:27.431Z]   Unresolved requirement: Require-Bundle: org.eclipse.tracecompass.tmf.core
05:43:27 [2020-10-14T09:43:27.431Z]     -> Bundle-SymbolicName: org.eclipse.tracecompass.tmf.core; bundle-version="6.1.0.202010090321"; singleton:="true"
05:43:27 [2020-10-14T09:43:27.431Z]        org.eclipse.tracecompass.tmf.core [218]
05:43:27 [2020-10-14T09:43:27.431Z]          Unresolved requirement: Require-Bundle: org.eclipse.cdt.core
05:43:27 [2020-10-14T09:43:27.431Z]            -> Bundle-SymbolicName: org.eclipse.cdt.core; bundle-version="7.0.0.202009010132"; singleton:="true"
05:43:27 [2020-10-14T09:43:27.431Z]               org.eclipse.cdt.core [43]
05:43:27 [2020-10-14T09:43:27.431Z]                 Unresolved requirement: Require-Capability: osgi.ee; filter:="(&(osgi.ee=JavaSE)(version=11))"
05:43:27 [2020-10-14T09:43:27.431Z]                 Unresolved requirement: Require-Bundle: org.eclipse.cdt.core.native; bundle-version="[6.0.0,7.0.0)"; visibility:="reexport"
05:43:27 [2020-10-14T09:43:27.431Z]                   -> Bundle-SymbolicName: org.eclipse.cdt.core.native; bundle-version="6.0.0.202009030027"; singleton:="true"
05:43:27 [2020-10-14T09:43:27.431Z]                      org.eclipse.cdt.core.native [44]
05:43:27 [2020-10-14T09:43:27.431Z]                        Unresolved requirement: Require-Capability: osgi.ee; filter:="(&(osgi.ee=JavaSE)(version=11))"
05:43:27 [2020-10-14T09:43:27.431Z]   Unresolved requirement: Require-Bundle: org.eclipse.tracecompass.analysis.timing.core
05:43:27 [2020-10-14T09:43:27.431Z]     -> Bundle-SymbolicName: org.eclipse.tracecompass.analysis.timing.core; bundle-version="5.2.0.202010090321"; singleton:="true"
05:43:27 [2020-10-14T09:43:27.431Z]        org.eclipse.tracecompass.analysis.timing.core [223]
05:43:27 [2020-10-14T09:43:27.431Z]          Unresolved requirement: Require-Bundle: org.eclipse.tracecompass.tmf.core
05:43:27 [2020-10-14T09:43:27.431Z]            -> Bundle-SymbolicName: org.eclipse.tracecompass.tmf.core; bundle-version="6.1.0.202010090321"; singleton:="true"
05:43:27 [2020-10-14T09:43:27.431Z] 
05:43:27 [2020-10-14T09:43:27.431Z] 	at org.eclipse.osgi.container.Module.start(Module.java:463)
05:43:27 [2020-10-14T09:43:27.431Z] 	at org.eclipse.osgi.container.ModuleContainer$ContainerStartLevel$2.run(ModuleContainer.java:1845)
05:43:27 [2020-10-14T09:43:27.431Z] 	at org.eclipse.osgi.internal.framework.EquinoxContainerAdaptor$1$1.execute(EquinoxContainerAdaptor.java:136)
05:43:27 [2020-10-14T09:43:27.431Z] 	at org.eclipse.osgi.container.ModuleContainer$ContainerStartLevel.incStartLevel(ModuleContainer.java:1838)
05:43:27 [2020-10-14T09:43:27.431Z] 	at org.eclipse.osgi.container.ModuleContainer$ContainerStartLevel.incStartLevel(ModuleContainer.java:1779)
05:43:27 [2020-10-14T09:43:27.431Z] 	at org.eclipse.osgi.container.ModuleContainer$ContainerStartLevel.doContainerStartLevel(ModuleContainer.java:1743)
05:43:27 [2020-10-14T09:43:27.431Z] 	at org.eclipse.osgi.container.ModuleContainer$ContainerStartLevel.dispatchEvent(ModuleContainer.java:1665)
05:43:27 [2020-10-14T09:43:27.431Z] 	at org.eclipse.osgi.container.ModuleContainer$ContainerStartLevel.dispatchEvent(ModuleContainer.java:1)
05:43:27 [2020-10-14T09:43:27.431Z] 	at org.eclipse.osgi.framework.eventmgr.EventManager.dispatchEvent(EventManager.java:234)
05:43:27 [2020-10-14T09:43:27.431Z] 	at org.eclipse.osgi.framework.eventmgr.EventManager$EventThread.run(EventManager.java:345)
05:43:27 [2020-10-14T09:43:27.431Z] 
05:43:27 [2020-10-14T09:43:27.431Z] !ENTRY org.eclipse.tracecompass.tmf.ctf.core 4 0 2020-10-14 09:43:27.340
05:43:27 [2020-10-14T09:43:27.431Z] !MESSAGE FrameworkEvent ERROR
05:43:27 [2020-10-14T09:43:27.431Z] !STACK 0
05:43:27 [2020-10-14T09:43:27.431Z] org.osgi.framework.BundleException: Could not resolve module: org.eclipse.tracecompass.tmf.ctf.core [233]
05:43:27 [2020-10-14T09:43:27.431Z]   Unresolved requirement: Require-Bundle: org.eclipse.tracecompass.tmf.core
05:43:27 [2020-10-14T09:43:27.431Z]     -> Bundle-SymbolicName: org.eclipse.tracecompass.tmf.core; bundle-version="6.1.0.202010090321"; singleton:="true"
05:43:27 [2020-10-14T09:43:27.431Z]        org.eclipse.tracecompass.tmf.core [218]
05:43:27 [2020-10-14T09:43:27.431Z]          Unresolved requirement: Require-Bundle: org.eclipse.cdt.core
05:43:27 [2020-10-14T09:43:27.431Z]            -> Bundle-SymbolicName: org.eclipse.cdt.core; bundle-version="7.0.0.202009010132"; singleton:="true"
05:43:27 [2020-10-14T09:43:27.431Z]               org.eclipse.cdt.core [43]
05:43:27 [2020-10-14T09:43:27.431Z]                 Unresolved requirement: Require-Capability: osgi.ee; filter:="(&(osgi.ee=JavaSE)(version=11))"
05:43:27 [2020-10-14T09:43:27.431Z]                 Unresolved requirement: Require-Bundle: org.eclipse.cdt.core.native; bundle-version="[6.0.0,7.0.0)"; visibility:="reexport"
05:43:27 [2020-10-14T09:43:27.431Z]                   -> Bundle-SymbolicName: org.eclipse.cdt.core.native; bundle-version="6.0.0.202009030027"; singleton:="true"
05:43:27 [2020-10-14T09:43:27.431Z]                      org.eclipse.cdt.core.native [44]
05:43:27 [2020-10-14T09:43:27.431Z]                        Unresolved requirement: Require-Capability: osgi.ee; filter:="(&(osgi.ee=JavaSE)(version=11))"
05:43:27 [2020-10-14T09:43:27.431Z] 
05:43:27 [2020-10-14T09:43:27.431Z] 	at org.eclipse.osgi.container.Module.start(Module.java:463)
05:43:27 [2020-10-14T09:43:27.431Z] 	at org.eclipse.osgi.container.ModuleContainer$ContainerStartLevel$2.run(ModuleContainer.java:1845)
05:43:27 [2020-10-14T09:43:27.431Z] 	at org.eclipse.osgi.internal.framework.EquinoxContainerAdaptor$1$1.execute(EquinoxContainerAdaptor.java:136)
05:43:27 [2020-10-14T09:43:27.431Z] 	at org.eclipse.osgi.container.ModuleContainer$ContainerStartLevel.incStartLevel(ModuleContainer.java:1838)
05:43:27 [2020-10-14T09:43:27.431Z] 	at org.eclipse.osgi.container.ModuleContainer$ContainerStartLevel.incStartLevel(ModuleContainer.java:1779)
05:43:27 [2020-10-14T09:43:27.431Z] 	at org.eclipse.osgi.container.ModuleContainer$ContainerStartLevel.doContainerStartLevel(ModuleContainer.java:1743)
05:43:27 [2020-10-14T09:43:27.431Z] 	at org.eclipse.osgi.container.ModuleContainer$ContainerStartLevel.dispatchEvent(ModuleContainer.java:1665)
05:43:27 [2020-10-14T09:43:27.431Z] 	at org.eclipse.osgi.container.ModuleContainer$ContainerStartLevel.dispatchEvent(ModuleContainer.java:1)
05:43:27 [2020-10-14T09:43:27.431Z] 	at org.eclipse.osgi.framework.eventmgr.EventManager.dispatchEvent(EventManager.java:234)
05:43:27 [2020-10-14T09:43:27.431Z] 	at org.eclipse.osgi.framework.eventmgr.EventManager$EventThread.run(EventManager.java:345)
05:43:27 [2020-10-14T09:43:27.431Z] 
05:43:27 [2020-10-14T09:43:27.431Z] !ENTRY org.eclipse.tracecompass.lttng2.common.core 4 0 2020-10-14 09:43:27.341
05:43:27 [2020-10-14T09:43:27.431Z] !MESSAGE FrameworkEvent ERROR
05:43:27 [2020-10-14T09:43:27.431Z] !STACK 0
05:43:27 [2020-10-14T09:43:27.431Z] org.osgi.framework.BundleException: Could not resolve module: org.eclipse.tracecompass.lttng2.common.core [234]
05:43:27 [2020-10-14T09:43:27.431Z]   Unresolved requirement: Require-Bundle: org.eclipse.tracecompass.analysis.counters.core
05:43:27 [2020-10-14T09:43:27.431Z]     -> Bundle-SymbolicName: org.eclipse.tracecompass.analysis.counters.core; bundle-version="2.0.5.202010090321"; singleton:="true"
05:43:27 [2020-10-14T09:43:27.431Z]        org.eclipse.tracecompass.analysis.counters.core [216]
05:43:27 [2020-10-14T09:43:27.431Z]          Unresolved requirement: Require-Bundle: org.eclipse.tracecompass.tmf.core
05:43:27 [2020-10-14T09:43:27.431Z]            -> Bundle-SymbolicName: org.eclipse.tracecompass.tmf.core; bundle-version="6.1.0.202010090321"; singleton:="true"
05:43:27 [2020-10-14T09:43:27.431Z]               org.eclipse.tracecompass.tmf.core [218]
05:43:27 [2020-10-14T09:43:27.431Z]                 Unresolved requirement: Require-Bundle: org.eclipse.cdt.core
05:43:27 [2020-10-14T09:43:27.431Z]                   -> Bundle-SymbolicName: org.eclipse.cdt.core; bundle-version="7.0.0.202009010132"; singleton:="true"
05:43:27 [2020-10-14T09:43:27.431Z]                      org.eclipse.cdt.core [43]
05:43:27 [2020-10-14T09:43:27.431Z]                        Unresolved requirement: Require-Capability: osgi.ee; filter:="(&(osgi.ee=JavaSE)(version=11))"
05:43:27 [2020-10-14T09:43:27.431Z]                        Unresolved requirement: Require-Bundle: org.eclipse.cdt.core.native; bundle-version="[6.0.0,7.0.0)"; visibility:="reexport"
05:43:27 [2020-10-14T09:43:27.431Z]                          -> Bundle-SymbolicName: org.eclipse.cdt.core.native; bundle-version="6.0.0.202009030027"; singleton:="true"
05:43:27 [2020-10-14T09:43:27.431Z]                             org.eclipse.cdt.core.native [44]
05:43:27 [2020-10-14T09:43:27.431Z]                               Unresolved requirement: Require-Capability: osgi.ee; filter:="(&(osgi.ee=JavaSE)(version=11))"
05:43:27 [2020-10-14T09:43:27.431Z]   Unresolved requirement: Require-Bundle: org.eclipse.tracecompass.analysis.os.linux.core
05:43:27 [2020-10-14T09:43:27.431Z]     -> Bundle-SymbolicName: org.eclipse.tracecompass.analysis.os.linux.core; bundle-version="5.0.1.202010090321"; singleton:="true"
05:43:27 [2020-10-14T09:43:27.431Z]        org.eclipse.tracecompass.analysis.os.linux.core [220]
05:43:27 [2020-10-14T09:43:27.431Z]          Unresolved requirement: Require-Bundle: org.eclipse.tracecompass.analysis.timing.core
05:43:27 [2020-10-14T09:43:27.431Z]            -> Bundle-SymbolicName: org.eclipse.tracecompass.analysis.timing.core; bundle-version="5.2.0.202010090321"; singleton:="true"
05:43:27 [2020-10-14T09:43:27.431Z]               org.eclipse.tracecompass.analysis.timing.core [223]
05:43:27 [2020-10-14T09:43:27.431Z]                 Unresolved requirement: Require-Bundle: org.eclipse.tracecompass.tmf.core
05:43:27 [2020-10-14T09:43:27.432Z]                   -> Bundle-SymbolicName: org.eclipse.tracecompass.tmf.core; bundle-version="6.1.0.202010090321"; singleton:="true"
05:43:27 [2020-10-14T09:43:27.432Z]          Unresolved requirement: Require-Bundle: org.eclipse.tracecompass.analysis.graph.core
05:43:27 [2020-10-14T09:43:27.432Z]            -> Bundle-SymbolicName: org.eclipse.tracecompass.analysis.graph.core; bundle-version="2.1.7.202010090321"; singleton:="true"
05:43:27 [2020-10-14T09:43:27.432Z]               org.eclipse.tracecompass.analysis.graph.core [219]
05:43:27 [2020-10-14T09:43:27.432Z]                 Unresolved requirement: Require-Bundle: org.eclipse.tracecompass.tmf.core
05:43:27 [2020-10-14T09:43:27.432Z]                   -> Bundle-SymbolicName: org.eclipse.tracecompass.tmf.core; bundle-version="6.1.0.202010090321"; singleton:="true"
05:43:27 [2020-10-14T09:43:27.432Z]          Unresolved requirement: Require-Bundle: org.eclipse.tracecompass.tmf.core
05:43:27 [2020-10-14T09:43:27.432Z]            -> Bundle-SymbolicName: org.eclipse.tracecompass.tmf.core; bundle-version="6.1.0.202010090321"; singleton:="true"
05:43:27 [2020-10-14T09:43:27.432Z]   Unresolved requirement: Require-Bundle: org.eclipse.tracecompass.tmf.core
05:43:27 [2020-10-14T09:43:27.432Z]     -> Bundle-SymbolicName: org.eclipse.tracecompass.tmf.core; bundle-version="6.1.0.202010090321"; singleton:="true"
05:43:27 [2020-10-14T09:43:27.432Z] 
05:43:27 [2020-10-14T09:43:27.432Z] 	at org.eclipse.osgi.container.Module.start(Module.java:463)
05:43:27 [2020-10-14T09:43:27.432Z] 	at org.eclipse.osgi.container.ModuleContainer$ContainerStartLevel$2.run(ModuleContainer.java:1845)
05:43:27 [2020-10-14T09:43:27.432Z] 	at org.eclipse.osgi.internal.framework.EquinoxContainerAdaptor$1$1.execute(EquinoxContainerAdaptor.java:136)
05:43:27 [2020-10-14T09:43:27.432Z] 	at org.eclipse.osgi.container.ModuleContainer$ContainerStartLevel.incStartLevel(ModuleContainer.java:1838)
05:43:27 [2020-10-14T09:43:27.432Z] 	at org.eclipse.osgi.container.ModuleContainer$ContainerStartLevel.incStartLevel(ModuleContainer.java:1779)
05:43:27 [2020-10-14T09:43:27.432Z] 	at org.eclipse.osgi.container.ModuleContainer$ContainerStartLevel.doContainerStartLevel(ModuleContainer.java:1743)
05:43:27 [2020-10-14T09:43:27.432Z] 	at org.eclipse.osgi.container.ModuleContainer$ContainerStartLevel.dispatchEvent(ModuleContainer.java:1665)
05:43:27 [2020-10-14T09:43:27.432Z] 	at org.eclipse.osgi.container.ModuleContainer$ContainerStartLevel.dispatchEvent(ModuleContainer.java:1)
05:43:27 [2020-10-14T09:43:27.432Z] 	at org.eclipse.osgi.framework.eventmgr.EventManager.dispatchEvent(EventManager.java:234)
05:43:27 [2020-10-14T09:43:27.432Z] 	at org.eclipse.osgi.framework.eventmgr.EventManager$EventThread.run(EventManager.java:345)
05:43:27 [2020-10-14T09:43:27.432Z] 
05:43:27 [2020-10-14T09:43:27.432Z] !ENTRY org.eclipse.tracecompass.lttng2.ust.core 4 0 2020-10-14 09:43:27.400
05:43:27 [2020-10-14T09:43:27.432Z] !MESSAGE FrameworkEvent ERROR
05:43:27 [2020-10-14T09:43:27.432Z] !STACK 0
05:43:27 [2020-10-14T09:43:27.432Z] org.osgi.framework.BundleException: Could not resolve module: org.eclipse.tracecompass.lttng2.ust.core [235]
05:43:27 [2020-10-14T09:43:27.432Z]   Unresolved requirement: Require-Bundle: org.eclipse.tracecompass.analysis.os.linux.core
05:43:27 [2020-10-14T09:43:27.432Z]     -> Bundle-SymbolicName: org.eclipse.tracecompass.analysis.os.linux.core; bundle-version="5.0.1.202010090321"; singleton:="true"
05:43:27 [2020-10-14T09:43:27.432Z]        org.eclipse.tracecompass.analysis.os.linux.core [220]
05:43:27 [2020-10-14T09:43:27.432Z]          Unresolved requirement: Require-Bundle: org.eclipse.tracecompass.analysis.timing.core
05:43:27 [2020-10-14T09:43:27.432Z]            -> Bundle-SymbolicName: org.eclipse.tracecompass.analysis.timing.core; bundle-version="5.2.0.202010090321"; singleton:="true"
05:43:27 [2020-10-14T09:43:27.432Z]               org.eclipse.tracecompass.analysis.timing.core [223]
05:43:27 [2020-10-14T09:43:27.432Z]                 Unresolved requirement: Require-Bundle: org.eclipse.tracecompass.tmf.core
05:43:27 [2020-10-14T09:43:27.432Z]                   -> Bundle-SymbolicName: org.eclipse.tracecompass.tmf.core; bundle-version="6.1.0.202010090321"; singleton:="true"
05:43:27 [2020-10-14T09:43:27.432Z]                      org.eclipse.tracecompass.tmf.core [218]
05:43:27 [2020-10-14T09:43:27.432Z]                        Unresolved requirement: Require-Bundle: org.eclipse.cdt.core
05:43:27 [2020-10-14T09:43:27.432Z]                          -> Bundle-SymbolicName: org.eclipse.cdt.core; bundle-version="7.0.0.202009010132"; singleton:="true"
05:43:27 [2020-10-14T09:43:27.432Z]                             org.eclipse.cdt.core [43]
05:43:27 [2020-10-14T09:43:27.432Z]                               Unresolved requirement: Require-Capability: osgi.ee; filter:="(&(osgi.ee=JavaSE)(version=11))"
05:43:27 [2020-10-14T09:43:27.432Z]                               Unresolved requirement: Require-Bundle: org.eclipse.cdt.core.native; bundle-version="[6.0.0,7.0.0)"; visibility:="reexport"
05:43:27 [2020-10-14T09:43:27.432Z]                                 -> Bundle-SymbolicName: org.eclipse.cdt.core.native; bundle-version="6.0.0.202009030027"; singleton:="true"
05:43:27 [2020-10-14T09:43:27.432Z]                                    org.eclipse.cdt.core.native [44]
05:43:27 [2020-10-14T09:43:27.432Z]                                      Unresolved requirement: Require-Capability: osgi.ee; filter:="(&(osgi.ee=JavaSE)(version=11))"
05:43:27 [2020-10-14T09:43:27.432Z]          Unresolved requirement: Require-Bundle: org.eclipse.tracecompass.analysis.graph.core
05:43:27 [2020-10-14T09:43:27.432Z]            -> Bundle-SymbolicName: org.eclipse.tracecompass.analysis.graph.core; bundle-version="2.1.7.202010090321"; singleton:="true"
05:43:27 [2020-10-14T09:43:27.432Z]               org.eclipse.tracecompass.analysis.graph.core [219]
05:43:27 [2020-10-14T09:43:27.432Z]                 Unresolved requirement: Require-Bundle: org.eclipse.tracecompass.tmf.core
05:43:27 [2020-10-14T09:43:27.432Z]                   -> Bundle-SymbolicName: org.eclipse.tracecompass.tmf.core; bundle-version="6.1.0.202010090321"; singleton:="true"
05:43:27 [2020-10-14T09:43:27.432Z]          Unresolved requirement: Require-Bundle: org.eclipse.tracecompass.tmf.core
05:43:27 [2020-10-14T09:43:27.432Z]            -> Bundle-SymbolicName: org.eclipse.tracecompass.tmf.core; bundle-version="6.1.0.202010090321"; singleton:="true"
05:43:27 [2020-10-14T09:43:27.432Z]   Unresolved requirement: Require-Bundle: org.eclipse.tracecompass.lttng2.control.core
05:43:27 [2020-10-14T09:43:27.432Z]     -> Bundle-SymbolicName: org.eclipse.tracecompass.lttng2.control.core; bundle-version="1.2.5.202010090321"; singleton:="true"
05:43:27 [2020-10-14T09:43:27.432Z]        org.eclipse.tracecompass.lttng2.control.core [240]
05:43:27 [2020-10-14T09:43:27.432Z]          Unresolved requirement: Require-Bundle: org.eclipse.tracecompass.tmf.core
05:43:27 [2020-10-14T09:43:27.432Z]            -> Bundle-SymbolicName: org.eclipse.tracecompass.tmf.core; bundle-version="6.1.0.202010090321"; singleton:="true"
05:43:27 [2020-10-14T09:43:27.432Z]          Unresolved requirement: Require-Bundle: org.eclipse.tracecompass.tmf.ctf.core
05:43:27 [2020-10-14T09:43:27.432Z]            -> Bundle-SymbolicName: org.eclipse.tracecompass.tmf.ctf.core; bundle-version="4.2.2.202010090321"; singleton:="true"
05:43:27 [2020-10-14T09:43:27.432Z]               org.eclipse.tracecompass.tmf.ctf.core [233]
05:43:27 [2020-10-14T09:43:27.432Z]                 Unresolved requirement: Require-Bundle: org.eclipse.tracecompass.tmf.core
05:43:27 [2020-10-14T09:43:27.432Z]                   -> Bundle-SymbolicName: org.eclipse.tracecompass.tmf.core; bundle-version="6.1.0.202010090321"; singleton:="true"
05:43:27 [2020-10-14T09:43:27.432Z]   Unresolved requirement: Require-Bundle: org.eclipse.tracecompass.lttng2.common.core
05:43:27 [2020-10-14T09:43:27.432Z]     -> Bundle-SymbolicName: org.eclipse.tracecompass.lttng2.common.core; bundle-version="1.1.3.202010090321"; singleton:="true"
05:43:27 [2020-10-14T09:43:27.432Z]        org.eclipse.tracecompass.lttng2.common.core [234]
05:43:27 [2020-10-14T09:43:27.432Z]          Unresolved requirement: Require-Bundle: org.eclipse.tracecompass.analysis.counters.core
05:43:27 [2020-10-14T09:43:27.432Z]            -> Bundle-SymbolicName: org.eclipse.tracecompass.analysis.counters.core; bundle-version="2.0.5.202010090321"; singleton:="true"
05:43:27 [2020-10-14T09:43:27.432Z]               org.eclipse.tracecompass.analysis.counters.core [216]
05:43:27 [2020-10-14T09:43:27.432Z]                 Unresolved requirement: Require-Bundle: org.eclipse.tracecompass.tmf.core
05:43:27 [2020-10-14T09:43:27.432Z]                   -> Bundle-SymbolicName: org.eclipse.tracecompass.tmf.core; bundle-version="6.1.0.202010090321"; singleton:="true"
05:43:27 [2020-10-14T09:43:27.432Z]          Unresolved requirement: Require-Bundle: org.eclipse.tracecompass.analysis.os.linux.core
05:43:27 [2020-10-14T09:43:27.432Z]            -> Bundle-SymbolicName: org.eclipse.tracecompass.analysis.os.linux.core; bundle-version="5.0.1.202010090321"; singleton:="true"
05:43:27 [2020-10-14T09:43:27.432Z]          Unresolved requirement: Require-Bundle: org.eclipse.tracecompass.tmf.core
05:43:27 [2020-10-14T09:43:27.432Z]            -> Bundle-SymbolicName: org.eclipse.tracecompass.tmf.core; bundle-version="6.1.0.202010090321"; singleton:="true"
05:43:27 [2020-10-14T09:43:27.432Z]   Unresolved requirement: Require-Bundle: org.eclipse.tracecompass.analysis.timing.core
05:43:27 [2020-10-14T09:43:27.432Z]     -> Bundle-SymbolicName: org.eclipse.tracecompass.analysis.timing.core; bundle-version="5.2.0.202010090321"; singleton:="true"
05:43:27 [2020-10-14T09:43:27.432Z]   Unresolved requirement: Require-Bundle: org.eclipse.tracecompass.tmf.core
05:43:27 [2020-10-14T09:43:27.432Z]     -> Bundle-SymbolicName: org.eclipse.tracecompass.tmf.core; bundle-version="6.1.0.202010090321"; singleton:="true"
05:43:27 [2020-10-14T09:43:27.432Z]   Unresolved requirement: Require-Bundle: org.eclipse.tracecompass.tmf.ctf.core
05:43:27 [2020-10-14T09:43:27.432Z]     -> Bundle-SymbolicName: org.eclipse.tracecompass.tmf.ctf.core; bundle-version="4.2.2.202010090321"; singleton:="true"
05:43:27 [2020-10-14T09:43:27.432Z]   Unresolved requirement: Require-Bundle: org.eclipse.tracecompass.analysis.counters.core
05:43:27 [2020-10-14T09:43:27.432Z]     -> Bundle-SymbolicName: org.eclipse.tracecompass.analysis.counters.core; bundle-version="2.0.5.202010090321"; singleton:="true"
05:43:27 [2020-10-14T09:43:27.432Z]   Unresolved requirement: Require-Bundle: org.eclipse.tracecompass.analysis.profiling.core
05:43:27 [2020-10-14T09:43:27.432Z]     -> Bundle-SymbolicName: org.eclipse.tracecompass.analysis.profiling.core; bundle-version="2.0.1.202010090321"; singleton:="true"
05:43:27 [2020-10-14T09:43:27.432Z]        org.eclipse.tracecompass.analysis.profiling.core [226]
05:43:27 [2020-10-14T09:43:27.432Z]          Unresolved requirement: Require-Bundle: org.eclipse.tracecompass.tmf.core
05:43:27 [2020-10-14T09:43:27.432Z]            -> Bundle-SymbolicName: org.eclipse.tracecompass.tmf.core; bundle-version="6.1.0.202010090321"; singleton:="true"
05:43:27 [2020-10-14T09:43:27.432Z]          Unresolved requirement: Require-Bundle: org.eclipse.cdt.core
05:43:27 [2020-10-14T09:43:27.432Z]            -> Bundle-SymbolicName: org.eclipse.cdt.core; bundle-version="7.0.0.202009010132"; singleton:="true"
05:43:27 [2020-10-14T09:43:27.432Z] 
05:43:27 [2020-10-14T09:43:27.432Z] 	at org.eclipse.osgi.container.Module.start(Module.java:463)
05:43:27 [2020-10-14T09:43:27.432Z] 	at org.eclipse.osgi.container.ModuleContainer$ContainerStartLevel$2.run(ModuleContainer.java:1845)
05:43:27 [2020-10-14T09:43:27.432Z] 	at org.eclipse.osgi.internal.framework.EquinoxContainerAdaptor$1$1.execute(EquinoxContainerAdaptor.java:136)
05:43:27 [2020-10-14T09:43:27.432Z] 	at org.eclipse.osgi.container.ModuleContainer$ContainerStartLevel.incStartLevel(ModuleContainer.java:1838)
05:43:27 [2020-10-14T09:43:27.432Z] 	at org.eclipse.osgi.container.ModuleContainer$ContainerStartLevel.incStartLevel(ModuleContainer.java:1779)
05:43:27 [2020-10-14T09:43:27.432Z] 	at org.eclipse.osgi.container.ModuleContainer$ContainerStartLevel.doContainerStartLevel(ModuleContainer.java:1743)
05:43:27 [2020-10-14T09:43:27.432Z] 	at org.eclipse.osgi.container.ModuleContainer$ContainerStartLevel.dispatchEvent(ModuleContainer.java:1665)
05:43:27 [2020-10-14T09:43:27.432Z] 	at org.eclipse.osgi.container.ModuleContainer$ContainerStartLevel.dispatchEvent(ModuleContainer.java:1)
05:43:27 [2020-10-14T09:43:27.432Z] 	at org.eclipse.osgi.framework.eventmgr.EventManager.dispatchEvent(EventManager.java:234)
05:43:27 [2020-10-14T09:43:27.432Z] 	at org.eclipse.osgi.framework.eventmgr.EventManager$EventThread.run(EventManager.java:345)
05:43:27 [2020-10-14T09:43:27.432Z] 
05:43:27 [2020-10-14T09:43:27.432Z] !ENTRY org.eclipse.tracecompass.incubator.kernel.core 4 0 2020-10-14 09:43:27.400
05:43:27 [2020-10-14T09:43:27.432Z] !MESSAGE FrameworkEvent ERROR
05:43:27 [2020-10-14T09:43:27.432Z] !STACK 0
05:43:27 [2020-10-14T09:43:27.433Z] org.osgi.framework.BundleException: Could not resolve module: org.eclipse.tracecompass.incubator.kernel.core [236]
05:43:27 [2020-10-14T09:43:27.433Z]   Unresolved requirement: Require-Bundle: org.eclipse.tracecompass.analysis.os.linux.core
05:43:27 [2020-10-14T09:43:27.433Z]     -> Bundle-SymbolicName: org.eclipse.tracecompass.analysis.os.linux.core; bundle-version="5.0.1.202010090321"; singleton:="true"
05:43:27 [2020-10-14T09:43:27.433Z]        org.eclipse.tracecompass.analysis.os.linux.core [220]
05:43:27 [2020-10-14T09:43:27.433Z]          Unresolved requirement: Require-Bundle: org.eclipse.tracecompass.analysis.timing.core
05:43:27 [2020-10-14T09:43:27.433Z]            -> Bundle-SymbolicName: org.eclipse.tracecompass.analysis.timing.core; bundle-version="5.2.0.202010090321"; singleton:="true"
05:43:27 [2020-10-14T09:43:27.433Z]               org.eclipse.tracecompass.analysis.timing.core [223]
05:43:27 [2020-10-14T09:43:27.433Z]                 Unresolved requirement: Require-Bundle: org.eclipse.tracecompass.tmf.core
05:43:27 [2020-10-14T09:43:27.433Z]                   -> Bundle-SymbolicName: org.eclipse.tracecompass.tmf.core; bundle-version="6.1.0.202010090321"; singleton:="true"
05:43:27 [2020-10-14T09:43:27.433Z]                      org.eclipse.tracecompass.tmf.core [218]
05:43:27 [2020-10-14T09:43:27.433Z]                        Unresolved requirement: Require-Bundle: org.eclipse.cdt.core
05:43:27 [2020-10-14T09:43:27.433Z]                          -> Bundle-SymbolicName: org.eclipse.cdt.core; bundle-version="7.0.0.202009010132"; singleton:="true"
05:43:27 [2020-10-14T09:43:27.433Z]                             org.eclipse.cdt.core [43]
05:43:27 [2020-10-14T09:43:27.433Z]                               Unresolved requirement: Require-Capability: osgi.ee; filter:="(&(osgi.ee=JavaSE)(version=11))"
05:43:27 [2020-10-14T09:43:27.433Z]                               Unresolved requirement: Require-Bundle: org.eclipse.cdt.core.native; bundle-version="[6.0.0,7.0.0)"; visibility:="reexport"
05:43:27 [2020-10-14T09:43:27.433Z]                                 -> Bundle-SymbolicName: org.eclipse.cdt.core.native; bundle-version="6.0.0.202009030027"; singleton:="true"
05:43:27 [2020-10-14T09:43:27.433Z]                                    org.eclipse.cdt.core.native [44]
05:43:27 [2020-10-14T09:43:27.433Z]                                      Unresolved requirement: Require-Capability: osgi.ee; filter:="(&(osgi.ee=JavaSE)(version=11))"
05:43:27 [2020-10-14T09:43:27.433Z]          Unresolved requirement: Require-Bundle: org.eclipse.tracecompass.analysis.graph.core
05:43:27 [2020-10-14T09:43:27.433Z]            -> Bundle-SymbolicName: org.eclipse.tracecompass.analysis.graph.core; bundle-version="2.1.7.202010090321"; singleton:="true"
05:43:27 [2020-10-14T09:43:27.433Z]               org.eclipse.tracecompass.analysis.graph.core [219]
05:43:27 [2020-10-14T09:43:27.433Z]                 Unresolved requirement: Require-Bundle: org.eclipse.tracecompass.tmf.core
05:43:27 [2020-10-14T09:43:27.433Z]                   -> Bundle-SymbolicName: org.eclipse.tracecompass.tmf.core; bundle-version="6.1.0.202010090321"; singleton:="true"
05:43:27 [2020-10-14T09:43:27.433Z]          Unresolved requirement: Require-Bundle: org.eclipse.tracecompass.tmf.core
05:43:27 [2020-10-14T09:43:27.433Z]            -> Bundle-SymbolicName: org.eclipse.tracecompass.tmf.core; bundle-version="6.1.0.202010090321"; singleton:="true"
05:43:27 [2020-10-14T09:43:27.433Z]   Unresolved requirement: Require-Bundle: org.eclipse.tracecompass.incubator.analysis.core
05:43:27 [2020-10-14T09:43:27.433Z]     -> Bundle-SymbolicName: org.eclipse.tracecompass.incubator.analysis.core; bundle-version="0.0.1.202010140930"; singleton:="true"
05:43:27 [2020-10-14T09:43:27.433Z]        org.eclipse.tracecompass.incubator.analysis.core [230]
05:43:27 [2020-10-14T09:43:27.433Z]          Unresolved requirement: Require-Bundle: org.eclipse.tracecompass.tmf.core
05:43:27 [2020-10-14T09:43:27.433Z]            -> Bundle-SymbolicName: org.eclipse.tracecompass.tmf.core; bundle-version="6.1.0.202010090321"; singleton:="true"
05:43:27 [2020-10-14T09:43:27.433Z]          Unresolved requirement: Require-Bundle: org.eclipse.tracecompass.analysis.timing.core
05:43:27 [2020-10-14T09:43:27.433Z]            -> Bundle-SymbolicName: org.eclipse.tracecompass.analysis.timing.core; bundle-version="5.2.0.202010090321"; singleton:="true"
05:43:27 [2020-10-14T09:43:27.433Z]          Unresolved requirement: Require-Bundle: org.eclipse.tracecompass.analysis.os.linux.core
05:43:27 [2020-10-14T09:43:27.433Z]            -> Bundle-SymbolicName: org.eclipse.tracecompass.analysis.os.linux.core; bundle-version="5.0.1.202010090321"; singleton:="true"
05:43:27 [2020-10-14T09:43:27.433Z]   Unresolved requirement: Require-Bundle: org.eclipse.tracecompass.tmf.core
05:43:27 [2020-10-14T09:43:27.433Z]     -> Bundle-SymbolicName: org.eclipse.tracecompass.tmf.core; bundle-version="6.1.0.202010090321"; singleton:="true"
05:43:27 [2020-10-14T09:43:27.433Z]   Unresolved requirement: Require-Bundle: org.eclipse.tracecompass.incubator.callstack.core
05:43:27 [2020-10-14T09:43:27.433Z]     -> Bundle-SymbolicName: org.eclipse.tracecompass.incubator.callstack.core; bundle-version="0.0.1.202010140930"; singleton:="true"
05:43:27 [2020-10-14T09:43:27.433Z]        org.eclipse.tracecompass.incubator.callstack.core [231]
05:43:27 [2020-10-14T09:43:27.433Z]          Unresolved requirement: Require-Bundle: org.eclipse.tracecompass.tmf.analysis.xml.core
05:43:27 [2020-10-14T09:43:27.433Z]            -> Bundle-SymbolicName: org.eclipse.tracecompass.tmf.analysis.xml.core; bundle-version="4.0.1.202010090321"; singleton:="true"
05:43:27 [2020-10-14T09:43:27.433Z]               org.eclipse.tracecompass.tmf.analysis.xml.core [232]
05:43:27 [2020-10-14T09:43:27.433Z]                 Unresolved requirement: Require-Bundle: org.eclipse.tracecompass.tmf.core
05:43:27 [2020-10-14T09:43:27.433Z]                   -> Bundle-SymbolicName: org.eclipse.tracecompass.tmf.core; bundle-version="6.1.0.202010090321"; singleton:="true"
05:43:27 [2020-10-14T09:43:27.433Z]                 Unresolved requirement: Require-Bundle: org.eclipse.tracecompass.analysis.timing.core
05:43:27 [2020-10-14T09:43:27.433Z]                   -> Bundle-SymbolicName: org.eclipse.tracecompass.analysis.timing.core; bundle-version="5.2.0.202010090321"; singleton:="true"
05:43:27 [2020-10-14T09:43:27.433Z]          Unresolved requirement: Require-Bundle: org.eclipse.tracecompass.lttng2.common.core
05:43:27 [2020-10-14T09:43:27.433Z]            -> Bundle-SymbolicName: org.eclipse.tracecompass.lttng2.common.core; bundle-version="1.1.3.202010090321"; singleton:="true"
05:43:27 [2020-10-14T09:43:27.433Z]               org.eclipse.tracecompass.lttng2.common.core [234]
05:43:27 [2020-10-14T09:43:27.433Z]                 Unresolved requirement: Require-Bundle: org.eclipse.tracecompass.analysis.counters.core
05:43:27 [2020-10-14T09:43:27.433Z]                   -> Bundle-SymbolicName: org.eclipse.tracecompass.analysis.counters.core; bundle-version="2.0.5.202010090321"; singleton:="true"
05:43:27 [2020-10-14T09:43:27.433Z]                      org.eclipse.tracecompass.analysis.counters.core [216]
05:43:27 [2020-10-14T09:43:27.433Z]                        Unresolved requirement: Require-Bundle: org.eclipse.tracecompass.tmf.core
05:43:27 [2020-10-14T09:43:27.433Z]                          -> Bundle-SymbolicName: org.eclipse.tracecompass.tmf.core; bundle-version="6.1.0.202010090321"; singleton:="true"
05:43:27 [2020-10-14T09:43:27.433Z]                 Unresolved requirement: Require-Bundle: org.eclipse.tracecompass.analysis.os.linux.core
05:43:27 [2020-10-14T09:43:27.433Z]                   -> Bundle-SymbolicName: org.eclipse.tracecompass.analysis.os.linux.core; bundle-version="5.0.1.202010090321"; singleton:="true"
05:43:27 [2020-10-14T09:43:27.433Z]                 Unresolved requirement: Require-Bundle: org.eclipse.tracecompass.tmf.core
05:43:27 [2020-10-14T09:43:27.433Z]                   -> Bundle-SymbolicName: org.eclipse.tracecompass.tmf.core; bundle-version="6.1.0.202010090321"; singleton:="true"
05:43:27 [2020-10-14T09:43:27.433Z]          Unresolved requirement: Require-Bundle: org.eclipse.tracecompass.analysis.timing.core
05:43:27 [2020-10-14T09:43:27.433Z]            -> Bundle-SymbolicName: org.eclipse.tracecompass.analysis.timing.core; bundle-version="5.2.0.202010090321"; singleton:="true"
05:43:27 [2020-10-14T09:43:27.433Z]          Unresolved requirement: Require-Bundle: org.eclipse.tracecompass.lttng2.ust.core
05:43:27 [2020-10-14T09:43:27.433Z]            -> Bundle-SymbolicName: org.eclipse.tracecompass.lttng2.ust.core; bundle-version="5.0.1.202010090321"; singleton:="true"
05:43:27 [2020-10-14T09:43:27.433Z]               org.eclipse.tracecompass.lttng2.ust.core [235]
05:43:27 [2020-10-14T09:43:27.433Z]                 Unresolved requirement: Require-Bundle: org.eclipse.tracecompass.analysis.os.linux.core
05:43:27 [2020-10-14T09:43:27.433Z]                   -> Bundle-SymbolicName: org.eclipse.tracecompass.analysis.os.linux.core; bundle-version="5.0.1.202010090321"; singleton:="true"
05:43:27 [2020-10-14T09:43:27.433Z]                 Unresolved requirement: Require-Bundle: org.eclipse.tracecompass.lttng2.control.core
05:43:27 [2020-10-14T09:43:27.433Z]                   -> Bundle-SymbolicName: org.eclipse.tracecompass.lttng2.control.core; bundle-version="1.2.5.202010090321"; singleton:="true"
05:43:27 [2020-10-14T09:43:27.433Z]                      org.eclipse.tracecompass.lttng2.control.core [240]
05:43:27 [2020-10-14T09:43:27.433Z]                        Unresolved requirement: Require-Bundle: org.eclipse.tracecompass.tmf.core
05:43:27 [2020-10-14T09:43:27.433Z]                          -> Bundle-SymbolicName: org.eclipse.tracecompass.tmf.core; bundle-version="6.1.0.202010090321"; singleton:="true"
05:43:27 [2020-10-14T09:43:27.433Z]                        Unresolved requirement: Require-Bundle: org.eclipse.tracecompass.tmf.ctf.core
05:43:27 [2020-10-14T09:43:27.433Z]                          -> Bundle-SymbolicName: org.eclipse.tracecompass.tmf.ctf.core; bundle-version="4.2.2.202010090321"; singleton:="true"
05:43:27 [2020-10-14T09:43:27.433Z]                             org.eclipse.tracecompass.tmf.ctf.core [233]
05:43:27 [2020-10-14T09:43:27.433Z]                               Unresolved requirement: Require-Bundle: org.eclipse.tracecompass.tmf.core
05:43:27 [2020-10-14T09:43:27.433Z]                                 -> Bundle-SymbolicName: org.eclipse.tracecompass.tmf.core; bundle-version="6.1.0.202010090321"; singleton:="true"
05:43:27 [2020-10-14T09:43:27.433Z]                 Unresolved requirement: Require-Bundle: org.eclipse.tracecompass.lttng2.common.core
05:43:27 [2020-10-14T09:43:27.433Z]                   -> Bundle-SymbolicName: org.eclipse.tracecompass.lttng2.common.core; bundle-version="1.1.3.202010090321"; singleton:="true"
05:43:27 [2020-10-14T09:43:27.433Z]                 Unresolved requirement: Require-Bundle: org.eclipse.tracecompass.analysis.timing.core
05:43:27 [2020-10-14T09:43:27.433Z]                   -> Bundle-SymbolicName: org.eclipse.tracecompass.analysis.timing.core; bundle-version="5.2.0.202010090321"; singleton:="true"
05:43:27 [2020-10-14T09:43:27.433Z]                 Unresolved requirement: Require-Bundle: org.eclipse.tracecompass.tmf.core
05:43:27 [2020-10-14T09:43:27.433Z]                   -> Bundle-SymbolicName: org.eclipse.tracecompass.tmf.core; bundle-version="6.1.0.202010090321"; singleton:="true"
05:43:27 [2020-10-14T09:43:27.433Z]                 Unresolved requirement: Require-Bundle: org.eclipse.tracecompass.tmf.ctf.core
05:43:27 [2020-10-14T09:43:27.433Z]                   -> Bundle-SymbolicName: org.eclipse.tracecompass.tmf.ctf.core; bundle-version="4.2.2.202010090321"; singleton:="true"
05:43:27 [2020-10-14T09:43:27.433Z]                 Unresolved requirement: Require-Bundle: org.eclipse.tracecompass.analysis.counters.core
05:43:27 [2020-10-14T09:43:27.433Z]                   -> Bundle-SymbolicName: org.eclipse.tracecompass.analysis.counters.core; bundle-version="2.0.5.202010090321"; singleton:="true"
05:43:27 [2020-10-14T09:43:27.433Z]                 Unresolved requirement: Require-Bundle: org.eclipse.tracecompass.analysis.profiling.core
05:43:27 [2020-10-14T09:43:27.433Z]                   -> Bundle-SymbolicName: org.eclipse.tracecompass.analysis.profiling.core; bundle-version="2.0.1.202010090321"; singleton:="true"
05:43:27 [2020-10-14T09:43:27.433Z]                      org.eclipse.tracecompass.analysis.profiling.core [226]
05:43:27 [2020-10-14T09:43:27.433Z]                        Unresolved requirement: Require-Bundle: org.eclipse.tracecompass.tmf.core
05:43:27 [2020-10-14T09:43:27.433Z]                          -> Bundle-SymbolicName: org.eclipse.tracecompass.tmf.core; bundle-version="6.1.0.202010090321"; singleton:="true"
05:43:27 [2020-10-14T09:43:27.433Z]                        Unresolved requirement: Require-Bundle: org.eclipse.cdt.core
05:43:27 [2020-10-14T09:43:27.433Z]                          -> Bundle-SymbolicName: org.eclipse.cdt.core; bundle-version="7.0.0.202009010132"; singleton:="true"
05:43:27 [2020-10-14T09:43:27.433Z]          Unresolved requirement: Require-Bundle: org.eclipse.tracecompass.tmf.ctf.core
05:43:27 [2020-10-14T09:43:27.433Z]            -> Bundle-SymbolicName: org.eclipse.tracecompass.tmf.ctf.core; bundle-version="4.2.2.202010090321"; singleton:="true"
05:43:27 [2020-10-14T09:43:27.433Z]          Unresolved requirement: Require-Bundle: org.eclipse.tracecompass.incubator.analysis.core
05:43:27 [2020-10-14T09:43:27.433Z]            -> Bundle-SymbolicName: org.eclipse.tracecompass.incubator.analysis.core; bundle-version="0.0.1.202010140930"; singleton:="true"
05:43:27 [2020-10-14T09:43:27.433Z]          Unresolved requirement: Require-Bundle: org.eclipse.tracecompass.tmf.core
05:43:27 [2020-10-14T09:43:27.433Z]            -> Bundle-SymbolicName: org.eclipse.tracecompass.tmf.core; bundle-version="6.1.0.202010090321"; singleton:="true"
05:43:27 [2020-10-14T09:43:27.433Z]          Unresolved requirement: Require-Bundle: org.eclipse.tracecompass.analysis.os.linux.core
05:43:27 [2020-10-14T09:43:27.433Z]            -> Bundle-SymbolicName: org.eclipse.tracecompass.analysis.os.linux.core; bundle-version="5.0.1.202010090321"; singleton:="true"
05:43:27 [2020-10-14T09:43:27.433Z]          Unresolved requirement: Require-Bundle: org.eclipse.tracecompass.analysis.profiling.core
05:43:27 [2020-10-14T09:43:27.434Z]            -> Bundle-SymbolicName: org.eclipse.tracecompass.analysis.profiling.core; bundle-version="2.0.1.202010090321"; singleton:="true"
05:43:27 [2020-10-14T09:43:27.434Z]   Unresolved requirement: Require-Bundle: org.eclipse.tracecompass.analysis.graph.core
05:43:27 [2020-10-14T09:43:27.434Z]     -> Bundle-SymbolicName: org.eclipse.tracecompass.analysis.graph.core; bundle-version="2.1.7.202010090321"; singleton:="true"
05:43:27 [2020-10-14T09:43:27.434Z]   Unresolved requirement: Require-Bundle: org.eclipse.tracecompass.analysis.timing.core
05:43:27 [2020-10-14T09:43:27.434Z]     -> Bundle-SymbolicName: org.eclipse.tracecompass.analysis.timing.core; bundle-version="5.2.0.202010090321"; singleton:="true"
05:43:27 [2020-10-14T09:43:27.434Z] 
05:43:27 [2020-10-14T09:43:27.434Z] 	at org.eclipse.osgi.container.Module.start(Module.java:463)
05:43:27 [2020-10-14T09:43:27.434Z] 	at org.eclipse.osgi.container.ModuleContainer$ContainerStartLevel$2.run(ModuleContainer.java:1845)
05:43:27 [2020-10-14T09:43:27.434Z] 	at org.eclipse.osgi.internal.framework.EquinoxContainerAdaptor$1$1.execute(EquinoxContainerAdaptor.java:136)
05:43:27 [2020-10-14T09:43:27.434Z] 	at org.eclipse.osgi.container.ModuleContainer$ContainerStartLevel.incStartLevel(ModuleContainer.java:1838)
05:43:27 [2020-10-14T09:43:27.434Z] 	at org.eclipse.osgi.container.ModuleContainer$ContainerStartLevel.incStartLevel(ModuleContainer.java:1779)
05:43:27 [2020-10-14T09:43:27.434Z] 	at org.eclipse.osgi.container.ModuleContainer$ContainerStartLevel.doContainerStartLevel(ModuleContainer.java:1743)
05:43:27 [2020-10-14T09:43:27.434Z] 	at org.eclipse.osgi.container.ModuleContainer$ContainerStartLevel.dispatchEvent(ModuleContainer.java:1665)
05:43:27 [2020-10-14T09:43:27.434Z] 	at org.eclipse.osgi.container.ModuleContainer$ContainerStartLevel.dispatchEvent(ModuleContainer.java:1)
05:43:27 [2020-10-14T09:43:27.434Z] 	at org.eclipse.osgi.framework.eventmgr.EventManager.dispatchEvent(EventManager.java:234)
05:43:27 [2020-10-14T09:43:27.434Z] 	at org.eclipse.osgi.framework.eventmgr.EventManager$EventThread.run(EventManager.java:345)
05:43:27 [2020-10-14T09:43:27.434Z] 
05:43:27 [2020-10-14T09:43:27.434Z] !ENTRY org.eclipse.tracecompass.incubator.lttng2.ust.extras.core 4 0 2020-10-14 09:43:27.401
05:43:27 [2020-10-14T09:43:27.434Z] !MESSAGE FrameworkEvent ERROR
05:43:27 [2020-10-14T09:43:27.434Z] !STACK 0
05:43:27 [2020-10-14T09:43:27.434Z] org.osgi.framework.BundleException: Could not resolve module: org.eclipse.tracecompass.incubator.lttng2.ust.extras.core [237]
05:43:27 [2020-10-14T09:43:27.434Z]   Unresolved requirement: Require-Bundle: org.eclipse.tracecompass.analysis.os.linux.core
05:43:27 [2020-10-14T09:43:27.434Z]     -> Bundle-SymbolicName: org.eclipse.tracecompass.analysis.os.linux.core; bundle-version="5.0.1.202010090321"; singleton:="true"
05:43:27 [2020-10-14T09:43:27.434Z]        org.eclipse.tracecompass.analysis.os.linux.core [220]
05:43:27 [2020-10-14T09:43:27.434Z]          Unresolved requirement: Require-Bundle: org.eclipse.tracecompass.analysis.timing.core
05:43:27 [2020-10-14T09:43:27.434Z]            -> Bundle-SymbolicName: org.eclipse.tracecompass.analysis.timing.core; bundle-version="5.2.0.202010090321"; singleton:="true"
05:43:27 [2020-10-14T09:43:27.434Z]               org.eclipse.tracecompass.analysis.timing.core [223]
05:43:27 [2020-10-14T09:43:27.434Z]                 Unresolved requirement: Require-Bundle: org.eclipse.tracecompass.tmf.core
05:43:27 [2020-10-14T09:43:27.434Z]                   -> Bundle-SymbolicName: org.eclipse.tracecompass.tmf.core; bundle-version="6.1.0.202010090321"; singleton:="true"
05:43:27 [2020-10-14T09:43:27.434Z]                      org.eclipse.tracecompass.tmf.core [218]
05:43:27 [2020-10-14T09:43:27.434Z]                        Unresolved requirement: Require-Bundle: org.eclipse.cdt.core
05:43:27 [2020-10-14T09:43:27.434Z]                          -> Bundle-SymbolicName: org.eclipse.cdt.core; bundle-version="7.0.0.202009010132"; singleton:="true"
05:43:27 [2020-10-14T09:43:27.434Z]                             org.eclipse.cdt.core [43]
05:43:27 [2020-10-14T09:43:27.434Z]                               Unresolved requirement: Require-Capability: osgi.ee; filter:="(&(osgi.ee=JavaSE)(version=11))"
05:43:27 [2020-10-14T09:43:27.434Z]                               Unresolved requirement: Require-Bundle: org.eclipse.cdt.core.native; bundle-version="[6.0.0,7.0.0)"; visibility:="reexport"
05:43:27 [2020-10-14T09:43:27.434Z]                                 -> Bundle-SymbolicName: org.eclipse.cdt.core.native; bundle-version="6.0.0.202009030027"; singleton:="true"
05:43:27 [2020-10-14T09:43:27.434Z]                                    org.eclipse.cdt.core.native [44]
05:43:27 [2020-10-14T09:43:27.434Z]                                      Unresolved requirement: Require-Capability: osgi.ee; filter:="(&(osgi.ee=JavaSE)(version=11))"
05:43:27 [2020-10-14T09:43:27.434Z]          Unresolved requirement: Require-Bundle: org.eclipse.tracecompass.analysis.graph.core
05:43:27 [2020-10-14T09:43:27.434Z]            -> Bundle-SymbolicName: org.eclipse.tracecompass.analysis.graph.core; bundle-version="2.1.7.202010090321"; singleton:="true"
05:43:27 [2020-10-14T09:43:27.434Z]               org.eclipse.tracecompass.analysis.graph.core [219]
05:43:27 [2020-10-14T09:43:27.434Z]                 Unresolved requirement: Require-Bundle: org.eclipse.tracecompass.tmf.core
05:43:27 [2020-10-14T09:43:27.434Z]                   -> Bundle-SymbolicName: org.eclipse.tracecompass.tmf.core; bundle-version="6.1.0.202010090321"; singleton:="true"
05:43:27 [2020-10-14T09:43:27.434Z]          Unresolved requirement: Require-Bundle: org.eclipse.tracecompass.tmf.core
05:43:27 [2020-10-14T09:43:27.434Z]            -> Bundle-SymbolicName: org.eclipse.tracecompass.tmf.core; bundle-version="6.1.0.202010090321"; singleton:="true"
05:43:27 [2020-10-14T09:43:27.434Z]   Unresolved requirement: Require-Bundle: org.eclipse.tracecompass.incubator.kernel.core
05:43:27 [2020-10-14T09:43:27.434Z]     -> Bundle-SymbolicName: org.eclipse.tracecompass.incubator.kernel.core; bundle-version="0.0.1.202010140930"; singleton:="true"
05:43:27 [2020-10-14T09:43:27.434Z]        org.eclipse.tracecompass.incubator.kernel.core [236]
05:43:27 [2020-10-14T09:43:27.434Z]          Unresolved requirement: Require-Bundle: org.eclipse.tracecompass.analysis.os.linux.core
05:43:27 [2020-10-14T09:43:27.434Z]            -> Bundle-SymbolicName: org.eclipse.tracecompass.analysis.os.linux.core; bundle-version="5.0.1.202010090321"; singleton:="true"
05:43:27 [2020-10-14T09:43:27.434Z]          Unresolved requirement: Require-Bundle: org.eclipse.tracecompass.incubator.analysis.core
05:43:27 [2020-10-14T09:43:27.434Z]            -> Bundle-SymbolicName: org.eclipse.tracecompass.incubator.analysis.core; bundle-version="0.0.1.202010140930"; singleton:="true"
05:43:27 [2020-10-14T09:43:27.434Z]               org.eclipse.tracecompass.incubator.analysis.core [230]
05:43:27 [2020-10-14T09:43:27.434Z]                 Unresolved requirement: Require-Bundle: org.eclipse.tracecompass.tmf.core
05:43:27 [2020-10-14T09:43:27.434Z]                   -> Bundle-SymbolicName: org.eclipse.tracecompass.tmf.core; bundle-version="6.1.0.202010090321"; singleton:="true"
05:43:27 [2020-10-14T09:43:27.434Z]                 Unresolved requirement: Require-Bundle: org.eclipse.tracecompass.analysis.timing.core
05:43:27 [2020-10-14T09:43:27.434Z]                   -> Bundle-SymbolicName: org.eclipse.tracecompass.analysis.timing.core; bundle-version="5.2.0.202010090321"; singleton:="true"
05:43:27 [2020-10-14T09:43:27.434Z]                 Unresolved requirement: Require-Bundle: org.eclipse.tracecompass.analysis.os.linux.core
05:43:27 [2020-10-14T09:43:27.434Z]                   -> Bundle-SymbolicName: org.eclipse.tracecompass.analysis.os.linux.core; bundle-version="5.0.1.202010090321"; singleton:="true"
05:43:27 [2020-10-14T09:43:27.434Z]          Unresolved requirement: Require-Bundle: org.eclipse.tracecompass.tmf.core
05:43:27 [2020-10-14T09:43:27.434Z]            -> Bundle-SymbolicName: org.eclipse.tracecompass.tmf.core; bundle-version="6.1.0.202010090321"; singleton:="true"
05:43:27 [2020-10-14T09:43:27.434Z]          Unresolved requirement: Require-Bundle: org.eclipse.tracecompass.incubator.callstack.core
05:43:27 [2020-10-14T09:43:27.434Z]            -> Bundle-SymbolicName: org.eclipse.tracecompass.incubator.callstack.core; bundle-version="0.0.1.202010140930"; singleton:="true"
05:43:27 [2020-10-14T09:43:27.434Z]               org.eclipse.tracecompass.incubator.callstack.core [231]
05:43:27 [2020-10-14T09:43:27.434Z]                 Unresolved requirement: Require-Bundle: org.eclipse.tracecompass.tmf.analysis.xml.core
05:43:27 [2020-10-14T09:43:27.434Z]                   -> Bundle-SymbolicName: org.eclipse.tracecompass.tmf.analysis.xml.core; bundle-version="4.0.1.202010090321"; singleton:="true"
05:43:27 [2020-10-14T09:43:27.434Z]                      org.eclipse.tracecompass.tmf.analysis.xml.core [232]
05:43:27 [2020-10-14T09:43:27.434Z]                        Unresolved requirement: Require-Bundle: org.eclipse.tracecompass.tmf.core
05:43:27 [2020-10-14T09:43:27.434Z]                          -> Bundle-SymbolicName: org.eclipse.tracecompass.tmf.core; bundle-version="6.1.0.202010090321"; singleton:="true"
05:43:27 [2020-10-14T09:43:27.434Z]                        Unresolved requirement: Require-Bundle: org.eclipse.tracecompass.analysis.timing.core
05:43:27 [2020-10-14T09:43:27.434Z]                          -> Bundle-SymbolicName: org.eclipse.tracecompass.analysis.timing.core; bundle-version="5.2.0.202010090321"; singleton:="true"
05:43:27 [2020-10-14T09:43:27.434Z]                 Unresolved requirement: Require-Bundle: org.eclipse.tracecompass.lttng2.common.core
05:43:27 [2020-10-14T09:43:27.434Z]                   -> Bundle-SymbolicName: org.eclipse.tracecompass.lttng2.common.core; bundle-version="1.1.3.202010090321"; singleton:="true"
05:43:27 [2020-10-14T09:43:27.434Z]                      org.eclipse.tracecompass.lttng2.common.core [234]
05:43:27 [2020-10-14T09:43:27.434Z]                        Unresolved requirement: Require-Bundle: org.eclipse.tracecompass.analysis.counters.core
05:43:27 [2020-10-14T09:43:27.434Z]                          -> Bundle-SymbolicName: org.eclipse.tracecompass.analysis.counters.core; bundle-version="2.0.5.202010090321"; singleton:="true"
05:43:27 [2020-10-14T09:43:27.434Z]                             org.eclipse.tracecompass.analysis.counters.core [216]
05:43:27 [2020-10-14T09:43:27.434Z]                               Unresolved requirement: Require-Bundle: org.eclipse.tracecompass.tmf.core
05:43:27 [2020-10-14T09:43:27.434Z]                                 -> Bundle-SymbolicName: org.eclipse.tracecompass.tmf.core; bundle-version="6.1.0.202010090321"; singleton:="true"
05:43:27 [2020-10-14T09:43:27.434Z]                        Unresolved requirement: Require-Bundle: org.eclipse.tracecompass.analysis.os.linux.core
05:43:27 [2020-10-14T09:43:27.434Z]                          -> Bundle-SymbolicName: org.eclipse.tracecompass.analysis.os.linux.core; bundle-version="5.0.1.202010090321"; singleton:="true"
05:43:27 [2020-10-14T09:43:27.434Z]                        Unresolved requirement: Require-Bundle: org.eclipse.tracecompass.tmf.core
05:43:27 [2020-10-14T09:43:27.434Z]                          -> Bundle-SymbolicName: org.eclipse.tracecompass.tmf.core; bundle-version="6.1.0.202010090321"; singleton:="true"
05:43:27 [2020-10-14T09:43:27.434Z]                 Unresolved requirement: Require-Bundle: org.eclipse.tracecompass.analysis.timing.core
05:43:27 [2020-10-14T09:43:27.434Z]                   -> Bundle-SymbolicName: org.eclipse.tracecompass.analysis.timing.core; bundle-version="5.2.0.202010090321"; singleton:="true"
05:43:27 [2020-10-14T09:43:27.434Z]                 Unresolved requirement: Require-Bundle: org.eclipse.tracecompass.lttng2.ust.core
05:43:27 [2020-10-14T09:43:27.434Z]                   -> Bundle-SymbolicName: org.eclipse.tracecompass.lttng2.ust.core; bundle-version="5.0.1.202010090321"; singleton:="true"
05:43:27 [2020-10-14T09:43:27.434Z]                      org.eclipse.tracecompass.lttng2.ust.core [235]
05:43:27 [2020-10-14T09:43:27.434Z]                        Unresolved requirement: Require-Bundle: org.eclipse.tracecompass.analysis.os.linux.core
05:43:27 [2020-10-14T09:43:27.434Z]                          -> Bundle-SymbolicName: org.eclipse.tracecompass.analysis.os.linux.core; bundle-version="5.0.1.202010090321"; singleton:="true"
05:43:27 [2020-10-14T09:43:27.434Z]                        Unresolved requirement: Require-Bundle: org.eclipse.tracecompass.lttng2.control.core
05:43:27 [2020-10-14T09:43:27.434Z]                          -> Bundle-SymbolicName: org.eclipse.tracecompass.lttng2.control.core; bundle-version="1.2.5.202010090321"; singleton:="true"
05:43:27 [2020-10-14T09:43:27.434Z]                             org.eclipse.tracecompass.lttng2.control.core [240]
05:43:27 [2020-10-14T09:43:27.434Z]                               Unresolved requirement: Require-Bundle: org.eclipse.tracecompass.tmf.core
05:43:27 [2020-10-14T09:43:27.434Z]                                 -> Bundle-SymbolicName: org.eclipse.tracecompass.tmf.core; bundle-version="6.1.0.202010090321"; singleton:="true"
05:43:27 [2020-10-14T09:43:27.434Z]                               Unresolved requirement: Require-Bundle: org.eclipse.tracecompass.tmf.ctf.core
05:43:27 [2020-10-14T09:43:27.434Z]                                 -> Bundle-SymbolicName: org.eclipse.tracecompass.tmf.ctf.core; bundle-version="4.2.2.202010090321"; singleton:="true"
05:43:27 [2020-10-14T09:43:27.434Z]                                    org.eclipse.tracecompass.tmf.ctf.core [233]
05:43:27 [2020-10-14T09:43:27.434Z]                                      Unresolved requirement: Require-Bundle: org.eclipse.tracecompass.tmf.core
05:43:27 [2020-10-14T09:43:27.434Z]                                        -> Bundle-SymbolicName: org.eclipse.tracecompass.tmf.core; bundle-version="6.1.0.202010090321"; singleton:="true"
05:43:27 [2020-10-14T09:43:27.434Z]                        Unresolved requirement: Require-Bundle: org.eclipse.tracecompass.lttng2.common.core
05:43:27 [2020-10-14T09:43:27.434Z]                          -> Bundle-SymbolicName: org.eclipse.tracecompass.lttng2.common.core; bundle-version="1.1.3.202010090321"; singleton:="true"
05:43:27 [2020-10-14T09:43:27.434Z]                        Unresolved requirement: Require-Bundle: org.eclipse.tracecompass.analysis.timing.core
05:43:27 [2020-10-14T09:43:27.435Z]                          -> Bundle-SymbolicName: org.eclipse.tracecompass.analysis.timing.core; bundle-version="5.2.0.202010090321"; singleton:="true"
05:43:27 [2020-10-14T09:43:27.435Z]                        Unresolved requirement: Require-Bundle: org.eclipse.tracecompass.tmf.core
05:43:27 [2020-10-14T09:43:27.435Z]                          -> Bundle-SymbolicName: org.eclipse.tracecompass.tmf.core; bundle-version="6.1.0.202010090321"; singleton:="true"
05:43:27 [2020-10-14T09:43:27.435Z]                        Unresolved requirement: Require-Bundle: org.eclipse.tracecompass.tmf.ctf.core
05:43:27 [2020-10-14T09:43:27.435Z]                          -> Bundle-SymbolicName: org.eclipse.tracecompass.tmf.ctf.core; bundle-version="4.2.2.202010090321"; singleton:="true"
05:43:27 [2020-10-14T09:43:27.435Z]                        Unresolved requirement: Require-Bundle: org.eclipse.tracecompass.analysis.counters.core
05:43:27 [2020-10-14T09:43:27.435Z]                          -> Bundle-SymbolicName: org.eclipse.tracecompass.analysis.counters.core; bundle-version="2.0.5.202010090321"; singleton:="true"
05:43:27 [2020-10-14T09:43:27.435Z]                        Unresolved requirement: Require-Bundle: org.eclipse.tracecompass.analysis.profiling.core
05:43:27 [2020-10-14T09:43:27.435Z]                          -> Bundle-SymbolicName: org.eclipse.tracecompass.analysis.profiling.core; bundle-version="2.0.1.202010090321"; singleton:="true"
05:43:27 [2020-10-14T09:43:27.435Z]                             org.eclipse.tracecompass.analysis.profiling.core [226]
05:43:27 [2020-10-14T09:43:27.435Z]                               Unresolved requirement: Require-Bundle: org.eclipse.tracecompass.tmf.core
05:43:27 [2020-10-14T09:43:27.435Z]                                 -> Bundle-SymbolicName: org.eclipse.tracecompass.tmf.core; bundle-version="6.1.0.202010090321"; singleton:="true"
05:43:27 [2020-10-14T09:43:27.435Z]                               Unresolved requirement: Require-Bundle: org.eclipse.cdt.core
05:43:27 [2020-10-14T09:43:27.435Z]                                 -> Bundle-SymbolicName: org.eclipse.cdt.core; bundle-version="7.0.0.202009010132"; singleton:="true"
05:43:27 [2020-10-14T09:43:27.435Z]                 Unresolved requirement: Require-Bundle: org.eclipse.tracecompass.tmf.ctf.core
05:43:27 [2020-10-14T09:43:27.435Z]                   -> Bundle-SymbolicName: org.eclipse.tracecompass.tmf.ctf.core; bundle-version="4.2.2.202010090321"; singleton:="true"
05:43:27 [2020-10-14T09:43:27.435Z]                 Unresolved requirement: Require-Bundle: org.eclipse.tracecompass.incubator.analysis.core
05:43:27 [2020-10-14T09:43:27.435Z]                   -> Bundle-SymbolicName: org.eclipse.tracecompass.incubator.analysis.core; bundle-version="0.0.1.202010140930"; singleton:="true"
05:43:27 [2020-10-14T09:43:27.435Z]                 Unresolved requirement: Require-Bundle: org.eclipse.tracecompass.tmf.core
05:43:27 [2020-10-14T09:43:27.435Z]                   -> Bundle-SymbolicName: org.eclipse.tracecompass.tmf.core; bundle-version="6.1.0.202010090321"; singleton:="true"
05:43:27 [2020-10-14T09:43:27.435Z]                 Unresolved requirement: Require-Bundle: org.eclipse.tracecompass.analysis.os.linux.core
05:43:27 [2020-10-14T09:43:27.435Z]                   -> Bundle-SymbolicName: org.eclipse.tracecompass.analysis.os.linux.core; bundle-version="5.0.1.202010090321"; singleton:="true"
05:43:27 [2020-10-14T09:43:27.435Z]                 Unresolved requirement: Require-Bundle: org.eclipse.tracecompass.analysis.profiling.core
05:43:27 [2020-10-14T09:43:27.435Z]                   -> Bundle-SymbolicName: org.eclipse.tracecompass.analysis.profiling.core; bundle-version="2.0.1.202010090321"; singleton:="true"
05:43:27 [2020-10-14T09:43:27.435Z]          Unresolved requirement: Require-Bundle: org.eclipse.tracecompass.analysis.graph.core
05:43:27 [2020-10-14T09:43:27.435Z]            -> Bundle-SymbolicName: org.eclipse.tracecompass.analysis.graph.core; bundle-version="2.1.7.202010090321"; singleton:="true"
05:43:27 [2020-10-14T09:43:27.435Z]          Unresolved requirement: Require-Bundle: org.eclipse.tracecompass.analysis.timing.core
05:43:27 [2020-10-14T09:43:27.435Z]            -> Bundle-SymbolicName: org.eclipse.tracecompass.analysis.timing.core; bundle-version="5.2.0.202010090321"; singleton:="true"
05:43:27 [2020-10-14T09:43:27.435Z]   Unresolved requirement: Require-Bundle: org.eclipse.tracecompass.tmf.core
05:43:27 [2020-10-14T09:43:27.435Z]     -> Bundle-SymbolicName: org.eclipse.tracecompass.tmf.core; bundle-version="6.1.0.202010090321"; singleton:="true"
05:43:27 [2020-10-14T09:43:27.435Z]   Unresolved requirement: Require-Bundle: org.eclipse.tracecompass.analysis.graph.core
05:43:27 [2020-10-14T09:43:27.435Z]     -> Bundle-SymbolicName: org.eclipse.tracecompass.analysis.graph.core; bundle-version="2.1.7.202010090321"; singleton:="true"
05:43:27 [2020-10-14T09:43:27.435Z]   Unresolved requirement: Require-Bundle: org.eclipse.tracecompass.lttng2.ust.core
05:43:27 [2020-10-14T09:43:27.435Z]     -> Bundle-SymbolicName: org.eclipse.tracecompass.lttng2.ust.core; bundle-version="5.0.1.202010090321"; singleton:="true"
05:43:27 [2020-10-14T09:43:27.435Z] 
05:43:27 [2020-10-14T09:43:27.435Z] 	at org.eclipse.osgi.container.Module.start(Module.java:463)
05:43:27 [2020-10-14T09:43:27.435Z] 	at org.eclipse.osgi.container.ModuleContainer$ContainerStartLevel$2.run(ModuleContainer.java:1845)
05:43:27 [2020-10-14T09:43:27.435Z] 	at org.eclipse.osgi.internal.framework.EquinoxContainerAdaptor$1$1.execute(EquinoxContainerAdaptor.java:136)
05:43:27 [2020-10-14T09:43:27.435Z] 	at org.eclipse.osgi.container.ModuleContainer$ContainerStartLevel.incStartLevel(ModuleContainer.java:1838)
05:43:27 [2020-10-14T09:43:27.435Z] 	at org.eclipse.osgi.container.ModuleContainer$ContainerStartLevel.incStartLevel(ModuleContainer.java:1779)
05:43:27 [2020-10-14T09:43:27.435Z] 	at org.eclipse.osgi.container.ModuleContainer$ContainerStartLevel.doContainerStartLevel(ModuleContainer.java:1743)
05:43:27 [2020-10-14T09:43:27.435Z] 	at org.eclipse.osgi.container.ModuleContainer$ContainerStartLevel.dispatchEvent(ModuleContainer.java:1665)
05:43:27 [2020-10-14T09:43:27.435Z] 	at org.eclipse.osgi.container.ModuleContainer$ContainerStartLevel.dispatchEvent(ModuleContainer.java:1)
05:43:27 [2020-10-14T09:43:27.435Z] 	at org.eclipse.osgi.framework.eventmgr.EventManager.dispatchEvent(EventManager.java:234)
05:43:27 [2020-10-14T09:43:27.435Z] 	at org.eclipse.osgi.framework.eventmgr.EventManager$EventThread.run(EventManager.java:345)
05:43:27 [2020-10-14T09:43:27.435Z] 
05:43:27 [2020-10-14T09:43:27.435Z] !ENTRY org.eclipse.tracecompass.lttng2.control.core 4 0 2020-10-14 09:43:27.403
05:43:27 [2020-10-14T09:43:27.435Z] !MESSAGE FrameworkEvent ERROR
05:43:27 [2020-10-14T09:43:27.435Z] !STACK 0
05:43:27 [2020-10-14T09:43:27.435Z] org.osgi.framework.BundleException: Could not resolve module: org.eclipse.tracecompass.lttng2.control.core [240]
05:43:27 [2020-10-14T09:43:27.435Z]   Unresolved requirement: Require-Bundle: org.eclipse.tracecompass.tmf.core
05:43:27 [2020-10-14T09:43:27.435Z]     -> Bundle-SymbolicName: org.eclipse.tracecompass.tmf.core; bundle-version="6.1.0.202010090321"; singleton:="true"
05:43:27 [2020-10-14T09:43:27.435Z]        org.eclipse.tracecompass.tmf.core [218]
05:43:27 [2020-10-14T09:43:27.435Z]          Unresolved requirement: Require-Bundle: org.eclipse.cdt.core
05:43:27 [2020-10-14T09:43:27.435Z]            -> Bundle-SymbolicName: org.eclipse.cdt.core; bundle-version="7.0.0.202009010132"; singleton:="true"
05:43:27 [2020-10-14T09:43:27.435Z]               org.eclipse.cdt.core [43]
05:43:27 [2020-10-14T09:43:27.435Z]                 Unresolved requirement: Require-Capability: osgi.ee; filter:="(&(osgi.ee=JavaSE)(version=11))"
05:43:27 [2020-10-14T09:43:27.435Z]                 Unresolved requirement: Require-Bundle: org.eclipse.cdt.core.native; bundle-version="[6.0.0,7.0.0)"; visibility:="reexport"
05:43:27 [2020-10-14T09:43:27.435Z]                   -> Bundle-SymbolicName: org.eclipse.cdt.core.native; bundle-version="6.0.0.202009030027"; singleton:="true"
05:43:27 [2020-10-14T09:43:27.435Z]                      org.eclipse.cdt.core.native [44]
05:43:27 [2020-10-14T09:43:27.435Z]                        Unresolved requirement: Require-Capability: osgi.ee; filter:="(&(osgi.ee=JavaSE)(version=11))"
05:43:27 [2020-10-14T09:43:27.435Z]   Unresolved requirement: Require-Bundle: org.eclipse.tracecompass.tmf.ctf.core
05:43:27 [2020-10-14T09:43:27.435Z]     -> Bundle-SymbolicName: org.eclipse.tracecompass.tmf.ctf.core; bundle-version="4.2.2.202010090321"; singleton:="true"
05:43:27 [2020-10-14T09:43:27.435Z]        org.eclipse.tracecompass.tmf.ctf.core [233]
05:43:27 [2020-10-14T09:43:27.435Z]          Unresolved requirement: Require-Bundle: org.eclipse.tracecompass.tmf.core
05:43:27 [2020-10-14T09:43:27.435Z]            -> Bundle-SymbolicName: org.eclipse.tracecompass.tmf.core; bundle-version="6.1.0.202010090321"; singleton:="true"
05:43:27 [2020-10-14T09:43:27.435Z] 
05:43:27 [2020-10-14T09:43:27.435Z] 	at org.eclipse.osgi.container.Module.start(Module.java:463)
05:43:27 [2020-10-14T09:43:27.435Z] 	at org.eclipse.osgi.container.ModuleContainer$ContainerStartLevel$2.run(ModuleContainer.java:1845)
05:43:27 [2020-10-14T09:43:27.435Z] 	at org.eclipse.osgi.internal.framework.EquinoxContainerAdaptor$1$1.execute(EquinoxContainerAdaptor.java:136)
05:43:27 [2020-10-14T09:43:27.435Z] 	at org.eclipse.osgi.container.ModuleContainer$ContainerStartLevel.incStartLevel(ModuleContainer.java:1838)
05:43:27 [2020-10-14T09:43:27.435Z] 	at org.eclipse.osgi.container.ModuleContainer$ContainerStartLevel.incStartLevel(ModuleContainer.java:1779)
05:43:27 [2020-10-14T09:43:27.435Z] 	at org.eclipse.osgi.container.ModuleContainer$ContainerStartLevel.doContainerStartLevel(ModuleContainer.java:1743)
05:43:27 [2020-10-14T09:43:27.435Z] 	at org.eclipse.osgi.container.ModuleContainer$ContainerStartLevel.dispatchEvent(ModuleContainer.java:1665)
05:43:27 [2020-10-14T09:43:27.435Z] 	at org.eclipse.osgi.container.ModuleContainer$ContainerStartLevel.dispatchEvent(ModuleContainer.java:1)
05:43:27 [2020-10-14T09:43:27.435Z] 	at org.eclipse.osgi.framework.eventmgr.EventManager.dispatchEvent(EventManager.java:234)
05:43:27 [2020-10-14T09:43:27.435Z] 	at org.eclipse.osgi.framework.eventmgr.EventManager$EventThread.run(EventManager.java:345)
05:43:27 [2020-10-14T09:43:27.692Z] 
05:43:27 [2020-10-14T09:43:27.692Z] !ENTRY org.eclipse.equinox.launcher.win32.win32.x86_64 2 0 2020-10-14 09:43:27.600
05:43:27 [2020-10-14T09:43:27.693Z] !MESSAGE Could not resolve module: org.eclipse.equinox.launcher.win32.win32.x86_64 [112]
05:43:27 [2020-10-14T09:43:27.693Z]   Unresolved requirement: Require-Capability: eclipse.platform; filter:="(& (osgi.ws=win32) (osgi.os=win32) (osgi.arch=x86_64))"
05:43:27 [2020-10-14T09:43:27.693Z]   Unresolved requirement: Require-Capability: eclipse.platform; filter:="(& (osgi.ws=win32) (osgi.os=win32) (osgi.arch=x86_64))"
05:43:27 [2020-10-14T09:43:27.693Z] 
05:43:27 [2020-10-14T09:43:27.693Z] 
05:43:27 [2020-10-14T09:43:27.693Z] !ENTRY org.eclipse.tracecompass.tmf.analysis.xml.core 2 0 2020-10-14 09:43:27.600
05:43:27 [2020-10-14T09:43:27.693Z] !MESSAGE Could not resolve module: org.eclipse.tracecompass.tmf.analysis.xml.core [232]
05:43:27 [2020-10-14T09:43:27.693Z]   Unresolved requirement: Require-Bundle: org.eclipse.tracecompass.tmf.core
05:43:27 [2020-10-14T09:43:27.693Z]     -> Bundle-SymbolicName: org.eclipse.tracecompass.tmf.core; bundle-version="6.1.0.202010090321"; singleton:="true"
05:43:27 [2020-10-14T09:43:27.693Z]        org.eclipse.tracecompass.tmf.core [218]
05:43:27 [2020-10-14T09:43:27.693Z]          Unresolved requirement: Require-Bundle: org.eclipse.cdt.core
05:43:27 [2020-10-14T09:43:27.693Z]            -> Bundle-SymbolicName: org.eclipse.cdt.core; bundle-version="7.0.0.202009010132"; singleton:="true"
05:43:27 [2020-10-14T09:43:27.693Z]               org.eclipse.cdt.core [43]
05:43:27 [2020-10-14T09:43:27.693Z]                 Unresolved requirement: Require-Capability: osgi.ee; filter:="(&(osgi.ee=JavaSE)(version=11))"
05:43:27 [2020-10-14T09:43:27.693Z]                 Unresolved requirement: Require-Bundle: org.eclipse.cdt.core.native; bundle-version="[6.0.0,7.0.0)"; visibility:="reexport"
05:43:27 [2020-10-14T09:43:27.693Z]                   -> Bundle-SymbolicName: org.eclipse.cdt.core.native; bundle-version="6.0.0.202009030027"; singleton:="true"
05:43:27 [2020-10-14T09:43:27.693Z]                      org.eclipse.cdt.core.native [44]
05:43:27 [2020-10-14T09:43:27.693Z]                        Unresolved requirement: Require-Capability: osgi.ee; filter:="(&(osgi.ee=JavaSE)(version=11))"
05:43:27 [2020-10-14T09:43:27.693Z] 
05:43:27 [2020-10-14T09:43:27.693Z] 
05:43:27 [2020-10-14T09:43:27.693Z] !ENTRY org.eclipse.tracecompass.tmf.core 2 0 2020-10-14 09:43:27.601
05:43:27 [2020-10-14T09:43:27.693Z] !MESSAGE Could not resolve module: org.eclipse.tracecompass.tmf.core [218]
05:43:27 [2020-10-14T09:43:27.693Z]   Unresolved requirement: Require-Bundle: org.eclipse.cdt.core
05:43:27 [2020-10-14T09:43:27.693Z]     -> Bundle-SymbolicName: org.eclipse.cdt.core; bundle-version="7.0.0.202009010132"; singleton:="true"
05:43:27 [2020-10-14T09:43:27.693Z]        org.eclipse.cdt.core [43]
05:43:27 [2020-10-14T09:43:27.693Z]          Unresolved requirement: Require-Capability: osgi.ee; filter:="(&(osgi.ee=JavaSE)(version=11))"
05:43:27 [2020-10-14T09:43:27.693Z]          Unresolved requirement: Require-Bundle: org.eclipse.cdt.core.native; bundle-version="[6.0.0,7.0.0)"; visibility:="reexport"
05:43:27 [2020-10-14T09:43:27.693Z]            -> Bundle-SymbolicName: org.eclipse.cdt.core.native; bundle-version="6.0.0.202009030027"; singleton:="true"
05:43:27 [2020-10-14T09:43:27.693Z]               org.eclipse.cdt.core.native [44]
05:43:27 [2020-10-14T09:43:27.693Z]                 Unresolved requirement: Require-Capability: osgi.ee; filter:="(&(osgi.ee=JavaSE)(version=11))"
05:43:27 [2020-10-14T09:43:27.693Z] 
05:43:27 [2020-10-14T09:43:27.693Z] 
05:43:27 [2020-10-14T09:43:27.693Z] !ENTRY org.eclipse.equinox.security.win32.x86_64 2 0 2020-10-14 09:43:27.601
05:43:27 [2020-10-14T09:43:27.693Z] !MESSAGE Could not resolve module: org.eclipse.equinox.security.win32.x86_64 [166]
05:43:27 [2020-10-14T09:43:27.693Z]   Unresolved requirement: Require-Capability: eclipse.platform; filter:="(& (osgi.os=win32) (osgi.arch=x86_64))"
05:43:27 [2020-10-14T09:43:27.693Z]   Unresolved requirement: Require-Capability: eclipse.platform; filter:="(& (osgi.os=win32) (osgi.arch=x86_64))"
05:43:27 [2020-10-14T09:43:27.693Z] 
05:43:27 [2020-10-14T09:43:27.693Z] 
05:43:27 [2020-10-14T09:43:27.693Z] !ENTRY org.eclipse.ui.win32 2 0 2020-10-14 09:43:27.601
05:43:27 [2020-10-14T09:43:27.693Z] !MESSAGE Could not resolve module: org.eclipse.ui.win32 [208]
05:43:27 [2020-10-14T09:43:27.693Z]   Unresolved requirement: Require-Capability: eclipse.platform; filter:="(osgi.ws=win32)"
05:43:27 [2020-10-14T09:43:27.693Z]   Unresolved requirement: Require-Capability: eclipse.platform; filter:="(osgi.ws=win32)"
05:43:27 [2020-10-14T09:43:27.693Z] 
05:43:27 [2020-10-14T09:43:27.693Z] 
05:43:27 [2020-10-14T09:43:27.693Z] !ENTRY org.eclipse.equinox.launcher.cocoa.macosx.x86_64 2 0 2020-10-14 09:43:27.601
05:43:27 [2020-10-14T09:43:27.693Z] !MESSAGE Could not resolve module: org.eclipse.equinox.launcher.cocoa.macosx.x86_64 [245]
05:43:27 [2020-10-14T09:43:27.693Z]   Unresolved requirement: Require-Capability: eclipse.platform; filter:="(& (osgi.ws=cocoa) (osgi.os=macosx) (osgi.arch=x86_64) )"
05:43:27 [2020-10-14T09:43:27.693Z]   Unresolved requirement: Require-Capability: eclipse.platform; filter:="(& (osgi.ws=cocoa) (osgi.os=macosx) (osgi.arch=x86_64) )"
05:43:27 [2020-10-14T09:43:27.693Z] 
05:43:27 [2020-10-14T09:43:27.693Z] 
05:43:27 [2020-10-14T09:43:27.693Z] !ENTRY org.eclipse.cdt.core 2 0 2020-10-14 09:43:27.601
05:43:27 [2020-10-14T09:43:27.693Z] !MESSAGE Could not resolve module: org.eclipse.cdt.core [43]
05:43:27 [2020-10-14T09:43:27.693Z]   Unresolved requirement: Require-Capability: osgi.ee; filter:="(&(osgi.ee=JavaSE)(version=11))"
05:43:27 [2020-10-14T09:43:27.693Z]   Unresolved requirement: Require-Bundle: org.eclipse.cdt.core.native; bundle-version="[6.0.0,7.0.0)"; visibility:="reexport"
05:43:27 [2020-10-14T09:43:27.693Z]     -> Bundle-SymbolicName: org.eclipse.cdt.core.native; bundle-version="6.0.0.202009030027"; singleton:="true"
05:43:27 [2020-10-14T09:43:27.693Z]        org.eclipse.cdt.core.native [44]
05:43:27 [2020-10-14T09:43:27.693Z]          Unresolved requirement: Require-Capability: osgi.ee; filter:="(&(osgi.ee=JavaSE)(version=11))"
05:43:27 [2020-10-14T09:43:27.693Z] 
05:43:27 [2020-10-14T09:43:27.693Z] 
05:43:27 [2020-10-14T09:43:27.693Z] !ENTRY org.eclipse.tracecompass.incubator.kernel.core 2 0 2020-10-14 09:43:27.602
05:43:27 [2020-10-14T09:43:27.693Z] !MESSAGE Could not resolve module: org.eclipse.tracecompass.incubator.kernel.core [236]
05:43:27 [2020-10-14T09:43:27.693Z]   Unresolved requirement: Require-Bundle: org.eclipse.tracecompass.tmf.core
05:43:27 [2020-10-14T09:43:27.693Z]     -> Bundle-SymbolicName: org.eclipse.tracecompass.tmf.core; bundle-version="6.1.0.202010090321"; singleton:="true"
05:43:27 [2020-10-14T09:43:27.693Z]        org.eclipse.tracecompass.tmf.core [218]
05:43:27 [2020-10-14T09:43:27.693Z]          Unresolved requirement: Require-Bundle: org.eclipse.cdt.core
05:43:27 [2020-10-14T09:43:27.693Z]            -> Bundle-SymbolicName: org.eclipse.cdt.core; bundle-version="7.0.0.202009010132"; singleton:="true"
05:43:27 [2020-10-14T09:43:27.693Z]               org.eclipse.cdt.core [43]
05:43:27 [2020-10-14T09:43:27.693Z]                 Unresolved requirement: Require-Capability: osgi.ee; filter:="(&(osgi.ee=JavaSE)(version=11))"
05:43:27 [2020-10-14T09:43:27.693Z]                 Unresolved requirement: Require-Bundle: org.eclipse.cdt.core.native; bundle-version="[6.0.0,7.0.0)"; visibility:="reexport"
05:43:27 [2020-10-14T09:43:27.693Z]                   -> Bundle-SymbolicName: org.eclipse.cdt.core.native; bundle-version="6.0.0.202009030027"; singleton:="true"
05:43:27 [2020-10-14T09:43:27.693Z]                      org.eclipse.cdt.core.native [44]
05:43:27 [2020-10-14T09:43:27.693Z]                        Unresolved requirement: Require-Capability: osgi.ee; filter:="(&(osgi.ee=JavaSE)(version=11))"
05:43:27 [2020-10-14T09:43:27.693Z] 
05:43:27 [2020-10-14T09:43:27.693Z] 
05:43:27 [2020-10-14T09:43:27.693Z] !ENTRY org.eclipse.swt.cocoa.macosx.x86_64 2 0 2020-10-14 09:43:27.602
05:43:27 [2020-10-14T09:43:27.693Z] !MESSAGE Could not resolve module: org.eclipse.swt.cocoa.macosx.x86_64 [246]
05:43:27 [2020-10-14T09:43:27.693Z]   Unresolved requirement: Require-Capability: eclipse.platform; filter:="(& (osgi.ws=cocoa) (osgi.os=macosx) (osgi.arch=x86_64) )"
05:43:27 [2020-10-14T09:43:27.693Z]   Unresolved requirement: Require-Capability: eclipse.platform; filter:="(& (osgi.ws=cocoa) (osgi.os=macosx) (osgi.arch=x86_64) )"
05:43:27 [2020-10-14T09:43:27.693Z] 
05:43:27 [2020-10-14T09:43:27.693Z] 
05:43:27 [2020-10-14T09:43:27.693Z] !ENTRY org.eclipse.core.filesystem.win32.x86_64 2 0 2020-10-14 09:43:27.602
05:43:27 [2020-10-14T09:43:27.693Z] !MESSAGE Could not resolve module: org.eclipse.core.filesystem.win32.x86_64 [75]
05:43:27 [2020-10-14T09:43:27.693Z]   Unresolved requirement: Require-Capability: eclipse.platform; filter:="(& (osgi.os=win32) (osgi.arch=x86_64))"
05:43:27 [2020-10-14T09:43:27.693Z]   Unresolved requirement: Require-Capability: eclipse.platform; filter:="(& (osgi.os=win32) (osgi.arch=x86_64))"
05:43:27 [2020-10-14T09:43:27.693Z] 
05:43:27 [2020-10-14T09:43:27.693Z] 
05:43:27 [2020-10-14T09:43:27.693Z] !ENTRY org.eclipse.tracecompass.analysis.timing.core 2 0 2020-10-14 09:43:27.602
05:43:27 [2020-10-14T09:43:27.693Z] !MESSAGE Could not resolve module: org.eclipse.tracecompass.analysis.timing.core [223]
05:43:27 [2020-10-14T09:43:27.693Z]   Unresolved requirement: Require-Bundle: org.eclipse.tracecompass.tmf.core
05:43:27 [2020-10-14T09:43:27.693Z]     -> Bundle-SymbolicName: org.eclipse.tracecompass.tmf.core; bundle-version="6.1.0.202010090321"; singleton:="true"
05:43:27 [2020-10-14T09:43:27.693Z]        org.eclipse.tracecompass.tmf.core [218]
05:43:27 [2020-10-14T09:43:27.693Z]          Unresolved requirement: Require-Bundle: org.eclipse.cdt.core
05:43:27 [2020-10-14T09:43:27.693Z]            -> Bundle-SymbolicName: org.eclipse.cdt.core; bundle-version="7.0.0.202009010132"; singleton:="true"
05:43:27 [2020-10-14T09:43:27.693Z]               org.eclipse.cdt.core [43]
05:43:27 [2020-10-14T09:43:27.693Z]                 Unresolved requirement: Require-Capability: osgi.ee; filter:="(&(osgi.ee=JavaSE)(version=11))"
05:43:27 [2020-10-14T09:43:27.693Z]                 Unresolved requirement: Require-Bundle: org.eclipse.cdt.core.native; bundle-version="[6.0.0,7.0.0)"; visibility:="reexport"
05:43:27 [2020-10-14T09:43:27.693Z]                   -> Bundle-SymbolicName: org.eclipse.cdt.core.native; bundle-version="6.0.0.202009030027"; singleton:="true"
05:43:27 [2020-10-14T09:43:27.693Z]                      org.eclipse.cdt.core.native [44]
05:43:27 [2020-10-14T09:43:27.693Z]                        Unresolved requirement: Require-Capability: osgi.ee; filter:="(&(osgi.ee=JavaSE)(version=11))"
05:43:27 [2020-10-14T09:43:27.693Z] 
05:43:27 [2020-10-14T09:43:27.693Z] 
05:43:27 [2020-10-14T09:43:27.693Z] !ENTRY org.eclipse.tracecompass.incubator.analysis.core 2 0 2020-10-14 09:43:27.603
05:43:27 [2020-10-14T09:43:27.693Z] !MESSAGE Could not resolve module: org.eclipse.tracecompass.incubator.analysis.core [230]
05:43:27 [2020-10-14T09:43:27.693Z]   Unresolved requirement: Require-Bundle: org.eclipse.tracecompass.tmf.core
05:43:27 [2020-10-14T09:43:27.693Z]     -> Bundle-SymbolicName: org.eclipse.tracecompass.tmf.core; bundle-version="6.1.0.202010090321"; singleton:="true"
05:43:27 [2020-10-14T09:43:27.693Z]        org.eclipse.tracecompass.tmf.core [218]
05:43:27 [2020-10-14T09:43:27.693Z]          Unresolved requirement: Require-Bundle: org.eclipse.cdt.core
05:43:27 [2020-10-14T09:43:27.693Z]            -> Bundle-SymbolicName: org.eclipse.cdt.core; bundle-version="7.0.0.202009010132"; singleton:="true"
05:43:27 [2020-10-14T09:43:27.693Z]               org.eclipse.cdt.core [43]
05:43:27 [2020-10-14T09:43:27.693Z]                 Unresolved requirement: Require-Capability: osgi.ee; filter:="(&(osgi.ee=JavaSE)(version=11))"
05:43:27 [2020-10-14T09:43:27.694Z]                 Unresolved requirement: Require-Bundle: org.eclipse.cdt.core.native; bundle-version="[6.0.0,7.0.0)"; visibility:="reexport"
05:43:27 [2020-10-14T09:43:27.694Z]                   -> Bundle-SymbolicName: org.eclipse.cdt.core.native; bundle-version="6.0.0.202009030027"; singleton:="true"
05:43:27 [2020-10-14T09:43:27.694Z]                      org.eclipse.cdt.core.native [44]
05:43:27 [2020-10-14T09:43:27.694Z]                        Unresolved requirement: Require-Capability: osgi.ee; filter:="(&(osgi.ee=JavaSE)(version=11))"
05:43:27 [2020-10-14T09:43:27.694Z] 
05:43:27 [2020-10-14T09:43:27.694Z] 
05:43:27 [2020-10-14T09:43:27.694Z] !ENTRY org.eclipse.core.net.win32.x86_64 2 0 2020-10-14 09:43:27.603
05:43:27 [2020-10-14T09:43:27.694Z] !MESSAGE Could not resolve module: org.eclipse.core.net.win32.x86_64 [79]
05:43:27 [2020-10-14T09:43:27.694Z]   Unresolved requirement: Require-Capability: eclipse.platform; filter:="(& (osgi.os=win32) (osgi.arch=x86_64))"
05:43:27 [2020-10-14T09:43:27.694Z]   Unresolved requirement: Require-Capability: eclipse.platform; filter:="(& (osgi.os=win32) (osgi.arch=x86_64))"
05:43:27 [2020-10-14T09:43:27.694Z] 
05:43:27 [2020-10-14T09:43:27.694Z] 
05:43:27 [2020-10-14T09:43:27.694Z] !ENTRY org.eclipse.tracecompass.incubator.callstack.core 2 0 2020-10-14 09:43:27.603
05:43:27 [2020-10-14T09:43:27.694Z] !MESSAGE Could not resolve module: org.eclipse.tracecompass.incubator.callstack.core [231]
05:43:27 [2020-10-14T09:43:27.694Z]   Unresolved requirement: Require-Bundle: org.eclipse.tracecompass.incubator.analysis.core
05:43:27 [2020-10-14T09:43:27.694Z]     -> Bundle-SymbolicName: org.eclipse.tracecompass.incubator.analysis.core; bundle-version="0.0.1.202010140930"; singleton:="true"
05:43:27 [2020-10-14T09:43:27.694Z]        org.eclipse.tracecompass.incubator.analysis.core [230]
05:43:27 [2020-10-14T09:43:27.694Z]          Unresolved requirement: Require-Bundle: org.eclipse.tracecompass.tmf.core
05:43:27 [2020-10-14T09:43:27.694Z]            -> Bundle-SymbolicName: org.eclipse.tracecompass.tmf.core; bundle-version="6.1.0.202010090321"; singleton:="true"
05:43:27 [2020-10-14T09:43:27.694Z]               org.eclipse.tracecompass.tmf.core [218]
05:43:27 [2020-10-14T09:43:27.694Z]                 Unresolved requirement: Require-Bundle: org.eclipse.cdt.core
05:43:27 [2020-10-14T09:43:27.694Z]                   -> Bundle-SymbolicName: org.eclipse.cdt.core; bundle-version="7.0.0.202009010132"; singleton:="true"
05:43:27 [2020-10-14T09:43:27.694Z]                      org.eclipse.cdt.core [43]
05:43:27 [2020-10-14T09:43:27.694Z]                        Unresolved requirement: Require-Capability: osgi.ee; filter:="(&(osgi.ee=JavaSE)(version=11))"
05:43:27 [2020-10-14T09:43:27.694Z]                        Unresolved requirement: Require-Bundle: org.eclipse.cdt.core.native; bundle-version="[6.0.0,7.0.0)"; visibility:="reexport"
05:43:27 [2020-10-14T09:43:27.694Z]                          -> Bundle-SymbolicName: org.eclipse.cdt.core.native; bundle-version="6.0.0.202009030027"; singleton:="true"
05:43:27 [2020-10-14T09:43:27.694Z]                             org.eclipse.cdt.core.native [44]
05:43:27 [2020-10-14T09:43:27.694Z]                               Unresolved requirement: Require-Capability: osgi.ee; filter:="(&(osgi.ee=JavaSE)(version=11))"
05:43:27 [2020-10-14T09:43:27.694Z] 
05:43:27 [2020-10-14T09:43:27.694Z] 
05:43:27 [2020-10-14T09:43:27.694Z] !ENTRY org.eclipse.ui.cheatsheets 2 0 2020-10-14 09:43:27.603
05:43:27 [2020-10-14T09:43:27.694Z] !MESSAGE Could not resolve module: org.eclipse.ui.cheatsheets [200]
05:43:27 [2020-10-14T09:43:27.694Z]   Unresolved requirement: Require-Capability: osgi.ee; filter:="(&(osgi.ee=JavaSE)(version=11))"
05:43:27 [2020-10-14T09:43:27.694Z]   Unresolved requirement: Require-Bundle: org.eclipse.help.base; bundle-version="[4.0.0,5.0.0)"; resolution:="optional"
05:43:27 [2020-10-14T09:43:27.694Z]     -> Bundle-SymbolicName: org.eclipse.help.base; bundle-version="4.3.0.v20200902-1800"; singleton:="true"
05:43:27 [2020-10-14T09:43:27.694Z]        org.eclipse.help.base [181]
05:43:27 [2020-10-14T09:43:27.694Z]          Unresolved requirement: Require-Capability: osgi.ee; filter:="(&(osgi.ee=JavaSE)(version=11))"
05:43:27 [2020-10-14T09:43:27.694Z]   Unresolved requirement: Require-Bundle: org.eclipse.help.ui; bundle-version="[4.0.0,5.0.0)"; resolution:="optional"
05:43:27 [2020-10-14T09:43:27.694Z]     -> Bundle-SymbolicName: org.eclipse.help.ui; bundle-version="4.2.0.v20200724-0708"; singleton:="true"
05:43:27 [2020-10-14T09:43:27.694Z]        org.eclipse.help.ui [182]
05:43:27 [2020-10-14T09:43:27.694Z]          Unresolved requirement: Require-Bundle: org.eclipse.help.base; bundle-version="[4.0.0,5.0.0)"; visibility:="reexport"
05:43:27 [2020-10-14T09:43:27.694Z]            -> Bundle-SymbolicName: org.eclipse.help.base; bundle-version="4.3.0.v20200902-1800"; singleton:="true"
05:43:27 [2020-10-14T09:43:27.694Z] 
05:43:27 [2020-10-14T09:43:27.694Z] 
05:43:27 [2020-10-14T09:43:27.694Z] !ENTRY org.eclipse.tracecompass.analysis.profiling.core 2 0 2020-10-14 09:43:27.604
05:43:27 [2020-10-14T09:43:27.694Z] !MESSAGE Could not resolve module: org.eclipse.tracecompass.analysis.profiling.core [226]
05:43:27 [2020-10-14T09:43:27.694Z]   Unresolved requirement: Require-Bundle: org.eclipse.tracecompass.tmf.core
05:43:27 [2020-10-14T09:43:27.694Z]     -> Bundle-SymbolicName: org.eclipse.tracecompass.tmf.core; bundle-version="6.1.0.202010090321"; singleton:="true"
05:43:27 [2020-10-14T09:43:27.694Z]        org.eclipse.tracecompass.tmf.core [218]
05:43:27 [2020-10-14T09:43:27.694Z]          Unresolved requirement: Require-Bundle: org.eclipse.cdt.core
05:43:27 [2020-10-14T09:43:27.694Z]            -> Bundle-SymbolicName: org.eclipse.cdt.core; bundle-version="7.0.0.202009010132"; singleton:="true"
05:43:27 [2020-10-14T09:43:27.694Z]               org.eclipse.cdt.core [43]
05:43:27 [2020-10-14T09:43:27.694Z]                 Unresolved requirement: Require-Capability: osgi.ee; filter:="(&(osgi.ee=JavaSE)(version=11))"
05:43:27 [2020-10-14T09:43:27.694Z]                 Unresolved requirement: Require-Bundle: org.eclipse.cdt.core.native; bundle-version="[6.0.0,7.0.0)"; visibility:="reexport"
05:43:27 [2020-10-14T09:43:27.694Z]                   -> Bundle-SymbolicName: org.eclipse.cdt.core.native; bundle-version="6.0.0.202009030027"; singleton:="true"
05:43:27 [2020-10-14T09:43:27.694Z]                      org.eclipse.cdt.core.native [44]
05:43:27 [2020-10-14T09:43:27.694Z]                        Unresolved requirement: Require-Capability: osgi.ee; filter:="(&(osgi.ee=JavaSE)(version=11))"
05:43:27 [2020-10-14T09:43:27.694Z] 
05:43:27 [2020-10-14T09:43:27.694Z] 
05:43:27 [2020-10-14T09:43:27.694Z] !ENTRY org.eclipse.tracecompass.tmf.ctf.core 2 0 2020-10-14 09:43:27.604
05:43:27 [2020-10-14T09:43:27.694Z] !MESSAGE Could not resolve module: org.eclipse.tracecompass.tmf.ctf.core [233]
05:43:27 [2020-10-14T09:43:27.694Z]   Unresolved requirement: Require-Bundle: org.eclipse.tracecompass.tmf.core
05:43:27 [2020-10-14T09:43:27.694Z]     -> Bundle-SymbolicName: org.eclipse.tracecompass.tmf.core; bundle-version="6.1.0.202010090321"; singleton:="true"
05:43:27 [2020-10-14T09:43:27.694Z]        org.eclipse.tracecompass.tmf.core [218]
05:43:27 [2020-10-14T09:43:27.694Z]          Unresolved requirement: Require-Bundle: org.eclipse.cdt.core
05:43:27 [2020-10-14T09:43:27.694Z]            -> Bundle-SymbolicName: org.eclipse.cdt.core; bundle-version="7.0.0.202009010132"; singleton:="true"
05:43:27 [2020-10-14T09:43:27.694Z]               org.eclipse.cdt.core [43]
05:43:27 [2020-10-14T09:43:27.694Z]                 Unresolved requirement: Require-Capability: osgi.ee; filter:="(&(osgi.ee=JavaSE)(version=11))"
05:43:27 [2020-10-14T09:43:27.694Z]                 Unresolved requirement: Require-Bundle: org.eclipse.cdt.core.native; bundle-version="[6.0.0,7.0.0)"; visibility:="reexport"
05:43:27 [2020-10-14T09:43:27.694Z]                   -> Bundle-SymbolicName: org.eclipse.cdt.core.native; bundle-version="6.0.0.202009030027"; singleton:="true"
05:43:27 [2020-10-14T09:43:27.694Z]                      org.eclipse.cdt.core.native [44]
05:43:27 [2020-10-14T09:43:27.694Z]                        Unresolved requirement: Require-Capability: osgi.ee; filter:="(&(osgi.ee=JavaSE)(version=11))"
05:43:27 [2020-10-14T09:43:27.694Z] 
05:43:27 [2020-10-14T09:43:27.694Z] 
05:43:27 [2020-10-14T09:43:27.694Z] !ENTRY org.eclipse.tracecompass.lttng2.common.core 2 0 2020-10-14 09:43:27.604
05:43:27 [2020-10-14T09:43:27.694Z] !MESSAGE Could not resolve module: org.eclipse.tracecompass.lttng2.common.core [234]
05:43:27 [2020-10-14T09:43:27.694Z]   Unresolved requirement: Require-Bundle: org.eclipse.tracecompass.tmf.core
05:43:27 [2020-10-14T09:43:27.694Z]     -> Bundle-SymbolicName: org.eclipse.tracecompass.tmf.core; bundle-version="6.1.0.202010090321"; singleton:="true"
05:43:27 [2020-10-14T09:43:27.694Z]        org.eclipse.tracecompass.tmf.core [218]
05:43:27 [2020-10-14T09:43:27.694Z]          Unresolved requirement: Require-Bundle: org.eclipse.cdt.core
05:43:27 [2020-10-14T09:43:27.694Z]            -> Bundle-SymbolicName: org.eclipse.cdt.core; bundle-version="7.0.0.202009010132"; singleton:="true"
05:43:27 [2020-10-14T09:43:27.694Z]               org.eclipse.cdt.core [43]
05:43:27 [2020-10-14T09:43:27.694Z]                 Unresolved requirement: Require-Capability: osgi.ee; filter:="(&(osgi.ee=JavaSE)(version=11))"
05:43:27 [2020-10-14T09:43:27.694Z]                 Unresolved requirement: Require-Bundle: org.eclipse.cdt.core.native; bundle-version="[6.0.0,7.0.0)"; visibility:="reexport"
05:43:27 [2020-10-14T09:43:27.694Z]                   -> Bundle-SymbolicName: org.eclipse.cdt.core.native; bundle-version="6.0.0.202009030027"; singleton:="true"
05:43:27 [2020-10-14T09:43:27.694Z]                      org.eclipse.cdt.core.native [44]
05:43:27 [2020-10-14T09:43:27.694Z]                        Unresolved requirement: Require-Capability: osgi.ee; filter:="(&(osgi.ee=JavaSE)(version=11))"
05:43:27 [2020-10-14T09:43:27.694Z] 
05:43:27 [2020-10-14T09:43:27.694Z] 
05:43:27 [2020-10-14T09:43:27.694Z] !ENTRY org.eclipse.tracecompass.incubator.lttng2.ust.extras.core 2 0 2020-10-14 09:43:27.605
05:43:27 [2020-10-14T09:43:27.694Z] !MESSAGE Could not resolve module: org.eclipse.tracecompass.incubator.lttng2.ust.extras.core [237]
05:43:27 [2020-10-14T09:43:27.694Z]   Unresolved requirement: Require-Bundle: org.eclipse.tracecompass.analysis.os.linux.core
05:43:27 [2020-10-14T09:43:27.694Z]     -> Bundle-SymbolicName: org.eclipse.tracecompass.analysis.os.linux.core; bundle-version="5.0.1.202010090321"; singleton:="true"
05:43:27 [2020-10-14T09:43:27.694Z]        org.eclipse.tracecompass.analysis.os.linux.core [220]
05:43:27 [2020-10-14T09:43:27.694Z]          Unresolved requirement: Require-Bundle: org.eclipse.tracecompass.tmf.core
05:43:27 [2020-10-14T09:43:27.694Z]            -> Bundle-SymbolicName: org.eclipse.tracecompass.tmf.core; bundle-version="6.1.0.202010090321"; singleton:="true"
05:43:27 [2020-10-14T09:43:27.694Z]               org.eclipse.tracecompass.tmf.core [218]
05:43:27 [2020-10-14T09:43:27.694Z]                 Unresolved requirement: Require-Bundle: org.eclipse.cdt.core
05:43:27 [2020-10-14T09:43:27.694Z]                   -> Bundle-SymbolicName: org.eclipse.cdt.core; bundle-version="7.0.0.202009010132"; singleton:="true"
05:43:27 [2020-10-14T09:43:27.694Z]                      org.eclipse.cdt.core [43]
05:43:27 [2020-10-14T09:43:27.694Z]                        Unresolved requirement: Require-Capability: osgi.ee; filter:="(&(osgi.ee=JavaSE)(version=11))"
05:43:27 [2020-10-14T09:43:27.694Z]                        Unresolved requirement: Require-Bundle: org.eclipse.cdt.core.native; bundle-version="[6.0.0,7.0.0)"; visibility:="reexport"
05:43:27 [2020-10-14T09:43:27.694Z]                          -> Bundle-SymbolicName: org.eclipse.cdt.core.native; bundle-version="6.0.0.202009030027"; singleton:="true"
05:43:27 [2020-10-14T09:43:27.694Z]                             org.eclipse.cdt.core.native [44]
05:43:27 [2020-10-14T09:43:27.695Z]                               Unresolved requirement: Require-Capability: osgi.ee; filter:="(&(osgi.ee=JavaSE)(version=11))"
05:43:27 [2020-10-14T09:43:27.695Z] 
05:43:27 [2020-10-14T09:43:27.695Z] 
05:43:27 [2020-10-14T09:43:27.695Z] !ENTRY org.eclipse.e4.ui.workbench.renderers.swt.cocoa 2 0 2020-10-14 09:43:27.605
05:43:27 [2020-10-14T09:43:27.695Z] !MESSAGE Could not resolve module: org.eclipse.e4.ui.workbench.renderers.swt.cocoa [244]
05:43:27 [2020-10-14T09:43:27.695Z]   Unresolved requirement: Require-Capability: eclipse.platform; filter:="(osgi.ws=cocoa)"
05:43:27 [2020-10-14T09:43:27.695Z]   Unresolved requirement: Require-Capability: eclipse.platform; filter:="(osgi.ws=cocoa)"
05:43:27 [2020-10-14T09:43:27.695Z] 
05:43:27 [2020-10-14T09:43:27.695Z] 
05:43:27 [2020-10-14T09:43:27.695Z] !ENTRY org.eclipse.equinox.security.macosx 2 0 2020-10-14 09:43:27.605
05:43:27 [2020-10-14T09:43:27.695Z] !MESSAGE Could not resolve module: org.eclipse.equinox.security.macosx [248]
05:43:27 [2020-10-14T09:43:27.695Z]   Unresolved requirement: Require-Capability: eclipse.platform; filter:="(& (osgi.os=macosx) (|(osgi.arch=x86)(osgi.arch=x86_64)(osgi.arch=ppc)) )"
05:43:27 [2020-10-14T09:43:27.695Z]   Unresolved requirement: Require-Capability: eclipse.platform; filter:="(& (osgi.os=macosx) (|(osgi.arch=x86)(osgi.arch=x86_64)(osgi.arch=ppc)) )"
05:43:27 [2020-10-14T09:43:27.695Z] 
05:43:27 [2020-10-14T09:43:27.695Z] 
05:43:27 [2020-10-14T09:43:27.695Z] !ENTRY org.eclipse.core.resources.win32.x86_64 2 0 2020-10-14 09:43:27.605
05:43:27 [2020-10-14T09:43:27.695Z] !MESSAGE Could not resolve module: org.eclipse.core.resources.win32.x86_64 [80]
05:43:27 [2020-10-14T09:43:27.695Z]   Unresolved requirement: Require-Capability: eclipse.platform; filter:="(& (osgi.os=win32) (osgi.arch=x86_64))"
05:43:27 [2020-10-14T09:43:27.695Z]   Unresolved requirement: Require-Capability: eclipse.platform; filter:="(& (osgi.os=win32) (osgi.arch=x86_64))"
05:43:27 [2020-10-14T09:43:27.695Z] 
05:43:27 [2020-10-14T09:43:27.695Z] 
05:43:27 [2020-10-14T09:43:27.695Z] !ENTRY org.eclipse.ecf.provider.filetransfer.httpclient45.win32 2 0 2020-10-14 09:43:27.606
05:43:27 [2020-10-14T09:43:27.695Z] !MESSAGE Could not resolve module: org.eclipse.ecf.provider.filetransfer.httpclient45.win32 [134]
05:43:27 [2020-10-14T09:43:27.695Z]   Unresolved requirement: Import-Package: org.apache.http.impl.auth.win; version="[4.5.0,5.0.0)"
05:43:27 [2020-10-14T09:43:27.695Z]     -> Export-Package: org.apache.http.impl.auth.win; bundle-symbolic-name="org.apache.httpcomponents.httpclient.win"; bundle-version="4.5.10.v20200113-2105"; version="4.5.10"; x-internal:="true"; uses:="org.apache.http,org.apache.http.auth,org.apache.http.client,org.apache.http.impl.auth,org.apache.http.protocol,org.apache.http.util"
05:43:27 [2020-10-14T09:43:27.695Z]        org.apache.httpcomponents.httpclient.win [35]
05:43:27 [2020-10-14T09:43:27.695Z]          Unresolved requirement: Require-Capability: eclipse.platform; filter:="(osgi.os=win32)"
05:43:27 [2020-10-14T09:43:27.695Z] 
05:43:27 [2020-10-14T09:43:27.695Z] 
05:43:27 [2020-10-14T09:43:27.695Z] !ENTRY org.eclipse.tracecompass.analysis.graph.core 2 0 2020-10-14 09:43:27.606
05:43:27 [2020-10-14T09:43:27.695Z] !MESSAGE Could not resolve module: org.eclipse.tracecompass.analysis.graph.core [219]
05:43:27 [2020-10-14T09:43:27.695Z]   Unresolved requirement: Require-Bundle: org.eclipse.tracecompass.tmf.core
05:43:27 [2020-10-14T09:43:27.695Z]     -> Bundle-SymbolicName: org.eclipse.tracecompass.tmf.core; bundle-version="6.1.0.202010090321"; singleton:="true"
05:43:27 [2020-10-14T09:43:27.695Z]        org.eclipse.tracecompass.tmf.core [218]
05:43:27 [2020-10-14T09:43:27.695Z]          Unresolved requirement: Require-Bundle: org.eclipse.cdt.core
05:43:27 [2020-10-14T09:43:27.695Z]            -> Bundle-SymbolicName: org.eclipse.cdt.core; bundle-version="7.0.0.202009010132"; singleton:="true"
05:43:27 [2020-10-14T09:43:27.695Z]               org.eclipse.cdt.core [43]
05:43:27 [2020-10-14T09:43:27.695Z]                 Unresolved requirement: Require-Capability: osgi.ee; filter:="(&(osgi.ee=JavaSE)(version=11))"
05:43:27 [2020-10-14T09:43:27.695Z]                 Unresolved requirement: Require-Bundle: org.eclipse.cdt.core.native; bundle-version="[6.0.0,7.0.0)"; visibility:="reexport"
05:43:27 [2020-10-14T09:43:27.695Z]                   -> Bundle-SymbolicName: org.eclipse.cdt.core.native; bundle-version="6.0.0.202009030027"; singleton:="true"
05:43:27 [2020-10-14T09:43:27.695Z]                      org.eclipse.cdt.core.native [44]
05:43:27 [2020-10-14T09:43:27.695Z]                        Unresolved requirement: Require-Capability: osgi.ee; filter:="(&(osgi.ee=JavaSE)(version=11))"
05:43:27 [2020-10-14T09:43:27.695Z] 
05:43:27 [2020-10-14T09:43:27.695Z] 
05:43:27 [2020-10-14T09:43:27.695Z] !ENTRY org.eclipse.core.filesystem.macosx 2 0 2020-10-14 09:43:27.606
05:43:27 [2020-10-14T09:43:27.695Z] !MESSAGE Could not resolve module: org.eclipse.core.filesystem.macosx [243]
05:43:27 [2020-10-14T09:43:27.695Z]   Unresolved requirement: Require-Capability: eclipse.platform; filter:="(& (osgi.os=macosx) (osgi.arch=x86_64))"
05:43:27 [2020-10-14T09:43:27.695Z]   Unresolved requirement: Require-Capability: eclipse.platform; filter:="(& (osgi.os=macosx) (osgi.arch=x86_64))"
05:43:27 [2020-10-14T09:43:27.695Z] 
05:43:27 [2020-10-14T09:43:27.695Z] 
05:43:27 [2020-10-14T09:43:27.695Z] !ENTRY org.eclipse.ui.intro.quicklinks 2 0 2020-10-14 09:43:27.606
05:43:27 [2020-10-14T09:43:27.695Z] !MESSAGE Could not resolve module: org.eclipse.ui.intro.quicklinks [211]
05:43:27 [2020-10-14T09:43:27.695Z]   Unresolved requirement: Require-Capability: osgi.ee; filter:="(&(osgi.ee=JavaSE)(version=11))"
05:43:27 [2020-10-14T09:43:27.695Z] 
05:43:27 [2020-10-14T09:43:27.695Z] 
05:43:27 [2020-10-14T09:43:27.695Z] !ENTRY org.eclipse.ui.intro.universal 2 0 2020-10-14 09:43:27.606
05:43:27 [2020-10-14T09:43:27.695Z] !MESSAGE Could not resolve module: org.eclipse.ui.intro.universal [199]
05:43:27 [2020-10-14T09:43:27.695Z]   Unresolved requirement: Require-Capability: osgi.ee; filter:="(&(osgi.ee=JavaSE)(version=11))"
05:43:27 [2020-10-14T09:43:27.695Z]   Unresolved requirement: Require-Bundle: org.eclipse.ui.intro.quicklinks; bundle-version="1.0.0"
05:43:27 [2020-10-14T09:43:27.695Z]     -> Bundle-SymbolicName: org.eclipse.ui.intro.quicklinks; bundle-version="1.1.0.v20200724-0708"; singleton:="true"
05:43:27 [2020-10-14T09:43:27.695Z]        org.eclipse.ui.intro.quicklinks [211]
05:43:27 [2020-10-14T09:43:27.695Z]          Unresolved requirement: Require-Capability: osgi.ee; filter:="(&(osgi.ee=JavaSE)(version=11))"
05:43:27 [2020-10-14T09:43:27.695Z] 
05:43:27 [2020-10-14T09:43:27.695Z] 
05:43:27 [2020-10-14T09:43:27.695Z] !ENTRY org.eclipse.tracecompass.analysis.os.linux.core 2 0 2020-10-14 09:43:27.607
05:43:27 [2020-10-14T09:43:27.695Z] !MESSAGE Could not resolve module: org.eclipse.tracecompass.analysis.os.linux.core [220]
05:43:27 [2020-10-14T09:43:27.695Z]   Unresolved requirement: Require-Bundle: org.eclipse.tracecompass.tmf.core
05:43:27 [2020-10-14T09:43:27.695Z]     -> Bundle-SymbolicName: org.eclipse.tracecompass.tmf.core; bundle-version="6.1.0.202010090321"; singleton:="true"
05:43:27 [2020-10-14T09:43:27.695Z]        org.eclipse.tracecompass.tmf.core [218]
05:43:27 [2020-10-14T09:43:27.695Z]          Unresolved requirement: Require-Bundle: org.eclipse.cdt.core
05:43:27 [2020-10-14T09:43:27.695Z]            -> Bundle-SymbolicName: org.eclipse.cdt.core; bundle-version="7.0.0.202009010132"; singleton:="true"
05:43:27 [2020-10-14T09:43:27.695Z]               org.eclipse.cdt.core [43]
05:43:27 [2020-10-14T09:43:27.695Z]                 Unresolved requirement: Require-Capability: osgi.ee; filter:="(&(osgi.ee=JavaSE)(version=11))"
05:43:27 [2020-10-14T09:43:27.695Z]                 Unresolved requirement: Require-Bundle: org.eclipse.cdt.core.native; bundle-version="[6.0.0,7.0.0)"; visibility:="reexport"
05:43:27 [2020-10-14T09:43:27.695Z]                   -> Bundle-SymbolicName: org.eclipse.cdt.core.native; bundle-version="6.0.0.202009030027"; singleton:="true"
05:43:27 [2020-10-14T09:43:27.695Z]                      org.eclipse.cdt.core.native [44]
05:43:27 [2020-10-14T09:43:27.695Z]                        Unresolved requirement: Require-Capability: osgi.ee; filter:="(&(osgi.ee=JavaSE)(version=11))"
05:43:27 [2020-10-14T09:43:27.695Z] 
05:43:27 [2020-10-14T09:43:27.695Z] 
05:43:27 [2020-10-14T09:43:27.695Z] !ENTRY org.eclipse.tracecompass.incubator.lttng2.ust.extras.core.tests 2 0 2020-10-14 09:43:27.607
05:43:27 [2020-10-14T09:43:27.695Z] !MESSAGE Could not resolve module: org.eclipse.tracecompass.incubator.lttng2.ust.extras.core.tests [238]
05:43:27 [2020-10-14T09:43:27.695Z]   Unresolved requirement: Require-Bundle: org.eclipse.tracecompass.incubator.lttng2.ust.extras.core
05:43:27 [2020-10-14T09:43:27.695Z]     -> Bundle-SymbolicName: org.eclipse.tracecompass.incubator.lttng2.ust.extras.core; bundle-version="0.0.1.202010140930"; singleton:="true"
05:43:27 [2020-10-14T09:43:27.695Z]        org.eclipse.tracecompass.incubator.lttng2.ust.extras.core [237]
05:43:27 [2020-10-14T09:43:27.695Z]          Unresolved requirement: Require-Bundle: org.eclipse.tracecompass.analysis.os.linux.core
05:43:27 [2020-10-14T09:43:27.695Z]            -> Bundle-SymbolicName: org.eclipse.tracecompass.analysis.os.linux.core; bundle-version="5.0.1.202010090321"; singleton:="true"
05:43:27 [2020-10-14T09:43:27.695Z]               org.eclipse.tracecompass.analysis.os.linux.core [220]
05:43:27 [2020-10-14T09:43:27.695Z]                 Unresolved requirement: Require-Bundle: org.eclipse.tracecompass.tmf.core
05:43:27 [2020-10-14T09:43:27.695Z]                   -> Bundle-SymbolicName: org.eclipse.tracecompass.tmf.core; bundle-version="6.1.0.202010090321"; singleton:="true"
05:43:27 [2020-10-14T09:43:27.695Z]                      org.eclipse.tracecompass.tmf.core [218]
05:43:27 [2020-10-14T09:43:27.695Z]                        Unresolved requirement: Require-Bundle: org.eclipse.cdt.core
05:43:27 [2020-10-14T09:43:27.695Z]                          -> Bundle-SymbolicName: org.eclipse.cdt.core; bundle-version="7.0.0.202009010132"; singleton:="true"
05:43:27 [2020-10-14T09:43:27.695Z]                             org.eclipse.cdt.core [43]
05:43:27 [2020-10-14T09:43:27.695Z]                               Unresolved requirement: Require-Capability: osgi.ee; filter:="(&(osgi.ee=JavaSE)(version=11))"
05:43:27 [2020-10-14T09:43:27.695Z]                               Unresolved requirement: Require-Bundle: org.eclipse.cdt.core.native; bundle-version="[6.0.0,7.0.0)"; visibility:="reexport"
05:43:27 [2020-10-14T09:43:27.695Z]                                 -> Bundle-SymbolicName: org.eclipse.cdt.core.native; bundle-version="6.0.0.202009030027"; singleton:="true"
05:43:27 [2020-10-14T09:43:27.695Z]                                    org.eclipse.cdt.core.native [44]
05:43:27 [2020-10-14T09:43:27.695Z]                                      Unresolved requirement: Require-Capability: osgi.ee; filter:="(&(osgi.ee=JavaSE)(version=11))"
05:43:27 [2020-10-14T09:43:27.695Z] 
05:43:27 [2020-10-14T09:43:27.695Z] 
05:43:27 [2020-10-14T09:43:27.695Z] !ENTRY org.eclipse.swt.win32.win32.x86_64 2 0 2020-10-14 09:43:27.607
05:43:27 [2020-10-14T09:43:27.695Z] !MESSAGE Could not resolve module: org.eclipse.swt.win32.win32.x86_64 [62]
05:43:27 [2020-10-14T09:43:27.695Z]   Unresolved requirement: Require-Capability: eclipse.platform; filter:="(& (osgi.ws=win32) (osgi.os=win32) (osgi.arch=x86_64))"
05:43:27 [2020-10-14T09:43:27.696Z]   Unresolved requirement: Require-Capability: eclipse.platform; filter:="(& (osgi.ws=win32) (osgi.os=win32) (osgi.arch=x86_64))"
05:43:27 [2020-10-14T09:43:27.696Z] 
05:43:27 [2020-10-14T09:43:27.696Z] 
05:43:27 [2020-10-14T09:43:27.696Z] !ENTRY org.eclipse.compare.win32 2 0 2020-10-14 09:43:27.607
05:43:27 [2020-10-14T09:43:27.696Z] !MESSAGE Could not resolve module: org.eclipse.compare.win32 [61]
05:43:27 [2020-10-14T09:43:27.696Z]   Unresolved requirement: Require-Capability: eclipse.platform; filter:="(osgi.os=win32)"
05:43:27 [2020-10-14T09:43:27.696Z] 
05:43:27 [2020-10-14T09:43:27.696Z] 
05:43:27 [2020-10-14T09:43:27.696Z] !ENTRY org.eclipse.tracecompass.lttng2.ust.core 2 0 2020-10-14 09:43:27.608
05:43:27 [2020-10-14T09:43:27.696Z] !MESSAGE Could not resolve module: org.eclipse.tracecompass.lttng2.ust.core [235]
05:43:27 [2020-10-14T09:43:27.696Z]   Unresolved requirement: Require-Bundle: org.eclipse.tracecompass.tmf.core
05:43:27 [2020-10-14T09:43:27.696Z]     -> Bundle-SymbolicName: org.eclipse.tracecompass.tmf.core; bundle-version="6.1.0.202010090321"; singleton:="true"
05:43:27 [2020-10-14T09:43:27.696Z]        org.eclipse.tracecompass.tmf.core [218]
05:43:27 [2020-10-14T09:43:27.696Z]          Unresolved requirement: Require-Bundle: org.eclipse.cdt.core
05:43:27 [2020-10-14T09:43:27.696Z]            -> Bundle-SymbolicName: org.eclipse.cdt.core; bundle-version="7.0.0.202009010132"; singleton:="true"
05:43:27 [2020-10-14T09:43:27.696Z]               org.eclipse.cdt.core [43]
05:43:27 [2020-10-14T09:43:27.696Z]                 Unresolved requirement: Require-Capability: osgi.ee; filter:="(&(osgi.ee=JavaSE)(version=11))"
05:43:27 [2020-10-14T09:43:27.696Z]                 Unresolved requirement: Require-Bundle: org.eclipse.cdt.core.native; bundle-version="[6.0.0,7.0.0)"; visibility:="reexport"
05:43:27 [2020-10-14T09:43:27.696Z]                   -> Bundle-SymbolicName: org.eclipse.cdt.core.native; bundle-version="6.0.0.202009030027"; singleton:="true"
05:43:27 [2020-10-14T09:43:27.696Z]                      org.eclipse.cdt.core.native [44]
05:43:27 [2020-10-14T09:43:27.696Z]                        Unresolved requirement: Require-Capability: osgi.ee; filter:="(&(osgi.ee=JavaSE)(version=11))"
05:43:27 [2020-10-14T09:43:27.696Z] 
05:43:27 [2020-10-14T09:43:27.696Z] 
05:43:27 [2020-10-14T09:43:27.696Z] !ENTRY org.eclipse.cdt.core.native 2 0 2020-10-14 09:43:27.608
05:43:27 [2020-10-14T09:43:27.696Z] !MESSAGE Could not resolve module: org.eclipse.cdt.core.native [44]
05:43:27 [2020-10-14T09:43:27.696Z]   Unresolved requirement: Require-Capability: osgi.ee; filter:="(&(osgi.ee=JavaSE)(version=11))"
05:43:27 [2020-10-14T09:43:27.696Z] 
05:43:27 [2020-10-14T09:43:27.696Z] 
05:43:27 [2020-10-14T09:43:27.696Z] !ENTRY org.eclipse.help.webapp 2 0 2020-10-14 09:43:27.608
05:43:27 [2020-10-14T09:43:27.696Z] !MESSAGE Could not resolve module: org.eclipse.help.webapp [183]
05:43:27 [2020-10-14T09:43:27.696Z]   Unresolved requirement: Require-Bundle: org.eclipse.help.base; bundle-version="[4.0.0,5.0.0)"
05:43:27 [2020-10-14T09:43:27.696Z]     -> Bundle-SymbolicName: org.eclipse.help.base; bundle-version="4.3.0.v20200902-1800"; singleton:="true"
05:43:27 [2020-10-14T09:43:27.696Z]        org.eclipse.help.base [181]
05:43:27 [2020-10-14T09:43:27.696Z]          Unresolved requirement: Require-Capability: osgi.ee; filter:="(&(osgi.ee=JavaSE)(version=11))"
05:43:27 [2020-10-14T09:43:27.696Z] 
05:43:27 [2020-10-14T09:43:27.696Z] 
05:43:27 [2020-10-14T09:43:27.696Z] !ENTRY org.eclipse.tracecompass.lttng2.control.core 2 0 2020-10-14 09:43:27.608
05:43:27 [2020-10-14T09:43:27.696Z] !MESSAGE Could not resolve module: org.eclipse.tracecompass.lttng2.control.core [240]
05:43:27 [2020-10-14T09:43:27.696Z]   Unresolved requirement: Require-Bundle: org.eclipse.tracecompass.tmf.core
05:43:27 [2020-10-14T09:43:27.696Z]     -> Bundle-SymbolicName: org.eclipse.tracecompass.tmf.core; bundle-version="6.1.0.202010090321"; singleton:="true"
05:43:27 [2020-10-14T09:43:27.696Z]        org.eclipse.tracecompass.tmf.core [218]
05:43:27 [2020-10-14T09:43:27.696Z]          Unresolved requirement: Require-Bundle: org.eclipse.cdt.core
05:43:27 [2020-10-14T09:43:27.696Z]            -> Bundle-SymbolicName: org.eclipse.cdt.core; bundle-version="7.0.0.202009010132"; singleton:="true"
05:43:27 [2020-10-14T09:43:27.696Z]               org.eclipse.cdt.core [43]
05:43:27 [2020-10-14T09:43:27.696Z]                 Unresolved requirement: Require-Capability: osgi.ee; filter:="(&(osgi.ee=JavaSE)(version=11))"
05:43:27 [2020-10-14T09:43:27.696Z]                 Unresolved requirement: Require-Bundle: org.eclipse.cdt.core.native; bundle-version="[6.0.0,7.0.0)"; visibility:="reexport"
05:43:27 [2020-10-14T09:43:27.696Z]                   -> Bundle-SymbolicName: org.eclipse.cdt.core.native; bundle-version="6.0.0.202009030027"; singleton:="true"
05:43:27 [2020-10-14T09:43:27.696Z]                      org.eclipse.cdt.core.native [44]
05:43:27 [2020-10-14T09:43:27.696Z]                        Unresolved requirement: Require-Capability: osgi.ee; filter:="(&(osgi.ee=JavaSE)(version=11))"
05:43:27 [2020-10-14T09:43:27.696Z] 
05:43:27 [2020-10-14T09:43:27.696Z] 
05:43:27 [2020-10-14T09:43:27.696Z] !ENTRY org.eclipse.help.base 2 0 2020-10-14 09:43:27.609
05:43:27 [2020-10-14T09:43:27.696Z] !MESSAGE Could not resolve module: org.eclipse.help.base [181]
05:43:27 [2020-10-14T09:43:27.696Z]   Unresolved requirement: Require-Capability: osgi.ee; filter:="(&(osgi.ee=JavaSE)(version=11))"
05:43:27 [2020-10-14T09:43:27.696Z] 
05:43:27 [2020-10-14T09:43:27.696Z] 
05:43:27 [2020-10-14T09:43:27.696Z] !ENTRY org.eclipse.e4.ui.swt.win32 2 0 2020-10-14 09:43:27.609
05:43:27 [2020-10-14T09:43:27.696Z] !MESSAGE Could not resolve module: org.eclipse.e4.ui.swt.win32 [121]
05:43:27 [2020-10-14T09:43:27.696Z]   Unresolved requirement: Require-Capability: eclipse.platform; filter:="(osgi.ws=win32)"
05:43:27 [2020-10-14T09:43:27.696Z] 
05:43:27 [2020-10-14T09:43:27.696Z] 
05:43:27 [2020-10-14T09:43:27.696Z] !ENTRY org.apache.httpcomponents.httpclient.win 2 0 2020-10-14 09:43:27.609
05:43:27 [2020-10-14T09:43:27.696Z] !MESSAGE Could not resolve module: org.apache.httpcomponents.httpclient.win [35]
05:43:27 [2020-10-14T09:43:27.696Z]   Unresolved requirement: Require-Capability: eclipse.platform; filter:="(osgi.os=win32)"
05:43:27 [2020-10-14T09:43:27.696Z] 
05:43:27 [2020-10-14T09:43:27.696Z] 
05:43:27 [2020-10-14T09:43:27.696Z] !ENTRY org.eclipse.swt.browser.chromium.win32.win32.x86_64 2 0 2020-10-14 09:43:27.609
05:43:27 [2020-10-14T09:43:27.696Z] !MESSAGE Could not resolve module: org.eclipse.swt.browser.chromium.win32.win32.x86_64 [114]
05:43:27 [2020-10-14T09:43:27.696Z]   Unresolved requirement: Require-Capability: eclipse.platform; filter:="(& (osgi.ws=win32) (osgi.os=win32) (osgi.arch=x86_64))"
05:43:27 [2020-10-14T09:43:27.696Z]   Unresolved requirement: Require-Capability: eclipse.platform; filter:="(& (osgi.ws=win32) (osgi.os=win32) (osgi.arch=x86_64))"
05:43:27 [2020-10-14T09:43:27.696Z] 
05:43:27 [2020-10-14T09:43:27.696Z] 
05:43:27 [2020-10-14T09:43:27.696Z] !ENTRY org.eclipse.swt.browser.chromium.cocoa.macosx.x86_64 2 0 2020-10-14 09:43:27.609
05:43:27 [2020-10-14T09:43:27.696Z] !MESSAGE Could not resolve module: org.eclipse.swt.browser.chromium.cocoa.macosx.x86_64 [247]
05:43:27 [2020-10-14T09:43:27.696Z]   Unresolved requirement: Require-Capability: eclipse.platform; filter:="(& (osgi.ws=cocoa) (osgi.os=macosx) (osgi.arch=x86_64))"
05:43:27 [2020-10-14T09:43:27.696Z]   Unresolved requirement: Require-Capability: eclipse.platform; filter:="(& (osgi.ws=cocoa) (osgi.os=macosx) (osgi.arch=x86_64))"
05:43:27 [2020-10-14T09:43:27.696Z] 
05:43:27 [2020-10-14T09:43:27.696Z] 
05:43:27 [2020-10-14T09:43:27.696Z] !ENTRY org.eclipse.help.ui 2 0 2020-10-14 09:43:27.610
05:43:27 [2020-10-14T09:43:27.696Z] !MESSAGE Could not resolve module: org.eclipse.help.ui [182]
05:43:27 [2020-10-14T09:43:27.696Z]   Unresolved requirement: Require-Bundle: org.eclipse.help.base; bundle-version="[4.0.0,5.0.0)"; visibility:="reexport"
05:43:27 [2020-10-14T09:43:27.696Z]     -> Bundle-SymbolicName: org.eclipse.help.base; bundle-version="4.3.0.v20200902-1800"; singleton:="true"
05:43:27 [2020-10-14T09:43:27.696Z]        org.eclipse.help.base [181]
05:43:27 [2020-10-14T09:43:27.696Z]          Unresolved requirement: Require-Capability: osgi.ee; filter:="(&(osgi.ee=JavaSE)(version=11))"
05:43:27 [2020-10-14T09:43:27.696Z] 
05:43:27 [2020-10-14T09:43:27.696Z] 
05:43:27 [2020-10-14T09:43:27.696Z] !ENTRY org.eclipse.ui.cocoa 2 0 2020-10-14 09:43:27.610
05:43:27 [2020-10-14T09:43:27.696Z] !MESSAGE Could not resolve module: org.eclipse.ui.cocoa [249]
05:43:27 [2020-10-14T09:43:27.696Z]   Unresolved requirement: Require-Capability: eclipse.platform; filter:="(osgi.ws=cocoa)"
05:43:27 [2020-10-14T09:43:27.696Z]   Unresolved requirement: Require-Capability: eclipse.platform; filter:="(osgi.ws=cocoa)"
05:43:27 [2020-10-14T09:43:27.696Z] 
05:43:27 [2020-10-14T09:43:27.696Z] 
05:43:27 [2020-10-14T09:43:27.696Z] !ENTRY org.eclipse.tracecompass.analysis.counters.core 2 0 2020-10-14 09:43:27.610
05:43:27 [2020-10-14T09:43:27.696Z] !MESSAGE Could not resolve module: org.eclipse.tracecompass.analysis.counters.core [216]
05:43:27 [2020-10-14T09:43:27.696Z]   Unresolved requirement: Require-Bundle: org.eclipse.tracecompass.tmf.core
05:43:27 [2020-10-14T09:43:27.696Z]     -> Bundle-SymbolicName: org.eclipse.tracecompass.tmf.core; bundle-version="6.1.0.202010090321"; singleton:="true"
05:43:27 [2020-10-14T09:43:27.696Z]        org.eclipse.tracecompass.tmf.core [218]
05:43:27 [2020-10-14T09:43:27.696Z]          Unresolved requirement: Require-Bundle: org.eclipse.cdt.core
05:43:27 [2020-10-14T09:43:27.696Z]            -> Bundle-SymbolicName: org.eclipse.cdt.core; bundle-version="7.0.0.202009010132"; singleton:="true"
05:43:27 [2020-10-14T09:43:27.696Z]               org.eclipse.cdt.core [43]
05:43:27 [2020-10-14T09:43:27.696Z]                 Unresolved requirement: Require-Capability: osgi.ee; filter:="(&(osgi.ee=JavaSE)(version=11))"
05:43:27 [2020-10-14T09:43:27.696Z]                 Unresolved requirement: Require-Bundle: org.eclipse.cdt.core.native; bundle-version="[6.0.0,7.0.0)"; visibility:="reexport"
05:43:27 [2020-10-14T09:43:27.696Z]                   -> Bundle-SymbolicName: org.eclipse.cdt.core.native; bundle-version="6.0.0.202009030027"; singleton:="true"
05:43:27 [2020-10-14T09:43:27.696Z]                      org.eclipse.cdt.core.native [44]
05:43:27 [2020-10-14T09:43:27.696Z]                        Unresolved requirement: Require-Capability: osgi.ee; filter:="(&(osgi.ee=JavaSE)(version=11))"
05:43:27 [2020-10-14T09:43:27.696Z] 
05:43:27 [2020-10-14T09:43:27.696Z] 
05:43:27 [2020-10-14T09:43:27.696Z] !ENTRY org.eclipse.osgi 4 0 2020-10-14 09:43:27.610
05:43:27 [2020-10-14T09:43:27.696Z] !MESSAGE Application error
05:43:27 [2020-10-14T09:43:27.696Z] !STACK 1
05:43:27 [2020-10-14T09:43:27.696Z] java.lang.RuntimeException: Bundle org.eclipse.tracecompass.incubator.lttng2.ust.extras.core.tests is not found
05:43:27 [2020-10-14T09:43:27.696Z] 	at org.eclipse.tycho.surefire.osgibooter.OsgiSurefireBooter.getBundleClassLoader(OsgiSurefireBooter.java:176)
05:43:27 [2020-10-14T09:43:27.697Z] 	at org.eclipse.tycho.surefire.osgibooter.OsgiSurefireBooter.createCombinedClassLoader(OsgiSurefireBooter.java:117)
05:43:27 [2020-10-14T09:43:27.697Z] 	at org.eclipse.tycho.surefire.osgibooter.OsgiSurefireBooter.run(OsgiSurefireBooter.java:110)
05:43:27 [2020-10-14T09:43:27.697Z] 	at org.eclipse.tycho.surefire.osgibooter.HeadlessTestApplication.run(HeadlessTestApplication.java:21)
05:43:27 [2020-10-14T09:43:27.697Z] 	at sun.reflect.NativeMethodAccessorImpl.invoke0(Native Method)
05:43:27 [2020-10-14T09:43:27.697Z] 	at sun.reflect.NativeMethodAccessorImpl.invoke(NativeMethodAccessorImpl.java:62)
05:43:27 [2020-10-14T09:43:27.697Z] 	at sun.reflect.DelegatingMethodAccessorImpl.invoke(DelegatingMethodAccessorImpl.java:43)
05:43:27 [2020-10-14T09:43:27.697Z] 	at java.lang.reflect.Method.invoke(Method.java:498)
05:43:27 [2020-10-14T09:43:27.697Z] 	at org.eclipse.equinox.internal.app.EclipseAppContainer.callMethodWithException(EclipseAppContainer.java:593)
05:43:27 [2020-10-14T09:43:27.697Z] 	at org.eclipse.equinox.internal.app.EclipseAppHandle.run(EclipseAppHandle.java:205)
05:43:27 [2020-10-14T09:43:27.697Z] 	at org.eclipse.core.runtime.internal.adaptor.EclipseAppLauncher.runApplication(EclipseAppLauncher.java:134)
05:43:27 [2020-10-14T09:43:27.697Z] 	at org.eclipse.core.runtime.internal.adaptor.EclipseAppLauncher.start(EclipseAppLauncher.java:104)
05:43:27 [2020-10-14T09:43:27.697Z] 	at org.eclipse.core.runtime.adaptor.EclipseStarter.run(EclipseStarter.java:401)
05:43:27 [2020-10-14T09:43:27.697Z] 	at org.eclipse.core.runtime.adaptor.EclipseStarter.run(EclipseStarter.java:255)
05:43:27 [2020-10-14T09:43:27.697Z] 	at sun.reflect.NativeMethodAccessorImpl.invoke0(Native Method)
05:43:27 [2020-10-14T09:43:27.697Z] 	at sun.reflect.NativeMethodAccessorImpl.invoke(NativeMethodAccessorImpl.java:62)
05:43:27 [2020-10-14T09:43:27.697Z] 	at sun.reflect.DelegatingMethodAccessorImpl.invoke(DelegatingMethodAccessorImpl.java:43)
05:43:27 [2020-10-14T09:43:27.697Z] 	at java.lang.reflect.Method.invoke(Method.java:498)
05:43:27 [2020-10-14T09:43:27.697Z] 	at org.eclipse.equinox.launcher.Main.invokeFramework(Main.java:657)
05:43:27 [2020-10-14T09:43:27.697Z] 	at org.eclipse.equinox.launcher.Main.basicRun(Main.java:594)
05:43:27 [2020-10-14T09:43:27.697Z] 	at org.eclipse.equinox.launcher.Main.run(Main.java:1465)
05:43:27 [2020-10-14T09:43:27.697Z] 	at org.eclipse.equinox.launcher.Main.main(Main.java:1438)
05:43:28 [2020-10-14T09:43:28.626Z] An error has occurred. See the log file
05:43:28 [2020-10-14T09:43:28.626Z] /home/jenkins/agent/workspace/tracecompass-incubator-stable/analyses/org.eclipse.tracecompass.incubator.lttng2.ust.extras.core.tests/target/work/configuration/1602668605549.log.
05:43:28 [2020-10-14T09:43:28.626Z] [INFO] ------------------------------------------------------------------------
05:43:28 [2020-10-14T09:43:28.626Z] [INFO] Reactor Summary:
05:43:28 [2020-10-14T09:43:28.626Z] [INFO] 
05:43:28 [2020-10-14T09:43:28.626Z] [INFO] Trace Compass Incubator Parent 0.0.1-SNAPSHOT ...... SUCCESS [01:28 min]
05:43:28 [2020-10-14T09:43:28.626Z] [INFO] Trace Compass Incubator Common Parent 0.0.1-SNAPSHOT SUCCESS [  0.039 s]
05:43:28 [2020-10-14T09:43:28.626Z] [INFO] Trace Compass Incubator Target Platform 0.0.1-SNAPSHOT SUCCESS [  4.815 s]
05:43:28 [2020-10-14T09:43:28.626Z] [INFO] Trace Compass Incubator Callstack Parent 0.0.1-SNAPSHOT SUCCESS [  0.018 s]
05:43:28 [2020-10-14T09:43:28.626Z] [INFO] org.eclipse.tracecompass.incubator.analysis.core 0.0.1-SNAPSHOT SUCCESS [ 16.183 s]
05:43:28 [2020-10-14T09:43:28.626Z] [INFO] Trace Compass Incubator tracetypes Parent 0.0.1-SNAPSHOT SUCCESS [  0.081 s]
05:43:28 [2020-10-14T09:43:28.626Z] [INFO] org.eclipse.tracecompass.incubator.ftrace.core 0.0.1-SNAPSHOT SUCCESS [  3.937 s]
05:43:28 [2020-10-14T09:43:28.626Z] [INFO] org.eclipse.tracecompass.incubator.callstack.core 0.0.1-SNAPSHOT SUCCESS [  4.567 s]
05:43:28 [2020-10-14T09:43:28.626Z] [INFO] org.eclipse.tracecompass.incubator.traceevent.core 0.0.1-SNAPSHOT SUCCESS [  3.609 s]
05:43:28 [2020-10-14T09:43:28.626Z] [INFO] org.eclipse.tracecompass.incubator.atrace.core 0.0.1-SNAPSHOT SUCCESS [  3.073 s]
05:43:28 [2020-10-14T09:43:28.626Z] [INFO] Trace Compass Incubator Documentation 0.0.1-SNAPSHOT SUCCESS [  0.014 s]
05:43:28 [2020-10-14T09:43:28.626Z] [INFO] Trace Compass Incubator for Android User Guide 0.0.1-SNAPSHOT SUCCESS [ 24.439 s]
05:43:28 [2020-10-14T09:43:28.626Z] [INFO] Trace Compass Incubator ftrace User Guide 0.0.1-SNAPSHOT SUCCESS [  5.583 s]
05:43:28 [2020-10-14T09:43:28.627Z] [INFO] org.eclipse.tracecompass.incubator.ftrace 0.0.1-SNAPSHOT SUCCESS [  2.660 s]
05:43:28 [2020-10-14T09:43:28.627Z] [INFO] Trace Compass Incubator callstack User Guide 0.0.1-SNAPSHOT SUCCESS [  5.416 s]
05:43:28 [2020-10-14T09:43:28.627Z] [INFO] org.eclipse.tracecompass.incubator.callstack.ui 0.0.1-SNAPSHOT SUCCESS [  4.126 s]
05:43:28 [2020-10-14T09:43:28.627Z] [INFO] org.eclipse.tracecompass.incubator.callstack 0.0.1-SNAPSHOT SUCCESS [  2.912 s]
05:43:28 [2020-10-14T09:43:28.627Z] [INFO] org.eclipse.tracecompass.incubator.traceevent.ui 0.0.1-SNAPSHOT SUCCESS [  4.100 s]
05:43:28 [2020-10-14T09:43:28.627Z] [INFO] org.eclipse.tracecompass.incubator.traceevent 0.0.1-SNAPSHOT SUCCESS [  2.961 s]
05:43:28 [2020-10-14T09:43:28.627Z] [INFO] org.eclipse.tracecompass.incubator.atrace 0.0.1-SNAPSHOT SUCCESS [  3.024 s]
05:43:28 [2020-10-14T09:43:28.627Z] [INFO] Trace Compass Incubator analyses Parent 0.0.1-SNAPSHOT SUCCESS [  0.019 s]
05:43:28 [2020-10-14T09:43:28.627Z] [INFO] org.eclipse.tracecompass.incubator.eventfieldcount.core 0.0.1-SNAPSHOT SUCCESS [  3.014 s]
05:43:28 [2020-10-14T09:43:28.627Z] [INFO] Trace Compass Incubator eventcount User Guide 0.0.1-SNAPSHOT SUCCESS [  5.371 s]
05:43:28 [2020-10-14T09:43:28.627Z] [INFO] org.eclipse.tracecompass.incubator.eventfieldcount 0.0.1-SNAPSHOT SUCCESS [  3.570 s]
05:43:28 [2020-10-14T09:43:28.627Z] [INFO] org.eclipse.tracecompass.incubator.filters.core 0.0.1-SNAPSHOT SUCCESS [  2.914 s]
05:43:28 [2020-10-14T09:43:28.627Z] [INFO] Trace Compass Incubator Filters User Guide 0.0.1-SNAPSHOT SUCCESS [  5.143 s]
05:43:28 [2020-10-14T09:43:28.627Z] [INFO] org.eclipse.tracecompass.incubator.filters.ui 0.0.1-SNAPSHOT SUCCESS [  3.015 s]
05:43:28 [2020-10-14T09:43:28.627Z] [INFO] org.eclipse.tracecompass.incubator.filters 0.0.1-SNAPSHOT SUCCESS [  2.831 s]
05:43:28 [2020-10-14T09:43:28.627Z] [INFO] org.eclipse.tracecompass.incubator.hudson.maven.core 0.0.1-SNAPSHOT SUCCESS [  2.763 s]
05:43:28 [2020-10-14T09:43:28.627Z] [INFO] org.eclipse.tracecompass.incubator.hudson.maven.ui 0.0.1-SNAPSHOT SUCCESS [  2.772 s]
05:43:28 [2020-10-14T09:43:28.627Z] [INFO] org.eclipse.tracecompass.incubator.hudson.maven 0.0.1-SNAPSHOT SUCCESS [  2.564 s]
05:43:28 [2020-10-14T09:43:28.627Z] [INFO] org.eclipse.tracecompass.incubator.kernel.core 0.0.1-SNAPSHOT SUCCESS [  3.733 s]
05:43:28 [2020-10-14T09:43:28.627Z] [INFO] Trace Compass Incubator kernel User Guide 0.0.1-SNAPSHOT SUCCESS [  5.595 s]
05:43:28 [2020-10-14T09:43:28.627Z] [INFO] org.eclipse.tracecompass.incubator.tmf.ui.multiview.ui 0.0.1-SNAPSHOT SUCCESS [  3.575 s]
05:43:28 [2020-10-14T09:43:28.627Z] [INFO] org.eclipse.tracecompass.incubator.kernel.ui 0.0.1-SNAPSHOT SUCCESS [  3.438 s]
05:43:28 [2020-10-14T09:43:28.627Z] [INFO] org.eclipse.tracecompass.incubator.kernel 0.0.1-SNAPSHOT SUCCESS [  2.787 s]
05:43:28 [2020-10-14T09:43:28.627Z] [INFO] org.eclipse.tracecompass.incubator.lttng2.ust.extras.core 0.0.1-SNAPSHOT SUCCESS [  2.906 s]
05:43:28 [2020-10-14T09:43:28.627Z] [INFO] Trace Compass Incubator LTTng2 Ust Extras User Guide 0.0.1-SNAPSHOT SUCCESS [  5.094 s]
05:43:28 [2020-10-14T09:43:28.627Z] [INFO] org.eclipse.tracecompass.incubator.lttng2.ust.extras 0.0.1-SNAPSHOT SUCCESS [  2.609 s]
05:43:28 [2020-10-14T09:43:28.627Z] [INFO] org.eclipse.tracecompass.incubator.opentracing.core 0.0.1-SNAPSHOT SUCCESS [  2.792 s]
05:43:28 [2020-10-14T09:43:28.627Z] [INFO] Trace Compass Incubator opentracing User Guide 0.0.1-SNAPSHOT SUCCESS [  5.620 s]
05:43:28 [2020-10-14T09:43:28.627Z] [INFO] org.eclipse.tracecompass.incubator.opentracing.ui 0.0.1-SNAPSHOT SUCCESS [  2.919 s]
05:43:28 [2020-10-14T09:43:28.627Z] [INFO] org.eclipse.tracecompass.incubator.opentracing 0.0.1-SNAPSHOT SUCCESS [  2.504 s]
05:43:28 [2020-10-14T09:43:28.627Z] [INFO] org.eclipse.tracecompass.incubator.perf.profiling.core 0.0.1-SNAPSHOT SUCCESS [  2.914 s]
05:43:28 [2020-10-14T09:43:28.627Z] [INFO] Trace Compass Incubator Perf Profiling User Guide 0.0.1-SNAPSHOT SUCCESS [  5.554 s]
05:43:28 [2020-10-14T09:43:28.627Z] [INFO] org.eclipse.tracecompass.incubator.perf.profiling 0.0.1-SNAPSHOT SUCCESS [  2.977 s]
05:43:28 [2020-10-14T09:43:28.627Z] [INFO] Trace Compass Incubator VM Parent 0.0.1-SNAPSHOT ... SUCCESS [  0.013 s]
05:43:28 [2020-10-14T09:43:28.627Z] [INFO] org.eclipse.tracecompass.incubator.virtual.machine.analysis.core 0.0.1-SNAPSHOT SUCCESS [  3.761 s]
05:43:28 [2020-10-14T09:43:28.627Z] [INFO] Trace Compass Incubator Virtual Machine Analysis User Guide 0.0.1-SNAPSHOT SUCCESS [  5.832 s]
05:43:28 [2020-10-14T09:43:28.627Z] [INFO] org.eclipse.tracecompass.incubator.virtual.machine.analysis.ui 0.0.1-SNAPSHOT SUCCESS [  3.496 s]
05:43:28 [2020-10-14T09:43:28.627Z] [INFO] org.eclipse.tracecompass.incubator.virtual.machine.analysis 0.0.1-SNAPSHOT SUCCESS [  3.504 s]
05:43:28 [2020-10-14T09:43:28.627Z] [INFO] org.eclipse.tracecompass.incubator.uftrace.core 0.0.1-SNAPSHOT SUCCESS [  3.618 s]
05:43:28 [2020-10-14T09:43:28.627Z] [INFO] Trace Compass Incubator uftrace User Guide 0.0.1-SNAPSHOT SUCCESS [  5.608 s]
05:43:28 [2020-10-14T09:43:28.627Z] [INFO] org.eclipse.tracecompass.incubator.uftrace 0.0.1-SNAPSHOT SUCCESS [  2.716 s]
05:43:28 [2020-10-14T09:43:28.627Z] [INFO] org.eclipse.tracecompass.incubator.tracecompass.core 0.0.1-SNAPSHOT SUCCESS [  3.021 s]
05:43:28 [2020-10-14T09:43:28.627Z] [INFO] org.eclipse.tracecompass.incubator.tracecompass 0.0.1-SNAPSHOT SUCCESS [  2.829 s]
05:43:28 [2020-10-14T09:43:28.627Z] [INFO] Trace Compass Incubator Scripting Parent 0.1.0-SNAPSHOT SUCCESS [ 22.397 s]
05:43:28 [2020-10-14T09:43:28.627Z] [INFO] org.eclipse.tracecompass.incubator.scripting.core 0.1.0-SNAPSHOT SUCCESS [  5.875 s]
05:43:28 [2020-10-14T09:43:28.627Z] [INFO] Trace Compass Incubator Scripting User Guide 0.1.0-SNAPSHOT SUCCESS [  5.715 s]
05:43:28 [2020-10-14T09:43:28.627Z] [INFO] org.eclipse.tracecompass.incubator.scripting.ui 0.1.0-SNAPSHOT SUCCESS [  5.572 s]
05:43:28 [2020-10-14T09:43:28.627Z] [INFO] org.eclipse.tracecompass.incubator.scripting 0.1.0-SNAPSHOT SUCCESS [  2.493 s]
05:43:28 [2020-10-14T09:43:28.627Z] [INFO] org.eclipse.tracecompass.incubator.scripting.javascript 0.1.0-SNAPSHOT SUCCESS [  2.356 s]
05:43:28 [2020-10-14T09:43:28.627Z] [INFO] org.eclipse.tracecompass.incubator.scripting.python 0.1.0-SNAPSHOT SUCCESS [  2.383 s]
05:43:28 [2020-10-14T09:43:28.627Z] [INFO] Trace Compass Incubator Repository 0.0.1-SNAPSHOT .. SUCCESS [  6.642 s]
05:43:28 [2020-10-14T09:43:28.627Z] [INFO] org.eclipse.tracecompass.incubator.xaf.core 0.0.1-SNAPSHOT SUCCESS [  3.058 s]
05:43:28 [2020-10-14T09:43:28.627Z] [INFO] org.eclipse.tracecompass.incubator.xaf.ui 1.0.0-SNAPSHOT SUCCESS [  3.883 s]
05:43:28 [2020-10-14T09:43:28.627Z] [INFO] org.eclipse.tracecompass.incubator.lttng2.ust.extras.core.tests 0.0.1-SNAPSHOT FAILURE [  6.416 s]
05:43:28 [2020-10-14T09:43:28.627Z] [INFO] org.eclipse.tracecompass.incubator.kernel.core.tests 0.0.1-SNAPSHOT SKIPPED
05:43:28 [2020-10-14T09:43:28.627Z] [INFO] org.eclipse.tracecompass.incubator.eventfieldcount.core.tests 0.0.1-SNAPSHOT SKIPPED
05:43:28 [2020-10-14T09:43:28.627Z] [INFO] org.eclipse.tracecompass.incubator.filters.core.tests 0.0.1-SNAPSHOT SKIPPED
05:43:28 [2020-10-14T09:43:28.627Z] [INFO] org.eclipse.tracecompass.incubator.tmf.ui.multiview 0.0.1-SNAPSHOT SKIPPED
05:43:28 [2020-10-14T09:43:28.627Z] [INFO] org.eclipse.tracecompass.incubator.analysis.core.tests 0.0.1-SNAPSHOT SKIPPED
05:43:28 [2020-10-14T09:43:28.627Z] [INFO] org.eclipse.tracecompass.incubator.callstack.core.tests 0.0.1-SNAPSHOT SKIPPED
05:43:28 [2020-10-14T09:43:28.627Z] [INFO] org.eclipse.tracecompass.incubator.callstack.ui.swtbot.tests 0.0.1-SNAPSHOT SKIPPED
05:43:28 [2020-10-14T09:43:28.627Z] [INFO] org.eclipse.tracecompass.incubator.virtual.machine.analysis.core.tests 0.0.1-SNAPSHOT SKIPPED
05:43:28 [2020-10-14T09:43:28.627Z] [INFO] org.eclipse.tracecompass.incubator.virtual.machine.analysis.ui.swtbot.tests 0.0.1-SNAPSHOT SKIPPED
05:43:28 [2020-10-14T09:43:28.627Z] [INFO] org.eclipse.tracecompass.incubator.scripting.core.tests 0.1.0-SNAPSHOT SKIPPED
05:43:28 [2020-10-14T09:43:28.627Z] [INFO] Trace Compass Incubator Scripting UI Tests Plug-in 0.1.0-SNAPSHOT SKIPPED
05:43:28 [2020-10-14T09:43:28.627Z] [INFO] org.eclipse.tracecompass.incubator.traceevent.core.tests 0.0.1-SNAPSHOT SKIPPED
05:43:28 [2020-10-14T09:43:28.627Z] [INFO] org.eclipse.tracecompass.incubator.hudson.maven.core.tests 0.0.1-SNAPSHOT SKIPPED
05:43:28 [2020-10-14T09:43:28.627Z] [INFO] org.eclipse.tracecompass.incubator.opentracing.core.tests 0.0.1-SNAPSHOT SKIPPED
05:43:28 [2020-10-14T09:43:28.627Z] [INFO] org.eclipse.tracecompass.incubator.perf.profiling.core.tests 0.0.1-SNAPSHOT SKIPPED
05:43:28 [2020-10-14T09:43:28.627Z] [INFO] org.eclipse.tracecompass.incubator.uftrace.core.tests 0.0.1-SNAPSHOT SKIPPED
05:43:28 [2020-10-14T09:43:28.627Z] [INFO] org.eclipse.tracecompass.incubator.tracecompass.core.tests 0.0.1-SNAPSHOT SKIPPED
05:43:28 [2020-10-14T09:43:28.627Z] [INFO] org.eclipse.tracecompass.incubator.ftrace.core.tests 0.0.1-SNAPSHOT SKIPPED
05:43:28 [2020-10-14T09:43:28.627Z] [INFO] org.eclipse.tracecompass.incubator.atrace.core.tests 0.0.1-SNAPSHOT SKIPPED
05:43:28 [2020-10-14T09:43:28.627Z] [INFO] org.eclipse.tracecompass.incubator.ros.core 0.0.1-SNAPSHOT SKIPPED
05:43:28 [2020-10-14T09:43:28.627Z] [INFO] Trace Compass Incubator ROS User Guide 0.0.1-SNAPSHOT SKIPPED
05:43:28 [2020-10-14T09:43:28.627Z] [INFO] org.eclipse.tracecompass.incubator.ros.ui 0.0.1-SNAPSHOT SKIPPED
05:43:28 [2020-10-14T09:43:28.627Z] [INFO] org.eclipse.tracecompass.incubator.ros 0.0.1-SNAPSHOT SKIPPED
05:43:28 [2020-10-14T09:43:28.627Z] [INFO] org.eclipse.tracecompass.incubator.ros.core.tests 0.0.1-SNAPSHOT SKIPPED
05:43:28 [2020-10-14T09:43:28.627Z] [INFO] Trace Compass Incubator Trace Server Parent 0.0.1-SNAPSHOT SKIPPED
05:43:28 [2020-10-14T09:43:28.627Z] [INFO] org.eclipse.tracecompass.incubator.trace.server.jersey.rest.core 0.0.1-SNAPSHOT SKIPPED
05:43:28 [2020-10-14T09:43:28.627Z] [INFO] org.eclipse.tracecompass.incubator.trace.server.jersey.rest 0.0.1-SNAPSHOT SKIPPED
05:43:28 [2020-10-14T09:43:28.627Z] [INFO] org.eclipse.tracecompass.incubator.trace.server.jersey.rest.core.tests 0.0.1-SNAPSHOT SKIPPED
05:43:28 [2020-10-14T09:43:28.627Z] [INFO] Trace Compass Server Product 0.0.1-SNAPSHOT ........ SKIPPED
05:43:28 [2020-10-14T09:43:28.627Z] [INFO] Trace Compass Incubator Trace Server Developer Guide 0.0.1-SNAPSHOT SKIPPED
05:43:28 [2020-10-14T09:43:28.627Z] [INFO] Trace Compass Incubator RCP Parent 0.0.1-SNAPSHOT .. SKIPPED
05:43:28 [2020-10-14T09:43:28.627Z] [INFO] Trace Compass Incubator RCP Feature 0.0.1-SNAPSHOT . SKIPPED
05:43:28 [2020-10-14T09:43:28.627Z] [INFO] Trace Compass RCP Branding plug-in 0.0.1-SNAPSHOT .. SKIPPED
05:43:28 [2020-10-14T09:43:28.627Z] [INFO] Trace Compass RCP Branding Feature 0.0.1-SNAPSHOT .. SKIPPED
05:43:28 [2020-10-14T09:43:28.627Z] [INFO] Trace Compass Incubator RCP Product 0.0.1-SNAPSHOT . SKIPPED
05:43:28 [2020-10-14T09:43:28.627Z] [INFO] ------------------------------------------------------------------------
05:43:28 [2020-10-14T09:43:28.627Z] [INFO] BUILD FAILURE
05:43:28 [2020-10-14T09:43:28.627Z] [INFO] ------------------------------------------------------------------------
05:43:28 [2020-10-14T09:43:28.627Z] [INFO] Total time:  12:57 min
05:43:28 [2020-10-14T09:43:28.627Z] [INFO] Finished at: 2020-10-14T09:43:28Z
05:43:28 [2020-10-14T09:43:28.627Z] [INFO] ------------------------------------------------------------------------
05:43:28 [2020-10-14T09:43:28.627Z] [WARNING] The requested profile "build-rcp" could not be activated because it does not exist.
05:43:28 [2020-10-14T09:43:28.627Z] [ERROR] Failed to execute goal org.eclipse.tycho:tycho-surefire-plugin:1.3.0:test (default-test) on project org.eclipse.tracecompass.incubator.lttng2.ust.extras.core.tests: An unexpected error occured while launching the test runtime (return code 13). See log /home/jenkins/agent/workspace/tracecompass-incubator-stable/analyses/org.eclipse.tracecompass.incubator.lttng2.ust.extras.core.tests/target/work/data/.metadata/.log for details. -> [Help 1]
05:43:28 [2020-10-14T09:43:28.628Z] [ERROR] 
05:43:28 [2020-10-14T09:43:28.628Z] [ERROR] To see the full stack trace of the errors, re-run Maven with the -e switch.
05:43:28 [2020-10-14T09:43:28.628Z] [ERROR] Re-run Maven using the -X switch to enable full debug logging.
05:43:28 [2020-10-14T09:43:28.628Z] [ERROR] 
05:43:28 [2020-10-14T09:43:28.628Z] [ERROR] For more information about the errors and possible solutions, please read the following articles:
05:43:28 [2020-10-14T09:43:28.628Z] [ERROR] [Help 1] http://cwiki.apache.org/confluence/display/MAVEN/MojoFailureException
05:43:28 [2020-10-14T09:43:28.628Z] [ERROR] 
05:43:28 [2020-10-14T09:43:28.628Z] [ERROR] After correcting the problems, you can resume the build with the command
05:43:28 [2020-10-14T09:43:28.628Z] [ERROR]   mvn <args> -rf :org.eclipse.tracecompass.incubator.lttng2.ust.extras.core.tests
05:43:29 [2020-10-14T09:43:29.998Z] [Pipeline] }
05:43:30 [2020-10-14T09:43:30.010Z] [Pipeline] // container
05:43:30 [2020-10-14T09:43:30.018Z] Post stage
05:43:30 [2020-10-14T09:43:30.022Z] [Pipeline] container
05:43:30 [2020-10-14T09:43:30.023Z] [Pipeline] {
05:43:30 [2020-10-14T09:43:30.033Z] [Pipeline] sh
05:43:32 [2020-10-14T09:43:32.419Z] + echo */*tests/screenshots/*.jpeg,*/*tests/target/work/data/.metadata/.log
05:43:32 [2020-10-14T09:43:32.421Z] */*tests/screenshots/*.jpeg,*/*tests/target/work/data/.metadata/.log
05:43:32 [2020-10-14T09:43:32.427Z] [Pipeline] junit
05:43:32 [2020-10-14T09:43:32.432Z] Recording test results
05:43:33 [2020-10-14T09:43:33.212Z] No test report files were found. Configuration error?
05:43:33 [2020-10-14T09:43:33.213Z] [Pipeline] }
05:43:33 [2020-10-14T09:43:33.286Z] [Pipeline] // container
05:43:33 [2020-10-14T09:43:33.294Z] Error when executing always post condition:
05:43:33 [2020-10-14T09:43:33.294Z] hudson.AbortException: No test report files were found. Configuration error?
05:43:33 [2020-10-14T09:43:33.294Z] 	at hudson.tasks.junit.JUnitParser$ParseResultCallable.invoke(JUnitParser.java:154)
05:43:33 [2020-10-14T09:43:33.294Z] 	at hudson.tasks.junit.JUnitParser$ParseResultCallable.invoke(JUnitParser.java:118)
05:43:33 [2020-10-14T09:43:33.294Z] 	at hudson.FilePath$FileCallableWrapper.call(FilePath.java:3069)
05:43:33 [2020-10-14T09:43:33.294Z] 	at hudson.remoting.UserRequest.perform(UserRequest.java:211)
05:43:33 [2020-10-14T09:43:33.294Z] 	at hudson.remoting.UserRequest.perform(UserRequest.java:54)
05:43:33 [2020-10-14T09:43:33.294Z] 	at hudson.remoting.Request$2.run(Request.java:375)
05:43:33 [2020-10-14T09:43:33.294Z] 	at hudson.remoting.InterceptingExecutorService$1.call(InterceptingExecutorService.java:73)
05:43:33 [2020-10-14T09:43:33.294Z] 	at java.util.concurrent.FutureTask.run(Unknown Source)
05:43:33 [2020-10-14T09:43:33.294Z] 	at java.util.concurrent.ThreadPoolExecutor.runWorker(Unknown Source)
05:43:33 [2020-10-14T09:43:33.294Z] 	at java.util.concurrent.ThreadPoolExecutor$Worker.run(Unknown Source)
05:43:33 [2020-10-14T09:43:33.294Z] 	at hudson.remoting.Engine$1.lambda$newThread$0(Engine.java:118)
05:43:33 [2020-10-14T09:43:33.294Z] 	at hudson.remoting.Engine$1$$Lambda$4/000000000001FF10.run(Unknown Source)
05:43:33 [2020-10-14T09:43:33.294Z] 	at java.lang.Thread.run(Unknown Source)
05:43:33 [2020-10-14T09:43:33.294Z] 	Suppressed: hudson.remoting.Channel$CallSiteStackTrace: Remote call to JNLP4-connect connection from 10.129.10.1/10.129.10.1:60134
05:43:33 [2020-10-14T09:43:33.294Z] 		at hudson.remoting.Channel.attachCallSiteStackTrace(Channel.java:1788)
05:43:33 [2020-10-14T09:43:33.294Z] 		at hudson.remoting.UserRequest$ExceptionResponse.retrieve(UserRequest.java:356)
05:43:33 [2020-10-14T09:43:33.294Z] 		at hudson.remoting.Channel.call(Channel.java:998)
05:43:33 [2020-10-14T09:43:33.294Z] 		at hudson.FilePath.act(FilePath.java:1069)
05:43:33 [2020-10-14T09:43:33.294Z] 		at hudson.FilePath.act(FilePath.java:1058)
05:43:33 [2020-10-14T09:43:33.294Z] 		at hudson.tasks.junit.JUnitParser.parseResult(JUnitParser.java:114)
05:43:33 [2020-10-14T09:43:33.294Z] 		at hudson.tasks.junit.JUnitResultArchiver.parse(JUnitResultArchiver.java:137)
05:43:33 [2020-10-14T09:43:33.294Z] 		at hudson.tasks.junit.JUnitResultArchiver.parseAndAttach(JUnitResultArchiver.java:167)
05:43:33 [2020-10-14T09:43:33.294Z] 		at hudson.tasks.junit.pipeline.JUnitResultsStepExecution.run(JUnitResultsStepExecution.java:52)
05:43:33 [2020-10-14T09:43:33.294Z] 		at hudson.tasks.junit.pipeline.JUnitResultsStepExecution.run(JUnitResultsStepExecution.java:25)
05:43:33 [2020-10-14T09:43:33.294Z] 		at org.jenkinsci.plugins.workflow.steps.SynchronousNonBlockingStepExecution.lambda$start$0(SynchronousNonBlockingStepExecution.java:47)
05:43:33 [2020-10-14T09:43:33.294Z] 		at org.jenkinsci.plugins.workflow.steps.SynchronousNonBlockingStepExecution$$Lambda$406/00000000B0034670.run(Unknown Source)
05:43:33 [2020-10-14T09:43:33.294Z] 		at java.util.concurrent.Executors$RunnableAdapter.call(Unknown Source)
05:43:33 [2020-10-14T09:43:33.294Z] 		at java.util.concurrent.FutureTask.run(Unknown Source)
05:43:33 [2020-10-14T09:43:33.294Z] 		at java.util.concurrent.ThreadPoolExecutor.runWorker(Unknown Source)
05:43:33 [2020-10-14T09:43:33.294Z] 		at java.util.concurrent.ThreadPoolExecutor$Worker.run(Unknown Source)
05:43:33 [2020-10-14T09:43:33.294Z] 		... 1 more
05:43:33 [2020-10-14T09:43:33.294Z] 
05:43:33 [2020-10-14T09:43:33.298Z] [Pipeline] }
05:43:33 [2020-10-14T09:43:33.305Z] [Pipeline] // withEnv
05:43:33 [2020-10-14T09:43:33.313Z] [Pipeline] }
05:43:33 [2020-10-14T09:43:33.320Z] [Pipeline] // stage
05:43:33 [2020-10-14T09:43:33.330Z] [Pipeline] stage
05:43:33 [2020-10-14T09:43:33.332Z] [Pipeline] { (Deploy Site)
05:43:33 [2020-10-14T09:43:33.340Z] Stage "Deploy Site" skipped due to earlier failure(s)
05:43:33 [2020-10-14T09:43:33.340Z] [Pipeline] }
05:43:33 [2020-10-14T09:43:33.348Z] [Pipeline] // stage
05:43:33 [2020-10-14T09:43:33.356Z] [Pipeline] stage
05:43:33 [2020-10-14T09:43:33.357Z] [Pipeline] { (Deploy RCP)
05:43:33 [2020-10-14T09:43:33.364Z] Stage "Deploy RCP" skipped due to earlier failure(s)
05:43:33 [2020-10-14T09:43:33.364Z] [Pipeline] }
05:43:33 [2020-10-14T09:43:33.371Z] [Pipeline] // stage
05:43:33 [2020-10-14T09:43:33.379Z] [Pipeline] stage
05:43:33 [2020-10-14T09:43:33.380Z] [Pipeline] { (Deploy Server)
05:43:33 [2020-10-14T09:43:33.388Z] Stage "Deploy Server" skipped due to earlier failure(s)
05:43:33 [2020-10-14T09:43:33.389Z] [Pipeline] }
05:43:33 [2020-10-14T09:43:33.395Z] [Pipeline] // stage
05:43:33 [2020-10-14T09:43:33.405Z] [Pipeline] stage
05:43:33 [2020-10-14T09:43:33.407Z] [Pipeline] { (Deploy Doc)
05:43:33 [2020-10-14T09:43:33.413Z] Stage "Deploy Doc" skipped due to earlier failure(s)
05:43:33 [2020-10-14T09:43:33.414Z] [Pipeline] }
05:43:33 [2020-10-14T09:43:33.421Z] [Pipeline] // stage
05:43:33 [2020-10-14T09:43:33.430Z] [Pipeline] stage
05:43:33 [2020-10-14T09:43:33.432Z] [Pipeline] { (Javadoc)
05:43:33 [2020-10-14T09:43:33.439Z] Stage "Javadoc" skipped due to earlier failure(s)
05:43:33 [2020-10-14T09:43:33.440Z] [Pipeline] }
05:43:33 [2020-10-14T09:43:33.449Z] [Pipeline] // stage
05:43:33 [2020-10-14T09:43:33.457Z] [Pipeline] stage
05:43:33 [2020-10-14T09:43:33.459Z] [Pipeline] { (Deploy Javadoc)
05:43:33 [2020-10-14T09:43:33.465Z] Stage "Deploy Javadoc" skipped due to earlier failure(s)
05:43:33 [2020-10-14T09:43:33.466Z] [Pipeline] }
05:43:33 [2020-10-14T09:43:33.472Z] [Pipeline] // stage
05:43:33 [2020-10-14T09:43:33.480Z] [Pipeline] stage
05:43:33 [2020-10-14T09:43:33.481Z] [Pipeline] { (Declarative: Post Actions)
05:43:33 [2020-10-14T09:43:33.493Z] [Pipeline] container
05:43:33 [2020-10-14T09:43:33.494Z] [Pipeline] {
05:43:33 [2020-10-14T09:43:33.503Z] [Pipeline] emailext
05:43:38 [2020-10-14T09:43:38.600Z] Not sending mail to unregistered user patrick.tasse@gmail.com because your SCM claimed this was associated with a user ID ‘patrick tasse' which your security realm does not recognize; you may need changes in your SCM plugin
05:43:38 [2020-10-14T09:43:38.664Z] Not sending mail to unregistered user bernd.hufmann@ericsson.com because your SCM claimed this was associated with a user ID ‘bernd hufmann' which your security realm does not recognize; you may need changes in your SCM plugin
05:43:38 [2020-10-14T09:43:38.730Z] Not sending mail to unregistered user gbastien+lttng@versatic.net because your SCM claimed this was associated with a user ID ‘genevieve bastien' which your security realm does not recognize; you may need changes in your SCM plugin
05:43:38 [2020-10-14T09:43:38.731Z] Sending email to: bernd.hufmann@ericsson.com patrick.tasse@gmail.com matthew.khouzam@ericsson.com gbastien@versatic.net
05:43:38 [2020-10-14T09:43:38.792Z] [Pipeline] }
05:43:38 [2020-10-14T09:43:38.800Z] [Pipeline] // container
05:43:38 [2020-10-14T09:43:38.808Z] [Pipeline] }
05:43:38 [2020-10-14T09:43:38.815Z] [Pipeline] // stage
05:43:38 [2020-10-14T09:43:38.824Z] [Pipeline] }
05:43:38 [2020-10-14T09:43:38.831Z] [Pipeline] // withEnv
05:43:38 [2020-10-14T09:43:38.839Z] [Pipeline] }
05:43:38 [2020-10-14T09:43:38.846Z] [Pipeline] // timeout
05:43:38 [2020-10-14T09:43:38.854Z] [Pipeline] }
05:43:38 [2020-10-14T09:43:38.860Z] [Pipeline] // timestamps
05:43:38 [2020-10-14T09:43:38.867Z] [Pipeline] }
05:43:38 [2020-10-14T09:43:38.874Z] [Pipeline] // withEnv
05:43:38 [2020-10-14T09:43:38.881Z] [Pipeline] }
05:43:38 [2020-10-14T09:43:38.888Z] [Pipeline] // container
05:43:38 [2020-10-14T09:43:38.896Z] [Pipeline] }
05:43:38 [2020-10-14T09:43:38.904Z] [Pipeline] // withEnv
05:43:38 [2020-10-14T09:43:38.912Z] [Pipeline] }
05:43:38 [2020-10-14T09:43:38.921Z] [Pipeline] // node
05:43:38 [2020-10-14T09:43:38.928Z] [Pipeline] }
05:43:38 [2020-10-14T09:43:38.936Z] [Pipeline] // podTemplate
05:43:38 [2020-10-14T09:43:38.945Z] [Pipeline] End of Pipeline
05:43:38 [2020-10-14T09:43:38.978Z] ERROR: script returned exit code 1
05:43:38 [2020-10-14T09:43:38.978Z] Finished: FAILURE