AbortedConsole Output

Skipping 1,937 KB.. Full Log
e 'Map<@NonNull Integer,Collection<@NonNull String>>' needs unchecked conversion to conform to '@NonNull Object'
12:47:17 [2019-12-21T17:47:17.132Z] [WARNING] /home/jenkins/agent/workspace/tracecompass-gerrit/tmf/org.eclipse.tracecompass.tmf.ui/src/org/eclipse/tracecompass/tmf/ui/viewers/xycharts/linecharts/TmfFilteredXYChartViewer.java:[141] 
12:47:17 [2019-12-21T17:47:17.132Z] 	return DataProviderManager.getInstance().getDataProvider(trace, fId, ITmfTreeXYDataProvider.class);
12:47:17 [2019-12-21T17:47:17.132Z] 	       ^^^^^^^^^^^^^^^^^^^^^^^^^^^^^^^^^^^^^^^^^^^^^^^^^^^^^^^^^^^^^^^^^^^^^^^^^^^^^^^^^^^^^^^^^^^
12:47:17 [2019-12-21T17:47:17.132Z] Type safety: Unchecked invocation getDataProvider(ITmfTrace, String, Class<ITmfTreeXYDataProvider>) of the generic method getDataProvider(ITmfTrace, String, Class<T>) of type DataProviderManager
12:47:17 [2019-12-21T17:47:17.132Z] [WARNING] /home/jenkins/agent/workspace/tracecompass-gerrit/tmf/org.eclipse.tracecompass.tmf.ui/src/org/eclipse/tracecompass/tmf/ui/project/model/TmfViewerSorter.java:[15] 
12:47:17 [2019-12-21T17:47:17.132Z] 	import org.eclipse.jface.viewers.ViewerSorter;
12:47:17 [2019-12-21T17:47:17.132Z] 	       ^^^^^^^^^^^^^^^^^^^^^^^^^^^^^^^^^^^^^^
12:47:17 [2019-12-21T17:47:17.132Z] The type ViewerSorter is deprecated
12:47:17 [2019-12-21T17:47:17.132Z] [WARNING] /home/jenkins/agent/workspace/tracecompass-gerrit/tmf/org.eclipse.tracecompass.tmf.ui/src/org/eclipse/tracecompass/tmf/ui/project/model/TmfViewerSorter.java:[21] 
12:47:17 [2019-12-21T17:47:17.132Z] 	public class TmfViewerSorter extends ViewerSorter {
12:47:17 [2019-12-21T17:47:17.132Z] 	                                     ^^^^^^^^^^^^
12:47:17 [2019-12-21T17:47:17.132Z] The type ViewerSorter is deprecated
12:47:17 [2019-12-21T17:47:17.132Z] [WARNING] /home/jenkins/agent/workspace/tracecompass-gerrit/tmf/org.eclipse.tracecompass.tmf.ui/src/org/eclipse/tracecompass/tmf/ui/views/uml2sd/NGC.java:[845] 
12:47:17 [2019-12-21T17:47:17.132Z] 	int width = fContext.getFontMetrics().getAverageCharWidth();
12:47:17 [2019-12-21T17:47:17.132Z] 	                                      ^^^^^^^^^^^^^^^^^^^^^
12:47:17 [2019-12-21T17:47:17.132Z] The method getAverageCharWidth() from the type FontMetrics is deprecated
12:47:17 [2019-12-21T17:47:17.132Z] [WARNING] /home/jenkins/agent/workspace/tracecompass-gerrit/tmf/org.eclipse.tracecompass.tmf.ui/src/org/eclipse/tracecompass/internal/tmf/ui/project/handlers/OpenExperimentHandler.java:[95] 
12:47:17 [2019-12-21T17:47:17.132Z] 	TmfOpenTraceHelper.openTraceFromElement(fExperiment);
12:47:17 [2019-12-21T17:47:17.132Z] 	                   ^^^^^^^^^^^^^^^^^^^^^^^^^^^^^^^^^
12:47:17 [2019-12-21T17:47:17.132Z] The method openTraceFromElement(TmfCommonProjectElement) from the type TmfOpenTraceHelper is deprecated
12:47:17 [2019-12-21T17:47:17.132Z] [WARNING] /home/jenkins/agent/workspace/tracecompass-gerrit/tmf/org.eclipse.tracecompass.tmf.ui/src/org/eclipse/tracecompass/internal/tmf/ui/project/handlers/TrimTraceHandler.java:[170] 
12:47:17 [2019-12-21T17:47:17.132Z] 	return traceElement.getSupplementaryResources();
12:47:17 [2019-12-21T17:47:17.132Z] 	       ^^^^^^^^^^^^^^^^^^^^^^^^^^^^^^^^^^^^^^^^
12:47:17 [2019-12-21T17:47:17.132Z] Null type safety (type annotations): The expression of type 'IResource[]' needs unchecked conversion to conform to 'IResource @NonNull[]'
12:47:17 [2019-12-21T17:47:17.132Z] [WARNING] /home/jenkins/agent/workspace/tracecompass-gerrit/tmf/org.eclipse.tracecompass.tmf.ui/src/org/eclipse/tracecompass/internal/tmf/ui/project/handlers/TrimTraceHandler.java:[193] 
12:47:17 [2019-12-21T17:47:17.132Z] 	TraceToTrim create = TraceToTrim.create(this, childElement);
12:47:17 [2019-12-21T17:47:17.132Z] 	                                              ^^^^^^^^^^^^
12:47:17 [2019-12-21T17:47:17.132Z] Null type safety (type annotations): The expression of type 'TmfTraceElement' needs unchecked conversion to conform to '@NonNull TmfTraceElement'
12:47:17 [2019-12-21T17:47:17.132Z] [WARNING] /home/jenkins/agent/workspace/tracecompass-gerrit/tmf/org.eclipse.tracecompass.tmf.ui/src/org/eclipse/tracecompass/internal/tmf/ui/project/handlers/TrimTraceHandler.java:[354] 
12:47:17 [2019-12-21T17:47:17.132Z] 	TmfOpenTraceHelper.openTraceFromElement((TmfCommonProjectElement) fDestElement);
12:47:17 [2019-12-21T17:47:17.132Z] 	                   ^^^^^^^^^^^^^^^^^^^^^^^^^^^^^^^^^^^^^^^^^^^^^^^^^^^^^^^^^^^^
12:47:17 [2019-12-21T17:47:17.132Z] The method openTraceFromElement(TmfCommonProjectElement) from the type TmfOpenTraceHelper is deprecated
12:47:17 [2019-12-21T17:47:17.132Z] [WARNING] /home/jenkins/agent/workspace/tracecompass-gerrit/tmf/org.eclipse.tracecompass.tmf.ui/src/org/eclipse/tracecompass/tmf/ui/views/uml2sd/DiagramToolTip.java:[108] 
12:47:17 [2019-12-21T17:47:17.132Z] 	int width = CHARACTERS_PER_COLUMN * fm.getAverageCharWidth();
12:47:17 [2019-12-21T17:47:17.132Z] 	                                       ^^^^^^^^^^^^^^^^^^^^^
12:47:17 [2019-12-21T17:47:17.132Z] The method getAverageCharWidth() from the type FontMetrics is deprecated
12:47:17 [2019-12-21T17:47:17.133Z] [WARNING] /home/jenkins/agent/workspace/tracecompass-gerrit/tmf/org.eclipse.tracecompass.tmf.ui/src/org/eclipse/tracecompass/tmf/ui/widgets/timegraph/widgets/TimeGraphControl.java:[2859] 
12:47:17 [2019-12-21T17:47:17.133Z] 	elementStyle = provider.getElementStyle(event);
12:47:17 [2019-12-21T17:47:17.133Z] 	                                        ^^^^^
12:47:17 [2019-12-21T17:47:17.133Z] Null type safety (type annotations): The expression of type 'ITimeEvent' needs unchecked conversion to conform to '@NonNull ITimeEvent'
12:47:17 [2019-12-21T17:47:17.133Z] [WARNING] /home/jenkins/agent/workspace/tracecompass-gerrit/tmf/org.eclipse.tracecompass.tmf.ui/src/org/eclipse/tracecompass/tmf/ui/project/wizards/SelectTracesWizardPage.java:[134] 
12:47:17 [2019-12-21T17:47:17.133Z] 	new FilteredTree(container, SWT.MULTI | SWT.H_SCROLL | SWT.V_SCROLL | SWT.BORDER, new PatternFilter(), true) {
12:47:17 [2019-12-21T17:47:17.133Z]             @Override
12:47:17 [2019-12-21T17:47:17.133Z]             protected TreeViewer doCreateTreeViewer(Composite aparent, int style) {
12:47:17 [2019-12-21T17:47:17.133Z]                 return SelectTracesWizardPage.this.doCreateTreeViewer(aparent);
12:47:17 [2019-12-21T17:47:17.133Z]             }
12:47:17 [2019-12-21T17:47:17.133Z]         };
12:47:17 [2019-12-21T17:47:17.133Z] 	    ^^^^^^^^^^^^^^^^^^^^^^^^^^^^^^^^^^^^^^^^^^^^^^^^^^^^^^^^^^^^^^^^^^^^^^^^^^^^^^^^^^^^^^^^^^^^^^^^^^^^^^^^^^^^^^^^^^^^^^^^^^^^^^^^^^^^^^^^^^^^^^^^^^^^^^^^^^^^^^^^^^^^^^^^^^^^^^^^^^^^^^^^^^^^^^^^^^^^^^^^^^^^^^^^^^^^^^^^^^^^^^^^^^^^^^^^^^^^^^^^^^^^^^^^^^^^^^^^^^^^^^^^^^^^^^^^^^^^^^^^^^^^^^^^^^^^^^^^^^^^^^^^^^^^^^^^^^^^
12:47:17 [2019-12-21T17:47:17.133Z] The constructor FilteredTree(Composite, int, PatternFilter, boolean) is deprecated
12:47:17 [2019-12-21T17:47:17.133Z] [WARNING] /home/jenkins/agent/workspace/tracecompass-gerrit/tmf/org.eclipse.tracecompass.tmf.ui/src/org/eclipse/tracecompass/tmf/ui/project/wizards/SelectTracesWizardPage.java:[134] 
12:47:17 [2019-12-21T17:47:17.133Z] 	new FilteredTree(container, SWT.MULTI | SWT.H_SCROLL | SWT.V_SCROLL | SWT.BORDER, new PatternFilter(), true) {
12:47:17 [2019-12-21T17:47:17.133Z] 	    ^^^^^^^^^^^^^^^^^^^^^^^^^^^^^^^^^^^^^^^^^^^^^^^^^^^^^^^^^^^^^^^^^^^^^^^^^^^^^^^^^^^^^^^^^^^^^^^^^^^^^^^^
12:47:17 [2019-12-21T17:47:17.133Z] The constructor FilteredTree(Composite, int, PatternFilter, boolean) is deprecated
12:47:17 [2019-12-21T17:47:17.133Z] [WARNING] /home/jenkins/agent/workspace/tracecompass-gerrit/tmf/org.eclipse.tracecompass.tmf.ui/src/org/eclipse/tracecompass/tmf/ui/views/uml2sd/SDWidget.java:[539] 
12:47:17 [2019-12-21T17:47:17.133Z] 	Object serviceObject = fSite.getSite().getWorkbenchWindow().getService(IContextService.class);
12:47:17 [2019-12-21T17:47:17.133Z] 	                       ^^^^^^^^^^^^^^^^^^^^^^^^^^^^^^^^^^^^^^^^^^^^^^^^^^^^^^^^^^^^^^^^^^^^^^
12:47:17 [2019-12-21T17:47:17.133Z] Unsafe interpretation of method return type as '@NonNull' based on substitution 'T=@NonNull IContextService'. Declaring type 'IServiceLocator' doesn't seem to be designed with null type annotations in mind
12:47:17 [2019-12-21T17:47:17.133Z] [WARNING] /home/jenkins/agent/workspace/tracecompass-gerrit/tmf/org.eclipse.tracecompass.tmf.ui/src/org/eclipse/tracecompass/internal/tmf/ui/project/handlers/OpenTraceHandler.java:[100] 
12:47:17 [2019-12-21T17:47:17.133Z] 	TmfOpenTraceHelper.openTraceFromElement(fTrace.getElementUnderTraceFolder());
12:47:17 [2019-12-21T17:47:17.133Z] 	                   ^^^^^^^^^^^^^^^^^^^^^^^^^^^^^^^^^^^^^^^^^^^^^^^^^^^^^^^^^
12:47:17 [2019-12-21T17:47:17.133Z] The method openTraceFromElement(TmfCommonProjectElement) from the type TmfOpenTraceHelper is deprecated
12:47:17 [2019-12-21T17:47:17.133Z] [WARNING] /home/jenkins/agent/workspace/tracecompass-gerrit/tmf/org.eclipse.tracecompass.tmf.ui/src/org/eclipse/tracecompass/internal/tmf/ui/project/dialogs/offset/OffsetDialog.java:[307] 
12:47:17 [2019-12-21T17:47:17.133Z] 	fViewer = new FilteredTree(parent, SWT.MULTI | SWT.H_SCROLL
12:47:17 [2019-12-21T17:47:17.133Z]                 | SWT.V_SCROLL | SWT.FULL_SELECTION | SWT.BORDER, new PatternFilter() {
12:47:17 [2019-12-21T17:47:17.133Z]                     @Override
12:47:17 [2019-12-21T17:47:17.133Z]                     protected boolean isLeafMatch(Viewer viewer, Object element) {
12:47:17 [2019-12-21T17:47:17.133Z]                         return wordMatches(((TmfTraceElement) element).getElementPath());
12:47:17 [2019-12-21T17:47:17.133Z]                     }
12:47:17 [2019-12-21T17:47:17.133Z]                 }, true);
12:47:17 [2019-12-21T17:47:17.133Z] 	              ^^^^^^^^^^^^^^^^^^^^^^^^^^^^^^^^^^^^^^^^^^^^^^^^^^^^^^^^^^^^^^^^^^^^^^^^^^^^^^^^^^^^^^^^^^^^^^^^^^^^^^^^^^^^^^^^^^^^^^^^^^^^^^^^^^^^^^^^^^^^^^^^^^^^^^^^^^^^^^^^^^^^^^^^^^^^^^^^^^^^^^^^^^^^^^^^^^^^^^^^^^^^^^^^^^^^^^^^^^^^^^^^^^^^^^^^^^^^^^^^^^^^^^^^^^^^^^^^^^^^^^^^^^^^^^^^^^^^^^^^^^^^^^^^^^^^^^^^^^^^^^^^^^^^^^^^^^^^^^^^^^^^^^^^^^^^^^^^^^^^^^^^^^^^^^^^^^^^^^^^^^^^^^^^^^^^^^^^^^^^^^^
12:47:17 [2019-12-21T17:47:17.133Z] The constructor FilteredTree(Composite, int, PatternFilter, boolean) is deprecated
12:47:17 [2019-12-21T17:47:17.133Z] [WARNING] /home/jenkins/agent/workspace/tracecompass-gerrit/tmf/org.eclipse.tracecompass.tmf.ui/src/org/eclipse/tracecompass/internal/tmf/ui/project/dialogs/offset/OffsetDialog.java:[459] 
12:47:17 [2019-12-21T17:47:17.133Z] 	TmfOpenTraceHelper.openTraceFromElement(traceElement);
12:47:17 [2019-12-21T17:47:17.133Z] 	                   ^^^^^^^^^^^^^^^^^^^^^^^^^^^^^^^^^^
12:47:17 [2019-12-21T17:47:17.133Z] The method openTraceFromElement(TmfCommonProjectElement) from the type TmfOpenTraceHelper is deprecated
12:47:17 [2019-12-21T17:47:17.133Z] [WARNING] /home/jenkins/agent/workspace/tracecompass-gerrit/tmf/org.eclipse.tracecompass.tmf.ui/src/org/eclipse/tracecompass/internal/tmf/ui/project/wizards/importtrace/ArchiveUtil.java:[133] 
12:47:17 [2019-12-21T17:47:17.133Z] 	return closeZipFile(specifiedFile);
12:47:17 [2019-12-21T17:47:17.133Z] 	^^^^^^^^^^^^^^^^^^^^^^^^^^^^^^^^^^^
12:47:17 [2019-12-21T17:47:17.133Z] Potential resource leak: 'specifiedFile' may not be closed at this location
12:47:17 [2019-12-21T17:47:17.133Z] [WARNING] /home/jenkins/agent/workspace/tracecompass-gerrit/tmf/org.eclipse.tracecompass.tmf.ui/src/org/eclipse/tracecompass/internal/tmf/ui/project/wizards/importtrace/ArchiveUtil.java:[193] 
12:47:17 [2019-12-21T17:47:17.133Z] 	return archiveSize;
12:47:17 [2019-12-21T17:47:17.133Z] 	^^^^^^^^^^^^^^^^^^^
12:47:17 [2019-12-21T17:47:17.133Z] Potential resource leak: 'zipFile' may not be closed at this location
12:47:17 [2019-12-21T17:47:17.133Z] [WARNING] /home/jenkins/agent/workspace/tracecompass-gerrit/tmf/org.eclipse.tracecompass.tmf.ui/src/org/eclipse/tracecompass/tmf/ui/views/timegraph/AbstractTimeGraphView.java:[770] 
12:47:17 [2019-12-21T17:47:17.133Z] 	Map<String, String> toTest = new HashMap<>(getPresentationProvider().getFilterInput(te));
12:47:17 [2019-12-21T17:47:17.133Z] 	                                           ^^^^^^^^^^^^^^^^^^^^^^^^^^^^^^^^^^^^^^^^^^^^
12:47:17 [2019-12-21T17:47:17.133Z] Null type safety (type annotations): The expression of type '@NonNull Map<String,String>' needs unchecked conversion to conform to 'Map<? extends @NonNull String,? extends @NonNull String>'
12:47:17 [2019-12-21T17:47:17.133Z] [WARNING] /home/jenkins/agent/workspace/tracecompass-gerrit/tmf/org.eclipse.tracecompass.tmf.ui/src/org/eclipse/tracecompass/tmf/ui/views/timegraph/AbstractTimeGraphView.java:[774] 
12:47:17 [2019-12-21T17:47:17.133Z] 	Integer property = mapEntry.getKey();
12:47:17 [2019-12-21T17:47:17.133Z] 	                   ^^^^^^^^^^^^^^^^^
12:47:17 [2019-12-21T17:47:17.133Z] Unsafe interpretation of method return type as '@NonNull' based on the receiver type 'Map.Entry<@NonNull Integer,@NonNull Predicate<@NonNull Map<@NonNull String,@NonNull String>>>'. Type 'Map.Entry<K,V>' doesn't seem to be designed with null type annotations in mind
12:47:17 [2019-12-21T17:47:17.133Z] [WARNING] /home/jenkins/agent/workspace/tracecompass-gerrit/tmf/org.eclipse.tracecompass.tmf.ui/src/org/eclipse/tracecompass/tmf/ui/views/timegraph/AbstractTimeGraphView.java:[841] 
12:47:17 [2019-12-21T17:47:17.133Z] 	for (Entry<Integer, Collection<String>> entry : regexes.asMap().entrySet()) {
12:47:17 [2019-12-21T17:47:17.133Z] 	                                                ^^^^^^^^^^^^^^^^^^^^^^^^^^
12:47:17 [2019-12-21T17:47:17.133Z] Null type safety (type annotations): The expression of type 'Map.@NonNull Entry<@NonNull Integer,Collection<@NonNull String>>' needs unchecked conversion to conform to 'Map.Entry<@NonNull Integer,@NonNull Collection<@NonNull String>>'
12:47:17 [2019-12-21T17:47:17.133Z] [WARNING] /home/jenkins/agent/workspace/tracecompass-gerrit/tmf/org.eclipse.tracecompass.tmf.ui/src/org/eclipse/tracecompass/tmf/ui/views/timegraph/AbstractTimeGraphView.java:[870] 
12:47:17 [2019-12-21T17:47:17.133Z] 	for (Entry<Integer, Collection<String>> entry : regexes.asMap().entrySet()) {
12:47:17 [2019-12-21T17:47:17.133Z] 	                                                ^^^^^^^^^^^^^^^^^^^^^^^^^^
12:47:17 [2019-12-21T17:47:17.133Z] Null type safety (type annotations): The expression of type 'Map.@NonNull Entry<@NonNull Integer,Collection<@NonNull String>>' needs unchecked conversion to conform to 'Map.Entry<@NonNull Integer,@NonNull Collection<@NonNull String>>'
12:47:17 [2019-12-21T17:47:17.133Z] [WARNING] /home/jenkins/agent/workspace/tracecompass-gerrit/tmf/org.eclipse.tracecompass.tmf.ui/src/org/eclipse/tracecompass/tmf/ui/views/timegraph/AbstractTimeGraphView.java:[1475] 
12:47:17 [2019-12-21T17:47:17.133Z] 	fContextService = site.getWorkbenchWindow().getService(IContextService.class);
12:47:17 [2019-12-21T17:47:17.133Z] 	                  ^^^^^^^^^^^^^^^^^^^^^^^^^^^^^^^^^^^^^^^^^^^^^^^^^^^^^^^^^^^
12:47:17 [2019-12-21T17:47:17.133Z] Unsafe interpretation of method return type as '@NonNull' based on substitution 'T=@NonNull IContextService'. Declaring type 'IServiceLocator' doesn't seem to be designed with null type annotations in mind
12:47:17 [2019-12-21T17:47:17.133Z] [WARNING] /home/jenkins/agent/workspace/tracecompass-gerrit/tmf/org.eclipse.tracecompass.tmf.ui/src/org/eclipse/tracecompass/tmf/ui/views/timegraph/AbstractTimeGraphView.java:[1838] 
12:47:17 [2019-12-21T17:47:17.133Z] 	service = site.getService(IWorkbenchSiteProgressService.class);
12:47:17 [2019-12-21T17:47:17.133Z] 	          ^^^^^^^^^^^^^^^^^^^^^^^^^^^^^^^^^^^^^^^^^^^^^^^^^^^^
12:47:17 [2019-12-21T17:47:17.133Z] Unsafe interpretation of method return type as '@NonNull' based on substitution 'T=@NonNull IWorkbenchSiteProgressService'. Declaring type 'IServiceLocator' doesn't seem to be designed with null type annotations in mind
12:47:17 [2019-12-21T17:47:17.133Z] [WARNING] /home/jenkins/agent/workspace/tracecompass-gerrit/tmf/org.eclipse.tracecompass.tmf.ui/src/org/eclipse/tracecompass/tmf/ui/views/timegraph/AbstractTimeGraphView.java:[2885] 
12:47:17 [2019-12-21T17:47:17.133Z] 	final Object service = PlatformUI.getWorkbench().getService(IHandlerService.class);
12:47:17 [2019-12-21T17:47:17.133Z] 	                       ^^^^^^^^^^^^^^^^^^^^^^^^^^^^^^^^^^^^^^^^^^^^^^^^^^^^^^^^^^^
12:47:17 [2019-12-21T17:47:17.133Z] Unsafe interpretation of method return type as '@NonNull' based on substitution 'T=@NonNull IHandlerService'. Declaring type 'IServiceLocator' doesn't seem to be designed with null type annotations in mind
12:47:17 [2019-12-21T17:47:17.133Z] [WARNING] /home/jenkins/agent/workspace/tracecompass-gerrit/tmf/org.eclipse.tracecompass.tmf.ui/src/org/eclipse/tracecompass/tmf/ui/views/timegraph/AbstractTimeGraphView.java:[2897] 
12:47:17 [2019-12-21T17:47:17.133Z] 	final Object service = PlatformUI.getWorkbench().getService(IHandlerService.class);
12:47:17 [2019-12-21T17:47:17.133Z] 	                       ^^^^^^^^^^^^^^^^^^^^^^^^^^^^^^^^^^^^^^^^^^^^^^^^^^^^^^^^^^^
12:47:17 [2019-12-21T17:47:17.133Z] Unsafe interpretation of method return type as '@NonNull' based on substitution 'T=@NonNull IHandlerService'. Declaring type 'IServiceLocator' doesn't seem to be designed with null type annotations in mind
12:47:17 [2019-12-21T17:47:17.133Z] [WARNING] /home/jenkins/agent/workspace/tracecompass-gerrit/tmf/org.eclipse.tracecompass.tmf.ui/src/org/eclipse/tracecompass/tmf/ui/views/timegraph/BaseDataProviderTimeGraphView.java:[37] 
12:47:17 [2019-12-21T17:47:17.133Z] 	import org.eclipse.tracecompass.internal.provisional.tmf.core.model.annotations.Annotation;
12:47:17 [2019-12-21T17:47:17.133Z] 	       ^^^^^^^^^^^^^^^^^^^^^^^^^^^^^^^^^^^^^^^^^^^^^^^^^^^^^^^^^^^^^^^^^^^^^^^^^^^^^^^^^^^
12:47:17 [2019-12-21T17:47:17.133Z] Discouraged access: The type 'Annotation' is not API (restriction on classpath entry '/home/jenkins/agent/workspace/tracecompass-gerrit/tmf/org.eclipse.tracecompass.tmf.core/target/classes')
12:47:17 [2019-12-21T17:47:17.133Z] [WARNING] /home/jenkins/agent/workspace/tracecompass-gerrit/tmf/org.eclipse.tracecompass.tmf.ui/src/org/eclipse/tracecompass/tmf/ui/views/timegraph/BaseDataProviderTimeGraphView.java:[38] 
12:47:17 [2019-12-21T17:47:17.134Z] 	import org.eclipse.tracecompass.internal.provisional.tmf.core.model.annotations.AnnotationCategoriesModel;
12:47:17 [2019-12-21T17:47:17.134Z] 	       ^^^^^^^^^^^^^^^^^^^^^^^^^^^^^^^^^^^^^^^^^^^^^^^^^^^^^^^^^^^^^^^^^^^^^^^^^^^^^^^^^^^^^^^^^^^^^^^^^^
12:47:17 [2019-12-21T17:47:17.134Z] Discouraged access: The type 'AnnotationCategoriesModel' is not API (restriction on classpath entry '/home/jenkins/agent/workspace/tracecompass-gerrit/tmf/org.eclipse.tracecompass.tmf.core/target/classes')
12:47:17 [2019-12-21T17:47:17.134Z] [WARNING] /home/jenkins/agent/workspace/tracecompass-gerrit/tmf/org.eclipse.tracecompass.tmf.ui/src/org/eclipse/tracecompass/tmf/ui/views/timegraph/BaseDataProviderTimeGraphView.java:[39] 
12:47:17 [2019-12-21T17:47:17.134Z] 	import org.eclipse.tracecompass.internal.provisional.tmf.core.model.annotations.AnnotationModel;
12:47:17 [2019-12-21T17:47:17.134Z] 	       ^^^^^^^^^^^^^^^^^^^^^^^^^^^^^^^^^^^^^^^^^^^^^^^^^^^^^^^^^^^^^^^^^^^^^^^^^^^^^^^^^^^^^^^^
12:47:17 [2019-12-21T17:47:17.134Z] Discouraged access: The type 'AnnotationModel' is not API (restriction on classpath entry '/home/jenkins/agent/workspace/tracecompass-gerrit/tmf/org.eclipse.tracecompass.tmf.core/target/classes')
12:47:17 [2019-12-21T17:47:17.134Z] [WARNING] /home/jenkins/agent/workspace/tracecompass-gerrit/tmf/org.eclipse.tracecompass.tmf.ui/src/org/eclipse/tracecompass/tmf/ui/views/timegraph/BaseDataProviderTimeGraphView.java:[40] 
12:47:17 [2019-12-21T17:47:17.134Z] 	import org.eclipse.tracecompass.internal.provisional.tmf.core.model.annotations.IAnnotation.AnnotationType;
12:47:17 [2019-12-21T17:47:17.134Z] 	       ^^^^^^^^^^^^^^^^^^^^^^^^^^^^^^^^^^^^^^^^^^^^^^^^^^^^^^^^^^^^^^^^^^^^^^^^^^^^^^^^^^^^^^^^^^^^^^^^^^^
12:47:17 [2019-12-21T17:47:17.134Z] Discouraged access: The type 'IAnnotation.AnnotationType' is not API (restriction on classpath entry '/home/jenkins/agent/workspace/tracecompass-gerrit/tmf/org.eclipse.tracecompass.tmf.core/target/classes')
12:47:17 [2019-12-21T17:47:17.134Z] [WARNING] /home/jenkins/agent/workspace/tracecompass-gerrit/tmf/org.eclipse.tracecompass.tmf.ui/src/org/eclipse/tracecompass/tmf/ui/views/timegraph/BaseDataProviderTimeGraphView.java:[41] 
12:47:17 [2019-12-21T17:47:17.134Z] 	import org.eclipse.tracecompass.internal.provisional.tmf.core.model.annotations.IOutputAnnotationProvider;
12:47:17 [2019-12-21T17:47:17.134Z] 	       ^^^^^^^^^^^^^^^^^^^^^^^^^^^^^^^^^^^^^^^^^^^^^^^^^^^^^^^^^^^^^^^^^^^^^^^^^^^^^^^^^^^^^^^^^^^^^^^^^^
12:47:17 [2019-12-21T17:47:17.134Z] Discouraged access: The type 'IOutputAnnotationProvider' is not API (restriction on classpath entry '/home/jenkins/agent/workspace/tracecompass-gerrit/tmf/org.eclipse.tracecompass.tmf.core/target/classes')
12:47:17 [2019-12-21T17:47:17.134Z] [WARNING] /home/jenkins/agent/workspace/tracecompass-gerrit/tmf/org.eclipse.tracecompass.tmf.ui/src/org/eclipse/tracecompass/tmf/ui/views/timegraph/BaseDataProviderTimeGraphView.java:[173] 
12:47:17 [2019-12-21T17:47:17.134Z] 	ITimeGraphDataProvider<@NonNull TimeGraphEntryModel> dataProvider = DataProviderManager
12:47:17 [2019-12-21T17:47:17.134Z]                 .getInstance().getDataProvider(trace, getProviderId(), ITimeGraphDataProvider.class);
12:47:17 [2019-12-21T17:47:17.134Z] 	                                                                    ^^^^^^^^^^^^^^^^^^^^^^^^^^^^^^^^^^^^^^^^^^^^^^^^^^^^^^^^^^^^^^^^^^^^^^^^^^^^^^^^^^^^^^^^^^^^^^^^^^^^^^^^^^^^^^^^^^^^^^^^
12:47:17 [2019-12-21T17:47:17.134Z] Type safety: Unchecked invocation getDataProvider(ITmfTrace, String, Class<ITimeGraphDataProvider>) of the generic method getDataProvider(ITmfTrace, String, Class<T>) of type DataProviderManager
12:47:17 [2019-12-21T17:47:17.134Z] [WARNING] /home/jenkins/agent/workspace/tracecompass-gerrit/tmf/org.eclipse.tracecompass.tmf.ui/src/org/eclipse/tracecompass/tmf/ui/views/timegraph/BaseDataProviderTimeGraphView.java:[180] 
12:47:17 [2019-12-21T17:47:17.134Z] 	((BaseDataProviderTimeGraphPresentationProvider) presentationProvider).addProvider(dataProvider, getTooltipResolver(dataProvider));
12:47:17 [2019-12-21T17:47:17.134Z] 	                                                                                                 ^^^^^^^^^^^^^^^^^^^^^^^^^^^^^^^^
12:47:17 [2019-12-21T17:47:17.134Z] Null type safety (type annotations): The expression of type 'BiFunction<ITimeEvent,Long,Map<String,String>>' needs unchecked conversion to conform to '@NonNull BiFunction<@NonNull ITimeEvent,@NonNull Long,@NonNull Map<@NonNull String,@NonNull String>>'
12:47:17 [2019-12-21T17:47:17.134Z] [WARNING] /home/jenkins/agent/workspace/tracecompass-gerrit/tmf/org.eclipse.tracecompass.tmf.ui/src/org/eclipse/tracecompass/tmf/ui/views/timegraph/BaseDataProviderTimeGraphView.java:[209] 
12:47:17 [2019-12-21T17:47:17.134Z] 	if (uiEntry == null) {
12:47:17 [2019-12-21T17:47:17.134Z] 	    ^^^^^^^
12:47:17 [2019-12-21T17:47:17.134Z] Null comparison always yields false: The variable uiEntry cannot be null at this location
12:47:17 [2019-12-21T17:47:17.134Z] [WARNING] /home/jenkins/agent/workspace/tracecompass-gerrit/tmf/org.eclipse.tracecompass.tmf.ui/src/org/eclipse/tracecompass/tmf/ui/views/timegraph/BaseDataProviderTimeGraphView.java:[209] 
12:47:17 [2019-12-21T17:47:17.134Z] 	if (uiEntry == null) {
12:47:17 [2019-12-21T17:47:17.134Z]                                 uiEntry = new TimeGraphEntry(entry);
12:47:17 [2019-12-21T17:47:17.134Z]                                 TimeGraphEntry parent = fScopedEntries.get(scope, entry.getParentId());
12:47:17 [2019-12-21T17:47:17.134Z]                                 if (parent != null) {
12:47:17 [2019-12-21T17:47:17.134Z]                                     // TODO: the order of children from different data providers is undefined
12:47:17 [2019-12-21T17:47:17.134Z]                                     parent.addChild(uiEntry);
12:47:17 [2019-12-21T17:47:17.134Z]                                 } else {
12:47:17 [2019-12-21T17:47:17.134Z]                                     orphaned.add(uiEntry);
12:47:17 [2019-12-21T17:47:17.134Z]                                 }
12:47:17 [2019-12-21T17:47:17.134Z]                                 fScopedEntries.put(scope, entry.getId(), uiEntry);
12:47:17 [2019-12-21T17:47:17.134Z]                             } else {
12:47:17 [2019-12-21T17:47:17.134Z] 	                     ^^^^^^^^^^^^^^^^^^^^^^^^^^^^^^^^^^^^^^^^^^^^^^^^^^^^^^^^^^^^^^^^^^^^^^^^^^^^^^^^^^^^^^^^^^^^^^^^^^^^^^^^^^^^^^^^^^^^^^^^^^^^^^^^^^^^^^^^^^^^^^^^^^^^^^^^^^^^^^^^^^^^^^^^^^^^^^^^^^^^^^^^^^^^^^^^^^^^^^^^^^^^^^^^^^^^^^^^^^^^^^^^^^^^^^^^^^^^^^^^^^^^^^^^^^^^^^^^^^^^^^^^^^^^^^^^^^^^^^^^^^^^^^^^^^^^^^^^^^^^^^^^^^^^^^^^^^^^^^^^^^^^^^^^^^^^^^^^^^^^^^^^^^^^^^^^^^^^^^^^^^^^^^^^^^^^^^^^^^^^^^^^^^^^^^^^^^^^^^^^^^^^^^^^^^^^^^^^^^^^^^^^^^^^^^^^^^^^^^^^^^^^^^^^^^^^^^^^^^^^^^^^^^^^^^^^^^^^^^^^^^^^^^^^^^^^^^^^^^^^^^^^^^^^^^^^^^^^^^^^^^^^^^^^^^^^^^^^^^^^^^^^^^^^^^^^^^^^^^^^^^^^^^^^^^^^^^^^^^^^^^^^^^^^^^^^^^^^^^^^^^^^^^^^^^^^^^^^^^^^^^^^^^^^^^^^^^^^^^^^^^^^^^^
12:47:17 [2019-12-21T17:47:17.134Z] Dead code
12:47:17 [2019-12-21T17:47:17.134Z] [WARNING] /home/jenkins/agent/workspace/tracecompass-gerrit/tmf/org.eclipse.tracecompass.tmf.ui/src/org/eclipse/tracecompass/tmf/ui/views/timegraph/BaseDataProviderTimeGraphView.java:[228] 
12:47:17 [2019-12-21T17:47:17.134Z] 	if (uiEntry != null) {
12:47:17 [2019-12-21T17:47:17.134Z] 	    ^^^^^^^
12:47:17 [2019-12-21T17:47:17.134Z] Redundant null check: The variable uiEntry cannot be null at this location
12:47:17 [2019-12-21T17:47:17.134Z] [WARNING] /home/jenkins/agent/workspace/tracecompass-gerrit/tmf/org.eclipse.tracecompass.tmf.ui/src/org/eclipse/tracecompass/tmf/ui/views/timegraph/BaseDataProviderTimeGraphView.java:[230] 
12:47:17 [2019-12-21T17:47:17.134Z] 	} else {
12:47:17 [2019-12-21T17:47:17.134Z]                                 // Do not assume that parentless entries are
12:47:17 [2019-12-21T17:47:17.134Z]                                 // trace entries
12:47:17 [2019-12-21T17:47:17.134Z]                                 uiEntry = new TraceEntry(entry, trace, dataProvider);
12:47:17 [2019-12-21T17:47:17.134Z]                                 fScopedEntries.put(scope, entry.getId(), uiEntry);
12:47:17 [2019-12-21T17:47:17.134Z]                                 addToEntryList(parentTrace, Collections.singletonList(uiEntry));
12:47:17 [2019-12-21T17:47:17.134Z]                             }
12:47:17 [2019-12-21T17:47:17.134Z] 	       ^^^^^^^^^^^^^^^^^^^^^^^^^^^^^^^^^^^^^^^^^^^^^^^^^^^^^^^^^^^^^^^^^^^^^^^^^^^^^^^^^^^^^^^^^^^^^^^^^^^^^^^^^^^^^^^^^^^^^^^^^^^^^^^^^^^^^^^^^^^^^^^^^^^^^^^^^^^^^^^^^^^^^^^^^^^^^^^^^^^^^^^^^^^^^^^^^^^^^^^^^^^^^^^^^^^^^^^^^^^^^^^^^^^^^^^^^^^^^^^^^^^^^^^^^^^^^^^^^^^^^^^^^^^^^^^^^^^^^^^^^^^^^^^^^^^^^^^^^^^^^^^^^^^^^^^^^^^^^^^^^^^^^^^^^^^^^^^^^^^^^^^^^^^^^^^^^^^^^^^^^^^^^^^^^^^^^^^^^^^^^^^^^^^^^^^^^^^^^^^^^^^^^^^^^^^^^^^^^^^^^^^
12:47:17 [2019-12-21T17:47:17.134Z] Dead code
12:47:17 [2019-12-21T17:47:17.134Z] [WARNING] /home/jenkins/agent/workspace/tracecompass-gerrit/tmf/org.eclipse.tracecompass.tmf.ui/src/org/eclipse/tracecompass/tmf/ui/views/timegraph/BaseDataProviderTimeGraphView.java:[244] 
12:47:17 [2019-12-21T17:47:17.134Z] 	if (parent != null) {
12:47:17 [2019-12-21T17:47:17.134Z] 	    ^^^^^^
12:47:17 [2019-12-21T17:47:17.134Z] Redundant null check: The variable parent cannot be null at this location
12:47:17 [2019-12-21T17:47:17.134Z] [WARNING] /home/jenkins/agent/workspace/tracecompass-gerrit/tmf/org.eclipse.tracecompass.tmf.ui/src/org/eclipse/tracecompass/tmf/ui/views/timegraph/BaseDataProviderTimeGraphView.java:[401] 
12:47:17 [2019-12-21T17:47:17.134Z] 	Map<@NonNull String, @NonNull Object> parameters = getFetchRowModelParameters(start, end, resolution, fullSearch, entry.getValue());
12:47:17 [2019-12-21T17:47:17.134Z] 	                                                                                                                  ^^^^^^^^^^^^^^^^
12:47:17 [2019-12-21T17:47:17.134Z] Null type safety (type annotations): The expression of type 'Collection<Long>' needs unchecked conversion to conform to '@NonNull Collection<Long>'
12:47:17 [2019-12-21T17:47:17.134Z] [WARNING] /home/jenkins/agent/workspace/tracecompass-gerrit/tmf/org.eclipse.tracecompass.tmf.ui/src/org/eclipse/tracecompass/tmf/ui/views/timegraph/BaseDataProviderTimeGraphView.java:[547] 
12:47:17 [2019-12-21T17:47:17.134Z] 	if (prevEntry != null && nextEntry != null) {
12:47:17 [2019-12-21T17:47:17.134Z] 	    ^^^^^^^^^
12:47:17 [2019-12-21T17:47:17.134Z] Redundant null check: The variable prevEntry cannot be null at this location
12:47:17 [2019-12-21T17:47:17.134Z] [WARNING] /home/jenkins/agent/workspace/tracecompass-gerrit/tmf/org.eclipse.tracecompass.tmf.ui/src/org/eclipse/tracecompass/tmf/ui/views/timegraph/BaseDataProviderTimeGraphView.java:[547] 
12:47:17 [2019-12-21T17:47:17.134Z] 	if (prevEntry != null && nextEntry != null) {
12:47:17 [2019-12-21T17:47:17.134Z] 	                         ^^^^^^^^^
12:47:17 [2019-12-21T17:47:17.134Z] Redundant null check: The variable nextEntry cannot be null at this location
12:47:17 [2019-12-21T17:47:17.134Z] [WARNING] /home/jenkins/agent/workspace/tracecompass-gerrit/tmf/org.eclipse.tracecompass.tmf.ui/src/org/eclipse/tracecompass/tmf/ui/views/timegraph/BaseDataProviderTimeGraphView.java:[564] 
12:47:17 [2019-12-21T17:47:17.134Z] 	if (provider instanceof IOutputAnnotationProvider) {
12:47:17 [2019-12-21T17:47:17.134Z] 	                        ^^^^^^^^^^^^^^^^^^^^^^^^^
12:47:17 [2019-12-21T17:47:17.134Z] Discouraged access: The type 'IOutputAnnotationProvider' is not API (restriction on classpath entry '/home/jenkins/agent/workspace/tracecompass-gerrit/tmf/org.eclipse.tracecompass.tmf.core/target/classes')
12:47:17 [2019-12-21T17:47:17.134Z] [WARNING] /home/jenkins/agent/workspace/tracecompass-gerrit/tmf/org.eclipse.tracecompass.tmf.ui/src/org/eclipse/tracecompass/tmf/ui/views/timegraph/BaseDataProviderTimeGraphView.java:[566] 
12:47:17 [2019-12-21T17:47:17.134Z] 	TmfModelResponse<@NonNull AnnotationCategoriesModel> response = ((IOutputAnnotationProvider) provider).fetchAnnotationCategories(parameters, new NullProgressMonitor());
12:47:17 [2019-12-21T17:47:17.134Z] 	                 ^^^^^^^^^^^^^^^^^^^^^^^^^^^^^^^^^^
12:47:17 [2019-12-21T17:47:17.134Z] Discouraged access: The type 'AnnotationCategoriesModel' is not API (restriction on classpath entry '/home/jenkins/agent/workspace/tracecompass-gerrit/tmf/org.eclipse.tracecompass.tmf.core/target/classes')
12:47:17 [2019-12-21T17:47:17.134Z] [WARNING] /home/jenkins/agent/workspace/tracecompass-gerrit/tmf/org.eclipse.tracecompass.tmf.ui/src/org/eclipse/tracecompass/tmf/ui/views/timegraph/BaseDataProviderTimeGraphView.java:[566] 
12:47:17 [2019-12-21T17:47:17.134Z] 	TmfModelResponse<@NonNull AnnotationCategoriesModel> response = ((IOutputAnnotationProvider) provider).fetchAnnotationCategories(parameters, new NullProgressMonitor());
12:47:17 [2019-12-21T17:47:17.134Z] 	                                                                ^^^^^^^^^^^^^^^^^^^^^^^^^^^^^^^^^^^^^^^^^^^^^^^^^^^^^^^^^^^^^^^^^^^^^^^^^^^^^^^^^^^^^^^^^^^^^^^^^^^^^^^
12:47:17 [2019-12-21T17:47:17.134Z] Discouraged access: The method 'IOutputAnnotationProvider.fetchAnnotationCategories(Map<String,Object>, IProgressMonitor)' is not API (restriction on classpath entry '/home/jenkins/agent/workspace/tracecompass-gerrit/tmf/org.eclipse.tracecompass.tmf.core/target/classes')
12:47:17 [2019-12-21T17:47:17.134Z] [WARNING] /home/jenkins/agent/workspace/tracecompass-gerrit/tmf/org.eclipse.tracecompass.tmf.ui/src/org/eclipse/tracecompass/tmf/ui/views/timegraph/BaseDataProviderTimeGraphView.java:[566] 
12:47:17 [2019-12-21T17:47:17.134Z] 	TmfModelResponse<@NonNull AnnotationCategoriesModel> response = ((IOutputAnnotationProvider) provider).fetchAnnotationCategories(parameters, new NullProgressMonitor());
12:47:17 [2019-12-21T17:47:17.134Z] 	                                                                  ^^^^^^^^^^^^^^^^^^^^^^^^^
12:47:17 [2019-12-21T17:47:17.134Z] Discouraged access: The type 'IOutputAnnotationProvider' is not API (restriction on classpath entry '/home/jenkins/agent/workspace/tracecompass-gerrit/tmf/org.eclipse.tracecompass.tmf.core/target/classes')
12:47:17 [2019-12-21T17:47:17.134Z] [WARNING] /home/jenkins/agent/workspace/tracecompass-gerrit/tmf/org.eclipse.tracecompass.tmf.ui/src/org/eclipse/tracecompass/tmf/ui/views/timegraph/BaseDataProviderTimeGraphView.java:[567] 
12:47:17 [2019-12-21T17:47:17.134Z] 	AnnotationCategoriesModel model = response.getModel();
12:47:17 [2019-12-21T17:47:17.134Z] 	^^^^^^^^^^^^^^^^^^^^^^^^^
12:47:17 [2019-12-21T17:47:17.134Z] Discouraged access: The type 'AnnotationCategoriesModel' is not API (restriction on classpath entry '/home/jenkins/agent/workspace/tracecompass-gerrit/tmf/org.eclipse.tracecompass.tmf.core/target/classes')
12:47:17 [2019-12-21T17:47:17.134Z] [WARNING] /home/jenkins/agent/workspace/tracecompass-gerrit/tmf/org.eclipse.tracecompass.tmf.ui/src/org/eclipse/tracecompass/tmf/ui/views/timegraph/BaseDataProviderTimeGraphView.java:[569] 
12:47:17 [2019-12-21T17:47:17.134Z] 	viewMarkerCategories.addAll(model.getAnnotationCategories());
12:47:17 [2019-12-21T17:47:17.134Z] 	                            ^^^^^^^^^^^^^^^^^^^^^^^^^^^^^^^
12:47:17 [2019-12-21T17:47:17.135Z] Discouraged access: The method 'AnnotationCategoriesModel.getAnnotationCategories()' is not API (restriction on classpath entry '/home/jenkins/agent/workspace/tracecompass-gerrit/tmf/org.eclipse.tracecompass.tmf.core/target/classes')
12:47:17 [2019-12-21T17:47:17.135Z] [WARNING] /home/jenkins/agent/workspace/tracecompass-gerrit/tmf/org.eclipse.tracecompass.tmf.ui/src/org/eclipse/tracecompass/tmf/ui/views/timegraph/BaseDataProviderTimeGraphView.java:[587] 
12:47:17 [2019-12-21T17:47:17.135Z] 	if (provider instanceof IOutputAnnotationProvider) {
12:47:17 [2019-12-21T17:47:17.135Z] 	                        ^^^^^^^^^^^^^^^^^^^^^^^^^
12:47:17 [2019-12-21T17:47:17.135Z] Discouraged access: The type 'IOutputAnnotationProvider' is not API (restriction on classpath entry '/home/jenkins/agent/workspace/tracecompass-gerrit/tmf/org.eclipse.tracecompass.tmf.core/target/classes')
12:47:17 [2019-12-21T17:47:17.135Z] [WARNING] /home/jenkins/agent/workspace/tracecompass-gerrit/tmf/org.eclipse.tracecompass.tmf.ui/src/org/eclipse/tracecompass/tmf/ui/views/timegraph/BaseDataProviderTimeGraphView.java:[588] 
12:47:17 [2019-12-21T17:47:17.135Z] 	Map<@NonNull String, @NonNull Object> parameters = getFetchAnnotationsParameters(times, providersToModelIds.get(provider));
12:47:17 [2019-12-21T17:47:17.135Z] 	                                                                                        ^^^^^^^^^^^^^^^^^^^^^^^^^^^^^^^^^
12:47:17 [2019-12-21T17:47:17.135Z] Null type safety (type annotations): The expression of type 'Collection<Long>' needs unchecked conversion to conform to '@NonNull Collection<Long>'
12:47:17 [2019-12-21T17:47:17.135Z] [WARNING] /home/jenkins/agent/workspace/tracecompass-gerrit/tmf/org.eclipse.tracecompass.tmf.ui/src/org/eclipse/tracecompass/tmf/ui/views/timegraph/BaseDataProviderTimeGraphView.java:[589] 
12:47:17 [2019-12-21T17:47:17.135Z] 	TmfModelResponse<@NonNull AnnotationModel> response = ((IOutputAnnotationProvider) provider).fetchAnnotations(parameters, new NullProgressMonitor());
12:47:17 [2019-12-21T17:47:17.135Z] 	                 ^^^^^^^^^^^^^^^^^^^^^^^^
12:47:17 [2019-12-21T17:47:17.135Z] Discouraged access: The type 'AnnotationModel' is not API (restriction on classpath entry '/home/jenkins/agent/workspace/tracecompass-gerrit/tmf/org.eclipse.tracecompass.tmf.core/target/classes')
12:47:17 [2019-12-21T17:47:17.135Z] [WARNING] /home/jenkins/agent/workspace/tracecompass-gerrit/tmf/org.eclipse.tracecompass.tmf.ui/src/org/eclipse/tracecompass/tmf/ui/views/timegraph/BaseDataProviderTimeGraphView.java:[589] 
12:47:17 [2019-12-21T17:47:17.135Z] 	TmfModelResponse<@NonNull AnnotationModel> response = ((IOutputAnnotationProvider) provider).fetchAnnotations(parameters, new NullProgressMonitor());
12:47:17 [2019-12-21T17:47:17.135Z] 	                                                      ^^^^^^^^^^^^^^^^^^^^^^^^^^^^^^^^^^^^^^^^^^^^^^^^^^^^^^^^^^^^^^^^^^^^^^^^^^^^^^^^^^^^^^^^^^^^^^
12:47:17 [2019-12-21T17:47:17.135Z] Discouraged access: The method 'IOutputAnnotationProvider.fetchAnnotations(Map<String,Object>, IProgressMonitor)' is not API (restriction on classpath entry '/home/jenkins/agent/workspace/tracecompass-gerrit/tmf/org.eclipse.tracecompass.tmf.core/target/classes')
12:47:17 [2019-12-21T17:47:17.135Z] [WARNING] /home/jenkins/agent/workspace/tracecompass-gerrit/tmf/org.eclipse.tracecompass.tmf.ui/src/org/eclipse/tracecompass/tmf/ui/views/timegraph/BaseDataProviderTimeGraphView.java:[589] 
12:47:17 [2019-12-21T17:47:17.135Z] 	TmfModelResponse<@NonNull AnnotationModel> response = ((IOutputAnnotationProvider) provider).fetchAnnotations(parameters, new NullProgressMonitor());
12:47:17 [2019-12-21T17:47:17.135Z] 	                                                        ^^^^^^^^^^^^^^^^^^^^^^^^^
12:47:17 [2019-12-21T17:47:17.135Z] Discouraged access: The type 'IOutputAnnotationProvider' is not API (restriction on classpath entry '/home/jenkins/agent/workspace/tracecompass-gerrit/tmf/org.eclipse.tracecompass.tmf.core/target/classes')
12:47:17 [2019-12-21T17:47:17.135Z] [WARNING] /home/jenkins/agent/workspace/tracecompass-gerrit/tmf/org.eclipse.tracecompass.tmf.ui/src/org/eclipse/tracecompass/tmf/ui/views/timegraph/BaseDataProviderTimeGraphView.java:[590] 
12:47:17 [2019-12-21T17:47:17.135Z] 	AnnotationModel model = response.getModel();
12:47:17 [2019-12-21T17:47:17.135Z] 	^^^^^^^^^^^^^^^
12:47:17 [2019-12-21T17:47:17.135Z] Discouraged access: The type 'AnnotationModel' is not API (restriction on classpath entry '/home/jenkins/agent/workspace/tracecompass-gerrit/tmf/org.eclipse.tracecompass.tmf.core/target/classes')
12:47:17 [2019-12-21T17:47:17.135Z] [WARNING] /home/jenkins/agent/workspace/tracecompass-gerrit/tmf/org.eclipse.tracecompass.tmf.ui/src/org/eclipse/tracecompass/tmf/ui/views/timegraph/BaseDataProviderTimeGraphView.java:[592] 
12:47:17 [2019-12-21T17:47:17.135Z] 	for (Entry<String, Collection<Annotation>> entry : model.getAnnotations().entrySet()) {
12:47:17 [2019-12-21T17:47:17.135Z] 	                              ^^^^^^^^^^
12:47:17 [2019-12-21T17:47:17.135Z] Discouraged access: The type 'Annotation' is not API (restriction on classpath entry '/home/jenkins/agent/workspace/tracecompass-gerrit/tmf/org.eclipse.tracecompass.tmf.core/target/classes')
12:47:17 [2019-12-21T17:47:17.135Z] [WARNING] /home/jenkins/agent/workspace/tracecompass-gerrit/tmf/org.eclipse.tracecompass.tmf.ui/src/org/eclipse/tracecompass/tmf/ui/views/timegraph/BaseDataProviderTimeGraphView.java:[592] 
12:47:17 [2019-12-21T17:47:17.135Z] 	for (Entry<String, Collection<Annotation>> entry : model.getAnnotations().entrySet()) {
12:47:17 [2019-12-21T17:47:17.135Z] 	                                                   ^^^^^^^^^^^^^^^^^^^^^^
12:47:17 [2019-12-21T17:47:17.135Z] Discouraged access: The method 'AnnotationModel.getAnnotations()' is not API (restriction on classpath entry '/home/jenkins/agent/workspace/tracecompass-gerrit/tmf/org.eclipse.tracecompass.tmf.core/target/classes')
12:47:17 [2019-12-21T17:47:17.135Z] [WARNING] /home/jenkins/agent/workspace/tracecompass-gerrit/tmf/org.eclipse.tracecompass.tmf.ui/src/org/eclipse/tracecompass/tmf/ui/views/timegraph/BaseDataProviderTimeGraphView.java:[594] 
12:47:17 [2019-12-21T17:47:17.135Z] 	for (Annotation annotation : entry.getValue()) {
12:47:17 [2019-12-21T17:47:17.135Z] 	     ^^^^^^^^^^
12:47:17 [2019-12-21T17:47:17.135Z] Discouraged access: The type 'Annotation' is not API (restriction on classpath entry '/home/jenkins/agent/workspace/tracecompass-gerrit/tmf/org.eclipse.tracecompass.tmf.core/target/classes')
12:47:17 [2019-12-21T17:47:17.135Z] [WARNING] /home/jenkins/agent/workspace/tracecompass-gerrit/tmf/org.eclipse.tracecompass.tmf.ui/src/org/eclipse/tracecompass/tmf/ui/views/timegraph/BaseDataProviderTimeGraphView.java:[595] 
12:47:17 [2019-12-21T17:47:17.135Z] 	if (annotation.getType() == AnnotationType.CHART) {
12:47:17 [2019-12-21T17:47:17.135Z] 	    ^^^^^^^^^^^^^^^^^^^^
12:47:17 [2019-12-21T17:47:17.135Z] Discouraged access: The method 'Annotation.getType()' is not API (restriction on classpath entry '/home/jenkins/agent/workspace/tracecompass-gerrit/tmf/org.eclipse.tracecompass.tmf.core/target/classes')
12:47:17 [2019-12-21T17:47:17.135Z] [WARNING] /home/jenkins/agent/workspace/tracecompass-gerrit/tmf/org.eclipse.tracecompass.tmf.ui/src/org/eclipse/tracecompass/tmf/ui/views/timegraph/BaseDataProviderTimeGraphView.java:[595] 
12:47:17 [2019-12-21T17:47:17.135Z] 	if (annotation.getType() == AnnotationType.CHART) {
12:47:17 [2019-12-21T17:47:17.135Z] 	                            ^^^^^^^^^^^^^^^^^^^^
12:47:17 [2019-12-21T17:47:17.135Z] Discouraged access: The type 'IAnnotation.AnnotationType' is not API (restriction on classpath entry '/home/jenkins/agent/workspace/tracecompass-gerrit/tmf/org.eclipse.tracecompass.tmf.core/target/classes')
12:47:17 [2019-12-21T17:47:17.135Z] [WARNING] /home/jenkins/agent/workspace/tracecompass-gerrit/tmf/org.eclipse.tracecompass.tmf.ui/src/org/eclipse/tracecompass/tmf/ui/views/timegraph/BaseDataProviderTimeGraphView.java:[595] 
12:47:17 [2019-12-21T17:47:17.135Z] 	if (annotation.getType() == AnnotationType.CHART) {
12:47:17 [2019-12-21T17:47:17.135Z] 	                                           ^^^^^
12:47:17 [2019-12-21T17:47:17.135Z] Discouraged access: The field 'IAnnotation.AnnotationType.CHART' is not API (restriction on classpath entry '/home/jenkins/agent/workspace/tracecompass-gerrit/tmf/org.eclipse.tracecompass.tmf.core/target/classes')
12:47:17 [2019-12-21T17:47:17.135Z] [WARNING] /home/jenkins/agent/workspace/tracecompass-gerrit/tmf/org.eclipse.tracecompass.tmf.ui/src/org/eclipse/tracecompass/tmf/ui/views/timegraph/BaseDataProviderTimeGraphView.java:[599] 
12:47:17 [2019-12-21T17:47:17.135Z] 	if (annotation.getEntryId() != -1) {
12:47:17 [2019-12-21T17:47:17.135Z] 	    ^^^^^^^^^^^^^^^^^^^^^^^
12:47:17 [2019-12-21T17:47:17.135Z] Discouraged access: The method 'Annotation.getEntryId()' is not API (restriction on classpath entry '/home/jenkins/agent/workspace/tracecompass-gerrit/tmf/org.eclipse.tracecompass.tmf.core/target/classes')
12:47:17 [2019-12-21T17:47:17.135Z] [WARNING] /home/jenkins/agent/workspace/tracecompass-gerrit/tmf/org.eclipse.tracecompass.tmf.ui/src/org/eclipse/tracecompass/tmf/ui/views/timegraph/BaseDataProviderTimeGraphView.java:[601] 
12:47:17 [2019-12-21T17:47:17.135Z] 	markerEntry = fEntries.get(provider, annotation.getEntryId());
12:47:17 [2019-12-21T17:47:17.135Z] 	                                     ^^^^^^^^^^^^^^^^^^^^^^^
12:47:17 [2019-12-21T17:47:17.135Z] Discouraged access: The method 'Annotation.getEntryId()' is not API (restriction on classpath entry '/home/jenkins/agent/workspace/tracecompass-gerrit/tmf/org.eclipse.tracecompass.tmf.core/target/classes')
12:47:17 [2019-12-21T17:47:17.135Z] [WARNING] /home/jenkins/agent/workspace/tracecompass-gerrit/tmf/org.eclipse.tracecompass.tmf.ui/src/org/eclipse/tracecompass/tmf/ui/views/timegraph/BaseDataProviderTimeGraphView.java:[648] 
12:47:17 [2019-12-21T17:47:17.135Z] 	parameters.put(DataProviderParameterUtils.REGEX_MAP_FILTERS_KEY, regexesMap.asMap());
12:47:17 [2019-12-21T17:47:17.135Z] 	                                                                 ^^^^^^^^^^^^^^^^^^
12:47:17 [2019-12-21T17:47:17.135Z] Null type safety (type annotations): The expression of type 'Map<@NonNull Integer,Collection<@NonNull String>>' needs unchecked conversion to conform to '@NonNull Object'
12:47:17 [2019-12-21T17:47:17.135Z] [WARNING] /home/jenkins/agent/workspace/tracecompass-gerrit/tmf/org.eclipse.tracecompass.tmf.ui/src/org/eclipse/tracecompass/tmf/ui/views/TmfChartView.java:[240] 
12:47:17 [2019-12-21T17:47:17.135Z] 	fContextService = site.getWorkbenchWindow().getService(IContextService.class);
12:47:17 [2019-12-21T17:47:17.135Z] 	                  ^^^^^^^^^^^^^^^^^^^^^^^^^^^^^^^^^^^^^^^^^^^^^^^^^^^^^^^^^^^
12:47:17 [2019-12-21T17:47:17.135Z] Unsafe interpretation of method return type as '@NonNull' based on substitution 'T=@NonNull IContextService'. Declaring type 'IServiceLocator' doesn't seem to be designed with null type annotations in mind
12:47:17 [2019-12-21T17:47:17.135Z] [WARNING] /home/jenkins/agent/workspace/tracecompass-gerrit/tmf/org.eclipse.tracecompass.tmf.ui/src/org/eclipse/tracecompass/tmf/ui/widgets/timegraph/model/MarkerEvent.java:[16] 
12:47:17 [2019-12-21T17:47:17.135Z] 	import org.eclipse.tracecompass.internal.provisional.tmf.core.model.annotations.IAnnotation;
12:47:17 [2019-12-21T17:47:17.135Z] 	       ^^^^^^^^^^^^^^^^^^^^^^^^^^^^^^^^^^^^^^^^^^^^^^^^^^^^^^^^^^^^^^^^^^^^^^^^^^^^^^^^^^^^
12:47:17 [2019-12-21T17:47:17.135Z] Discouraged access: The type 'IAnnotation' is not API (restriction on classpath entry '/home/jenkins/agent/workspace/tracecompass-gerrit/tmf/org.eclipse.tracecompass.tmf.core/target/classes')
12:47:17 [2019-12-21T17:47:17.135Z] [WARNING] /home/jenkins/agent/workspace/tracecompass-gerrit/tmf/org.eclipse.tracecompass.tmf.ui/src/org/eclipse/tracecompass/tmf/ui/widgets/timegraph/model/MarkerEvent.java:[88] 
12:47:17 [2019-12-21T17:47:17.136Z] 	*            {@link IAnnotation} that represent this marker event
12:47:17 [2019-12-21T17:47:17.136Z] 	                    ^^^^^^^^^^^
12:47:17 [2019-12-21T17:47:17.136Z] Discouraged access: The type 'IAnnotation' is not API (restriction on classpath entry '/home/jenkins/agent/workspace/tracecompass-gerrit/tmf/org.eclipse.tracecompass.tmf.core/target/classes')
12:47:17 [2019-12-21T17:47:17.136Z] [WARNING] /home/jenkins/agent/workspace/tracecompass-gerrit/tmf/org.eclipse.tracecompass.tmf.ui/src/org/eclipse/tracecompass/tmf/ui/widgets/timegraph/model/MarkerEvent.java:[97] 
12:47:17 [2019-12-21T17:47:17.136Z] 	public MarkerEvent(IAnnotation annotation, ITimeGraphEntry entry, String category, boolean foreground) {
12:47:17 [2019-12-21T17:47:17.136Z] 	                   ^^^^^^^^^^^
12:47:17 [2019-12-21T17:47:17.136Z] Discouraged access: The type 'IAnnotation' is not API (restriction on classpath entry '/home/jenkins/agent/workspace/tracecompass-gerrit/tmf/org.eclipse.tracecompass.tmf.core/target/classes')
12:47:17 [2019-12-21T17:47:17.136Z] [WARNING] /home/jenkins/agent/workspace/tracecompass-gerrit/tmf/org.eclipse.tracecompass.tmf.ui/src/org/eclipse/tracecompass/tmf/ui/widgets/timegraph/model/MarkerEvent.java:[100] 
12:47:17 [2019-12-21T17:47:17.136Z] 	fLabel = annotation.getLabel();
12:47:17 [2019-12-21T17:47:17.136Z] 	         ^^^^^^^^^^^^^^^^^^^^^
12:47:17 [2019-12-21T17:47:17.136Z] Discouraged access: The method 'IAnnotation.getLabel()' is not API (restriction on classpath entry '/home/jenkins/agent/workspace/tracecompass-gerrit/tmf/org.eclipse.tracecompass.tmf.core/target/classes')
12:47:17 [2019-12-21T17:47:17.136Z] [WARNING] /home/jenkins/agent/workspace/tracecompass-gerrit/tmf/org.eclipse.tracecompass.tmf.ui/src/org/eclipse/tracecompass/internal/tmf/ui/project/handlers/OpenAsExperimentHandler.java:[168] 
12:47:17 [2019-12-21T17:47:17.136Z] 	TmfOpenTraceHelper.openTraceFromElement(experimentElement);
12:47:17 [2019-12-21T17:47:17.136Z] 	                   ^^^^^^^^^^^^^^^^^^^^^^^^^^^^^^^^^^^^^^^
12:47:17 [2019-12-21T17:47:17.136Z] The method openTraceFromElement(TmfCommonProjectElement) from the type TmfOpenTraceHelper is deprecated
12:47:17 [2019-12-21T17:47:17.136Z] [WARNING] /home/jenkins/agent/workspace/tracecompass-gerrit/tmf/org.eclipse.tracecompass.tmf.ui/src/org/eclipse/tracecompass/internal/tmf/ui/symbols/BasicSymbolProviderPreferencePage.java:[247] 
12:47:17 [2019-12-21T17:47:17.136Z] 	return AbstractUIPlugin.imageDescriptorFromPlugin(Activator.PLUGIN_ID, file);
12:47:17 [2019-12-21T17:47:17.136Z] 	                        ^^^^^^^^^^^^^^^^^^^^^^^^^^^^^^^^^^^^^^^^^^^^^^^^^^^^
12:47:17 [2019-12-21T17:47:17.136Z] The method imageDescriptorFromPlugin(String, String) from the type AbstractUIPlugin is deprecated
12:47:17 [2019-12-21T17:47:17.136Z] [WARNING] /home/jenkins/agent/workspace/tracecompass-gerrit/tmf/org.eclipse.tracecompass.tmf.ui/src/org/eclipse/tracecompass/tmf/ui/viewers/xycharts/linecharts/TmfCommonXLineChartTooltipProvider.java:[90] 
12:47:17 [2019-12-21T17:47:17.136Z] 	addItem(null, ToolTipString.fromString(Messages.TmfCommonXLineChartTooltipProvider_time), ToolTipString.fromTimestamp(time.toString(), time.toNanos()));
12:47:17 [2019-12-21T17:47:17.136Z] 	                                       ^^^^^^^^^^^^^^^^^^^^^^^^^^^^^^^^^^^^^^^^^^^^^^^^
12:47:17 [2019-12-21T17:47:17.136Z] Null type safety (type annotations): The expression of type 'String' needs unchecked conversion to conform to '@NonNull String'
12:47:17 [2019-12-21T17:47:17.136Z] [WARNING] /home/jenkins/agent/workspace/tracecompass-gerrit/tmf/org.eclipse.tracecompass.tmf.ui/src/org/eclipse/tracecompass/tmf/ui/viewers/xycharts/linecharts/TmfCommonXLineChartTooltipProvider.java:[90] 
12:47:17 [2019-12-21T17:47:17.136Z] 	addItem(null, ToolTipString.fromString(Messages.TmfCommonXLineChartTooltipProvider_time), ToolTipString.fromTimestamp(time.toString(), time.toNanos()));
12:47:17 [2019-12-21T17:47:17.136Z] 	                                                                                                                      ^^^^^^^^^^^^^^^
12:47:17 [2019-12-21T17:47:17.136Z] Null type safety (type annotations): The expression of type 'String' needs unchecked conversion to conform to '@NonNull String'
12:47:17 [2019-12-21T17:47:17.136Z] [WARNING] /home/jenkins/agent/workspace/tracecompass-gerrit/tmf/org.eclipse.tracecompass.tmf.ui/src/org/eclipse/tracecompass/tmf/ui/viewers/xycharts/linecharts/TmfCommonXLineChartTooltipProvider.java:[108] 
12:47:17 [2019-12-21T17:47:17.136Z] 	addItem(null, ToolTipString.fromHtml(key), ToolTipString.fromString(format.format(yValue)));
12:47:17 [2019-12-21T17:47:17.136Z] 	                                                                    ^^^^^^^^^^^^^^^^^^^^^
12:47:17 [2019-12-21T17:47:17.136Z] Null type safety (type annotations): The expression of type 'String' needs unchecked conversion to conform to '@NonNull String'
12:47:17 [2019-12-21T17:47:17.136Z] [WARNING] /home/jenkins/agent/workspace/tracecompass-gerrit/tmf/org.eclipse.tracecompass.tmf.ui/src/org/eclipse/tracecompass/tmf/ui/widgets/timegraph/model/NamedTimeEvent.java:[97] 
12:47:17 [2019-12-21T17:47:17.136Z] 	data.put(IElementResolver.LABEL_KEY, getLabel());
12:47:17 [2019-12-21T17:47:17.136Z] 	                          ^^^^^^^^^
12:47:17 [2019-12-21T17:47:17.136Z] The field IElementResolver.LABEL_KEY is deprecated
12:47:17 [2019-12-21T17:47:17.136Z] [WARNING] /home/jenkins/agent/workspace/tracecompass-gerrit/tmf/org.eclipse.tracecompass.tmf.ui/src/org/eclipse/tracecompass/tmf/ui/widgets/rawviewer/TmfRawEventViewer.java:[718] 
12:47:17 [2019-12-21T17:47:17.136Z] 	int offset = fStyledText.getOffsetAtLocation(new Point(0, fCursorYCoordinate));
12:47:17 [2019-12-21T17:47:17.136Z] 	                         ^^^^^^^^^^^^^^^^^^^^^^^^^^^^^^^^^^^^^^^^^^^^^^^^^^^^^
12:47:17 [2019-12-21T17:47:17.136Z] The method getOffsetAtLocation(Point) from the type StyledText is deprecated
12:47:17 [2019-12-21T17:47:17.136Z] [WARNING] /home/jenkins/agent/workspace/tracecompass-gerrit/tmf/org.eclipse.tracecompass.tmf.ui/src/org/eclipse/tracecompass/tmf/ui/widgets/rawviewer/TmfRawEventViewer.java:[1128] 
12:47:17 [2019-12-21T17:47:17.136Z] 	int offset = fStyledText.getOffsetAtLocation(new Point(0, e.y));
12:47:17 [2019-12-21T17:47:17.136Z] 	                         ^^^^^^^^^^^^^^^^^^^^^^^^^^^^^^^^^^^^^^
12:47:17 [2019-12-21T17:47:17.136Z] The method getOffsetAtLocation(Point) from the type StyledText is deprecated
12:47:17 [2019-12-21T17:47:17.136Z] 199 problems (199 warnings)
12:47:17 [2019-12-21T17:47:17.136Z] [INFO] 
12:47:17 [2019-12-21T17:47:17.136Z] [INFO] --- maven-resources-plugin:3.0.2:testResources (default-testResources) @ org.eclipse.tracecompass.tmf.ui ---
12:47:17 [2019-12-21T17:47:17.136Z] [INFO] Using 'UTF-8' encoding to copy filtered resources.
12:47:17 [2019-12-21T17:47:17.136Z] [INFO] skip non existing resourceDirectory /home/jenkins/agent/workspace/tracecompass-gerrit/tmf/org.eclipse.tracecompass.tmf.ui/src/test/resources
12:47:17 [2019-12-21T17:47:17.136Z] [INFO] 
12:47:17 [2019-12-21T17:47:17.136Z] [INFO] --- tycho-source-plugin:1.3.0:plugin-source (plugin-source) @ org.eclipse.tracecompass.tmf.ui ---
12:47:17 [2019-12-21T17:47:17.136Z] [INFO] Building jar: /home/jenkins/agent/workspace/tracecompass-gerrit/tmf/org.eclipse.tracecompass.tmf.ui/target/org.eclipse.tracecompass.tmf.ui-5.2.0-SNAPSHOT-sources.jar
12:47:17 [2019-12-21T17:47:17.392Z] [INFO] 
12:47:17 [2019-12-21T17:47:17.392Z] [INFO] --- target-platform-configuration:1.3.0:target-platform (default-target-platform) @ org.eclipse.tracecompass.tmf.ui ---
12:47:17 [2019-12-21T17:47:17.392Z] [INFO] 
12:47:17 [2019-12-21T17:47:17.392Z] [INFO] --- tycho-packaging-plugin:1.3.0:package-plugin (default-package-plugin) @ org.eclipse.tracecompass.tmf.ui ---
12:47:17 [2019-12-21T17:47:17.648Z] [INFO] Building jar: /home/jenkins/agent/workspace/tracecompass-gerrit/tmf/org.eclipse.tracecompass.tmf.ui/target/org.eclipse.tracecompass.tmf.ui-5.2.0-SNAPSHOT.jar
12:47:18 [2019-12-21T17:47:18.210Z] [INFO] 
12:47:18 [2019-12-21T17:47:18.210Z] [INFO] --- tycho-p2-plugin:1.3.0:p2-metadata-default (default-p2-metadata-default) @ org.eclipse.tracecompass.tmf.ui ---
12:47:18 [2019-12-21T17:47:18.210Z] [INFO] 
12:47:18 [2019-12-21T17:47:18.210Z] [INFO] --- tycho-source-feature-plugin:1.3.0:source-feature (source-feature) @ org.eclipse.tracecompass.tmf.ui ---
12:47:18 [2019-12-21T17:47:18.210Z] [INFO] 
12:47:18 [2019-12-21T17:47:18.210Z] [INFO] --- tycho-pack200b-plugin:1.3.0:pack (pack200-pack) @ org.eclipse.tracecompass.tmf.ui ---
12:47:18 [2019-12-21T17:47:18.210Z] [INFO] Pack200 packing jar /home/jenkins/agent/workspace/tracecompass-gerrit/tmf/org.eclipse.tracecompass.tmf.ui/target/org.eclipse.tracecompass.tmf.ui-5.2.0-SNAPSHOT.jar
12:47:20 [2019-12-21T17:47:20.730Z] [INFO] 
12:47:20 [2019-12-21T17:47:20.730Z] [INFO] --- tycho-p2-plugin:1.3.0:p2-metadata (p2-metadata) @ org.eclipse.tracecompass.tmf.ui ---
12:47:20 [2019-12-21T17:47:20.730Z] [INFO] 
12:47:20 [2019-12-21T17:47:20.730Z] [INFO] --- maven-install-plugin:2.5.2:install (default-install) @ org.eclipse.tracecompass.tmf.ui ---
12:47:20 [2019-12-21T17:47:20.730Z] [INFO] Installing /home/jenkins/agent/workspace/tracecompass-gerrit/tmf/org.eclipse.tracecompass.tmf.ui/target/org.eclipse.tracecompass.tmf.ui-5.2.0-SNAPSHOT.jar to /home/jenkins/.m2/repository/org/eclipse/tracecompass/org.eclipse.tracecompass.tmf.ui/5.2.0-SNAPSHOT/org.eclipse.tracecompass.tmf.ui-5.2.0-SNAPSHOT.jar
12:47:21 [2019-12-21T17:47:21.291Z] [INFO] Installing /home/jenkins/agent/workspace/tracecompass-gerrit/tmf/org.eclipse.tracecompass.tmf.ui/.polyglot.build.properties to /home/jenkins/.m2/repository/org/eclipse/tracecompass/org.eclipse.tracecompass.tmf.ui/5.2.0-SNAPSHOT/org.eclipse.tracecompass.tmf.ui-5.2.0-SNAPSHOT.pom
12:47:21 [2019-12-21T17:47:21.547Z] [INFO] Installing /home/jenkins/agent/workspace/tracecompass-gerrit/tmf/org.eclipse.tracecompass.tmf.ui/target/org.eclipse.tracecompass.tmf.ui-5.2.0-SNAPSHOT-sources.jar to /home/jenkins/.m2/repository/org/eclipse/tracecompass/org.eclipse.tracecompass.tmf.ui/5.2.0-SNAPSHOT/org.eclipse.tracecompass.tmf.ui-5.2.0-SNAPSHOT-sources.jar
12:47:21 [2019-12-21T17:47:21.547Z] [INFO] Installing /home/jenkins/agent/workspace/tracecompass-gerrit/tmf/org.eclipse.tracecompass.tmf.ui/target/org.eclipse.tracecompass.tmf.ui-5.2.0-SNAPSHOT.jar.pack.gz to /home/jenkins/.m2/repository/org/eclipse/tracecompass/org.eclipse.tracecompass.tmf.ui/5.2.0-SNAPSHOT/org.eclipse.tracecompass.tmf.ui-5.2.0-SNAPSHOT-pack200.jar.pack.gz
12:47:21 [2019-12-21T17:47:21.547Z] [INFO] Installing /home/jenkins/agent/workspace/tracecompass-gerrit/tmf/org.eclipse.tracecompass.tmf.ui/target/p2content.xml to /home/jenkins/.m2/repository/org/eclipse/tracecompass/org.eclipse.tracecompass.tmf.ui/5.2.0-SNAPSHOT/org.eclipse.tracecompass.tmf.ui-5.2.0-SNAPSHOT-p2metadata.xml
12:47:21 [2019-12-21T17:47:21.803Z] [INFO] Installing /home/jenkins/agent/workspace/tracecompass-gerrit/tmf/org.eclipse.tracecompass.tmf.ui/target/p2artifacts.xml to /home/jenkins/.m2/repository/org/eclipse/tracecompass/org.eclipse.tracecompass.tmf.ui/5.2.0-SNAPSHOT/org.eclipse.tracecompass.tmf.ui-5.2.0-SNAPSHOT-p2artifacts.xml
12:47:21 [2019-12-21T17:47:21.803Z] [INFO] 
12:47:21 [2019-12-21T17:47:21.803Z] [INFO] --- tycho-p2-plugin:1.3.0:update-local-index (default-update-local-index) @ org.eclipse.tracecompass.tmf.ui ---
12:47:21 [2019-12-21T17:47:21.803Z] [INFO] 
12:47:21 [2019-12-21T17:47:21.803Z] [INFO] --< org.eclipse.tracecompass:org.eclipse.tracecompass.analysis.counters.ui >--
12:47:21 [2019-12-21T17:47:21.803Z] [INFO] Building org.eclipse.tracecompass.analysis.counters.ui 0.0.5-SNAPSHOT [23/138]
12:47:21 [2019-12-21T17:47:21.803Z] [INFO] ---------------------------[ eclipse-plugin ]---------------------------
12:47:21 [2019-12-21T17:47:21.803Z] [INFO] 
12:47:21 [2019-12-21T17:47:21.803Z] [INFO] --- maven-clean-plugin:3.0.0:clean (default-clean) @ org.eclipse.tracecompass.analysis.counters.ui ---
12:47:21 [2019-12-21T17:47:21.803Z] [INFO] 
12:47:21 [2019-12-21T17:47:21.803Z] [INFO] --- tycho-packaging-plugin:1.3.0:build-qualifier (default-build-qualifier) @ org.eclipse.tracecompass.analysis.counters.ui ---
12:47:21 [2019-12-21T17:47:21.803Z] [INFO] The project's OSGi version is 0.0.5.201912211728
12:47:21 [2019-12-21T17:47:21.803Z] [INFO] 
12:47:21 [2019-12-21T17:47:21.803Z] [INFO] --- tycho-packaging-plugin:1.3.0:validate-id (default-validate-id) @ org.eclipse.tracecompass.analysis.counters.ui ---
12:47:21 [2019-12-21T17:47:21.803Z] [INFO] 
12:47:21 [2019-12-21T17:47:21.803Z] [INFO] --- tycho-packaging-plugin:1.3.0:validate-version (default-validate-version) @ org.eclipse.tracecompass.analysis.counters.ui ---
12:47:21 [2019-12-21T17:47:21.803Z] [INFO] 
12:47:21 [2019-12-21T17:47:21.803Z] [INFO] --- maven-enforcer-plugin:1.4.1:enforce (enforce-maven-version) @ org.eclipse.tracecompass.analysis.counters.ui ---
12:47:21 [2019-12-21T17:47:21.803Z] [INFO] 
12:47:21 [2019-12-21T17:47:21.803Z] [INFO] --- maven-resources-plugin:3.0.2:resources (default-resources) @ org.eclipse.tracecompass.analysis.counters.ui ---
12:47:21 [2019-12-21T17:47:21.803Z] [INFO] Using 'UTF-8' encoding to copy filtered resources.
12:47:21 [2019-12-21T17:47:21.803Z] [INFO] skip non existing resourceDirectory /home/jenkins/agent/workspace/tracecompass-gerrit/analysis/org.eclipse.tracecompass.analysis.counters.ui/src/main/resources
12:47:21 [2019-12-21T17:47:21.803Z] [INFO] 
12:47:21 [2019-12-21T17:47:21.803Z] [INFO] --- tycho-compiler-plugin:1.3.0:compile (default-compile) @ org.eclipse.tracecompass.analysis.counters.ui ---
12:47:21 [2019-12-21T17:47:21.803Z] [INFO] Compiling 5 source files to /home/jenkins/agent/workspace/tracecompass-gerrit/analysis/org.eclipse.tracecompass.analysis.counters.ui/target/classes
12:47:22 [2019-12-21T17:47:22.365Z] [WARNING] /home/jenkins/agent/workspace/tracecompass-gerrit/analysis/org.eclipse.tracecompass.analysis.counters.ui/src/org/eclipse/tracecompass/analysis/counters/ui/CounterTreeViewer.java:[51] 
12:47:22 [2019-12-21T17:47:22.365Z] 	TmfGenericTreeEntry<TmfTreeDataModel> genericEntry = (TmfGenericTreeEntry<TmfTreeDataModel>) element;
12:47:22 [2019-12-21T17:47:22.365Z] 	                                                     ^^^^^^^^^^^^^^^^^^^^^^^^^^^^^^^^^^^^^^^^^^^^^^^
12:47:22 [2019-12-21T17:47:22.365Z] Type safety: Unchecked cast from Object to TmfGenericTreeEntry<TmfTreeDataModel>
12:47:22 [2019-12-21T17:47:22.365Z] [WARNING] /home/jenkins/agent/workspace/tracecompass-gerrit/analysis/org.eclipse.tracecompass.analysis.counters.ui/src/org/eclipse/tracecompass/analysis/counters/ui/CounterTreeViewer.java:[74] 
12:47:22 [2019-12-21T17:47:22.365Z] 	return () -> Lists.newArrayList(createColumn("Counters", Comparator.comparing(TmfGenericTreeEntry::getName)), new TmfTreeColumnData("Legend")); //$NON-NLS-1$ //$NON-NLS-2$
12:47:22 [2019-12-21T17:47:22.366Z] 	             ^^^^^^^^^^^^^^^^^^^^^^^^^^^^^^^^^^^^^^^^^^^^^^^^^^^^^^^^^^^^^^^^^^^^^^^^^^^^^^^^^^^^^^^^^^^^^^^^^^^^^^^^^^^^^^^^^^^^^^^^^^^^^^^^^
12:47:22 [2019-12-21T17:47:22.366Z] Null type safety (type annotations): The expression of type 'ArrayList<@NonNull TmfTreeColumnData>' needs unchecked conversion to conform to '@NonNull List<TmfTreeColumnData>'
12:47:22 [2019-12-21T17:47:22.366Z] [WARNING] /home/jenkins/agent/workspace/tracecompass-gerrit/analysis/org.eclipse.tracecompass.analysis.counters.ui/src/org/eclipse/tracecompass/analysis/counters/ui/CounterView.java:[90] 
12:47:22 [2019-12-21T17:47:22.366Z] 	action.setImageDescriptor(AbstractUIPlugin.imageDescriptorFromPlugin("org.eclipse.tracecompass.tmf.ui", "icons/elcl16/sigma.gif")); //$NON-NLS-1$ //$NON-NLS-2$
12:47:22 [2019-12-21T17:47:22.366Z] 	                                           ^^^^^^^^^^^^^^^^^^^^^^^^^^^^^^^^^^^^^^^^^^^^^^^^^^^^^^^^^^^^^^^^^^^^^^^^^^^^^^^^^^^^^^
12:47:22 [2019-12-21T17:47:22.366Z] The method imageDescriptorFromPlugin(String, String) from the type AbstractUIPlugin is deprecated
12:47:22 [2019-12-21T17:47:22.366Z] 3 problems (3 warnings)
12:47:22 [2019-12-21T17:47:22.366Z] [INFO] 
12:47:22 [2019-12-21T17:47:22.366Z] [INFO] --- maven-resources-plugin:3.0.2:testResources (default-testResources) @ org.eclipse.tracecompass.analysis.counters.ui ---
12:47:22 [2019-12-21T17:47:22.366Z] [INFO] Using 'UTF-8' encoding to copy filtered resources.
12:47:22 [2019-12-21T17:47:22.366Z] [INFO] skip non existing resourceDirectory /home/jenkins/agent/workspace/tracecompass-gerrit/analysis/org.eclipse.tracecompass.analysis.counters.ui/src/test/resources
12:47:22 [2019-12-21T17:47:22.366Z] [INFO] 
12:47:22 [2019-12-21T17:47:22.366Z] [INFO] --- tycho-source-plugin:1.3.0:plugin-source (plugin-source) @ org.eclipse.tracecompass.analysis.counters.ui ---
12:47:22 [2019-12-21T17:47:22.366Z] [INFO] Building jar: /home/jenkins/agent/workspace/tracecompass-gerrit/analysis/org.eclipse.tracecompass.analysis.counters.ui/target/org.eclipse.tracecompass.analysis.counters.ui-0.0.5-SNAPSHOT-sources.jar
12:47:22 [2019-12-21T17:47:22.366Z] [INFO] 
12:47:22 [2019-12-21T17:47:22.366Z] [INFO] --- target-platform-configuration:1.3.0:target-platform (default-target-platform) @ org.eclipse.tracecompass.analysis.counters.ui ---
12:47:22 [2019-12-21T17:47:22.366Z] [INFO] 
12:47:22 [2019-12-21T17:47:22.366Z] [INFO] --- tycho-packaging-plugin:1.3.0:package-plugin (default-package-plugin) @ org.eclipse.tracecompass.analysis.counters.ui ---
12:47:22 [2019-12-21T17:47:22.366Z] [INFO] Building jar: /home/jenkins/agent/workspace/tracecompass-gerrit/analysis/org.eclipse.tracecompass.analysis.counters.ui/target/org.eclipse.tracecompass.analysis.counters.ui-0.0.5-SNAPSHOT.jar
12:47:22 [2019-12-21T17:47:22.366Z] [INFO] 
12:47:22 [2019-12-21T17:47:22.366Z] [INFO] --- tycho-p2-plugin:1.3.0:p2-metadata-default (default-p2-metadata-default) @ org.eclipse.tracecompass.analysis.counters.ui ---
12:47:22 [2019-12-21T17:47:22.366Z] [INFO] 
12:47:22 [2019-12-21T17:47:22.366Z] [INFO] --- tycho-source-feature-plugin:1.3.0:source-feature (source-feature) @ org.eclipse.tracecompass.analysis.counters.ui ---
12:47:22 [2019-12-21T17:47:22.366Z] [INFO] 
12:47:22 [2019-12-21T17:47:22.366Z] [INFO] --- tycho-pack200b-plugin:1.3.0:pack (pack200-pack) @ org.eclipse.tracecompass.analysis.counters.ui ---
12:47:22 [2019-12-21T17:47:22.366Z] [INFO] Pack200 packing jar /home/jenkins/agent/workspace/tracecompass-gerrit/analysis/org.eclipse.tracecompass.analysis.counters.ui/target/org.eclipse.tracecompass.analysis.counters.ui-0.0.5-SNAPSHOT.jar
12:47:22 [2019-12-21T17:47:22.366Z] [INFO] 
12:47:22 [2019-12-21T17:47:22.366Z] [INFO] --- tycho-p2-plugin:1.3.0:p2-metadata (p2-metadata) @ org.eclipse.tracecompass.analysis.counters.ui ---
12:47:22 [2019-12-21T17:47:22.366Z] [INFO] 
12:47:22 [2019-12-21T17:47:22.366Z] [INFO] --- maven-install-plugin:2.5.2:install (default-install) @ org.eclipse.tracecompass.analysis.counters.ui ---
12:47:22 [2019-12-21T17:47:22.366Z] [INFO] Installing /home/jenkins/agent/workspace/tracecompass-gerrit/analysis/org.eclipse.tracecompass.analysis.counters.ui/target/org.eclipse.tracecompass.analysis.counters.ui-0.0.5-SNAPSHOT.jar to /home/jenkins/.m2/repository/org/eclipse/tracecompass/org.eclipse.tracecompass.analysis.counters.ui/0.0.5-SNAPSHOT/org.eclipse.tracecompass.analysis.counters.ui-0.0.5-SNAPSHOT.jar
12:47:22 [2019-12-21T17:47:22.366Z] [INFO] Installing /home/jenkins/agent/workspace/tracecompass-gerrit/analysis/org.eclipse.tracecompass.analysis.counters.ui/.polyglot.build.properties to /home/jenkins/.m2/repository/org/eclipse/tracecompass/org.eclipse.tracecompass.analysis.counters.ui/0.0.5-SNAPSHOT/org.eclipse.tracecompass.analysis.counters.ui-0.0.5-SNAPSHOT.pom
12:47:22 [2019-12-21T17:47:22.366Z] [INFO] Installing /home/jenkins/agent/workspace/tracecompass-gerrit/analysis/org.eclipse.tracecompass.analysis.counters.ui/target/org.eclipse.tracecompass.analysis.counters.ui-0.0.5-SNAPSHOT-sources.jar to /home/jenkins/.m2/repository/org/eclipse/tracecompass/org.eclipse.tracecompass.analysis.counters.ui/0.0.5-SNAPSHOT/org.eclipse.tracecompass.analysis.counters.ui-0.0.5-SNAPSHOT-sources.jar
12:47:22 [2019-12-21T17:47:22.366Z] [INFO] Installing /home/jenkins/agent/workspace/tracecompass-gerrit/analysis/org.eclipse.tracecompass.analysis.counters.ui/target/org.eclipse.tracecompass.analysis.counters.ui-0.0.5-SNAPSHOT.jar.pack.gz to /home/jenkins/.m2/repository/org/eclipse/tracecompass/org.eclipse.tracecompass.analysis.counters.ui/0.0.5-SNAPSHOT/org.eclipse.tracecompass.analysis.counters.ui-0.0.5-SNAPSHOT-pack200.jar.pack.gz
12:47:22 [2019-12-21T17:47:22.366Z] [INFO] Installing /home/jenkins/agent/workspace/tracecompass-gerrit/analysis/org.eclipse.tracecompass.analysis.counters.ui/target/p2content.xml to /home/jenkins/.m2/repository/org/eclipse/tracecompass/org.eclipse.tracecompass.analysis.counters.ui/0.0.5-SNAPSHOT/org.eclipse.tracecompass.analysis.counters.ui-0.0.5-SNAPSHOT-p2metadata.xml
12:47:22 [2019-12-21T17:47:22.366Z] [INFO] Installing /home/jenkins/agent/workspace/tracecompass-gerrit/analysis/org.eclipse.tracecompass.analysis.counters.ui/target/p2artifacts.xml to /home/jenkins/.m2/repository/org/eclipse/tracecompass/org.eclipse.tracecompass.analysis.counters.ui/0.0.5-SNAPSHOT/org.eclipse.tracecompass.analysis.counters.ui-0.0.5-SNAPSHOT-p2artifacts.xml
12:47:22 [2019-12-21T17:47:22.366Z] [INFO] 
12:47:22 [2019-12-21T17:47:22.366Z] [INFO] --- tycho-p2-plugin:1.3.0:update-local-index (default-update-local-index) @ org.eclipse.tracecompass.analysis.counters.ui ---
12:47:22 [2019-12-21T17:47:22.366Z] [INFO] 
12:47:22 [2019-12-21T17:47:22.366Z] [INFO] ---< org.eclipse.tracecompass:org.eclipse.tracecompass.tmf.ui.tests >---
12:47:22 [2019-12-21T17:47:22.366Z] [INFO] Building org.eclipse.tracecompass.tmf.ui.tests 1.0.12-SNAPSHOT  [24/138]
12:47:22 [2019-12-21T17:47:22.366Z] [INFO] ------------------------[ eclipse-test-plugin ]-------------------------
12:47:22 [2019-12-21T17:47:22.366Z] [INFO] 
12:47:22 [2019-12-21T17:47:22.366Z] [INFO] --- maven-clean-plugin:3.0.0:clean (default-clean) @ org.eclipse.tracecompass.tmf.ui.tests ---
12:47:22 [2019-12-21T17:47:22.366Z] [INFO] 
12:47:22 [2019-12-21T17:47:22.366Z] [INFO] --- tycho-packaging-plugin:1.3.0:build-qualifier (default-build-qualifier) @ org.eclipse.tracecompass.tmf.ui.tests ---
12:47:22 [2019-12-21T17:47:22.366Z] [INFO] The project's OSGi version is 1.0.12.201912211728
12:47:22 [2019-12-21T17:47:22.366Z] [INFO] 
12:47:22 [2019-12-21T17:47:22.366Z] [INFO] --- tycho-packaging-plugin:1.3.0:validate-id (default-validate-id) @ org.eclipse.tracecompass.tmf.ui.tests ---
12:47:22 [2019-12-21T17:47:22.366Z] [INFO] 
12:47:22 [2019-12-21T17:47:22.366Z] [INFO] --- tycho-packaging-plugin:1.3.0:validate-version (default-validate-version) @ org.eclipse.tracecompass.tmf.ui.tests ---
12:47:22 [2019-12-21T17:47:22.366Z] [INFO] 
12:47:22 [2019-12-21T17:47:22.366Z] [INFO] --- maven-enforcer-plugin:1.4.1:enforce (enforce-maven-version) @ org.eclipse.tracecompass.tmf.ui.tests ---
12:47:22 [2019-12-21T17:47:22.366Z] [INFO] 
12:47:22 [2019-12-21T17:47:22.366Z] [INFO] --- maven-resources-plugin:3.0.2:resources (default-resources) @ org.eclipse.tracecompass.tmf.ui.tests ---
12:47:22 [2019-12-21T17:47:22.366Z] [INFO] Using 'UTF-8' encoding to copy filtered resources.
12:47:22 [2019-12-21T17:47:22.366Z] [INFO] skip non existing resourceDirectory /home/jenkins/agent/workspace/tracecompass-gerrit/tmf/org.eclipse.tracecompass.tmf.ui.tests/src/main/resources
12:47:22 [2019-12-21T17:47:22.366Z] [INFO] 
12:47:22 [2019-12-21T17:47:22.366Z] [INFO] --- tycho-compiler-plugin:1.3.0:compile (default-compile) @ org.eclipse.tracecompass.tmf.ui.tests ---
12:47:22 [2019-12-21T17:47:22.366Z] [INFO] Compiling 55 source files to /home/jenkins/agent/workspace/tracecompass-gerrit/tmf/org.eclipse.tracecompass.tmf.ui.tests/target/classes
12:47:23 [2019-12-21T17:47:23.293Z] [WARNING] /home/jenkins/agent/workspace/tracecompass-gerrit/tmf/org.eclipse.tracecompass.tmf.ui.tests/src/org/eclipse/tracecompass/tmf/ui/tests/views/TmfViewFactoryTest.java:[123] 
12:47:23 [2019-12-21T17:47:23.293Z] 	assertFalse("New view from view id with suffix was not created", Arrays.asList(viewRefs).contains(thirdView));
12:47:23 [2019-12-21T17:47:23.293Z] 	                                                                                                  ^^^^^^^^^
12:47:23 [2019-12-21T17:47:23.293Z] Unlikely argument type IViewPart for contains(Object) on a Collection<IViewReference>
12:47:23 [2019-12-21T17:47:23.293Z] [WARNING] /home/jenkins/agent/workspace/tracecompass-gerrit/tmf/org.eclipse.tracecompass.tmf.ui.tests/widgetStubs/org/eclipse/tracecompass/tmf/ui/tests/uml2sd/trace/TmfUml2SDTestTrace.java:[105] 
12:47:23 [2019-12-21T17:47:23.293Z] 	return tmfEvent;
12:47:23 [2019-12-21T17:47:23.293Z] 	^^^^^^^^^^^^^^^^
12:47:23 [2019-12-21T17:47:23.293Z] Potential resource leak: 'stream' may not be closed at this location
12:47:23 [2019-12-21T17:47:23.293Z] [WARNING] /home/jenkins/agent/workspace/tracecompass-gerrit/tmf/org.eclipse.tracecompass.tmf.ui.tests/widgetStubs/org/eclipse/tracecompass/tmf/ui/tests/uml2sd/trace/TmfUml2SDTestTrace.java:[109] 
12:47:23 [2019-12-21T17:47:23.293Z] 	return null;
12:47:23 [2019-12-21T17:47:23.293Z] 	^^^^^^^^^^^^
12:47:23 [2019-12-21T17:47:23.293Z] Potential resource leak: 'stream' may not be closed at this location
12:47:23 [2019-12-21T17:47:23.293Z] 3 problems (3 warnings)
12:47:23 [2019-12-21T17:47:23.293Z] [INFO] 
12:47:23 [2019-12-21T17:47:23.293Z] [INFO] --- maven-resources-plugin:3.0.2:testResources (default-testResources) @ org.eclipse.tracecompass.tmf.ui.tests ---
12:47:23 [2019-12-21T17:47:23.293Z] [INFO] Using 'UTF-8' encoding to copy filtered resources.
12:47:23 [2019-12-21T17:47:23.293Z] [INFO] skip non existing resourceDirectory /home/jenkins/agent/workspace/tracecompass-gerrit/tmf/org.eclipse.tracecompass.tmf.ui.tests/src/test/resources
12:47:23 [2019-12-21T17:47:23.293Z] [INFO] 
12:47:23 [2019-12-21T17:47:23.293Z] [INFO] --- tycho-source-plugin:1.3.0:plugin-source (plugin-source) @ org.eclipse.tracecompass.tmf.ui.tests ---
12:47:23 [2019-12-21T17:47:23.293Z] [INFO] Building jar: /home/jenkins/agent/workspace/tracecompass-gerrit/tmf/org.eclipse.tracecompass.tmf.ui.tests/target/org.eclipse.tracecompass.tmf.ui.tests-1.0.12-SNAPSHOT-sources.jar
12:47:23 [2019-12-21T17:47:23.293Z] [INFO] 
12:47:23 [2019-12-21T17:47:23.293Z] [INFO] --- target-platform-configuration:1.3.0:target-platform (default-target-platform) @ org.eclipse.tracecompass.tmf.ui.tests ---
12:47:23 [2019-12-21T17:47:23.293Z] [INFO] 
12:47:23 [2019-12-21T17:47:23.293Z] [INFO] --- tycho-packaging-plugin:1.3.0:package-plugin (default-package-plugin) @ org.eclipse.tracecompass.tmf.ui.tests ---
12:47:23 [2019-12-21T17:47:23.550Z] [INFO] Building jar: /home/jenkins/agent/workspace/tracecompass-gerrit/tmf/org.eclipse.tracecompass.tmf.ui.tests/target/org.eclipse.tracecompass.tmf.ui.tests-1.0.12-SNAPSHOT.jar
12:47:23 [2019-12-21T17:47:23.550Z] [INFO] 
12:47:23 [2019-12-21T17:47:23.550Z] [INFO] --- tycho-p2-plugin:1.3.0:p2-metadata-default (default-p2-metadata-default) @ org.eclipse.tracecompass.tmf.ui.tests ---
12:47:23 [2019-12-21T17:47:23.550Z] [INFO] 
12:47:23 [2019-12-21T17:47:23.550Z] [INFO] --- tycho-source-feature-plugin:1.3.0:source-feature (source-feature) @ org.eclipse.tracecompass.tmf.ui.tests ---
12:47:23 [2019-12-21T17:47:23.550Z] [INFO] 
12:47:23 [2019-12-21T17:47:23.550Z] [INFO] --- tycho-pack200b-plugin:1.3.0:pack (pack200-pack) @ org.eclipse.tracecompass.tmf.ui.tests ---
12:47:23 [2019-12-21T17:47:23.550Z] [INFO] Pack200 packing jar /home/jenkins/agent/workspace/tracecompass-gerrit/tmf/org.eclipse.tracecompass.tmf.ui.tests/target/org.eclipse.tracecompass.tmf.ui.tests-1.0.12-SNAPSHOT.jar
12:47:23 [2019-12-21T17:47:23.807Z] [INFO] 
12:47:23 [2019-12-21T17:47:23.807Z] [INFO] --- tycho-p2-plugin:1.3.0:p2-metadata (p2-metadata) @ org.eclipse.tracecompass.tmf.ui.tests ---
12:47:24 [2019-12-21T17:47:24.064Z] [INFO] 
12:47:24 [2019-12-21T17:47:24.064Z] [INFO] --- tycho-surefire-plugin:1.3.0:test (default-test) @ org.eclipse.tracecompass.tmf.ui.tests ---
12:47:25 [2019-12-21T17:47:25.429Z] [INFO] Expected eclipse log file: /home/jenkins/agent/workspace/tracecompass-gerrit/tmf/org.eclipse.tracecompass.tmf.ui.tests/target/work/data/.metadata/.log
12:47:25 [2019-12-21T17:47:25.429Z] [INFO] Command line:
12:47:25 [2019-12-21T17:47:25.429Z] 	[/opt/tools/java/oracle/jdk-8/1.8.0_202/jre/bin/java, -Dosgi.noShutdown=false, -Dosgi.os=linux, -Dosgi.ws=gtk, -Dosgi.arch=x86_64, -Dorg.eclipse.swt.browser.DefaultType=mozilla, -Xms512m, -Xmx1024m, -Dosgi.clean=true, -jar, /home/jenkins/.m2/repository/p2/osgi/bundle/org.eclipse.equinox.launcher/1.5.600.v20191014-2022/org.eclipse.equinox.launcher-1.5.600.v20191014-2022.jar, -data, /home/jenkins/agent/workspace/tracecompass-gerrit/tmf/org.eclipse.tracecompass.tmf.ui.tests/target/work/data, -install, /home/jenkins/agent/workspace/tracecompass-gerrit/tmf/org.eclipse.tracecompass.tmf.ui.tests/target/work, -configuration, /home/jenkins/agent/workspace/tracecompass-gerrit/tmf/org.eclipse.tracecompass.tmf.ui.tests/target/work/configuration, -application, org.eclipse.tycho.surefire.osgibooter.uitest, -testproperties, /home/jenkins/agent/workspace/tracecompass-gerrit/tmf/org.eclipse.tracecompass.tmf.ui.tests/target/surefire.properties, -product, org.eclipse.platform.ide, -consoleLog]
12:47:25 [2019-12-21T17:47:25.429Z] Picked up _JAVA_OPTIONS: -Duser.home=/home/tracecompass
12:47:27 [2019-12-21T17:47:27.349Z] !SESSION 2019-12-21 17:47:25.217 -----------------------------------------------
12:47:27 [2019-12-21T17:47:27.349Z] eclipse.buildId=unknown
12:47:27 [2019-12-21T17:47:27.349Z] java.version=1.8.0_202
12:47:27 [2019-12-21T17:47:27.349Z] java.vendor=Oracle Corporation
12:47:27 [2019-12-21T17:47:27.349Z] BootLoader constants: OS=linux, ARCH=x86_64, WS=gtk, NL=en_US
12:47:27 [2019-12-21T17:47:27.349Z] Framework arguments:  -application org.eclipse.tycho.surefire.osgibooter.uitest -testproperties /home/jenkins/agent/workspace/tracecompass-gerrit/tmf/org.eclipse.tracecompass.tmf.ui.tests/target/surefire.properties -product org.eclipse.platform.ide
12:47:27 [2019-12-21T17:47:27.349Z] Command-line arguments:  -data /home/jenkins/agent/workspace/tracecompass-gerrit/tmf/org.eclipse.tracecompass.tmf.ui.tests/target/work/data -application org.eclipse.tycho.surefire.osgibooter.uitest -testproperties /home/jenkins/agent/workspace/tracecompass-gerrit/tmf/org.eclipse.tracecompass.tmf.ui.tests/target/surefire.properties -product org.eclipse.platform.ide -consoleLog
12:47:27 [2019-12-21T17:47:27.349Z] 
12:47:27 [2019-12-21T17:47:27.349Z] !ENTRY org.eclipse.compare.win32 4 0 2019-12-21 17:47:27.134
12:47:27 [2019-12-21T17:47:27.349Z] !MESSAGE FrameworkEvent ERROR
12:47:27 [2019-12-21T17:47:27.349Z] !STACK 0
12:47:27 [2019-12-21T17:47:27.349Z] org.osgi.framework.BundleException: Could not resolve module: org.eclipse.compare.win32 [65]
12:47:27 [2019-12-21T17:47:27.349Z]   Unresolved requirement: Require-Capability: eclipse.platform; filter:="(osgi.os=win32)"
12:47:27 [2019-12-21T17:47:27.349Z] 
12:47:27 [2019-12-21T17:47:27.349Z] 	at org.eclipse.osgi.container.Module.start(Module.java:462)
12:47:27 [2019-12-21T17:47:27.349Z] 	at org.eclipse.osgi.container.ModuleContainer$ContainerStartLevel$2.run(ModuleContainer.java:1844)
12:47:27 [2019-12-21T17:47:27.349Z] 	at org.eclipse.osgi.internal.framework.EquinoxContainerAdaptor$1$1.execute(EquinoxContainerAdaptor.java:136)
12:47:27 [2019-12-21T17:47:27.349Z] 	at org.eclipse.osgi.container.ModuleContainer$ContainerStartLevel.incStartLevel(ModuleContainer.java:1837)
12:47:27 [2019-12-21T17:47:27.349Z] 	at org.eclipse.osgi.container.ModuleContainer$ContainerStartLevel.incStartLevel(ModuleContainer.java:1778)
12:47:27 [2019-12-21T17:47:27.349Z] 	at org.eclipse.osgi.container.ModuleContainer$ContainerStartLevel.doContainerStartLevel(ModuleContainer.java:1742)
12:47:27 [2019-12-21T17:47:27.349Z] 	at org.eclipse.osgi.container.ModuleContainer$ContainerStartLevel.dispatchEvent(ModuleContainer.java:1664)
12:47:27 [2019-12-21T17:47:27.349Z] 	at org.eclipse.osgi.container.ModuleContainer$ContainerStartLevel.dispatchEvent(ModuleContainer.java:1)
12:47:27 [2019-12-21T17:47:27.349Z] 	at org.eclipse.osgi.framework.eventmgr.EventManager.dispatchEvent(EventManager.java:234)
12:47:27 [2019-12-21T17:47:27.349Z] 	at org.eclipse.osgi.framework.eventmgr.EventManager$EventThread.run(EventManager.java:345)
12:47:27 [2019-12-21T17:47:27.349Z] 
12:47:27 [2019-12-21T17:47:27.349Z] !ENTRY org.eclipse.ecf.provider.filetransfer.httpclient45.win32 4 0 2019-12-21 17:47:27.254
12:47:27 [2019-12-21T17:47:27.349Z] !MESSAGE FrameworkEvent ERROR
12:47:27 [2019-12-21T17:47:27.349Z] !STACK 0
12:47:27 [2019-12-21T17:47:27.349Z] org.osgi.framework.BundleException: Could not resolve module: org.eclipse.ecf.provider.filetransfer.httpclient45.win32 [133]
12:47:27 [2019-12-21T17:47:27.349Z]   Unresolved requirement: Require-Capability: eclipse.platform; filter:="(osgi.os=win32)"
12:47:27 [2019-12-21T17:47:27.349Z]   Unresolved requirement: Import-Package: org.apache.http.impl.auth.win; version="[4.5.0,5.0.0)"
12:47:27 [2019-12-21T17:47:27.349Z]     -> Export-Package: org.apache.http.impl.auth.win; bundle-symbolic-name="org.apache.httpcomponents.httpclient.win"; bundle-version="4.5.6.v20190213-1947"; version="4.5.6"; x-internal:="true"; uses:="org.apache.http,org.apache.http.auth,org.apache.http.client,org.apache.http.impl.auth,org.apache.http.protocol,org.apache.http.util"
12:47:27 [2019-12-21T17:47:27.349Z]        org.apache.httpcomponents.httpclient.win [36]
12:47:27 [2019-12-21T17:47:27.349Z]          Unresolved requirement: Require-Capability: eclipse.platform; filter:="(osgi.os=win32)"
12:47:27 [2019-12-21T17:47:27.349Z] 
12:47:27 [2019-12-21T17:47:27.349Z] 	at org.eclipse.osgi.container.Module.start(Module.java:462)
12:47:27 [2019-12-21T17:47:27.349Z] 	at org.eclipse.osgi.container.ModuleContainer$ContainerStartLevel$2.run(ModuleContainer.java:1844)
12:47:27 [2019-12-21T17:47:27.349Z] 	at org.eclipse.osgi.internal.framework.EquinoxContainerAdaptor$1$1.execute(EquinoxContainerAdaptor.java:136)
12:47:27 [2019-12-21T17:47:27.349Z] 	at org.eclipse.osgi.container.ModuleContainer$ContainerStartLevel.incStartLevel(ModuleContainer.java:1837)
12:47:27 [2019-12-21T17:47:27.349Z] 	at org.eclipse.osgi.container.ModuleContainer$ContainerStartLevel.incStartLevel(ModuleContainer.java:1778)
12:47:27 [2019-12-21T17:47:27.349Z] 	at org.eclipse.osgi.container.ModuleContainer$ContainerStartLevel.doContainerStartLevel(ModuleContainer.java:1742)
12:47:27 [2019-12-21T17:47:27.349Z] 	at org.eclipse.osgi.container.ModuleContainer$ContainerStartLevel.dispatchEvent(ModuleContainer.java:1664)
12:47:27 [2019-12-21T17:47:27.350Z] 	at org.eclipse.osgi.container.ModuleContainer$ContainerStartLevel.dispatchEvent(ModuleContainer.java:1)
12:47:27 [2019-12-21T17:47:27.350Z] 	at org.eclipse.osgi.framework.eventmgr.EventManager.dispatchEvent(EventManager.java:234)
12:47:27 [2019-12-21T17:47:27.350Z] 	at org.eclipse.osgi.framework.eventmgr.EventManager$EventThread.run(EventManager.java:345)
12:47:28 [2019-12-21T17:47:28.714Z] process 4239: D-Bus library appears to be incorrectly set up; failed to read machine uuid: UUID file '/etc/machine-id' should contain a hex string of length 32, not length 0, with no other text
12:47:28 [2019-12-21T17:47:28.714Z] See the manual page for dbus-uuidgen to correct this issue.
12:47:28 [2019-12-21T17:47:28.970Z] SWT SessionManagerDBus: Failed to connect to org.gnome.SessionManager: Failed to execute child process "dbus-launch" (No such file or directory)
12:47:28 [2019-12-21T17:47:28.970Z] SWT SessionManagerDBus: Failed to connect to org.xfce.SessionManager: Failed to execute child process "dbus-launch" (No such file or directory)
12:47:35 [2019-12-21T17:47:35.506Z] Running org.eclipse.tracecompass.tmf.ui.tests.views.uml2sd.loader.TmfUml2SDSyncLoaderSignalTest
12:47:50 [2019-12-21T17:47:50.347Z] Tests run: 2, Failures: 0, Errors: 0, Skipped: 0, Time elapsed: 14.2 s - in org.eclipse.tracecompass.tmf.ui.tests.views.uml2sd.loader.TmfUml2SDSyncLoaderSignalTest
12:47:50 [2019-12-21T17:47:50.347Z] verifyFirstPageSignal(org.eclipse.tracecompass.tmf.ui.tests.views.uml2sd.loader.TmfUml2SDSyncLoaderSignalTest)  Time elapsed: 1.383 s
12:47:50 [2019-12-21T17:47:50.347Z] verifySelectionSignal(org.eclipse.tracecompass.tmf.ui.tests.views.uml2sd.loader.TmfUml2SDSyncLoaderSignalTest)  Time elapsed: 0.003 s
12:47:50 [2019-12-21T17:47:50.347Z] Running org.eclipse.tracecompass.tmf.ui.tests.views.uml2sd.loader.TmfUml2SDSyncLoaderExpTest
12:48:16 [2019-12-21T17:48:16.840Z] Tests run: 5, Failures: 0, Errors: 0, Skipped: 0, Time elapsed: 25.665 s - in org.eclipse.tracecompass.tmf.ui.tests.views.uml2sd.loader.TmfUml2SDSyncLoaderExpTest
12:48:16 [2019-12-21T17:48:16.840Z] verifySetup(org.eclipse.tracecompass.tmf.ui.tests.views.uml2sd.loader.TmfUml2SDSyncLoaderExpTest)  Time elapsed: 2.057 s
12:48:16 [2019-12-21T17:48:16.840Z] verifyCancel(org.eclipse.tracecompass.tmf.ui.tests.views.uml2sd.loader.TmfUml2SDSyncLoaderExpTest)  Time elapsed: 15.88 s
12:48:16 [2019-12-21T17:48:16.840Z] verifyLoaderDispose(org.eclipse.tracecompass.tmf.ui.tests.views.uml2sd.loader.TmfUml2SDSyncLoaderExpTest)  Time elapsed: 0.053 s
12:48:16 [2019-12-21T17:48:16.840Z] testSetViewer(org.eclipse.tracecompass.tmf.ui.tests.views.uml2sd.loader.TmfUml2SDSyncLoaderExpTest)  Time elapsed: 0.124 s
12:48:16 [2019-12-21T17:48:16.840Z] verifyDispose(org.eclipse.tracecompass.tmf.ui.tests.views.uml2sd.loader.TmfUml2SDSyncLoaderExpTest)  Time elapsed: 0.001 s
12:48:16 [2019-12-21T17:48:16.840Z] Running org.eclipse.tracecompass.tmf.ui.tests.views.uml2sd.loader.TmfUml2SDSyncLoaderFindTest
12:48:38 [2019-12-21T17:48:38.732Z] Tests run: 4, Failures: 0, Errors: 0, Skipped: 0, Time elapsed: 21.173 s - in org.eclipse.tracecompass.tmf.ui.tests.views.uml2sd.loader.TmfUml2SDSyncLoaderFindTest
12:48:38 [2019-12-21T17:48:38.732Z] verifyFirstMessage(org.eclipse.tracecompass.tmf.ui.tests.views.uml2sd.loader.TmfUml2SDSyncLoaderFindTest)  Time elapsed: 3.583 s
12:48:38 [2019-12-21T17:48:38.732Z] verifyFind(org.eclipse.tracecompass.tmf.ui.tests.views.uml2sd.loader.TmfUml2SDSyncLoaderFindTest)  Time elapsed: 5.601 s
12:48:38 [2019-12-21T17:48:38.732Z] verifyISDGraphNodeSupporter(org.eclipse.tracecompass.tmf.ui.tests.views.uml2sd.loader.TmfUml2SDSyncLoaderFindTest)  Time elapsed: 1.495 s
12:48:38 [2019-12-21T17:48:38.732Z] verifyCancelSearch(org.eclipse.tracecompass.tmf.ui.tests.views.uml2sd.loader.TmfUml2SDSyncLoaderFindTest)  Time elapsed: 2.895 s
12:48:38 [2019-12-21T17:48:38.732Z] Running org.eclipse.tracecompass.tmf.ui.tests.views.uml2sd.loader.TmfUml2SDSyncLoaderPagesTest
12:49:25 [2019-12-21T17:49:25.361Z] Tests run: 6, Failures: 0, Errors: 0, Skipped: 0, Time elapsed: 42.002 s - in org.eclipse.tracecompass.tmf.ui.tests.views.uml2sd.loader.TmfUml2SDSyncLoaderPagesTest
12:49:25 [2019-12-21T17:49:25.361Z] verifyLastPage(org.eclipse.tracecompass.tmf.ui.tests.views.uml2sd.loader.TmfUml2SDSyncLoaderPagesTest)  Time elapsed: 2.582 s
12:49:25 [2019-12-21T17:49:25.361Z] verifyPrevPage(org.eclipse.tracecompass.tmf.ui.tests.views.uml2sd.loader.TmfUml2SDSyncLoaderPagesTest)  Time elapsed: 13.152 s
12:49:25 [2019-12-21T17:49:25.361Z] verifyPageNumberChanged(org.eclipse.tracecompass.tmf.ui.tests.views.uml2sd.loader.TmfUml2SDSyncLoaderPagesTest)  Time elapsed: 3.099 s
12:49:25 [2019-12-21T17:49:25.361Z] verifyFirstPage(org.eclipse.tracecompass.tmf.ui.tests.views.uml2sd.loader.TmfUml2SDSyncLoaderPagesTest)  Time elapsed: 2.601 s
12:49:25 [2019-12-21T17:49:25.361Z] verifyPagesCount(org.eclipse.tracecompass.tmf.ui.tests.views.uml2sd.loader.TmfUml2SDSyncLoaderPagesTest)  Time elapsed: 0 s
12:49:25 [2019-12-21T17:49:25.361Z] verifyNextPage(org.eclipse.tracecompass.tmf.ui.tests.views.uml2sd.loader.TmfUml2SDSyncLoaderPagesTest)  Time elapsed: 13.218 s
12:49:25 [2019-12-21T17:49:25.361Z] Running org.eclipse.tracecompass.tmf.ui.tests.views.uml2sd.loader.TmfUml2SDSyncLoaderTimeTest
12:49:40 [2019-12-21T17:49:40.200Z] Tests run: 9, Failures: 0, Errors: 0, Skipped: 0, Time elapsed: 20.827 s - in org.eclipse.tracecompass.tmf.ui.tests.views.uml2sd.loader.TmfUml2SDSyncLoaderTimeTest
12:49:40 [2019-12-21T17:49:40.200Z] verifyTimeRangeSamePage(org.eclipse.tracecompass.tmf.ui.tests.views.uml2sd.loader.TmfUml2SDSyncLoaderTimeTest)  Time elapsed: 1.367 s
12:49:40 [2019-12-21T17:49:40.200Z] verifyTimeRangeDifferentPages(org.eclipse.tracecompass.tmf.ui.tests.views.uml2sd.loader.TmfUml2SDSyncLoaderTimeTest)  Time elapsed: 1.555 s
12:49:40 [2019-12-21T17:49:40.200Z] verifySynchToTimeEqualsLast(org.eclipse.tracecompass.tmf.ui.tests.views.uml2sd.loader.TmfUml2SDSyncLoaderTimeTest)  Time elapsed: 1.498 s
12:49:40 [2019-12-21T17:49:40.200Z] verifySynchToTimeBeforeExpStart(org.eclipse.tracecompass.tmf.ui.tests.views.uml2sd.loader.TmfUml2SDSyncLoaderTimeTest)  Time elapsed: 1.362 s
12:49:40 [2019-12-21T17:49:40.200Z] verifySynchToTimeAfterExpEnd(org.eclipse.tracecompass.tmf.ui.tests.views.uml2sd.loader.TmfUml2SDSyncLoaderTimeTest)  Time elapsed: 1.232 s
12:49:40 [2019-12-21T17:49:40.200Z] verifySynchToTimeInPage(org.eclipse.tracecompass.tmf.ui.tests.views.uml2sd.loader.TmfUml2SDSyncLoaderTimeTest)  Time elapsed: 1.356 s
12:49:40 [2019-12-21T17:49:40.200Z] verifySynchToTimeNonExisting(org.eclipse.tracecompass.tmf.ui.tests.views.uml2sd.loader.TmfUml2SDSyncLoaderTimeTest)  Time elapsed: 1.927 s
12:49:40 [2019-12-21T17:49:40.200Z] verifySynchToTimeFirst(org.eclipse.tracecompass.tmf.ui.tests.views.uml2sd.loader.TmfUml2SDSyncLoaderTimeTest)  Time elapsed: 1.535 s
12:49:40 [2019-12-21T17:49:40.200Z] verifySynchToTimeOutsidePage(org.eclipse.tracecompass.tmf.ui.tests.views.uml2sd.loader.TmfUml2SDSyncLoaderTimeTest)  Time elapsed: 1.493 s
12:49:40 [2019-12-21T17:49:40.200Z] Running org.eclipse.tracecompass.tmf.ui.tests.views.uml2sd.loader.TmfUml2SDSyncLoaderFilterTest
12:50:06 [2019-12-21T17:50:06.708Z] Tests run: 5, Failures: 0, Errors: 0, Skipped: 0, Time elapsed: 25.92 s - in org.eclipse.tracecompass.tmf.ui.tests.views.uml2sd.loader.TmfUml2SDSyncLoaderFilterTest
12:50:06 [2019-12-21T17:50:06.708Z] verifyMessageFilter(org.eclipse.tracecompass.tmf.ui.tests.views.uml2sd.loader.TmfUml2SDSyncLoaderFilterTest)  Time elapsed: 3.436 s
12:50:06 [2019-12-21T17:50:06.708Z] verifyRemoval(org.eclipse.tracecompass.tmf.ui.tests.views.uml2sd.loader.TmfUml2SDSyncLoaderFilterTest)  Time elapsed: 4.43 s
12:50:06 [2019-12-21T17:50:06.708Z] verifyFilter1of2(org.eclipse.tracecompass.tmf.ui.tests.views.uml2sd.loader.TmfUml2SDSyncLoaderFilterTest)  Time elapsed: 3.374 s
12:50:06 [2019-12-21T17:50:06.708Z] verifyFilter1of3(org.eclipse.tracecompass.tmf.ui.tests.views.uml2sd.loader.TmfUml2SDSyncLoaderFilterTest)  Time elapsed: 3.96 s
12:50:06 [2019-12-21T17:50:06.708Z] verifyFilter2of2(org.eclipse.tracecompass.tmf.ui.tests.views.uml2sd.loader.TmfUml2SDSyncLoaderFilterTest)  Time elapsed: 3.355 s
12:50:06 [2019-12-21T17:50:06.708Z] Running org.eclipse.tracecompass.tmf.ui.tests.views.uml2sd.dialogs.CriteriaTest
12:50:06 [2019-12-21T17:50:06.708Z] Tests run: 8, Failures: 0, Errors: 0, Skipped: 0, Time elapsed: 0.003 s - in org.eclipse.tracecompass.tmf.ui.tests.views.uml2sd.dialogs.CriteriaTest
12:50:06 [2019-12-21T17:50:06.708Z] testCriteria(org.eclipse.tracecompass.tmf.ui.tests.views.uml2sd.dialogs.CriteriaTest)  Time elapsed: 0 s
12:50:06 [2019-12-21T17:50:06.708Z] testAccessors(org.eclipse.tracecompass.tmf.ui.tests.views.uml2sd.dialogs.CriteriaTest)  Time elapsed: 0 s
12:50:06 [2019-12-21T17:50:06.708Z] testLoad(org.eclipse.tracecompass.tmf.ui.tests.views.uml2sd.dialogs.CriteriaTest)  Time elapsed: 0 s
12:50:06 [2019-12-21T17:50:06.708Z] testSave(org.eclipse.tracecompass.tmf.ui.tests.views.uml2sd.dialogs.CriteriaTest)  Time elapsed: 0 s
12:50:06 [2019-12-21T17:50:06.708Z] testCompareTo(org.eclipse.tracecompass.tmf.ui.tests.views.uml2sd.dialogs.CriteriaTest)  Time elapsed: 0.001 s
12:50:06 [2019-12-21T17:50:06.708Z] testCriteriaCriteria(org.eclipse.tracecompass.tmf.ui.tests.views.uml2sd.dialogs.CriteriaTest)  Time elapsed: 0 s
12:50:06 [2019-12-21T17:50:06.708Z] testMatches(org.eclipse.tracecompass.tmf.ui.tests.views.uml2sd.dialogs.CriteriaTest)  Time elapsed: 0 s
12:50:06 [2019-12-21T17:50:06.708Z] testGetGraphNodeSummary(org.eclipse.tracecompass.tmf.ui.tests.views.uml2sd.dialogs.CriteriaTest)  Time elapsed: 0.001 s
12:50:06 [2019-12-21T17:50:06.708Z] Running org.eclipse.tracecompass.tmf.ui.tests.views.uml2sd.load.LoadersManagerTest
12:50:06 [2019-12-21T17:50:06.708Z] Tests run: 1, Failures: 0, Errors: 0, Skipped: 0, Time elapsed: 1.195 s - in org.eclipse.tracecompass.tmf.ui.tests.views.uml2sd.load.LoadersManagerTest
12:50:06 [2019-12-21T17:50:06.708Z] testLoaderManager(org.eclipse.tracecompass.tmf.ui.tests.views.uml2sd.load.LoadersManagerTest)  Time elapsed: 1.195 s
12:50:06 [2019-12-21T17:50:06.708Z] Running org.eclipse.tracecompass.tmf.ui.tests.views.TmfViewFactoryTest
12:50:06 [2019-12-21T17:50:06.708Z] Tests run: 2, Failures: 0, Errors: 0, Skipped: 0, Time elapsed: 0.104 s - in org.eclipse.tracecompass.tmf.ui.tests.views.TmfViewFactoryTest
12:50:06 [2019-12-21T17:50:06.708Z] testGetBaseSecId(org.eclipse.tracecompass.tmf.ui.tests.views.TmfViewFactoryTest)  Time elapsed: 0.001 s
12:50:06 [2019-12-21T17:50:06.708Z] testNewView(org.eclipse.tracecompass.tmf.ui.tests.views.TmfViewFactoryTest)  Time elapsed: 0.101 s
12:50:06 [2019-12-21T17:50:06.708Z] Running org.eclipse.tracecompass.tmf.ui.tests.views.FormatTimeUtilsTest
12:50:06 [2019-12-21T17:50:06.708Z] Tests run: 2, Failures: 0, Errors: 0, Skipped: 0, Time elapsed: 0.003 s - in org.eclipse.tracecompass.tmf.ui.tests.views.FormatTimeUtilsTest
12:50:06 [2019-12-21T17:50:06.708Z] testFormatTimeRelative(org.eclipse.tracecompass.tmf.ui.tests.views.FormatTimeUtilsTest)  Time elapsed: 0.003 s
12:50:06 [2019-12-21T17:50:06.708Z] testFormatTimeCalendar(org.eclipse.tracecompass.tmf.ui.tests.views.FormatTimeUtilsTest)  Time elapsed: 0 s
12:50:06 [2019-12-21T17:50:06.708Z] Running org.eclipse.tracecompass.tmf.ui.tests.actions.TraceImportOperationTest
12:50:11 [2019-12-21T17:50:11.956Z] Tests run: 3, Failures: 0, Errors: 0, Skipped: 0, Time elapsed: 4.276 s - in org.eclipse.tracecompass.tmf.ui.tests.actions.TraceImportOperationTest
12:50:11 [2019-12-21T17:50:11.956Z] testTimeRangeFiltering(org.eclipse.tracecompass.tmf.ui.tests.actions.TraceImportOperationTest)  Time elapsed: 1.192 s
12:50:11 [2019-12-21T17:50:11.956Z] test(org.eclipse.tracecompass.tmf.ui.tests.actions.TraceImportOperationTest)  Time elapsed: 1.015 s
12:50:11 [2019-12-21T17:50:11.956Z] testSkipArchiveExtraction(org.eclipse.tracecompass.tmf.ui.tests.actions.TraceImportOperationTest)  Time elapsed: 1.461 s
12:50:11 [2019-12-21T17:50:11.956Z] Running org.eclipse.tracecompass.tmf.ui.tests.actions.HttpTraceImportOperationTest
12:50:18 [2019-12-21T17:50:18.495Z] Tests run: 3, Failures: 0, Errors: 0, Skipped: 0, Time elapsed: 6.538 s - in org.eclipse.tracecompass.tmf.ui.tests.actions.HttpTraceImportOperationTest
12:50:18 [2019-12-21T17:50:18.495Z] testTraceImport(org.eclipse.tracecompass.tmf.ui.tests.actions.HttpTraceImportOperationTest)  Time elapsed: 5.415 s
12:50:18 [2019-12-21T17:50:18.495Z] testMultipleTracesImport(org.eclipse.tracecompass.tmf.ui.tests.actions.HttpTraceImportOperationTest)  Time elapsed: 0.499 s
12:50:18 [2019-12-21T17:50:18.495Z] testArchiveImport(org.eclipse.tracecompass.tmf.ui.tests.actions.HttpTraceImportOperationTest)  Time elapsed: 0.61 s
12:50:18 [2019-12-21T17:50:18.495Z] Running org.eclipse.tracecompass.tmf.ui.tests.actions.SelectTracesOperationTest
12:50:18 [2019-12-21T17:50:18.495Z] Tests run: 2, Failures: 0, Errors: 0, Skipped: 0, Time elapsed: 0.817 s - in org.eclipse.tracecompass.tmf.ui.tests.actions.SelectTracesOperationTest
12:50:18 [2019-12-21T17:50:18.495Z] testOperationTimeRange(org.eclipse.tracecompass.tmf.ui.tests.actions.SelectTracesOperationTest)  Time elapsed: 0.376 s
12:50:18 [2019-12-21T17:50:18.495Z] testBasicOperation(org.eclipse.tracecompass.tmf.ui.tests.actions.SelectTracesOperationTest)  Time elapsed: 0.44 s
12:50:18 [2019-12-21T17:50:18.495Z] Running org.eclipse.tracecompass.tmf.ui.tests.actions.DownloadTraceHttpHelperTest
12:50:18 [2019-12-21T17:50:18.495Z] Tests run: 3, Failures: 0, Errors: 0, Skipped: 0, Time elapsed: 0.04 s - in org.eclipse.tracecompass.tmf.ui.tests.actions.DownloadTraceHttpHelperTest
12:50:18 [2019-12-21T17:50:18.495Z] testTraceDownload(org.eclipse.tracecompass.tmf.ui.tests.actions.DownloadTraceHttpHelperTest)  Time elapsed: 0.033 s
12:50:18 [2019-12-21T17:50:18.495Z] testArchiveTraceDownload(org.eclipse.tracecompass.tmf.ui.tests.actions.DownloadTraceHttpHelperTest)  Time elapsed: 0.003 s
12:50:18 [2019-12-21T17:50:18.495Z] testMutlipleTracesDownload(org.eclipse.tracecompass.tmf.ui.tests.actions.DownloadTraceHttpHelperTest)  Time elapsed: 0.003 s
12:50:18 [2019-12-21T17:50:18.495Z] Running org.eclipse.tracecompass.tmf.ui.tests.project.model.ProjectModelTraceTest
12:50:19 [2019-12-21T17:50:19.425Z] Tests run: 1, Failures: 0, Errors: 0, Skipped: 0, Time elapsed: 0.898 s - in org.eclipse.tracecompass.tmf.ui.tests.project.model.ProjectModelTraceTest
12:50:19 [2019-12-21T17:50:19.425Z] testOpenTrace(org.eclipse.tracecompass.tmf.ui.tests.project.model.ProjectModelTraceTest)  Time elapsed: 0.898 s
12:50:19 [2019-12-21T17:50:19.425Z] Running org.eclipse.tracecompass.tmf.ui.tests.project.model.TraceAndExperimentTypeTest
12:50:22 [2019-12-21T17:50:22.128Z] Tests run: 5, Failures: 0, Errors: 0, Skipped: 0, Time elapsed: 2.566 s - in org.eclipse.tracecompass.tmf.ui.tests.project.model.TraceAndExperimentTypeTest
12:50:22 [2019-12-21T17:50:22.128Z] testExperimentTypeAnalysis(org.eclipse.tracecompass.tmf.ui.tests.project.model.TraceAndExperimentTypeTest)  Time elapsed: 0.126 s
12:50:22 [2019-12-21T17:50:22.128Z] testDefaultExperimentType(org.eclipse.tracecompass.tmf.ui.tests.project.model.TraceAndExperimentTypeTest)  Time elapsed: 0.384 s
12:50:22 [2019-12-21T17:50:22.128Z] testNoExperimentTypeChildren(org.eclipse.tracecompass.tmf.ui.tests.project.model.TraceAndExperimentTypeTest)  Time elapsed: 0.481 s
12:50:22 [2019-12-21T17:50:22.128Z] testExperimentType(org.eclipse.tracecompass.tmf.ui.tests.project.model.TraceAndExperimentTypeTest)  Time elapsed: 0.61 s
12:50:22 [2019-12-21T17:50:22.128Z] testExperimentTypeChildren(org.eclipse.tracecompass.tmf.ui.tests.project.model.TraceAndExperimentTypeTest)  Time elapsed: 0.965 s
12:50:22 [2019-12-21T17:50:22.128Z] Running org.eclipse.tracecompass.tmf.ui.tests.project.model.TmfProjectRegistryTest
12:50:22 [2019-12-21T17:50:22.404Z] 
12:50:22 [2019-12-21T17:50:22.404Z] !ENTRY org.eclipse.cdt.core 1 0 2019-12-21 17:50:22.241
12:50:22 [2019-12-21T17:50:22.404Z] !MESSAGE Indexed 'SomeProject' (0 sources, 0 headers) in 0.002 sec: 0 declarations; 0 references; 0 unresolved inclusions; 0 syntax errors; 0 unresolved names (0%)
12:50:22 [2019-12-21T17:50:22.704Z] 
12:50:22 [2019-12-21T17:50:22.704Z] !ENTRY org.eclipse.cdt.core 1 0 2019-12-21 17:50:22.527
12:50:22 [2019-12-21T17:50:22.704Z] !MESSAGE Indexed 'SomeProject2' (0 sources, 0 headers) in 0 sec: 0 declarations; 0 references; 0 unresolved inclusions; 0 syntax errors; 0 unresolved names (0%)
12:50:22 [2019-12-21T17:50:22.704Z] 
12:50:22 [2019-12-21T17:50:22.704Z] !ENTRY org.eclipse.core.resources 2 2 2019-12-21 17:50:22.530
12:50:22 [2019-12-21T17:50:22.704Z] !MESSAGE Save operation warnings.
12:50:22 [2019-12-21T17:50:22.704Z] !SUBENTRY 1 org.eclipse.core.resources 2 234 2019-12-21 17:50:22.531
12:50:22 [2019-12-21T17:50:22.704Z] !MESSAGE The project description file (.project) for '.tracecompass-SomeProject' was missing.  This file contains important information about the project.  A new project description file has been created, but some information about the project may have been lost.
12:50:22 [2019-12-21T17:50:22.704Z] Tests run: 3, Failures: 0, Errors: 0, Skipped: 0, Time elapsed: 0.804 s - in org.eclipse.tracecompass.tmf.ui.tests.project.model.TmfProjectRegistryTest
12:50:22 [2019-12-21T17:50:22.704Z] testAddingTracingNature(org.eclipse.tracecompass.tmf.ui.tests.project.model.TmfProjectRegistryTest)  Time elapsed: 0.513 s
12:50:22 [2019-12-21T17:50:22.704Z] testCreateTracingProject(org.eclipse.tracecompass.tmf.ui.tests.project.model.TmfProjectRegistryTest)  Time elapsed: 0.073 s
12:50:22 [2019-12-21T17:50:22.704Z] testAddingTracingNatureNotAllowed(org.eclipse.tracecompass.tmf.ui.tests.project.model.TmfProjectRegistryTest)  Time elapsed: 0 s
12:50:22 [2019-12-21T17:50:22.704Z] Running org.eclipse.tracecompass.tmf.ui.tests.project.model.ProjectModelAnalysisTest
12:50:23 [2019-12-21T17:50:23.311Z] Tests run: 3, Failures: 0, Errors: 0, Skipped: 0, Time elapsed: 0.638 s - in org.eclipse.tracecompass.tmf.ui.tests.project.model.ProjectModelAnalysisTest
12:50:23 [2019-12-21T17:50:23.311Z] testListAnalysis(org.eclipse.tracecompass.tmf.ui.tests.project.model.ProjectModelAnalysisTest)  Time elapsed: 0.02 s
12:50:23 [2019-12-21T17:50:23.311Z] testPopulate(org.eclipse.tracecompass.tmf.ui.tests.project.model.ProjectModelAnalysisTest)  Time elapsed: 0.067 s
12:50:23 [2019-12-21T17:50:23.311Z] testInstantiate(org.eclipse.tracecompass.tmf.ui.tests.project.model.ProjectModelAnalysisTest)  Time elapsed: 0.55 s
12:50:23 [2019-12-21T17:50:23.311Z] Running org.eclipse.tracecompass.tmf.ui.tests.project.model.ProjectModelOutputTest
12:50:24 [2019-12-21T17:50:24.676Z] Tests run: 2, Failures: 0, Errors: 0, Skipped: 0, Time elapsed: 1.36 s - in org.eclipse.tracecompass.tmf.ui.tests.project.model.ProjectModelOutputTest
12:50:24 [2019-12-21T17:50:24.676Z] testListOutputs(org.eclipse.tracecompass.tmf.ui.tests.project.model.ProjectModelOutputTest)  Time elapsed: 0.567 s
12:50:24 [2019-12-21T17:50:24.676Z] testOpenView(org.eclipse.tracecompass.tmf.ui.tests.project.model.ProjectModelOutputTest)  Time elapsed: 0.793 s
12:50:24 [2019-12-21T17:50:24.676Z] Running org.eclipse.tracecompass.tmf.ui.tests.statistics.TmfTreeContentProviderTest
12:50:24 [2019-12-21T17:50:24.676Z] Tests run: 4, Failures: 0, Errors: 0, Skipped: 0, Time elapsed: 0.003 s - in org.eclipse.tracecompass.tmf.ui.tests.statistics.TmfTreeContentProviderTest
12:50:24 [2019-12-21T17:50:24.676Z] testGetChildren(org.eclipse.tracecompass.tmf.ui.tests.statistics.TmfTreeContentProviderTest)  Time elapsed: 0.001 s
12:50:24 [2019-12-21T17:50:24.676Z] testHasChildren(org.eclipse.tracecompass.tmf.ui.tests.statistics.TmfTreeContentProviderTest)  Time elapsed: 0 s
12:50:24 [2019-12-21T17:50:24.676Z] testGetParent(org.eclipse.tracecompass.tmf.ui.tests.statistics.TmfTreeContentProviderTest)  Time elapsed: 0 s
12:50:24 [2019-12-21T17:50:24.676Z] testGetElements(org.eclipse.tracecompass.tmf.ui.tests.statistics.TmfTreeContentProviderTest)  Time elapsed: 0 s
12:50:24 [2019-12-21T17:50:24.676Z] Running org.eclipse.tracecompass.tmf.ui.tests.statistics.TmfStatisticsTreeManagerTest
12:50:24 [2019-12-21T17:50:24.676Z] Tests run: 6, Failures: 0, Errors: 0, Skipped: 0, Time elapsed: 0.001 s - in org.eclipse.tracecompass.tmf.ui.tests.statistics.TmfStatisticsTreeManagerTest
12:50:24 [2019-12-21T17:50:24.676Z] testaddStatsTreeRoot(org.eclipse.tracecompass.tmf.ui.tests.statistics.TmfStatisticsTreeManagerTest)  Time elapsed: 0.001 s
12:50:24 [2019-12-21T17:50:24.676Z] testGetStatTree(org.eclipse.tracecompass.tmf.ui.tests.statistics.TmfStatisticsTreeManagerTest)  Time elapsed: 0 s
12:50:24 [2019-12-21T17:50:24.676Z] testContainsTreeRoot(org.eclipse.tracecompass.tmf.ui.tests.statistics.TmfStatisticsTreeManagerTest)  Time elapsed: 0 s
12:50:24 [2019-12-21T17:50:24.676Z] testRemoveStatTreeRoot(org.eclipse.tracecompass.tmf.ui.tests.statistics.TmfStatisticsTreeManagerTest)  Time elapsed: 0 s
12:50:24 [2019-12-21T17:50:24.676Z] testGetStatTreeRoot(org.eclipse.tracecompass.tmf.ui.tests.statistics.TmfStatisticsTreeManagerTest)  Time elapsed: 0 s
12:50:24 [2019-12-21T17:50:24.676Z] testRemoveAll(org.eclipse.tracecompass.tmf.ui.tests.statistics.TmfStatisticsTreeManagerTest)  Time elapsed: 0 s
12:50:24 [2019-12-21T17:50:24.676Z] Running org.eclipse.tracecompass.tmf.ui.tests.statistics.TmfStatisticsTest
12:50:24 [2019-12-21T17:50:24.676Z] Tests run: 4, Failures: 0, Errors: 0, Skipped: 0, Time elapsed: 0 s - in org.eclipse.tracecompass.tmf.ui.tests.statistics.TmfStatisticsTest
12:50:24 [2019-12-21T17:50:24.676Z] testResetPartial(org.eclipse.tracecompass.tmf.ui.tests.statistics.TmfStatisticsTest)  Time elapsed: 0 s
12:50:24 [2019-12-21T17:50:24.676Z] testInitialState(org.eclipse.tracecompass.tmf.ui.tests.statistics.TmfStatisticsTest)  Time elapsed: 0 s
12:50:24 [2019-12-21T17:50:24.676Z] testResetTotal(org.eclipse.tracecompass.tmf.ui.tests.statistics.TmfStatisticsTest)  Time elapsed: 0 s
12:50:24 [2019-12-21T17:50:24.676Z] testSetValue(org.eclipse.tracecompass.tmf.ui.tests.statistics.TmfStatisticsTest)  Time elapsed: 0 s
12:50:24 [2019-12-21T17:50:24.676Z] Running org.eclipse.tracecompass.tmf.ui.tests.statistics.TmfBaseStatisticsDataTest
12:50:24 [2019-12-21T17:50:24.676Z] Tests run: 6, Failures: 0, Errors: 0, Skipped: 0, Time elapsed: 0.001 s - in org.eclipse.tracecompass.tmf.ui.tests.statistics.TmfBaseStatisticsDataTest
12:50:24 [2019-12-21T17:50:24.676Z] testGet(org.eclipse.tracecompass.tmf.ui.tests.statistics.TmfBaseStatisticsDataTest)  Time elapsed: 0 s
12:50:24 [2019-12-21T17:50:24.676Z] testGetChildren(org.eclipse.tracecompass.tmf.ui.tests.statistics.TmfBaseStatisticsDataTest)  Time elapsed: 0 s
12:50:24 [2019-12-21T17:50:24.676Z] testReset(org.eclipse.tracecompass.tmf.ui.tests.statistics.TmfBaseStatisticsDataTest)  Time elapsed: 0 s
12:50:24 [2019-12-21T17:50:24.676Z] testRegisterEvent(org.eclipse.tracecompass.tmf.ui.tests.statistics.TmfBaseStatisticsDataTest)  Time elapsed: 0 s
12:50:24 [2019-12-21T17:50:24.676Z] testGetParent(org.eclipse.tracecompass.tmf.ui.tests.statistics.TmfBaseStatisticsDataTest)  Time elapsed: 0 s
12:50:24 [2019-12-21T17:50:24.676Z] testGetOrCreate(org.eclipse.tracecompass.tmf.ui.tests.statistics.TmfBaseStatisticsDataTest)  Time elapsed: 0 s
12:50:24 [2019-12-21T17:50:24.676Z] Running org.eclipse.tracecompass.tmf.ui.tests.statistics.TmfBaseColumnDataProviderTest
12:50:24 [2019-12-21T17:50:24.676Z] Tests run: 1, Failures: 0, Errors: 0, Skipped: 0, Time elapsed: 0.004 s - in org.eclipse.tracecompass.tmf.ui.tests.statistics.TmfBaseColumnDataProviderTest
12:50:24 [2019-12-21T17:50:24.676Z] testGetColumnData(org.eclipse.tracecompass.tmf.ui.tests.statistics.TmfBaseColumnDataProviderTest)  Time elapsed: 0.001 s
12:50:24 [2019-12-21T17:50:24.676Z] Running org.eclipse.tracecompass.tmf.ui.tests.statistics.TmfBaseColumnDataTest
12:50:24 [2019-12-21T17:50:24.676Z] Tests run: 7, Failures: 0, Errors: 0, Skipped: 0, Time elapsed: 0.003 s - in org.eclipse.tracecompass.tmf.ui.tests.statistics.TmfBaseColumnDataTest
12:50:24 [2019-12-21T17:50:24.676Z] testGetWidth(org.eclipse.tracecompass.tmf.ui.tests.statistics.TmfBaseColumnDataTest)  Time elapsed: 0 s
12:50:24 [2019-12-21T17:50:24.676Z] testGetAlignment(org.eclipse.tracecompass.tmf.ui.tests.statistics.TmfBaseColumnDataTest)  Time elapsed: 0 s
12:50:24 [2019-12-21T17:50:24.676Z] testGetLabelProvider(org.eclipse.tracecompass.tmf.ui.tests.statistics.TmfBaseColumnDataTest)  Time elapsed: 0.001 s
12:50:24 [2019-12-21T17:50:24.676Z] testGetTooltip(org.eclipse.tracecompass.tmf.ui.tests.statistics.TmfBaseColumnDataTest)  Time elapsed: 0 s
12:50:24 [2019-12-21T17:50:24.676Z] testGetComparator(org.eclipse.tracecompass.tmf.ui.tests.statistics.TmfBaseColumnDataTest)  Time elapsed: 0 s
12:50:24 [2019-12-21T17:50:24.676Z] testGetPercentageProvider(org.eclipse.tracecompass.tmf.ui.tests.statistics.TmfBaseColumnDataTest)  Time elapsed: 0 s
12:50:24 [2019-12-21T17:50:24.676Z] testGetHeader(org.eclipse.tracecompass.tmf.ui.tests.statistics.TmfBaseColumnDataTest)  Time elapsed: 0 s
12:50:24 [2019-12-21T17:50:24.676Z] Running org.eclipse.tracecompass.tmf.ui.tests.statistics.TmfStatisticsTreeNodeTest
12:50:24 [2019-12-21T17:50:24.933Z] Tests run: 11, Failures: 0, Errors: 0, Skipped: 0, Time elapsed: 0.045 s - in org.eclipse.tracecompass.tmf.ui.tests.statistics.TmfStatisticsTreeNodeTest
12:50:24 [2019-12-21T17:50:24.933Z] testgetName(org.eclipse.tracecompass.tmf.ui.tests.statistics.TmfStatisticsTreeNodeTest)  Time elapsed: 0 s
12:50:24 [2019-12-21T17:50:24.933Z] testGetValue(org.eclipse.tracecompass.tmf.ui.tests.statistics.TmfStatisticsTreeNodeTest)  Time elapsed: 0.043 s
12:50:24 [2019-12-21T17:50:24.933Z] testResetTimeRangeValue(org.eclipse.tracecompass.tmf.ui.tests.statistics.TmfStatisticsTreeNodeTest)  Time elapsed: 0.001 s
12:50:24 [2019-12-21T17:50:24.933Z] testGetChildren(org.eclipse.tracecompass.tmf.ui.tests.statistics.TmfStatisticsTreeNodeTest)  Time elapsed: 0 s
12:50:24 [2019-12-21T17:50:24.933Z] testReset(org.eclipse.tracecompass.tmf.ui.tests.statistics.TmfStatisticsTreeNodeTest)  Time elapsed: 0 s
12:50:24 [2019-12-21T17:50:24.933Z] testGetPath(org.eclipse.tracecompass.tmf.ui.tests.statistics.TmfStatisticsTreeNodeTest)  Time elapsed: 0 s
12:50:24 [2019-12-21T17:50:24.933Z] testResetGlobalValue(org.eclipse.tracecompass.tmf.ui.tests.statistics.TmfStatisticsTreeNodeTest)  Time elapsed: 0 s
12:50:24 [2019-12-21T17:50:24.933Z] testHasChildren(org.eclipse.tracecompass.tmf.ui.tests.statistics.TmfStatisticsTreeNodeTest)  Time elapsed: 0 s
12:50:24 [2019-12-21T17:50:24.933Z] testContainsChild(org.eclipse.tracecompass.tmf.ui.tests.statistics.TmfStatisticsTreeNodeTest)  Time elapsed: 0 s
12:50:24 [2019-12-21T17:50:24.933Z] testGetParent(org.eclipse.tracecompass.tmf.ui.tests.statistics.TmfStatisticsTreeNodeTest)  Time elapsed: 0 s
12:50:24 [2019-12-21T17:50:24.933Z] testGetNbChildren(org.eclipse.tracecompass.tmf.ui.tests.statistics.TmfStatisticsTreeNodeTest)  Time elapsed: 0 s
12:50:24 [2019-12-21T17:50:24.933Z] Running org.eclipse.tracecompass.tmf.ui.tests.widgets.timegraph.model.TimeGraphEntryTest
12:50:24 [2019-12-21T17:50:24.933Z] Tests run: 19, Failures: 0, Errors: 0, Skipped: 0, Time elapsed: 0.009 s - in org.eclipse.tracecompass.tmf.ui.tests.widgets.timegraph.model.TimeGraphEntryTest
12:50:24 [2019-12-21T17:50:24.933Z] testAddChildOtherParent(org.eclipse.tracecompass.tmf.ui.tests.widgets.timegraph.model.TimeGraphEntryTest)  Time elapsed: 0.004 s
12:50:24 [2019-12-21T17:50:24.933Z] testAddEventReplaceLast(org.eclipse.tracecompass.tmf.ui.tests.widgets.timegraph.model.TimeGraphEntryTest)  Time elapsed: 0.002 s
12:50:24 [2019-12-21T17:50:24.933Z] testAddChildAtPosition(org.eclipse.tracecompass.tmf.ui.tests.widgets.timegraph.model.TimeGraphEntryTest)  Time elapsed: 0 s
12:50:24 [2019-12-21T17:50:24.933Z] testGetTimeEventsIteratorMixedSplit(org.eclipse.tracecompass.tmf.ui.tests.widgets.timegraph.model.TimeGraphEntryTest)  Time elapsed: 0.001 s
12:50:24 [2019-12-21T17:50:24.933Z] testSortChildren(org.eclipse.tracecompass.tmf.ui.tests.widgets.timegraph.model.TimeGraphEntryTest)  Time elapsed: 0 s
12:50:24 [2019-12-21T17:50:24.933Z] testAddEventNulls(org.eclipse.tracecompass.tmf.ui.tests.widgets.timegraph.model.TimeGraphEntryTest)  Time elapsed: 0 s
12:50:24 [2019-12-21T17:50:24.933Z] testRemoveChild(org.eclipse.tracecompass.tmf.ui.tests.widgets.timegraph.model.TimeGraphEntryTest)  Time elapsed: 0 s
12:50:24 [2019-12-21T17:50:24.933Z] testGetTimeEventsIteratorMixed(org.eclipse.tracecompass.tmf.ui.tests.widgets.timegraph.model.TimeGraphEntryTest)  Time elapsed: 0 s
12:50:24 [2019-12-21T17:50:24.933Z] testSortChildrenThenAdd(org.eclipse.tracecompass.tmf.ui.tests.widgets.timegraph.model.TimeGraphEntryTest)  Time elapsed: 0 s
12:50:24 [2019-12-21T17:50:24.933Z] testAddChild(org.eclipse.tracecompass.tmf.ui.tests.widgets.timegraph.model.TimeGraphEntryTest)  Time elapsed: 0 s
12:50:24 [2019-12-21T17:50:24.933Z] testAddEvent(org.eclipse.tracecompass.tmf.ui.tests.widgets.timegraph.model.TimeGraphEntryTest)  Time elapsed: 0 s
12:50:24 [2019-12-21T17:50:24.933Z] testRemoveChildOtherParent(org.eclipse.tracecompass.tmf.ui.tests.widgets.timegraph.model.TimeGraphEntryTest)  Time elapsed: 0 s
12:50:24 [2019-12-21T17:50:24.933Z] testaddZoomedEvent(org.eclipse.tracecompass.tmf.ui.tests.widgets.timegraph.model.TimeGraphEntryTest)  Time elapsed: 0 s
12:50:24 [2019-12-21T17:50:24.933Z] testRemoveChildNoParent(org.eclipse.tracecompass.tmf.ui.tests.widgets.timegraph.model.TimeGraphEntryTest)  Time elapsed: 0 s
12:50:24 [2019-12-21T17:50:24.933Z] testaddZoomedEventPartialRestart(org.eclipse.tracecompass.tmf.ui.tests.widgets.timegraph.model.TimeGraphEntryTest)  Time elapsed: 0 s
12:50:24 [2019-12-21T17:50:24.933Z] testAddChildSameParent(org.eclipse.tracecompass.tmf.ui.tests.widgets.timegraph.model.TimeGraphEntryTest)  Time elapsed: 0 s
12:50:24 [2019-12-21T17:50:24.933Z] testaddZoomedEventDuplicate(org.eclipse.tracecompass.tmf.ui.tests.widgets.timegraph.model.TimeGraphEntryTest)  Time elapsed: 0 s
12:50:24 [2019-12-21T17:50:24.933Z] testaddZoomedEventReplaceLast(org.eclipse.tracecompass.tmf.ui.tests.widgets.timegraph.model.TimeGraphEntryTest)  Time elapsed: 0 s
12:50:24 [2019-12-21T17:50:24.933Z] testAddZoomedEventNulls(org.eclipse.tracecompass.tmf.ui.tests.widgets.timegraph.model.TimeGraphEntryTest)  Time elapsed: 0 s
12:50:24 [2019-12-21T17:50:24.933Z] Running org.eclipse.tracecompass.tmf.ui.tests.markers.ConfigurableMarkerEventSourceTest
12:50:24 [2019-12-21T17:50:24.933Z] Tests run: 1, Failures: 0, Errors: 0, Skipped: 0, Time elapsed: 0.186 s - in org.eclipse.tracecompass.tmf.ui.tests.markers.ConfigurableMarkerEventSourceTest
12:50:24 [2019-12-21T17:50:24.933Z] test(org.eclipse.tracecompass.tmf.ui.tests.markers.ConfigurableMarkerEventSourceTest)  Time elapsed: 0.181 s
12:50:24 [2019-12-21T17:50:24.933Z] Running org.eclipse.tracecompass.tmf.ui.tests.markers.PeriodicMarkerEventSourceTest
12:50:24 [2019-12-21T17:50:24.933Z] Tests run: 11, Failures: 0, Errors: 0, Skipped: 0, Time elapsed: 0.003 s - in org.eclipse.tracecompass.tmf.ui.tests.markers.PeriodicMarkerEventSourceTest
12:50:24 [2019-12-21T17:50:24.933Z] testNextPreviousIncluded(org.eclipse.tracecompass.tmf.ui.tests.markers.PeriodicMarkerEventSourceTest)  Time elapsed: 0 s
12:50:24 [2019-12-21T17:50:24.933Z] testInvalidRollover(org.eclipse.tracecompass.tmf.ui.tests.markers.PeriodicMarkerEventSourceTest)  Time elapsed: 0 s
12:50:24 [2019-12-21T17:50:24.933Z] testSmallPeriod(org.eclipse.tracecompass.tmf.ui.tests.markers.PeriodicMarkerEventSourceTest)  Time elapsed: 0 s
12:50:24 [2019-12-21T17:50:24.933Z] testIsApplicable(org.eclipse.tracecompass.tmf.ui.tests.markers.PeriodicMarkerEventSourceTest)  Time elapsed: 0 s
12:50:24 [2019-12-21T17:50:24.933Z] testAlternateShadingMarkerEventSource(org.eclipse.tracecompass.tmf.ui.tests.markers.PeriodicMarkerEventSourceTest)  Time elapsed: 0 s
12:50:24 [2019-12-21T17:50:24.933Z] testFractionalPeriod(org.eclipse.tracecompass.tmf.ui.tests.markers.PeriodicMarkerEventSourceTest)  Time elapsed: 0 s
12:50:24 [2019-12-21T17:50:24.933Z] testReference(org.eclipse.tracecompass.tmf.ui.tests.markers.PeriodicMarkerEventSourceTest)  Time elapsed: 0 s
12:50:24 [2019-12-21T17:50:24.933Z] testRollover(org.eclipse.tracecompass.tmf.ui.tests.markers.PeriodicMarkerEventSourceTest)  Time elapsed: 0 s
12:50:24 [2019-12-21T17:50:24.933Z] testInvalidPeriod(org.eclipse.tracecompass.tmf.ui.tests.markers.PeriodicMarkerEventSourceTest)  Time elapsed: 0 s
12:50:24 [2019-12-21T17:50:24.933Z] testLineMarkerEventSource(org.eclipse.tracecompass.tmf.ui.tests.markers.PeriodicMarkerEventSourceTest)  Time elapsed: 0 s
12:50:24 [2019-12-21T17:50:24.933Z] testResolution(org.eclipse.tracecompass.tmf.ui.tests.markers.PeriodicMarkerEventSourceTest)  Time elapsed: 0.001 s
12:50:24 [2019-12-21T17:50:24.933Z] Running org.eclipse.tracecompass.tmf.ui.tests.viewers.ToolTipStringTest
12:50:25 [2019-12-21T17:50:25.183Z] Aborted by Bernd Hufmann
12:50:25 [2019-12-21T17:50:25.186Z] Sending interrupt signal to process
12:50:25 [2019-12-21T17:50:25.186Z] Killing processes
12:50:25 [2019-12-21T17:50:25.189Z] Tests run: 5, Failures: 0, Errors: 0, Skipped: 0, Time elapsed: 0.011 s - in org.eclipse.tracecompass.tmf.ui.tests.viewers.ToolTipStringTest
12:50:25 [2019-12-21T17:50:25.189Z] testHtml(org.eclipse.tracecompass.tmf.ui.tests.viewers.ToolTipStringTest)  Time elapsed: 0.009 s
12:50:25 [2019-12-21T17:50:25.189Z] testTimestamp(org.eclipse.tracecompass.tmf.ui.tests.viewers.ToolTipStringTest)  Time elapsed: 0 s
12:50:25 [2019-12-21T17:50:25.189Z] testDecimal(org.eclipse.tracecompass.tmf.ui.tests.viewers.ToolTipStringTest)  Time elapsed: 0.002 s
12:50:25 [2019-12-21T17:50:25.189Z] testString(org.eclipse.tracecompass.tmf.ui.tests.viewers.ToolTipStringTest)  Time elapsed: 0 s
12:50:25 [2019-12-21T17:50:25.189Z] testEgality(org.eclipse.tracecompass.tmf.ui.tests.viewers.ToolTipStringTest)  Time elapsed: 0 s
12:50:25 [2019-12-21T17:50:25.189Z] Running org.eclipse.tracecompass.tmf.ui.tests.histogram.HistogramDataModelTest
12:50:25 [2019-12-21T17:50:25.189Z] Tests run: 27, Failures: 0, Errors: 0, Skipped: 0, Time elapsed: 0.065 s - in org.eclipse.tracecompass.tmf.ui.tests.histogram.HistogramDataModelTest
12:50:25 [2019-12-21T17:50:25.189Z] testHistogramDataModelInt(org.eclipse.tracecompass.tmf.ui.tests.histogram.HistogramDataModelTest)  Time elapsed: 0 s
12:50:25 [2019-12-21T17:50:25.189Z] testScaleTo_0(org.eclipse.tracecompass.tmf.ui.tests.histogram.HistogramDataModelTest)  Time elapsed: 0 s
12:50:25 [2019-12-21T17:50:25.189Z] testScaleTo_1(org.eclipse.tracecompass.tmf.ui.tests.histogram.HistogramDataModelTest)  Time elapsed: 0.001 s
12:50:25 [2019-12-21T17:50:25.189Z] testScaleTo_2(org.eclipse.tracecompass.tmf.ui.tests.histogram.HistogramDataModelTest)  Time elapsed: 0 s
12:50:25 [2019-12-21T17:50:25.189Z] testScaleTo_3(org.eclipse.tracecompass.tmf.ui.tests.histogram.HistogramDataModelTest)  Time elapsed: 0 s
12:50:25 [2019-12-21T17:50:25.189Z] testScaleTo_4(org.eclipse.tracecompass.tmf.ui.tests.histogram.HistogramDataModelTest)  Time elapsed: 0 s
12:50:25 [2019-12-21T17:50:25.189Z] testScaleTo_5(org.eclipse.tracecompass.tmf.ui.tests.histogram.HistogramDataModelTest)  Time elapsed: 0 s
12:50:25 [2019-12-21T17:50:25.189Z] testScaleTo_6(org.eclipse.tracecompass.tmf.ui.tests.histogram.HistogramDataModelTest)  Time elapsed: 0 s
12:50:25 [2019-12-21T17:50:25.189Z] testScaleTo_7(org.eclipse.tracecompass.tmf.ui.tests.histogram.HistogramDataModelTest)  Time elapsed: 0.001 s
12:50:25 [2019-12-21T17:50:25.189Z] testClear(org.eclipse.tracecompass.tmf.ui.tests.histogram.HistogramDataModelTest)  Time elapsed: 0 s
12:50:25 [2019-12-21T17:50:25.189Z] testHistogramDataModel(org.eclipse.tracecompass.tmf.ui.tests.histogram.HistogramDataModelTest)  Time elapsed: 0 s
12:50:25 [2019-12-21T17:50:25.189Z] testModelListener(org.eclipse.tracecompass.tmf.ui.tests.histogram.HistogramDataModelTest)  Time elapsed: 0.008 s
12:50:25 [2019-12-21T17:50:25.189Z] testHistogramDataModelCopyConstructor(org.eclipse.tracecompass.tmf.ui.tests.histogram.HistogramDataModelTest)  Time elapsed: 0.002 s
12:50:25 [2019-12-21T17:50:25.189Z] testLostEventsScaleTo_0(org.eclipse.tracecompass.tmf.ui.tests.histogram.HistogramDataModelTest)  Time elapsed: 0 s
12:50:25 [2019-12-21T17:50:25.189Z] testLostEventsScaleTo_1(org.eclipse.tracecompass.tmf.ui.tests.histogram.HistogramDataModelTest)  Time elapsed: 0 s
12:50:25 [2019-12-21T17:50:25.189Z] testLostEventsScaleTo_2(org.eclipse.tracecompass.tmf.ui.tests.histogram.HistogramDataModelTest)  Time elapsed: 0 s
12:50:25 [2019-12-21T17:50:25.189Z] testLostEventsScaleTo_3(org.eclipse.tracecompass.tmf.ui.tests.histogram.HistogramDataModelTest)  Time elapsed: 0 s
12:50:25 [2019-12-21T17:50:25.189Z] testLostEventsScaleTo_4(org.eclipse.tracecompass.tmf.ui.tests.histogram.HistogramDataModelTest)  Time elapsed: 0 s
12:50:25 [2019-12-21T17:50:25.189Z] testCountEvent_0(org.eclipse.tracecompass.tmf.ui.tests.histogram.HistogramDataModelTest)  Time elapsed: 0 s
12:50:25 [2019-12-21T17:50:25.189Z] testCountEvent_1(org.eclipse.tracecompass.tmf.ui.tests.histogram.HistogramDataModelTest)  Time elapsed: 0 s
12:50:25 [2019-12-21T17:50:25.189Z] testCountEvent_2(org.eclipse.tracecompass.tmf.ui.tests.histogram.HistogramDataModelTest)  Time elapsed: 0.001 s
12:50:25 [2019-12-21T17:50:25.189Z] testCountEvent_3(org.eclipse.tracecompass.tmf.ui.tests.histogram.HistogramDataModelTest)  Time elapsed: 0 s
12:50:25 [2019-12-21T17:50:25.189Z] testCountEvent_4(org.eclipse.tracecompass.tmf.ui.tests.histogram.HistogramDataModelTest)  Time elapsed: 0 s
12:50:25 [2019-12-21T17:50:25.189Z] testCountEvent_5(org.eclipse.tracecompass.tmf.ui.tests.histogram.HistogramDataModelTest)  Time elapsed: 0 s
12:50:25 [2019-12-21T17:50:25.189Z] testCountEvent_6(org.eclipse.tracecompass.tmf.ui.tests.histogram.HistogramDataModelTest)  Time elapsed: 0 s
12:50:25 [2019-12-21T17:50:25.190Z] testScaleToReverse_1(org.eclipse.tracecompass.tmf.ui.tests.histogram.HistogramDataModelTest)  Time elapsed: 0.048 s
12:50:25 [2019-12-21T17:50:25.190Z] testScaleToReverse_2(org.eclipse.tracecompass.tmf.ui.tests.histogram.HistogramDataModelTest)  Time elapsed: 0.001 s
12:50:25 [2019-12-21T17:50:25.190Z] Running org.eclipse.tracecompass.tmf.ui.tests.symbols.BasicSymbolProviderTest
12:50:25 [2019-12-21T17:50:25.190Z] 
12:50:25 [2019-12-21T17:50:25.190Z] !ENTRY org.eclipse.cdt.core.native 4 0 2019-12-21 17:50:25.018
12:50:25 [2019-12-21T17:50:25.190Z] !MESSAGE no spawner in java.library.path
12:50:25 [2019-12-21T17:50:25.190Z] Tests run: 1, Failures: 0, Errors: 0, Skipped: 0, Time elapsed: 0.028 s - in org.eclipse.tracecompass.tmf.ui.tests.symbols.BasicSymbolProviderTest
12:50:25 [2019-12-21T17:50:25.190Z] testBasicProvider(org.eclipse.tracecompass.tmf.ui.tests.symbols.BasicSymbolProviderTest)  Time elapsed: 0.028 s
12:50:25 [2019-12-21T17:50:25.190Z] Running org.eclipse.tracecompass.tmf.ui.tests.util.LineClipperTest
12:50:25 [2019-12-21T17:50:25.190Z] Tests run: 13, Failures: 0, Errors: 0, Skipped: 0, Time elapsed: 0.002 s - in org.eclipse.tracecompass.tmf.ui.tests.util.LineClipperTest
12:50:25 [2019-12-21T17:50:25.190Z] clipRightTest(org.eclipse.tracecompass.tmf.ui.tests.util.LineClipperTest)  Time elapsed: 0 s
12:50:25 [2019-12-21T17:50:25.190Z] clipXTest(org.eclipse.tracecompass.tmf.ui.tests.util.LineClipperTest)  Time elapsed: 0 s
12:50:25 [2019-12-21T17:50:25.190Z] horizontalTest(org.eclipse.tracecompass.tmf.ui.tests.util.LineClipperTest)  Time elapsed: 0 s
12:50:25 [2019-12-21T17:50:25.190Z] tangentInsideTest(org.eclipse.tracecompass.tmf.ui.tests.util.LineClipperTest)  Time elapsed: 0 s
12:50:25 [2019-12-21T17:50:25.190Z] glancingTest(org.eclipse.tracecompass.tmf.ui.tests.util.LineClipperTest)  Time elapsed: 0 s
12:50:25 [2019-12-21T17:50:25.190Z] ousideSquareTest(org.eclipse.tracecompass.tmf.ui.tests.util.LineClipperTest)  Time elapsed: 0 s
12:50:25 [2019-12-21T17:50:25.190Z] insideTest(org.eclipse.tracecompass.tmf.ui.tests.util.LineClipperTest)  Time elapsed: 0 s
12:50:25 [2019-12-21T17:50:25.190Z] verticalTest(org.eclipse.tracecompass.tmf.ui.tests.util.LineClipperTest)  Time elapsed: 0 s
12:50:25 [2019-12-21T17:50:25.190Z] clipTopTest(org.eclipse.tracecompass.tmf.ui.tests.util.LineClipperTest)  Time elapsed: 0 s
12:50:25 [2019-12-21T17:50:25.190Z] tangentTest(org.eclipse.tracecompass.tmf.ui.tests.util.LineClipperTest)  Time elapsed: 0 s
12:50:25 [2019-12-21T17:50:25.190Z] tangentInsideCornerTest(org.eclipse.tracecompass.tmf.ui.tests.util.LineClipperTest)  Time elapsed: 0 s
12:50:25 [2019-12-21T17:50:25.190Z] clipLeftTest(org.eclipse.tracecompass.tmf.ui.tests.util.LineClipperTest)  Time elapsed: 0 s
12:50:25 [2019-12-21T17:50:25.190Z] clipBottomTest(org.eclipse.tracecompass.tmf.ui.tests.util.LineClipperTest)  Time elapsed: 0 s
12:50:25 [2019-12-21T17:50:25.190Z] Running org.eclipse.tracecompass.tmf.ui.tests.colors.ColorUtilsTest
12:50:25 [2019-12-21T17:50:25.190Z] Tests run: 1, Failures: 0, Errors: 0, Skipped: 0, Time elapsed: 0.001 s - in org.eclipse.tracecompass.tmf.ui.tests.colors.ColorUtilsTest
12:50:25 [2019-12-21T17:50:25.190Z] testToHexStringRGB(org.eclipse.tracecompass.tmf.ui.tests.colors.ColorUtilsTest)  Time elapsed: 0.001 s
12:50:25 [2019-12-21T17:50:25.190Z] 
12:50:25 [2019-12-21T17:50:25.190Z] Results:
12:50:25 [2019-12-21T17:50:25.190Z] 
12:50:25 [2019-12-21T17:50:25.190Z] Tests run: 186, Failures: 0, Errors: 0, Skipped: 0
12:50:25 [2019-12-21T17:50:25.190Z] 
12:50:26 [2019-12-21T17:50:26.118Z] 
12:50:26 [2019-12-21T17:50:26.118Z] !ENTRY org.eclipse.core.resources 2 10035 2019-12-21 17:50:25.833
12:50:26 [2019-12-21T17:50:26.118Z] !MESSAGE The workspace will exit with unsaved changes in this session.
12:50:26 [2019-12-21T17:50:26.679Z] [INFO] All tests passed!
12:50:26 [2019-12-21T17:50:26.679Z] [INFO] 
12:50:26 [2019-12-21T17:50:26.679Z] [INFO] --- maven-install-plugin:2.5.2:install (default-install) @ org.eclipse.tracecompass.tmf.ui.tests ---
12:50:26 [2019-12-21T17:50:26.679Z] [INFO] Installing /home/jenkins/agent/workspace/tracecompass-gerrit/tmf/org.eclipse.tracecompass.tmf.ui.tests/target/org.eclipse.tracecompass.tmf.ui.tests-1.0.12-SNAPSHOT.jar to /home/jenkins/.m2/repository/org/eclipse/tracecompass/org.eclipse.tracecompass.tmf.ui.tests/1.0.12-SNAPSHOT/org.eclipse.tracecompass.tmf.ui.tests-1.0.12-SNAPSHOT.jar
12:50:26 [2019-12-21T17:50:26.679Z] [INFO] Installing /home/jenkins/agent/workspace/tracecompass-gerrit/tmf/org.eclipse.tracecompass.tmf.ui.tests/pom.xml to /home/jenkins/.m2/repository/org/eclipse/tracecompass/org.eclipse.tracecompass.tmf.ui.tests/1.0.12-SNAPSHOT/org.eclipse.tracecompass.tmf.ui.tests-1.0.12-SNAPSHOT.pom
12:50:26 [2019-12-21T17:50:26.679Z] [INFO] Installing /home/jenkins/agent/workspace/tracecompass-gerrit/tmf/org.eclipse.tracecompass.tmf.ui.tests/target/org.eclipse.tracecompass.tmf.ui.tests-1.0.12-SNAPSHOT-sources.jar to /home/jenkins/.m2/repository/org/eclipse/tracecompass/org.eclipse.tracecompass.tmf.ui.tests/1.0.12-SNAPSHOT/org.eclipse.tracecompass.tmf.ui.tests-1.0.12-SNAPSHOT-sources.jar
12:50:26 [2019-12-21T17:50:26.679Z] [INFO] Installing /home/jenkins/agent/workspace/tracecompass-gerrit/tmf/org.eclipse.tracecompass.tmf.ui.tests/target/org.eclipse.tracecompass.tmf.ui.tests-1.0.12-SNAPSHOT.jar.pack.gz to /home/jenkins/.m2/repository/org/eclipse/tracecompass/org.eclipse.tracecompass.tmf.ui.tests/1.0.12-SNAPSHOT/org.eclipse.tracecompass.tmf.ui.tests-1.0.12-SNAPSHOT-pack200.jar.pack.gz
12:50:26 [2019-12-21T17:50:26.679Z] [INFO] Installing /home/jenkins/agent/workspace/tracecompass-gerrit/tmf/org.eclipse.tracecompass.tmf.ui.tests/target/p2content.xml to /home/jenkins/.m2/repository/org/eclipse/tracecompass/org.eclipse.tracecompass.tmf.ui.tests/1.0.12-SNAPSHOT/org.eclipse.tracecompass.tmf.ui.tests-1.0.12-SNAPSHOT-p2metadata.xml
12:50:26 [2019-12-21T17:50:26.679Z] [INFO] Installing /home/jenkins/agent/workspace/tracecompass-gerrit/tmf/org.eclipse.tracecompass.tmf.ui.tests/target/p2artifacts.xml to /home/jenkins/.m2/repository/org/eclipse/tracecompass/org.eclipse.tracecompass.tmf.ui.tests/1.0.12-SNAPSHOT/org.eclipse.tracecompass.tmf.ui.tests-1.0.12-SNAPSHOT-p2artifacts.xml
12:50:26 [2019-12-21T17:50:26.679Z] [INFO] 
12:50:26 [2019-12-21T17:50:26.679Z] [INFO] --- tycho-p2-plugin:1.3.0:update-local-index (default-update-local-index) @ org.eclipse.tracecompass.tmf.ui.tests ---
12:50:26 [2019-12-21T17:50:26.679Z] [INFO] 
12:50:26 [2019-12-21T17:50:26.679Z] [INFO] --< org.eclipse.tracecompass:org.eclipse.tracecompass.tmf.ui.swtbot.tests >--
12:50:26 [2019-12-21T17:50:26.679Z] [INFO] Building org.eclipse.tracecompass.tmf.ui.swtbot.tests 1.0.11-SNAPSHOT [25/138]
12:50:26 [2019-12-21T17:50:26.679Z] [INFO] ------------------------[ eclipse-test-plugin ]-------------------------
12:50:26 [2019-12-21T17:50:26.679Z] [INFO] 
12:50:26 [2019-12-21T17:50:26.679Z] [INFO] --- maven-clean-plugin:3.0.0:clean (default-clean) @ org.eclipse.tracecompass.tmf.ui.swtbot.tests ---
12:50:26 [2019-12-21T17:50:26.680Z] [INFO] 
12:50:26 [2019-12-21T17:50:26.680Z] [INFO] --- tycho-packaging-plugin:1.3.0:build-qualifier (default-build-qualifier) @ org.eclipse.tracecompass.tmf.ui.swtbot.tests ---
12:50:26 [2019-12-21T17:50:26.680Z] [INFO] The project's OSGi version is 1.0.11.201912211728
12:50:26 [2019-12-21T17:50:26.680Z] [INFO] 
12:50:26 [2019-12-21T17:50:26.680Z] [INFO] --- tycho-packaging-plugin:1.3.0:validate-id (default-validate-id) @ org.eclipse.tracecompass.tmf.ui.swtbot.tests ---
12:50:26 [2019-12-21T17:50:26.680Z] [INFO] 
12:50:26 [2019-12-21T17:50:26.680Z] [INFO] --- tycho-packaging-plugin:1.3.0:validate-version (default-validate-version) @ org.eclipse.tracecompass.tmf.ui.swtbot.tests ---
12:50:26 [2019-12-21T17:50:26.680Z] [INFO] 
12:50:26 [2019-12-21T17:50:26.680Z] [INFO] --- maven-enforcer-plugin:1.4.1:enforce (enforce-maven-version) @ org.eclipse.tracecompass.tmf.ui.swtbot.tests ---
12:50:26 [2019-12-21T17:50:26.680Z] [INFO] 
12:50:26 [2019-12-21T17:50:26.680Z] [INFO] --- maven-resources-plugin:3.0.2:resources (default-resources) @ org.eclipse.tracecompass.tmf.ui.swtbot.tests ---
12:50:26 [2019-12-21T17:50:26.680Z] [INFO] Using 'UTF-8' encoding to copy filtered resources.
12:50:26 [2019-12-21T17:50:26.680Z] [INFO] skip non existing resourceDirectory /home/jenkins/agent/workspace/tracecompass-gerrit/tmf/org.eclipse.tracecompass.tmf.ui.swtbot.tests/src/main/resources
12:50:26 [2019-12-21T17:50:26.680Z] [INFO] 
12:50:26 [2019-12-21T17:50:26.680Z] [INFO] --- tycho-compiler-plugin:1.3.0:compile (default-compile) @ org.eclipse.tracecompass.tmf.ui.swtbot.tests ---
12:50:26 [2019-12-21T17:50:26.680Z] [INFO] Compiling 46 source files to /home/jenkins/agent/workspace/tracecompass-gerrit/tmf/org.eclipse.tracecompass.tmf.ui.swtbot.tests/target/classes
12:50:27 [2019-12-21T17:50:27.441Z] kill finished with exit code 127
12:50:28 [2019-12-21T17:50:28.045Z] [WARNING] /home/jenkins/agent/workspace/tracecompass-gerrit/tmf/org.eclipse.tracecompass.tmf.ui.swtbot.tests/src/org/eclipse/tracecompass/tmf/ui/swtbot/tests/views/TimeGraphViewStub.java:[23] 
12:50:28 [2019-12-21T17:50:28.045Z] 	import org.eclipse.tracecompass.internal.tmf.ui.widgets.timegraph.model.TimeLineEvent;
12:50:28 [2019-12-21T17:50:28.045Z] 	       ^^^^^^^^^^^^^^^^^^^^^^^^^^^^^^^^^^^^^^^^^^^^^^^^^^^^^^^^^^^^^^^^^^^^^^^^^^^^^^
12:50:28 [2019-12-21T17:50:28.045Z] Discouraged access: The type 'TimeLineEvent' is not API (restriction on classpath entry '/home/jenkins/agent/workspace/tracecompass-gerrit/tmf/org.eclipse.tracecompass.tmf.ui/target/classes')
12:50:28 [2019-12-21T17:50:28.045Z] [WARNING] /home/jenkins/agent/workspace/tracecompass-gerrit/tmf/org.eclipse.tracecompass.tmf.ui.swtbot.tests/src/org/eclipse/tracecompass/tmf/ui/swtbot/tests/views/TimeGraphViewStub.java:[128] 
12:50:28 [2019-12-21T17:50:28.045Z] 	fEntries.add(pulse);
12:50:28 [2019-12-21T17:50:28.045Z] 	             ^^^^^
12:50:28 [2019-12-21T17:50:28.045Z] Null type safety (type annotations): The expression of type 'TimeGraphEntry' needs unchecked conversion to conform to '@NonNull TimeGraphEntry'
12:50:28 [2019-12-21T17:50:28.045Z] [WARNING] /home/jenkins/agent/workspace/tracecompass-gerrit/tmf/org.eclipse.tracecompass.tmf.ui.swtbot.tests/src/org/eclipse/tracecompass/tmf/ui/swtbot/tests/views/TimeGraphViewStub.java:[159] 
12:50:28 [2019-12-21T17:50:28.045Z] 	events.add(new TimeLineEvent(pulse, i, Arrays.asList(value1, value2, value3, value4)));
12:50:28 [2019-12-21T17:50:28.045Z] 	           ^^^^^^^^^^^^^^^^^^^^^^^^^^^^^^^^^^^^^^^^^^^^^^^^^^^^^^^^^^^^^^^^^^^^^^^^^^
12:50:28 [2019-12-21T17:50:28.045Z] Discouraged access: The constructor 'TimeLineEvent(ITimeGraphEntry, long, List<Long>)' is not API (restriction on classpath entry '/home/jenkins/agent/workspace/tracecompass-gerrit/tmf/org.eclipse.tracecompass.tmf.ui/target/classes')
12:50:28 [2019-12-21T17:50:28.045Z] [WARNING] /home/jenkins/agent/workspace/tracecompass-gerrit/tmf/org.eclipse.tracecompass.tmf.ui.swtbot.tests/src/org/eclipse/tracecompass/tmf/ui/swtbot/tests/views/TimeGraphViewStub.java:[159] 
12:50:28 [2019-12-21T17:50:28.045Z] 	events.add(new TimeLineEvent(pulse, i, Arrays.asList(value1, value2, value3, value4)));
12:50:28 [2019-12-21T17:50:28.045Z] 	               ^^^^^^^^^^^^^
12:50:28 [2019-12-21T17:50:28.045Z] Discouraged access: The type 'TimeLineEvent' is not API (restriction on classpath entry '/home/jenkins/agent/workspace/tracecompass-gerrit/tmf/org.eclipse.tracecompass.tmf.ui/target/classes')
12:50:28 [2019-12-21T17:50:28.045Z] [WARNING] /home/jenkins/agent/workspace/tracecompass-gerrit/tmf/org.eclipse.tracecompass.tmf.ui.swtbot.tests/src/org/eclipse/tracecompass/tmf/ui/swtbot/tests/views/TimeGraphViewStub.java:[161] 
12:50:28 [2019-12-21T17:50:28.045Z] 	fEvents.put(pulse.getName(), events);
12:50:28 [2019-12-21T17:50:28.045Z] 	                             ^^^^^^
12:50:28 [2019-12-21T17:50:28.045Z] Null type safety (type annotations): The expression of type 'List<ITimeEvent>' needs unchecked conversion to conform to 'List<@NonNull ITimeEvent>'
12:50:28 [2019-12-21T17:50:28.045Z] [WARNING] /home/jenkins/agent/workspace/tracecompass-gerrit/tmf/org.eclipse.tracecompass.tmf.ui.swtbot.tests/src/org/eclipse/tracecompass/tmf/ui/swtbot/tests/views/TimeGraphViewStub.java:[171] 
12:50:28 [2019-12-21T17:50:28.045Z] 	regexes.put(IFilterProperty.BOUND, fFilterRegex);
12:50:28 [2019-12-21T17:50:28.045Z] 	                                   ^^^^^^^^^^^^
12:50:28 [2019-12-21T17:50:28.045Z] Null type safety (type annotations): The expression of type 'String' needs unchecked conversion to conform to '@NonNull String'
12:50:28 [2019-12-21T17:50:28.045Z] [WARNING] /home/jenkins/agent/workspace/tracecompass-gerrit/tmf/org.eclipse.tracecompass.tmf.ui.swtbot.tests/src/org/eclipse/tracecompass/tmf/ui/swtbot/tests/views/TimeGraphViewStub.java:[179] 
12:50:28 [2019-12-21T17:50:28.045Z] 	public void setFilterRegex(String filterRegex) {
12:50:28 [2019-12-21T17:50:28.045Z] 	                                  ^^^^^^^^^^^
12:50:28 [2019-12-21T17:50:28.045Z] Javadoc: Missing tag for parameter filterRegex
12:50:28 [2019-12-21T17:50:28.045Z] [WARNING] /home/jenkins/agent/workspace/tracecompass-gerrit/tmf/org.eclipse.tracecompass.tmf.ui.swtbot.tests/src/org/eclipse/tracecompass/tmf/ui/swtbot/tests/views/TimeGraphViewStub.java:[227] 
12:50:28 [2019-12-21T17:50:28.045Z] 	ret.add(new TimeLineEvent(ref.getEntry(), ref.getTime() + trace.getStartTime().toNanos(), ((TimeLineEvent) ref).getValues()));
12:50:28 [2019-12-21T17:50:28.045Z] 	                                                                                          ^^^^^^^^^^^^^^^^^^^^^^^^^^^^^^^^^
12:50:28 [2019-12-21T17:50:28.045Z] Null type safety (type annotations): The expression of type 'List<Long>' needs unchecked conversion to conform to 'List<@Nullable Long>'
12:50:28 [2019-12-21T17:50:28.045Z] 8 problems (8 warnings)
12:50:28 [2019-12-21T17:50:28.045Z] [INFO] 
12:50:28 [2019-12-21T17:50:28.045Z] [INFO] --- maven-resources-plugin:3.0.2:testResources (default-testResources) @ org.eclipse.tracecompass.tmf.ui.swtbot.tests ---
12:50:28 [2019-12-21T17:50:28.045Z] [INFO] Using 'UTF-8' encoding to copy filtered resources.
12:50:28 [2019-12-21T17:50:28.045Z] [INFO] skip non existing resourceDirectory /home/jenkins/agent/workspace/tracecompass-gerrit/tmf/org.eclipse.tracecompass.tmf.ui.swtbot.tests/src/test/resources
12:50:28 [2019-12-21T17:50:28.045Z] [INFO] 
12:50:28 [2019-12-21T17:50:28.045Z] [INFO] --- tycho-source-plugin:1.3.0:plugin-source (plugin-source) @ org.eclipse.tracecompass.tmf.ui.swtbot.tests ---
12:50:28 [2019-12-21T17:50:28.045Z] [INFO] Building jar: /home/jenkins/agent/workspace/tracecompass-gerrit/tmf/org.eclipse.tracecompass.tmf.ui.swtbot.tests/target/org.eclipse.tracecompass.tmf.ui.swtbot.tests-1.0.11-SNAPSHOT-sources.jar
12:50:28 [2019-12-21T17:50:28.045Z] [INFO] 
12:50:28 [2019-12-21T17:50:28.045Z] [INFO] --- target-platform-configuration:1.3.0:target-platform (default-target-platform) @ org.eclipse.tracecompass.tmf.ui.swtbot.tests ---
12:50:28 [2019-12-21T17:50:28.045Z] [INFO] 
12:50:28 [2019-12-21T17:50:28.045Z] [INFO] --- tycho-packaging-plugin:1.3.0:package-plugin (default-package-plugin) @ org.eclipse.tracecompass.tmf.ui.swtbot.tests ---
12:50:28 [2019-12-21T17:50:28.305Z] [INFO] Building jar: /home/jenkins/agent/workspace/tracecompass-gerrit/tmf/org.eclipse.tracecompass.tmf.ui.swtbot.tests/target/org.eclipse.tracecompass.tmf.ui.swtbot.tests-1.0.11-SNAPSHOT.jar
12:50:28 [2019-12-21T17:50:28.305Z] [INFO] 
12:50:28 [2019-12-21T17:50:28.305Z] [INFO] --- tycho-p2-plugin:1.3.0:p2-metadata-default (default-p2-metadata-default) @ org.eclipse.tracecompass.tmf.ui.swtbot.tests ---
12:50:28 [2019-12-21T17:50:28.305Z] [INFO] 
12:50:28 [2019-12-21T17:50:28.305Z] [INFO] --- tycho-source-feature-plugin:1.3.0:source-feature (source-feature) @ org.eclipse.tracecompass.tmf.ui.swtbot.tests ---
12:50:28 [2019-12-21T17:50:28.305Z] [INFO] 
12:50:28 [2019-12-21T17:50:28.305Z] [INFO] --- tycho-pack200b-plugin:1.3.0:pack (pack200-pack) @ org.eclipse.tracecompass.tmf.ui.swtbot.tests ---
12:50:28 [2019-12-21T17:50:28.305Z] [INFO] Pack200 packing jar /home/jenkins/agent/workspace/tracecompass-gerrit/tmf/org.eclipse.tracecompass.tmf.ui.swtbot.tests/target/org.eclipse.tracecompass.tmf.ui.swtbot.tests-1.0.11-SNAPSHOT.jar
12:50:28 [2019-12-21T17:50:28.561Z] [INFO] 
12:50:28 [2019-12-21T17:50:28.561Z] [INFO] --- tycho-p2-plugin:1.3.0:p2-metadata (p2-metadata) @ org.eclipse.tracecompass.tmf.ui.swtbot.tests ---
12:50:28 [2019-12-21T17:50:28.561Z] [INFO] 
12:50:28 [2019-12-21T17:50:28.561Z] [INFO] --- tycho-surefire-plugin:1.3.0:test (default-test) @ org.eclipse.tracecompass.tmf.ui.swtbot.tests ---
12:50:29 [2019-12-21T17:50:29.927Z] [INFO] Expected eclipse log file: /home/jenkins/agent/workspace/tracecompass-gerrit/tmf/org.eclipse.tracecompass.tmf.ui.swtbot.tests/target/work/data/.metadata/.log
12:50:29 [2019-12-21T17:50:29.927Z] [INFO] Command line:
12:50:29 [2019-12-21T17:50:29.927Z] 	[/opt/tools/java/oracle/jdk-8/1.8.0_202/jre/bin/java, -Dosgi.noShutdown=false, -Dosgi.os=linux, -Dosgi.ws=gtk, -Dosgi.arch=x86_64, -Dorg.eclipse.swt.browser.DefaultType=mozilla, -Xms512m, -Xmx1024m, -Dosgi.clean=true, -jar, /home/jenkins/.m2/repository/p2/osgi/bundle/org.eclipse.equinox.launcher/1.5.600.v20191014-2022/org.eclipse.equinox.launcher-1.5.600.v20191014-2022.jar, -data, /home/jenkins/agent/workspace/tracecompass-gerrit/tmf/org.eclipse.tracecompass.tmf.ui.swtbot.tests/target/work/data, -install, /home/jenkins/agent/workspace/tracecompass-gerrit/tmf/org.eclipse.tracecompass.tmf.ui.swtbot.tests/target/work, -configuration, /home/jenkins/agent/workspace/tracecompass-gerrit/tmf/org.eclipse.tracecompass.tmf.ui.swtbot.tests/target/work/configuration, -application, org.eclipse.tycho.surefire.osgibooter.uitest, -testproperties, /home/jenkins/agent/workspace/tracecompass-gerrit/tmf/org.eclipse.tracecompass.tmf.ui.swtbot.tests/target/surefire.properties, -product, org.eclipse.platform.ide, -nouithread, -consoleLog]
12:50:29 [2019-12-21T17:50:29.927Z] Picked up _JAVA_OPTIONS: -Duser.home=/home/tracecompass
12:50:32 [2019-12-21T17:50:32.442Z] !SESSION 2019-12-21 17:50:30.033 -----------------------------------------------
12:50:32 [2019-12-21T17:50:32.442Z] eclipse.buildId=unknown
12:50:32 [2019-12-21T17:50:32.442Z] java.version=1.8.0_202
12:50:32 [2019-12-21T17:50:32.442Z] java.vendor=Oracle Corporation
12:50:32 [2019-12-21T17:50:32.442Z] BootLoader constants: OS=linux, ARCH=x86_64, WS=gtk, NL=en_US
12:50:32 [2019-12-21T17:50:32.443Z] Framework arguments:  -application org.eclipse.tycho.surefire.osgibooter.uitest -testproperties /home/jenkins/agent/workspace/tracecompass-gerrit/tmf/org.eclipse.tracecompass.tmf.ui.swtbot.tests/target/surefire.properties -product org.eclipse.platform.ide -nouithread
12:50:32 [2019-12-21T17:50:32.443Z] Command-line arguments:  -data /home/jenkins/agent/workspace/tracecompass-gerrit/tmf/org.eclipse.tracecompass.tmf.ui.swtbot.tests/target/work/data -application org.eclipse.tycho.surefire.osgibooter.uitest -testproperties /home/jenkins/agent/workspace/tracecompass-gerrit/tmf/org.eclipse.tracecompass.tmf.ui.swtbot.tests/target/surefire.properties -product org.eclipse.platform.ide -nouithread -consoleLog
12:50:32 [2019-12-21T17:50:32.443Z] 
12:50:32 [2019-12-21T17:50:32.443Z] !ENTRY org.eclipse.compare.win32 4 0 2019-12-21 17:50:32.034
12:50:32 [2019-12-21T17:50:32.443Z] !MESSAGE FrameworkEvent ERROR
12:50:32 [2019-12-21T17:50:32.443Z] !STACK 0
12:50:32 [2019-12-21T17:50:32.443Z] org.osgi.framework.BundleException: Could not resolve module: org.eclipse.compare.win32 [65]
12:50:32 [2019-12-21T17:50:32.443Z]   Unresolved requirement: Require-Capability: eclipse.platform; filter:="(osgi.os=win32)"
12:50:32 [2019-12-21T17:50:32.443Z] 
12:50:32 [2019-12-21T17:50:32.443Z] 	at org.eclipse.osgi.container.Module.start(Module.java:462)
12:50:32 [2019-12-21T17:50:32.443Z] 	at org.eclipse.osgi.container.ModuleContainer$ContainerStartLevel$2.run(ModuleContainer.java:1844)
12:50:32 [2019-12-21T17:50:32.443Z] 	at org.eclipse.osgi.internal.framework.EquinoxContainerAdaptor$1$1.execute(EquinoxContainerAdaptor.java:136)
12:50:32 [2019-12-21T17:50:32.443Z] 	at org.eclipse.osgi.container.ModuleContainer$ContainerStartLevel.incStartLevel(ModuleContainer.java:1837)
12:50:32 [2019-12-21T17:50:32.443Z] 	at org.eclipse.osgi.container.ModuleContainer$ContainerStartLevel.incStartLevel(ModuleContainer.java:1778)
12:50:32 [2019-12-21T17:50:32.443Z] 	at org.eclipse.osgi.container.ModuleContainer$ContainerStartLevel.doContainerStartLevel(ModuleContainer.java:1742)
12:50:32 [2019-12-21T17:50:32.443Z] 	at org.eclipse.osgi.container.ModuleContainer$ContainerStartLevel.dispatchEvent(ModuleContainer.java:1664)
12:50:32 [2019-12-21T17:50:32.443Z] 	at org.eclipse.osgi.container.ModuleContainer$ContainerStartLevel.dispatchEvent(ModuleContainer.java:1)
12:50:32 [2019-12-21T17:50:32.443Z] 	at org.eclipse.osgi.framework.eventmgr.EventManager.dispatchEvent(EventManager.java:234)
12:50:32 [2019-12-21T17:50:32.443Z] 	at org.eclipse.osgi.framework.eventmgr.EventManager$EventThread.run(EventManager.java:345)
12:50:32 [2019-12-21T17:50:32.443Z] 
12:50:32 [2019-12-21T17:50:32.443Z] !ENTRY org.eclipse.ecf.provider.filetransfer.httpclient45.win32 4 0 2019-12-21 17:50:32.136
12:50:32 [2019-12-21T17:50:32.443Z] !MESSAGE FrameworkEvent ERROR
12:50:32 [2019-12-21T17:50:32.443Z] !STACK 0
12:50:32 [2019-12-21T17:50:32.443Z] org.osgi.framework.BundleException: Could not resolve module: org.eclipse.ecf.provider.filetransfer.httpclient45.win32 [133]
12:50:32 [2019-12-21T17:50:32.443Z]   Unresolved requirement: Require-Capability: eclipse.platform; filter:="(osgi.os=win32)"
12:50:32 [2019-12-21T17:50:32.443Z]   Unresolved requirement: Import-Package: org.apache.http.impl.auth.win; version="[4.5.0,5.0.0)"
12:50:32 [2019-12-21T17:50:32.443Z]     -> Export-Package: org.apache.http.impl.auth.win; bundle-symbolic-name="org.apache.httpcomponents.httpclient.win"; bundle-version="4.5.6.v20190213-1947"; version="4.5.6"; x-internal:="true"; uses:="org.apache.http,org.apache.http.auth,org.apache.http.client,org.apache.http.impl.auth,org.apache.http.protocol,org.apache.http.util"
12:50:32 [2019-12-21T17:50:32.443Z]        org.apache.httpcomponents.httpclient.win [36]
12:50:32 [2019-12-21T17:50:32.443Z]          Unresolved requirement: Require-Capability: eclipse.platform; filter:="(osgi.os=win32)"
12:50:32 [2019-12-21T17:50:32.443Z] 
12:50:32 [2019-12-21T17:50:32.443Z] 	at org.eclipse.osgi.container.Module.start(Module.java:462)
12:50:32 [2019-12-21T17:50:32.443Z] 	at org.eclipse.osgi.container.ModuleContainer$ContainerStartLevel$2.run(ModuleContainer.java:1844)
12:50:32 [2019-12-21T17:50:32.443Z] 	at org.eclipse.osgi.internal.framework.EquinoxContainerAdaptor$1$1.execute(EquinoxContainerAdaptor.java:136)
12:50:32 [2019-12-21T17:50:32.443Z] 	at org.eclipse.osgi.container.ModuleContainer$ContainerStartLevel.incStartLevel(ModuleContainer.java:1837)
12:50:32 [2019-12-21T17:50:32.443Z] 	at org.eclipse.osgi.container.ModuleContainer$ContainerStartLevel.incStartLevel(ModuleContainer.java:1778)
12:50:32 [2019-12-21T17:50:32.443Z] 	at org.eclipse.osgi.container.ModuleContainer$ContainerStartLevel.doContainerStartLevel(ModuleContainer.java:1742)
12:50:32 [2019-12-21T17:50:32.443Z] 	at org.eclipse.osgi.container.ModuleContainer$ContainerStartLevel.dispatchEvent(ModuleContainer.java:1664)
12:50:32 [2019-12-21T17:50:32.443Z] 	at org.eclipse.osgi.container.ModuleContainer$ContainerStartLevel.dispatchEvent(ModuleContainer.java:1)
12:50:32 [2019-12-21T17:50:32.443Z] 	at org.eclipse.osgi.framework.eventmgr.EventManager.dispatchEvent(EventManager.java:234)
12:50:32 [2019-12-21T17:50:32.443Z] 	at org.eclipse.osgi.framework.eventmgr.EventManager$EventThread.run(EventManager.java:345)
12:50:33 [2019-12-21T17:50:33.369Z] process 4667: D-Bus library appears to be incorrectly set up; failed to read machine uuid: UUID file '/etc/machine-id' should contain a hex string of length 32, not length 0, with no other text
12:50:33 [2019-12-21T17:50:33.370Z] See the manual page for dbus-uuidgen to correct this issue.
12:50:33 [2019-12-21T17:50:33.625Z] SWT SessionManagerDBus: Failed to connect to org.gnome.SessionManager: Failed to execute child process "dbus-launch" (No such file or directory)
12:50:33 [2019-12-21T17:50:33.625Z] SWT SessionManagerDBus: Failed to connect to org.xfce.SessionManager: Failed to execute child process "dbus-launch" (No such file or directory)
12:50:40 [2019-12-21T17:50:40.159Z] Running org.eclipse.tracecompass.tmf.ui.swtbot.tests.views.TimeGraphViewTest
12:50:40 [2019-12-21T17:50:40.159Z] Display size: 1440x900
12:50:40 [2019-12-21T17:50:40.159Z] OS version=3.10.0-957.10.1.el7.x86_64
12:50:40 [2019-12-21T17:50:40.159Z] GTK version=3.18.9
12:50:40 [2019-12-21T17:50:40.159Z] GTK theme=Ambiance
12:50:40 [2019-12-21T17:50:40.159Z] LIBOVERLAY_SCROLLBAR=0
12:50:40 [2019-12-21T17:50:40.159Z] Time zone: Coordinated Universal Time
12:50:40 [2019-12-21T17:50:40.159Z] log4j:WARN No appenders could be found for logger (org.eclipse.swtbot.swt.finder.widgets.SWTBotShell).
12:50:40 [2019-12-21T17:50:40.159Z] log4j:WARN Please initialize the log4j system properly.
12:50:40 [2019-12-21T17:50:40.185Z] Click here to forcibly terminate running steps
12:50:42 [2019-12-21T17:50:42.495Z] Sending interrupt signal to process
12:50:42 [2019-12-21T17:50:42.495Z] Killing processes
12:50:45 [2019-12-21T17:50:45.186Z] After 20s process did not stop
12:50:45 [2019-12-21T17:50:45.817Z] kill finished with exit code 127
12:50:45 [2019-12-21T17:50:45.818Z] [Pipeline] }
12:50:45 [2019-12-21T17:50:45.826Z] [Pipeline] // container
12:50:45 [2019-12-21T17:50:45.834Z] Post stage
12:50:45 [2019-12-21T17:50:45.838Z] [Pipeline] container
12:50:45 [2019-12-21T17:50:45.838Z] [Pipeline] {
12:50:45 [2019-12-21T17:50:45.847Z] [Pipeline] sh
12:50:48 [2019-12-21T17:50:48.928Z] + echo */*tests/screenshots/*.jpeg,*/*tests/target/work/data/.metadata/.log
12:50:48 [2019-12-21T17:50:48.929Z] */*tests/screenshots/*.jpeg,*/*tests/target/work/data/.metadata/.log
12:50:48 [2019-12-21T17:50:48.936Z] [Pipeline] junit
12:50:48 [2019-12-21T17:50:48.939Z] Recording test results
12:50:56 [2019-12-21T17:50:56.519Z] Aborted by Bernd Hufmann
12:50:56 [2019-12-21T17:50:56.520Z] null
12:50:56 [2019-12-21T17:50:56.521Z] [Pipeline] }
12:50:56 [2019-12-21T17:50:56.530Z] [Pipeline] // container
12:50:56 [2019-12-21T17:50:56.540Z] Error when executing always post condition:
12:50:56 [2019-12-21T17:50:56.540Z] org.jenkinsci.plugins.workflow.steps.FlowInterruptedException
12:50:56 [2019-12-21T17:50:56.540Z] 	at org.jenkinsci.plugins.workflow.cps.CpsFlowExecution.interrupt(CpsFlowExecution.java:1137)
12:50:56 [2019-12-21T17:50:56.540Z] 	at org.jenkinsci.plugins.workflow.job.WorkflowRun$2.lambda$interrupt$0(WorkflowRun.java:367)
12:50:56 [2019-12-21T17:50:56.540Z] 	at org.jenkinsci.plugins.workflow.job.WorkflowRun$2$$Lambda$378.00000000A4035EE0.run(Unknown Source)
12:50:56 [2019-12-21T17:50:56.540Z] 	at jenkins.security.ImpersonatingScheduledExecutorService$1.run(ImpersonatingScheduledExecutorService.java:58)
12:50:56 [2019-12-21T17:50:56.540Z] 	at java.util.concurrent.Executors$RunnableAdapter.call(Unknown Source)
12:50:56 [2019-12-21T17:50:56.540Z] 	at java.util.concurrent.FutureTask.run(Unknown Source)
12:50:56 [2019-12-21T17:50:56.540Z] 	at java.util.concurrent.ScheduledThreadPoolExecutor$ScheduledFutureTask.access$201(Unknown Source)
12:50:56 [2019-12-21T17:50:56.540Z] 	at java.util.concurrent.ScheduledThreadPoolExecutor$ScheduledFutureTask.run(Unknown Source)
12:50:56 [2019-12-21T17:50:56.540Z] 	at java.util.concurrent.ThreadPoolExecutor.runWorker(Unknown Source)
12:50:56 [2019-12-21T17:50:56.540Z] 	at java.util.concurrent.ThreadPoolExecutor$Worker.run(Unknown Source)
12:50:56 [2019-12-21T17:50:56.540Z] 	at java.lang.Thread.run(Unknown Source)
12:50:56 [2019-12-21T17:50:56.540Z] 	Suppressed: java.lang.InterruptedException
12:50:56 [2019-12-21T17:50:56.540Z] 		at java.lang.Object.wait(Native Method)
12:50:56 [2019-12-21T17:50:56.540Z] 		at java.lang.Object.wait(Unknown Source)
12:50:56 [2019-12-21T17:50:56.540Z] 		at hudson.remoting.Request.call(Request.java:177)
12:50:56 [2019-12-21T17:50:56.540Z] 		at hudson.remoting.Channel.call(Channel.java:956)
12:50:56 [2019-12-21T17:50:56.540Z] 		at hudson.FilePath.act(FilePath.java:1072)
12:50:56 [2019-12-21T17:50:56.540Z] 		at hudson.FilePath.act(FilePath.java:1061)
12:50:56 [2019-12-21T17:50:56.540Z] 		at hudson.tasks.junit.JUnitParser.parseResult(JUnitParser.java:114)
12:50:56 [2019-12-21T17:50:56.540Z] 		at hudson.tasks.junit.JUnitResultArchiver.parse(JUnitResultArchiver.java:137)
12:50:56 [2019-12-21T17:50:56.540Z] 		at hudson.tasks.junit.JUnitResultArchiver.parseAndAttach(JUnitResultArchiver.java:167)
12:50:56 [2019-12-21T17:50:56.540Z] 		at hudson.tasks.junit.pipeline.JUnitResultsStepExecution.run(JUnitResultsStepExecution.java:52)
12:50:56 [2019-12-21T17:50:56.540Z] 		at hudson.tasks.junit.pipeline.JUnitResultsStepExecution.run(JUnitResultsStepExecution.java:25)
12:50:56 [2019-12-21T17:50:56.540Z] 		at org.jenkinsci.plugins.workflow.steps.SynchronousNonBlockingStepExecution.lambda$start$0(SynchronousNonBlockingStepExecution.java:47)
12:50:56 [2019-12-21T17:50:56.540Z] 		at org.jenkinsci.plugins.workflow.steps.SynchronousNonBlockingStepExecution$$Lambda$286.00000000B0098EF0.run(Unknown Source)
12:50:56 [2019-12-21T17:50:56.540Z] 		at java.util.concurrent.Executors$RunnableAdapter.call(Unknown Source)
12:50:56 [2019-12-21T17:50:56.540Z] 		at java.util.concurrent.FutureTask.run(Unknown Source)
12:50:56 [2019-12-21T17:50:56.540Z] 		... 3 more
12:50:56 [2019-12-21T17:50:56.540Z] 
12:50:56 [2019-12-21T17:50:56.544Z] [Pipeline] }
12:50:56 [2019-12-21T17:50:56.553Z] [Pipeline] // withEnv
12:50:56 [2019-12-21T17:50:56.561Z] [Pipeline] }
12:50:56 [2019-12-21T17:50:56.569Z] [Pipeline] // stage
12:50:56 [2019-12-21T17:50:56.579Z] [Pipeline] stage
12:50:56 [2019-12-21T17:50:56.582Z] [Pipeline] { (Deploy Site)
12:50:56 [2019-12-21T17:50:56.590Z] Stage "Deploy Site" skipped due to earlier failure(s)
12:50:56 [2019-12-21T17:50:56.591Z] [Pipeline] }
12:50:56 [2019-12-21T17:50:56.599Z] [Pipeline] // stage
12:50:56 [2019-12-21T17:50:56.609Z] [Pipeline] stage
12:50:56 [2019-12-21T17:50:56.612Z] [Pipeline] { (Deploy RCP)
12:50:56 [2019-12-21T17:50:56.620Z] Stage "Deploy RCP" skipped due to earlier failure(s)
12:50:56 [2019-12-21T17:50:56.620Z] [Pipeline] }
12:50:56 [2019-12-21T17:50:56.628Z] [Pipeline] // stage
12:50:56 [2019-12-21T17:50:56.639Z] [Pipeline] stage
12:50:56 [2019-12-21T17:50:56.641Z] [Pipeline] { (Deploy Doc)
12:50:56 [2019-12-21T17:50:56.651Z] Stage "Deploy Doc" skipped due to earlier failure(s)
12:50:56 [2019-12-21T17:50:56.651Z] [Pipeline] }
12:50:56 [2019-12-21T17:50:56.663Z] [Pipeline] // stage
12:50:56 [2019-12-21T17:50:56.673Z] [Pipeline] }
12:50:56 [2019-12-21T17:50:56.684Z] [Pipeline] // withEnv
12:50:56 [2019-12-21T17:50:56.692Z] [Pipeline] }
12:50:56 [2019-12-21T17:50:56.700Z] [Pipeline] // timeout
12:50:56 [2019-12-21T17:50:56.709Z] [Pipeline] }
12:50:56 [2019-12-21T17:50:56.718Z] [Pipeline] // timestamps
12:50:56 [2019-12-21T17:50:56.727Z] [Pipeline] }
12:50:56 [2019-12-21T17:50:56.734Z] [Pipeline] // withEnv
12:50:56 [2019-12-21T17:50:56.743Z] [Pipeline] }
12:50:56 [2019-12-21T17:50:56.751Z] [Pipeline] // container
12:50:56 [2019-12-21T17:50:56.760Z] [Pipeline] }
12:50:56 [2019-12-21T17:50:56.768Z] [Pipeline] // withEnv
12:50:56 [2019-12-21T17:50:56.776Z] [Pipeline] }
12:50:56 [2019-12-21T17:50:56.784Z] [Pipeline] // node
12:50:56 [2019-12-21T17:50:56.791Z] [Pipeline] }
12:50:56 [2019-12-21T17:50:56.799Z] [Pipeline] // podTemplate
12:50:56 [2019-12-21T17:50:56.807Z] [Pipeline] End of Pipeline
12:50:56 [2019-12-21T17:50:56.836Z] Finished: ABORTED