AbortedConsole Output

Skipping 4,167 KB.. Full Log
^^^^^^^^^^^^^^^^^^^^^^^^^^^^
17:25:11 [2020-07-09T21:25:11.045Z] Discouraged access: The type 'TmfFilterAppliedSignal' is not API (restriction on classpath entry '/home/jenkins/agent/workspace/tracecompass-gerrit-short-ui-only/tmf/org.eclipse.tracecompass.tmf.core/target/classes')
17:25:11 [2020-07-09T21:25:11.045Z] [WARNING] /home/jenkins/agent/workspace/tracecompass-gerrit-short-ui-only/analysis/org.eclipse.tracecompass.analysis.timing.ui/src/org/eclipse/tracecompass/analysis/timing/ui/views/segmentstore/table/AbstractSegmentStoreTableViewer.java:[65] 
17:25:11 [2020-07-09T21:25:11.045Z] 	import org.eclipse.tracecompass.internal.provisional.tmf.core.model.filters.TraceCompassFilter;
17:25:11 [2020-07-09T21:25:11.045Z] 	       ^^^^^^^^^^^^^^^^^^^^^^^^^^^^^^^^^^^^^^^^^^^^^^^^^^^^^^^^^^^^^^^^^^^^^^^^^^^^^^^^^^^^^^^
17:25:11 [2020-07-09T21:25:11.045Z] Discouraged access: The type 'TraceCompassFilter' is not API (restriction on classpath entry '/home/jenkins/agent/workspace/tracecompass-gerrit-short-ui-only/tmf/org.eclipse.tracecompass.tmf.core/target/classes')
17:25:11 [2020-07-09T21:25:11.045Z] [WARNING] /home/jenkins/agent/workspace/tracecompass-gerrit-short-ui-only/analysis/org.eclipse.tracecompass.analysis.timing.ui/src/org/eclipse/tracecompass/analysis/timing/ui/views/segmentstore/table/AbstractSegmentStoreTableViewer.java:[66] 
17:25:11 [2020-07-09T21:25:11.045Z] 	import org.eclipse.tracecompass.internal.segmentstore.core.arraylist.ArrayListStore;
17:25:11 [2020-07-09T21:25:11.045Z] 	       ^^^^^^^^^^^^^^^^^^^^^^^^^^^^^^^^^^^^^^^^^^^^^^^^^^^^^^^^^^^^^^^^^^^^^^^^^^^^
17:25:11 [2020-07-09T21:25:11.045Z] Discouraged access: The type 'ArrayListStore<E>' is not API (restriction on classpath entry '/home/jenkins/agent/workspace/tracecompass-gerrit-short-ui-only/statesystem/org.eclipse.tracecompass.segmentstore.core/target/classes')
17:25:11 [2020-07-09T21:25:11.045Z] [WARNING] /home/jenkins/agent/workspace/tracecompass-gerrit-short-ui-only/analysis/org.eclipse.tracecompass.analysis.timing.ui/src/org/eclipse/tracecompass/analysis/timing/ui/views/segmentstore/table/AbstractSegmentStoreTableViewer.java:[435] 
17:25:11 [2020-07-09T21:25:11.045Z] 	ISegmentStore<ISegment> filteredStore = new ArrayListStore<>();
17:25:11 [2020-07-09T21:25:11.045Z] 	                                        ^^^^^^^^^^^^^^^^^^^^^^
17:25:11 [2020-07-09T21:25:11.045Z] Discouraged access: The constructor 'ArrayListStore<ISegment>()' is not API (restriction on classpath entry '/home/jenkins/agent/workspace/tracecompass-gerrit-short-ui-only/statesystem/org.eclipse.tracecompass.segmentstore.core/target/classes')
17:25:11 [2020-07-09T21:25:11.045Z] [WARNING] /home/jenkins/agent/workspace/tracecompass-gerrit-short-ui-only/analysis/org.eclipse.tracecompass.analysis.timing.ui/src/org/eclipse/tracecompass/analysis/timing/ui/views/segmentstore/table/AbstractSegmentStoreTableViewer.java:[435] 
17:25:11 [2020-07-09T21:25:11.045Z] 	ISegmentStore<ISegment> filteredStore = new ArrayListStore<>();
17:25:11 [2020-07-09T21:25:11.045Z] 	                                            ^^^^^^^^^^^^^^
17:25:11 [2020-07-09T21:25:11.045Z] Discouraged access: The type 'ArrayListStore' is not API (restriction on classpath entry '/home/jenkins/agent/workspace/tracecompass-gerrit-short-ui-only/statesystem/org.eclipse.tracecompass.segmentstore.core/target/classes')
17:25:11 [2020-07-09T21:25:11.045Z] [WARNING] /home/jenkins/agent/workspace/tracecompass-gerrit-short-ui-only/analysis/org.eclipse.tracecompass.analysis.timing.ui/src/org/eclipse/tracecompass/analysis/timing/ui/views/segmentstore/table/AbstractSegmentStoreTableViewer.java:[478] 
17:25:11 [2020-07-09T21:25:11.045Z] 	for (Map.Entry<Integer, Collection<String>> entry : regexes.asMap().entrySet()) {
17:25:11 [2020-07-09T21:25:11.045Z] 	                                                    ^^^^^^^^^^^^^^^^^^^^^^^^^^
17:25:11 [2020-07-09T21:25:11.045Z] Null type safety (type annotations): The expression of type 'Map.@NonNull Entry<@NonNull Integer,Collection<@NonNull String>>' needs unchecked conversion to conform to 'Map.Entry<@NonNull Integer,@NonNull Collection<@NonNull String>>'
17:25:11 [2020-07-09T21:25:11.045Z] [WARNING] /home/jenkins/agent/workspace/tracecompass-gerrit-short-ui-only/analysis/org.eclipse.tracecompass.analysis.timing.ui/src/org/eclipse/tracecompass/analysis/timing/ui/views/segmentstore/table/AbstractSegmentStoreTableViewer.java:[479] 
17:25:11 [2020-07-09T21:25:11.045Z] 	String regex = IFilterStrings.mergeFilters(entry.getValue());
17:25:11 [2020-07-09T21:25:11.045Z] 	               ^^^^^^^^^^^^^^
17:25:11 [2020-07-09T21:25:11.045Z] Discouraged access: The type 'IFilterStrings' is not API (restriction on classpath entry '/home/jenkins/agent/workspace/tracecompass-gerrit-short-ui-only/tmf/org.eclipse.tracecompass.tmf.core/target/classes')
17:25:11 [2020-07-09T21:25:11.045Z] [WARNING] /home/jenkins/agent/workspace/tracecompass-gerrit-short-ui-only/analysis/org.eclipse.tracecompass.analysis.timing.ui/src/org/eclipse/tracecompass/analysis/timing/ui/views/segmentstore/table/AbstractSegmentStoreTableViewer.java:[479] 
17:25:11 [2020-07-09T21:25:11.045Z] 	String regex = IFilterStrings.mergeFilters(entry.getValue());
17:25:11 [2020-07-09T21:25:11.045Z] 	               ^^^^^^^^^^^^^^^^^^^^^^^^^^^^^^^^^^^^^^^^^^^^^
17:25:11 [2020-07-09T21:25:11.045Z] Discouraged access: The method 'IFilterStrings.mergeFilters(Collection<String>)' is not API (restriction on classpath entry '/home/jenkins/agent/workspace/tracecompass-gerrit-short-ui-only/tmf/org.eclipse.tracecompass.tmf.core/target/classes')
17:25:11 [2020-07-09T21:25:11.045Z] [WARNING] /home/jenkins/agent/workspace/tracecompass-gerrit-short-ui-only/analysis/org.eclipse.tracecompass.analysis.timing.ui/src/org/eclipse/tracecompass/analysis/timing/ui/views/segmentstore/table/AbstractSegmentStoreTableViewer.java:[480] 
17:25:11 [2020-07-09T21:25:11.045Z] 	FilterCu cu = FilterCu.compile(regex);
17:25:11 [2020-07-09T21:25:11.045Z] 	^^^^^^^^
17:25:11 [2020-07-09T21:25:11.045Z] Discouraged access: The type 'FilterCu' is not API (restriction on classpath entry '/home/jenkins/agent/workspace/tracecompass-gerrit-short-ui-only/tmf/org.eclipse.tracecompass.tmf.core/target/classes')
17:25:11 [2020-07-09T21:25:11.045Z] [WARNING] /home/jenkins/agent/workspace/tracecompass-gerrit-short-ui-only/analysis/org.eclipse.tracecompass.analysis.timing.ui/src/org/eclipse/tracecompass/analysis/timing/ui/views/segmentstore/table/AbstractSegmentStoreTableViewer.java:[480] 
17:25:11 [2020-07-09T21:25:11.045Z] 	FilterCu cu = FilterCu.compile(regex);
17:25:11 [2020-07-09T21:25:11.045Z] 	              ^^^^^^^^
17:25:11 [2020-07-09T21:25:11.045Z] Discouraged access: The type 'FilterCu' is not API (restriction on classpath entry '/home/jenkins/agent/workspace/tracecompass-gerrit-short-ui-only/tmf/org.eclipse.tracecompass.tmf.core/target/classes')
17:25:11 [2020-07-09T21:25:11.045Z] [WARNING] /home/jenkins/agent/workspace/tracecompass-gerrit-short-ui-only/analysis/org.eclipse.tracecompass.analysis.timing.ui/src/org/eclipse/tracecompass/analysis/timing/ui/views/segmentstore/table/AbstractSegmentStoreTableViewer.java:[480] 
17:25:11 [2020-07-09T21:25:11.045Z] 	FilterCu cu = FilterCu.compile(regex);
17:25:11 [2020-07-09T21:25:11.045Z] 	              ^^^^^^^^^^^^^^^^^^^^^^^
17:25:11 [2020-07-09T21:25:11.045Z] Discouraged access: The method 'FilterCu.compile(String)' is not API (restriction on classpath entry '/home/jenkins/agent/workspace/tracecompass-gerrit-short-ui-only/tmf/org.eclipse.tracecompass.tmf.core/target/classes')
17:25:11 [2020-07-09T21:25:11.045Z] [WARNING] /home/jenkins/agent/workspace/tracecompass-gerrit-short-ui-only/analysis/org.eclipse.tracecompass.analysis.timing.ui/src/org/eclipse/tracecompass/analysis/timing/ui/views/segmentstore/table/AbstractSegmentStoreTableViewer.java:[481] 
17:25:11 [2020-07-09T21:25:11.045Z] 	Predicate<@NonNull Map<@NonNull String, @NonNull Object>> predicate = cu != null ? multiToMapPredicate(cu.generate()) : null;
17:25:11 [2020-07-09T21:25:11.045Z] 	                                                                                                       ^^^^^^^^^^^^^
17:25:11 [2020-07-09T21:25:11.045Z] Discouraged access: The method 'FilterCu.generate()' is not API (restriction on classpath entry '/home/jenkins/agent/workspace/tracecompass-gerrit-short-ui-only/tmf/org.eclipse.tracecompass.tmf.core/target/classes')
17:25:11 [2020-07-09T21:25:11.045Z] [WARNING] /home/jenkins/agent/workspace/tracecompass-gerrit-short-ui-only/analysis/org.eclipse.tracecompass.analysis.timing.ui/src/org/eclipse/tracecompass/analysis/timing/ui/views/segmentstore/table/AbstractSegmentStoreTableViewer.java:[506] 
17:25:11 [2020-07-09T21:25:11.045Z] 	for (Entry<Integer, Collection<String>> entry : regexes.asMap().entrySet()) {
17:25:11 [2020-07-09T21:25:11.045Z] 	                                                ^^^^^^^^^^^^^^^^^^^^^^^^^^
17:25:11 [2020-07-09T21:25:11.045Z] Null type safety (type annotations): The expression of type 'Map.@NonNull Entry<@NonNull Integer,Collection<@NonNull String>>' needs unchecked conversion to conform to 'Map.Entry<@NonNull Integer,@NonNull Collection<@NonNull String>>'
17:25:11 [2020-07-09T21:25:11.045Z] [WARNING] /home/jenkins/agent/workspace/tracecompass-gerrit-short-ui-only/analysis/org.eclipse.tracecompass.analysis.timing.ui/src/org/eclipse/tracecompass/analysis/timing/ui/views/segmentstore/table/AbstractSegmentStoreTableViewer.java:[507] 
17:25:11 [2020-07-09T21:25:11.045Z] 	String regex = IFilterStrings.mergeFilters(entry.getValue());
17:25:11 [2020-07-09T21:25:11.045Z] 	               ^^^^^^^^^^^^^^
17:25:11 [2020-07-09T21:25:11.045Z] Discouraged access: The type 'IFilterStrings' is not API (restriction on classpath entry '/home/jenkins/agent/workspace/tracecompass-gerrit-short-ui-only/tmf/org.eclipse.tracecompass.tmf.core/target/classes')
17:25:11 [2020-07-09T21:25:11.045Z] [WARNING] /home/jenkins/agent/workspace/tracecompass-gerrit-short-ui-only/analysis/org.eclipse.tracecompass.analysis.timing.ui/src/org/eclipse/tracecompass/analysis/timing/ui/views/segmentstore/table/AbstractSegmentStoreTableViewer.java:[507] 
17:25:11 [2020-07-09T21:25:11.045Z] 	String regex = IFilterStrings.mergeFilters(entry.getValue());
17:25:11 [2020-07-09T21:25:11.045Z] 	               ^^^^^^^^^^^^^^^^^^^^^^^^^^^^^^^^^^^^^^^^^^^^^
17:25:11 [2020-07-09T21:25:11.045Z] Discouraged access: The method 'IFilterStrings.mergeFilters(Collection<String>)' is not API (restriction on classpath entry '/home/jenkins/agent/workspace/tracecompass-gerrit-short-ui-only/tmf/org.eclipse.tracecompass.tmf.core/target/classes')
17:25:11 [2020-07-09T21:25:11.045Z] [WARNING] /home/jenkins/agent/workspace/tracecompass-gerrit-short-ui-only/analysis/org.eclipse.tracecompass.analysis.timing.ui/src/org/eclipse/tracecompass/analysis/timing/ui/views/segmentstore/table/AbstractSegmentStoreTableViewer.java:[508] 
17:25:11 [2020-07-09T21:25:11.045Z] 	FilterCu cu = FilterCu.compile(regex);
17:25:11 [2020-07-09T21:25:11.045Z] 	^^^^^^^^
17:25:11 [2020-07-09T21:25:11.045Z] Discouraged access: The type 'FilterCu' is not API (restriction on classpath entry '/home/jenkins/agent/workspace/tracecompass-gerrit-short-ui-only/tmf/org.eclipse.tracecompass.tmf.core/target/classes')
17:25:11 [2020-07-09T21:25:11.045Z] [WARNING] /home/jenkins/agent/workspace/tracecompass-gerrit-short-ui-only/analysis/org.eclipse.tracecompass.analysis.timing.ui/src/org/eclipse/tracecompass/analysis/timing/ui/views/segmentstore/table/AbstractSegmentStoreTableViewer.java:[508] 
17:25:11 [2020-07-09T21:25:11.045Z] 	FilterCu cu = FilterCu.compile(regex);
17:25:11 [2020-07-09T21:25:11.045Z] 	              ^^^^^^^^
17:25:11 [2020-07-09T21:25:11.045Z] Discouraged access: The type 'FilterCu' is not API (restriction on classpath entry '/home/jenkins/agent/workspace/tracecompass-gerrit-short-ui-only/tmf/org.eclipse.tracecompass.tmf.core/target/classes')
17:25:11 [2020-07-09T21:25:11.045Z] [WARNING] /home/jenkins/agent/workspace/tracecompass-gerrit-short-ui-only/analysis/org.eclipse.tracecompass.analysis.timing.ui/src/org/eclipse/tracecompass/analysis/timing/ui/views/segmentstore/table/AbstractSegmentStoreTableViewer.java:[508] 
17:25:11 [2020-07-09T21:25:11.045Z] 	FilterCu cu = FilterCu.compile(regex);
17:25:11 [2020-07-09T21:25:11.045Z] 	              ^^^^^^^^^^^^^^^^^^^^^^^
17:25:11 [2020-07-09T21:25:11.045Z] Discouraged access: The method 'FilterCu.compile(String)' is not API (restriction on classpath entry '/home/jenkins/agent/workspace/tracecompass-gerrit-short-ui-only/tmf/org.eclipse.tracecompass.tmf.core/target/classes')
17:25:11 [2020-07-09T21:25:11.045Z] [WARNING] /home/jenkins/agent/workspace/tracecompass-gerrit-short-ui-only/analysis/org.eclipse.tracecompass.analysis.timing.ui/src/org/eclipse/tracecompass/analysis/timing/ui/views/segmentstore/table/AbstractSegmentStoreTableViewer.java:[509] 
17:25:11 [2020-07-09T21:25:11.045Z] 	Predicate<@NonNull Multimap<@NonNull String, @NonNull Object>> predicate = cu != null ? cu.generate() : null;
17:25:11 [2020-07-09T21:25:11.045Z] 	                                                                                        ^^^^^^^^^^^^^
17:25:11 [2020-07-09T21:25:11.045Z] Discouraged access: The method 'FilterCu.generate()' is not API (restriction on classpath entry '/home/jenkins/agent/workspace/tracecompass-gerrit-short-ui-only/tmf/org.eclipse.tracecompass.tmf.core/target/classes')
17:25:11 [2020-07-09T21:25:11.045Z] [WARNING] /home/jenkins/agent/workspace/tracecompass-gerrit-short-ui-only/analysis/org.eclipse.tracecompass.analysis.timing.ui/src/org/eclipse/tracecompass/analysis/timing/ui/views/segmentstore/table/AbstractSegmentStoreTableViewer.java:[671] 
17:25:11 [2020-07-09T21:25:11.045Z] 	public void regexFilterApplied(TmfFilterAppliedSignal signal) {
17:25:11 [2020-07-09T21:25:11.045Z] 	                               ^^^^^^^^^^^^^^^^^^^^^^
17:25:11 [2020-07-09T21:25:11.045Z] Discouraged access: The type 'TmfFilterAppliedSignal' is not API (restriction on classpath entry '/home/jenkins/agent/workspace/tracecompass-gerrit-short-ui-only/tmf/org.eclipse.tracecompass.tmf.core/target/classes')
17:25:11 [2020-07-09T21:25:11.046Z] [WARNING] /home/jenkins/agent/workspace/tracecompass-gerrit-short-ui-only/analysis/org.eclipse.tracecompass.analysis.timing.ui/src/org/eclipse/tracecompass/analysis/timing/ui/views/segmentstore/table/AbstractSegmentStoreTableViewer.java:[696] 
17:25:11 [2020-07-09T21:25:11.046Z] 	TraceCompassFilter globalFilter = TraceCompassFilter.getFilterForTrace(trace);
17:25:11 [2020-07-09T21:25:11.046Z] 	^^^^^^^^^^^^^^^^^^
17:25:11 [2020-07-09T21:25:11.046Z] Discouraged access: The type 'TraceCompassFilter' is not API (restriction on classpath entry '/home/jenkins/agent/workspace/tracecompass-gerrit-short-ui-only/tmf/org.eclipse.tracecompass.tmf.core/target/classes')
17:25:11 [2020-07-09T21:25:11.046Z] [WARNING] /home/jenkins/agent/workspace/tracecompass-gerrit-short-ui-only/analysis/org.eclipse.tracecompass.analysis.timing.ui/src/org/eclipse/tracecompass/analysis/timing/ui/views/segmentstore/table/AbstractSegmentStoreTableViewer.java:[696] 
17:25:11 [2020-07-09T21:25:11.046Z] 	TraceCompassFilter globalFilter = TraceCompassFilter.getFilterForTrace(trace);
17:25:11 [2020-07-09T21:25:11.046Z] 	                                  ^^^^^^^^^^^^^^^^^^
17:25:11 [2020-07-09T21:25:11.046Z] Discouraged access: The type 'TraceCompassFilter' is not API (restriction on classpath entry '/home/jenkins/agent/workspace/tracecompass-gerrit-short-ui-only/tmf/org.eclipse.tracecompass.tmf.core/target/classes')
17:25:11 [2020-07-09T21:25:11.046Z] [WARNING] /home/jenkins/agent/workspace/tracecompass-gerrit-short-ui-only/analysis/org.eclipse.tracecompass.analysis.timing.ui/src/org/eclipse/tracecompass/analysis/timing/ui/views/segmentstore/table/AbstractSegmentStoreTableViewer.java:[696] 
17:25:11 [2020-07-09T21:25:11.046Z] 	TraceCompassFilter globalFilter = TraceCompassFilter.getFilterForTrace(trace);
17:25:11 [2020-07-09T21:25:11.046Z] 	                                  ^^^^^^^^^^^^^^^^^^^^^^^^^^^^^^^^^^^^^^^^^^^
17:25:11 [2020-07-09T21:25:11.046Z] Discouraged access: The method 'TraceCompassFilter.getFilterForTrace(ITmfTrace)' is not API (restriction on classpath entry '/home/jenkins/agent/workspace/tracecompass-gerrit-short-ui-only/tmf/org.eclipse.tracecompass.tmf.core/target/classes')
17:25:11 [2020-07-09T21:25:11.046Z] [WARNING] /home/jenkins/agent/workspace/tracecompass-gerrit-short-ui-only/analysis/org.eclipse.tracecompass.analysis.timing.ui/src/org/eclipse/tracecompass/analysis/timing/ui/views/segmentstore/table/AbstractSegmentStoreTableViewer.java:[700] 
17:25:11 [2020-07-09T21:25:11.046Z] 	regexes.putAll(IFilterProperty.DIMMED, globalFilter.getRegexes());
17:25:11 [2020-07-09T21:25:11.046Z] 	                                       ^^^^^^^^^^^^^^^^^^^^^^^^^
17:25:11 [2020-07-09T21:25:11.046Z] Discouraged access: The method 'TraceCompassFilter.getRegexes()' is not API (restriction on classpath entry '/home/jenkins/agent/workspace/tracecompass-gerrit-short-ui-only/tmf/org.eclipse.tracecompass.tmf.core/target/classes')
17:25:11 [2020-07-09T21:25:11.046Z] [WARNING] /home/jenkins/agent/workspace/tracecompass-gerrit-short-ui-only/analysis/org.eclipse.tracecompass.analysis.timing.ui/src/org/eclipse/tracecompass/analysis/timing/ui/views/segmentstore/statistics/AbstractSegmentsStatisticsViewer.java:[123] 
17:25:11 [2020-07-09T21:25:11.046Z] 	SegmentStoreStatisticsModel model = ((TmfGenericTreeEntry<@NonNull SegmentStoreStatisticsModel>) element).getModel();
17:25:11 [2020-07-09T21:25:11.046Z] 	                                    ^^^^^^^^^^^^^^^^^^^^^^^^^^^^^^^^^^^^^^^^^^^^^^^^^^^^^^^^^^^^^^^^^^^^^
17:25:11 [2020-07-09T21:25:11.046Z] Type safety: Unchecked cast from Object to TmfGenericTreeEntry<SegmentStoreStatisticsModel>
17:25:11 [2020-07-09T21:25:11.046Z] 56. INFO in /home/jenkins/agent/workspace/tracecompass-gerrit-short-ui-only/analysis/org.eclipse.tracecompass.analysis.timing.ui/src/org/eclipse/tracecompass/analysis/timing/ui/views/segmentstore/statistics/AbstractSegmentsStatisticsViewer.java (at line 123)
17:25:11 [2020-07-09T21:25:11.046Z] 	SegmentStoreStatisticsModel model = ((TmfGenericTreeEntry<@NonNull SegmentStoreStatisticsModel>) element).getModel();
17:25:11 [2020-07-09T21:25:11.046Z] 	                                    ^^^^^^^^^^^^^^^^^^^^^^^^^^^^^^^^^^^^^^^^^^^^^^^^^^^^^^^^^^^^^^^^^^^^^^^^^^^^^^^^
17:25:11 [2020-07-09T21:25:11.046Z] Unsafe interpretation of method return type as '@NonNull' based on the receiver type 'TmfGenericTreeEntry<@NonNull SegmentStoreStatisticsModel>'. Type 'TmfGenericTreeEntry<M>' doesn't seem to be designed with null type annotations in mind
17:25:11 [2020-07-09T21:25:11.046Z] [WARNING] /home/jenkins/agent/workspace/tracecompass-gerrit-short-ui-only/analysis/org.eclipse.tracecompass.analysis.timing.ui/src/org/eclipse/tracecompass/analysis/timing/ui/views/segmentstore/statistics/AbstractSegmentsStatisticsViewer.java:[149] 
17:25:11 [2020-07-09T21:25:11.046Z] 	createTmfTreeColumnData(Messages.SegmentStoreStatistics_LevelLabel, Comparator.comparing(TmfTreeViewerEntry::getName)),
17:25:11 [2020-07-09T21:25:11.046Z] 	                                                                    ^^^^^^^^^^^^^^^^^^^^^^^^^^^^^^^^^^^^^^^^^^^^^^^^^
17:25:11 [2020-07-09T21:25:11.046Z] Null type safety (type annotations): The expression of type 'Comparator<@NonNull TmfTreeViewerEntry>' needs unchecked conversion to conform to '@NonNull Comparator<@NonNull TmfTreeViewerEntry>'
17:25:11 [2020-07-09T21:25:11.046Z] [WARNING] /home/jenkins/agent/workspace/tracecompass-gerrit-short-ui-only/analysis/org.eclipse.tracecompass.analysis.timing.ui/src/org/eclipse/tracecompass/analysis/timing/ui/views/segmentstore/statistics/AbstractSegmentsStatisticsViewer.java:[150] 
17:25:11 [2020-07-09T21:25:11.046Z] 	createTmfTreeColumnData(Messages.SegmentStoreStatistics_Statistics_MinLabel, Comparator.comparing(keyExtractor(SegmentStoreStatisticsModel::getMin))),
17:25:11 [2020-07-09T21:25:11.046Z] 	                                                                             ^^^^^^^^^^^^^^^^^^^^^^^^^^^^^^^^^^^^^^^^^^^^^^^^^^^^^^^^^^^^^^^^^^^^^^^
17:25:11 [2020-07-09T21:25:11.046Z] Null type safety (type annotations): The expression of type 'Comparator<@NonNull TmfTreeViewerEntry>' needs unchecked conversion to conform to '@NonNull Comparator<@NonNull TmfTreeViewerEntry>'
17:25:11 [2020-07-09T21:25:11.046Z] [WARNING] /home/jenkins/agent/workspace/tracecompass-gerrit-short-ui-only/analysis/org.eclipse.tracecompass.analysis.timing.ui/src/org/eclipse/tracecompass/analysis/timing/ui/views/segmentstore/statistics/AbstractSegmentsStatisticsViewer.java:[151] 
17:25:11 [2020-07-09T21:25:11.046Z] 	createTmfTreeColumnData(Messages.SegmentStoreStatistics_MaxLabel, Comparator.comparing(keyExtractor(SegmentStoreStatisticsModel::getMax))),
17:25:11 [2020-07-09T21:25:11.046Z] 	                                                                  ^^^^^^^^^^^^^^^^^^^^^^^^^^^^^^^^^^^^^^^^^^^^^^^^^^^^^^^^^^^^^^^^^^^^^^^
17:25:11 [2020-07-09T21:25:11.046Z] Null type safety (type annotations): The expression of type 'Comparator<@NonNull TmfTreeViewerEntry>' needs unchecked conversion to conform to '@NonNull Comparator<@NonNull TmfTreeViewerEntry>'
17:25:11 [2020-07-09T21:25:11.046Z] [WARNING] /home/jenkins/agent/workspace/tracecompass-gerrit-short-ui-only/analysis/org.eclipse.tracecompass.analysis.timing.ui/src/org/eclipse/tracecompass/analysis/timing/ui/views/segmentstore/statistics/AbstractSegmentsStatisticsViewer.java:[152] 
17:25:11 [2020-07-09T21:25:11.046Z] 	createTmfTreeColumnData(Messages.SegmentStoreStatistics_AverageLabel, Comparator.comparing(keyExtractor(SegmentStoreStatisticsModel::getMean))),
17:25:11 [2020-07-09T21:25:11.046Z] 	                                                                      ^^^^^^^^^^^^^^^^^^^^^^^^^^^^^^^^^^^^^^^^^^^^^^^^^^^^^^^^^^^^^^^^^^^^^^^^
17:25:11 [2020-07-09T21:25:11.046Z] Null type safety (type annotations): The expression of type 'Comparator<@NonNull TmfTreeViewerEntry>' needs unchecked conversion to conform to '@NonNull Comparator<@NonNull TmfTreeViewerEntry>'
17:25:11 [2020-07-09T21:25:11.046Z] [WARNING] /home/jenkins/agent/workspace/tracecompass-gerrit-short-ui-only/analysis/org.eclipse.tracecompass.analysis.timing.ui/src/org/eclipse/tracecompass/analysis/timing/ui/views/segmentstore/statistics/AbstractSegmentsStatisticsViewer.java:[153] 
17:25:11 [2020-07-09T21:25:11.046Z] 	createTmfTreeColumnData(Messages.SegmentStoreStatisticsViewer_StandardDeviation, Comparator.comparing(keyExtractor(SegmentStoreStatisticsModel::getStdDev))),
17:25:11 [2020-07-09T21:25:11.046Z] 	                                                                                 ^^^^^^^^^^^^^^^^^^^^^^^^^^^^^^^^^^^^^^^^^^^^^^^^^^^^^^^^^^^^^^^^^^^^^^^^^^
17:25:11 [2020-07-09T21:25:11.046Z] Null type safety (type annotations): The expression of type 'Comparator<@NonNull TmfTreeViewerEntry>' needs unchecked conversion to conform to '@NonNull Comparator<@NonNull TmfTreeViewerEntry>'
17:25:11 [2020-07-09T21:25:11.046Z] [WARNING] /home/jenkins/agent/workspace/tracecompass-gerrit-short-ui-only/analysis/org.eclipse.tracecompass.analysis.timing.ui/src/org/eclipse/tracecompass/analysis/timing/ui/views/segmentstore/statistics/AbstractSegmentsStatisticsViewer.java:[154] 
17:25:11 [2020-07-09T21:25:11.046Z] 	createTmfTreeColumnData(Messages.SegmentStoreStatisticsViewer_Count, Comparator.comparing(keyExtractor(SegmentStoreStatisticsModel::getNbElements))),
17:25:11 [2020-07-09T21:25:11.046Z] 	                                                                     ^^^^^^^^^^^^^^^^^^^^^^^^^^^^^^^^^^^^^^^^^^^^^^^^^^^^^^^^^^^^^^^^^^^^^^^^^^^^^^
17:25:11 [2020-07-09T21:25:11.046Z] Null type safety (type annotations): The expression of type 'Comparator<@NonNull TmfTreeViewerEntry>' needs unchecked conversion to conform to '@NonNull Comparator<@NonNull TmfTreeViewerEntry>'
17:25:11 [2020-07-09T21:25:11.046Z] [WARNING] /home/jenkins/agent/workspace/tracecompass-gerrit-short-ui-only/analysis/org.eclipse.tracecompass.analysis.timing.ui/src/org/eclipse/tracecompass/analysis/timing/ui/views/segmentstore/statistics/AbstractSegmentsStatisticsViewer.java:[155] 
17:25:11 [2020-07-09T21:25:11.046Z] 	createTmfTreeColumnData(Messages.SegmentStoreStatisticsViewer_Total, Comparator.comparing(keyExtractor(SegmentStoreStatisticsModel::getTotal))),
17:25:11 [2020-07-09T21:25:11.046Z] 	                                                                     ^^^^^^^^^^^^^^^^^^^^^^^^^^^^^^^^^^^^^^^^^^^^^^^^^^^^^^^^^^^^^^^^^^^^^^^^^
17:25:11 [2020-07-09T21:25:11.046Z] Null type safety (type annotations): The expression of type 'Comparator<@NonNull TmfTreeViewerEntry>' needs unchecked conversion to conform to '@NonNull Comparator<@NonNull TmfTreeViewerEntry>'
17:25:11 [2020-07-09T21:25:11.046Z] [WARNING] /home/jenkins/agent/workspace/tracecompass-gerrit-short-ui-only/analysis/org.eclipse.tracecompass.analysis.timing.ui/src/org/eclipse/tracecompass/analysis/timing/ui/views/segmentstore/statistics/AbstractSegmentsStatisticsViewer.java:[183] 
17:25:11 [2020-07-09T21:25:11.046Z] 	return modelExtractor.apply(((TmfGenericTreeEntry<M>) entry).getModel());
17:25:11 [2020-07-09T21:25:11.046Z] 	       ^^^^^^^^^^^^^^^^^^^^^^^^^^^^^^^^^^^^^^^^^^^^^^^^^^^^^^^^^^^^^^^^^
17:25:11 [2020-07-09T21:25:11.046Z] Unsafe interpretation of method return type as '@NonNull' based on the receiver type '@NonNull Function<M extends @NonNull SegmentStoreStatisticsModel,E extends @NonNull Comparable<E>>'. Type 'Function<T,R>' doesn't seem to be designed with null type annotations in mind
17:25:11 [2020-07-09T21:25:11.046Z] [WARNING] /home/jenkins/agent/workspace/tracecompass-gerrit-short-ui-only/analysis/org.eclipse.tracecompass.analysis.timing.ui/src/org/eclipse/tracecompass/analysis/timing/ui/views/segmentstore/statistics/AbstractSegmentsStatisticsViewer.java:[183] 
17:25:11 [2020-07-09T21:25:11.046Z] 	return modelExtractor.apply(((TmfGenericTreeEntry<M>) entry).getModel());
17:25:11 [2020-07-09T21:25:11.046Z] 	                            ^^^^^^^^^^^^^^^^^^^^^^^^^^^^^^^^
17:25:11 [2020-07-09T21:25:11.046Z] Type safety: Unchecked cast from TmfTreeViewerEntry to TmfGenericTreeEntry<M>
17:25:11 [2020-07-09T21:25:11.046Z] [WARNING] /home/jenkins/agent/workspace/tracecompass-gerrit-short-ui-only/analysis/org.eclipse.tracecompass.analysis.timing.ui/src/org/eclipse/tracecompass/analysis/timing/ui/views/segmentstore/statistics/AbstractSegmentsStatisticsViewer.java:[185] 
17:25:11 [2020-07-09T21:25:11.046Z] 	return (E) (Comparable<E>) o -> 0;
17:25:11 [2020-07-09T21:25:11.046Z] 	       ^^^^^^^^^^^^^^^^^^^^^^^^^^
17:25:11 [2020-07-09T21:25:11.046Z] Type safety: Unchecked cast from Comparable<E> to E
17:25:11 [2020-07-09T21:25:11.046Z] [WARNING] /home/jenkins/agent/workspace/tracecompass-gerrit-short-ui-only/analysis/org.eclipse.tracecompass.analysis.timing.ui/src/org/eclipse/tracecompass/analysis/timing/ui/views/segmentstore/statistics/AbstractSegmentsStatisticsViewer.java:[206] 
17:25:11 [2020-07-09T21:25:11.046Z] 	SegmentStoreStatisticsModel model = ((TmfGenericTreeEntry<SegmentStoreStatisticsModel>) element).getModel();
17:25:11 [2020-07-09T21:25:11.046Z] 	                                    ^^^^^^^^^^^^^^^^^^^^^^^^^^^^^^^^^^^^^^^^^^^^^^^^^^^^^^^^^^^^
17:25:11 [2020-07-09T21:25:11.046Z] Type safety: Unchecked cast from Object to TmfGenericTreeEntry<SegmentStoreStatisticsModel>
17:25:11 [2020-07-09T21:25:11.046Z] 68. INFO in /home/jenkins/agent/workspace/tracecompass-gerrit-short-ui-only/analysis/org.eclipse.tracecompass.analysis.timing.ui/src/org/eclipse/tracecompass/analysis/timing/ui/views/segmentstore/statistics/AbstractSegmentsStatisticsViewer.java (at line 206)
17:25:11 [2020-07-09T21:25:11.046Z] 	SegmentStoreStatisticsModel model = ((TmfGenericTreeEntry<SegmentStoreStatisticsModel>) element).getModel();
17:25:11 [2020-07-09T21:25:11.046Z] 	                                    ^^^^^^^^^^^^^^^^^^^^^^^^^^^^^^^^^^^^^^^^^^^^^^^^^^^^^^^^^^^^^^^^^^^^^^^
17:25:11 [2020-07-09T21:25:11.046Z] Unsafe interpretation of method return type as '@NonNull' based on the receiver type 'TmfGenericTreeEntry<@NonNull SegmentStoreStatisticsModel>'. Type 'TmfGenericTreeEntry<M>' doesn't seem to be designed with null type annotations in mind
17:25:11 [2020-07-09T21:25:11.046Z] [WARNING] /home/jenkins/agent/workspace/tracecompass-gerrit-short-ui-only/analysis/org.eclipse.tracecompass.analysis.timing.ui/src/org/eclipse/tracecompass/analysis/timing/ui/views/segmentstore/statistics/AbstractSegmentsStatisticsViewer.java:[223] 
17:25:11 [2020-07-09T21:25:11.046Z] 	SegmentStoreStatisticsModel model = ((TmfGenericTreeEntry<SegmentStoreStatisticsModel>) element).getModel();
17:25:11 [2020-07-09T21:25:11.046Z] 	                                    ^^^^^^^^^^^^^^^^^^^^^^^^^^^^^^^^^^^^^^^^^^^^^^^^^^^^^^^^^^^^
17:25:11 [2020-07-09T21:25:11.046Z] Type safety: Unchecked cast from Object to TmfGenericTreeEntry<SegmentStoreStatisticsModel>
17:25:11 [2020-07-09T21:25:11.046Z] 70. INFO in /home/jenkins/agent/workspace/tracecompass-gerrit-short-ui-only/analysis/org.eclipse.tracecompass.analysis.timing.ui/src/org/eclipse/tracecompass/analysis/timing/ui/views/segmentstore/statistics/AbstractSegmentsStatisticsViewer.java (at line 223)
17:25:11 [2020-07-09T21:25:11.046Z] 	SegmentStoreStatisticsModel model = ((TmfGenericTreeEntry<SegmentStoreStatisticsModel>) element).getModel();
17:25:11 [2020-07-09T21:25:11.046Z] 	                                    ^^^^^^^^^^^^^^^^^^^^^^^^^^^^^^^^^^^^^^^^^^^^^^^^^^^^^^^^^^^^^^^^^^^^^^^
17:25:11 [2020-07-09T21:25:11.046Z] Unsafe interpretation of method return type as '@NonNull' based on the receiver type 'TmfGenericTreeEntry<@NonNull SegmentStoreStatisticsModel>'. Type 'TmfGenericTreeEntry<M>' doesn't seem to be designed with null type annotations in mind
17:25:11 [2020-07-09T21:25:11.046Z] [WARNING] /home/jenkins/agent/workspace/tracecompass-gerrit-short-ui-only/analysis/org.eclipse.tracecompass.analysis.timing.ui/src/org/eclipse/tracecompass/analysis/timing/ui/views/segmentstore/statistics/AbstractSegmentsStatisticsViewer.java:[260] 
17:25:11 [2020-07-09T21:25:11.046Z] 	provider = DataProviderManager.getInstance().getDataProvider(trace,
17:25:11 [2020-07-09T21:25:11.046Z]                     fProviderId, ITmfTreeDataProvider.class);
17:25:11 [2020-07-09T21:25:11.046Z] 	           ^^^^^^^^^^^^^^^^^^^^^^^^^^^^^^^^^^^^^^^^^^^^^^^^^^^^^^^^^^^^^^^^^^^^^^^^^^^^^^^^^^^^^^^^^^^^^^^^^^^^^^^^^^^^^^^^^^^^^
17:25:11 [2020-07-09T21:25:11.046Z] Type safety: Unchecked invocation getDataProvider(ITmfTrace, String, Class<ITmfTreeDataProvider>) of the generic method getDataProvider(ITmfTrace, String, Class<T>) of type DataProviderManager
17:25:11 [2020-07-09T21:25:11.046Z] [WARNING] /home/jenkins/agent/workspace/tracecompass-gerrit-short-ui-only/analysis/org.eclipse.tracecompass.analysis.timing.ui/src/org/eclipse/tracecompass/analysis/timing/ui/views/segmentstore/statistics/AbstractSegmentsStatisticsViewer.java:[282] 
17:25:11 [2020-07-09T21:25:11.046Z] 	return modelToTree(trace.getName(), model.getEntries());
17:25:11 [2020-07-09T21:25:11.046Z] 	                   ^^^^^^^^^^^^^^^
17:25:11 [2020-07-09T21:25:11.046Z] Null type safety (type annotations): The expression of type 'String' needs unchecked conversion to conform to '@NonNull String'
17:25:11 [2020-07-09T21:25:11.046Z] [WARNING] /home/jenkins/agent/workspace/tracecompass-gerrit-short-ui-only/analysis/org.eclipse.tracecompass.analysis.timing.ui/src/org/eclipse/tracecompass/internal/analysis/timing/ui/views/segmentstore/density2/SimpleTooltipProvider.java:[75] 
17:25:11 [2020-07-09T21:25:11.046Z] 	colors.add(getDensityViewer().getColorForItem(id));
17:25:11 [2020-07-09T21:25:11.046Z] 	                                              ^^
17:25:11 [2020-07-09T21:25:11.046Z] Null type safety (type annotations): The expression of type 'String' needs unchecked conversion to conform to '@NonNull String'
17:25:11 [2020-07-09T21:25:11.046Z] [WARNING] /home/jenkins/agent/workspace/tracecompass-gerrit-short-ui-only/analysis/org.eclipse.tracecompass.analysis.timing.ui/src/org/eclipse/tracecompass/internal/analysis/timing/ui/views/segmentstore/density2/SimpleTooltipProvider.java:[84] 
17:25:11 [2020-07-09T21:25:11.046Z] 	addItem(null, ToolTipString.fromString(String.valueOf(Messages.SimpleTooltipProvider_count)), ToolTipString.fromDecimal(yValues.get(0)));
17:25:11 [2020-07-09T21:25:11.046Z] 	                                                                                                                        ^^^^^^^^^^^^^^
17:25:11 [2020-07-09T21:25:11.046Z] Null type safety (type annotations): The expression of type 'Long' needs unchecked conversion to conform to '@NonNull Number'
17:25:11 [2020-07-09T21:25:11.046Z] [WARNING] /home/jenkins/agent/workspace/tracecompass-gerrit-short-ui-only/analysis/org.eclipse.tracecompass.analysis.timing.ui/src/org/eclipse/tracecompass/internal/analysis/timing/ui/views/segmentstore/density2/SimpleTooltipProvider.java:[88] 
17:25:11 [2020-07-09T21:25:11.047Z] 	RGB color = getDensityViewer().getColorForItem(id);
17:25:11 [2020-07-09T21:25:11.047Z] 	                                               ^^
17:25:11 [2020-07-09T21:25:11.047Z] Null type safety (type annotations): The expression of type 'String' needs unchecked conversion to conform to '@NonNull String'
17:25:11 [2020-07-09T21:25:11.047Z] [WARNING] /home/jenkins/agent/workspace/tracecompass-gerrit-short-ui-only/analysis/org.eclipse.tracecompass.analysis.timing.ui/src/org/eclipse/tracecompass/internal/analysis/timing/ui/views/segmentstore/density2/SimpleTooltipProvider.java:[89] 
17:25:11 [2020-07-09T21:25:11.047Z] 	addItem(null, ToolTipString.fromHtml(String.format(HTML_COLOR_TOOLTIP, new RGBAColor(color.red, color.green, color.blue).toString(), id)), ToolTipString.fromDecimal(yValues.get(i)));
17:25:11 [2020-07-09T21:25:11.047Z] 	                                                                                                                                                                     ^^^^^^^^^^^^^^
17:25:11 [2020-07-09T21:25:11.047Z] Null type safety (type annotations): The expression of type 'Long' needs unchecked conversion to conform to '@NonNull Number'
17:25:11 [2020-07-09T21:25:11.047Z] 76 problems (0 errors, 71 warnings, 71 info)
17:25:11 [2020-07-09T21:25:11.304Z] [INFO] 
17:25:11 [2020-07-09T21:25:11.304Z] [INFO] --- maven-resources-plugin:3.0.2:testResources (default-testResources) @ org.eclipse.tracecompass.analysis.timing.ui ---
17:25:11 [2020-07-09T21:25:11.304Z] [INFO] Using 'UTF-8' encoding to copy filtered resources.
17:25:11 [2020-07-09T21:25:11.304Z] [INFO] skip non existing resourceDirectory /home/jenkins/agent/workspace/tracecompass-gerrit-short-ui-only/analysis/org.eclipse.tracecompass.analysis.timing.ui/src/test/resources
17:25:11 [2020-07-09T21:25:11.304Z] [INFO] 
17:25:11 [2020-07-09T21:25:11.304Z] [INFO] --- tycho-source-plugin:1.3.0:plugin-source (plugin-source) @ org.eclipse.tracecompass.analysis.timing.ui ---
17:25:11 [2020-07-09T21:25:11.304Z] [INFO] Building jar: /home/jenkins/agent/workspace/tracecompass-gerrit-short-ui-only/analysis/org.eclipse.tracecompass.analysis.timing.ui/target/org.eclipse.tracecompass.analysis.timing.ui-4.1.0-SNAPSHOT-sources.jar
17:25:11 [2020-07-09T21:25:11.304Z] [INFO] 
17:25:11 [2020-07-09T21:25:11.304Z] [INFO] --- target-platform-configuration:1.3.0:target-platform (default-target-platform) @ org.eclipse.tracecompass.analysis.timing.ui ---
17:25:11 [2020-07-09T21:25:11.304Z] [INFO] 
17:25:11 [2020-07-09T21:25:11.304Z] [INFO] --- tycho-packaging-plugin:1.3.0:package-plugin (default-package-plugin) @ org.eclipse.tracecompass.analysis.timing.ui ---
17:25:11 [2020-07-09T21:25:11.304Z] [INFO] Building jar: /home/jenkins/agent/workspace/tracecompass-gerrit-short-ui-only/analysis/org.eclipse.tracecompass.analysis.timing.ui/target/org.eclipse.tracecompass.analysis.timing.ui-4.1.0-SNAPSHOT.jar
17:25:11 [2020-07-09T21:25:11.304Z] [INFO] 
17:25:11 [2020-07-09T21:25:11.304Z] [INFO] --- tycho-p2-plugin:1.3.0:p2-metadata-default (default-p2-metadata-default) @ org.eclipse.tracecompass.analysis.timing.ui ---
17:25:11 [2020-07-09T21:25:11.304Z] [INFO] 
17:25:11 [2020-07-09T21:25:11.304Z] [INFO] --- tycho-source-feature-plugin:1.3.0:source-feature (source-feature) @ org.eclipse.tracecompass.analysis.timing.ui ---
17:25:11 [2020-07-09T21:25:11.304Z] [INFO] 
17:25:11 [2020-07-09T21:25:11.304Z] [INFO] --- tycho-pack200b-plugin:1.3.0:pack (pack200-pack) @ org.eclipse.tracecompass.analysis.timing.ui ---
17:25:11 [2020-07-09T21:25:11.304Z] [INFO] Pack200 packing jar /home/jenkins/agent/workspace/tracecompass-gerrit-short-ui-only/analysis/org.eclipse.tracecompass.analysis.timing.ui/target/org.eclipse.tracecompass.analysis.timing.ui-4.1.0-SNAPSHOT.jar
17:25:11 [2020-07-09T21:25:11.304Z] [INFO] 
17:25:11 [2020-07-09T21:25:11.304Z] [INFO] --- tycho-p2-plugin:1.3.0:p2-metadata (p2-metadata) @ org.eclipse.tracecompass.analysis.timing.ui ---
17:25:11 [2020-07-09T21:25:11.304Z] [INFO] 
17:25:11 [2020-07-09T21:25:11.304Z] [INFO] --- maven-install-plugin:2.5.2:install (default-install) @ org.eclipse.tracecompass.analysis.timing.ui ---
17:25:11 [2020-07-09T21:25:11.304Z] [INFO] Installing /home/jenkins/agent/workspace/tracecompass-gerrit-short-ui-only/analysis/org.eclipse.tracecompass.analysis.timing.ui/target/org.eclipse.tracecompass.analysis.timing.ui-4.1.0-SNAPSHOT.jar to /home/jenkins/.m2/repository/org/eclipse/tracecompass/org.eclipse.tracecompass.analysis.timing.ui/4.1.0-SNAPSHOT/org.eclipse.tracecompass.analysis.timing.ui-4.1.0-SNAPSHOT.jar
17:25:11 [2020-07-09T21:25:11.304Z] [INFO] Installing /home/jenkins/agent/workspace/tracecompass-gerrit-short-ui-only/analysis/org.eclipse.tracecompass.analysis.timing.ui/.polyglot.build.properties to /home/jenkins/.m2/repository/org/eclipse/tracecompass/org.eclipse.tracecompass.analysis.timing.ui/4.1.0-SNAPSHOT/org.eclipse.tracecompass.analysis.timing.ui-4.1.0-SNAPSHOT.pom
17:25:11 [2020-07-09T21:25:11.304Z] [INFO] Installing /home/jenkins/agent/workspace/tracecompass-gerrit-short-ui-only/analysis/org.eclipse.tracecompass.analysis.timing.ui/target/org.eclipse.tracecompass.analysis.timing.ui-4.1.0-SNAPSHOT-sources.jar to /home/jenkins/.m2/repository/org/eclipse/tracecompass/org.eclipse.tracecompass.analysis.timing.ui/4.1.0-SNAPSHOT/org.eclipse.tracecompass.analysis.timing.ui-4.1.0-SNAPSHOT-sources.jar
17:25:11 [2020-07-09T21:25:11.304Z] [INFO] Installing /home/jenkins/agent/workspace/tracecompass-gerrit-short-ui-only/analysis/org.eclipse.tracecompass.analysis.timing.ui/target/org.eclipse.tracecompass.analysis.timing.ui-4.1.0-SNAPSHOT.jar.pack.gz to /home/jenkins/.m2/repository/org/eclipse/tracecompass/org.eclipse.tracecompass.analysis.timing.ui/4.1.0-SNAPSHOT/org.eclipse.tracecompass.analysis.timing.ui-4.1.0-SNAPSHOT-pack200.jar.pack.gz
17:25:11 [2020-07-09T21:25:11.304Z] [INFO] Installing /home/jenkins/agent/workspace/tracecompass-gerrit-short-ui-only/analysis/org.eclipse.tracecompass.analysis.timing.ui/target/p2content.xml to /home/jenkins/.m2/repository/org/eclipse/tracecompass/org.eclipse.tracecompass.analysis.timing.ui/4.1.0-SNAPSHOT/org.eclipse.tracecompass.analysis.timing.ui-4.1.0-SNAPSHOT-p2metadata.xml
17:25:11 [2020-07-09T21:25:11.304Z] [INFO] Installing /home/jenkins/agent/workspace/tracecompass-gerrit-short-ui-only/analysis/org.eclipse.tracecompass.analysis.timing.ui/target/p2artifacts.xml to /home/jenkins/.m2/repository/org/eclipse/tracecompass/org.eclipse.tracecompass.analysis.timing.ui/4.1.0-SNAPSHOT/org.eclipse.tracecompass.analysis.timing.ui-4.1.0-SNAPSHOT-p2artifacts.xml
17:25:11 [2020-07-09T21:25:11.304Z] [INFO] 
17:25:11 [2020-07-09T21:25:11.304Z] [INFO] --- tycho-p2-plugin:1.3.0:update-local-index (default-update-local-index) @ org.eclipse.tracecompass.analysis.timing.ui ---
17:25:11 [2020-07-09T21:25:11.304Z] [INFO] 
17:25:11 [2020-07-09T21:25:11.304Z] [INFO] --< org.eclipse.tracecompass:org.eclipse.tracecompass.analysis.os.linux.ui >--
17:25:11 [2020-07-09T21:25:11.304Z] [INFO] Building org.eclipse.tracecompass.analysis.os.linux.ui 4.0.0-SNAPSHOT [46/138]
17:25:11 [2020-07-09T21:25:11.304Z] [INFO] ---------------------------[ eclipse-plugin ]---------------------------
17:25:11 [2020-07-09T21:25:11.304Z] [INFO] 
17:25:11 [2020-07-09T21:25:11.304Z] [INFO] --- maven-clean-plugin:3.0.0:clean (default-clean) @ org.eclipse.tracecompass.analysis.os.linux.ui ---
17:25:11 [2020-07-09T21:25:11.304Z] [INFO] 
17:25:11 [2020-07-09T21:25:11.304Z] [INFO] --- tycho-packaging-plugin:1.3.0:build-qualifier (default-build-qualifier) @ org.eclipse.tracecompass.analysis.os.linux.ui ---
17:25:11 [2020-07-09T21:25:11.304Z] [INFO] The project's OSGi version is 4.0.0.202007092109
17:25:11 [2020-07-09T21:25:11.304Z] [INFO] 
17:25:11 [2020-07-09T21:25:11.304Z] [INFO] --- tycho-packaging-plugin:1.3.0:validate-id (default-validate-id) @ org.eclipse.tracecompass.analysis.os.linux.ui ---
17:25:11 [2020-07-09T21:25:11.304Z] [INFO] 
17:25:11 [2020-07-09T21:25:11.304Z] [INFO] --- tycho-packaging-plugin:1.3.0:validate-version (default-validate-version) @ org.eclipse.tracecompass.analysis.os.linux.ui ---
17:25:11 [2020-07-09T21:25:11.304Z] [INFO] 
17:25:11 [2020-07-09T21:25:11.304Z] [INFO] --- maven-enforcer-plugin:1.4.1:enforce (enforce-maven-version) @ org.eclipse.tracecompass.analysis.os.linux.ui ---
17:25:11 [2020-07-09T21:25:11.304Z] [INFO] 
17:25:11 [2020-07-09T21:25:11.304Z] [INFO] --- maven-resources-plugin:3.0.2:resources (default-resources) @ org.eclipse.tracecompass.analysis.os.linux.ui ---
17:25:11 [2020-07-09T21:25:11.304Z] [INFO] Using 'UTF-8' encoding to copy filtered resources.
17:25:11 [2020-07-09T21:25:11.304Z] [INFO] skip non existing resourceDirectory /home/jenkins/agent/workspace/tracecompass-gerrit-short-ui-only/analysis/org.eclipse.tracecompass.analysis.os.linux.ui/src/main/resources
17:25:11 [2020-07-09T21:25:11.304Z] [INFO] 
17:25:11 [2020-07-09T21:25:11.304Z] [INFO] --- tycho-compiler-plugin:1.3.0:compile (default-compile) @ org.eclipse.tracecompass.analysis.os.linux.ui ---
17:25:11 [2020-07-09T21:25:11.563Z] [INFO] Compiling 45 source files to /home/jenkins/agent/workspace/tracecompass-gerrit-short-ui-only/analysis/org.eclipse.tracecompass.analysis.os.linux.ui/target/classes
17:25:11 [2020-07-09T21:25:11.819Z] [WARNING] /home/jenkins/agent/workspace/tracecompass-gerrit-short-ui-only/analysis/org.eclipse.tracecompass.analysis.os.linux.ui/src/org/eclipse/tracecompass/internal/analysis/os/linux/ui/views/memory/MemoryPresentationProvider.java:[19] 
17:25:11 [2020-07-09T21:25:11.819Z] 	import org.eclipse.tracecompass.internal.provisional.tmf.ui.viewers.xychart.BaseXYPresentationProvider;
17:25:11 [2020-07-09T21:25:11.819Z] 	       ^^^^^^^^^^^^^^^^^^^^^^^^^^^^^^^^^^^^^^^^^^^^^^^^^^^^^^^^^^^^^^^^^^^^^^^^^^^^^^^^^^^^^^^^^^^^^^^
17:25:11 [2020-07-09T21:25:11.819Z] Discouraged access: The type 'BaseXYPresentationProvider' is not API (restriction on classpath entry '/home/jenkins/agent/workspace/tracecompass-gerrit-short-ui-only/tmf/org.eclipse.tracecompass.tmf.ui/target/classes')
17:25:11 [2020-07-09T21:25:11.819Z] [WARNING] /home/jenkins/agent/workspace/tracecompass-gerrit-short-ui-only/analysis/org.eclipse.tracecompass.analysis.os.linux.ui/src/org/eclipse/tracecompass/internal/analysis/os/linux/ui/views/memory/MemoryPresentationProvider.java:[33] 
17:25:11 [2020-07-09T21:25:11.819Z] 	public class MemoryPresentationProvider extends BaseXYPresentationProvider {
17:25:11 [2020-07-09T21:25:11.819Z] 	                                                ^^^^^^^^^^^^^^^^^^^^^^^^^^
17:25:11 [2020-07-09T21:25:11.819Z] Discouraged access: The type 'BaseXYPresentationProvider' is not API (restriction on classpath entry '/home/jenkins/agent/workspace/tracecompass-gerrit-short-ui-only/tmf/org.eclipse.tracecompass.tmf.ui/target/classes')
17:25:11 [2020-07-09T21:25:11.819Z] [WARNING] /home/jenkins/agent/workspace/tracecompass-gerrit-short-ui-only/analysis/org.eclipse.tracecompass.analysis.os.linux.ui/src/org/eclipse/tracecompass/internal/analysis/os/linux/ui/views/controlflow/ControlFlowView.java:[63] 
17:25:11 [2020-07-09T21:25:11.819Z] 	import org.eclipse.tracecompass.internal.provisional.tmf.ui.widgets.timegraph.BaseDataProviderTimeGraphPresentationProvider;
17:25:11 [2020-07-09T21:25:11.819Z] 	       ^^^^^^^^^^^^^^^^^^^^^^^^^^^^^^^^^^^^^^^^^^^^^^^^^^^^^^^^^^^^^^^^^^^^^^^^^^^^^^^^^^^^^^^^^^^^^^^^^^^^^^^^^^^^^^^^^^^^
17:25:11 [2020-07-09T21:25:11.819Z] Discouraged access: The type 'BaseDataProviderTimeGraphPresentationProvider' is not API (restriction on classpath entry '/home/jenkins/agent/workspace/tracecompass-gerrit-short-ui-only/tmf/org.eclipse.tracecompass.tmf.ui/target/classes')
17:25:11 [2020-07-09T21:25:11.819Z] [WARNING] /home/jenkins/agent/workspace/tracecompass-gerrit-short-ui-only/analysis/org.eclipse.tracecompass.analysis.os.linux.ui/src/org/eclipse/tracecompass/internal/analysis/os/linux/ui/views/controlflow/ControlFlowView.java:[220] 
17:25:11 [2020-07-09T21:25:11.819Z] 	super(ID, new BaseDataProviderTimeGraphPresentationProvider(), ThreadStatusDataProvider.ID);
17:25:11 [2020-07-09T21:25:11.819Z] 	          ^^^^^^^^^^^^^^^^^^^^^^^^^^^^^^^^^^^^^^^^^^^^^^^^^^^
17:25:11 [2020-07-09T21:25:11.819Z] Discouraged access: The constructor 'BaseDataProviderTimeGraphPresentationProvider()' is not API (restriction on classpath entry '/home/jenkins/agent/workspace/tracecompass-gerrit-short-ui-only/tmf/org.eclipse.tracecompass.tmf.ui/target/classes')
17:25:11 [2020-07-09T21:25:11.819Z] [WARNING] /home/jenkins/agent/workspace/tracecompass-gerrit-short-ui-only/analysis/org.eclipse.tracecompass.analysis.os.linux.ui/src/org/eclipse/tracecompass/internal/analysis/os/linux/ui/views/controlflow/ControlFlowView.java:[220] 
17:25:11 [2020-07-09T21:25:11.819Z] 	super(ID, new BaseDataProviderTimeGraphPresentationProvider(), ThreadStatusDataProvider.ID);
17:25:11 [2020-07-09T21:25:11.819Z] 	              ^^^^^^^^^^^^^^^^^^^^^^^^^^^^^^^^^^^^^^^^^^^^^
17:25:11 [2020-07-09T21:25:11.819Z] Discouraged access: The type 'BaseDataProviderTimeGraphPresentationProvider' is not API (restriction on classpath entry '/home/jenkins/agent/workspace/tracecompass-gerrit-short-ui-only/tmf/org.eclipse.tracecompass.tmf.ui/target/classes')
17:25:11 [2020-07-09T21:25:11.819Z] [WARNING] /home/jenkins/agent/workspace/tracecompass-gerrit-short-ui-only/analysis/org.eclipse.tracecompass.analysis.os.linux.ui/src/org/eclipse/tracecompass/internal/analysis/os/linux/ui/views/controlflow/ControlFlowView.java:[783] 
17:25:11 [2020-07-09T21:25:11.819Z] 	SelectionTimeQueryFilter filter = new SelectionTimeQueryFilter(time - 1, time, 2, map.keySet());
17:25:11 [2020-07-09T21:25:11.819Z] 	                                                                                  ^^^^^^^^^^^^
17:25:11 [2020-07-09T21:25:11.819Z] Null type safety (type annotations): The expression of type '@NonNull Set<Long>' needs unchecked conversion to conform to '@NonNull Collection<@NonNull Long>', corresponding supertype is 'Collection<Long>'
17:25:11 [2020-07-09T21:25:11.819Z] [WARNING] /home/jenkins/agent/workspace/tracecompass-gerrit-short-ui-only/analysis/org.eclipse.tracecompass.analysis.os.linux.ui/src/org/eclipse/tracecompass/internal/analysis/os/linux/ui/views/memory/MemoryUsageView.java:[18] 
17:25:11 [2020-07-09T21:25:11.819Z] 	import org.eclipse.tracecompass.internal.provisional.tmf.ui.viewers.xychart.BaseXYPresentationProvider;
17:25:11 [2020-07-09T21:25:11.819Z] 	       ^^^^^^^^^^^^^^^^^^^^^^^^^^^^^^^^^^^^^^^^^^^^^^^^^^^^^^^^^^^^^^^^^^^^^^^^^^^^^^^^^^^^^^^^^^^^^^^
17:25:11 [2020-07-09T21:25:11.820Z] Discouraged access: The type 'BaseXYPresentationProvider' is not API (restriction on classpath entry '/home/jenkins/agent/workspace/tracecompass-gerrit-short-ui-only/tmf/org.eclipse.tracecompass.tmf.ui/target/classes')
17:25:11 [2020-07-09T21:25:11.820Z] [WARNING] /home/jenkins/agent/workspace/tracecompass-gerrit-short-ui-only/analysis/org.eclipse.tracecompass.analysis.os.linux.ui/src/org/eclipse/tracecompass/internal/analysis/os/linux/ui/views/memory/MemoryUsageView.java:[67] 
17:25:11 [2020-07-09T21:25:11.820Z] 	protected BaseXYPresentationProvider createPresentationProvider(ITmfTrace trace) {
17:25:11 [2020-07-09T21:25:11.820Z] 	          ^^^^^^^^^^^^^^^^^^^^^^^^^^
17:25:11 [2020-07-09T21:25:11.820Z] Discouraged access: The type 'BaseXYPresentationProvider' is not API (restriction on classpath entry '/home/jenkins/agent/workspace/tracecompass-gerrit-short-ui-only/tmf/org.eclipse.tracecompass.tmf.ui/target/classes')
17:25:11 [2020-07-09T21:25:11.820Z] [WARNING] /home/jenkins/agent/workspace/tracecompass-gerrit-short-ui-only/analysis/org.eclipse.tracecompass.analysis.os.linux.ui/src/org/eclipse/tracecompass/internal/analysis/os/linux/ui/views/memory/MemoryUsageTreeViewer.java:[57] 
17:25:11 [2020-07-09T21:25:11.820Z] 	TmfGenericTreeEntry<MemoryUsageTreeModel> obj = (TmfGenericTreeEntry<MemoryUsageTreeModel>) element;
17:25:11 [2020-07-09T21:25:11.820Z] 	                                                ^^^^^^^^^^^^^^^^^^^^^^^^^^^^^^^^^^^^^^^^^^^^^^^^^^^
17:25:11 [2020-07-09T21:25:11.820Z] Type safety: Unchecked cast from Object to TmfGenericTreeEntry<MemoryUsageTreeModel>
17:25:11 [2020-07-09T21:25:11.820Z] [WARNING] /home/jenkins/agent/workspace/tracecompass-gerrit-short-ui-only/analysis/org.eclipse.tracecompass.analysis.os.linux.ui/src/org/eclipse/tracecompass/internal/analysis/os/linux/ui/views/memory/MemoryUsageTreeViewer.java:[76] 
17:25:11 [2020-07-09T21:25:11.820Z] 	TmfGenericTreeEntry<MemoryUsageTreeModel> obj = (TmfGenericTreeEntry<MemoryUsageTreeModel>) element;
17:25:11 [2020-07-09T21:25:11.820Z] 	                                                ^^^^^^^^^^^^^^^^^^^^^^^^^^^^^^^^^^^^^^^^^^^^^^^^^^^
17:25:11 [2020-07-09T21:25:11.820Z] Type safety: Unchecked cast from Object to TmfGenericTreeEntry<MemoryUsageTreeModel>
17:25:11 [2020-07-09T21:25:11.820Z] [WARNING] /home/jenkins/agent/workspace/tracecompass-gerrit-short-ui-only/analysis/org.eclipse.tracecompass.analysis.os.linux.ui/src/org/eclipse/tracecompass/internal/analysis/os/linux/ui/views/memory/MemoryUsageTreeViewer.java:[78] 
17:25:11 [2020-07-09T21:25:11.820Z] 	TmfGenericTreeEntry<MemoryUsageTreeModel> entry = (TmfGenericTreeEntry<MemoryUsageTreeModel>) element;
17:25:11 [2020-07-09T21:25:11.820Z] 	                                                  ^^^^^^^^^^^^^^^^^^^^^^^^^^^^^^^^^^^^^^^^^^^^^^^^^^^
17:25:11 [2020-07-09T21:25:11.820Z] Type safety: Unchecked cast from Object to TmfGenericTreeEntry<MemoryUsageTreeModel>
17:25:11 [2020-07-09T21:25:11.820Z] [WARNING] /home/jenkins/agent/workspace/tracecompass-gerrit-short-ui-only/analysis/org.eclipse.tracecompass.analysis.os.linux.ui/src/org/eclipse/tracecompass/internal/analysis/os/linux/ui/views/cpuusage/CpuUsageXYViewer.java:[24] 
17:25:11 [2020-07-09T21:25:11.820Z] 	import org.eclipse.tracecompass.internal.provisional.tmf.ui.viewers.xychart.BaseXYPresentationProvider;
17:25:11 [2020-07-09T21:25:11.820Z] 	       ^^^^^^^^^^^^^^^^^^^^^^^^^^^^^^^^^^^^^^^^^^^^^^^^^^^^^^^^^^^^^^^^^^^^^^^^^^^^^^^^^^^^^^^^^^^^^^^
17:25:11 [2020-07-09T21:25:11.820Z] Discouraged access: The type 'BaseXYPresentationProvider' is not API (restriction on classpath entry '/home/jenkins/agent/workspace/tracecompass-gerrit-short-ui-only/tmf/org.eclipse.tracecompass.tmf.ui/target/classes')
17:25:11 [2020-07-09T21:25:11.820Z] [WARNING] /home/jenkins/agent/workspace/tracecompass-gerrit-short-ui-only/analysis/org.eclipse.tracecompass.analysis.os.linux.ui/src/org/eclipse/tracecompass/internal/analysis/os/linux/ui/views/cpuusage/CpuUsageXYViewer.java:[59] 
17:25:11 [2020-07-09T21:25:11.820Z] 	parameters.put(CpuUsageDataProvider.REQUESTED_CPUS_KEY, CpuUsageView.getCpus(getTrace()));
17:25:11 [2020-07-09T21:25:11.820Z] 	                                                                             ^^^^^^^^^^
17:25:11 [2020-07-09T21:25:11.820Z] Null type safety (type annotations): The expression of type 'ITmfTrace' needs unchecked conversion to conform to '@NonNull ITmfTrace'
17:25:11 [2020-07-09T21:25:11.820Z] [WARNING] /home/jenkins/agent/workspace/tracecompass-gerrit-short-ui-only/analysis/org.eclipse.tracecompass.analysis.os.linux.ui/src/org/eclipse/tracecompass/internal/analysis/os/linux/ui/views/cpuusage/CpuUsageXYViewer.java:[72] 
17:25:11 [2020-07-09T21:25:11.820Z] 	Set<Integer> cpus = CpuUsageView.getCpus(getTrace());
17:25:11 [2020-07-09T21:25:11.820Z] 	                                         ^^^^^^^^^^
17:25:11 [2020-07-09T21:25:11.820Z] Null type safety (type annotations): The expression of type 'ITmfTrace' needs unchecked conversion to conform to '@NonNull ITmfTrace'
17:25:11 [2020-07-09T21:25:11.820Z] [WARNING] /home/jenkins/agent/workspace/tracecompass-gerrit-short-ui-only/analysis/org.eclipse.tracecompass.analysis.os.linux.ui/src/org/eclipse/tracecompass/internal/analysis/os/linux/ui/views/cpuusage/CpuUsageXYViewer.java:[81] 
17:25:11 [2020-07-09T21:25:11.820Z] 	protected BaseXYPresentationProvider createPresentationProvider(ITmfTrace trace) {
17:25:11 [2020-07-09T21:25:11.820Z] 	          ^^^^^^^^^^^^^^^^^^^^^^^^^^
17:25:11 [2020-07-09T21:25:11.820Z] Discouraged access: The type 'BaseXYPresentationProvider' is not API (restriction on classpath entry '/home/jenkins/agent/workspace/tracecompass-gerrit-short-ui-only/tmf/org.eclipse.tracecompass.tmf.ui/target/classes')
17:25:11 [2020-07-09T21:25:11.820Z] [WARNING] /home/jenkins/agent/workspace/tracecompass-gerrit-short-ui-only/analysis/org.eclipse.tracecompass.analysis.os.linux.ui/src/org/eclipse/tracecompass/internal/analysis/os/linux/ui/views/memory/MemoryUsageTreeViewer2.java:[54] 
17:25:11 [2020-07-09T21:25:11.820Z] 	TmfGenericTreeEntry<MemoryUsageTreeModel> obj = (TmfGenericTreeEntry<MemoryUsageTreeModel>) element;
17:25:11 [2020-07-09T21:25:11.820Z] 	                                                ^^^^^^^^^^^^^^^^^^^^^^^^^^^^^^^^^^^^^^^^^^^^^^^^^^^
17:25:11 [2020-07-09T21:25:11.820Z] Type safety: Unchecked cast from Object to TmfGenericTreeEntry<MemoryUsageTreeModel>
17:25:11 [2020-07-09T21:25:11.820Z] [WARNING] /home/jenkins/agent/workspace/tracecompass-gerrit-short-ui-only/analysis/org.eclipse.tracecompass.analysis.os.linux.ui/src/org/eclipse/tracecompass/internal/analysis/os/linux/ui/views/memory/MemoryUsageTreeViewer2.java:[73] 
17:25:11 [2020-07-09T21:25:11.820Z] 	TmfGenericTreeEntry<MemoryUsageTreeModel> obj = (TmfGenericTreeEntry<MemoryUsageTreeModel>) element;
17:25:11 [2020-07-09T21:25:11.820Z] 	                                                ^^^^^^^^^^^^^^^^^^^^^^^^^^^^^^^^^^^^^^^^^^^^^^^^^^^
17:25:11 [2020-07-09T21:25:11.820Z] Type safety: Unchecked cast from Object to TmfGenericTreeEntry<MemoryUsageTreeModel>
17:25:11 [2020-07-09T21:25:11.820Z] [WARNING] /home/jenkins/agent/workspace/tracecompass-gerrit-short-ui-only/analysis/org.eclipse.tracecompass.analysis.os.linux.ui/src/org/eclipse/tracecompass/internal/analysis/os/linux/ui/views/memory/MemoryUsageTreeViewer2.java:[75] 
17:25:11 [2020-07-09T21:25:11.820Z] 	TmfGenericTreeEntry<MemoryUsageTreeModel> entry = (TmfGenericTreeEntry<MemoryUsageTreeModel>) element;
17:25:11 [2020-07-09T21:25:11.820Z] 	                                                  ^^^^^^^^^^^^^^^^^^^^^^^^^^^^^^^^^^^^^^^^^^^^^^^^^^^
17:25:11 [2020-07-09T21:25:11.820Z] Type safety: Unchecked cast from Object to TmfGenericTreeEntry<MemoryUsageTreeModel>
17:25:11 [2020-07-09T21:25:11.820Z] [WARNING] /home/jenkins/agent/workspace/tracecompass-gerrit-short-ui-only/analysis/org.eclipse.tracecompass.analysis.os.linux.ui/src/org/eclipse/tracecompass/internal/analysis/os/linux/ui/views/cpuusage/CpuUsageView.java:[94] 
17:25:11 [2020-07-09T21:25:11.820Z] 	Set<@NonNull Integer> data = (Set<@NonNull Integer>) getData(trace, CpuUsageView.CPU_USAGE_FOLLOW_CPU);
17:25:11 [2020-07-09T21:25:11.820Z] 	                             ^^^^^^^^^^^^^^^^^^^^^^^^^^^^^^^^^^^^^^^^^^^^^^^^^^^^^^^^^^^^^^^^^^^^^^^^^
17:25:11 [2020-07-09T21:25:11.820Z] Type safety: Unchecked cast from Object to Set<Integer>
17:25:11 [2020-07-09T21:25:11.820Z] [WARNING] /home/jenkins/agent/workspace/tracecompass-gerrit-short-ui-only/analysis/org.eclipse.tracecompass.analysis.os.linux.ui/src/org/eclipse/tracecompass/internal/analysis/os/linux/ui/views/cpuusage/CpuUsageView.java:[119] 
17:25:11 [2020-07-09T21:25:11.820Z] 	Set<Integer> data = (Set<Integer>) getData(trace, CPU_USAGE_FOLLOW_CPU);
17:25:11 [2020-07-09T21:25:11.820Z] 	                    ^^^^^^^^^^^^^^^^^^^^^^^^^^^^^^^^^^^^^^^^^^^^^^^^^^^
17:25:11 [2020-07-09T21:25:11.820Z] Type safety: Unchecked cast from Object to Set<Integer>
17:25:11 [2020-07-09T21:25:11.820Z] [WARNING] /home/jenkins/agent/workspace/tracecompass-gerrit-short-ui-only/analysis/org.eclipse.tracecompass.analysis.os.linux.ui/src/org/eclipse/tracecompass/internal/analysis/os/linux/ui/views/cpuusage/CPUUsagePresentationProvider.java:[19] 
17:25:11 [2020-07-09T21:25:11.820Z] 	import org.eclipse.tracecompass.internal.provisional.tmf.ui.viewers.xychart.BaseXYPresentationProvider;
17:25:11 [2020-07-09T21:25:11.820Z] 	       ^^^^^^^^^^^^^^^^^^^^^^^^^^^^^^^^^^^^^^^^^^^^^^^^^^^^^^^^^^^^^^^^^^^^^^^^^^^^^^^^^^^^^^^^^^^^^^^
17:25:11 [2020-07-09T21:25:11.820Z] Discouraged access: The type 'BaseXYPresentationProvider' is not API (restriction on classpath entry '/home/jenkins/agent/workspace/tracecompass-gerrit-short-ui-only/tmf/org.eclipse.tracecompass.tmf.ui/target/classes')
17:25:11 [2020-07-09T21:25:11.820Z] [WARNING] /home/jenkins/agent/workspace/tracecompass-gerrit-short-ui-only/analysis/org.eclipse.tracecompass.analysis.os.linux.ui/src/org/eclipse/tracecompass/internal/analysis/os/linux/ui/views/cpuusage/CPUUsagePresentationProvider.java:[33] 
17:25:11 [2020-07-09T21:25:11.820Z] 	public class CPUUsagePresentationProvider extends BaseXYPresentationProvider {
17:25:11 [2020-07-09T21:25:11.820Z] 	                                                  ^^^^^^^^^^^^^^^^^^^^^^^^^^
17:25:11 [2020-07-09T21:25:11.820Z] Discouraged access: The type 'BaseXYPresentationProvider' is not API (restriction on classpath entry '/home/jenkins/agent/workspace/tracecompass-gerrit-short-ui-only/tmf/org.eclipse.tracecompass.tmf.ui/target/classes')
17:25:11 [2020-07-09T21:25:11.820Z] [WARNING] /home/jenkins/agent/workspace/tracecompass-gerrit-short-ui-only/analysis/org.eclipse.tracecompass.analysis.os.linux.ui/src/org/eclipse/tracecompass/internal/analysis/os/linux/ui/views/memory/MemoryUsageView2.java:[18] 
17:25:11 [2020-07-09T21:25:11.820Z] 	import org.eclipse.tracecompass.internal.provisional.tmf.ui.viewers.xychart.BaseXYPresentationProvider;
17:25:11 [2020-07-09T21:25:11.820Z] 	       ^^^^^^^^^^^^^^^^^^^^^^^^^^^^^^^^^^^^^^^^^^^^^^^^^^^^^^^^^^^^^^^^^^^^^^^^^^^^^^^^^^^^^^^^^^^^^^^
17:25:11 [2020-07-09T21:25:11.820Z] Discouraged access: The type 'BaseXYPresentationProvider' is not API (restriction on classpath entry '/home/jenkins/agent/workspace/tracecompass-gerrit-short-ui-only/tmf/org.eclipse.tracecompass.tmf.ui/target/classes')
17:25:11 [2020-07-09T21:25:11.820Z] [WARNING] /home/jenkins/agent/workspace/tracecompass-gerrit-short-ui-only/analysis/org.eclipse.tracecompass.analysis.os.linux.ui/src/org/eclipse/tracecompass/internal/analysis/os/linux/ui/views/memory/MemoryUsageView2.java:[65] 
17:25:11 [2020-07-09T21:25:11.820Z] 	protected BaseXYPresentationProvider createPresentationProvider(ITmfTrace trace) {
17:25:11 [2020-07-09T21:25:11.820Z] 	          ^^^^^^^^^^^^^^^^^^^^^^^^^^
17:25:11 [2020-07-09T21:25:11.820Z] Discouraged access: The type 'BaseXYPresentationProvider' is not API (restriction on classpath entry '/home/jenkins/agent/workspace/tracecompass-gerrit-short-ui-only/tmf/org.eclipse.tracecompass.tmf.ui/target/classes')
17:25:11 [2020-07-09T21:25:11.820Z] [WARNING] /home/jenkins/agent/workspace/tracecompass-gerrit-short-ui-only/analysis/org.eclipse.tracecompass.analysis.os.linux.ui/src/org/eclipse/tracecompass/internal/analysis/os/linux/ui/views/cpuusage/CpuUsageTreeViewer.java:[136] 
17:25:11 [2020-07-09T21:25:11.820Z] 	parameters.put(CpuUsageDataProvider.REQUESTED_CPUS_KEY, CpuUsageView.getCpus(getTrace()));
17:25:11 [2020-07-09T21:25:11.820Z] 	                                                                             ^^^^^^^^^^
17:25:11 [2020-07-09T21:25:11.820Z] Null type safety (type annotations): The expression of type 'ITmfTrace' needs unchecked conversion to conform to '@NonNull ITmfTrace'
17:25:11 [2020-07-09T21:25:11.820Z] [WARNING] /home/jenkins/agent/workspace/tracecompass-gerrit-short-ui-only/analysis/org.eclipse.tracecompass.analysis.os.linux.ui/src/org/eclipse/tracecompass/internal/analysis/os/linux/ui/views/io/diskioactivity/DiskIOActivityTreeViewer.java:[40] 
17:25:11 [2020-07-09T21:25:11.820Z] 	TmfGenericTreeEntry<TmfTreeDataModel> entry = (TmfGenericTreeEntry<TmfTreeDataModel>) element;
17:25:11 [2020-07-09T21:25:11.820Z] 	                                              ^^^^^^^^^^^^^^^^^^^^^^^^^^^^^^^^^^^^^^^^^^^^^^^
17:25:11 [2020-07-09T21:25:11.820Z] Type safety: Unchecked cast from Object to TmfGenericTreeEntry<TmfTreeDataModel>
17:25:11 [2020-07-09T21:25:11.820Z] 27. INFO in /home/jenkins/agent/workspace/tracecompass-gerrit-short-ui-only/analysis/org.eclipse.tracecompass.analysis.os.linux.ui/src/org/eclipse/tracecompass/internal/analysis/os/linux/ui/views/io/diskioactivity/DiskIOActivityTreeViewer.java (at line 43)
17:25:11 [2020-07-09T21:25:11.820Z] 	return getLegendImage(entry.getModel().getId());
17:25:11 [2020-07-09T21:25:11.820Z] 	                      ^^^^^^^^^^^^^^^^
17:25:11 [2020-07-09T21:25:11.820Z] Unsafe interpretation of method return type as '@NonNull' based on the receiver type 'TmfGenericTreeEntry<@NonNull TmfTreeDataModel>'. Type 'TmfGenericTreeEntry<M>' doesn't seem to be designed with null type annotations in mind
17:25:11 [2020-07-09T21:25:11.820Z] [WARNING] /home/jenkins/agent/workspace/tracecompass-gerrit-short-ui-only/analysis/org.eclipse.tracecompass.analysis.os.linux.ui/src/org/eclipse/tracecompass/internal/analysis/os/linux/ui/actions/UnfollowThreadAction.java:[45] 
17:25:11 [2020-07-09T21:25:11.820Z] 	return Messages.FollowThreadAction_unfollow;
17:25:11 [2020-07-09T21:25:11.820Z] 	       ^^^^^^^^^^^^^^^^^^^^^^^^^^^^^^^^^^^^
17:25:11 [2020-07-09T21:25:11.820Z] Null type safety (type annotations): The expression of type 'String' needs unchecked conversion to conform to '@NonNull String'
17:25:11 [2020-07-09T21:25:11.820Z] 28 problems (0 errors, 27 warnings, 1 info)
17:25:11 [2020-07-09T21:25:11.820Z] [INFO] 
17:25:11 [2020-07-09T21:25:11.820Z] [INFO] --- maven-resources-plugin:3.0.2:testResources (default-testResources) @ org.eclipse.tracecompass.analysis.os.linux.ui ---
17:25:11 [2020-07-09T21:25:11.820Z] [INFO] Using 'UTF-8' encoding to copy filtered resources.
17:25:11 [2020-07-09T21:25:11.820Z] [INFO] skip non existing resourceDirectory /home/jenkins/agent/workspace/tracecompass-gerrit-short-ui-only/analysis/org.eclipse.tracecompass.analysis.os.linux.ui/src/test/resources
17:25:11 [2020-07-09T21:25:11.820Z] [INFO] 
17:25:11 [2020-07-09T21:25:11.820Z] [INFO] --- tycho-source-plugin:1.3.0:plugin-source (plugin-source) @ org.eclipse.tracecompass.analysis.os.linux.ui ---
17:25:11 [2020-07-09T21:25:11.821Z] [INFO] Building jar: /home/jenkins/agent/workspace/tracecompass-gerrit-short-ui-only/analysis/org.eclipse.tracecompass.analysis.os.linux.ui/target/org.eclipse.tracecompass.analysis.os.linux.ui-4.0.0-SNAPSHOT-sources.jar
17:25:11 [2020-07-09T21:25:11.821Z] [INFO] 
17:25:11 [2020-07-09T21:25:11.821Z] [INFO] --- target-platform-configuration:1.3.0:target-platform (default-target-platform) @ org.eclipse.tracecompass.analysis.os.linux.ui ---
17:25:11 [2020-07-09T21:25:11.821Z] [INFO] 
17:25:11 [2020-07-09T21:25:11.821Z] [INFO] --- tycho-packaging-plugin:1.3.0:package-plugin (default-package-plugin) @ org.eclipse.tracecompass.analysis.os.linux.ui ---
17:25:11 [2020-07-09T21:25:11.821Z] [INFO] Building jar: /home/jenkins/agent/workspace/tracecompass-gerrit-short-ui-only/analysis/org.eclipse.tracecompass.analysis.os.linux.ui/target/org.eclipse.tracecompass.analysis.os.linux.ui-4.0.0-SNAPSHOT.jar
17:25:12 [2020-07-09T21:25:12.076Z] [INFO] 
17:25:12 [2020-07-09T21:25:12.077Z] [INFO] --- tycho-p2-plugin:1.3.0:p2-metadata-default (default-p2-metadata-default) @ org.eclipse.tracecompass.analysis.os.linux.ui ---
17:25:12 [2020-07-09T21:25:12.077Z] [INFO] 
17:25:12 [2020-07-09T21:25:12.077Z] [INFO] --- tycho-source-feature-plugin:1.3.0:source-feature (source-feature) @ org.eclipse.tracecompass.analysis.os.linux.ui ---
17:25:12 [2020-07-09T21:25:12.077Z] [INFO] 
17:25:12 [2020-07-09T21:25:12.077Z] [INFO] --- tycho-pack200b-plugin:1.3.0:pack (pack200-pack) @ org.eclipse.tracecompass.analysis.os.linux.ui ---
17:25:12 [2020-07-09T21:25:12.077Z] [INFO] Pack200 packing jar /home/jenkins/agent/workspace/tracecompass-gerrit-short-ui-only/analysis/org.eclipse.tracecompass.analysis.os.linux.ui/target/org.eclipse.tracecompass.analysis.os.linux.ui-4.0.0-SNAPSHOT.jar
17:25:12 [2020-07-09T21:25:12.077Z] [INFO] 
17:25:12 [2020-07-09T21:25:12.077Z] [INFO] --- tycho-p2-plugin:1.3.0:p2-metadata (p2-metadata) @ org.eclipse.tracecompass.analysis.os.linux.ui ---
17:25:12 [2020-07-09T21:25:12.077Z] [INFO] 
17:25:12 [2020-07-09T21:25:12.077Z] [INFO] --- maven-install-plugin:2.5.2:install (default-install) @ org.eclipse.tracecompass.analysis.os.linux.ui ---
17:25:12 [2020-07-09T21:25:12.077Z] [INFO] Installing /home/jenkins/agent/workspace/tracecompass-gerrit-short-ui-only/analysis/org.eclipse.tracecompass.analysis.os.linux.ui/target/org.eclipse.tracecompass.analysis.os.linux.ui-4.0.0-SNAPSHOT.jar to /home/jenkins/.m2/repository/org/eclipse/tracecompass/org.eclipse.tracecompass.analysis.os.linux.ui/4.0.0-SNAPSHOT/org.eclipse.tracecompass.analysis.os.linux.ui-4.0.0-SNAPSHOT.jar
17:25:12 [2020-07-09T21:25:12.077Z] [INFO] Installing /home/jenkins/agent/workspace/tracecompass-gerrit-short-ui-only/analysis/org.eclipse.tracecompass.analysis.os.linux.ui/.polyglot.build.properties to /home/jenkins/.m2/repository/org/eclipse/tracecompass/org.eclipse.tracecompass.analysis.os.linux.ui/4.0.0-SNAPSHOT/org.eclipse.tracecompass.analysis.os.linux.ui-4.0.0-SNAPSHOT.pom
17:25:12 [2020-07-09T21:25:12.077Z] [INFO] Installing /home/jenkins/agent/workspace/tracecompass-gerrit-short-ui-only/analysis/org.eclipse.tracecompass.analysis.os.linux.ui/target/org.eclipse.tracecompass.analysis.os.linux.ui-4.0.0-SNAPSHOT-sources.jar to /home/jenkins/.m2/repository/org/eclipse/tracecompass/org.eclipse.tracecompass.analysis.os.linux.ui/4.0.0-SNAPSHOT/org.eclipse.tracecompass.analysis.os.linux.ui-4.0.0-SNAPSHOT-sources.jar
17:25:12 [2020-07-09T21:25:12.077Z] [INFO] Installing /home/jenkins/agent/workspace/tracecompass-gerrit-short-ui-only/analysis/org.eclipse.tracecompass.analysis.os.linux.ui/target/org.eclipse.tracecompass.analysis.os.linux.ui-4.0.0-SNAPSHOT.jar.pack.gz to /home/jenkins/.m2/repository/org/eclipse/tracecompass/org.eclipse.tracecompass.analysis.os.linux.ui/4.0.0-SNAPSHOT/org.eclipse.tracecompass.analysis.os.linux.ui-4.0.0-SNAPSHOT-pack200.jar.pack.gz
17:25:12 [2020-07-09T21:25:12.077Z] [INFO] Installing /home/jenkins/agent/workspace/tracecompass-gerrit-short-ui-only/analysis/org.eclipse.tracecompass.analysis.os.linux.ui/target/p2content.xml to /home/jenkins/.m2/repository/org/eclipse/tracecompass/org.eclipse.tracecompass.analysis.os.linux.ui/4.0.0-SNAPSHOT/org.eclipse.tracecompass.analysis.os.linux.ui-4.0.0-SNAPSHOT-p2metadata.xml
17:25:12 [2020-07-09T21:25:12.077Z] [INFO] Installing /home/jenkins/agent/workspace/tracecompass-gerrit-short-ui-only/analysis/org.eclipse.tracecompass.analysis.os.linux.ui/target/p2artifacts.xml to /home/jenkins/.m2/repository/org/eclipse/tracecompass/org.eclipse.tracecompass.analysis.os.linux.ui/4.0.0-SNAPSHOT/org.eclipse.tracecompass.analysis.os.linux.ui-4.0.0-SNAPSHOT-p2artifacts.xml
17:25:12 [2020-07-09T21:25:12.077Z] [INFO] 
17:25:12 [2020-07-09T21:25:12.077Z] [INFO] --- tycho-p2-plugin:1.3.0:update-local-index (default-update-local-index) @ org.eclipse.tracecompass.analysis.os.linux.ui ---
17:25:12 [2020-07-09T21:25:12.077Z] [INFO] 
17:25:12 [2020-07-09T21:25:12.077Z] [INFO] --< org.eclipse.tracecompass:org.eclipse.tracecompass.analysis.os.linux.ui.tests >--
17:25:12 [2020-07-09T21:25:12.077Z] [INFO] Building org.eclipse.tracecompass.analysis.os.linux.ui.tests 1.0.8-SNAPSHOT [47/138]
17:25:12 [2020-07-09T21:25:12.077Z] [INFO] ------------------------[ eclipse-test-plugin ]-------------------------
17:25:12 [2020-07-09T21:25:12.077Z] [INFO] 
17:25:12 [2020-07-09T21:25:12.077Z] [INFO] --- maven-clean-plugin:3.0.0:clean (default-clean) @ org.eclipse.tracecompass.analysis.os.linux.ui.tests ---
17:25:12 [2020-07-09T21:25:12.077Z] [INFO] 
17:25:12 [2020-07-09T21:25:12.077Z] [INFO] --- tycho-packaging-plugin:1.3.0:build-qualifier (default-build-qualifier) @ org.eclipse.tracecompass.analysis.os.linux.ui.tests ---
17:25:12 [2020-07-09T21:25:12.077Z] [INFO] The project's OSGi version is 1.0.8.202007092109
17:25:12 [2020-07-09T21:25:12.077Z] [INFO] 
17:25:12 [2020-07-09T21:25:12.077Z] [INFO] --- tycho-packaging-plugin:1.3.0:validate-id (default-validate-id) @ org.eclipse.tracecompass.analysis.os.linux.ui.tests ---
17:25:12 [2020-07-09T21:25:12.077Z] [INFO] 
17:25:12 [2020-07-09T21:25:12.077Z] [INFO] --- tycho-packaging-plugin:1.3.0:validate-version (default-validate-version) @ org.eclipse.tracecompass.analysis.os.linux.ui.tests ---
17:25:12 [2020-07-09T21:25:12.077Z] [INFO] 
17:25:12 [2020-07-09T21:25:12.077Z] [INFO] --- maven-enforcer-plugin:1.4.1:enforce (enforce-maven-version) @ org.eclipse.tracecompass.analysis.os.linux.ui.tests ---
17:25:12 [2020-07-09T21:25:12.077Z] [INFO] 
17:25:12 [2020-07-09T21:25:12.077Z] [INFO] --- maven-resources-plugin:3.0.2:resources (default-resources) @ org.eclipse.tracecompass.analysis.os.linux.ui.tests ---
17:25:12 [2020-07-09T21:25:12.077Z] [INFO] Using 'UTF-8' encoding to copy filtered resources.
17:25:12 [2020-07-09T21:25:12.077Z] [INFO] skip non existing resourceDirectory /home/jenkins/agent/workspace/tracecompass-gerrit-short-ui-only/analysis/org.eclipse.tracecompass.analysis.os.linux.ui.tests/src/main/resources
17:25:12 [2020-07-09T21:25:12.077Z] [INFO] 
17:25:12 [2020-07-09T21:25:12.077Z] [INFO] --- tycho-compiler-plugin:1.3.0:compile (default-compile) @ org.eclipse.tracecompass.analysis.os.linux.ui.tests ---
17:25:12 [2020-07-09T21:25:12.077Z] [INFO] Compiling 2 source files to /home/jenkins/agent/workspace/tracecompass-gerrit-short-ui-only/analysis/org.eclipse.tracecompass.analysis.os.linux.ui.tests/target/classes
17:25:12 [2020-07-09T21:25:12.333Z] [INFO] 
17:25:12 [2020-07-09T21:25:12.333Z] [INFO] --- maven-resources-plugin:3.0.2:testResources (default-testResources) @ org.eclipse.tracecompass.analysis.os.linux.ui.tests ---
17:25:12 [2020-07-09T21:25:12.333Z] [INFO] Using 'UTF-8' encoding to copy filtered resources.
17:25:12 [2020-07-09T21:25:12.333Z] [INFO] skip non existing resourceDirectory /home/jenkins/agent/workspace/tracecompass-gerrit-short-ui-only/analysis/org.eclipse.tracecompass.analysis.os.linux.ui.tests/src/test/resources
17:25:12 [2020-07-09T21:25:12.333Z] [INFO] 
17:25:12 [2020-07-09T21:25:12.333Z] [INFO] --- tycho-source-plugin:1.3.0:plugin-source (plugin-source) @ org.eclipse.tracecompass.analysis.os.linux.ui.tests ---
17:25:12 [2020-07-09T21:25:12.333Z] [INFO] Building jar: /home/jenkins/agent/workspace/tracecompass-gerrit-short-ui-only/analysis/org.eclipse.tracecompass.analysis.os.linux.ui.tests/target/org.eclipse.tracecompass.analysis.os.linux.ui.tests-1.0.8-SNAPSHOT-sources.jar
17:25:12 [2020-07-09T21:25:12.333Z] [INFO] 
17:25:12 [2020-07-09T21:25:12.333Z] [INFO] --- target-platform-configuration:1.3.0:target-platform (default-target-platform) @ org.eclipse.tracecompass.analysis.os.linux.ui.tests ---
17:25:12 [2020-07-09T21:25:12.333Z] [INFO] 
17:25:12 [2020-07-09T21:25:12.333Z] [INFO] --- tycho-packaging-plugin:1.3.0:package-plugin (default-package-plugin) @ org.eclipse.tracecompass.analysis.os.linux.ui.tests ---
17:25:12 [2020-07-09T21:25:12.333Z] [INFO] Building jar: /home/jenkins/agent/workspace/tracecompass-gerrit-short-ui-only/analysis/org.eclipse.tracecompass.analysis.os.linux.ui.tests/target/org.eclipse.tracecompass.analysis.os.linux.ui.tests-1.0.8-SNAPSHOT.jar
17:25:12 [2020-07-09T21:25:12.333Z] [INFO] 
17:25:12 [2020-07-09T21:25:12.333Z] [INFO] --- tycho-p2-plugin:1.3.0:p2-metadata-default (default-p2-metadata-default) @ org.eclipse.tracecompass.analysis.os.linux.ui.tests ---
17:25:12 [2020-07-09T21:25:12.333Z] [INFO] 
17:25:12 [2020-07-09T21:25:12.333Z] [INFO] --- tycho-source-feature-plugin:1.3.0:source-feature (source-feature) @ org.eclipse.tracecompass.analysis.os.linux.ui.tests ---
17:25:12 [2020-07-09T21:25:12.333Z] [INFO] 
17:25:12 [2020-07-09T21:25:12.333Z] [INFO] --- tycho-pack200b-plugin:1.3.0:pack (pack200-pack) @ org.eclipse.tracecompass.analysis.os.linux.ui.tests ---
17:25:12 [2020-07-09T21:25:12.333Z] [INFO] Pack200 packing jar /home/jenkins/agent/workspace/tracecompass-gerrit-short-ui-only/analysis/org.eclipse.tracecompass.analysis.os.linux.ui.tests/target/org.eclipse.tracecompass.analysis.os.linux.ui.tests-1.0.8-SNAPSHOT.jar
17:25:12 [2020-07-09T21:25:12.333Z] [INFO] 
17:25:12 [2020-07-09T21:25:12.333Z] [INFO] --- tycho-p2-plugin:1.3.0:p2-metadata (p2-metadata) @ org.eclipse.tracecompass.analysis.os.linux.ui.tests ---
17:25:12 [2020-07-09T21:25:12.333Z] [INFO] 
17:25:12 [2020-07-09T21:25:12.333Z] [INFO] --- tycho-surefire-plugin:1.3.0:test (default-test) @ org.eclipse.tracecompass.analysis.os.linux.ui.tests ---
17:25:13 [2020-07-09T21:25:13.262Z] [INFO] Expected eclipse log file: /home/jenkins/agent/workspace/tracecompass-gerrit-short-ui-only/analysis/org.eclipse.tracecompass.analysis.os.linux.ui.tests/target/work/data/.metadata/.log
17:25:13 [2020-07-09T21:25:13.262Z] [INFO] Command line:
17:25:13 [2020-07-09T21:25:13.262Z] 	[/opt/tools/java/oracle/jdk-8/1.8.0_202/jre/bin/java, -Dosgi.noShutdown=false, -Dosgi.os=linux, -Dosgi.ws=gtk, -Dosgi.arch=x86_64, -Dorg.eclipse.swt.browser.DefaultType=mozilla, -Xms512m, -Xmx1024m, -Dosgi.clean=true, -jar, /home/jenkins/.m2/repository/p2/osgi/bundle/org.eclipse.equinox.launcher/1.5.700.v20200207-2156/org.eclipse.equinox.launcher-1.5.700.v20200207-2156.jar, -data, /home/jenkins/agent/workspace/tracecompass-gerrit-short-ui-only/analysis/org.eclipse.tracecompass.analysis.os.linux.ui.tests/target/work/data, -install, /home/jenkins/agent/workspace/tracecompass-gerrit-short-ui-only/analysis/org.eclipse.tracecompass.analysis.os.linux.ui.tests/target/work, -configuration, /home/jenkins/agent/workspace/tracecompass-gerrit-short-ui-only/analysis/org.eclipse.tracecompass.analysis.os.linux.ui.tests/target/work/configuration, -application, org.eclipse.tycho.surefire.osgibooter.uitest, -testproperties, /home/jenkins/agent/workspace/tracecompass-gerrit-short-ui-only/analysis/org.eclipse.tracecompass.analysis.os.linux.ui.tests/target/surefire.properties, -product, org.eclipse.platform.ide, -consoleLog]
17:25:13 [2020-07-09T21:25:13.262Z] Picked up _JAVA_OPTIONS: -Duser.home=/home/tracecompass
17:25:14 [2020-07-09T21:25:14.626Z] !SESSION 2020-07-09 21:25:13.084 -----------------------------------------------
17:25:14 [2020-07-09T21:25:14.626Z] eclipse.buildId=unknown
17:25:14 [2020-07-09T21:25:14.626Z] java.version=1.8.0_202
17:25:14 [2020-07-09T21:25:14.626Z] java.vendor=Oracle Corporation
17:25:14 [2020-07-09T21:25:14.626Z] BootLoader constants: OS=linux, ARCH=x86_64, WS=gtk, NL=en_US
17:25:14 [2020-07-09T21:25:14.626Z] Framework arguments:  -application org.eclipse.tycho.surefire.osgibooter.uitest -testproperties /home/jenkins/agent/workspace/tracecompass-gerrit-short-ui-only/analysis/org.eclipse.tracecompass.analysis.os.linux.ui.tests/target/surefire.properties -product org.eclipse.platform.ide
17:25:14 [2020-07-09T21:25:14.626Z] Command-line arguments:  -data /home/jenkins/agent/workspace/tracecompass-gerrit-short-ui-only/analysis/org.eclipse.tracecompass.analysis.os.linux.ui.tests/target/work/data -application org.eclipse.tycho.surefire.osgibooter.uitest -testproperties /home/jenkins/agent/workspace/tracecompass-gerrit-short-ui-only/analysis/org.eclipse.tracecompass.analysis.os.linux.ui.tests/target/surefire.properties -product org.eclipse.platform.ide -consoleLog
17:25:14 [2020-07-09T21:25:14.626Z] 
17:25:14 [2020-07-09T21:25:14.626Z] !ENTRY org.eclipse.compare.win32 4 0 2020-07-09 21:25:14.418
17:25:14 [2020-07-09T21:25:14.626Z] !MESSAGE FrameworkEvent ERROR
17:25:14 [2020-07-09T21:25:14.626Z] !STACK 0
17:25:14 [2020-07-09T21:25:14.626Z] org.osgi.framework.BundleException: Could not resolve module: org.eclipse.compare.win32 [65]
17:25:14 [2020-07-09T21:25:14.626Z]   Unresolved requirement: Require-Capability: eclipse.platform; filter:="(osgi.os=win32)"
17:25:14 [2020-07-09T21:25:14.626Z] 
17:25:14 [2020-07-09T21:25:14.626Z] 	at org.eclipse.osgi.container.Module.start(Module.java:463)
17:25:14 [2020-07-09T21:25:14.626Z] 	at org.eclipse.osgi.container.ModuleContainer$ContainerStartLevel$2.run(ModuleContainer.java:1845)
17:25:14 [2020-07-09T21:25:14.626Z] 	at org.eclipse.osgi.internal.framework.EquinoxContainerAdaptor$1$1.execute(EquinoxContainerAdaptor.java:136)
17:25:14 [2020-07-09T21:25:14.626Z] 	at org.eclipse.osgi.container.ModuleContainer$ContainerStartLevel.incStartLevel(ModuleContainer.java:1838)
17:25:14 [2020-07-09T21:25:14.626Z] 	at org.eclipse.osgi.container.ModuleContainer$ContainerStartLevel.incStartLevel(ModuleContainer.java:1779)
17:25:14 [2020-07-09T21:25:14.626Z] 	at org.eclipse.osgi.container.ModuleContainer$ContainerStartLevel.doContainerStartLevel(ModuleContainer.java:1743)
17:25:14 [2020-07-09T21:25:14.626Z] 	at org.eclipse.osgi.container.ModuleContainer$ContainerStartLevel.dispatchEvent(ModuleContainer.java:1665)
17:25:14 [2020-07-09T21:25:14.626Z] 	at org.eclipse.osgi.container.ModuleContainer$ContainerStartLevel.dispatchEvent(ModuleContainer.java:1)
17:25:14 [2020-07-09T21:25:14.626Z] 	at org.eclipse.osgi.framework.eventmgr.EventManager.dispatchEvent(EventManager.java:234)
17:25:14 [2020-07-09T21:25:14.626Z] 	at org.eclipse.osgi.framework.eventmgr.EventManager$EventThread.run(EventManager.java:345)
17:25:14 [2020-07-09T21:25:14.626Z] 
17:25:14 [2020-07-09T21:25:14.626Z] !ENTRY org.eclipse.ecf.provider.filetransfer.httpclient45.win32 4 0 2020-07-09 21:25:14.443
17:25:14 [2020-07-09T21:25:14.626Z] !MESSAGE FrameworkEvent ERROR
17:25:14 [2020-07-09T21:25:14.626Z] !STACK 0
17:25:14 [2020-07-09T21:25:14.626Z] org.osgi.framework.BundleException: Could not resolve module: org.eclipse.ecf.provider.filetransfer.httpclient45.win32 [137]
17:25:14 [2020-07-09T21:25:14.626Z]   Unresolved requirement: Require-Capability: eclipse.platform; filter:="(osgi.os=win32)"
17:25:14 [2020-07-09T21:25:14.626Z]   Unresolved requirement: Import-Package: org.apache.http.impl.auth.win; version="[4.5.0,5.0.0)"
17:25:14 [2020-07-09T21:25:14.626Z]     -> Export-Package: org.apache.http.impl.auth.win; bundle-symbolic-name="org.apache.httpcomponents.httpclient.win"; bundle-version="4.5.10.v20200113-2105"; version="4.5.10"; x-internal:="true"; uses:="org.apache.http,org.apache.http.auth,org.apache.http.client,org.apache.http.impl.auth,org.apache.http.protocol,org.apache.http.util"
17:25:14 [2020-07-09T21:25:14.626Z]        org.apache.httpcomponents.httpclient.win [36]
17:25:14 [2020-07-09T21:25:14.626Z]          Unresolved requirement: Require-Capability: eclipse.platform; filter:="(osgi.os=win32)"
17:25:14 [2020-07-09T21:25:14.626Z] 
17:25:14 [2020-07-09T21:25:14.626Z] 	at org.eclipse.osgi.container.Module.start(Module.java:463)
17:25:14 [2020-07-09T21:25:14.626Z] 	at org.eclipse.osgi.container.ModuleContainer$ContainerStartLevel$2.run(ModuleContainer.java:1845)
17:25:14 [2020-07-09T21:25:14.626Z] 	at org.eclipse.osgi.internal.framework.EquinoxContainerAdaptor$1$1.execute(EquinoxContainerAdaptor.java:136)
17:25:14 [2020-07-09T21:25:14.626Z] 	at org.eclipse.osgi.container.ModuleContainer$ContainerStartLevel.incStartLevel(ModuleContainer.java:1838)
17:25:14 [2020-07-09T21:25:14.626Z] 	at org.eclipse.osgi.container.ModuleContainer$ContainerStartLevel.incStartLevel(ModuleContainer.java:1779)
17:25:14 [2020-07-09T21:25:14.626Z] 	at org.eclipse.osgi.container.ModuleContainer$ContainerStartLevel.doContainerStartLevel(ModuleContainer.java:1743)
17:25:14 [2020-07-09T21:25:14.626Z] 	at org.eclipse.osgi.container.ModuleContainer$ContainerStartLevel.dispatchEvent(ModuleContainer.java:1665)
17:25:14 [2020-07-09T21:25:14.626Z] 	at org.eclipse.osgi.container.ModuleContainer$ContainerStartLevel.dispatchEvent(ModuleContainer.java:1)
17:25:14 [2020-07-09T21:25:14.626Z] 	at org.eclipse.osgi.framework.eventmgr.EventManager.dispatchEvent(EventManager.java:234)
17:25:14 [2020-07-09T21:25:14.626Z] 	at org.eclipse.osgi.framework.eventmgr.EventManager$EventThread.run(EventManager.java:345)
17:25:15 [2020-07-09T21:25:15.552Z] SWT SessionManagerDBus: Failed to connect to org.gnome.SessionManager: Failed to execute child process “dbus-launch” (No such file or directory)
17:25:15 [2020-07-09T21:25:15.552Z] SWT SessionManagerDBus: Failed to connect to org.xfce.SessionManager: Failed to execute child process “dbus-launch” (No such file or directory)
17:25:19 [2020-07-09T21:25:19.715Z] 
17:25:19 [2020-07-09T21:25:19.715Z] !ENTRY org.eclipse.urischeme 4 0 2020-07-09 21:25:19.329
17:25:19 [2020-07-09T21:25:19.715Z] !MESSAGE Cannot run program "xdg-mime": error=2, No such file or directory
17:25:19 [2020-07-09T21:25:19.715Z] !STACK 0
17:25:19 [2020-07-09T21:25:19.715Z] java.io.IOException: Cannot run program "xdg-mime": error=2, No such file or directory
17:25:19 [2020-07-09T21:25:19.715Z] 	at java.lang.ProcessBuilder.start(ProcessBuilder.java:1048)
17:25:19 [2020-07-09T21:25:19.715Z] 	at org.eclipse.urischeme.internal.registration.ProcessExecutor.execute(ProcessExecutor.java:36)
17:25:19 [2020-07-09T21:25:19.715Z] 	at org.eclipse.urischeme.internal.registration.RegistrationLinux.getRegisteredDesktopFileForScheme(RegistrationLinux.java:136)
17:25:19 [2020-07-09T21:25:19.715Z] 	at org.eclipse.urischeme.internal.registration.RegistrationLinux.determineHandlerLocation(RegistrationLinux.java:80)
17:25:19 [2020-07-09T21:25:19.715Z] 	at org.eclipse.urischeme.internal.registration.RegistrationLinux.getSchemesInformation(RegistrationLinux.java:69)
17:25:19 [2020-07-09T21:25:19.715Z] 	at org.eclipse.urischeme.AutoRegisterSchemeHandlersJob.run(AutoRegisterSchemeHandlersJob.java:63)
17:25:19 [2020-07-09T21:25:19.715Z] 	at org.eclipse.core.internal.jobs.Worker.run(Worker.java:63)
17:25:19 [2020-07-09T21:25:19.715Z] Caused by: java.io.IOException: error=2, No such file or directory
17:25:19 [2020-07-09T21:25:19.715Z] 	at java.lang.UNIXProcess.forkAndExec(Native Method)
17:25:19 [2020-07-09T21:25:19.715Z] 	at java.lang.UNIXProcess.<init>(UNIXProcess.java:247)
17:25:19 [2020-07-09T21:25:19.715Z] 	at java.lang.ProcessImpl.start(ProcessImpl.java:134)
17:25:19 [2020-07-09T21:25:19.715Z] 	at java.lang.ProcessBuilder.start(ProcessBuilder.java:1029)
17:25:19 [2020-07-09T21:25:19.715Z] 	... 6 more
17:25:19 [2020-07-09T21:25:19.715Z] 
17:25:19 [2020-07-09T21:25:19.715Z] (WebKitWebProcess:4654): GLib-WARNING **: 21:25:19.445: getpwuid_r(): failed due to unknown user id (1000520000)
17:25:19 [2020-07-09T21:25:19.972Z] Running org.eclipse.tracecompass.analysis.os.linux.ui.tests.view.controlflow.ControlFlowEntryComparatorTest
17:25:19 [2020-07-09T21:25:19.972Z] Tests run: 12, Failures: 0, Errors: 0, Skipped: 0, Time elapsed: 0.04 s - in org.eclipse.tracecompass.analysis.os.linux.ui.tests.view.controlflow.ControlFlowEntryComparatorTest
17:25:19 [2020-07-09T21:25:19.972Z] tidColumnComparatorTest(org.eclipse.tracecompass.analysis.os.linux.ui.tests.view.controlflow.ControlFlowEntryComparatorTest)  Time elapsed: 0.024 s
17:25:19 [2020-07-09T21:25:19.972Z] tidSecondaryTimeColumnComparatorTest(org.eclipse.tracecompass.analysis.os.linux.ui.tests.view.controlflow.ControlFlowEntryComparatorTest)  Time elapsed: 0 s
17:25:19 [2020-07-09T21:25:19.972Z] execNameColumnComparatorTest(org.eclipse.tracecompass.analysis.os.linux.ui.tests.view.controlflow.ControlFlowEntryComparatorTest)  Time elapsed: 0 s
17:25:19 [2020-07-09T21:25:19.972Z] ptidComparatorTest(org.eclipse.tracecompass.analysis.os.linux.ui.tests.view.controlflow.ControlFlowEntryComparatorTest)  Time elapsed: 0 s
17:25:19 [2020-07-09T21:25:19.972Z] tidComparatorTest(org.eclipse.tracecompass.analysis.os.linux.ui.tests.view.controlflow.ControlFlowEntryComparatorTest)  Time elapsed: 0 s
17:25:19 [2020-07-09T21:25:19.972Z] ptidColumnComparatorTest(org.eclipse.tracecompass.analysis.os.linux.ui.tests.view.controlflow.ControlFlowEntryComparatorTest)  Time elapsed: 0 s
17:25:19 [2020-07-09T21:25:19.972Z] birthTimeColumnComparatorTest(org.eclipse.tracecompass.analysis.os.linux.ui.tests.view.controlflow.ControlFlowEntryComparatorTest)  Time elapsed: 0 s
17:25:19 [2020-07-09T21:25:19.972Z] birthTimeSecondaryTimeColumnComparatorTest(org.eclipse.tracecompass.analysis.os.linux.ui.tests.view.controlflow.ControlFlowEntryComparatorTest)  Time elapsed: 0.001 s
17:25:19 [2020-07-09T21:25:19.972Z] execNameSecondaryTimeColumnComparatorTest(org.eclipse.tracecompass.analysis.os.linux.ui.tests.view.controlflow.ControlFlowEntryComparatorTest)  Time elapsed: 0 s
17:25:19 [2020-07-09T21:25:19.972Z] ptidSecondaryTimeColumnComparatorTest(org.eclipse.tracecompass.analysis.os.linux.ui.tests.view.controlflow.ControlFlowEntryComparatorTest)  Time elapsed: 0 s
17:25:19 [2020-07-09T21:25:19.972Z] birthTimeComparatorTest(org.eclipse.tracecompass.analysis.os.linux.ui.tests.view.controlflow.ControlFlowEntryComparatorTest)  Time elapsed: 0 s
17:25:19 [2020-07-09T21:25:19.972Z] execNameComparatorTest(org.eclipse.tracecompass.analysis.os.linux.ui.tests.view.controlflow.ControlFlowEntryComparatorTest)  Time elapsed: 0 s
17:25:19 [2020-07-09T21:25:19.972Z] Running org.eclipse.tracecompass.analysis.os.linux.ui.tests.view.controlflow.ControlFlowOptimizerTest
17:25:19 [2020-07-09T21:25:19.972Z] Tests run: 9, Failures: 0, Errors: 0, Skipped: 0, Time elapsed: 0.138 s - in org.eclipse.tracecompass.analysis.os.linux.ui.tests.view.controlflow.ControlFlowOptimizerTest
17:25:19 [2020-07-09T21:25:19.972Z] testEmpty(org.eclipse.tracecompass.analysis.os.linux.ui.tests.view.controlflow.ControlFlowOptimizerTest)  Time elapsed: 0.004 s
17:25:19 [2020-07-09T21:25:19.972Z] testMany(org.eclipse.tracecompass.analysis.os.linux.ui.tests.view.controlflow.ControlFlowOptimizerTest)  Time elapsed: 0.129 s
17:25:19 [2020-07-09T21:25:19.972Z] testDoubleOtherOrder(org.eclipse.tracecompass.analysis.os.linux.ui.tests.view.controlflow.ControlFlowOptimizerTest)  Time elapsed: 0.003 s
17:25:19 [2020-07-09T21:25:19.972Z] test9OutOfOrder(org.eclipse.tracecompass.analysis.os.linux.ui.tests.view.controlflow.ControlFlowOptimizerTest)  Time elapsed: 0 s
17:25:19 [2020-07-09T21:25:19.972Z] test9InOrder(org.eclipse.tracecompass.analysis.os.linux.ui.tests.view.controlflow.ControlFlowOptimizerTest)  Time elapsed: 0 s
17:25:19 [2020-07-09T21:25:19.972Z] testDouble(org.eclipse.tracecompass.analysis.os.linux.ui.tests.view.controlflow.ControlFlowOptimizerTest)  Time elapsed: 0 s
17:25:19 [2020-07-09T21:25:19.972Z] testSingleInvalid(org.eclipse.tracecompass.analysis.os.linux.ui.tests.view.controlflow.ControlFlowOptimizerTest)  Time elapsed: 0.001 s
17:25:19 [2020-07-09T21:25:19.972Z] testSingle(org.eclipse.tracecompass.analysis.os.linux.ui.tests.view.controlflow.ControlFlowOptimizerTest)  Time elapsed: 0 s
17:25:19 [2020-07-09T21:25:19.972Z] test9InOrder10Times(org.eclipse.tracecompass.analysis.os.linux.ui.tests.view.controlflow.ControlFlowOptimizerTest)  Time elapsed: 0 s
17:25:19 [2020-07-09T21:25:19.972Z] 
17:25:19 [2020-07-09T21:25:19.972Z] Results:
17:25:19 [2020-07-09T21:25:19.972Z] 
17:25:19 [2020-07-09T21:25:19.972Z] Tests run: 21, Failures: 0, Errors: 0, Skipped: 0
17:25:19 [2020-07-09T21:25:19.972Z] 
17:25:21 [2020-07-09T21:25:21.336Z] [INFO] All tests passed!
17:25:21 [2020-07-09T21:25:21.336Z] [INFO] 
17:25:21 [2020-07-09T21:25:21.336Z] [INFO] --- maven-install-plugin:2.5.2:install (default-install) @ org.eclipse.tracecompass.analysis.os.linux.ui.tests ---
17:25:21 [2020-07-09T21:25:21.336Z] [INFO] Installing /home/jenkins/agent/workspace/tracecompass-gerrit-short-ui-only/analysis/org.eclipse.tracecompass.analysis.os.linux.ui.tests/target/org.eclipse.tracecompass.analysis.os.linux.ui.tests-1.0.8-SNAPSHOT.jar to /home/jenkins/.m2/repository/org/eclipse/tracecompass/org.eclipse.tracecompass.analysis.os.linux.ui.tests/1.0.8-SNAPSHOT/org.eclipse.tracecompass.analysis.os.linux.ui.tests-1.0.8-SNAPSHOT.jar
17:25:21 [2020-07-09T21:25:21.336Z] [INFO] Installing /home/jenkins/agent/workspace/tracecompass-gerrit-short-ui-only/analysis/org.eclipse.tracecompass.analysis.os.linux.ui.tests/pom.xml to /home/jenkins/.m2/repository/org/eclipse/tracecompass/org.eclipse.tracecompass.analysis.os.linux.ui.tests/1.0.8-SNAPSHOT/org.eclipse.tracecompass.analysis.os.linux.ui.tests-1.0.8-SNAPSHOT.pom
17:25:21 [2020-07-09T21:25:21.336Z] [INFO] Installing /home/jenkins/agent/workspace/tracecompass-gerrit-short-ui-only/analysis/org.eclipse.tracecompass.analysis.os.linux.ui.tests/target/org.eclipse.tracecompass.analysis.os.linux.ui.tests-1.0.8-SNAPSHOT-sources.jar to /home/jenkins/.m2/repository/org/eclipse/tracecompass/org.eclipse.tracecompass.analysis.os.linux.ui.tests/1.0.8-SNAPSHOT/org.eclipse.tracecompass.analysis.os.linux.ui.tests-1.0.8-SNAPSHOT-sources.jar
17:25:21 [2020-07-09T21:25:21.336Z] [INFO] Installing /home/jenkins/agent/workspace/tracecompass-gerrit-short-ui-only/analysis/org.eclipse.tracecompass.analysis.os.linux.ui.tests/target/org.eclipse.tracecompass.analysis.os.linux.ui.tests-1.0.8-SNAPSHOT.jar.pack.gz to /home/jenkins/.m2/repository/org/eclipse/tracecompass/org.eclipse.tracecompass.analysis.os.linux.ui.tests/1.0.8-SNAPSHOT/org.eclipse.tracecompass.analysis.os.linux.ui.tests-1.0.8-SNAPSHOT-pack200.jar.pack.gz
17:25:21 [2020-07-09T21:25:21.336Z] [INFO] Installing /home/jenkins/agent/workspace/tracecompass-gerrit-short-ui-only/analysis/org.eclipse.tracecompass.analysis.os.linux.ui.tests/target/p2content.xml to /home/jenkins/.m2/repository/org/eclipse/tracecompass/org.eclipse.tracecompass.analysis.os.linux.ui.tests/1.0.8-SNAPSHOT/org.eclipse.tracecompass.analysis.os.linux.ui.tests-1.0.8-SNAPSHOT-p2metadata.xml
17:25:21 [2020-07-09T21:25:21.336Z] [INFO] Installing /home/jenkins/agent/workspace/tracecompass-gerrit-short-ui-only/analysis/org.eclipse.tracecompass.analysis.os.linux.ui.tests/target/p2artifacts.xml to /home/jenkins/.m2/repository/org/eclipse/tracecompass/org.eclipse.tracecompass.analysis.os.linux.ui.tests/1.0.8-SNAPSHOT/org.eclipse.tracecompass.analysis.os.linux.ui.tests-1.0.8-SNAPSHOT-p2artifacts.xml
17:25:21 [2020-07-09T21:25:21.336Z] [INFO] 
17:25:21 [2020-07-09T21:25:21.336Z] [INFO] --- tycho-p2-plugin:1.3.0:update-local-index (default-update-local-index) @ org.eclipse.tracecompass.analysis.os.linux.ui.tests ---
17:25:21 [2020-07-09T21:25:21.336Z] [INFO] 
17:25:21 [2020-07-09T21:25:21.336Z] [INFO] --< org.eclipse.tracecompass:org.eclipse.tracecompass.analysis.timing.core.tests >--
17:25:21 [2020-07-09T21:25:21.336Z] [INFO] Building org.eclipse.tracecompass.analysis.timing.core.tests 1.0.5-SNAPSHOT [48/138]
17:25:21 [2020-07-09T21:25:21.336Z] [INFO] ------------------------[ eclipse-test-plugin ]-------------------------
17:25:21 [2020-07-09T21:25:21.336Z] [INFO] 
17:25:21 [2020-07-09T21:25:21.336Z] [INFO] --- maven-clean-plugin:3.0.0:clean (default-clean) @ org.eclipse.tracecompass.analysis.timing.core.tests ---
17:25:21 [2020-07-09T21:25:21.336Z] [INFO] 
17:25:21 [2020-07-09T21:25:21.336Z] [INFO] --- tycho-packaging-plugin:1.3.0:build-qualifier (default-build-qualifier) @ org.eclipse.tracecompass.analysis.timing.core.tests ---
17:25:21 [2020-07-09T21:25:21.336Z] [INFO] The project's OSGi version is 1.0.5.202007092109
17:25:21 [2020-07-09T21:25:21.336Z] [INFO] 
17:25:21 [2020-07-09T21:25:21.336Z] [INFO] --- tycho-packaging-plugin:1.3.0:validate-id (default-validate-id) @ org.eclipse.tracecompass.analysis.timing.core.tests ---
17:25:21 [2020-07-09T21:25:21.336Z] [INFO] 
17:25:21 [2020-07-09T21:25:21.336Z] [INFO] --- tycho-packaging-plugin:1.3.0:validate-version (default-validate-version) @ org.eclipse.tracecompass.analysis.timing.core.tests ---
17:25:21 [2020-07-09T21:25:21.336Z] [INFO] 
17:25:21 [2020-07-09T21:25:21.336Z] [INFO] --- maven-enforcer-plugin:1.4.1:enforce (enforce-maven-version) @ org.eclipse.tracecompass.analysis.timing.core.tests ---
17:25:21 [2020-07-09T21:25:21.336Z] [INFO] 
17:25:21 [2020-07-09T21:25:21.336Z] [INFO] --- maven-resources-plugin:3.0.2:resources (default-resources) @ org.eclipse.tracecompass.analysis.timing.core.tests ---
17:25:21 [2020-07-09T21:25:21.336Z] [INFO] Using 'UTF-8' encoding to copy filtered resources.
17:25:21 [2020-07-09T21:25:21.336Z] [INFO] skip non existing resourceDirectory /home/jenkins/agent/workspace/tracecompass-gerrit-short-ui-only/analysis/org.eclipse.tracecompass.analysis.timing.core.tests/src/main/resources
17:25:21 [2020-07-09T21:25:21.336Z] [INFO] 
17:25:21 [2020-07-09T21:25:21.336Z] [INFO] --- tycho-compiler-plugin:1.3.0:compile (default-compile) @ org.eclipse.tracecompass.analysis.timing.core.tests ---
17:25:21 [2020-07-09T21:25:21.336Z] [INFO] Compiling 9 source files to /home/jenkins/agent/workspace/tracecompass-gerrit-short-ui-only/analysis/org.eclipse.tracecompass.analysis.timing.core.tests/target/classes
17:25:21 [2020-07-09T21:25:21.336Z] [WARNING] /home/jenkins/agent/workspace/tracecompass-gerrit-short-ui-only/analysis/org.eclipse.tracecompass.analysis.timing.core.tests/src/org/eclipse/tracecompass/analysis/timing/core/tests/statistics/OfflineStatisticsCalculator.java:[86] 
17:25:21 [2020-07-09T21:25:21.336Z] 	Long value = fMapper.apply(element);
17:25:21 [2020-07-09T21:25:21.336Z] 	             ^^^^^^^^^^^^^^^^^^^^^^
17:25:21 [2020-07-09T21:25:21.336Z] Unsafe interpretation of method return type as '@NonNull' based on the receiver type '@NonNull Function<@NonNull E,@NonNull Long>'. Type 'Function<T,R>' doesn't seem to be designed with null type annotations in mind
17:25:21 [2020-07-09T21:25:21.336Z] [WARNING] /home/jenkins/agent/workspace/tracecompass-gerrit-short-ui-only/analysis/org.eclipse.tracecompass.analysis.timing.core.tests/src/org/eclipse/tracecompass/analysis/timing/core/tests/statistics/OfflineStatisticsCalculator.java:[87] 
17:25:21 [2020-07-09T21:25:21.336Z] 	if (value <= fMapper.apply(obj)) {
17:25:21 [2020-07-09T21:25:21.336Z] 	             ^^^^^^^^^^^^^^^^^^
17:25:21 [2020-07-09T21:25:21.336Z] Unsafe interpretation of method return type as '@NonNull' based on the receiver type '@NonNull Function<@NonNull E,@NonNull Long>'. Type 'Function<T,R>' doesn't seem to be designed with null type annotations in mind
17:25:21 [2020-07-09T21:25:21.336Z] [WARNING] /home/jenkins/agent/workspace/tracecompass-gerrit-short-ui-only/analysis/org.eclipse.tracecompass.analysis.timing.core.tests/src/org/eclipse/tracecompass/analysis/timing/core/tests/statistics/OfflineStatisticsCalculator.java:[105] 
17:25:21 [2020-07-09T21:25:21.336Z] 	Long value = fMapper.apply(element);
17:25:21 [2020-07-09T21:25:21.336Z] 	             ^^^^^^^^^^^^^^^^^^^^^^
17:25:21 [2020-07-09T21:25:21.336Z] Unsafe interpretation of method return type as '@NonNull' based on the receiver type '@NonNull Function<@NonNull E,@NonNull Long>'. Type 'Function<T,R>' doesn't seem to be designed with null type annotations in mind
17:25:21 [2020-07-09T21:25:21.336Z] [WARNING] /home/jenkins/agent/workspace/tracecompass-gerrit-short-ui-only/analysis/org.eclipse.tracecompass.analysis.timing.core.tests/src/org/eclipse/tracecompass/analysis/timing/core/tests/statistics/OfflineStatisticsCalculator.java:[106] 
17:25:21 [2020-07-09T21:25:21.336Z] 	if (value >= fMapper.apply(obj)) {
17:25:21 [2020-07-09T21:25:21.336Z] 	             ^^^^^^^^^^^^^^^^^^
17:25:21 [2020-07-09T21:25:21.336Z] Unsafe interpretation of method return type as '@NonNull' based on the receiver type '@NonNull Function<@NonNull E,@NonNull Long>'. Type 'Function<T,R>' doesn't seem to be designed with null type annotations in mind
17:25:21 [2020-07-09T21:25:21.336Z] [WARNING] /home/jenkins/agent/workspace/tracecompass-gerrit-short-ui-only/analysis/org.eclipse.tracecompass.analysis.timing.core.tests/src/org/eclipse/tracecompass/analysis/timing/core/tests/statistics/AbstractStatisticsTest.java:[124] 
17:25:21 [2020-07-09T21:25:21.336Z] 	return new Statistics<>(mapper);
17:25:21 [2020-07-09T21:25:21.336Z] 	                        ^^^^^^
17:25:21 [2020-07-09T21:25:21.336Z] Null type safety (type annotations): The expression of type 'Function<@NonNull E,Long>' needs unchecked conversion to conform to '@NonNull Function<@NonNull E,@Nullable ? extends @Nullable Number>'
17:25:21 [2020-07-09T21:25:21.336Z] [WARNING] /home/jenkins/agent/workspace/tracecompass-gerrit-short-ui-only/analysis/org.eclipse.tracecompass.analysis.timing.core.tests/src/org/eclipse/tracecompass/analysis/timing/core/tests/statistics/AbstractStatisticsTest.java:[368] 
17:25:21 [2020-07-09T21:25:21.337Z] 	Statistics<E>::update, Statistics<E>::merge);
17:25:21 [2020-07-09T21:25:21.337Z] 	                       ^^^^^^^^^^^^^^^^^^^^
17:25:21 [2020-07-09T21:25:21.337Z] Null type safety: parameter 1 provided via method descriptor BiConsumer<Statistics<E>,Statistics<E>>.accept(Statistics<E>, Statistics<E>) needs unchecked conversion to conform to '@NonNull IStatistics<@NonNull E>'
17:25:21 [2020-07-09T21:25:21.337Z] [WARNING] /home/jenkins/agent/workspace/tracecompass-gerrit-short-ui-only/analysis/org.eclipse.tracecompass.analysis.timing.core.tests/src/org/eclipse/tracecompass/analysis/timing/core/tests/statistics/AbstractStatisticsTest.java:[386] 
17:25:21 [2020-07-09T21:25:21.337Z] 	Statistics<E>::update, Statistics<E>::merge);
17:25:21 [2020-07-09T21:25:21.337Z] 	                       ^^^^^^^^^^^^^^^^^^^^
17:25:21 [2020-07-09T21:25:21.337Z] Null type safety: parameter 1 provided via method descriptor BiConsumer<Statistics<E>,Statistics<E>>.accept(Statistics<E>, Statistics<E>) needs unchecked conversion to conform to '@NonNull IStatistics<@NonNull E>'
17:25:21 [2020-07-09T21:25:21.337Z] 7 problems (7 warnings)
17:25:21 [2020-07-09T21:25:21.337Z] [INFO] 
17:25:21 [2020-07-09T21:25:21.337Z] [INFO] --- maven-resources-plugin:3.0.2:testResources (default-testResources) @ org.eclipse.tracecompass.analysis.timing.core.tests ---
17:25:21 [2020-07-09T21:25:21.337Z] [INFO] Using 'UTF-8' encoding to copy filtered resources.
17:25:21 [2020-07-09T21:25:21.337Z] [INFO] skip non existing resourceDirectory /home/jenkins/agent/workspace/tracecompass-gerrit-short-ui-only/analysis/org.eclipse.tracecompass.analysis.timing.core.tests/src/test/resources
17:25:21 [2020-07-09T21:25:21.337Z] [INFO] 
17:25:21 [2020-07-09T21:25:21.337Z] [INFO] --- tycho-source-plugin:1.3.0:plugin-source (plugin-source) @ org.eclipse.tracecompass.analysis.timing.core.tests ---
17:25:21 [2020-07-09T21:25:21.337Z] [INFO] Building jar: /home/jenkins/agent/workspace/tracecompass-gerrit-short-ui-only/analysis/org.eclipse.tracecompass.analysis.timing.core.tests/target/org.eclipse.tracecompass.analysis.timing.core.tests-1.0.5-SNAPSHOT-sources.jar
17:25:21 [2020-07-09T21:25:21.337Z] [INFO] 
17:25:21 [2020-07-09T21:25:21.337Z] [INFO] --- target-platform-configuration:1.3.0:target-platform (default-target-platform) @ org.eclipse.tracecompass.analysis.timing.core.tests ---
17:25:21 [2020-07-09T21:25:21.337Z] [INFO] 
17:25:21 [2020-07-09T21:25:21.337Z] [INFO] --- tycho-packaging-plugin:1.3.0:package-plugin (default-package-plugin) @ org.eclipse.tracecompass.analysis.timing.core.tests ---
17:25:21 [2020-07-09T21:25:21.337Z] [INFO] Building jar: /home/jenkins/agent/workspace/tracecompass-gerrit-short-ui-only/analysis/org.eclipse.tracecompass.analysis.timing.core.tests/target/org.eclipse.tracecompass.analysis.timing.core.tests-1.0.5-SNAPSHOT.jar
17:25:21 [2020-07-09T21:25:21.592Z] [INFO] 
17:25:21 [2020-07-09T21:25:21.592Z] [INFO] --- tycho-p2-plugin:1.3.0:p2-metadata-default (default-p2-metadata-default) @ org.eclipse.tracecompass.analysis.timing.core.tests ---
17:25:21 [2020-07-09T21:25:21.592Z] [INFO] 
17:25:21 [2020-07-09T21:25:21.592Z] [INFO] --- tycho-source-feature-plugin:1.3.0:source-feature (source-feature) @ org.eclipse.tracecompass.analysis.timing.core.tests ---
17:25:21 [2020-07-09T21:25:21.592Z] [INFO] 
17:25:21 [2020-07-09T21:25:21.592Z] [INFO] --- tycho-pack200b-plugin:1.3.0:pack (pack200-pack) @ org.eclipse.tracecompass.analysis.timing.core.tests ---
17:25:21 [2020-07-09T21:25:21.592Z] [INFO] Pack200 packing jar /home/jenkins/agent/workspace/tracecompass-gerrit-short-ui-only/analysis/org.eclipse.tracecompass.analysis.timing.core.tests/target/org.eclipse.tracecompass.analysis.timing.core.tests-1.0.5-SNAPSHOT.jar
17:25:21 [2020-07-09T21:25:21.592Z] [INFO] 
17:25:21 [2020-07-09T21:25:21.592Z] [INFO] --- tycho-p2-plugin:1.3.0:p2-metadata (p2-metadata) @ org.eclipse.tracecompass.analysis.timing.core.tests ---
17:25:21 [2020-07-09T21:25:21.592Z] [INFO] 
17:25:21 [2020-07-09T21:25:21.592Z] [INFO] --- tycho-surefire-plugin:1.3.0:test (default-test) @ org.eclipse.tracecompass.analysis.timing.core.tests ---
17:25:21 [2020-07-09T21:25:21.592Z] [INFO] Skipping tests
17:25:21 [2020-07-09T21:25:21.592Z] [INFO] 
17:25:21 [2020-07-09T21:25:21.592Z] [INFO] --- maven-install-plugin:2.5.2:install (default-install) @ org.eclipse.tracecompass.analysis.timing.core.tests ---
17:25:21 [2020-07-09T21:25:21.592Z] [INFO] Installing /home/jenkins/agent/workspace/tracecompass-gerrit-short-ui-only/analysis/org.eclipse.tracecompass.analysis.timing.core.tests/target/org.eclipse.tracecompass.analysis.timing.core.tests-1.0.5-SNAPSHOT.jar to /home/jenkins/.m2/repository/org/eclipse/tracecompass/org.eclipse.tracecompass.analysis.timing.core.tests/1.0.5-SNAPSHOT/org.eclipse.tracecompass.analysis.timing.core.tests-1.0.5-SNAPSHOT.jar
17:25:21 [2020-07-09T21:25:21.592Z] [INFO] Installing /home/jenkins/agent/workspace/tracecompass-gerrit-short-ui-only/analysis/org.eclipse.tracecompass.analysis.timing.core.tests/pom.xml to /home/jenkins/.m2/repository/org/eclipse/tracecompass/org.eclipse.tracecompass.analysis.timing.core.tests/1.0.5-SNAPSHOT/org.eclipse.tracecompass.analysis.timing.core.tests-1.0.5-SNAPSHOT.pom
17:25:21 [2020-07-09T21:25:21.592Z] [INFO] Installing /home/jenkins/agent/workspace/tracecompass-gerrit-short-ui-only/analysis/org.eclipse.tracecompass.analysis.timing.core.tests/target/org.eclipse.tracecompass.analysis.timing.core.tests-1.0.5-SNAPSHOT-sources.jar to /home/jenkins/.m2/repository/org/eclipse/tracecompass/org.eclipse.tracecompass.analysis.timing.core.tests/1.0.5-SNAPSHOT/org.eclipse.tracecompass.analysis.timing.core.tests-1.0.5-SNAPSHOT-sources.jar
17:25:21 [2020-07-09T21:25:21.592Z] [INFO] Installing /home/jenkins/agent/workspace/tracecompass-gerrit-short-ui-only/analysis/org.eclipse.tracecompass.analysis.timing.core.tests/target/org.eclipse.tracecompass.analysis.timing.core.tests-1.0.5-SNAPSHOT.jar.pack.gz to /home/jenkins/.m2/repository/org/eclipse/tracecompass/org.eclipse.tracecompass.analysis.timing.core.tests/1.0.5-SNAPSHOT/org.eclipse.tracecompass.analysis.timing.core.tests-1.0.5-SNAPSHOT-pack200.jar.pack.gz
17:25:21 [2020-07-09T21:25:21.593Z] [INFO] Installing /home/jenkins/agent/workspace/tracecompass-gerrit-short-ui-only/analysis/org.eclipse.tracecompass.analysis.timing.core.tests/target/p2content.xml to /home/jenkins/.m2/repository/org/eclipse/tracecompass/org.eclipse.tracecompass.analysis.timing.core.tests/1.0.5-SNAPSHOT/org.eclipse.tracecompass.analysis.timing.core.tests-1.0.5-SNAPSHOT-p2metadata.xml
17:25:21 [2020-07-09T21:25:21.593Z] [INFO] Installing /home/jenkins/agent/workspace/tracecompass-gerrit-short-ui-only/analysis/org.eclipse.tracecompass.analysis.timing.core.tests/target/p2artifacts.xml to /home/jenkins/.m2/repository/org/eclipse/tracecompass/org.eclipse.tracecompass.analysis.timing.core.tests/1.0.5-SNAPSHOT/org.eclipse.tracecompass.analysis.timing.core.tests-1.0.5-SNAPSHOT-p2artifacts.xml
17:25:21 [2020-07-09T21:25:21.593Z] [INFO] 
17:25:21 [2020-07-09T21:25:21.593Z] [INFO] --- tycho-p2-plugin:1.3.0:update-local-index (default-update-local-index) @ org.eclipse.tracecompass.analysis.timing.core.tests ---
17:25:21 [2020-07-09T21:25:21.593Z] [INFO] 
17:25:21 [2020-07-09T21:25:21.593Z] [INFO] --< org.eclipse.tracecompass:org.eclipse.tracecompass.analysis.timing.ui.swtbot.tests >--
17:25:21 [2020-07-09T21:25:21.593Z] [INFO] Building org.eclipse.tracecompass.analysis.timing.ui.swtbot.tests 1.0.9-SNAPSHOT [49/138]
17:25:21 [2020-07-09T21:25:21.593Z] [INFO] ------------------------[ eclipse-test-plugin ]-------------------------
17:25:21 [2020-07-09T21:25:21.593Z] [INFO] 
17:25:21 [2020-07-09T21:25:21.593Z] [INFO] --- maven-clean-plugin:3.0.0:clean (default-clean) @ org.eclipse.tracecompass.analysis.timing.ui.swtbot.tests ---
17:25:21 [2020-07-09T21:25:21.593Z] [INFO] 
17:25:21 [2020-07-09T21:25:21.593Z] [INFO] --- tycho-packaging-plugin:1.3.0:build-qualifier (default-build-qualifier) @ org.eclipse.tracecompass.analysis.timing.ui.swtbot.tests ---
17:25:21 [2020-07-09T21:25:21.593Z] [INFO] The project's OSGi version is 1.0.9.202007092109
17:25:21 [2020-07-09T21:25:21.593Z] [INFO] 
17:25:21 [2020-07-09T21:25:21.593Z] [INFO] --- tycho-packaging-plugin:1.3.0:validate-id (default-validate-id) @ org.eclipse.tracecompass.analysis.timing.ui.swtbot.tests ---
17:25:21 [2020-07-09T21:25:21.593Z] [INFO] 
17:25:21 [2020-07-09T21:25:21.593Z] [INFO] --- tycho-packaging-plugin:1.3.0:validate-version (default-validate-version) @ org.eclipse.tracecompass.analysis.timing.ui.swtbot.tests ---
17:25:21 [2020-07-09T21:25:21.593Z] [INFO] 
17:25:21 [2020-07-09T21:25:21.593Z] [INFO] --- maven-enforcer-plugin:1.4.1:enforce (enforce-maven-version) @ org.eclipse.tracecompass.analysis.timing.ui.swtbot.tests ---
17:25:21 [2020-07-09T21:25:21.593Z] [INFO] 
17:25:21 [2020-07-09T21:25:21.593Z] [INFO] --- maven-resources-plugin:3.0.2:resources (default-resources) @ org.eclipse.tracecompass.analysis.timing.ui.swtbot.tests ---
17:25:21 [2020-07-09T21:25:21.593Z] [INFO] Using 'UTF-8' encoding to copy filtered resources.
17:25:21 [2020-07-09T21:25:21.593Z] [INFO] skip non existing resourceDirectory /home/jenkins/agent/workspace/tracecompass-gerrit-short-ui-only/analysis/org.eclipse.tracecompass.analysis.timing.ui.swtbot.tests/src/main/resources
17:25:21 [2020-07-09T21:25:21.593Z] [INFO] 
17:25:21 [2020-07-09T21:25:21.593Z] [INFO] --- tycho-compiler-plugin:1.3.0:compile (default-compile) @ org.eclipse.tracecompass.analysis.timing.ui.swtbot.tests ---
17:25:21 [2020-07-09T21:25:21.593Z] [INFO] Compiling 1 source file to /home/jenkins/agent/workspace/tracecompass-gerrit-short-ui-only/analysis/org.eclipse.tracecompass.analysis.timing.ui.swtbot.tests/target/classes
17:25:21 [2020-07-09T21:25:21.848Z] [INFO] 
17:25:21 [2020-07-09T21:25:21.848Z] [INFO] --- maven-resources-plugin:3.0.2:testResources (default-testResources) @ org.eclipse.tracecompass.analysis.timing.ui.swtbot.tests ---
17:25:21 [2020-07-09T21:25:21.848Z] [INFO] Using 'UTF-8' encoding to copy filtered resources.
17:25:21 [2020-07-09T21:25:21.848Z] [INFO] skip non existing resourceDirectory /home/jenkins/agent/workspace/tracecompass-gerrit-short-ui-only/analysis/org.eclipse.tracecompass.analysis.timing.ui.swtbot.tests/src/test/resources
17:25:21 [2020-07-09T21:25:21.848Z] [INFO] 
17:25:21 [2020-07-09T21:25:21.848Z] [INFO] --- tycho-source-plugin:1.3.0:plugin-source (plugin-source) @ org.eclipse.tracecompass.analysis.timing.ui.swtbot.tests ---
17:25:21 [2020-07-09T21:25:21.848Z] [INFO] Building jar: /home/jenkins/agent/workspace/tracecompass-gerrit-short-ui-only/analysis/org.eclipse.tracecompass.analysis.timing.ui.swtbot.tests/target/org.eclipse.tracecompass.analysis.timing.ui.swtbot.tests-1.0.9-SNAPSHOT-sources.jar
17:25:21 [2020-07-09T21:25:21.848Z] [INFO] 
17:25:21 [2020-07-09T21:25:21.848Z] [INFO] --- target-platform-configuration:1.3.0:target-platform (default-target-platform) @ org.eclipse.tracecompass.analysis.timing.ui.swtbot.tests ---
17:25:21 [2020-07-09T21:25:21.848Z] [INFO] 
17:25:21 [2020-07-09T21:25:21.848Z] [INFO] --- tycho-packaging-plugin:1.3.0:package-plugin (default-package-plugin) @ org.eclipse.tracecompass.analysis.timing.ui.swtbot.tests ---
17:25:21 [2020-07-09T21:25:21.848Z] [INFO] Building jar: /home/jenkins/agent/workspace/tracecompass-gerrit-short-ui-only/analysis/org.eclipse.tracecompass.analysis.timing.ui.swtbot.tests/target/org.eclipse.tracecompass.analysis.timing.ui.swtbot.tests-1.0.9-SNAPSHOT.jar
17:25:21 [2020-07-09T21:25:21.848Z] [INFO] 
17:25:21 [2020-07-09T21:25:21.848Z] [INFO] --- tycho-p2-plugin:1.3.0:p2-metadata-default (default-p2-metadata-default) @ org.eclipse.tracecompass.analysis.timing.ui.swtbot.tests ---
17:25:21 [2020-07-09T21:25:21.848Z] [INFO] 
17:25:21 [2020-07-09T21:25:21.848Z] [INFO] --- tycho-source-feature-plugin:1.3.0:source-feature (source-feature) @ org.eclipse.tracecompass.analysis.timing.ui.swtbot.tests ---
17:25:21 [2020-07-09T21:25:21.848Z] [INFO] 
17:25:21 [2020-07-09T21:25:21.848Z] [INFO] --- tycho-pack200b-plugin:1.3.0:pack (pack200-pack) @ org.eclipse.tracecompass.analysis.timing.ui.swtbot.tests ---
17:25:21 [2020-07-09T21:25:21.848Z] [INFO] Pack200 packing jar /home/jenkins/agent/workspace/tracecompass-gerrit-short-ui-only/analysis/org.eclipse.tracecompass.analysis.timing.ui.swtbot.tests/target/org.eclipse.tracecompass.analysis.timing.ui.swtbot.tests-1.0.9-SNAPSHOT.jar
17:25:21 [2020-07-09T21:25:21.848Z] [INFO] 
17:25:21 [2020-07-09T21:25:21.848Z] [INFO] --- tycho-p2-plugin:1.3.0:p2-metadata (p2-metadata) @ org.eclipse.tracecompass.analysis.timing.ui.swtbot.tests ---
17:25:21 [2020-07-09T21:25:21.848Z] [INFO] 
17:25:21 [2020-07-09T21:25:21.848Z] [INFO] --- tycho-surefire-plugin:1.3.0:test (default-test) @ org.eclipse.tracecompass.analysis.timing.ui.swtbot.tests ---
17:25:22 [2020-07-09T21:25:22.774Z] [INFO] Expected eclipse log file: /home/jenkins/agent/workspace/tracecompass-gerrit-short-ui-only/analysis/org.eclipse.tracecompass.analysis.timing.ui.swtbot.tests/target/work/data/.metadata/.log
17:25:22 [2020-07-09T21:25:22.774Z] [INFO] Command line:
17:25:22 [2020-07-09T21:25:22.774Z] 	[/opt/tools/java/oracle/jdk-8/1.8.0_202/jre/bin/java, -Dosgi.noShutdown=false, -Dosgi.os=linux, -Dosgi.ws=gtk, -Dosgi.arch=x86_64, -Dorg.eclipse.swt.browser.DefaultType=mozilla, -Xms512m, -Xmx1024m, -Dosgi.clean=true, -jar, /home/jenkins/.m2/repository/p2/osgi/bundle/org.eclipse.equinox.launcher/1.5.700.v20200207-2156/org.eclipse.equinox.launcher-1.5.700.v20200207-2156.jar, -data, /home/jenkins/agent/workspace/tracecompass-gerrit-short-ui-only/analysis/org.eclipse.tracecompass.analysis.timing.ui.swtbot.tests/target/work/data, -install, /home/jenkins/agent/workspace/tracecompass-gerrit-short-ui-only/analysis/org.eclipse.tracecompass.analysis.timing.ui.swtbot.tests/target/work, -configuration, /home/jenkins/agent/workspace/tracecompass-gerrit-short-ui-only/analysis/org.eclipse.tracecompass.analysis.timing.ui.swtbot.tests/target/work/configuration, -application, org.eclipse.tycho.surefire.osgibooter.uitest, -testproperties, /home/jenkins/agent/workspace/tracecompass-gerrit-short-ui-only/analysis/org.eclipse.tracecompass.analysis.timing.ui.swtbot.tests/target/surefire.properties, -product, org.eclipse.platform.ide, -nouithread, -consoleLog]
17:25:22 [2020-07-09T21:25:22.774Z] Picked up _JAVA_OPTIONS: -Duser.home=/home/tracecompass
17:25:24 [2020-07-09T21:25:24.139Z] !SESSION 2020-07-09 21:25:22.578 -----------------------------------------------
17:25:24 [2020-07-09T21:25:24.139Z] eclipse.buildId=unknown
17:25:24 [2020-07-09T21:25:24.139Z] java.version=1.8.0_202
17:25:24 [2020-07-09T21:25:24.139Z] java.vendor=Oracle Corporation
17:25:24 [2020-07-09T21:25:24.139Z] BootLoader constants: OS=linux, ARCH=x86_64, WS=gtk, NL=en_US
17:25:24 [2020-07-09T21:25:24.139Z] Framework arguments:  -application org.eclipse.tycho.surefire.osgibooter.uitest -testproperties /home/jenkins/agent/workspace/tracecompass-gerrit-short-ui-only/analysis/org.eclipse.tracecompass.analysis.timing.ui.swtbot.tests/target/surefire.properties -product org.eclipse.platform.ide -nouithread
17:25:24 [2020-07-09T21:25:24.139Z] Command-line arguments:  -data /home/jenkins/agent/workspace/tracecompass-gerrit-short-ui-only/analysis/org.eclipse.tracecompass.analysis.timing.ui.swtbot.tests/target/work/data -application org.eclipse.tycho.surefire.osgibooter.uitest -testproperties /home/jenkins/agent/workspace/tracecompass-gerrit-short-ui-only/analysis/org.eclipse.tracecompass.analysis.timing.ui.swtbot.tests/target/surefire.properties -product org.eclipse.platform.ide -nouithread -consoleLog
17:25:24 [2020-07-09T21:25:24.139Z] 
17:25:24 [2020-07-09T21:25:24.139Z] !ENTRY org.eclipse.compare.win32 4 0 2020-07-09 21:25:23.943
17:25:24 [2020-07-09T21:25:24.139Z] !MESSAGE FrameworkEvent ERROR
17:25:24 [2020-07-09T21:25:24.139Z] !STACK 0
17:25:24 [2020-07-09T21:25:24.139Z] org.osgi.framework.BundleException: Could not resolve module: org.eclipse.compare.win32 [65]
17:25:24 [2020-07-09T21:25:24.139Z]   Unresolved requirement: Require-Capability: eclipse.platform; filter:="(osgi.os=win32)"
17:25:24 [2020-07-09T21:25:24.139Z] 
17:25:24 [2020-07-09T21:25:24.139Z] 	at org.eclipse.osgi.container.Module.start(Module.java:463)
17:25:24 [2020-07-09T21:25:24.139Z] 	at org.eclipse.osgi.container.ModuleContainer$ContainerStartLevel$2.run(ModuleContainer.java:1845)
17:25:24 [2020-07-09T21:25:24.139Z] 	at org.eclipse.osgi.internal.framework.EquinoxContainerAdaptor$1$1.execute(EquinoxContainerAdaptor.java:136)
17:25:24 [2020-07-09T21:25:24.139Z] 	at org.eclipse.osgi.container.ModuleContainer$ContainerStartLevel.incStartLevel(ModuleContainer.java:1838)
17:25:24 [2020-07-09T21:25:24.139Z] 	at org.eclipse.osgi.container.ModuleContainer$ContainerStartLevel.incStartLevel(ModuleContainer.java:1779)
17:25:24 [2020-07-09T21:25:24.139Z] 	at org.eclipse.osgi.container.ModuleContainer$ContainerStartLevel.doContainerStartLevel(ModuleContainer.java:1743)
17:25:24 [2020-07-09T21:25:24.139Z] 	at org.eclipse.osgi.container.ModuleContainer$ContainerStartLevel.dispatchEvent(ModuleContainer.java:1665)
17:25:24 [2020-07-09T21:25:24.139Z] 	at org.eclipse.osgi.container.ModuleContainer$ContainerStartLevel.dispatchEvent(ModuleContainer.java:1)
17:25:24 [2020-07-09T21:25:24.139Z] 	at org.eclipse.osgi.framework.eventmgr.EventManager.dispatchEvent(EventManager.java:234)
17:25:24 [2020-07-09T21:25:24.139Z] 	at org.eclipse.osgi.framework.eventmgr.EventManager$EventThread.run(EventManager.java:345)
17:25:24 [2020-07-09T21:25:24.139Z] 
17:25:24 [2020-07-09T21:25:24.139Z] !ENTRY org.eclipse.ecf.provider.filetransfer.httpclient45.win32 4 0 2020-07-09 21:25:24.021
17:25:24 [2020-07-09T21:25:24.139Z] !MESSAGE FrameworkEvent ERROR
17:25:24 [2020-07-09T21:25:24.139Z] !STACK 0
17:25:24 [2020-07-09T21:25:24.139Z] org.osgi.framework.BundleException: Could not resolve module: org.eclipse.ecf.provider.filetransfer.httpclient45.win32 [137]
17:25:24 [2020-07-09T21:25:24.139Z]   Unresolved requirement: Require-Capability: eclipse.platform; filter:="(osgi.os=win32)"
17:25:24 [2020-07-09T21:25:24.139Z]   Unresolved requirement: Import-Package: org.apache.http.impl.auth.win; version="[4.5.0,5.0.0)"
17:25:24 [2020-07-09T21:25:24.139Z]     -> Export-Package: org.apache.http.impl.auth.win; bundle-symbolic-name="org.apache.httpcomponents.httpclient.win"; bundle-version="4.5.10.v20200113-2105"; version="4.5.10"; x-internal:="true"; uses:="org.apache.http,org.apache.http.auth,org.apache.http.client,org.apache.http.impl.auth,org.apache.http.protocol,org.apache.http.util"
17:25:24 [2020-07-09T21:25:24.139Z]        org.apache.httpcomponents.httpclient.win [36]
17:25:24 [2020-07-09T21:25:24.139Z]          Unresolved requirement: Require-Capability: eclipse.platform; filter:="(osgi.os=win32)"
17:25:24 [2020-07-09T21:25:24.139Z] 
17:25:24 [2020-07-09T21:25:24.139Z] 	at org.eclipse.osgi.container.Module.start(Module.java:463)
17:25:24 [2020-07-09T21:25:24.139Z] 	at org.eclipse.osgi.container.ModuleContainer$ContainerStartLevel$2.run(ModuleContainer.java:1845)
17:25:24 [2020-07-09T21:25:24.139Z] 	at org.eclipse.osgi.internal.framework.EquinoxContainerAdaptor$1$1.execute(EquinoxContainerAdaptor.java:136)
17:25:24 [2020-07-09T21:25:24.139Z] 	at org.eclipse.osgi.container.ModuleContainer$ContainerStartLevel.incStartLevel(ModuleContainer.java:1838)
17:25:24 [2020-07-09T21:25:24.139Z] 	at org.eclipse.osgi.container.ModuleContainer$ContainerStartLevel.incStartLevel(ModuleContainer.java:1779)
17:25:24 [2020-07-09T21:25:24.139Z] 	at org.eclipse.osgi.container.ModuleContainer$ContainerStartLevel.doContainerStartLevel(ModuleContainer.java:1743)
17:25:24 [2020-07-09T21:25:24.139Z] 	at org.eclipse.osgi.container.ModuleContainer$ContainerStartLevel.dispatchEvent(ModuleContainer.java:1665)
17:25:24 [2020-07-09T21:25:24.139Z] 	at org.eclipse.osgi.container.ModuleContainer$ContainerStartLevel.dispatchEvent(ModuleContainer.java:1)
17:25:24 [2020-07-09T21:25:24.139Z] 	at org.eclipse.osgi.framework.eventmgr.EventManager.dispatchEvent(EventManager.java:234)
17:25:24 [2020-07-09T21:25:24.139Z] 	at org.eclipse.osgi.framework.eventmgr.EventManager$EventThread.run(EventManager.java:345)
17:25:25 [2020-07-09T21:25:25.066Z] SWT SessionManagerDBus: Failed to connect to org.gnome.SessionManager: Failed to execute child process “dbus-launch” (No such file or directory)
17:25:25 [2020-07-09T21:25:25.066Z] SWT SessionManagerDBus: Failed to connect to org.xfce.SessionManager: Failed to execute child process “dbus-launch” (No such file or directory)
17:25:29 [2020-07-09T21:25:29.412Z] 
17:25:29 [2020-07-09T21:25:29.412Z] !ENTRY org.eclipse.urischeme 4 0 2020-07-09 21:25:28.817
17:25:29 [2020-07-09T21:25:29.412Z] !MESSAGE Cannot run program "xdg-mime": error=2, No such file or directory
17:25:29 [2020-07-09T21:25:29.412Z] !STACK 0
17:25:29 [2020-07-09T21:25:29.412Z] java.io.IOException: Cannot run program "xdg-mime": error=2, No such file or directory
17:25:29 [2020-07-09T21:25:29.412Z] 	at java.lang.ProcessBuilder.start(ProcessBuilder.java:1048)
17:25:29 [2020-07-09T21:25:29.412Z] 	at org.eclipse.urischeme.internal.registration.ProcessExecutor.execute(ProcessExecutor.java:36)
17:25:29 [2020-07-09T21:25:29.412Z] 	at org.eclipse.urischeme.internal.registration.RegistrationLinux.getRegisteredDesktopFileForScheme(RegistrationLinux.java:136)
17:25:29 [2020-07-09T21:25:29.412Z] 	at org.eclipse.urischeme.internal.registration.RegistrationLinux.determineHandlerLocation(RegistrationLinux.java:80)
17:25:29 [2020-07-09T21:25:29.412Z] 	at org.eclipse.urischeme.internal.registration.RegistrationLinux.getSchemesInformation(RegistrationLinux.java:69)
17:25:29 [2020-07-09T21:25:29.412Z] 	at org.eclipse.urischeme.AutoRegisterSchemeHandlersJob.run(AutoRegisterSchemeHandlersJob.java:63)
17:25:29 [2020-07-09T21:25:29.412Z] 	at org.eclipse.core.internal.jobs.Worker.run(Worker.java:63)
17:25:29 [2020-07-09T21:25:29.412Z] Caused by: java.io.IOException: error=2, No such file or directory
17:25:29 [2020-07-09T21:25:29.413Z] 	at java.lang.UNIXProcess.forkAndExec(Native Method)
17:25:29 [2020-07-09T21:25:29.413Z] 	at java.lang.UNIXProcess.<init>(UNIXProcess.java:247)
17:25:29 [2020-07-09T21:25:29.413Z] 	at java.lang.ProcessImpl.start(ProcessImpl.java:134)
17:25:29 [2020-07-09T21:25:29.413Z] 	at java.lang.ProcessBuilder.start(ProcessBuilder.java:1029)
17:25:29 [2020-07-09T21:25:29.413Z] 	... 6 more
17:25:29 [2020-07-09T21:25:29.413Z] 
17:25:29 [2020-07-09T21:25:29.413Z] (WebKitWebProcess:4759): GLib-WARNING **: 21:25:28.935: getpwuid_r(): failed due to unknown user id (1000520000)
17:25:29 [2020-07-09T21:25:29.413Z] Running org.eclipse.tracecompass.analysis.timing.ui.swtbot.tests.table.SegmentTableTest
17:25:29 [2020-07-09T21:25:29.413Z] Display size: 1440x900
17:25:29 [2020-07-09T21:25:29.413Z] OS version=3.10.0-1062.el7.x86_64
17:25:29 [2020-07-09T21:25:29.413Z] GTK version=3.22.30
17:25:29 [2020-07-09T21:25:29.413Z] GTK theme=Ambiance
17:25:29 [2020-07-09T21:25:29.413Z] LIBOVERLAY_SCROLLBAR=0
17:25:29 [2020-07-09T21:25:29.413Z] Time zone: Greenwich Mean Time
17:25:29 [2020-07-09T21:25:29.413Z] log4j:WARN No appenders could be found for logger (org.eclipse.swtbot.swt.finder.widgets.SWTBotShell).
17:25:29 [2020-07-09T21:25:29.413Z] log4j:WARN Please initialize the log4j system properly.
17:25:30 [2020-07-09T21:25:30.384Z] DEBUG - Sent event Selection [13]: SelectionEvent{TableColumn {Duration} time=897063337 data=null item=null detail=0 x=0 y=0 width=0 height=0 stateMask=0x0 text=null doit=true} to TableColumn with text {Duration}
17:25:30 [2020-07-09T21:25:30.384Z] DEBUG - Sent event MouseUp [4]: MouseEvent{TableColumn {Duration} time=897063340 data=null button=1 stateMask=0x80000 x=525 y=-13 count=1} to TableColumn with text {Duration}
17:25:30 [2020-07-09T21:25:30.384Z] DEBUG - Sent event Selection [13]: SelectionEvent{TableColumn {Duration} time=897063341 data=null item=null detail=0 x=0 y=0 width=0 height=0 stateMask=0x0 text=null doit=true} to TableColumn with text {Duration}
17:25:30 [2020-07-09T21:25:30.384Z] DEBUG - Sent event MouseUp [4]: MouseEvent{TableColumn {Duration} time=897063343 data=null button=1 stateMask=0x80000 x=525 y=-13 count=1} to TableColumn with text {Duration}
17:25:30 [2020-07-09T21:25:30.384Z] DEBUG - matched ViewReference with text "", using matcher: with id '"org.eclipse.tracecompass.analysis.timing.ui.swtbot.tests.table.TestSegmentStoreTableView"'
17:25:30 [2020-07-09T21:25:30.384Z] DEBUG - Sent event Selection [13]: SelectionEvent{TableColumn {Duration} time=897063510 data=null item=null detail=0 x=0 y=0 width=0 height=0 stateMask=0x0 text=null doit=true} to TableColumn with text {Duration}
17:25:30 [2020-07-09T21:25:30.384Z] DEBUG - Sent event MouseUp [4]: MouseEvent{TableColumn {Duration} time=897063511 data=null button=1 stateMask=0x80000 x=333 y=-13 count=1} to TableColumn with text {Duration}
17:25:30 [2020-07-09T21:25:30.384Z] DEBUG - Sent event Selection [13]: SelectionEvent{TableColumn {Duration} time=897063511 data=null item=null detail=0 x=0 y=0 width=0 height=0 stateMask=0x0 text=null doit=true} to TableColumn with text {Duration}
17:25:30 [2020-07-09T21:25:30.384Z] DEBUG - Sent event MouseUp [4]: MouseEvent{TableColumn {Duration} time=897063512 data=null button=1 stateMask=0x80000 x=333 y=-13 count=1} to TableColumn with text {Duration}
17:25:30 [2020-07-09T21:25:30.384Z] DEBUG - matched ViewReference with text "", using matcher: with id '"org.eclipse.tracecompass.analysis.timing.ui.swtbot.tests.table.TestSegmentStoreTableView"'
17:25:30 [2020-07-09T21:25:30.641Z] DEBUG - matched ViewReference with text "", using matcher: with id '"org.eclipse.tracecompass.analysis.timing.ui.swtbot.tests.table.TestSegmentStoreTableView"'
17:25:30 [2020-07-09T21:25:30.641Z] DEBUG - matched MenuItem with text "Export to TSV...", using matcher: with mnemonic 'Export to TSV...'
17:25:30 [2020-07-09T21:25:30.641Z] DEBUG - Clicking on with mnemonic 'Export to TSV...'
17:25:30 [2020-07-09T21:25:30.641Z] DEBUG - Sent event Selection [13]: SelectionEvent{MenuItem {Export to TSV...} time=897063702 data=null item=null detail=0 x=0 y=0 width=0 height=0 stateMask=0x0 text=null doit=true} to with mnemonic 'Export to TSV...'
17:25:30 [2020-07-09T21:25:30.641Z] DEBUG - Clicked on with mnemonic 'Export to TSV...'
17:25:30 [2020-07-09T21:25:30.641Z] DEBUG - matched ViewReference with text "", using matcher: with id '"org.eclipse.tracecompass.analysis.timing.ui.swtbot.tests.table.TestSegmentStoreTableView"'
17:25:35 [2020-07-09T21:25:35.884Z] DEBUG - Sent event Selection [13]: SelectionEvent{TableColumn {Duration} time=897068079 data=null item=null detail=0 x=0 y=0 width=0 height=0 stateMask=0x0 text=null doit=true} to TableColumn with text {Duration}
17:25:35 [2020-07-09T21:25:35.884Z] DEBUG - Sent event MouseUp [4]: MouseEvent{TableColumn {Duration} time=897068471 data=null button=1 stateMask=0x80000 x=525 y=-13 count=1} to TableColumn with text {Duration}
17:25:35 [2020-07-09T21:25:35.884Z] DEBUG - Sent event Selection [13]: SelectionEvent{TableColumn {Duration} time=897068472 data=null item=null detail=0 x=0 y=0 width=0 height=0 stateMask=0x0 text=null doit=true} to TableColumn with text {Duration}
17:25:35 [2020-07-09T21:25:35.884Z] DEBUG - Sent event MouseUp [4]: MouseEvent{TableColumn {Duration} time=897068764 data=null button=1 stateMask=0x80000 x=525 y=-13 count=1} to TableColumn with text {Duration}
17:25:35 [2020-07-09T21:25:35.884Z] DEBUG - matched ViewReference with text "", using matcher: with id '"org.eclipse.tracecompass.analysis.timing.ui.swtbot.tests.table.TestSegmentStoreTableView"'
17:25:36 [2020-07-09T21:25:36.812Z] DEBUG - Sent event Selection [13]: SelectionEvent{TableColumn {Duration} time=897069735 data=null item=null detail=0 x=0 y=0 width=0 height=0 stateMask=0x0 text=null doit=true} to TableColumn with text {Duration}
17:25:36 [2020-07-09T21:25:36.812Z] DEBUG - Sent event MouseUp [4]: MouseEvent{TableColumn {Duration} time=897069736 data=null button=1 stateMask=0x80000 x=333 y=-13 count=1} to TableColumn with text {Duration}
17:25:36 [2020-07-09T21:25:36.812Z] DEBUG - Sent event Selection [13]: SelectionEvent{TableColumn {Duration} time=897069737 data=null item=null detail=0 x=0 y=0 width=0 height=0 stateMask=0x0 text=null doit=true} to TableColumn with text {Duration}
17:25:36 [2020-07-09T21:25:36.812Z] DEBUG - Sent event MouseUp [4]: MouseEvent{TableColumn {Duration} time=897069738 data=null button=1 stateMask=0x80000 x=333 y=-13 count=1} to TableColumn with text {Duration}
17:25:36 [2020-07-09T21:25:36.812Z] DEBUG - matched ViewReference with text "", using matcher: with id '"org.eclipse.tracecompass.analysis.timing.ui.swtbot.tests.table.TestSegmentStoreTableView"'
17:25:36 [2020-07-09T21:25:36.940Z] Aborted by new patch set.
17:25:36 [2020-07-09T21:25:36.942Z] Sending interrupt signal to process
17:25:36 [2020-07-09T21:25:36.942Z] Aborted by new patch set.
17:25:36 [2020-07-09T21:25:36.943Z] Killing processes
17:25:36 [2020-07-09T21:25:36.944Z] Aborted by new patch set.
17:25:39 [2020-07-09T21:25:39.112Z] kill finished with exit code 127
17:25:39 [2020-07-09T21:25:39.114Z] Sending interrupt signal to process
17:25:39 [2020-07-09T21:25:39.114Z] Killing processes
17:25:40 [2020-07-09T21:25:40.976Z] DEBUG - Sent event Selection [13]: SelectionEvent{TableColumn {Duration} time=897073398 data=null item=null detail=0 x=0 y=0 width=0 height=0 stateMask=0x0 text=null doit=true} to TableColumn with text {Duration}
17:25:40 [2020-07-09T21:25:40.976Z] DEBUG - Sent event MouseUp [4]: MouseEvent{TableColumn {Duration} time=897073411 data=null button=1 stateMask=0x80000 x=525 y=-13 count=1} to TableColumn with text {Duration}
17:25:40 [2020-07-09T21:25:40.976Z] DEBUG - Sent event Selection [13]: SelectionEvent{TableColumn {Duration} time=897073412 data=null item=null detail=0 x=0 y=0 width=0 height=0 stateMask=0x0 text=null doit=true} to TableColumn with text {Duration}
17:25:40 [2020-07-09T21:25:40.976Z] DEBUG - Sent event MouseUp [4]: MouseEvent{TableColumn {Duration} time=897073421 data=null button=1 stateMask=0x80000 x=525 y=-13 count=1} to TableColumn with text {Duration}
17:25:40 [2020-07-09T21:25:40.976Z] DEBUG - matched ViewReference with text "", using matcher: with id '"org.eclipse.tracecompass.analysis.timing.ui.swtbot.tests.table.TestSegmentStoreTableView"'
17:25:41 [2020-07-09T21:25:41.256Z] kill finished with exit code 127
17:25:41 [2020-07-09T21:25:41.257Z] Sending interrupt signal to process
17:25:41 [2020-07-09T21:25:41.257Z] Killing processes
17:25:43 [2020-07-09T21:25:43.514Z] kill finished with exit code 127
17:25:46 [2020-07-09T21:25:46.219Z] DEBUG - Sent event Selection [13]: SelectionEvent{TableColumn {Duration} time=897078593 data=null item=null detail=0 x=0 y=0 width=0 height=0 stateMask=0x0 text=null doit=true} to TableColumn with text {Duration}
17:25:46 [2020-07-09T21:25:46.220Z] DEBUG - Sent event MouseUp [4]: MouseEvent{TableColumn {Duration} time=897078604 data=null button=1 stateMask=0x80000 x=525 y=-13 count=1} to TableColumn with text {Duration}
17:25:46 [2020-07-09T21:25:46.220Z] DEBUG - Sent event Selection [13]: SelectionEvent{TableColumn {Duration} time=897078605 data=null item=null detail=0 x=0 y=0 width=0 height=0 stateMask=0x0 text=null doit=true} to TableColumn with text {Duration}
17:25:46 [2020-07-09T21:25:46.220Z] DEBUG - Sent event MouseUp [4]: MouseEvent{TableColumn {Duration} time=897078607 data=null button=1 stateMask=0x80000 x=525 y=-13 count=1} to TableColumn with text {Duration}
17:25:46 [2020-07-09T21:25:46.220Z] DEBUG - matched ViewReference with text "", using matcher: with id '"org.eclipse.tracecompass.analysis.timing.ui.swtbot.tests.table.TestSegmentStoreTableView"'
17:25:51 [2020-07-09T21:25:51.960Z] Click here to forcibly terminate running steps
17:25:51 [2020-07-09T21:25:51.961Z] Click here to forcibly terminate running steps
17:25:51 [2020-07-09T21:25:51.961Z] Click here to forcibly terminate running steps
17:25:52 [2020-07-09T21:25:52.750Z] DEBUG - Sent event Selection [13]: SelectionEvent{TableColumn {Duration} time=897084580 data=null item=null detail=0 x=0 y=0 width=0 height=0 stateMask=0x0 text=null doit=true} to TableColumn with text {Duration}
17:25:52 [2020-07-09T21:25:52.751Z] DEBUG - Sent event MouseUp [4]: MouseEvent{TableColumn {Duration} time=897084912 data=null button=1 stateMask=0x80000 x=525 y=-13 count=1} to TableColumn with text {Duration}
17:25:52 [2020-07-09T21:25:52.751Z] DEBUG - Sent event Selection [13]: SelectionEvent{TableColumn {Duration} time=897084913 data=null item=null detail=0 x=0 y=0 width=0 height=0 stateMask=0x0 text=null doit=true} to TableColumn with text {Duration}
17:25:52 [2020-07-09T21:25:52.751Z] DEBUG - Sent event MouseUp [4]: MouseEvent{TableColumn {Duration} time=897085238 data=null button=1 stateMask=0x80000 x=525 y=-13 count=1} to TableColumn with text {Duration}
17:25:52 [2020-07-09T21:25:52.751Z] DEBUG - matched ViewReference with text "", using matcher: with id '"org.eclipse.tracecompass.analysis.timing.ui.swtbot.tests.table.TestSegmentStoreTableView"'
17:25:53 [2020-07-09T21:25:53.312Z] Tests run: 8, Failures: 0, Errors: 0, Skipped: 0, Time elapsed: 24.253 s - in org.eclipse.tracecompass.analysis.timing.ui.swtbot.tests.table.SegmentTableTest
17:25:53 [2020-07-09T21:25:53.312Z] climbTest(org.eclipse.tracecompass.analysis.timing.ui.swtbot.tests.table.SegmentTableTest)  Time elapsed: 0.213 s
17:25:53 [2020-07-09T21:25:53.312Z] smallTest(org.eclipse.tracecompass.analysis.timing.ui.swtbot.tests.table.SegmentTableTest)  Time elapsed: 0.118 s
17:25:53 [2020-07-09T21:25:53.312Z] testWriteToTsv(org.eclipse.tracecompass.analysis.timing.ui.swtbot.tests.table.SegmentTableTest)  Time elapsed: 0.189 s
17:25:53 [2020-07-09T21:25:53.312Z] gaussianNoiseTest(org.eclipse.tracecompass.analysis.timing.ui.swtbot.tests.table.SegmentTableTest)  Time elapsed: 5.967 s
17:25:53 [2020-07-09T21:25:53.312Z] decrementingTest(org.eclipse.tracecompass.analysis.timing.ui.swtbot.tests.table.SegmentTableTest)  Time elapsed: 0.114 s
17:25:53 [2020-07-09T21:25:53.312Z] largeTest(org.eclipse.tracecompass.analysis.timing.ui.swtbot.tests.table.SegmentTableTest)  Time elapsed: 4.692 s
17:25:53 [2020-07-09T21:25:53.312Z] onDiskSegStoreTest(org.eclipse.tracecompass.analysis.timing.ui.swtbot.tests.table.SegmentTableTest)  Time elapsed: 5.499 s
17:25:53 [2020-07-09T21:25:53.312Z] noiseTest(org.eclipse.tracecompass.analysis.timing.ui.swtbot.tests.table.SegmentTableTest)  Time elapsed: 6.457 s
17:25:53 [2020-07-09T21:25:53.312Z] 
17:25:53 [2020-07-09T21:25:53.312Z] Results:
17:25:53 [2020-07-09T21:25:53.312Z] 
17:25:53 [2020-07-09T21:25:53.312Z] Tests run: 8, Failures: 0, Errors: 0, Skipped: 0
17:25:53 [2020-07-09T21:25:53.313Z] 
17:25:54 [2020-07-09T21:25:54.677Z] [INFO] All tests passed!
17:25:54 [2020-07-09T21:25:54.677Z] [INFO] 
17:25:54 [2020-07-09T21:25:54.677Z] [INFO] --- maven-install-plugin:2.5.2:install (default-install) @ org.eclipse.tracecompass.analysis.timing.ui.swtbot.tests ---
17:25:54 [2020-07-09T21:25:54.677Z] [INFO] Installing /home/jenkins/agent/workspace/tracecompass-gerrit-short-ui-only/analysis/org.eclipse.tracecompass.analysis.timing.ui.swtbot.tests/target/org.eclipse.tracecompass.analysis.timing.ui.swtbot.tests-1.0.9-SNAPSHOT.jar to /home/jenkins/.m2/repository/org/eclipse/tracecompass/org.eclipse.tracecompass.analysis.timing.ui.swtbot.tests/1.0.9-SNAPSHOT/org.eclipse.tracecompass.analysis.timing.ui.swtbot.tests-1.0.9-SNAPSHOT.jar
17:25:54 [2020-07-09T21:25:54.677Z] [INFO] Installing /home/jenkins/agent/workspace/tracecompass-gerrit-short-ui-only/analysis/org.eclipse.tracecompass.analysis.timing.ui.swtbot.tests/pom.xml to /home/jenkins/.m2/repository/org/eclipse/tracecompass/org.eclipse.tracecompass.analysis.timing.ui.swtbot.tests/1.0.9-SNAPSHOT/org.eclipse.tracecompass.analysis.timing.ui.swtbot.tests-1.0.9-SNAPSHOT.pom
17:25:54 [2020-07-09T21:25:54.678Z] [INFO] Installing /home/jenkins/agent/workspace/tracecompass-gerrit-short-ui-only/analysis/org.eclipse.tracecompass.analysis.timing.ui.swtbot.tests/target/org.eclipse.tracecompass.analysis.timing.ui.swtbot.tests-1.0.9-SNAPSHOT-sources.jar to /home/jenkins/.m2/repository/org/eclipse/tracecompass/org.eclipse.tracecompass.analysis.timing.ui.swtbot.tests/1.0.9-SNAPSHOT/org.eclipse.tracecompass.analysis.timing.ui.swtbot.tests-1.0.9-SNAPSHOT-sources.jar
17:25:54 [2020-07-09T21:25:54.678Z] [INFO] Installing /home/jenkins/agent/workspace/tracecompass-gerrit-short-ui-only/analysis/org.eclipse.tracecompass.analysis.timing.ui.swtbot.tests/target/org.eclipse.tracecompass.analysis.timing.ui.swtbot.tests-1.0.9-SNAPSHOT.jar.pack.gz to /home/jenkins/.m2/repository/org/eclipse/tracecompass/org.eclipse.tracecompass.analysis.timing.ui.swtbot.tests/1.0.9-SNAPSHOT/org.eclipse.tracecompass.analysis.timing.ui.swtbot.tests-1.0.9-SNAPSHOT-pack200.jar.pack.gz
17:25:54 [2020-07-09T21:25:54.678Z] [INFO] Installing /home/jenkins/agent/workspace/tracecompass-gerrit-short-ui-only/analysis/org.eclipse.tracecompass.analysis.timing.ui.swtbot.tests/target/p2content.xml to /home/jenkins/.m2/repository/org/eclipse/tracecompass/org.eclipse.tracecompass.analysis.timing.ui.swtbot.tests/1.0.9-SNAPSHOT/org.eclipse.tracecompass.analysis.timing.ui.swtbot.tests-1.0.9-SNAPSHOT-p2metadata.xml
17:25:54 [2020-07-09T21:25:54.678Z] [INFO] Installing /home/jenkins/agent/workspace/tracecompass-gerrit-short-ui-only/analysis/org.eclipse.tracecompass.analysis.timing.ui.swtbot.tests/target/p2artifacts.xml to /home/jenkins/.m2/repository/org/eclipse/tracecompass/org.eclipse.tracecompass.analysis.timing.ui.swtbot.tests/1.0.9-SNAPSHOT/org.eclipse.tracecompass.analysis.timing.ui.swtbot.tests-1.0.9-SNAPSHOT-p2artifacts.xml
17:25:54 [2020-07-09T21:25:54.678Z] [INFO] 
17:25:54 [2020-07-09T21:25:54.678Z] [INFO] --- tycho-p2-plugin:1.3.0:update-local-index (default-update-local-index) @ org.eclipse.tracecompass.analysis.timing.ui.swtbot.tests ---
17:25:54 [2020-07-09T21:25:54.678Z] [INFO] 
17:25:54 [2020-07-09T21:25:54.678Z] [INFO] --< org.eclipse.tracecompass:org.eclipse.tracecompass.analysis.os.linux.ui.swtbot.tests >--
17:25:54 [2020-07-09T21:25:54.678Z] [INFO] Building org.eclipse.tracecompass.analysis.os.linux.ui.swtbot.tests 1.0.14-SNAPSHOT [50/138]
17:25:54 [2020-07-09T21:25:54.678Z] [INFO] ------------------------[ eclipse-test-plugin ]-------------------------
17:25:54 [2020-07-09T21:25:54.678Z] [INFO] 
17:25:54 [2020-07-09T21:25:54.678Z] [INFO] --- maven-clean-plugin:3.0.0:clean (default-clean) @ org.eclipse.tracecompass.analysis.os.linux.ui.swtbot.tests ---
17:25:54 [2020-07-09T21:25:54.678Z] [INFO] 
17:25:54 [2020-07-09T21:25:54.678Z] [INFO] --- tycho-packaging-plugin:1.3.0:build-qualifier (default-build-qualifier) @ org.eclipse.tracecompass.analysis.os.linux.ui.swtbot.tests ---
17:25:54 [2020-07-09T21:25:54.678Z] [INFO] The project's OSGi version is 1.0.14.202007092109
17:25:54 [2020-07-09T21:25:54.678Z] [INFO] 
17:25:54 [2020-07-09T21:25:54.678Z] [INFO] --- tycho-packaging-plugin:1.3.0:validate-id (default-validate-id) @ org.eclipse.tracecompass.analysis.os.linux.ui.swtbot.tests ---
17:25:54 [2020-07-09T21:25:54.678Z] [INFO] 
17:25:54 [2020-07-09T21:25:54.678Z] [INFO] --- tycho-packaging-plugin:1.3.0:validate-version (default-validate-version) @ org.eclipse.tracecompass.analysis.os.linux.ui.swtbot.tests ---
17:25:54 [2020-07-09T21:25:54.678Z] [INFO] 
17:25:54 [2020-07-09T21:25:54.678Z] [INFO] --- maven-enforcer-plugin:1.4.1:enforce (enforce-maven-version) @ org.eclipse.tracecompass.analysis.os.linux.ui.swtbot.tests ---
17:25:54 [2020-07-09T21:25:54.678Z] [INFO] 
17:25:54 [2020-07-09T21:25:54.678Z] [INFO] --- maven-resources-plugin:3.0.2:resources (default-resources) @ org.eclipse.tracecompass.analysis.os.linux.ui.swtbot.tests ---
17:25:54 [2020-07-09T21:25:54.678Z] [INFO] Using 'UTF-8' encoding to copy filtered resources.
17:25:54 [2020-07-09T21:25:54.678Z] [INFO] skip non existing resourceDirectory /home/jenkins/agent/workspace/tracecompass-gerrit-short-ui-only/analysis/org.eclipse.tracecompass.analysis.os.linux.ui.swtbot.tests/src/main/resources
17:25:54 [2020-07-09T21:25:54.678Z] [INFO] 
17:25:54 [2020-07-09T21:25:54.678Z] [INFO] --- tycho-compiler-plugin:1.3.0:compile (default-compile) @ org.eclipse.tracecompass.analysis.os.linux.ui.swtbot.tests ---
17:25:54 [2020-07-09T21:25:54.678Z] [INFO] Compiling 5 source files to /home/jenkins/agent/workspace/tracecompass-gerrit-short-ui-only/analysis/org.eclipse.tracecompass.analysis.os.linux.ui.swtbot.tests/target/classes
17:25:54 [2020-07-09T21:25:54.934Z] [WARNING] /home/jenkins/agent/workspace/tracecompass-gerrit-short-ui-only/analysis/org.eclipse.tracecompass.analysis.os.linux.ui.swtbot.tests/src/org/eclipse/tracecompass/analysis/os/linux/ui/swtbot/tests/latency/SystemCallLatencyDensityViewTest.java:[148] 
17:25:54 [2020-07-09T21:25:54.934Z] 	fDensityChart = viewBot.bot().widget(WidgetOfType.widgetOfType(Chart.class));
17:25:54 [2020-07-09T21:25:54.934Z] 	                ^^^^^^^^^^^^^^^^^^^^^^^^^^^^^^^^^^^^^^^^^^^^^^^^^^^^^^^^^^^^
17:25:54 [2020-07-09T21:25:54.934Z] Unsafe interpretation of method return type as '@NonNull' based on substitution 'T=@NonNull Chart'. Declaring type 'SWTBotFactory' doesn't seem to be designed with null type annotations in mind
17:25:54 [2020-07-09T21:25:54.934Z] [WARNING] /home/jenkins/agent/workspace/tracecompass-gerrit-short-ui-only/analysis/org.eclipse.tracecompass.analysis.os.linux.ui.swtbot.tests/perf/org/eclipse/tracecompass/analysis/os/linux/ui/swtbot/tests/perf/views/UiResponseTest.java:[25] 
17:25:54 [2020-07-09T21:25:54.934Z] 	import org.eclipse.tracecompass.internal.analysis.os.linux.core.inputoutput.InputOutputAnalysisModule;
17:25:54 [2020-07-09T21:25:54.934Z] 	       ^^^^^^^^^^^^^^^^^^^^^^^^^^^^^^^^^^^^^^^^^^^^^^^^^^^^^^^^^^^^^^^^^^^^^^^^^^^^^^^^^^^^^^^^^^^^^^
17:25:54 [2020-07-09T21:25:54.934Z] Discouraged access: The type 'InputOutputAnalysisModule' is not API (restriction on classpath entry '/home/jenkins/agent/workspace/tracecompass-gerrit-short-ui-only/analysis/org.eclipse.tracecompass.analysis.os.linux.core/target/classes')
17:25:54 [2020-07-09T21:25:54.934Z] [WARNING] /home/jenkins/agent/workspace/tracecompass-gerrit-short-ui-only/analysis/org.eclipse.tracecompass.analysis.os.linux.ui.swtbot.tests/perf/org/eclipse/tracecompass/analysis/os/linux/ui/swtbot/tests/perf/views/UiResponseTest.java:[86] 
17:25:54 [2020-07-09T21:25:54.934Z] 	modules.add(trace.getAnalysisModule(InputOutputAnalysisModule.ID));
17:25:54 [2020-07-09T21:25:54.934Z] 	                                    ^^^^^^^^^^^^^^^^^^^^^^^^^^^^
17:25:54 [2020-07-09T21:25:54.934Z] Discouraged access: The type 'InputOutputAnalysisModule' is not API (restriction on classpath entry '/home/jenkins/agent/workspace/tracecompass-gerrit-short-ui-only/analysis/org.eclipse.tracecompass.analysis.os.linux.core/target/classes')
17:25:54 [2020-07-09T21:25:54.934Z] [WARNING] /home/jenkins/agent/workspace/tracecompass-gerrit-short-ui-only/analysis/org.eclipse.tracecompass.analysis.os.linux.ui.swtbot.tests/perf/org/eclipse/tracecompass/analysis/os/linux/ui/swtbot/tests/perf/views/UiResponseTest.java:[86] 
17:25:54 [2020-07-09T21:25:54.934Z] 	modules.add(trace.getAnalysisModule(InputOutputAnalysisModule.ID));
17:25:54 [2020-07-09T21:25:54.934Z] 	                                                              ^^
17:25:54 [2020-07-09T21:25:54.934Z] Discouraged access: The field 'InputOutputAnalysisModule.ID' is not API (restriction on classpath entry '/home/jenkins/agent/workspace/tracecompass-gerrit-short-ui-only/analysis/org.eclipse.tracecompass.analysis.os.linux.core/target/classes')
17:25:54 [2020-07-09T21:25:54.934Z] 4 problems (4 warnings)
17:25:54 [2020-07-09T21:25:54.934Z] [INFO] 
17:25:54 [2020-07-09T21:25:54.934Z] [INFO] --- maven-resources-plugin:3.0.2:testResources (default-testResources) @ org.eclipse.tracecompass.analysis.os.linux.ui.swtbot.tests ---
17:25:54 [2020-07-09T21:25:54.934Z] [INFO] Using 'UTF-8' encoding to copy filtered resources.
17:25:54 [2020-07-09T21:25:54.934Z] [INFO] skip non existing resourceDirectory /home/jenkins/agent/workspace/tracecompass-gerrit-short-ui-only/analysis/org.eclipse.tracecompass.analysis.os.linux.ui.swtbot.tests/src/test/resources
17:25:54 [2020-07-09T21:25:54.934Z] [INFO] 
17:25:54 [2020-07-09T21:25:54.934Z] [INFO] --- tycho-source-plugin:1.3.0:plugin-source (plugin-source) @ org.eclipse.tracecompass.analysis.os.linux.ui.swtbot.tests ---
17:25:54 [2020-07-09T21:25:54.934Z] [INFO] Building jar: /home/jenkins/agent/workspace/tracecompass-gerrit-short-ui-only/analysis/org.eclipse.tracecompass.analysis.os.linux.ui.swtbot.tests/target/org.eclipse.tracecompass.analysis.os.linux.ui.swtbot.tests-1.0.14-SNAPSHOT-sources.jar
17:25:54 [2020-07-09T21:25:54.934Z] [INFO] 
17:25:54 [2020-07-09T21:25:54.934Z] [INFO] --- target-platform-configuration:1.3.0:target-platform (default-target-platform) @ org.eclipse.tracecompass.analysis.os.linux.ui.swtbot.tests ---
17:25:54 [2020-07-09T21:25:54.934Z] [INFO] 
17:25:54 [2020-07-09T21:25:54.934Z] [INFO] --- tycho-packaging-plugin:1.3.0:package-plugin (default-package-plugin) @ org.eclipse.tracecompass.analysis.os.linux.ui.swtbot.tests ---
17:25:54 [2020-07-09T21:25:54.934Z] [INFO] Building jar: /home/jenkins/agent/workspace/tracecompass-gerrit-short-ui-only/analysis/org.eclipse.tracecompass.analysis.os.linux.ui.swtbot.tests/target/org.eclipse.tracecompass.analysis.os.linux.ui.swtbot.tests-1.0.14-SNAPSHOT.jar
17:25:54 [2020-07-09T21:25:54.934Z] [INFO] 
17:25:54 [2020-07-09T21:25:54.934Z] [INFO] --- tycho-p2-plugin:1.3.0:p2-metadata-default (default-p2-metadata-default) @ org.eclipse.tracecompass.analysis.os.linux.ui.swtbot.tests ---
17:25:54 [2020-07-09T21:25:54.934Z] [INFO] 
17:25:54 [2020-07-09T21:25:54.934Z] [INFO] --- tycho-source-feature-plugin:1.3.0:source-feature (source-feature) @ org.eclipse.tracecompass.analysis.os.linux.ui.swtbot.tests ---
17:25:54 [2020-07-09T21:25:54.934Z] [INFO] 
17:25:54 [2020-07-09T21:25:54.934Z] [INFO] --- tycho-pack200b-plugin:1.3.0:pack (pack200-pack) @ org.eclipse.tracecompass.analysis.os.linux.ui.swtbot.tests ---
17:25:54 [2020-07-09T21:25:54.934Z] [INFO] Pack200 packing jar /home/jenkins/agent/workspace/tracecompass-gerrit-short-ui-only/analysis/org.eclipse.tracecompass.analysis.os.linux.ui.swtbot.tests/target/org.eclipse.tracecompass.analysis.os.linux.ui.swtbot.tests-1.0.14-SNAPSHOT.jar
17:25:54 [2020-07-09T21:25:54.934Z] [INFO] 
17:25:54 [2020-07-09T21:25:54.934Z] [INFO] --- tycho-p2-plugin:1.3.0:p2-metadata (p2-metadata) @ org.eclipse.tracecompass.analysis.os.linux.ui.swtbot.tests ---
17:25:54 [2020-07-09T21:25:54.934Z] [INFO] 
17:25:54 [2020-07-09T21:25:54.934Z] [INFO] --- tycho-surefire-plugin:1.3.0:test (default-test) @ org.eclipse.tracecompass.analysis.os.linux.ui.swtbot.tests ---
17:25:55 [2020-07-09T21:25:55.862Z] [INFO] Expected eclipse log file: /home/jenkins/agent/workspace/tracecompass-gerrit-short-ui-only/analysis/org.eclipse.tracecompass.analysis.os.linux.ui.swtbot.tests/target/work/data/.metadata/.log
17:25:55 [2020-07-09T21:25:55.862Z] [INFO] Command line:
17:25:55 [2020-07-09T21:25:55.862Z] 	[/opt/tools/java/oracle/jdk-8/1.8.0_202/jre/bin/java, -Dosgi.noShutdown=false, -Dosgi.os=linux, -Dosgi.ws=gtk, -Dosgi.arch=x86_64, -Dorg.eclipse.swt.browser.DefaultType=mozilla, -Xms512m, -Xmx1024m, -Dosgi.clean=true, -jar, /home/jenkins/.m2/repository/p2/osgi/bundle/org.eclipse.equinox.launcher/1.5.700.v20200207-2156/org.eclipse.equinox.launcher-1.5.700.v20200207-2156.jar, -data, /home/jenkins/agent/workspace/tracecompass-gerrit-short-ui-only/analysis/org.eclipse.tracecompass.analysis.os.linux.ui.swtbot.tests/target/work/data, -install, /home/jenkins/agent/workspace/tracecompass-gerrit-short-ui-only/analysis/org.eclipse.tracecompass.analysis.os.linux.ui.swtbot.tests/target/work, -configuration, /home/jenkins/agent/workspace/tracecompass-gerrit-short-ui-only/analysis/org.eclipse.tracecompass.analysis.os.linux.ui.swtbot.tests/target/work/configuration, -application, org.eclipse.tycho.surefire.osgibooter.uitest, -testproperties, /home/jenkins/agent/workspace/tracecompass-gerrit-short-ui-only/analysis/org.eclipse.tracecompass.analysis.os.linux.ui.swtbot.tests/target/surefire.properties, -product, org.eclipse.platform.ide, -nouithread, -consoleLog]
17:25:55 [2020-07-09T21:25:55.862Z] Picked up _JAVA_OPTIONS: -Duser.home=/home/tracecompass
17:25:56 [2020-07-09T21:25:56.943Z] After 20s process did not stop
17:25:56 [2020-07-09T21:25:56.944Z] [Pipeline] }
17:25:57 [2020-07-09T21:25:57.113Z] [Pipeline] // container
17:25:57 [2020-07-09T21:25:57.237Z] Post stage
17:25:57 [2020-07-09T21:25:57.239Z] [Pipeline] container
17:25:57 [2020-07-09T21:25:57.240Z] [Pipeline] {
17:25:57 [2020-07-09T21:25:57.318Z] [Pipeline] sh
17:26:00 [2020-07-09T21:26:00.701Z] + echo */*tests/screenshots/*.jpeg,*/*tests/target/work/data/.metadata/.log
17:26:00 [2020-07-09T21:26:00.702Z] */*tests/screenshots/*.jpeg,*/*tests/target/work/data/.metadata/.log
17:26:00 [2020-07-09T21:26:00.708Z] [Pipeline] junit
17:26:00 [2020-07-09T21:26:00.711Z] Recording test results
17:26:06 [2020-07-09T21:26:06.331Z] [Pipeline] archiveArtifacts
17:26:06 [2020-07-09T21:26:06.409Z] Archiving artifacts
17:26:07 [2020-07-09T21:26:07.955Z] [Pipeline] }
17:26:08 [2020-07-09T21:26:08.013Z] [Pipeline] // container
17:26:08 [2020-07-09T21:26:08.066Z] [Pipeline] }
17:26:08 [2020-07-09T21:26:08.157Z] [Pipeline] // withEnv
17:26:08 [2020-07-09T21:26:08.234Z] [Pipeline] }
17:26:08 [2020-07-09T21:26:08.318Z] [Pipeline] // stage
17:26:08 [2020-07-09T21:26:08.378Z] [Pipeline] stage
17:26:08 [2020-07-09T21:26:08.380Z] [Pipeline] { (Deploy Site)
17:26:08 [2020-07-09T21:26:08.431Z] Stage "Deploy Site" skipped due to earlier failure(s)
17:26:08 [2020-07-09T21:26:08.432Z] [Pipeline] }
17:26:08 [2020-07-09T21:26:08.489Z] [Pipeline] // stage
17:26:08 [2020-07-09T21:26:08.544Z] [Pipeline] stage
17:26:08 [2020-07-09T21:26:08.546Z] [Pipeline] { (Deploy RCP)
17:26:08 [2020-07-09T21:26:08.592Z] Stage "Deploy RCP" skipped due to earlier failure(s)
17:26:08 [2020-07-09T21:26:08.593Z] [Pipeline] }
17:26:08 [2020-07-09T21:26:08.644Z] [Pipeline] // stage
17:26:08 [2020-07-09T21:26:08.694Z] [Pipeline] stage
17:26:08 [2020-07-09T21:26:08.696Z] [Pipeline] { (Deploy Doc)
17:26:08 [2020-07-09T21:26:08.755Z] Stage "Deploy Doc" skipped due to earlier failure(s)
17:26:08 [2020-07-09T21:26:08.756Z] [Pipeline] }
17:26:08 [2020-07-09T21:26:08.846Z] [Pipeline] // stage
17:26:08 [2020-07-09T21:26:08.934Z] [Pipeline] }
17:26:08 [2020-07-09T21:26:08.986Z] [Pipeline] // withEnv
17:26:09 [2020-07-09T21:26:09.060Z] [Pipeline] }
17:26:09 [2020-07-09T21:26:09.135Z] [Pipeline] // timeout
17:26:09 [2020-07-09T21:26:09.189Z] [Pipeline] }
17:26:09 [2020-07-09T21:26:09.250Z] [Pipeline] // timestamps
17:26:09 [2020-07-09T21:26:09.308Z] [Pipeline] }
17:26:09 [2020-07-09T21:26:09.362Z] [Pipeline] // withEnv
17:26:09 [2020-07-09T21:26:09.434Z] [Pipeline] }
17:26:09 [2020-07-09T21:26:09.489Z] [Pipeline] // container
17:26:09 [2020-07-09T21:26:09.544Z] [Pipeline] }
17:26:09 [2020-07-09T21:26:09.603Z] [Pipeline] // withEnv
17:26:09 [2020-07-09T21:26:09.661Z] [Pipeline] }
17:26:09 [2020-07-09T21:26:09.721Z] [Pipeline] // node
17:26:09 [2020-07-09T21:26:09.779Z] [Pipeline] }
17:26:09 [2020-07-09T21:26:09.835Z] [Pipeline] // podTemplate
17:26:09 [2020-07-09T21:26:09.902Z] [Pipeline] End of Pipeline
17:26:10 [2020-07-09T21:26:10.024Z] Finished: ABORTED