FailedConsole Output

Skipping 506 KB.. Full Log
ics-2.0.6.jar
Downloading from CBI: https://repo.eclipse.org/content/repositories/cbi-releases/org/apache/maven/doxia/doxia-sink-api/1.0-alpha-7/doxia-sink-api-1.0-alpha-7.jar
Downloading from CBI: https://repo.eclipse.org/content/repositories/cbi-releases/org/apache/maven/maven-core/2.0.6/maven-core-2.0.6.jar
Downloading from CBI: https://repo.eclipse.org/content/repositories/cbi-releases/commons-cli/commons-cli/1.0/commons-cli-1.0.jar
Downloading from CBI: https://repo.eclipse.org/content/repositories/cbi-releases/org/apache/maven/maven-plugin-descriptor/2.0.6/maven-plugin-descriptor-2.0.6.jar
Downloading from CBI: https://repo.eclipse.org/content/repositories/cbi-releases/org/codehaus/plexus/plexus-interactivity-api/1.0-alpha-4/plexus-interactivity-api-1.0-alpha-4.jar
Downloading from CBI: https://repo.eclipse.org/content/repositories/cbi-releases/classworlds/classworlds/1.1/classworlds-1.1.jar
Downloading from CBI: https://repo.eclipse.org/content/repositories/cbi-releases/org/apache/maven/maven-monitor/2.0.6/maven-monitor-2.0.6.jar
Downloading from CBI: https://repo.eclipse.org/content/repositories/cbi-releases/org/codehaus/plexus/plexus-utils/2.0.5/plexus-utils-2.0.5.jar
Downloading from CBI: https://repo.eclipse.org/content/repositories/cbi-releases/org/apache/maven/shared/maven-filtering/1.1/maven-filtering-1.1.jar
Downloading from CBI: https://repo.eclipse.org/content/repositories/cbi-releases/org/sonatype/plexus/plexus-build-api/0.0.4/plexus-build-api-0.0.4.jar
Downloading from CBI: https://repo.eclipse.org/content/repositories/cbi-releases/org/codehaus/plexus/plexus-interpolation/1.13/plexus-interpolation-1.13.jar
Downloading from sonatype: https://oss.sonatype.org/content/groups/public/org/apache/maven/maven-core/2.0.6/maven-core-2.0.6.jar
Downloading from sonatype: https://oss.sonatype.org/content/groups/public/org/apache/maven/reporting/maven-reporting-api/2.0.6/maven-reporting-api-2.0.6.jar
Downloading from sonatype: https://oss.sonatype.org/content/groups/public/org/apache/maven/maven-plugin-parameter-documenter/2.0.6/maven-plugin-parameter-documenter-2.0.6.jar
Downloading from sonatype: https://oss.sonatype.org/content/groups/public/org/apache/maven/doxia/doxia-sink-api/1.0-alpha-7/doxia-sink-api-1.0-alpha-7.jar
Downloading from sonatype: https://oss.sonatype.org/content/groups/public/org/apache/maven/maven-error-diagnostics/2.0.6/maven-error-diagnostics-2.0.6.jar
Downloading from sonatype: https://oss.sonatype.org/content/groups/public/commons-cli/commons-cli/1.0/commons-cli-1.0.jar
Downloading from sonatype: https://oss.sonatype.org/content/groups/public/org/apache/maven/maven-plugin-descriptor/2.0.6/maven-plugin-descriptor-2.0.6.jar
Downloading from sonatype: https://oss.sonatype.org/content/groups/public/org/codehaus/plexus/plexus-interactivity-api/1.0-alpha-4/plexus-interactivity-api-1.0-alpha-4.jar
Downloading from sonatype: https://oss.sonatype.org/content/groups/public/classworlds/classworlds/1.1/classworlds-1.1.jar
Downloading from sonatype: https://oss.sonatype.org/content/groups/public/org/apache/maven/maven-monitor/2.0.6/maven-monitor-2.0.6.jar
Downloading from sonatype: https://oss.sonatype.org/content/groups/public/org/codehaus/plexus/plexus-utils/2.0.5/plexus-utils-2.0.5.jar
Downloading from sonatype: https://oss.sonatype.org/content/groups/public/org/apache/maven/shared/maven-filtering/1.1/maven-filtering-1.1.jar
Downloading from sonatype: https://oss.sonatype.org/content/groups/public/org/codehaus/plexus/plexus-interpolation/1.13/plexus-interpolation-1.13.jar
Downloading from sonatype: https://oss.sonatype.org/content/groups/public/org/sonatype/plexus/plexus-build-api/0.0.4/plexus-build-api-0.0.4.jar
Downloading from eclipse.maven.central.mirror: https://repo.eclipse.org/content/repositories/maven_central/org/apache/maven/maven-core/2.0.6/maven-core-2.0.6.jar
Downloading from eclipse.maven.central.mirror: https://repo.eclipse.org/content/repositories/maven_central/org/apache/maven/maven-plugin-parameter-documenter/2.0.6/maven-plugin-parameter-documenter-2.0.6.jar
Downloading from eclipse.maven.central.mirror: https://repo.eclipse.org/content/repositories/maven_central/org/apache/maven/reporting/maven-reporting-api/2.0.6/maven-reporting-api-2.0.6.jar
Downloading from eclipse.maven.central.mirror: https://repo.eclipse.org/content/repositories/maven_central/org/apache/maven/doxia/doxia-sink-api/1.0-alpha-7/doxia-sink-api-1.0-alpha-7.jar
Downloading from eclipse.maven.central.mirror: https://repo.eclipse.org/content/repositories/maven_central/org/apache/maven/maven-error-diagnostics/2.0.6/maven-error-diagnostics-2.0.6.jar
Progress (1): 4.1/14 kB
Progress (1): 7.7/14 kB
Progress (1): 12/14 kB 
Progress (1): 14 kB   
Progress (2): 14 kB | 4.1/152 kB
Progress (2): 14 kB | 7.7/152 kB
Progress (2): 14 kB | 12/152 kB 
Progress (2): 14 kB | 16/152 kB
Progress (2): 14 kB | 20/152 kB
Progress (2): 14 kB | 24/152 kB
Progress (2): 14 kB | 28/152 kB
Progress (2): 14 kB | 32/152 kB
Progress (2): 14 kB | 36/152 kB
Progress (2): 14 kB | 40/152 kB
Progress (2): 14 kB | 44/152 kB
Progress (2): 14 kB | 48/152 kB
Progress (2): 14 kB | 52/152 kB
Progress (2): 14 kB | 56/152 kB
Progress (2): 14 kB | 60/152 kB
Progress (2): 14 kB | 64/152 kB
Progress (2): 14 kB | 68/152 kB
Progress (2): 14 kB | 72/152 kB
Progress (2): 14 kB | 76/152 kB
Progress (2): 14 kB | 80/152 kB
Progress (2): 14 kB | 84/152 kB
Progress (2): 14 kB | 88/152 kB
Progress (2): 14 kB | 92/152 kB
Progress (2): 14 kB | 96/152 kB
Progress (2): 14 kB | 100/152 kB
Progress (2): 14 kB | 104/152 kB
Progress (2): 14 kB | 108/152 kB
Progress (2): 14 kB | 112/152 kB
Progress (3): 14 kB | 112/152 kB | 4.1/9.9 kB
Progress (3): 14 kB | 116/152 kB | 4.1/9.9 kB
Progress (3): 14 kB | 116/152 kB | 7.7/9.9 kB
Progress (3): 14 kB | 120/152 kB | 7.7/9.9 kB
Progress (3): 14 kB | 120/152 kB | 9.9 kB    
Progress (3): 14 kB | 124/152 kB | 9.9 kB
Progress (3): 14 kB | 128/152 kB | 9.9 kB
Progress (3): 14 kB | 132/152 kB | 9.9 kB
Progress (3): 14 kB | 136/152 kB | 9.9 kB
Progress (3): 14 kB | 140/152 kB | 9.9 kB
Progress (3): 14 kB | 144/152 kB | 9.9 kB
Progress (3): 14 kB | 148/152 kB | 9.9 kB
Progress (3): 14 kB | 152 kB | 9.9 kB    
                                     
Downloaded from eclipse.maven.central.mirror: https://repo.eclipse.org/content/repositories/maven_central/org/apache/maven/maven-error-diagnostics/2.0.6/maven-error-diagnostics-2.0.6.jar (14 kB at 592 kB/s)
Downloading from eclipse.maven.central.mirror: https://repo.eclipse.org/content/repositories/maven_central/commons-cli/commons-cli/1.0/commons-cli-1.0.jar
Downloaded from eclipse.maven.central.mirror: https://repo.eclipse.org/content/repositories/maven_central/org/apache/maven/reporting/maven-reporting-api/2.0.6/maven-reporting-api-2.0.6.jar (9.9 kB at 321 kB/s)
Downloading from eclipse.maven.central.mirror: https://repo.eclipse.org/content/repositories/maven_central/org/apache/maven/maven-plugin-descriptor/2.0.6/maven-plugin-descriptor-2.0.6.jar
Progress (2): 152 kB | 4.1/30 kB
Progress (2): 152 kB | 7.7/30 kB
Progress (2): 152 kB | 12/30 kB 
Progress (2): 152 kB | 16/30 kB
Progress (2): 152 kB | 20/30 kB
Progress (2): 152 kB | 24/30 kB
Progress (2): 152 kB | 28/30 kB
Progress (2): 152 kB | 30 kB   
                            
Downloaded from eclipse.maven.central.mirror: https://repo.eclipse.org/content/repositories/maven_central/commons-cli/commons-cli/1.0/commons-cli-1.0.jar (30 kB at 753 kB/s)
Downloading from eclipse.maven.central.mirror: https://repo.eclipse.org/content/repositories/maven_central/org/codehaus/plexus/plexus-interactivity-api/1.0-alpha-4/plexus-interactivity-api-1.0-alpha-4.jar
Progress (2): 152 kB | 4.1/37 kB
Progress (2): 152 kB | 7.7/37 kB
Progress (2): 152 kB | 12/37 kB 
Progress (2): 152 kB | 16/37 kB
Progress (2): 152 kB | 20/37 kB
Progress (2): 152 kB | 24/37 kB
Progress (2): 152 kB | 28/37 kB
Progress (2): 152 kB | 32/37 kB
Progress (2): 152 kB | 33/37 kB
Progress (2): 152 kB | 37/37 kB
Progress (2): 152 kB | 37 kB   
Progress (3): 152 kB | 37 kB | 4.1/5.9 kB
Progress (3): 152 kB | 37 kB | 5.9 kB    
Progress (4): 152 kB | 37 kB | 5.9 kB | 4.1/21 kB
Progress (4): 152 kB | 37 kB | 5.9 kB | 7.7/21 kB
Progress (4): 152 kB | 37 kB | 5.9 kB | 12/21 kB 
Progress (4): 152 kB | 37 kB | 5.9 kB | 16/21 kB
Progress (5): 152 kB | 37 kB | 5.9 kB | 16/21 kB | 4.1/13 kB
Progress (5): 152 kB | 37 kB | 5.9 kB | 16/21 kB | 7.7/13 kB
Progress (5): 152 kB | 37 kB | 5.9 kB | 20/21 kB | 7.7/13 kB
Progress (5): 152 kB | 37 kB | 5.9 kB | 21 kB | 7.7/13 kB   
Progress (5): 152 kB | 37 kB | 5.9 kB | 21 kB | 12/13 kB 
Progress (5): 152 kB | 37 kB | 5.9 kB | 21 kB | 13 kB   
                                                     
Downloaded from eclipse.maven.central.mirror: https://repo.eclipse.org/content/repositories/maven_central/org/apache/maven/maven-plugin-descriptor/2.0.6/maven-plugin-descriptor-2.0.6.jar (37 kB at 208 kB/s)
Downloading from eclipse.maven.central.mirror: https://repo.eclipse.org/content/repositories/maven_central/classworlds/classworlds/1.1/classworlds-1.1.jar
Downloaded from eclipse.maven.central.mirror: https://repo.eclipse.org/content/repositories/maven_central/org/apache/maven/maven-plugin-parameter-documenter/2.0.6/maven-plugin-parameter-documenter-2.0.6.jar (21 kB at 117 kB/s)
Downloading from eclipse.maven.central.mirror: https://repo.eclipse.org/content/repositories/maven_central/org/apache/maven/maven-monitor/2.0.6/maven-monitor-2.0.6.jar
Downloaded from eclipse.maven.central.mirror: https://repo.eclipse.org/content/repositories/maven_central/org/codehaus/plexus/plexus-interactivity-api/1.0-alpha-4/plexus-interactivity-api-1.0-alpha-4.jar (13 kB at 75 kB/s)
Downloading from eclipse.maven.central.mirror: https://repo.eclipse.org/content/repositories/maven_central/org/codehaus/plexus/plexus-utils/2.0.5/plexus-utils-2.0.5.jar
Downloaded from eclipse.maven.central.mirror: https://repo.eclipse.org/content/repositories/maven_central/org/apache/maven/doxia/doxia-sink-api/1.0-alpha-7/doxia-sink-api-1.0-alpha-7.jar (5.9 kB at 32 kB/s)
Downloading from eclipse.maven.central.mirror: https://repo.eclipse.org/content/repositories/maven_central/org/apache/maven/shared/maven-filtering/1.1/maven-filtering-1.1.jar
Progress (2): 152 kB | 4.1/38 kB
Progress (2): 152 kB | 7.7/38 kB
Progress (3): 152 kB | 7.7/38 kB | 4.1/10 kB
Progress (3): 152 kB | 12/38 kB | 4.1/10 kB 
Progress (3): 152 kB | 12/38 kB | 7.7/10 kB
Progress (3): 152 kB | 16/38 kB | 7.7/10 kB
Progress (3): 152 kB | 16/38 kB | 10 kB    
Progress (3): 152 kB | 20/38 kB | 10 kB
Progress (3): 152 kB | 24/38 kB | 10 kB
Progress (3): 152 kB | 28/38 kB | 10 kB
Progress (3): 152 kB | 32/38 kB | 10 kB
Progress (3): 152 kB | 36/38 kB | 10 kB
Progress (3): 152 kB | 38 kB | 10 kB   
Progress (4): 152 kB | 38 kB | 10 kB | 4.1/223 kB
Progress (4): 152 kB | 38 kB | 10 kB | 7.7/223 kB
Progress (4): 152 kB | 38 kB | 10 kB | 12/223 kB 
Progress (4): 152 kB | 38 kB | 10 kB | 16/223 kB
Progress (4): 152 kB | 38 kB | 10 kB | 20/223 kB
Progress (4): 152 kB | 38 kB | 10 kB | 24/223 kB
Progress (4): 152 kB | 38 kB | 10 kB | 28/223 kB
Progress (4): 152 kB | 38 kB | 10 kB | 32/223 kB
Progress (4): 152 kB | 38 kB | 10 kB | 33/223 kB
Progress (4): 152 kB | 38 kB | 10 kB | 37/223 kB
Progress (4): 152 kB | 38 kB | 10 kB | 41/223 kB
Progress (4): 152 kB | 38 kB | 10 kB | 45/223 kB
Progress (4): 152 kB | 38 kB | 10 kB | 49/223 kB
Progress (4): 152 kB | 38 kB | 10 kB | 53/223 kB
Progress (4): 152 kB | 38 kB | 10 kB | 57/223 kB
Progress (5): 152 kB | 38 kB | 10 kB | 57/223 kB | 4.1/43 kB
Progress (5): 152 kB | 38 kB | 10 kB | 57/223 kB | 7.7/43 kB
Progress (5): 152 kB | 38 kB | 10 kB | 61/223 kB | 7.7/43 kB
Progress (5): 152 kB | 38 kB | 10 kB | 65/223 kB | 7.7/43 kB
Progress (5): 152 kB | 38 kB | 10 kB | 65/223 kB | 12/43 kB 
Progress (5): 152 kB | 38 kB | 10 kB | 66/223 kB | 12/43 kB
Progress (5): 152 kB | 38 kB | 10 kB | 66/223 kB | 16/43 kB
Progress (5): 152 kB | 38 kB | 10 kB | 70/223 kB | 16/43 kB
Progress (5): 152 kB | 38 kB | 10 kB | 70/223 kB | 20/43 kB
Progress (5): 152 kB | 38 kB | 10 kB | 74/223 kB | 20/43 kB
Progress (5): 152 kB | 38 kB | 10 kB | 74/223 kB | 24/43 kB
Progress (5): 152 kB | 38 kB | 10 kB | 78/223 kB | 24/43 kB
Progress (5): 152 kB | 38 kB | 10 kB | 78/223 kB | 28/43 kB
Progress (5): 152 kB | 38 kB | 10 kB | 82/223 kB | 28/43 kB
Progress (5): 152 kB | 38 kB | 10 kB | 82/223 kB | 32/43 kB
Progress (5): 152 kB | 38 kB | 10 kB | 86/223 kB | 32/43 kB
Progress (5): 152 kB | 38 kB | 10 kB | 86/223 kB | 36/43 kB
Progress (5): 152 kB | 38 kB | 10 kB | 90/223 kB | 36/43 kB
Progress (5): 152 kB | 38 kB | 10 kB | 90/223 kB | 40/43 kB
Progress (5): 152 kB | 38 kB | 10 kB | 90/223 kB | 43 kB   
Progress (5): 152 kB | 38 kB | 10 kB | 94/223 kB | 43 kB
Progress (5): 152 kB | 38 kB | 10 kB | 98/223 kB | 43 kB
Progress (5): 152 kB | 38 kB | 10 kB | 98/223 kB | 43 kB
Progress (5): 152 kB | 38 kB | 10 kB | 102/223 kB | 43 kB
Progress (5): 152 kB | 38 kB | 10 kB | 106/223 kB | 43 kB
Progress (5): 152 kB | 38 kB | 10 kB | 110/223 kB | 43 kB
Progress (5): 152 kB | 38 kB | 10 kB | 114/223 kB | 43 kB
Progress (5): 152 kB | 38 kB | 10 kB | 118/223 kB | 43 kB
Progress (5): 152 kB | 38 kB | 10 kB | 122/223 kB | 43 kB
Progress (5): 152 kB | 38 kB | 10 kB | 126/223 kB | 43 kB
Progress (5): 152 kB | 38 kB | 10 kB | 130/223 kB | 43 kB
Progress (5): 152 kB | 38 kB | 10 kB | 131/223 kB | 43 kB
Progress (5): 152 kB | 38 kB | 10 kB | 135/223 kB | 43 kB
Progress (5): 152 kB | 38 kB | 10 kB | 139/223 kB | 43 kB
Progress (5): 152 kB | 38 kB | 10 kB | 143/223 kB | 43 kB
Progress (5): 152 kB | 38 kB | 10 kB | 147/223 kB | 43 kB
Progress (5): 152 kB | 38 kB | 10 kB | 151/223 kB | 43 kB
Progress (5): 152 kB | 38 kB | 10 kB | 155/223 kB | 43 kB
Progress (5): 152 kB | 38 kB | 10 kB | 159/223 kB | 43 kB
Progress (5): 152 kB | 38 kB | 10 kB | 163/223 kB | 43 kB
Progress (5): 152 kB | 38 kB | 10 kB | 164/223 kB | 43 kB
Progress (5): 152 kB | 38 kB | 10 kB | 168/223 kB | 43 kB
Progress (5): 152 kB | 38 kB | 10 kB | 172/223 kB | 43 kB
Progress (5): 152 kB | 38 kB | 10 kB | 176/223 kB | 43 kB
Progress (5): 152 kB | 38 kB | 10 kB | 180/223 kB | 43 kB
                                                         
Downloaded from eclipse.maven.central.mirror: https://repo.eclipse.org/content/repositories/maven_central/classworlds/classworlds/1.1/classworlds-1.1.jar (38 kB at 189 kB/s)
Progress (4): 152 kB | 10 kB | 184/223 kB | 43 kB
                                                 
Downloading from eclipse.maven.central.mirror: https://repo.eclipse.org/content/repositories/maven_central/org/sonatype/plexus/plexus-build-api/0.0.4/plexus-build-api-0.0.4.jar
Progress (4): 152 kB | 10 kB | 188/223 kB | 43 kB
Progress (4): 152 kB | 10 kB | 192/223 kB | 43 kB
Progress (4): 152 kB | 10 kB | 196/223 kB | 43 kB
Progress (4): 152 kB | 10 kB | 197/223 kB | 43 kB
Progress (4): 152 kB | 10 kB | 201/223 kB | 43 kB
Progress (4): 152 kB | 10 kB | 205/223 kB | 43 kB
Progress (4): 152 kB | 10 kB | 209/223 kB | 43 kB
Progress (4): 152 kB | 10 kB | 213/223 kB | 43 kB
Progress (4): 152 kB | 10 kB | 217/223 kB | 43 kB
Progress (4): 152 kB | 10 kB | 221/223 kB | 43 kB
Progress (4): 152 kB | 10 kB | 223 kB | 43 kB    
Progress (5): 152 kB | 10 kB | 223 kB | 43 kB | 4.1/6.8 kB
Progress (5): 152 kB | 10 kB | 223 kB | 43 kB | 6.8 kB    
                                                      
Downloaded from eclipse.maven.central.mirror: https://repo.eclipse.org/content/repositories/maven_central/org/apache/maven/maven-core/2.0.6/maven-core-2.0.6.jar (152 kB at 708 kB/s)
Downloading from eclipse.maven.central.mirror: https://repo.eclipse.org/content/repositories/maven_central/org/codehaus/plexus/plexus-interpolation/1.13/plexus-interpolation-1.13.jar
Downloaded from eclipse.maven.central.mirror: https://repo.eclipse.org/content/repositories/maven_central/org/apache/maven/maven-monitor/2.0.6/maven-monitor-2.0.6.jar (10 kB at 46 kB/s)
Progress (4): 223 kB | 43 kB | 6.8 kB | 4.1/61 kB
                                                 
Downloaded from eclipse.maven.central.mirror: https://repo.eclipse.org/content/repositories/maven_central/org/codehaus/plexus/plexus-utils/2.0.5/plexus-utils-2.0.5.jar (223 kB at 992 kB/s)
Progress (3): 43 kB | 6.8 kB | 7.7/61 kB
                                        
Downloaded from eclipse.maven.central.mirror: https://repo.eclipse.org/content/repositories/maven_central/org/apache/maven/shared/maven-filtering/1.1/maven-filtering-1.1.jar (43 kB at 191 kB/s)
Progress (2): 6.8 kB | 12/61 kB
Progress (2): 6.8 kB | 16/61 kB
Progress (2): 6.8 kB | 20/61 kB
Progress (2): 6.8 kB | 24/61 kB
Progress (2): 6.8 kB | 28/61 kB
Progress (2): 6.8 kB | 32/61 kB
Progress (2): 6.8 kB | 33/61 kB
Progress (2): 6.8 kB | 37/61 kB
Progress (2): 6.8 kB | 41/61 kB
Progress (2): 6.8 kB | 45/61 kB
Progress (2): 6.8 kB | 49/61 kB
Progress (2): 6.8 kB | 53/61 kB
Progress (2): 6.8 kB | 57/61 kB
Progress (2): 6.8 kB | 61/61 kB
Progress (2): 6.8 kB | 61 kB   
                            
Downloaded from eclipse.maven.central.mirror: https://repo.eclipse.org/content/repositories/maven_central/org/sonatype/plexus/plexus-build-api/0.0.4/plexus-build-api-0.0.4.jar (6.8 kB at 29 kB/s)
Downloaded from eclipse.maven.central.mirror: https://repo.eclipse.org/content/repositories/maven_central/org/codehaus/plexus/plexus-interpolation/1.13/plexus-interpolation-1.13.jar (61 kB at 259 kB/s)
[INFO] Using 'UTF-8' encoding to copy filtered resources.
[INFO] skip non existing resourceDirectory /jobs/genie.tm/tm-3.7-maintenance/workspace/rse/doc/org.eclipse.dstore.doc.isv/src/main/resources
[INFO] 
[INFO] --- tycho-compiler-plugin:0.20.0:compile (default-compile) @ org.eclipse.dstore.doc.isv ---
Downloading from CBI: https://repo.eclipse.org/content/repositories/cbi-releases/org/apache/maven/maven-compat/3.0/maven-compat-3.0.pom
Downloading from sonatype: https://oss.sonatype.org/content/groups/public/org/apache/maven/maven-compat/3.0/maven-compat-3.0.pom
Downloading from eclipse.maven.central.mirror: https://repo.eclipse.org/content/repositories/maven_central/org/apache/maven/maven-compat/3.0/maven-compat-3.0.pom
Progress (1): 4.0 kB
                    
Downloaded from eclipse.maven.central.mirror: https://repo.eclipse.org/content/repositories/maven_central/org/apache/maven/maven-compat/3.0/maven-compat-3.0.pom (4.0 kB at 168 kB/s)
Downloading from CBI: https://repo.eclipse.org/content/repositories/cbi-releases/org/apache/maven/wagon/wagon-provider-api/1.0-beta-6/wagon-provider-api-1.0-beta-6.pom
Downloading from sonatype: https://oss.sonatype.org/content/groups/public/org/apache/maven/wagon/wagon-provider-api/1.0-beta-6/wagon-provider-api-1.0-beta-6.pom
Downloading from eclipse.maven.central.mirror: https://repo.eclipse.org/content/repositories/maven_central/org/apache/maven/wagon/wagon-provider-api/1.0-beta-6/wagon-provider-api-1.0-beta-6.pom
Progress (1): 1.8 kB
                    
Downloaded from eclipse.maven.central.mirror: https://repo.eclipse.org/content/repositories/maven_central/org/apache/maven/wagon/wagon-provider-api/1.0-beta-6/wagon-provider-api-1.0-beta-6.pom (1.8 kB at 73 kB/s)
Downloading from CBI: https://repo.eclipse.org/content/repositories/cbi-releases/org/apache/maven/wagon/wagon/1.0-beta-6/wagon-1.0-beta-6.pom
Downloading from sonatype: https://oss.sonatype.org/content/groups/public/org/apache/maven/wagon/wagon/1.0-beta-6/wagon-1.0-beta-6.pom
Downloading from eclipse.maven.central.mirror: https://repo.eclipse.org/content/repositories/maven_central/org/apache/maven/wagon/wagon/1.0-beta-6/wagon-1.0-beta-6.pom
Progress (1): 4.1/12 kB
Progress (1): 7.7/12 kB
Progress (1): 12/12 kB 
Progress (1): 12 kB   
                   
Downloaded from eclipse.maven.central.mirror: https://repo.eclipse.org/content/repositories/maven_central/org/apache/maven/wagon/wagon/1.0-beta-6/wagon-1.0-beta-6.pom (12 kB at 387 kB/s)
Downloading from CBI: https://repo.eclipse.org/content/repositories/cbi-releases/org/codehaus/plexus/plexus-compiler-manager/2.2/plexus-compiler-manager-2.2.pom
Downloading from sonatype: https://oss.sonatype.org/content/groups/public/org/codehaus/plexus/plexus-compiler-manager/2.2/plexus-compiler-manager-2.2.pom
Downloading from eclipse.maven.central.mirror: https://repo.eclipse.org/content/repositories/maven_central/org/codehaus/plexus/plexus-compiler-manager/2.2/plexus-compiler-manager-2.2.pom
Progress (1): 690 B
                   
Downloaded from eclipse.maven.central.mirror: https://repo.eclipse.org/content/repositories/maven_central/org/codehaus/plexus/plexus-compiler-manager/2.2/plexus-compiler-manager-2.2.pom (690 B at 19 kB/s)
Downloading from CBI: https://repo.eclipse.org/content/repositories/cbi-releases/org/codehaus/plexus/plexus-compiler/2.2/plexus-compiler-2.2.pom
Downloading from sonatype: https://oss.sonatype.org/content/groups/public/org/codehaus/plexus/plexus-compiler/2.2/plexus-compiler-2.2.pom
Downloading from eclipse.maven.central.mirror: https://repo.eclipse.org/content/repositories/maven_central/org/codehaus/plexus/plexus-compiler/2.2/plexus-compiler-2.2.pom
Progress (1): 3.6 kB
                    
Downloaded from eclipse.maven.central.mirror: https://repo.eclipse.org/content/repositories/maven_central/org/codehaus/plexus/plexus-compiler/2.2/plexus-compiler-2.2.pom (3.6 kB at 11 kB/s)
Downloading from CBI: https://repo.eclipse.org/content/repositories/cbi-releases/org/codehaus/plexus/plexus-components/1.3.1/plexus-components-1.3.1.pom
Downloading from sonatype: https://oss.sonatype.org/content/groups/public/org/codehaus/plexus/plexus-components/1.3.1/plexus-components-1.3.1.pom
Downloading from eclipse.maven.central.mirror: https://repo.eclipse.org/content/repositories/maven_central/org/codehaus/plexus/plexus-components/1.3.1/plexus-components-1.3.1.pom
Progress (1): 3.1 kB
                    
Downloaded from eclipse.maven.central.mirror: https://repo.eclipse.org/content/repositories/maven_central/org/codehaus/plexus/plexus-components/1.3.1/plexus-components-1.3.1.pom (3.1 kB at 49 kB/s)
Downloading from CBI: https://repo.eclipse.org/content/repositories/cbi-releases/org/codehaus/plexus/plexus-compiler-api/2.2/plexus-compiler-api-2.2.pom
Downloading from sonatype: https://oss.sonatype.org/content/groups/public/org/codehaus/plexus/plexus-compiler-api/2.2/plexus-compiler-api-2.2.pom
Downloading from eclipse.maven.central.mirror: https://repo.eclipse.org/content/repositories/maven_central/org/codehaus/plexus/plexus-compiler-api/2.2/plexus-compiler-api-2.2.pom
Progress (1): 865 B
                   
Downloaded from eclipse.maven.central.mirror: https://repo.eclipse.org/content/repositories/maven_central/org/codehaus/plexus/plexus-compiler-api/2.2/plexus-compiler-api-2.2.pom (865 B at 33 kB/s)
Downloading from CBI: https://repo.eclipse.org/content/repositories/cbi-releases/org/eclipse/tycho/tycho-compiler-jdt/0.20.0/tycho-compiler-jdt-0.20.0.pom
Downloading from sonatype: https://oss.sonatype.org/content/groups/public/org/eclipse/tycho/tycho-compiler-jdt/0.20.0/tycho-compiler-jdt-0.20.0.pom
Progress (1): 1.8 kB
                    
Downloaded from sonatype: https://oss.sonatype.org/content/groups/public/org/eclipse/tycho/tycho-compiler-jdt/0.20.0/tycho-compiler-jdt-0.20.0.pom (1.8 kB at 640 B/s)
Downloading from CBI: https://repo.eclipse.org/content/repositories/cbi-releases/org/eclipse/tycho/org.eclipse.jdt.core/3.9.1.v20130905-0837/org.eclipse.jdt.core-3.9.1.v20130905-0837.pom
Downloading from sonatype: https://oss.sonatype.org/content/groups/public/org/eclipse/tycho/org.eclipse.jdt.core/3.9.1.v20130905-0837/org.eclipse.jdt.core-3.9.1.v20130905-0837.pom
Progress (1): 1.5 kB
                    
Downloaded from sonatype: https://oss.sonatype.org/content/groups/public/org/eclipse/tycho/org.eclipse.jdt.core/3.9.1.v20130905-0837/org.eclipse.jdt.core-3.9.1.v20130905-0837.pom (1.5 kB at 13 kB/s)
Downloading from CBI: https://repo.eclipse.org/content/repositories/cbi-releases/org/eclipse/tycho/org.eclipse.jdt.compiler.apt/1.0.600.v20130530-1010/org.eclipse.jdt.compiler.apt-1.0.600.v20130530-1010.pom
Downloading from sonatype: https://oss.sonatype.org/content/groups/public/org/eclipse/tycho/org.eclipse.jdt.compiler.apt/1.0.600.v20130530-1010/org.eclipse.jdt.compiler.apt-1.0.600.v20130530-1010.pom
Progress (1): 1.5 kB
                    
Downloaded from sonatype: https://oss.sonatype.org/content/groups/public/org/eclipse/tycho/org.eclipse.jdt.compiler.apt/1.0.600.v20130530-1010/org.eclipse.jdt.compiler.apt-1.0.600.v20130530-1010.pom (1.5 kB at 10 kB/s)
Downloading from CBI: https://repo.eclipse.org/content/repositories/cbi-releases/org/apache/maven/maven-compat/3.0/maven-compat-3.0.jar
Downloading from CBI: https://repo.eclipse.org/content/repositories/cbi-releases/org/apache/maven/wagon/wagon-provider-api/1.0-beta-6/wagon-provider-api-1.0-beta-6.jar
Downloading from CBI: https://repo.eclipse.org/content/repositories/cbi-releases/org/codehaus/plexus/plexus-compiler-manager/2.2/plexus-compiler-manager-2.2.jar
Downloading from CBI: https://repo.eclipse.org/content/repositories/cbi-releases/org/codehaus/plexus/plexus-compiler-api/2.2/plexus-compiler-api-2.2.jar
Downloading from CBI: https://repo.eclipse.org/content/repositories/cbi-releases/org/eclipse/tycho/tycho-compiler-jdt/0.20.0/tycho-compiler-jdt-0.20.0.jar
Downloading from CBI: https://repo.eclipse.org/content/repositories/cbi-releases/org/eclipse/tycho/org.eclipse.jdt.core/3.9.1.v20130905-0837/org.eclipse.jdt.core-3.9.1.v20130905-0837.jar
Downloading from CBI: https://repo.eclipse.org/content/repositories/cbi-releases/org/eclipse/tycho/org.eclipse.jdt.compiler.apt/1.0.600.v20130530-1010/org.eclipse.jdt.compiler.apt-1.0.600.v20130530-1010.jar
Downloading from sonatype: https://oss.sonatype.org/content/groups/public/org/apache/maven/maven-compat/3.0/maven-compat-3.0.jar
Downloading from sonatype: https://oss.sonatype.org/content/groups/public/org/apache/maven/wagon/wagon-provider-api/1.0-beta-6/wagon-provider-api-1.0-beta-6.jar
Downloading from sonatype: https://oss.sonatype.org/content/groups/public/org/codehaus/plexus/plexus-compiler-api/2.2/plexus-compiler-api-2.2.jar
Downloading from sonatype: https://oss.sonatype.org/content/groups/public/org/eclipse/tycho/tycho-compiler-jdt/0.20.0/tycho-compiler-jdt-0.20.0.jar
Downloading from sonatype: https://oss.sonatype.org/content/groups/public/org/codehaus/plexus/plexus-compiler-manager/2.2/plexus-compiler-manager-2.2.jar
Downloading from sonatype: https://oss.sonatype.org/content/groups/public/org/eclipse/tycho/org.eclipse.jdt.core/3.9.1.v20130905-0837/org.eclipse.jdt.core-3.9.1.v20130905-0837.jar
Downloading from sonatype: https://oss.sonatype.org/content/groups/public/org/eclipse/tycho/org.eclipse.jdt.compiler.apt/1.0.600.v20130530-1010/org.eclipse.jdt.compiler.apt-1.0.600.v20130530-1010.jar
Progress (1): 3.8/155 kB
Progress (2): 3.8/155 kB | 0/4.8 MB
Progress (2): 3.8/155 kB | 0/4.8 MB
Progress (2): 3.8/155 kB | 0/4.8 MB
Progress (2): 3.8/155 kB | 0/4.8 MB
Progress (2): 3.8/155 kB | 0/4.8 MB
Progress (2): 3.8/155 kB | 0/4.8 MB
Progress (2): 3.8/155 kB | 0/4.8 MB
Progress (2): 3.8/155 kB | 0/4.8 MB
Progress (2): 3.8/155 kB | 0/4.8 MB
Progress (2): 7.9/155 kB | 0/4.8 MB
Progress (2): 12/155 kB | 0/4.8 MB 
Progress (2): 16/155 kB | 0/4.8 MB
Progress (2): 20/155 kB | 0/4.8 MB
Progress (2): 24/155 kB | 0/4.8 MB
Progress (2): 28/155 kB | 0/4.8 MB
Progress (2): 32/155 kB | 0/4.8 MB
Progress (2): 37/155 kB | 0/4.8 MB
Progress (2): 37/155 kB | 0/4.8 MB
Progress (2): 37/155 kB | 0/4.8 MB
Progress (2): 37/155 kB | 0/4.8 MB
Progress (2): 37/155 kB | 0/4.8 MB
Progress (2): 37/155 kB | 0.1/4.8 MB
Progress (2): 37/155 kB | 0.1/4.8 MB
Progress (2): 37/155 kB | 0.1/4.8 MB
Progress (2): 37/155 kB | 0.1/4.8 MB
Progress (2): 37/155 kB | 0.1/4.8 MB
Progress (2): 37/155 kB | 0.1/4.8 MB
Progress (2): 37/155 kB | 0.1/4.8 MB
Progress (2): 37/155 kB | 0.1/4.8 MB
Progress (2): 37/155 kB | 0.1/4.8 MB
Progress (2): 37/155 kB | 0.1/4.8 MB
Progress (2): 37/155 kB | 0.1/4.8 MB
Progress (2): 37/155 kB | 0.1/4.8 MB
Progress (2): 37/155 kB | 0.1/4.8 MB
Progress (2): 37/155 kB | 0.1/4.8 MB
Progress (2): 37/155 kB | 0.1/4.8 MB
Progress (2): 37/155 kB | 0.1/4.8 MB
Progress (2): 37/155 kB | 0.1/4.8 MB
Progress (2): 37/155 kB | 0.1/4.8 MB
Progress (2): 37/155 kB | 0.1/4.8 MB
Progress (2): 37/155 kB | 0.1/4.8 MB
Progress (2): 41/155 kB | 0.1/4.8 MB
Progress (2): 45/155 kB | 0.1/4.8 MB
Progress (2): 49/155 kB | 0.1/4.8 MB
Progress (2): 53/155 kB | 0.1/4.8 MB
Progress (2): 57/155 kB | 0.1/4.8 MB
Progress (2): 61/155 kB | 0.1/4.8 MB
Progress (2): 65/155 kB | 0.1/4.8 MB
Progress (2): 69/155 kB | 0.1/4.8 MB
Progress (2): 69/155 kB | 0.1/4.8 MB
Progress (2): 69/155 kB | 0.1/4.8 MB
Progress (2): 69/155 kB | 0.1/4.8 MB
Progress (2): 69/155 kB | 0.1/4.8 MB
Progress (2): 69/155 kB | 0.2/4.8 MB
Progress (2): 69/155 kB | 0.2/4.8 MB
Progress (2): 69/155 kB | 0.2/4.8 MB
Progress (2): 69/155 kB | 0.2/4.8 MB
Progress (2): 69/155 kB | 0.2/4.8 MB
Progress (2): 69/155 kB | 0.2/4.8 MB
Progress (2): 69/155 kB | 0.2/4.8 MB
Progress (2): 69/155 kB | 0.2/4.8 MB
Progress (2): 69/155 kB | 0.2/4.8 MB
Progress (2): 69/155 kB | 0.2/4.8 MB
Progress (2): 69/155 kB | 0.2/4.8 MB
Progress (2): 69/155 kB | 0.2/4.8 MB
Progress (2): 69/155 kB | 0.2/4.8 MB
Progress (2): 69/155 kB | 0.2/4.8 MB
Progress (2): 69/155 kB | 0.2/4.8 MB
Progress (2): 69/155 kB | 0.2/4.8 MB
Progress (2): 69/155 kB | 0.2/4.8 MB
Progress (2): 69/155 kB | 0.2/4.8 MB
Progress (2): 69/155 kB | 0.2/4.8 MB
Progress (2): 69/155 kB | 0.2/4.8 MB
Progress (2): 73/155 kB | 0.2/4.8 MB
Progress (2): 77/155 kB | 0.2/4.8 MB
Progress (2): 82/155 kB | 0.2/4.8 MB
Progress (2): 86/155 kB | 0.2/4.8 MB
Progress (2): 90/155 kB | 0.2/4.8 MB
Progress (2): 94/155 kB | 0.2/4.8 MB
Progress (2): 98/155 kB | 0.2/4.8 MB
Progress (2): 102/155 kB | 0.2/4.8 MB
Progress (2): 106/155 kB | 0.2/4.8 MB
Progress (2): 110/155 kB | 0.2/4.8 MB
Progress (2): 114/155 kB | 0.2/4.8 MB
Progress (2): 118/155 kB | 0.2/4.8 MB
Progress (2): 123/155 kB | 0.2/4.8 MB
Progress (2): 127/155 kB | 0.2/4.8 MB
Progress (2): 131/155 kB | 0.2/4.8 MB
Progress (2): 135/155 kB | 0.2/4.8 MB
Progress (2): 139/155 kB | 0.2/4.8 MB
Progress (2): 143/155 kB | 0.2/4.8 MB
Progress (2): 147/155 kB | 0.2/4.8 MB
Progress (2): 151/155 kB | 0.2/4.8 MB
Progress (2): 155 kB | 0.2/4.8 MB    
Progress (2): 155 kB | 0.2/4.8 MB
Progress (2): 155 kB | 0.2/4.8 MB
Progress (2): 155 kB | 0.2/4.8 MB
Progress (2): 155 kB | 0.2/4.8 MB
Progress (2): 155 kB | 0.2/4.8 MB
Progress (2): 155 kB | 0.3/4.8 MB
Progress (2): 155 kB | 0.3/4.8 MB
Progress (2): 155 kB | 0.3/4.8 MB
Progress (2): 155 kB | 0.3/4.8 MB
Progress (2): 155 kB | 0.3/4.8 MB
Progress (2): 155 kB | 0.3/4.8 MB
Progress (2): 155 kB | 0.3/4.8 MB
Progress (2): 155 kB | 0.3/4.8 MB
Progress (2): 155 kB | 0.3/4.8 MB
Progress (2): 155 kB | 0.3/4.8 MB
Progress (2): 155 kB | 0.3/4.8 MB
Progress (2): 155 kB | 0.3/4.8 MB
Progress (2): 155 kB | 0.3/4.8 MB
Progress (2): 155 kB | 0.3/4.8 MB
Progress (2): 155 kB | 0.3/4.8 MB
Progress (2): 155 kB | 0.3/4.8 MB
Progress (2): 155 kB | 0.3/4.8 MB
Progress (2): 155 kB | 0.3/4.8 MB
Progress (2): 155 kB | 0.3/4.8 MB
Progress (2): 155 kB | 0.3/4.8 MB
Progress (2): 155 kB | 0.3/4.8 MB
Progress (2): 155 kB | 0.3/4.8 MB
Progress (2): 155 kB | 0.3/4.8 MB
Progress (2): 155 kB | 0.3/4.8 MB
Progress (2): 155 kB | 0.4/4.8 MB
Progress (2): 155 kB | 0.4/4.8 MB
Progress (2): 155 kB | 0.4/4.8 MB
Progress (2): 155 kB | 0.4/4.8 MB
Progress (2): 155 kB | 0.4/4.8 MB
Progress (2): 155 kB | 0.4/4.8 MB
Progress (2): 155 kB | 0.4/4.8 MB
Progress (2): 155 kB | 0.4/4.8 MB
Progress (2): 155 kB | 0.4/4.8 MB
Progress (2): 155 kB | 0.4/4.8 MB
Progress (2): 155 kB | 0.4/4.8 MB
Progress (2): 155 kB | 0.4/4.8 MB
Progress (2): 155 kB | 0.4/4.8 MB
Progress (2): 155 kB | 0.4/4.8 MB
Progress (2): 155 kB | 0.4/4.8 MB
Progress (2): 155 kB | 0.4/4.8 MB
Progress (2): 155 kB | 0.4/4.8 MB
Progress (2): 155 kB | 0.4/4.8 MB
Progress (2): 155 kB | 0.4/4.8 MB
Progress (2): 155 kB | 0.4/4.8 MB
Progress (2): 155 kB | 0.4/4.8 MB
Progress (2): 155 kB | 0.4/4.8 MB
Progress (2): 155 kB | 0.4/4.8 MB
Progress (2): 155 kB | 0.4/4.8 MB
Progress (2): 155 kB | 0.5/4.8 MB
Progress (2): 155 kB | 0.5/4.8 MB
Progress (2): 155 kB | 0.5/4.8 MB
Progress (2): 155 kB | 0.5/4.8 MB
Progress (2): 155 kB | 0.5/4.8 MB
Progress (2): 155 kB | 0.5/4.8 MB
Progress (2): 155 kB | 0.5/4.8 MB
Progress (2): 155 kB | 0.5/4.8 MB
Progress (2): 155 kB | 0.5/4.8 MB
Progress (2): 155 kB | 0.5/4.8 MB
Progress (2): 155 kB | 0.5/4.8 MB
Progress (2): 155 kB | 0.5/4.8 MB
Progress (2): 155 kB | 0.5/4.8 MB
Progress (2): 155 kB | 0.5/4.8 MB
Progress (2): 155 kB | 0.5/4.8 MB
Progress (2): 155 kB | 0.5/4.8 MB
Progress (2): 155 kB | 0.5/4.8 MB
Progress (2): 155 kB | 0.5/4.8 MB
Progress (2): 155 kB | 0.5/4.8 MB
Progress (2): 155 kB | 0.5/4.8 MB
Progress (2): 155 kB | 0.5/4.8 MB
Progress (2): 155 kB | 0.5/4.8 MB
Progress (2): 155 kB | 0.5/4.8 MB
Progress (2): 155 kB | 0.5/4.8 MB
Progress (2): 155 kB | 0.5/4.8 MB
Progress (2): 155 kB | 0.6/4.8 MB
Progress (2): 155 kB | 0.6/4.8 MB
Progress (2): 155 kB | 0.6/4.8 MB
Progress (2): 155 kB | 0.6/4.8 MB
Progress (2): 155 kB | 0.6/4.8 MB
Progress (2): 155 kB | 0.6/4.8 MB
Progress (2): 155 kB | 0.6/4.8 MB
Progress (2): 155 kB | 0.6/4.8 MB
Progress (2): 155 kB | 0.6/4.8 MB
Progress (2): 155 kB | 0.6/4.8 MB
                                 
Downloaded from sonatype: https://oss.sonatype.org/content/groups/public/org/eclipse/tycho/org.eclipse.jdt.compiler.apt/1.0.600.v20130530-1010/org.eclipse.jdt.compiler.apt-1.0.600.v20130530-1010.jar (155 kB at 331 kB/s)
Progress (1): 0.6/4.8 MB
Progress (1): 0.6/4.8 MB
Progress (1): 0.6/4.8 MB
Progress (1): 0.6/4.8 MB
Progress (1): 0.6/4.8 MB
Progress (1): 0.6/4.8 MB
Progress (1): 0.6/4.8 MB
Progress (1): 0.6/4.8 MB
Progress (1): 0.6/4.8 MB
Progress (1): 0.6/4.8 MB
Progress (1): 0.6/4.8 MB
Progress (1): 0.6/4.8 MB
Progress (1): 0.6/4.8 MB
Progress (1): 0.6/4.8 MB
Progress (1): 0.7/4.8 MB
Progress (1): 0.7/4.8 MB
Progress (1): 0.7/4.8 MB
Progress (1): 0.7/4.8 MB
Progress (1): 0.7/4.8 MB
Progress (1): 0.7/4.8 MB
Progress (1): 0.7/4.8 MB
Progress (1): 0.7/4.8 MB
Progress (1): 0.7/4.8 MB
Progress (1): 0.7/4.8 MB
Progress (1): 0.7/4.8 MB
Progress (1): 0.7/4.8 MB
Progress (1): 0.7/4.8 MB
Progress (1): 0.7/4.8 MB
Progress (1): 0.7/4.8 MB
Progress (1): 0.7/4.8 MB
Progress (1): 0.7/4.8 MB
Progress (1): 0.7/4.8 MB
Progress (1): 0.7/4.8 MB
Progress (1): 0.7/4.8 MB
Progress (1): 0.7/4.8 MB
Progress (1): 0.7/4.8 MB
Progress (1): 0.7/4.8 MB
Progress (1): 0.7/4.8 MB
Progress (1): 0.7/4.8 MB
Progress (1): 0.8/4.8 MB
Progress (1): 0.8/4.8 MB
Progress (1): 0.8/4.8 MB
Progress (1): 0.8/4.8 MB
Progress (1): 0.8/4.8 MB
Progress (1): 0.8/4.8 MB
Progress (1): 0.8/4.8 MB
Progress (1): 0.8/4.8 MB
Progress (1): 0.8/4.8 MB
Progress (1): 0.8/4.8 MB
Progress (1): 0.8/4.8 MB
Progress (1): 0.8/4.8 MB
Progress (1): 0.8/4.8 MB
Progress (1): 0.8/4.8 MB
Progress (1): 0.8/4.8 MB
Progress (1): 0.8/4.8 MB
Progress (1): 0.8/4.8 MB
Progress (1): 0.8/4.8 MB
Progress (1): 0.8/4.8 MB
Progress (1): 0.8/4.8 MB
Progress (1): 0.8/4.8 MB
Progress (1): 0.8/4.8 MB
Progress (1): 0.8/4.8 MB
Progress (1): 0.8/4.8 MB
Progress (1): 0.9/4.8 MB
Progress (1): 0.9/4.8 MB
Progress (1): 0.9/4.8 MB
Progress (1): 0.9/4.8 MB
Progress (1): 0.9/4.8 MB
Progress (1): 0.9/4.8 MB
Progress (1): 0.9/4.8 MB
Progress (1): 0.9/4.8 MB
Progress (1): 0.9/4.8 MB
Progress (1): 0.9/4.8 MB
Progress (1): 0.9/4.8 MB
Progress (1): 0.9/4.8 MB
Progress (1): 0.9/4.8 MB
Progress (1): 0.9/4.8 MB
Progress (1): 0.9/4.8 MB
Progress (1): 0.9/4.8 MB
Progress (1): 0.9/4.8 MB
Progress (1): 0.9/4.8 MB
Progress (1): 0.9/4.8 MB
Progress (1): 0.9/4.8 MB
Progress (1): 0.9/4.8 MB
Progress (1): 0.9/4.8 MB
Progress (1): 0.9/4.8 MB
Progress (1): 0.9/4.8 MB
Progress (1): 0.9/4.8 MB
Progress (1): 1.0/4.8 MB
Progress (1): 1.0/4.8 MB
Progress (1): 1.0/4.8 MB
Progress (1): 1.0/4.8 MB
Progress (1): 1.0/4.8 MB
Progress (1): 1.0/4.8 MB
Progress (1): 1.0/4.8 MB
Progress (1): 1.0/4.8 MB
Progress (1): 1.0/4.8 MB
Progress (1): 1.0/4.8 MB
Progress (1): 1.0/4.8 MB
Progress (1): 1.0/4.8 MB
Progress (1): 1.0/4.8 MB
Progress (1): 1.0/4.8 MB
Progress (1): 1.0/4.8 MB
Progress (1): 1.0/4.8 MB
Progress (1): 1.0/4.8 MB
Progress (1): 1.0/4.8 MB
Progress (1): 1.0/4.8 MB
Progress (1): 1.0/4.8 MB
Progress (1): 1.0/4.8 MB
Progress (1): 1.0/4.8 MB
Progress (1): 1.0/4.8 MB
Progress (1): 1.0/4.8 MB
Progress (1): 1.1/4.8 MB
Progress (1): 1.1/4.8 MB
Progress (1): 1.1/4.8 MB
Progress (1): 1.1/4.8 MB
Progress (1): 1.1/4.8 MB
Progress (1): 1.1/4.8 MB
Progress (1): 1.1/4.8 MB
Progress (1): 1.1/4.8 MB
Progress (1): 1.1/4.8 MB
Progress (1): 1.1/4.8 MB
Progress (1): 1.1/4.8 MB
Progress (1): 1.1/4.8 MB
Progress (1): 1.1/4.8 MB
Progress (1): 1.1/4.8 MB
Progress (1): 1.1/4.8 MB
Progress (1): 1.1/4.8 MB
Progress (1): 1.1/4.8 MB
Progress (1): 1.1/4.8 MB
Progress (1): 1.1/4.8 MB
Progress (1): 1.1/4.8 MB
Progress (1): 1.1/4.8 MB
Progress (1): 1.1/4.8 MB
Progress (1): 1.1/4.8 MB
Progress (1): 1.1/4.8 MB
Progress (1): 1.2/4.8 MB
Progress (1): 1.2/4.8 MB
Progress (1): 1.2/4.8 MB
Progress (1): 1.2/4.8 MB
Progress (1): 1.2/4.8 MB
Progress (1): 1.2/4.8 MB
Progress (1): 1.2/4.8 MB
Progress (1): 1.2/4.8 MB
Progress (1): 1.2/4.8 MB
Progress (1): 1.2/4.8 MB
Progress (1): 1.2/4.8 MB
Progress (1): 1.2/4.8 MB
Progress (1): 1.2/4.8 MB
Progress (1): 1.2/4.8 MB
Progress (1): 1.2/4.8 MB
Progress (1): 1.2/4.8 MB
Progress (1): 1.2/4.8 MB
Progress (1): 1.2/4.8 MB
Progress (1): 1.2/4.8 MB
Progress (1): 1.2/4.8 MB
Progress (1): 1.2/4.8 MB
Progress (1): 1.2/4.8 MB
Progress (1): 1.2/4.8 MB
Progress (1): 1.2/4.8 MB
Progress (1): 1.2/4.8 MB
Progress (1): 1.3/4.8 MB
Progress (1): 1.3/4.8 MB
Progress (1): 1.3/4.8 MB
Progress (1): 1.3/4.8 MB
Progress (1): 1.3/4.8 MB
Progress (1): 1.3/4.8 MB
Progress (1): 1.3/4.8 MB
Progress (1): 1.3/4.8 MB
Progress (1): 1.3/4.8 MB
Progress (1): 1.3/4.8 MB
Progress (1): 1.3/4.8 MB
Progress (1): 1.3/4.8 MB
Progress (1): 1.3/4.8 MB
Progress (1): 1.3/4.8 MB
Progress (1): 1.3/4.8 MB
Progress (1): 1.3/4.8 MB
Progress (1): 1.3/4.8 MB
Progress (1): 1.3/4.8 MB
Progress (1): 1.3/4.8 MB
Progress (1): 1.3/4.8 MB
Progress (1): 1.3/4.8 MB
Progress (1): 1.3/4.8 MB
Progress (1): 1.3/4.8 MB
Progress (1): 1.3/4.8 MB
Progress (1): 1.4/4.8 MB
Progress (1): 1.4/4.8 MB
Progress (1): 1.4/4.8 MB
Progress (1): 1.4/4.8 MB
Progress (1): 1.4/4.8 MB
Progress (1): 1.4/4.8 MB
Progress (1): 1.4/4.8 MB
Progress (1): 1.4/4.8 MB
Progress (1): 1.4/4.8 MB
Progress (1): 1.4/4.8 MB
Progress (1): 1.4/4.8 MB
Progress (1): 1.4/4.8 MB
Progress (1): 1.4/4.8 MB
Progress (1): 1.4/4.8 MB
Progress (1): 1.4/4.8 MB
Progress (1): 1.4/4.8 MB
Progress (1): 1.4/4.8 MB
Progress (1): 1.4/4.8 MB
Progress (1): 1.4/4.8 MB
Progress (1): 1.4/4.8 MB
Progress (1): 1.4/4.8 MB
Progress (1): 1.4/4.8 MB
Progress (1): 1.4/4.8 MB
Progress (1): 1.4/4.8 MB
Progress (1): 1.4/4.8 MB
Progress (1): 1.5/4.8 MB
Progress (1): 1.5/4.8 MB
Progress (1): 1.5/4.8 MB
Progress (1): 1.5/4.8 MB
Progress (1): 1.5/4.8 MB
Progress (1): 1.5/4.8 MB
Progress (1): 1.5/4.8 MB
Progress (1): 1.5/4.8 MB
Progress (1): 1.5/4.8 MB
Progress (1): 1.5/4.8 MB
Progress (1): 1.5/4.8 MB
Progress (1): 1.5/4.8 MB
Progress (1): 1.5/4.8 MB
Progress (1): 1.5/4.8 MB
Progress (1): 1.5/4.8 MB
Progress (1): 1.5/4.8 MB
Progress (1): 1.5/4.8 MB
Progress (1): 1.5/4.8 MB
Progress (1): 1.5/4.8 MB
Progress (1): 1.5/4.8 MB
Progress (1): 1.5/4.8 MB
Progress (1): 1.5/4.8 MB
Progress (1): 1.5/4.8 MB
Progress (1): 1.5/4.8 MB
Progress (1): 1.6/4.8 MB
Progress (1): 1.6/4.8 MB
Progress (1): 1.6/4.8 MB
Progress (1): 1.6/4.8 MB
Progress (1): 1.6/4.8 MB
Progress (1): 1.6/4.8 MB
Progress (1): 1.6/4.8 MB
Progress (1): 1.6/4.8 MB
Progress (1): 1.6/4.8 MB
Progress (1): 1.6/4.8 MB
Progress (1): 1.6/4.8 MB
Progress (1): 1.6/4.8 MB
Progress (1): 1.6/4.8 MB
Progress (1): 1.6/4.8 MB
Progress (1): 1.6/4.8 MB
Progress (1): 1.6/4.8 MB
Progress (1): 1.6/4.8 MB
Progress (1): 1.6/4.8 MB
Progress (1): 1.6/4.8 MB
Progress (1): 1.6/4.8 MB
Progress (1): 1.6/4.8 MB
Progress (1): 1.6/4.8 MB
Progress (1): 1.6/4.8 MB
Progress (1): 1.6/4.8 MB
Progress (1): 1.7/4.8 MB
Progress (1): 1.7/4.8 MB
Progress (1): 1.7/4.8 MB
Progress (1): 1.7/4.8 MB
Progress (1): 1.7/4.8 MB
Progress (1): 1.7/4.8 MB
Progress (1): 1.7/4.8 MB
Progress (1): 1.7/4.8 MB
Progress (1): 1.7/4.8 MB
Progress (1): 1.7/4.8 MB
Progress (1): 1.7/4.8 MB
Progress (1): 1.7/4.8 MB
Progress (1): 1.7/4.8 MB
Progress (1): 1.7/4.8 MB
Progress (1): 1.7/4.8 MB
Progress (1): 1.7/4.8 MB
Progress (1): 1.7/4.8 MB
Progress (1): 1.7/4.8 MB
Progress (1): 1.7/4.8 MB
Progress (1): 1.7/4.8 MB
Progress (1): 1.7/4.8 MB
Progress (1): 1.7/4.8 MB
Progress (1): 1.7/4.8 MB
Progress (1): 1.7/4.8 MB
Progress (1): 1.7/4.8 MB
Progress (1): 1.8/4.8 MB
Progress (1): 1.8/4.8 MB
Progress (1): 1.8/4.8 MB
Progress (1): 1.8/4.8 MB
Progress (1): 1.8/4.8 MB
Progress (1): 1.8/4.8 MB
Progress (1): 1.8/4.8 MB
Progress (1): 1.8/4.8 MB
Progress (1): 1.8/4.8 MB
Progress (1): 1.8/4.8 MB
Progress (1): 1.8/4.8 MB
Progress (1): 1.8/4.8 MB
Progress (1): 1.8/4.8 MB
Progress (1): 1.8/4.8 MB
Progress (1): 1.8/4.8 MB
Progress (1): 1.8/4.8 MB
Progress (1): 1.8/4.8 MB
Progress (1): 1.8/4.8 MB
Progress (1): 1.8/4.8 MB
Progress (1): 1.8/4.8 MB
Progress (1): 1.8/4.8 MB
Progress (1): 1.8/4.8 MB
Progress (1): 1.8/4.8 MB
Progress (1): 1.8/4.8 MB
Progress (1): 1.9/4.8 MB
Progress (1): 1.9/4.8 MB
Progress (1): 1.9/4.8 MB
Progress (1): 1.9/4.8 MB
Progress (1): 1.9/4.8 MB
Progress (1): 1.9/4.8 MB
Progress (1): 1.9/4.8 MB
Progress (1): 1.9/4.8 MB
Progress (1): 1.9/4.8 MB
Progress (1): 1.9/4.8 MB
Progress (1): 1.9/4.8 MB
Progress (1): 1.9/4.8 MB
Progress (1): 1.9/4.8 MB
Progress (1): 1.9/4.8 MB
Progress (1): 1.9/4.8 MB
Progress (1): 1.9/4.8 MB
Progress (1): 1.9/4.8 MB
Progress (1): 1.9/4.8 MB
Progress (1): 1.9/4.8 MB
Progress (1): 1.9/4.8 MB
Progress (1): 1.9/4.8 MB
Progress (1): 1.9/4.8 MB
Progress (1): 1.9/4.8 MB
Progress (1): 1.9/4.8 MB
Progress (1): 1.9/4.8 MB
Progress (1): 2.0/4.8 MB
Progress (1): 2.0/4.8 MB
Progress (1): 2.0/4.8 MB
Progress (1): 2.0/4.8 MB
Progress (1): 2.0/4.8 MB
Progress (1): 2.0/4.8 MB
Progress (1): 2.0/4.8 MB
Progress (1): 2.0/4.8 MB
Progress (1): 2.0/4.8 MB
Progress (1): 2.0/4.8 MB
Progress (1): 2.0/4.8 MB
Progress (1): 2.0/4.8 MB
Progress (1): 2.0/4.8 MB
Progress (1): 2.0/4.8 MB
Progress (1): 2.0/4.8 MB
Progress (1): 2.0/4.8 MB
Progress (1): 2.0/4.8 MB
Progress (1): 2.0/4.8 MB
Progress (1): 2.0/4.8 MB
Progress (1): 2.0/4.8 MB
Progress (1): 2.0/4.8 MB
Progress (1): 2.0/4.8 MB
Progress (1): 2.0/4.8 MB
Progress (1): 2.0/4.8 MB
Progress (1): 2.1/4.8 MB
Progress (1): 2.1/4.8 MB
Progress (1): 2.1/4.8 MB
Progress (1): 2.1/4.8 MB
Progress (1): 2.1/4.8 MB
Progress (1): 2.1/4.8 MB
Progress (1): 2.1/4.8 MB
Progress (1): 2.1/4.8 MB
Progress (1): 2.1/4.8 MB
Progress (1): 2.1/4.8 MB
Progress (1): 2.1/4.8 MB
Progress (1): 2.1/4.8 MB
Progress (1): 2.1/4.8 MB
Progress (1): 2.1/4.8 MB
Progress (1): 2.1/4.8 MB
Progress (1): 2.1/4.8 MB
Progress (1): 2.1/4.8 MB
Progress (1): 2.1/4.8 MB
Progress (1): 2.1/4.8 MB
Progress (1): 2.1/4.8 MB
Progress (1): 2.1/4.8 MB
Progress (1): 2.1/4.8 MB
Progress (1): 2.1/4.8 MB
Progress (1): 2.1/4.8 MB
Progress (1): 2.2/4.8 MB
Progress (1): 2.2/4.8 MB
Progress (1): 2.2/4.8 MB
Progress (1): 2.2/4.8 MB
Progress (1): 2.2/4.8 MB
Progress (1): 2.2/4.8 MB
Progress (1): 2.2/4.8 MB
Progress (1): 2.2/4.8 MB
Progress (1): 2.2/4.8 MB
Progress (1): 2.2/4.8 MB
Progress (1): 2.2/4.8 MB
Progress (1): 2.2/4.8 MB
Progress (1): 2.2/4.8 MB
Progress (1): 2.2/4.8 MB
Progress (1): 2.2/4.8 MB
Progress (1): 2.2/4.8 MB
Progress (1): 2.2/4.8 MB
Progress (1): 2.2/4.8 MB
Progress (1): 2.2/4.8 MB
Progress (1): 2.2/4.8 MB
Progress (1): 2.2/4.8 MB
Progress (1): 2.2/4.8 MB
Progress (1): 2.2/4.8 MB
Progress (1): 2.2/4.8 MB
Progress (1): 2.2/4.8 MB
Progress (1): 2.3/4.8 MB
Progress (1): 2.3/4.8 MB
Progress (1): 2.3/4.8 MB
Progress (1): 2.3/4.8 MB
Progress (1): 2.3/4.8 MB
Progress (1): 2.3/4.8 MB
Progress (1): 2.3/4.8 MB
Progress (1): 2.3/4.8 MB
Progress (1): 2.3/4.8 MB
Progress (1): 2.3/4.8 MB
Progress (1): 2.3/4.8 MB
Progress (1): 2.3/4.8 MB
Progress (1): 2.3/4.8 MB
Progress (1): 2.3/4.8 MB
Progress (1): 2.3/4.8 MB
Progress (1): 2.3/4.8 MB
Progress (1): 2.3/4.8 MB
Progress (1): 2.3/4.8 MB
Progress (1): 2.3/4.8 MB
Progress (1): 2.3/4.8 MB
Progress (1): 2.3/4.8 MB
Progress (1): 2.3/4.8 MB
Progress (1): 2.3/4.8 MB
Progress (1): 2.3/4.8 MB
Progress (1): 2.4/4.8 MB
Progress (1): 2.4/4.8 MB
Progress (1): 2.4/4.8 MB
Progress (1): 2.4/4.8 MB
Progress (1): 2.4/4.8 MB
Progress (1): 2.4/4.8 MB
Progress (1): 2.4/4.8 MB
Progress (1): 2.4/4.8 MB
Progress (1): 2.4/4.8 MB
Progress (1): 2.4/4.8 MB
Progress (1): 2.4/4.8 MB
Progress (1): 2.4/4.8 MB
Progress (1): 2.4/4.8 MB
Progress (1): 2.4/4.8 MB
Progress (1): 2.4/4.8 MB
Progress (1): 2.4/4.8 MB
Progress (1): 2.4/4.8 MB
Progress (1): 2.4/4.8 MB
Progress (1): 2.4/4.8 MB
Progress (1): 2.4/4.8 MB
Progress (1): 2.4/4.8 MB
Progress (1): 2.4/4.8 MB
Progress (1): 2.4/4.8 MB
Progress (2): 2.4/4.8 MB | 3.8/14 kB
Progress (2): 2.4/4.8 MB | 7.9/14 kB
Progress (2): 2.4/4.8 MB | 12/14 kB 
Progress (2): 2.4/4.8 MB | 14 kB   
Progress (2): 2.4/4.8 MB | 14 kB
Progress (2): 2.4/4.8 MB | 14 kB
Progress (2): 2.5/4.8 MB | 14 kB
Progress (2): 2.5/4.8 MB | 14 kB
Progress (2): 2.5/4.8 MB | 14 kB
Progress (2): 2.5/4.8 MB | 14 kB
Progress (2): 2.5/4.8 MB | 14 kB
Progress (2): 2.5/4.8 MB | 14 kB
Progress (2): 2.5/4.8 MB | 14 kB
Progress (2): 2.5/4.8 MB | 14 kB
Progress (2): 2.5/4.8 MB | 14 kB
Progress (2): 2.5/4.8 MB | 14 kB
Progress (2): 2.5/4.8 MB | 14 kB
Progress (2): 2.5/4.8 MB | 14 kB
Progress (2): 2.5/4.8 MB | 14 kB
Progress (2): 2.5/4.8 MB | 14 kB
Progress (2): 2.5/4.8 MB | 14 kB
Progress (2): 2.5/4.8 MB | 14 kB
Progress (2): 2.5/4.8 MB | 14 kB
Progress (2): 2.5/4.8 MB | 14 kB
Progress (2): 2.5/4.8 MB | 14 kB
Progress (2): 2.5/4.8 MB | 14 kB
Progress (2): 2.5/4.8 MB | 14 kB
Progress (2): 2.5/4.8 MB | 14 kB
Progress (2): 2.5/4.8 MB | 14 kB
Progress (2): 2.5/4.8 MB | 14 kB
Progress (2): 2.6/4.8 MB | 14 kB
Progress (2): 2.6/4.8 MB | 14 kB
Progress (2): 2.6/4.8 MB | 14 kB
Progress (2): 2.6/4.8 MB | 14 kB
Progress (2): 2.6/4.8 MB | 14 kB
Progress (2): 2.6/4.8 MB | 14 kB
Progress (2): 2.6/4.8 MB | 14 kB
Progress (2): 2.6/4.8 MB | 14 kB
Progress (2): 2.6/4.8 MB | 14 kB
Progress (2): 2.6/4.8 MB | 14 kB
Progress (2): 2.6/4.8 MB | 14 kB
Progress (2): 2.6/4.8 MB | 14 kB
Progress (2): 2.6/4.8 MB | 14 kB
Progress (2): 2.6/4.8 MB | 14 kB
Progress (2): 2.6/4.8 MB | 14 kB
Progress (2): 2.6/4.8 MB | 14 kB
Progress (2): 2.6/4.8 MB | 14 kB
Progress (2): 2.6/4.8 MB | 14 kB
Progress (2): 2.6/4.8 MB | 14 kB
Progress (2): 2.6/4.8 MB | 14 kB
Progress (2): 2.6/4.8 MB | 14 kB
Progress (2): 2.6/4.8 MB | 14 kB
Progress (2): 2.6/4.8 MB | 14 kB
Progress (2): 2.6/4.8 MB | 14 kB
Progress (2): 2.6/4.8 MB | 14 kB
Progress (2): 2.7/4.8 MB | 14 kB
Progress (2): 2.7/4.8 MB | 14 kB
Progress (2): 2.7/4.8 MB | 14 kB
Progress (2): 2.7/4.8 MB | 14 kB
Progress (2): 2.7/4.8 MB | 14 kB
Progress (2): 2.7/4.8 MB | 14 kB
Progress (2): 2.7/4.8 MB | 14 kB
Progress (2): 2.7/4.8 MB | 14 kB
Progress (2): 2.7/4.8 MB | 14 kB
Progress (2): 2.7/4.8 MB | 14 kB
Progress (2): 2.7/4.8 MB | 14 kB
Progress (2): 2.7/4.8 MB | 14 kB
Progress (2): 2.7/4.8 MB | 14 kB
Progress (2): 2.7/4.8 MB | 14 kB
Progress (2): 2.7/4.8 MB | 14 kB
Progress (2): 2.7/4.8 MB | 14 kB
Progress (2): 2.7/4.8 MB | 14 kB
Progress (2): 2.7/4.8 MB | 14 kB
Progress (2): 2.7/4.8 MB | 14 kB
Progress (2): 2.7/4.8 MB | 14 kB
Progress (2): 2.7/4.8 MB | 14 kB
Progress (2): 2.7/4.8 MB | 14 kB
Progress (2): 2.7/4.8 MB | 14 kB
Progress (2): 2.7/4.8 MB | 14 kB
Progress (2): 2.8/4.8 MB | 14 kB
Progress (2): 2.8/4.8 MB | 14 kB
Progress (2): 2.8/4.8 MB | 14 kB
Progress (2): 2.8/4.8 MB | 14 kB
Progress (2): 2.8/4.8 MB | 14 kB
Progress (2): 2.8/4.8 MB | 14 kB
Progress (2): 2.8/4.8 MB | 14 kB
Progress (2): 2.8/4.8 MB | 14 kB
Progress (2): 2.8/4.8 MB | 14 kB
Progress (2): 2.8/4.8 MB | 14 kB
Progress (2): 2.8/4.8 MB | 14 kB
Progress (2): 2.8/4.8 MB | 14 kB
Progress (2): 2.8/4.8 MB | 14 kB
Progress (2): 2.8/4.8 MB | 14 kB
Progress (2): 2.8/4.8 MB | 14 kB
Progress (2): 2.8/4.8 MB | 14 kB
Progress (2): 2.8/4.8 MB | 14 kB
Progress (2): 2.8/4.8 MB | 14 kB
Progress (2): 2.8/4.8 MB | 14 kB
Progress (2): 2.8/4.8 MB | 14 kB
Progress (2): 2.8/4.8 MB | 14 kB
Progress (2): 2.8/4.8 MB | 14 kB
Progress (2): 2.8/4.8 MB | 14 kB
Progress (2): 2.8/4.8 MB | 14 kB
Progress (2): 2.9/4.8 MB | 14 kB
Progress (2): 2.9/4.8 MB | 14 kB
Progress (2): 2.9/4.8 MB | 14 kB
Progress (2): 2.9/4.8 MB | 14 kB
Progress (2): 2.9/4.8 MB | 14 kB
Progress (2): 2.9/4.8 MB | 14 kB
Progress (2): 2.9/4.8 MB | 14 kB
Progress (2): 2.9/4.8 MB | 14 kB
Progress (2): 2.9/4.8 MB | 14 kB
Progress (2): 2.9/4.8 MB | 14 kB
Progress (2): 2.9/4.8 MB | 14 kB
Progress (2): 2.9/4.8 MB | 14 kB
Progress (2): 2.9/4.8 MB | 14 kB
Progress (2): 2.9/4.8 MB | 14 kB
Progress (2): 2.9/4.8 MB | 14 kB
Progress (2): 2.9/4.8 MB | 14 kB
Progress (2): 2.9/4.8 MB | 14 kB
Progress (2): 2.9/4.8 MB | 14 kB
Progress (2): 2.9/4.8 MB | 14 kB
Progress (2): 2.9/4.8 MB | 14 kB
Progress (2): 2.9/4.8 MB | 14 kB
Progress (2): 2.9/4.8 MB | 14 kB
Progress (2): 2.9/4.8 MB | 14 kB
Progress (2): 2.9/4.8 MB | 14 kB
Progress (2): 2.9/4.8 MB | 14 kB
Progress (2): 3.0/4.8 MB | 14 kB
Progress (2): 3.0/4.8 MB | 14 kB
Progress (2): 3.0/4.8 MB | 14 kB
Progress (2): 3.0/4.8 MB | 14 kB
Progress (2): 3.0/4.8 MB | 14 kB
Progress (2): 3.0/4.8 MB | 14 kB
Progress (2): 3.0/4.8 MB | 14 kB
Progress (2): 3.0/4.8 MB | 14 kB
Progress (2): 3.0/4.8 MB | 14 kB
Progress (2): 3.0/4.8 MB | 14 kB
Progress (2): 3.0/4.8 MB | 14 kB
Progress (2): 3.0/4.8 MB | 14 kB
Progress (2): 3.0/4.8 MB | 14 kB
Progress (2): 3.0/4.8 MB | 14 kB
Progress (2): 3.0/4.8 MB | 14 kB
Progress (2): 3.0/4.8 MB | 14 kB
Progress (2): 3.0/4.8 MB | 14 kB
Progress (2): 3.0/4.8 MB | 14 kB
Progress (2): 3.0/4.8 MB | 14 kB
Progress (2): 3.0/4.8 MB | 14 kB
Progress (2): 3.0/4.8 MB | 14 kB
Progress (2): 3.0/4.8 MB | 14 kB
Progress (2): 3.0/4.8 MB | 14 kB
Progress (2): 3.0/4.8 MB | 14 kB
Progress (2): 3.1/4.8 MB | 14 kB
Progress (2): 3.1/4.8 MB | 14 kB
Progress (2): 3.1/4.8 MB | 14 kB
Progress (2): 3.1/4.8 MB | 14 kB
Progress (2): 3.1/4.8 MB | 14 kB
Progress (2): 3.1/4.8 MB | 14 kB
Progress (2): 3.1/4.8 MB | 14 kB
Progress (2): 3.1/4.8 MB | 14 kB
Progress (2): 3.1/4.8 MB | 14 kB
Progress (2): 3.1/4.8 MB | 14 kB
Progress (2): 3.1/4.8 MB | 14 kB
Progress (2): 3.1/4.8 MB | 14 kB
Progress (2): 3.1/4.8 MB | 14 kB
Progress (2): 3.1/4.8 MB | 14 kB
Progress (2): 3.1/4.8 MB | 14 kB
Progress (2): 3.1/4.8 MB | 14 kB
Progress (2): 3.1/4.8 MB | 14 kB
Progress (2): 3.1/4.8 MB | 14 kB
Progress (2): 3.1/4.8 MB | 14 kB
Progress (2): 3.1/4.8 MB | 14 kB
Progress (2): 3.1/4.8 MB | 14 kB
Progress (2): 3.1/4.8 MB | 14 kB
Progress (2): 3.1/4.8 MB | 14 kB
Progress (2): 3.1/4.8 MB | 14 kB
Progress (2): 3.1/4.8 MB | 14 kB
Progress (2): 3.2/4.8 MB | 14 kB
Progress (2): 3.2/4.8 MB | 14 kB
Progress (2): 3.2/4.8 MB | 14 kB
Progress (2): 3.2/4.8 MB | 14 kB
Progress (2): 3.2/4.8 MB | 14 kB
Progress (2): 3.2/4.8 MB | 14 kB
Progress (2): 3.2/4.8 MB | 14 kB
Progress (2): 3.2/4.8 MB | 14 kB
Progress (2): 3.2/4.8 MB | 14 kB
Progress (2): 3.2/4.8 MB | 14 kB
Progress (2): 3.2/4.8 MB | 14 kB
Progress (2): 3.2/4.8 MB | 14 kB
Progress (2): 3.2/4.8 MB | 14 kB
Progress (2): 3.2/4.8 MB | 14 kB
Progress (2): 3.2/4.8 MB | 14 kB
Progress (2): 3.2/4.8 MB | 14 kB
Progress (2): 3.2/4.8 MB | 14 kB
Progress (2): 3.2/4.8 MB | 14 kB
Progress (2): 3.2/4.8 MB | 14 kB
Progress (2): 3.2/4.8 MB | 14 kB
Progress (2): 3.2/4.8 MB | 14 kB
Progress (2): 3.2/4.8 MB | 14 kB
Progress (2): 3.2/4.8 MB | 14 kB
Progress (2): 3.2/4.8 MB | 14 kB
Progress (2): 3.3/4.8 MB | 14 kB
Progress (2): 3.3/4.8 MB | 14 kB
Progress (2): 3.3/4.8 MB | 14 kB
Progress (2): 3.3/4.8 MB | 14 kB
Progress (2): 3.3/4.8 MB | 14 kB
Progress (2): 3.3/4.8 MB | 14 kB
Progress (2): 3.3/4.8 MB | 14 kB
Progress (2): 3.3/4.8 MB | 14 kB
Progress (2): 3.3/4.8 MB | 14 kB
Progress (2): 3.3/4.8 MB | 14 kB
Progress (2): 3.3/4.8 MB | 14 kB
Progress (2): 3.3/4.8 MB | 14 kB
Progress (2): 3.3/4.8 MB | 14 kB
Progress (2): 3.3/4.8 MB | 14 kB
Progress (2): 3.3/4.8 MB | 14 kB
Progress (2): 3.3/4.8 MB | 14 kB
Progress (2): 3.3/4.8 MB | 14 kB
Progress (2): 3.3/4.8 MB | 14 kB
Progress (2): 3.3/4.8 MB | 14 kB
Progress (2): 3.3/4.8 MB | 14 kB
Progress (2): 3.3/4.8 MB | 14 kB
Progress (2): 3.3/4.8 MB | 14 kB
Progress (2): 3.3/4.8 MB | 14 kB
Progress (2): 3.3/4.8 MB | 14 kB
Progress (2): 3.4/4.8 MB | 14 kB
Progress (2): 3.4/4.8 MB | 14 kB
Progress (2): 3.4/4.8 MB | 14 kB
Progress (2): 3.4/4.8 MB | 14 kB
Progress (2): 3.4/4.8 MB | 14 kB
Progress (2): 3.4/4.8 MB | 14 kB
Progress (2): 3.4/4.8 MB | 14 kB
Progress (2): 3.4/4.8 MB | 14 kB
Progress (2): 3.4/4.8 MB | 14 kB
Progress (2): 3.4/4.8 MB | 14 kB
Progress (2): 3.4/4.8 MB | 14 kB
Progress (2): 3.4/4.8 MB | 14 kB
Progress (2): 3.4/4.8 MB | 14 kB
Progress (2): 3.4/4.8 MB | 14 kB
Progress (2): 3.4/4.8 MB | 14 kB
Progress (2): 3.4/4.8 MB | 14 kB
Progress (2): 3.4/4.8 MB | 14 kB
Progress (2): 3.4/4.8 MB | 14 kB
Progress (2): 3.4/4.8 MB | 14 kB
Progress (2): 3.4/4.8 MB | 14 kB
Progress (2): 3.4/4.8 MB | 14 kB
Progress (2): 3.4/4.8 MB | 14 kB
Progress (2): 3.4/4.8 MB | 14 kB
Progress (2): 3.4/4.8 MB | 14 kB
Progress (2): 3.4/4.8 MB | 14 kB
Progress (2): 3.5/4.8 MB | 14 kB
Progress (2): 3.5/4.8 MB | 14 kB
Progress (2): 3.5/4.8 MB | 14 kB
Progress (2): 3.5/4.8 MB | 14 kB
Progress (2): 3.5/4.8 MB | 14 kB
Progress (2): 3.5/4.8 MB | 14 kB
Progress (2): 3.5/4.8 MB | 14 kB
Progress (2): 3.5/4.8 MB | 14 kB
Progress (2): 3.5/4.8 MB | 14 kB
Progress (2): 3.5/4.8 MB | 14 kB
Progress (2): 3.5/4.8 MB | 14 kB
Progress (2): 3.5/4.8 MB | 14 kB
Progress (2): 3.5/4.8 MB | 14 kB
Progress (2): 3.5/4.8 MB | 14 kB
Progress (2): 3.5/4.8 MB | 14 kB
Progress (2): 3.5/4.8 MB | 14 kB
Progress (2): 3.5/4.8 MB | 14 kB
Progress (2): 3.5/4.8 MB | 14 kB
Progress (2): 3.5/4.8 MB | 14 kB
Progress (2): 3.5/4.8 MB | 14 kB
Progress (2): 3.5/4.8 MB | 14 kB
Progress (2): 3.5/4.8 MB | 14 kB
                                
Downloaded from sonatype: https://oss.sonatype.org/content/groups/public/org/eclipse/tycho/tycho-compiler-jdt/0.20.0/tycho-compiler-jdt-0.20.0.jar (14 kB at 20 kB/s)
Progress (1): 3.5/4.8 MB
Progress (1): 3.5/4.8 MB
Progress (1): 3.6/4.8 MB
Progress (1): 3.6/4.8 MB
Progress (1): 3.6/4.8 MB
Progress (1): 3.6/4.8 MB
Progress (1): 3.6/4.8 MB
Progress (1): 3.6/4.8 MB
Progress (1): 3.6/4.8 MB
Progress (1): 3.6/4.8 MB
Progress (1): 3.6/4.8 MB
Progress (1): 3.6/4.8 MB
Progress (1): 3.6/4.8 MB
Progress (1): 3.6/4.8 MB
Progress (1): 3.6/4.8 MB
Progress (1): 3.6/4.8 MB
Progress (1): 3.6/4.8 MB
Progress (1): 3.6/4.8 MB
Progress (1): 3.6/4.8 MB
Progress (1): 3.6/4.8 MB
Progress (1): 3.6/4.8 MB
Progress (1): 3.6/4.8 MB
Progress (1): 3.6/4.8 MB
Progress (1): 3.6/4.8 MB
Progress (1): 3.6/4.8 MB
Progress (1): 3.6/4.8 MB
Progress (1): 3.6/4.8 MB
Progress (1): 3.7/4.8 MB
Progress (1): 3.7/4.8 MB
Progress (1): 3.7/4.8 MB
Progress (1): 3.7/4.8 MB
Progress (1): 3.7/4.8 MB
Progress (1): 3.7/4.8 MB
Progress (1): 3.7/4.8 MB
Progress (1): 3.7/4.8 MB
Progress (1): 3.7/4.8 MB
Progress (1): 3.7/4.8 MB
Progress (1): 3.7/4.8 MB
Progress (1): 3.7/4.8 MB
Progress (1): 3.7/4.8 MB
Progress (1): 3.7/4.8 MB
Progress (1): 3.7/4.8 MB
Progress (1): 3.7/4.8 MB
Progress (1): 3.7/4.8 MB
Progress (1): 3.7/4.8 MB
Progress (1): 3.7/4.8 MB
Progress (1): 3.7/4.8 MB
Progress (1): 3.7/4.8 MB
Progress (1): 3.7/4.8 MB
Progress (1): 3.7/4.8 MB
Progress (1): 3.7/4.8 MB
Progress (1): 3.8/4.8 MB
Progress (1): 3.8/4.8 MB
Progress (1): 3.8/4.8 MB
Progress (1): 3.8/4.8 MB
Progress (1): 3.8/4.8 MB
Progress (1): 3.8/4.8 MB
Progress (1): 3.8/4.8 MB
Progress (1): 3.8/4.8 MB
Progress (1): 3.8/4.8 MB
Progress (1): 3.8/4.8 MB
Progress (1): 3.8/4.8 MB
Progress (1): 3.8/4.8 MB
Progress (1): 3.8/4.8 MB
Progress (1): 3.8/4.8 MB
Progress (1): 3.8/4.8 MB
Progress (1): 3.8/4.8 MB
Progress (1): 3.8/4.8 MB
Progress (1): 3.8/4.8 MB
Progress (1): 3.8/4.8 MB
Progress (1): 3.8/4.8 MB
Progress (1): 3.8/4.8 MB
Progress (1): 3.8/4.8 MB
Progress (1): 3.8/4.8 MB
Progress (1): 3.8/4.8 MB
Progress (1): 3.8/4.8 MB
Progress (1): 3.9/4.8 MB
Progress (1): 3.9/4.8 MB
Progress (1): 3.9/4.8 MB
Progress (1): 3.9/4.8 MB
Progress (1): 3.9/4.8 MB
Progress (1): 3.9/4.8 MB
Progress (1): 3.9/4.8 MB
Progress (1): 3.9/4.8 MB
Progress (1): 3.9/4.8 MB
Progress (1): 3.9/4.8 MB
Progress (1): 3.9/4.8 MB
Progress (1): 3.9/4.8 MB
Progress (1): 3.9/4.8 MB
Progress (1): 3.9/4.8 MB
Progress (1): 3.9/4.8 MB
Progress (1): 3.9/4.8 MB
Progress (1): 3.9/4.8 MB
Progress (1): 3.9/4.8 MB
Progress (1): 3.9/4.8 MB
Progress (1): 3.9/4.8 MB
Progress (1): 3.9/4.8 MB
Progress (1): 3.9/4.8 MB
Progress (1): 3.9/4.8 MB
Progress (1): 3.9/4.8 MB
Progress (1): 4.0/4.8 MB
Progress (1): 4.0/4.8 MB
Progress (1): 4.0/4.8 MB
Progress (1): 4.0/4.8 MB
Progress (1): 4.0/4.8 MB
Progress (1): 4.0/4.8 MB
Progress (1): 4.0/4.8 MB
Progress (1): 4.0/4.8 MB
Progress (1): 4.0/4.8 MB
Progress (1): 4.0/4.8 MB
Progress (1): 4.0/4.8 MB
Progress (1): 4.0/4.8 MB
Progress (1): 4.0/4.8 MB
Progress (1): 4.0/4.8 MB
Progress (1): 4.0/4.8 MB
Progress (1): 4.0/4.8 MB
Progress (1): 4.0/4.8 MB
Progress (1): 4.0/4.8 MB
Progress (1): 4.0/4.8 MB
Progress (1): 4.0/4.8 MB
Progress (1): 4.0/4.8 MB
Progress (1): 4.0/4.8 MB
Progress (1): 4.0/4.8 MB
Progress (1): 4.0/4.8 MB
Progress (1): 4.1/4.8 MB
Progress (1): 4.1/4.8 MB
Progress (1): 4.1/4.8 MB
Progress (1): 4.1/4.8 MB
Progress (1): 4.1/4.8 MB
Progress (1): 4.1/4.8 MB
Progress (1): 4.1/4.8 MB
Progress (1): 4.1/4.8 MB
Progress (1): 4.1/4.8 MB
Progress (1): 4.1/4.8 MB
Progress (1): 4.1/4.8 MB
Progress (1): 4.1/4.8 MB
Progress (1): 4.1/4.8 MB
Progress (1): 4.1/4.8 MB
Progress (1): 4.1/4.8 MB
Progress (1): 4.1/4.8 MB
Progress (1): 4.1/4.8 MB
Progress (1): 4.1/4.8 MB
Progress (1): 4.1/4.8 MB
Progress (1): 4.1/4.8 MB
Progress (1): 4.1/4.8 MB
Progress (1): 4.1/4.8 MB
Progress (1): 4.1/4.8 MB
Progress (1): 4.1/4.8 MB
Progress (1): 4.1/4.8 MB
Progress (1): 4.2/4.8 MB
Progress (1): 4.2/4.8 MB
Progress (1): 4.2/4.8 MB
Progress (1): 4.2/4.8 MB
Progress (1): 4.2/4.8 MB
Progress (1): 4.2/4.8 MB
Progress (1): 4.2/4.8 MB
Progress (1): 4.2/4.8 MB
Progress (1): 4.2/4.8 MB
Progress (1): 4.2/4.8 MB
Progress (1): 4.2/4.8 MB
Progress (1): 4.2/4.8 MB
Progress (1): 4.2/4.8 MB
Progress (1): 4.2/4.8 MB
Progress (1): 4.2/4.8 MB
Progress (1): 4.2/4.8 MB
Progress (1): 4.2/4.8 MB
Progress (1): 4.2/4.8 MB
Progress (1): 4.2/4.8 MB
Progress (1): 4.2/4.8 MB
Progress (1): 4.2/4.8 MB
Progress (1): 4.2/4.8 MB
Progress (1): 4.2/4.8 MB
Progress (1): 4.2/4.8 MB
Progress (1): 4.3/4.8 MB
Progress (1): 4.3/4.8 MB
Progress (1): 4.3/4.8 MB
Progress (1): 4.3/4.8 MB
Progress (1): 4.3/4.8 MB
Progress (1): 4.3/4.8 MB
Progress (1): 4.3/4.8 MB
Progress (1): 4.3/4.8 MB
Progress (1): 4.3/4.8 MB
Progress (1): 4.3/4.8 MB
Progress (1): 4.3/4.8 MB
Progress (1): 4.3/4.8 MB
Progress (1): 4.3/4.8 MB
Progress (1): 4.3/4.8 MB
Progress (1): 4.3/4.8 MB
Progress (1): 4.3/4.8 MB
Progress (1): 4.3/4.8 MB
Progress (1): 4.3/4.8 MB
Progress (1): 4.3/4.8 MB
Progress (1): 4.3/4.8 MB
Progress (1): 4.3/4.8 MB
Progress (1): 4.3/4.8 MB
Progress (1): 4.3/4.8 MB
Progress (1): 4.3/4.8 MB
Progress (1): 4.3/4.8 MB
Progress (1): 4.4/4.8 MB
Progress (1): 4.4/4.8 MB
Progress (1): 4.4/4.8 MB
Progress (1): 4.4/4.8 MB
Progress (1): 4.4/4.8 MB
Progress (1): 4.4/4.8 MB
Progress (1): 4.4/4.8 MB
Progress (1): 4.4/4.8 MB
Progress (1): 4.4/4.8 MB
Progress (1): 4.4/4.8 MB
Progress (1): 4.4/4.8 MB
Progress (1): 4.4/4.8 MB
Progress (1): 4.4/4.8 MB
Progress (1): 4.4/4.8 MB
Progress (1): 4.4/4.8 MB
Progress (1): 4.4/4.8 MB
Progress (1): 4.4/4.8 MB
Progress (1): 4.4/4.8 MB
Progress (1): 4.4/4.8 MB
Progress (1): 4.4/4.8 MB
Progress (1): 4.4/4.8 MB
Progress (1): 4.4/4.8 MB
Progress (1): 4.4/4.8 MB
Progress (1): 4.4/4.8 MB
Progress (1): 4.5/4.8 MB
Progress (1): 4.5/4.8 MB
Progress (1): 4.5/4.8 MB
Progress (1): 4.5/4.8 MB
Progress (1): 4.5/4.8 MB
Progress (1): 4.5/4.8 MB
Progress (1): 4.5/4.8 MB
Progress (1): 4.5/4.8 MB
Progress (1): 4.5/4.8 MB
Progress (1): 4.5/4.8 MB
Progress (1): 4.5/4.8 MB
Progress (1): 4.5/4.8 MB
Progress (1): 4.5/4.8 MB
Progress (1): 4.5/4.8 MB
Progress (1): 4.5/4.8 MB
Progress (1): 4.5/4.8 MB
Progress (1): 4.5/4.8 MB
Progress (1): 4.5/4.8 MB
Progress (1): 4.5/4.8 MB
Progress (1): 4.5/4.8 MB
Progress (1): 4.5/4.8 MB
Progress (1): 4.5/4.8 MB
Progress (1): 4.5/4.8 MB
Progress (1): 4.5/4.8 MB
Progress (1): 4.6/4.8 MB
Progress (1): 4.6/4.8 MB
Progress (1): 4.6/4.8 MB
Progress (1): 4.6/4.8 MB
Progress (1): 4.6/4.8 MB
Progress (1): 4.6/4.8 MB
Progress (1): 4.6/4.8 MB
Progress (1): 4.6/4.8 MB
Progress (1): 4.6/4.8 MB
Progress (1): 4.6/4.8 MB
Progress (1): 4.6/4.8 MB
Progress (1): 4.6/4.8 MB
Progress (1): 4.6/4.8 MB
Progress (1): 4.6/4.8 MB
Progress (1): 4.6/4.8 MB
Progress (1): 4.6/4.8 MB
Progress (1): 4.6/4.8 MB
Progress (1): 4.6/4.8 MB
Progress (1): 4.6/4.8 MB
Progress (1): 4.6/4.8 MB
Progress (1): 4.6/4.8 MB
Progress (1): 4.6/4.8 MB
Progress (1): 4.6/4.8 MB
Progress (1): 4.6/4.8 MB
Progress (1): 4.6/4.8 MB
Progress (1): 4.7/4.8 MB
Progress (1): 4.7/4.8 MB
Progress (1): 4.7/4.8 MB
Progress (1): 4.7/4.8 MB
Progress (1): 4.7/4.8 MB
Progress (1): 4.7/4.8 MB
Progress (1): 4.7/4.8 MB
Progress (1): 4.7/4.8 MB
Progress (1): 4.7/4.8 MB
Progress (1): 4.7/4.8 MB
Progress (1): 4.7/4.8 MB
Progress (1): 4.7/4.8 MB
Progress (1): 4.7/4.8 MB
Progress (1): 4.7/4.8 MB
Progress (1): 4.7/4.8 MB
Progress (1): 4.7/4.8 MB
Progress (1): 4.7/4.8 MB
Progress (1): 4.7/4.8 MB
Progress (1): 4.7/4.8 MB
Progress (1): 4.7/4.8 MB
Progress (1): 4.7/4.8 MB
Progress (1): 4.7/4.8 MB
Progress (1): 4.7/4.8 MB
Progress (1): 4.7/4.8 MB
Progress (1): 4.8/4.8 MB
Progress (1): 4.8/4.8 MB
Progress (1): 4.8/4.8 MB
Progress (1): 4.8/4.8 MB
Progress (1): 4.8/4.8 MB
Progress (1): 4.8/4.8 MB
Progress (1): 4.8/4.8 MB
Progress (1): 4.8/4.8 MB
Progress (1): 4.8/4.8 MB
Progress (1): 4.8/4.8 MB
Progress (1): 4.8/4.8 MB
Progress (1): 4.8/4.8 MB
Progress (1): 4.8/4.8 MB
Progress (1): 4.8/4.8 MB
Progress (1): 4.8/4.8 MB
Progress (1): 4.8/4.8 MB
Progress (1): 4.8/4.8 MB
Progress (1): 4.8/4.8 MB
Progress (1): 4.8/4.8 MB
Progress (1): 4.8/4.8 MB
Progress (1): 4.8/4.8 MB
Progress (1): 4.8/4.8 MB
Progress (1): 4.8/4.8 MB
Progress (1): 4.8/4.8 MB
Progress (1): 4.8/4.8 MB
Progress (1): 4.8 MB    
                    
Downloaded from sonatype: https://oss.sonatype.org/content/groups/public/org/eclipse/tycho/org.eclipse.jdt.core/3.9.1.v20130905-0837/org.eclipse.jdt.core-3.9.1.v20130905-0837.jar (4.8 MB at 4.0 MB/s)
Downloading from eclipse.maven.central.mirror: https://repo.eclipse.org/content/repositories/maven_central/org/apache/maven/wagon/wagon-provider-api/1.0-beta-6/wagon-provider-api-1.0-beta-6.jar
Downloading from eclipse.maven.central.mirror: https://repo.eclipse.org/content/repositories/maven_central/org/codehaus/plexus/plexus-compiler-manager/2.2/plexus-compiler-manager-2.2.jar
Downloading from eclipse.maven.central.mirror: https://repo.eclipse.org/content/repositories/maven_central/org/apache/maven/maven-compat/3.0/maven-compat-3.0.jar
Downloading from eclipse.maven.central.mirror: https://repo.eclipse.org/content/repositories/maven_central/org/codehaus/plexus/plexus-compiler-api/2.2/plexus-compiler-api-2.2.jar
Progress (1): 4.1/4.6 kB
Progress (1): 4.6 kB    
Progress (2): 4.6 kB | 4.1/285 kB
Progress (2): 4.6 kB | 7.7/285 kB
Progress (2): 4.6 kB | 12/285 kB 
Progress (2): 4.6 kB | 16/285 kB
Progress (2): 4.6 kB | 20/285 kB
Progress (2): 4.6 kB | 24/285 kB
Progress (2): 4.6 kB | 28/285 kB
Progress (2): 4.6 kB | 32/285 kB
Progress (2): 4.6 kB | 36/285 kB
Progress (2): 4.6 kB | 40/285 kB
Progress (2): 4.6 kB | 44/285 kB
Progress (2): 4.6 kB | 48/285 kB
Progress (2): 4.6 kB | 52/285 kB
Progress (2): 4.6 kB | 56/285 kB
Progress (2): 4.6 kB | 60/285 kB
Progress (2): 4.6 kB | 64/285 kB
Progress (2): 4.6 kB | 66/285 kB
Progress (2): 4.6 kB | 70/285 kB
Progress (2): 4.6 kB | 74/285 kB
Progress (2): 4.6 kB | 78/285 kB
Progress (2): 4.6 kB | 82/285 kB
Progress (2): 4.6 kB | 86/285 kB
Progress (2): 4.6 kB | 90/285 kB
Progress (2): 4.6 kB | 94/285 kB
Progress (2): 4.6 kB | 98/285 kB
Progress (2): 4.6 kB | 102/285 kB
Progress (2): 4.6 kB | 106/285 kB
Progress (2): 4.6 kB | 110/285 kB
Progress (2): 4.6 kB | 114/285 kB
Progress (2): 4.6 kB | 118/285 kB
Progress (2): 4.6 kB | 122/285 kB
Progress (2): 4.6 kB | 126/285 kB
Progress (2): 4.6 kB | 130/285 kB
Progress (2): 4.6 kB | 134/285 kB
Progress (2): 4.6 kB | 138/285 kB
Progress (2): 4.6 kB | 142/285 kB
Progress (2): 4.6 kB | 146/285 kB
Progress (2): 4.6 kB | 150/285 kB
Progress (2): 4.6 kB | 154/285 kB
Progress (2): 4.6 kB | 158/285 kB
Progress (2): 4.6 kB | 162/285 kB
Progress (2): 4.6 kB | 164/285 kB
Progress (2): 4.6 kB | 168/285 kB
Progress (2): 4.6 kB | 172/285 kB
Progress (2): 4.6 kB | 176/285 kB
Progress (2): 4.6 kB | 180/285 kB
Progress (2): 4.6 kB | 184/285 kB
Progress (2): 4.6 kB | 188/285 kB
Progress (2): 4.6 kB | 192/285 kB
Progress (2): 4.6 kB | 196/285 kB
Progress (2): 4.6 kB | 197/285 kB
Progress (2): 4.6 kB | 201/285 kB
Progress (2): 4.6 kB | 205/285 kB
Progress (2): 4.6 kB | 209/285 kB
Progress (2): 4.6 kB | 213/285 kB
Progress (2): 4.6 kB | 217/285 kB
Progress (2): 4.6 kB | 221/285 kB
Progress (2): 4.6 kB | 225/285 kB
Progress (2): 4.6 kB | 229/285 kB
Progress (2): 4.6 kB | 229/285 kB
Progress (2): 4.6 kB | 233/285 kB
Progress (2): 4.6 kB | 237/285 kB
Progress (2): 4.6 kB | 241/285 kB
Progress (2): 4.6 kB | 245/285 kB
                                 
Downloaded from eclipse.maven.central.mirror: https://repo.eclipse.org/content/repositories/maven_central/org/codehaus/plexus/plexus-compiler-manager/2.2/plexus-compiler-manager-2.2.jar (4.6 kB at 117 kB/s)
Progress (1): 249/285 kB
Progress (1): 253/285 kB
Progress (1): 257/285 kB
Progress (1): 261/285 kB
Progress (1): 265/285 kB
Progress (1): 269/285 kB
Progress (1): 273/285 kB
Progress (1): 277/285 kB
Progress (1): 281/285 kB
Progress (1): 285 kB    
                    
Downloaded from eclipse.maven.central.mirror: https://repo.eclipse.org/content/repositories/maven_central/org/apache/maven/maven-compat/3.0/maven-compat-3.0.jar (285 kB at 478 kB/s)
Progress (1): 4.1/25 kB
Progress (1): 7.7/25 kB
Progress (1): 12/25 kB 
Progress (1): 16/25 kB
Progress (1): 20/25 kB
Progress (1): 24/25 kB
Progress (1): 25 kB   
Progress (2): 25 kB | 4.1/53 kB
Progress (2): 25 kB | 7.7/53 kB
Progress (2): 25 kB | 12/53 kB 
Progress (2): 25 kB | 16/53 kB
Progress (2): 25 kB | 20/53 kB
Progress (2): 25 kB | 24/53 kB
Progress (2): 25 kB | 28/53 kB
Progress (2): 25 kB | 32/53 kB
Progress (2): 25 kB | 36/53 kB
Progress (2): 25 kB | 40/53 kB
Progress (2): 25 kB | 44/53 kB
Progress (2): 25 kB | 48/53 kB
Progress (2): 25 kB | 52/53 kB
Progress (2): 25 kB | 53 kB   
                           
Downloaded from eclipse.maven.central.mirror: https://repo.eclipse.org/content/repositories/maven_central/org/codehaus/plexus/plexus-compiler-api/2.2/plexus-compiler-api-2.2.jar (25 kB at 32 kB/s)
Downloaded from eclipse.maven.central.mirror: https://repo.eclipse.org/content/repositories/maven_central/org/apache/maven/wagon/wagon-provider-api/1.0-beta-6/wagon-provider-api-1.0-beta-6.jar (53 kB at 67 kB/s)
[INFO] 
[INFO] --- maven-resources-plugin:2.6:testResources (default-testResources) @ org.eclipse.dstore.doc.isv ---
[INFO] Using 'UTF-8' encoding to copy filtered resources.
[INFO] skip non existing resourceDirectory /jobs/genie.tm/tm-3.7-maintenance/workspace/rse/doc/org.eclipse.dstore.doc.isv/src/test/resources
[INFO] 
[INFO] --- tycho-source-plugin:0.20.0:plugin-source (plugin-source) @ org.eclipse.dstore.doc.isv ---
[INFO] Building jar: /jobs/genie.tm/tm-3.7-maintenance/workspace/rse/doc/org.eclipse.dstore.doc.isv/target/org.eclipse.dstore.doc.isv-3.4.0-SNAPSHOT-sources.jar
[INFO] 
[INFO] --- tycho-packaging-plugin:0.20.0:package-plugin (default-package-plugin) @ org.eclipse.dstore.doc.isv ---
[WARNING] /jobs/genie.tm/tm-3.7-maintenance/workspace/rse/doc/org.eclipse.dstore.doc.isv/build.properties: bin.includes value(s) [index/] do not match any files.
[INFO] Building jar: /jobs/genie.tm/tm-3.7-maintenance/workspace/rse/doc/org.eclipse.dstore.doc.isv/target/org.eclipse.dstore.doc.isv-3.4.0-SNAPSHOT.jar
[INFO] 
[INFO] --- tycho-p2-plugin:0.20.0:p2-metadata-default (default-p2-metadata-default) @ org.eclipse.dstore.doc.isv ---
[INFO] 
[INFO] --- tycho-pack200a-plugin:0.20.0:normalize (pack200-normalize) @ org.eclipse.dstore.doc.isv ---
[INFO] Pack200 normalizing jar /jobs/genie.tm/tm-3.7-maintenance/workspace/rse/doc/org.eclipse.dstore.doc.isv/target/org.eclipse.dstore.doc.isv-3.4.0-SNAPSHOT.jar
[INFO] 
[INFO] --- eclipse-jarsigner-plugin:1.0.5:sign (sign) @ org.eclipse.dstore.doc.isv ---
[INFO] Searching org.eclipse.dstore.doc.isv-3.4.0-SNAPSHOT.jar for inner jars...
[INFO] Signed org.eclipse.tm:org.eclipse.dstore.doc.isv:eclipse-plugin:3.4.0-SNAPSHOT in 5 seconds.
[INFO] Searching org.eclipse.dstore.doc.isv-3.4.0-SNAPSHOT-sources.jar for inner jars...
[INFO] Signed org.eclipse.tm:org.eclipse.dstore.doc.isv:java-source:sources:3.4.0-SNAPSHOT in 1 seconds.
[INFO] 
[INFO] --- tycho-pack200b-plugin:0.20.0:pack (pack200-pack) @ org.eclipse.dstore.doc.isv ---
[INFO] Pack200 packing jar /jobs/genie.tm/tm-3.7-maintenance/workspace/rse/doc/org.eclipse.dstore.doc.isv/target/org.eclipse.dstore.doc.isv-3.4.0-SNAPSHOT.jar
[INFO] 
[INFO] --- tycho-p2-plugin:0.20.0:p2-metadata (p2-metadata) @ org.eclipse.dstore.doc.isv ---
[INFO] 
[INFO] --- maven-install-plugin:2.3.1:install (default-install) @ org.eclipse.dstore.doc.isv ---
[INFO] Installing /jobs/genie.tm/tm-3.7-maintenance/workspace/rse/doc/org.eclipse.dstore.doc.isv/target/org.eclipse.dstore.doc.isv-3.4.0-SNAPSHOT.jar to /home/hudson/genie.tm/.jenkins/jobs/tm-3.7-maintenance/workspace/.repository/org/eclipse/tm/org.eclipse.dstore.doc.isv/3.4.0-SNAPSHOT/org.eclipse.dstore.doc.isv-3.4.0-SNAPSHOT.jar
[INFO] Installing /jobs/genie.tm/tm-3.7-maintenance/workspace/rse/doc/org.eclipse.dstore.doc.isv/pom.xml to /home/hudson/genie.tm/.jenkins/jobs/tm-3.7-maintenance/workspace/.repository/org/eclipse/tm/org.eclipse.dstore.doc.isv/3.4.0-SNAPSHOT/org.eclipse.dstore.doc.isv-3.4.0-SNAPSHOT.pom
[INFO] Installing /jobs/genie.tm/tm-3.7-maintenance/workspace/rse/doc/org.eclipse.dstore.doc.isv/target/org.eclipse.dstore.doc.isv-3.4.0-SNAPSHOT-sources.jar to /home/hudson/genie.tm/.jenkins/jobs/tm-3.7-maintenance/workspace/.repository/org/eclipse/tm/org.eclipse.dstore.doc.isv/3.4.0-SNAPSHOT/org.eclipse.dstore.doc.isv-3.4.0-SNAPSHOT-sources.jar
[INFO] Installing /jobs/genie.tm/tm-3.7-maintenance/workspace/rse/doc/org.eclipse.dstore.doc.isv/target/org.eclipse.dstore.doc.isv-3.4.0-SNAPSHOT.jar.pack.gz to /home/hudson/genie.tm/.jenkins/jobs/tm-3.7-maintenance/workspace/.repository/org/eclipse/tm/org.eclipse.dstore.doc.isv/3.4.0-SNAPSHOT/org.eclipse.dstore.doc.isv-3.4.0-SNAPSHOT-pack200.jar.pack.gz
[INFO] Installing /jobs/genie.tm/tm-3.7-maintenance/workspace/rse/doc/org.eclipse.dstore.doc.isv/target/p2content.xml to /home/hudson/genie.tm/.jenkins/jobs/tm-3.7-maintenance/workspace/.repository/org/eclipse/tm/org.eclipse.dstore.doc.isv/3.4.0-SNAPSHOT/org.eclipse.dstore.doc.isv-3.4.0-SNAPSHOT-p2metadata.xml
[INFO] Installing /jobs/genie.tm/tm-3.7-maintenance/workspace/rse/doc/org.eclipse.dstore.doc.isv/target/p2artifacts.xml to /home/hudson/genie.tm/.jenkins/jobs/tm-3.7-maintenance/workspace/.repository/org/eclipse/tm/org.eclipse.dstore.doc.isv/3.4.0-SNAPSHOT/org.eclipse.dstore.doc.isv-3.4.0-SNAPSHOT-p2artifacts.xml
[INFO] 
[INFO] --- tycho-p2-plugin:0.20.0:update-local-index (default-update-local-index) @ org.eclipse.dstore.doc.isv ---
[INFO] 
[INFO] ------------------------------------------------------------------------
[INFO] Building org.eclipse.rse.doc.isv 3.4.0-SNAPSHOT
[INFO] ------------------------------------------------------------------------
[INFO] 
[INFO] --- maven-clean-plugin:2.5:clean (default-clean) @ org.eclipse.rse.doc.isv ---
[INFO] 
[INFO] --- tycho-packaging-plugin:0.20.0:build-qualifier (default-build-qualifier) @ org.eclipse.rse.doc.isv ---
[INFO] The project's OSGi version is 3.4.0.201403101646
[INFO] 
[INFO] --- tycho-packaging-plugin:0.20.0:validate-id (default-validate-id) @ org.eclipse.rse.doc.isv ---
[INFO] 
[INFO] --- tycho-packaging-plugin:0.20.0:validate-version (default-validate-version) @ org.eclipse.rse.doc.isv ---
[INFO] 
[INFO] --- maven-resources-plugin:2.6:resources (default-resources) @ org.eclipse.rse.doc.isv ---
[INFO] Using 'UTF-8' encoding to copy filtered resources.
[INFO] skip non existing resourceDirectory /jobs/genie.tm/tm-3.7-maintenance/workspace/rse/doc/org.eclipse.rse.doc.isv/src/main/resources
[INFO] 
[INFO] --- tycho-compiler-plugin:0.20.0:compile (default-compile) @ org.eclipse.rse.doc.isv ---
[INFO] 
[INFO] --- maven-resources-plugin:2.6:testResources (default-testResources) @ org.eclipse.rse.doc.isv ---
[INFO] Using 'UTF-8' encoding to copy filtered resources.
[INFO] skip non existing resourceDirectory /jobs/genie.tm/tm-3.7-maintenance/workspace/rse/doc/org.eclipse.rse.doc.isv/src/test/resources
[INFO] 
[INFO] --- tycho-source-plugin:0.20.0:plugin-source (plugin-source) @ org.eclipse.rse.doc.isv ---
[INFO] 
[INFO] --- tycho-packaging-plugin:0.20.0:package-plugin (default-package-plugin) @ org.eclipse.rse.doc.isv ---
[WARNING] /jobs/genie.tm/tm-3.7-maintenance/workspace/rse/doc/org.eclipse.rse.doc.isv/build.properties: bin.includes value(s) [index/] do not match any files.
[INFO] Building jar: /jobs/genie.tm/tm-3.7-maintenance/workspace/rse/doc/org.eclipse.rse.doc.isv/target/org.eclipse.rse.doc.isv-3.4.0-SNAPSHOT.jar
[INFO] 
[INFO] --- tycho-p2-plugin:0.20.0:p2-metadata-default (default-p2-metadata-default) @ org.eclipse.rse.doc.isv ---
[INFO] 
[INFO] --- tycho-pack200a-plugin:0.20.0:normalize (pack200-normalize) @ org.eclipse.rse.doc.isv ---
[INFO] Pack200 normalizing jar /jobs/genie.tm/tm-3.7-maintenance/workspace/rse/doc/org.eclipse.rse.doc.isv/target/org.eclipse.rse.doc.isv-3.4.0-SNAPSHOT.jar
[INFO] 
[INFO] --- eclipse-jarsigner-plugin:1.0.5:sign (sign) @ org.eclipse.rse.doc.isv ---
[INFO] Searching org.eclipse.rse.doc.isv-3.4.0-SNAPSHOT.jar for inner jars...
[INFO] Signed org.eclipse.tm:org.eclipse.rse.doc.isv:eclipse-plugin:3.4.0-SNAPSHOT in 1 seconds.
[INFO] 
[INFO] --- tycho-pack200b-plugin:0.20.0:pack (pack200-pack) @ org.eclipse.rse.doc.isv ---
[INFO] Pack200 packing jar /jobs/genie.tm/tm-3.7-maintenance/workspace/rse/doc/org.eclipse.rse.doc.isv/target/org.eclipse.rse.doc.isv-3.4.0-SNAPSHOT.jar
[INFO] 
[INFO] --- tycho-p2-plugin:0.20.0:p2-metadata (p2-metadata) @ org.eclipse.rse.doc.isv ---
[INFO] 
[INFO] --- maven-install-plugin:2.3.1:install (default-install) @ org.eclipse.rse.doc.isv ---
[INFO] Installing /jobs/genie.tm/tm-3.7-maintenance/workspace/rse/doc/org.eclipse.rse.doc.isv/target/org.eclipse.rse.doc.isv-3.4.0-SNAPSHOT.jar to /home/hudson/genie.tm/.jenkins/jobs/tm-3.7-maintenance/workspace/.repository/org/eclipse/tm/org.eclipse.rse.doc.isv/3.4.0-SNAPSHOT/org.eclipse.rse.doc.isv-3.4.0-SNAPSHOT.jar
[INFO] Installing /jobs/genie.tm/tm-3.7-maintenance/workspace/rse/doc/org.eclipse.rse.doc.isv/pom.xml to /home/hudson/genie.tm/.jenkins/jobs/tm-3.7-maintenance/workspace/.repository/org/eclipse/tm/org.eclipse.rse.doc.isv/3.4.0-SNAPSHOT/org.eclipse.rse.doc.isv-3.4.0-SNAPSHOT.pom
[INFO] Installing /jobs/genie.tm/tm-3.7-maintenance/workspace/rse/doc/org.eclipse.rse.doc.isv/target/org.eclipse.rse.doc.isv-3.4.0-SNAPSHOT.jar.pack.gz to /home/hudson/genie.tm/.jenkins/jobs/tm-3.7-maintenance/workspace/.repository/org/eclipse/tm/org.eclipse.rse.doc.isv/3.4.0-SNAPSHOT/org.eclipse.rse.doc.isv-3.4.0-SNAPSHOT-pack200.jar.pack.gz
[INFO] Installing /jobs/genie.tm/tm-3.7-maintenance/workspace/rse/doc/org.eclipse.rse.doc.isv/target/p2content.xml to /home/hudson/genie.tm/.jenkins/jobs/tm-3.7-maintenance/workspace/.repository/org/eclipse/tm/org.eclipse.rse.doc.isv/3.4.0-SNAPSHOT/org.eclipse.rse.doc.isv-3.4.0-SNAPSHOT-p2metadata.xml
[INFO] Installing /jobs/genie.tm/tm-3.7-maintenance/workspace/rse/doc/org.eclipse.rse.doc.isv/target/p2artifacts.xml to /home/hudson/genie.tm/.jenkins/jobs/tm-3.7-maintenance/workspace/.repository/org/eclipse/tm/org.eclipse.rse.doc.isv/3.4.0-SNAPSHOT/org.eclipse.rse.doc.isv-3.4.0-SNAPSHOT-p2artifacts.xml
[INFO] 
[INFO] --- tycho-p2-plugin:0.20.0:update-local-index (default-update-local-index) @ org.eclipse.rse.doc.isv ---
[INFO] 
[INFO] ------------------------------------------------------------------------
[INFO] Building org.eclipse.rse.doc.user 3.4.100-SNAPSHOT
[INFO] ------------------------------------------------------------------------
[INFO] 
[INFO] --- maven-clean-plugin:2.5:clean (default-clean) @ org.eclipse.rse.doc.user ---
[INFO] 
[INFO] --- tycho-packaging-plugin:0.20.0:build-qualifier (default-build-qualifier) @ org.eclipse.rse.doc.user ---
[INFO] The project's OSGi version is 3.4.100.201403101646
[INFO] 
[INFO] --- tycho-packaging-plugin:0.20.0:validate-id (default-validate-id) @ org.eclipse.rse.doc.user ---
[INFO] 
[INFO] --- tycho-packaging-plugin:0.20.0:validate-version (default-validate-version) @ org.eclipse.rse.doc.user ---
[INFO] 
[INFO] --- maven-resources-plugin:2.6:resources (default-resources) @ org.eclipse.rse.doc.user ---
[INFO] Using 'UTF-8' encoding to copy filtered resources.
[INFO] skip non existing resourceDirectory /jobs/genie.tm/tm-3.7-maintenance/workspace/rse/doc/org.eclipse.rse.doc.user/src/main/resources
[INFO] 
[INFO] --- tycho-compiler-plugin:0.20.0:compile (default-compile) @ org.eclipse.rse.doc.user ---
[INFO] 
[INFO] --- maven-resources-plugin:2.6:testResources (default-testResources) @ org.eclipse.rse.doc.user ---
[INFO] Using 'UTF-8' encoding to copy filtered resources.
[INFO] skip non existing resourceDirectory /jobs/genie.tm/tm-3.7-maintenance/workspace/rse/doc/org.eclipse.rse.doc.user/src/test/resources
[INFO] 
[INFO] --- tycho-source-plugin:0.20.0:plugin-source (plugin-source) @ org.eclipse.rse.doc.user ---
[INFO] 
[INFO] --- tycho-packaging-plugin:0.20.0:package-plugin (default-package-plugin) @ org.eclipse.rse.doc.user ---
[WARNING] /jobs/genie.tm/tm-3.7-maintenance/workspace/rse/doc/org.eclipse.rse.doc.user/build.properties: bin.includes value(s) [index*/] do not match any files.
[INFO] Building jar: /jobs/genie.tm/tm-3.7-maintenance/workspace/rse/doc/org.eclipse.rse.doc.user/target/org.eclipse.rse.doc.user-3.4.100-SNAPSHOT.jar
[INFO] 
[INFO] --- tycho-p2-plugin:0.20.0:p2-metadata-default (default-p2-metadata-default) @ org.eclipse.rse.doc.user ---
[INFO] 
[INFO] --- tycho-pack200a-plugin:0.20.0:normalize (pack200-normalize) @ org.eclipse.rse.doc.user ---
[INFO] Pack200 normalizing jar /jobs/genie.tm/tm-3.7-maintenance/workspace/rse/doc/org.eclipse.rse.doc.user/target/org.eclipse.rse.doc.user-3.4.100-SNAPSHOT.jar
[INFO] 
[INFO] --- eclipse-jarsigner-plugin:1.0.5:sign (sign) @ org.eclipse.rse.doc.user ---
[INFO] Searching org.eclipse.rse.doc.user-3.4.100-SNAPSHOT.jar for inner jars...
[INFO] Signed org.eclipse.tm:org.eclipse.rse.doc.user:eclipse-plugin:3.4.100-SNAPSHOT in 6 seconds.
[INFO] 
[INFO] --- tycho-pack200b-plugin:0.20.0:pack (pack200-pack) @ org.eclipse.rse.doc.user ---
[INFO] Pack200 packing jar /jobs/genie.tm/tm-3.7-maintenance/workspace/rse/doc/org.eclipse.rse.doc.user/target/org.eclipse.rse.doc.user-3.4.100-SNAPSHOT.jar
[INFO] 
[INFO] --- tycho-p2-plugin:0.20.0:p2-metadata (p2-metadata) @ org.eclipse.rse.doc.user ---
[INFO] 
[INFO] --- maven-install-plugin:2.3.1:install (default-install) @ org.eclipse.rse.doc.user ---
[INFO] Installing /jobs/genie.tm/tm-3.7-maintenance/workspace/rse/doc/org.eclipse.rse.doc.user/target/org.eclipse.rse.doc.user-3.4.100-SNAPSHOT.jar to /home/hudson/genie.tm/.jenkins/jobs/tm-3.7-maintenance/workspace/.repository/org/eclipse/tm/org.eclipse.rse.doc.user/3.4.100-SNAPSHOT/org.eclipse.rse.doc.user-3.4.100-SNAPSHOT.jar
[INFO] Installing /jobs/genie.tm/tm-3.7-maintenance/workspace/rse/doc/org.eclipse.rse.doc.user/pom.xml to /home/hudson/genie.tm/.jenkins/jobs/tm-3.7-maintenance/workspace/.repository/org/eclipse/tm/org.eclipse.rse.doc.user/3.4.100-SNAPSHOT/org.eclipse.rse.doc.user-3.4.100-SNAPSHOT.pom
[INFO] Installing /jobs/genie.tm/tm-3.7-maintenance/workspace/rse/doc/org.eclipse.rse.doc.user/target/org.eclipse.rse.doc.user-3.4.100-SNAPSHOT.jar.pack.gz to /home/hudson/genie.tm/.jenkins/jobs/tm-3.7-maintenance/workspace/.repository/org/eclipse/tm/org.eclipse.rse.doc.user/3.4.100-SNAPSHOT/org.eclipse.rse.doc.user-3.4.100-SNAPSHOT-pack200.jar.pack.gz
[INFO] Installing /jobs/genie.tm/tm-3.7-maintenance/workspace/rse/doc/org.eclipse.rse.doc.user/target/p2content.xml to /home/hudson/genie.tm/.jenkins/jobs/tm-3.7-maintenance/workspace/.repository/org/eclipse/tm/org.eclipse.rse.doc.user/3.4.100-SNAPSHOT/org.eclipse.rse.doc.user-3.4.100-SNAPSHOT-p2metadata.xml
[INFO] Installing /jobs/genie.tm/tm-3.7-maintenance/workspace/rse/doc/org.eclipse.rse.doc.user/target/p2artifacts.xml to /home/hudson/genie.tm/.jenkins/jobs/tm-3.7-maintenance/workspace/.repository/org/eclipse/tm/org.eclipse.rse.doc.user/3.4.100-SNAPSHOT/org.eclipse.rse.doc.user-3.4.100-SNAPSHOT-p2artifacts.xml
[INFO] 
[INFO] --- tycho-p2-plugin:0.20.0:update-local-index (default-update-local-index) @ org.eclipse.rse.doc.user ---
[INFO] 
[INFO] ------------------------------------------------------------------------
[INFO] Building org.eclipse.rse.services 3.3.0-SNAPSHOT
[INFO] ------------------------------------------------------------------------
[INFO] 
[INFO] --- maven-clean-plugin:2.5:clean (default-clean) @ org.eclipse.rse.services ---
[INFO] 
[INFO] --- tycho-packaging-plugin:0.20.0:build-qualifier (default-build-qualifier) @ org.eclipse.rse.services ---
[INFO] The project's OSGi version is 3.3.0.201403100950
[INFO] 
[INFO] --- tycho-packaging-plugin:0.20.0:validate-id (default-validate-id) @ org.eclipse.rse.services ---
[INFO] 
[INFO] --- tycho-packaging-plugin:0.20.0:validate-version (default-validate-version) @ org.eclipse.rse.services ---
[INFO] 
[INFO] --- maven-resources-plugin:2.6:resources (default-resources) @ org.eclipse.rse.services ---
[INFO] Using 'UTF-8' encoding to copy filtered resources.
[INFO] skip non existing resourceDirectory /jobs/genie.tm/tm-3.7-maintenance/workspace/rse/plugins/org.eclipse.rse.services/src/main/resources
[INFO] 
[INFO] --- tycho-compiler-plugin:0.20.0:compile (default-compile) @ org.eclipse.rse.services ---
[WARNING] Effective compiler target 1.5 is incompatible with OSGi profile 'J2SE-1.4' { source level: 1.3, target level: 1.2} @ MavenProject: org.eclipse.tm:org.eclipse.rse.services:3.3.0-SNAPSHOT @ /jobs/genie.tm/tm-3.7-maintenance/workspace/rse/plugins/org.eclipse.rse.services/pom.xml
[INFO] Compiling 100 source files to /jobs/genie.tm/tm-3.7-maintenance/workspace/rse/plugins/org.eclipse.rse.services/target/clientserver.jar-classes
[INFO] Compiling 168 source files to /jobs/genie.tm/tm-3.7-maintenance/workspace/rse/plugins/org.eclipse.rse.services/target/classes
[INFO] 
[INFO] --- maven-resources-plugin:2.6:testResources (default-testResources) @ org.eclipse.rse.services ---
[INFO] Using 'UTF-8' encoding to copy filtered resources.
[INFO] skip non existing resourceDirectory /jobs/genie.tm/tm-3.7-maintenance/workspace/rse/plugins/org.eclipse.rse.services/src/test/resources
[INFO] 
[INFO] --- tycho-source-plugin:0.20.0:plugin-source (plugin-source) @ org.eclipse.rse.services ---
[INFO] Building jar: /jobs/genie.tm/tm-3.7-maintenance/workspace/rse/plugins/org.eclipse.rse.services/target/org.eclipse.rse.services-3.3.0-SNAPSHOT-sources.jar
[INFO] 
[INFO] --- tycho-packaging-plugin:0.20.0:package-plugin (default-package-plugin) @ org.eclipse.rse.services ---
[INFO] Building jar: /jobs/genie.tm/tm-3.7-maintenance/workspace/rse/plugins/org.eclipse.rse.services/clientserver.jar
[INFO] Building jar: /jobs/genie.tm/tm-3.7-maintenance/workspace/rse/plugins/org.eclipse.rse.services/target/org.eclipse.rse.services-3.3.0-SNAPSHOT.jar
[INFO] 
[INFO] --- tycho-p2-plugin:0.20.0:p2-metadata-default (default-p2-metadata-default) @ org.eclipse.rse.services ---
[INFO] 
[INFO] --- tycho-pack200a-plugin:0.20.0:normalize (pack200-normalize) @ org.eclipse.rse.services ---
[INFO] Pack200 normalizing jar /jobs/genie.tm/tm-3.7-maintenance/workspace/rse/plugins/org.eclipse.rse.services/target/org.eclipse.rse.services-3.3.0-SNAPSHOT.jar
[INFO] 
[INFO] --- eclipse-jarsigner-plugin:1.0.5:sign (sign) @ org.eclipse.rse.services ---
[INFO] Searching org.eclipse.rse.services-3.3.0-SNAPSHOT.jar for inner jars...
[INFO] Signed clientserver.jar in 1 seconds.
[INFO] Signed org.eclipse.tm:org.eclipse.rse.services:eclipse-plugin:3.3.0-SNAPSHOT in 87 seconds.
[INFO] Searching org.eclipse.rse.services-3.3.0-SNAPSHOT-sources.jar for inner jars...
[INFO] Signed org.eclipse.tm:org.eclipse.rse.services:java-source:sources:3.3.0-SNAPSHOT in 1 seconds.
[INFO] 
[INFO] --- tycho-pack200b-plugin:0.20.0:pack (pack200-pack) @ org.eclipse.rse.services ---
[INFO] Pack200 packing jar /jobs/genie.tm/tm-3.7-maintenance/workspace/rse/plugins/org.eclipse.rse.services/target/org.eclipse.rse.services-3.3.0-SNAPSHOT.jar
[INFO] 
[INFO] --- tycho-p2-plugin:0.20.0:p2-metadata (p2-metadata) @ org.eclipse.rse.services ---
[INFO] 
[INFO] --- maven-install-plugin:2.3.1:install (default-install) @ org.eclipse.rse.services ---
[INFO] Installing /jobs/genie.tm/tm-3.7-maintenance/workspace/rse/plugins/org.eclipse.rse.services/target/org.eclipse.rse.services-3.3.0-SNAPSHOT.jar to /home/hudson/genie.tm/.jenkins/jobs/tm-3.7-maintenance/workspace/.repository/org/eclipse/tm/org.eclipse.rse.services/3.3.0-SNAPSHOT/org.eclipse.rse.services-3.3.0-SNAPSHOT.jar
[INFO] Installing /jobs/genie.tm/tm-3.7-maintenance/workspace/rse/plugins/org.eclipse.rse.services/pom.xml to /home/hudson/genie.tm/.jenkins/jobs/tm-3.7-maintenance/workspace/.repository/org/eclipse/tm/org.eclipse.rse.services/3.3.0-SNAPSHOT/org.eclipse.rse.services-3.3.0-SNAPSHOT.pom
[INFO] Installing /jobs/genie.tm/tm-3.7-maintenance/workspace/rse/plugins/org.eclipse.rse.services/target/org.eclipse.rse.services-3.3.0-SNAPSHOT-sources.jar to /home/hudson/genie.tm/.jenkins/jobs/tm-3.7-maintenance/workspace/.repository/org/eclipse/tm/org.eclipse.rse.services/3.3.0-SNAPSHOT/org.eclipse.rse.services-3.3.0-SNAPSHOT-sources.jar
[INFO] Installing /jobs/genie.tm/tm-3.7-maintenance/workspace/rse/plugins/org.eclipse.rse.services/target/org.eclipse.rse.services-3.3.0-SNAPSHOT.jar.pack.gz to /home/hudson/genie.tm/.jenkins/jobs/tm-3.7-maintenance/workspace/.repository/org/eclipse/tm/org.eclipse.rse.services/3.3.0-SNAPSHOT/org.eclipse.rse.services-3.3.0-SNAPSHOT-pack200.jar.pack.gz
[INFO] Installing /jobs/genie.tm/tm-3.7-maintenance/workspace/rse/plugins/org.eclipse.rse.services/target/p2content.xml to /home/hudson/genie.tm/.jenkins/jobs/tm-3.7-maintenance/workspace/.repository/org/eclipse/tm/org.eclipse.rse.services/3.3.0-SNAPSHOT/org.eclipse.rse.services-3.3.0-SNAPSHOT-p2metadata.xml
[INFO] Installing /jobs/genie.tm/tm-3.7-maintenance/workspace/rse/plugins/org.eclipse.rse.services/target/p2artifacts.xml to /home/hudson/genie.tm/.jenkins/jobs/tm-3.7-maintenance/workspace/.repository/org/eclipse/tm/org.eclipse.rse.services/3.3.0-SNAPSHOT/org.eclipse.rse.services-3.3.0-SNAPSHOT-p2artifacts.xml
[INFO] 
[INFO] --- tycho-p2-plugin:0.20.0:update-local-index (default-update-local-index) @ org.eclipse.rse.services ---
[INFO] 
[INFO] ------------------------------------------------------------------------
[INFO] Building org.eclipse.rse.core 3.3.100.qualifier
[INFO] ------------------------------------------------------------------------
[INFO] 
[INFO] --- maven-clean-plugin:2.5:clean (default-clean) @ org.eclipse.rse.core ---
[INFO] 
[INFO] --- tycho-packaging-plugin:0.20.0:build-qualifier (default-build-qualifier) @ org.eclipse.rse.core ---
[INFO] The project's OSGi version is 3.3.100.qualifier.201407181907
[INFO] 
[INFO] --- tycho-packaging-plugin:0.20.0:validate-id (default-validate-id) @ org.eclipse.rse.core ---
[INFO] 
[INFO] --- tycho-packaging-plugin:0.20.0:validate-version (default-validate-version) @ org.eclipse.rse.core ---
[INFO] 
[INFO] --- maven-resources-plugin:2.6:resources (default-resources) @ org.eclipse.rse.core ---
[INFO] Using 'UTF-8' encoding to copy filtered resources.
[INFO] skip non existing resourceDirectory /jobs/genie.tm/tm-3.7-maintenance/workspace/rse/plugins/org.eclipse.rse.core/src/main/resources
[INFO] 
[INFO] --- tycho-compiler-plugin:0.20.0:compile (default-compile) @ org.eclipse.rse.core ---
[WARNING] Effective compiler target 1.5 is incompatible with OSGi profile 'J2SE-1.4' { source level: 1.3, target level: 1.2} @ MavenProject: org.eclipse.tm:org.eclipse.rse.core:3.3.100.qualifier @ /jobs/genie.tm/tm-3.7-maintenance/workspace/rse/plugins/org.eclipse.rse.core/pom.xml
[INFO] Compiling 217 source files to /jobs/genie.tm/tm-3.7-maintenance/workspace/rse/plugins/org.eclipse.rse.core/target/classes
[INFO] 
[INFO] --- maven-resources-plugin:2.6:testResources (default-testResources) @ org.eclipse.rse.core ---
[INFO] Using 'UTF-8' encoding to copy filtered resources.
[INFO] skip non existing resourceDirectory /jobs/genie.tm/tm-3.7-maintenance/workspace/rse/plugins/org.eclipse.rse.core/src/test/resources
[INFO] 
[INFO] --- tycho-source-plugin:0.20.0:plugin-source (plugin-source) @ org.eclipse.rse.core ---
[INFO] Building jar: /jobs/genie.tm/tm-3.7-maintenance/workspace/rse/plugins/org.eclipse.rse.core/target/org.eclipse.rse.core-3.3.100.qualifier-sources.jar
[INFO] 
[INFO] --- tycho-packaging-plugin:0.20.0:package-plugin (default-package-plugin) @ org.eclipse.rse.core ---
[INFO] Building jar: /jobs/genie.tm/tm-3.7-maintenance/workspace/rse/plugins/org.eclipse.rse.core/target/org.eclipse.rse.core-3.3.100.qualifier.jar
[INFO] 
[INFO] --- tycho-p2-plugin:0.20.0:p2-metadata-default (default-p2-metadata-default) @ org.eclipse.rse.core ---
[INFO] 
[INFO] --- tycho-pack200a-plugin:0.20.0:normalize (pack200-normalize) @ org.eclipse.rse.core ---
[INFO] Pack200 normalizing jar /jobs/genie.tm/tm-3.7-maintenance/workspace/rse/plugins/org.eclipse.rse.core/target/org.eclipse.rse.core-3.3.100.qualifier.jar
[INFO] 
[INFO] --- eclipse-jarsigner-plugin:1.0.5:sign (sign) @ org.eclipse.rse.core ---
[INFO] Searching org.eclipse.rse.core-3.3.100.qualifier.jar for inner jars...
[INFO] Signed org.eclipse.tm:org.eclipse.rse.core:eclipse-plugin:3.3.100.qualifier in 0 seconds.
[INFO] Searching org.eclipse.rse.core-3.3.100.qualifier-sources.jar for inner jars...
[INFO] Signed org.eclipse.tm:org.eclipse.rse.core:java-source:sources:3.3.100.qualifier in 1 seconds.
[INFO] 
[INFO] --- tycho-pack200b-plugin:0.20.0:pack (pack200-pack) @ org.eclipse.rse.core ---
[INFO] Pack200 packing jar /jobs/genie.tm/tm-3.7-maintenance/workspace/rse/plugins/org.eclipse.rse.core/target/org.eclipse.rse.core-3.3.100.qualifier.jar
[INFO] 
[INFO] --- tycho-p2-plugin:0.20.0:p2-metadata (p2-metadata) @ org.eclipse.rse.core ---
[INFO] 
[INFO] --- maven-install-plugin:2.3.1:install (default-install) @ org.eclipse.rse.core ---
[INFO] Installing /jobs/genie.tm/tm-3.7-maintenance/workspace/rse/plugins/org.eclipse.rse.core/target/org.eclipse.rse.core-3.3.100.qualifier.jar to /home/hudson/genie.tm/.jenkins/jobs/tm-3.7-maintenance/workspace/.repository/org/eclipse/tm/org.eclipse.rse.core/3.3.100.qualifier/org.eclipse.rse.core-3.3.100.qualifier.jar
[INFO] Installing /jobs/genie.tm/tm-3.7-maintenance/workspace/rse/plugins/org.eclipse.rse.core/pom.xml to /home/hudson/genie.tm/.jenkins/jobs/tm-3.7-maintenance/workspace/.repository/org/eclipse/tm/org.eclipse.rse.core/3.3.100.qualifier/org.eclipse.rse.core-3.3.100.qualifier.pom
[INFO] Installing /jobs/genie.tm/tm-3.7-maintenance/workspace/rse/plugins/org.eclipse.rse.core/target/org.eclipse.rse.core-3.3.100.qualifier-sources.jar to /home/hudson/genie.tm/.jenkins/jobs/tm-3.7-maintenance/workspace/.repository/org/eclipse/tm/org.eclipse.rse.core/3.3.100.qualifier/org.eclipse.rse.core-3.3.100.qualifier-sources.jar
[INFO] Installing /jobs/genie.tm/tm-3.7-maintenance/workspace/rse/plugins/org.eclipse.rse.core/target/org.eclipse.rse.core-3.3.100.qualifier.jar.pack.gz to /home/hudson/genie.tm/.jenkins/jobs/tm-3.7-maintenance/workspace/.repository/org/eclipse/tm/org.eclipse.rse.core/3.3.100.qualifier/org.eclipse.rse.core-3.3.100.qualifier-pack200.jar.pack.gz
[INFO] Installing /jobs/genie.tm/tm-3.7-maintenance/workspace/rse/plugins/org.eclipse.rse.core/target/p2content.xml to /home/hudson/genie.tm/.jenkins/jobs/tm-3.7-maintenance/workspace/.repository/org/eclipse/tm/org.eclipse.rse.core/3.3.100.qualifier/org.eclipse.rse.core-3.3.100.qualifier-p2metadata.xml
[INFO] Installing /jobs/genie.tm/tm-3.7-maintenance/workspace/rse/plugins/org.eclipse.rse.core/target/p2artifacts.xml to /home/hudson/genie.tm/.jenkins/jobs/tm-3.7-maintenance/workspace/.repository/org/eclipse/tm/org.eclipse.rse.core/3.3.100.qualifier/org.eclipse.rse.core-3.3.100.qualifier-p2artifacts.xml
[INFO] 
[INFO] --- tycho-p2-plugin:0.20.0:update-local-index (default-update-local-index) @ org.eclipse.rse.core ---
[INFO] 
[INFO] ------------------------------------------------------------------------
[INFO] Building org.eclipse.rse.ui 3.3.100.qualifier
[INFO] ------------------------------------------------------------------------
[INFO] 
[INFO] --- maven-clean-plugin:2.5:clean (default-clean) @ org.eclipse.rse.ui ---
[INFO] 
[INFO] --- tycho-packaging-plugin:0.20.0:build-qualifier (default-build-qualifier) @ org.eclipse.rse.ui ---
[INFO] The project's OSGi version is 3.3.100.qualifier.201408221458
[INFO] 
[INFO] --- tycho-packaging-plugin:0.20.0:validate-id (default-validate-id) @ org.eclipse.rse.ui ---
[INFO] 
[INFO] --- tycho-packaging-plugin:0.20.0:validate-version (default-validate-version) @ org.eclipse.rse.ui ---
[INFO] 
[INFO] --- maven-resources-plugin:2.6:resources (default-resources) @ org.eclipse.rse.ui ---
[INFO] Using 'UTF-8' encoding to copy filtered resources.
[INFO] skip non existing resourceDirectory /jobs/genie.tm/tm-3.7-maintenance/workspace/rse/plugins/org.eclipse.rse.ui/src/main/resources
[INFO] 
[INFO] --- tycho-compiler-plugin:0.20.0:compile (default-compile) @ org.eclipse.rse.ui ---
[WARNING] Effective compiler target 1.5 is incompatible with OSGi profile 'J2SE-1.4' { source level: 1.3, target level: 1.2} @ MavenProject: org.eclipse.tm:org.eclipse.rse.ui:3.3.100.qualifier @ /jobs/genie.tm/tm-3.7-maintenance/workspace/rse/plugins/org.eclipse.rse.ui/pom.xml
[INFO] Compiling 506 source files to /jobs/genie.tm/tm-3.7-maintenance/workspace/rse/plugins/org.eclipse.rse.ui/target/classes
[INFO] 
[INFO] --- maven-resources-plugin:2.6:testResources (default-testResources) @ org.eclipse.rse.ui ---
[INFO] Using 'UTF-8' encoding to copy filtered resources.
[INFO] skip non existing resourceDirectory /jobs/genie.tm/tm-3.7-maintenance/workspace/rse/plugins/org.eclipse.rse.ui/src/test/resources
[INFO] 
[INFO] --- tycho-source-plugin:0.20.0:plugin-source (plugin-source) @ org.eclipse.rse.ui ---
[INFO] Building jar: /jobs/genie.tm/tm-3.7-maintenance/workspace/rse/plugins/org.eclipse.rse.ui/target/org.eclipse.rse.ui-3.3.100.qualifier-sources.jar
[INFO] 
[INFO] --- tycho-packaging-plugin:0.20.0:package-plugin (default-package-plugin) @ org.eclipse.rse.ui ---
[INFO] Building jar: /jobs/genie.tm/tm-3.7-maintenance/workspace/rse/plugins/org.eclipse.rse.ui/target/org.eclipse.rse.ui-3.3.100.qualifier.jar
[INFO] 
[INFO] --- tycho-p2-plugin:0.20.0:p2-metadata-default (default-p2-metadata-default) @ org.eclipse.rse.ui ---
[INFO] 
[INFO] --- tycho-pack200a-plugin:0.20.0:normalize (pack200-normalize) @ org.eclipse.rse.ui ---
[INFO] Pack200 normalizing jar /jobs/genie.tm/tm-3.7-maintenance/workspace/rse/plugins/org.eclipse.rse.ui/target/org.eclipse.rse.ui-3.3.100.qualifier.jar
[INFO] 
[INFO] --- eclipse-jarsigner-plugin:1.0.5:sign (sign) @ org.eclipse.rse.ui ---
[INFO] Searching org.eclipse.rse.ui-3.3.100.qualifier.jar for inner jars...
[INFO] Signed org.eclipse.tm:org.eclipse.rse.ui:eclipse-plugin:3.3.100.qualifier in 1 seconds.
[INFO] Searching org.eclipse.rse.ui-3.3.100.qualifier-sources.jar for inner jars...
[INFO] Signed org.eclipse.tm:org.eclipse.rse.ui:java-source:sources:3.3.100.qualifier in 3 seconds.
[INFO] 
[INFO] --- tycho-pack200b-plugin:0.20.0:pack (pack200-pack) @ org.eclipse.rse.ui ---
[INFO] Pack200 packing jar /jobs/genie.tm/tm-3.7-maintenance/workspace/rse/plugins/org.eclipse.rse.ui/target/org.eclipse.rse.ui-3.3.100.qualifier.jar
[INFO] 
[INFO] --- tycho-p2-plugin:0.20.0:p2-metadata (p2-metadata) @ org.eclipse.rse.ui ---
[INFO] 
[INFO] --- maven-install-plugin:2.3.1:install (default-install) @ org.eclipse.rse.ui ---
[INFO] Installing /jobs/genie.tm/tm-3.7-maintenance/workspace/rse/plugins/org.eclipse.rse.ui/target/org.eclipse.rse.ui-3.3.100.qualifier.jar to /home/hudson/genie.tm/.jenkins/jobs/tm-3.7-maintenance/workspace/.repository/org/eclipse/tm/org.eclipse.rse.ui/3.3.100.qualifier/org.eclipse.rse.ui-3.3.100.qualifier.jar
[INFO] Installing /jobs/genie.tm/tm-3.7-maintenance/workspace/rse/plugins/org.eclipse.rse.ui/pom.xml to /home/hudson/genie.tm/.jenkins/jobs/tm-3.7-maintenance/workspace/.repository/org/eclipse/tm/org.eclipse.rse.ui/3.3.100.qualifier/org.eclipse.rse.ui-3.3.100.qualifier.pom
[INFO] Installing /jobs/genie.tm/tm-3.7-maintenance/workspace/rse/plugins/org.eclipse.rse.ui/target/org.eclipse.rse.ui-3.3.100.qualifier-sources.jar to /home/hudson/genie.tm/.jenkins/jobs/tm-3.7-maintenance/workspace/.repository/org/eclipse/tm/org.eclipse.rse.ui/3.3.100.qualifier/org.eclipse.rse.ui-3.3.100.qualifier-sources.jar
[INFO] Installing /jobs/genie.tm/tm-3.7-maintenance/workspace/rse/plugins/org.eclipse.rse.ui/target/org.eclipse.rse.ui-3.3.100.qualifier.jar.pack.gz to /home/hudson/genie.tm/.jenkins/jobs/tm-3.7-maintenance/workspace/.repository/org/eclipse/tm/org.eclipse.rse.ui/3.3.100.qualifier/org.eclipse.rse.ui-3.3.100.qualifier-pack200.jar.pack.gz
[INFO] Installing /jobs/genie.tm/tm-3.7-maintenance/workspace/rse/plugins/org.eclipse.rse.ui/target/p2content.xml to /home/hudson/genie.tm/.jenkins/jobs/tm-3.7-maintenance/workspace/.repository/org/eclipse/tm/org.eclipse.rse.ui/3.3.100.qualifier/org.eclipse.rse.ui-3.3.100.qualifier-p2metadata.xml
[INFO] Installing /jobs/genie.tm/tm-3.7-maintenance/workspace/rse/plugins/org.eclipse.rse.ui/target/p2artifacts.xml to /home/hudson/genie.tm/.jenkins/jobs/tm-3.7-maintenance/workspace/.repository/org/eclipse/tm/org.eclipse.rse.ui/3.3.100.qualifier/org.eclipse.rse.ui-3.3.100.qualifier-p2artifacts.xml
[INFO] 
[INFO] --- tycho-p2-plugin:0.20.0:update-local-index (default-update-local-index) @ org.eclipse.rse.ui ---
[INFO] 
[INFO] ------------------------------------------------------------------------
[INFO] Building org.eclipse.rse.examples.daytime 2.2.300-SNAPSHOT
[INFO] ------------------------------------------------------------------------
[INFO] 
[INFO] --- maven-clean-plugin:2.5:clean (default-clean) @ org.eclipse.rse.examples.daytime ---
[INFO] 
[INFO] --- tycho-packaging-plugin:0.20.0:build-qualifier (default-build-qualifier) @ org.eclipse.rse.examples.daytime ---
[INFO] The project's OSGi version is 2.2.300.201403101549
[INFO] 
[INFO] --- tycho-packaging-plugin:0.20.0:validate-id (default-validate-id) @ org.eclipse.rse.examples.daytime ---
[INFO] 
[INFO] --- tycho-packaging-plugin:0.20.0:validate-version (default-validate-version) @ org.eclipse.rse.examples.daytime ---
[INFO] 
[INFO] --- maven-resources-plugin:2.6:resources (default-resources) @ org.eclipse.rse.examples.daytime ---
[INFO] Using 'UTF-8' encoding to copy filtered resources.
[INFO] skip non existing resourceDirectory /jobs/genie.tm/tm-3.7-maintenance/workspace/rse/examples/org.eclipse.rse.examples.daytime/src/main/resources
[INFO] 
[INFO] --- tycho-compiler-plugin:0.20.0:compile (default-compile) @ org.eclipse.rse.examples.daytime ---
[WARNING] Effective compiler target 1.5 is incompatible with OSGi profile 'J2SE-1.4' { source level: 1.3, target level: 1.2} @ MavenProject: org.eclipse.tm:org.eclipse.rse.examples.daytime:2.2.300-SNAPSHOT @ /jobs/genie.tm/tm-3.7-maintenance/workspace/rse/examples/org.eclipse.rse.examples.daytime/pom.xml
[INFO] Compiling 15 source files to /jobs/genie.tm/tm-3.7-maintenance/workspace/rse/examples/org.eclipse.rse.examples.daytime/target/classes
[INFO] 
[INFO] --- maven-resources-plugin:2.6:testResources (default-testResources) @ org.eclipse.rse.examples.daytime ---
[INFO] Using 'UTF-8' encoding to copy filtered resources.
[INFO] skip non existing resourceDirectory /jobs/genie.tm/tm-3.7-maintenance/workspace/rse/examples/org.eclipse.rse.examples.daytime/src/test/resources
[INFO] 
[INFO] --- tycho-source-plugin:0.20.0:plugin-source (plugin-source) @ org.eclipse.rse.examples.daytime ---
[INFO] Building jar: /jobs/genie.tm/tm-3.7-maintenance/workspace/rse/examples/org.eclipse.rse.examples.daytime/target/org.eclipse.rse.examples.daytime-2.2.300-SNAPSHOT-sources.jar
[INFO] 
[INFO] --- tycho-packaging-plugin:0.20.0:package-plugin (default-package-plugin) @ org.eclipse.rse.examples.daytime ---
[INFO] Building jar: /jobs/genie.tm/tm-3.7-maintenance/workspace/rse/examples/org.eclipse.rse.examples.daytime/target/org.eclipse.rse.examples.daytime-2.2.300-SNAPSHOT.jar
[INFO] 
[INFO] --- tycho-p2-plugin:0.20.0:p2-metadata-default (default-p2-metadata-default) @ org.eclipse.rse.examples.daytime ---
[INFO] 
[INFO] --- tycho-pack200a-plugin:0.20.0:normalize (pack200-normalize) @ org.eclipse.rse.examples.daytime ---
[INFO] Pack200 normalizing jar /jobs/genie.tm/tm-3.7-maintenance/workspace/rse/examples/org.eclipse.rse.examples.daytime/target/org.eclipse.rse.examples.daytime-2.2.300-SNAPSHOT.jar
[INFO] 
[INFO] --- eclipse-jarsigner-plugin:1.0.5:sign (sign) @ org.eclipse.rse.examples.daytime ---
[INFO] Searching org.eclipse.rse.examples.daytime-2.2.300-SNAPSHOT.jar for inner jars...
[INFO] Signed org.eclipse.tm:org.eclipse.rse.examples.daytime:eclipse-plugin:2.2.300-SNAPSHOT in 0 seconds.
[INFO] Searching org.eclipse.rse.examples.daytime-2.2.300-SNAPSHOT-sources.jar for inner jars...
[INFO] Signed org.eclipse.tm:org.eclipse.rse.examples.daytime:java-source:sources:2.2.300-SNAPSHOT in 5 seconds.
[INFO] 
[INFO] --- tycho-pack200b-plugin:0.20.0:pack (pack200-pack) @ org.eclipse.rse.examples.daytime ---
[INFO] Pack200 packing jar /jobs/genie.tm/tm-3.7-maintenance/workspace/rse/examples/org.eclipse.rse.examples.daytime/target/org.eclipse.rse.examples.daytime-2.2.300-SNAPSHOT.jar
[INFO] 
[INFO] --- tycho-p2-plugin:0.20.0:p2-metadata (p2-metadata) @ org.eclipse.rse.examples.daytime ---
[INFO] 
[INFO] --- maven-install-plugin:2.3.1:install (default-install) @ org.eclipse.rse.examples.daytime ---
[INFO] Installing /jobs/genie.tm/tm-3.7-maintenance/workspace/rse/examples/org.eclipse.rse.examples.daytime/target/org.eclipse.rse.examples.daytime-2.2.300-SNAPSHOT.jar to /home/hudson/genie.tm/.jenkins/jobs/tm-3.7-maintenance/workspace/.repository/org/eclipse/tm/org.eclipse.rse.examples.daytime/2.2.300-SNAPSHOT/org.eclipse.rse.examples.daytime-2.2.300-SNAPSHOT.jar
[INFO] Installing /jobs/genie.tm/tm-3.7-maintenance/workspace/rse/examples/org.eclipse.rse.examples.daytime/pom.xml to /home/hudson/genie.tm/.jenkins/jobs/tm-3.7-maintenance/workspace/.repository/org/eclipse/tm/org.eclipse.rse.examples.daytime/2.2.300-SNAPSHOT/org.eclipse.rse.examples.daytime-2.2.300-SNAPSHOT.pom
[INFO] Installing /jobs/genie.tm/tm-3.7-maintenance/workspace/rse/examples/org.eclipse.rse.examples.daytime/target/org.eclipse.rse.examples.daytime-2.2.300-SNAPSHOT-sources.jar to /home/hudson/genie.tm/.jenkins/jobs/tm-3.7-maintenance/workspace/.repository/org/eclipse/tm/org.eclipse.rse.examples.daytime/2.2.300-SNAPSHOT/org.eclipse.rse.examples.daytime-2.2.300-SNAPSHOT-sources.jar
[INFO] Installing /jobs/genie.tm/tm-3.7-maintenance/workspace/rse/examples/org.eclipse.rse.examples.daytime/target/org.eclipse.rse.examples.daytime-2.2.300-SNAPSHOT.jar.pack.gz to /home/hudson/genie.tm/.jenkins/jobs/tm-3.7-maintenance/workspace/.repository/org/eclipse/tm/org.eclipse.rse.examples.daytime/2.2.300-SNAPSHOT/org.eclipse.rse.examples.daytime-2.2.300-SNAPSHOT-pack200.jar.pack.gz
[INFO] Installing /jobs/genie.tm/tm-3.7-maintenance/workspace/rse/examples/org.eclipse.rse.examples.daytime/target/p2content.xml to /home/hudson/genie.tm/.jenkins/jobs/tm-3.7-maintenance/workspace/.repository/org/eclipse/tm/org.eclipse.rse.examples.daytime/2.2.300-SNAPSHOT/org.eclipse.rse.examples.daytime-2.2.300-SNAPSHOT-p2metadata.xml
[INFO] Installing /jobs/genie.tm/tm-3.7-maintenance/workspace/rse/examples/org.eclipse.rse.examples.daytime/target/p2artifacts.xml to /home/hudson/genie.tm/.jenkins/jobs/tm-3.7-maintenance/workspace/.repository/org/eclipse/tm/org.eclipse.rse.examples.daytime/2.2.300-SNAPSHOT/org.eclipse.rse.examples.daytime-2.2.300-SNAPSHOT-p2artifacts.xml
[INFO] 
[INFO] --- tycho-p2-plugin:0.20.0:update-local-index (default-update-local-index) @ org.eclipse.rse.examples.daytime ---
[INFO] 
[INFO] ------------------------------------------------------------------------
[INFO] Building org.eclipse.rse.subsystems.files.core 3.3.1-SNAPSHOT
[INFO] ------------------------------------------------------------------------
[INFO] 
[INFO] --- maven-clean-plugin:2.5:clean (default-clean) @ org.eclipse.rse.subsystems.files.core ---
[INFO] 
[INFO] --- tycho-packaging-plugin:0.20.0:build-qualifier (default-build-qualifier) @ org.eclipse.rse.subsystems.files.core ---
[INFO] The project's OSGi version is 3.3.1.201403100950
[INFO] 
[INFO] --- tycho-packaging-plugin:0.20.0:validate-id (default-validate-id) @ org.eclipse.rse.subsystems.files.core ---
[INFO] 
[INFO] --- tycho-packaging-plugin:0.20.0:validate-version (default-validate-version) @ org.eclipse.rse.subsystems.files.core ---
[INFO] 
[INFO] --- maven-resources-plugin:2.6:resources (default-resources) @ org.eclipse.rse.subsystems.files.core ---
[INFO] Using 'UTF-8' encoding to copy filtered resources.
[INFO] skip non existing resourceDirectory /jobs/genie.tm/tm-3.7-maintenance/workspace/rse/plugins/org.eclipse.rse.subsystems.files.core/src/main/resources
[INFO] 
[INFO] --- tycho-compiler-plugin:0.20.0:compile (default-compile) @ org.eclipse.rse.subsystems.files.core ---
[WARNING] Effective compiler target 1.5 is incompatible with OSGi profile 'J2SE-1.4' { source level: 1.3, target level: 1.2} @ MavenProject: org.eclipse.tm:org.eclipse.rse.subsystems.files.core:3.3.1-SNAPSHOT @ /jobs/genie.tm/tm-3.7-maintenance/workspace/rse/plugins/org.eclipse.rse.subsystems.files.core/pom.xml
[INFO] Compiling 70 source files to /jobs/genie.tm/tm-3.7-maintenance/workspace/rse/plugins/org.eclipse.rse.subsystems.files.core/target/classes
[INFO] 
[INFO] --- maven-resources-plugin:2.6:testResources (default-testResources) @ org.eclipse.rse.subsystems.files.core ---
[INFO] Using 'UTF-8' encoding to copy filtered resources.
[INFO] skip non existing resourceDirectory /jobs/genie.tm/tm-3.7-maintenance/workspace/rse/plugins/org.eclipse.rse.subsystems.files.core/src/test/resources
[INFO] 
[INFO] --- tycho-source-plugin:0.20.0:plugin-source (plugin-source) @ org.eclipse.rse.subsystems.files.core ---
[INFO] Building jar: /jobs/genie.tm/tm-3.7-maintenance/workspace/rse/plugins/org.eclipse.rse.subsystems.files.core/target/org.eclipse.rse.subsystems.files.core-3.3.1-SNAPSHOT-sources.jar
[INFO] 
[INFO] --- tycho-packaging-plugin:0.20.0:package-plugin (default-package-plugin) @ org.eclipse.rse.subsystems.files.core ---
[INFO] Building jar: /jobs/genie.tm/tm-3.7-maintenance/workspace/rse/plugins/org.eclipse.rse.subsystems.files.core/target/org.eclipse.rse.subsystems.files.core-3.3.1-SNAPSHOT.jar
[INFO] 
[INFO] --- tycho-p2-plugin:0.20.0:p2-metadata-default (default-p2-metadata-default) @ org.eclipse.rse.subsystems.files.core ---
[INFO] 
[INFO] --- tycho-pack200a-plugin:0.20.0:normalize (pack200-normalize) @ org.eclipse.rse.subsystems.files.core ---
[INFO] Pack200 normalizing jar /jobs/genie.tm/tm-3.7-maintenance/workspace/rse/plugins/org.eclipse.rse.subsystems.files.core/target/org.eclipse.rse.subsystems.files.core-3.3.1-SNAPSHOT.jar
[INFO] 
[INFO] --- eclipse-jarsigner-plugin:1.0.5:sign (sign) @ org.eclipse.rse.subsystems.files.core ---
[INFO] Searching org.eclipse.rse.subsystems.files.core-3.3.1-SNAPSHOT.jar for inner jars...
[INFO] Signed org.eclipse.tm:org.eclipse.rse.subsystems.files.core:eclipse-plugin:3.3.1-SNAPSHOT in 2 seconds.
[INFO] Searching org.eclipse.rse.subsystems.files.core-3.3.1-SNAPSHOT-sources.jar for inner jars...
[INFO] Signed org.eclipse.tm:org.eclipse.rse.subsystems.files.core:java-source:sources:3.3.1-SNAPSHOT in 1 seconds.
[INFO] 
[INFO] --- tycho-pack200b-plugin:0.20.0:pack (pack200-pack) @ org.eclipse.rse.subsystems.files.core ---
[INFO] Pack200 packing jar /jobs/genie.tm/tm-3.7-maintenance/workspace/rse/plugins/org.eclipse.rse.subsystems.files.core/target/org.eclipse.rse.subsystems.files.core-3.3.1-SNAPSHOT.jar
[INFO] 
[INFO] --- tycho-p2-plugin:0.20.0:p2-metadata (p2-metadata) @ org.eclipse.rse.subsystems.files.core ---
[INFO] 
[INFO] --- maven-install-plugin:2.3.1:install (default-install) @ org.eclipse.rse.subsystems.files.core ---
[INFO] Installing /jobs/genie.tm/tm-3.7-maintenance/workspace/rse/plugins/org.eclipse.rse.subsystems.files.core/target/org.eclipse.rse.subsystems.files.core-3.3.1-SNAPSHOT.jar to /home/hudson/genie.tm/.jenkins/jobs/tm-3.7-maintenance/workspace/.repository/org/eclipse/tm/org.eclipse.rse.subsystems.files.core/3.3.1-SNAPSHOT/org.eclipse.rse.subsystems.files.core-3.3.1-SNAPSHOT.jar
[INFO] Installing /jobs/genie.tm/tm-3.7-maintenance/workspace/rse/plugins/org.eclipse.rse.subsystems.files.core/pom.xml to /home/hudson/genie.tm/.jenkins/jobs/tm-3.7-maintenance/workspace/.repository/org/eclipse/tm/org.eclipse.rse.subsystems.files.core/3.3.1-SNAPSHOT/org.eclipse.rse.subsystems.files.core-3.3.1-SNAPSHOT.pom
[INFO] Installing /jobs/genie.tm/tm-3.7-maintenance/workspace/rse/plugins/org.eclipse.rse.subsystems.files.core/target/org.eclipse.rse.subsystems.files.core-3.3.1-SNAPSHOT-sources.jar to /home/hudson/genie.tm/.jenkins/jobs/tm-3.7-maintenance/workspace/.repository/org/eclipse/tm/org.eclipse.rse.subsystems.files.core/3.3.1-SNAPSHOT/org.eclipse.rse.subsystems.files.core-3.3.1-SNAPSHOT-sources.jar
[INFO] Installing /jobs/genie.tm/tm-3.7-maintenance/workspace/rse/plugins/org.eclipse.rse.subsystems.files.core/target/org.eclipse.rse.subsystems.files.core-3.3.1-SNAPSHOT.jar.pack.gz to /home/hudson/genie.tm/.jenkins/jobs/tm-3.7-maintenance/workspace/.repository/org/eclipse/tm/org.eclipse.rse.subsystems.files.core/3.3.1-SNAPSHOT/org.eclipse.rse.subsystems.files.core-3.3.1-SNAPSHOT-pack200.jar.pack.gz
[INFO] Installing /jobs/genie.tm/tm-3.7-maintenance/workspace/rse/plugins/org.eclipse.rse.subsystems.files.core/target/p2content.xml to /home/hudson/genie.tm/.jenkins/jobs/tm-3.7-maintenance/workspace/.repository/org/eclipse/tm/org.eclipse.rse.subsystems.files.core/3.3.1-SNAPSHOT/org.eclipse.rse.subsystems.files.core-3.3.1-SNAPSHOT-p2metadata.xml
[INFO] Installing /jobs/genie.tm/tm-3.7-maintenance/workspace/rse/plugins/org.eclipse.rse.subsystems.files.core/target/p2artifacts.xml to /home/hudson/genie.tm/.jenkins/jobs/tm-3.7-maintenance/workspace/.repository/org/eclipse/tm/org.eclipse.rse.subsystems.files.core/3.3.1-SNAPSHOT/org.eclipse.rse.subsystems.files.core-3.3.1-SNAPSHOT-p2artifacts.xml
[INFO] 
[INFO] --- tycho-p2-plugin:0.20.0:update-local-index (default-update-local-index) @ org.eclipse.rse.subsystems.files.core ---
[INFO] 
[INFO] ------------------------------------------------------------------------
[INFO] Building org.eclipse.rse.subsystems.shells.core 3.1.300-SNAPSHOT
[INFO] ------------------------------------------------------------------------
[INFO] 
[INFO] --- maven-clean-plugin:2.5:clean (default-clean) @ org.eclipse.rse.subsystems.shells.core ---
[INFO] 
[INFO] --- tycho-packaging-plugin:0.20.0:build-qualifier (default-build-qualifier) @ org.eclipse.rse.subsystems.shells.core ---
[INFO] The project's OSGi version is 3.1.300.201403271554
[INFO] 
[INFO] --- tycho-packaging-plugin:0.20.0:validate-id (default-validate-id) @ org.eclipse.rse.subsystems.shells.core ---
[INFO] 
[INFO] --- tycho-packaging-plugin:0.20.0:validate-version (default-validate-version) @ org.eclipse.rse.subsystems.shells.core ---
[INFO] 
[INFO] --- maven-resources-plugin:2.6:resources (default-resources) @ org.eclipse.rse.subsystems.shells.core ---
[INFO] Using 'UTF-8' encoding to copy filtered resources.
[INFO] skip non existing resourceDirectory /jobs/genie.tm/tm-3.7-maintenance/workspace/rse/plugins/org.eclipse.rse.subsystems.shells.core/src/main/resources
[INFO] 
[INFO] --- tycho-compiler-plugin:0.20.0:compile (default-compile) @ org.eclipse.rse.subsystems.shells.core ---
[WARNING] Effective compiler target 1.5 is incompatible with OSGi profile 'J2SE-1.4' { source level: 1.3, target level: 1.2} @ MavenProject: org.eclipse.tm:org.eclipse.rse.subsystems.shells.core:3.1.300-SNAPSHOT @ /jobs/genie.tm/tm-3.7-maintenance/workspace/rse/plugins/org.eclipse.rse.subsystems.shells.core/pom.xml
[INFO] Compiling 29 source files to /jobs/genie.tm/tm-3.7-maintenance/workspace/rse/plugins/org.eclipse.rse.subsystems.shells.core/target/classes
[INFO] 
[INFO] --- maven-resources-plugin:2.6:testResources (default-testResources) @ org.eclipse.rse.subsystems.shells.core ---
[INFO] Using 'UTF-8' encoding to copy filtered resources.
[INFO] skip non existing resourceDirectory /jobs/genie.tm/tm-3.7-maintenance/workspace/rse/plugins/org.eclipse.rse.subsystems.shells.core/src/test/resources
[INFO] 
[INFO] --- tycho-source-plugin:0.20.0:plugin-source (plugin-source) @ org.eclipse.rse.subsystems.shells.core ---
[INFO] Building jar: /jobs/genie.tm/tm-3.7-maintenance/workspace/rse/plugins/org.eclipse.rse.subsystems.shells.core/target/org.eclipse.rse.subsystems.shells.core-3.1.300-SNAPSHOT-sources.jar
[INFO] 
[INFO] --- tycho-packaging-plugin:0.20.0:package-plugin (default-package-plugin) @ org.eclipse.rse.subsystems.shells.core ---
[INFO] Building jar: /jobs/genie.tm/tm-3.7-maintenance/workspace/rse/plugins/org.eclipse.rse.subsystems.shells.core/target/org.eclipse.rse.subsystems.shells.core-3.1.300-SNAPSHOT.jar
[INFO] 
[INFO] --- tycho-p2-plugin:0.20.0:p2-metadata-default (default-p2-metadata-default) @ org.eclipse.rse.subsystems.shells.core ---
[INFO] 
[INFO] --- tycho-pack200a-plugin:0.20.0:normalize (pack200-normalize) @ org.eclipse.rse.subsystems.shells.core ---
[INFO] Pack200 normalizing jar /jobs/genie.tm/tm-3.7-maintenance/workspace/rse/plugins/org.eclipse.rse.subsystems.shells.core/target/org.eclipse.rse.subsystems.shells.core-3.1.300-SNAPSHOT.jar
[INFO] 
[INFO] --- eclipse-jarsigner-plugin:1.0.5:sign (sign) @ org.eclipse.rse.subsystems.shells.core ---
[INFO] Searching org.eclipse.rse.subsystems.shells.core-3.1.300-SNAPSHOT.jar for inner jars...
[INFO] Signed org.eclipse.tm:org.eclipse.rse.subsystems.shells.core:eclipse-plugin:3.1.300-SNAPSHOT in 5 seconds.
[INFO] Searching org.eclipse.rse.subsystems.shells.core-3.1.300-SNAPSHOT-sources.jar for inner jars...
[INFO] Signed org.eclipse.tm:org.eclipse.rse.subsystems.shells.core:java-source:sources:3.1.300-SNAPSHOT in 3 seconds.
[INFO] 
[INFO] --- tycho-pack200b-plugin:0.20.0:pack (pack200-pack) @ org.eclipse.rse.subsystems.shells.core ---
[INFO] Pack200 packing jar /jobs/genie.tm/tm-3.7-maintenance/workspace/rse/plugins/org.eclipse.rse.subsystems.shells.core/target/org.eclipse.rse.subsystems.shells.core-3.1.300-SNAPSHOT.jar
[INFO] ------------------------------------------------------------------------
[INFO] Reactor Summary:
[INFO] 
[INFO] Target Management Parent ........................... SUCCESS [03:12 min]
[INFO] org.eclipse.dstore.doc.isv ......................... SUCCESS [01:19 min]
[INFO] org.eclipse.rse.doc.isv ............................ SUCCESS [ 21.846 s]
[INFO] org.eclipse.rse.doc.user ........................... SUCCESS [ 12.343 s]
[INFO] org.eclipse.rse.services ........................... SUCCESS [02:01 min]
[INFO] org.eclipse.rse.core ............................... SUCCESS [ 19.959 s]
[INFO] org.eclipse.rse.ui ................................. SUCCESS [ 52.592 s]
[INFO] org.eclipse.rse.examples.daytime ................... SUCCESS [ 10.104 s]
[INFO] org.eclipse.rse.subsystems.files.core .............. SUCCESS [  7.322 s]
[INFO] org.eclipse.rse.subsystems.shells.core ............. FAILURE [ 25.779 s]
[INFO] org.eclipse.rse.files.ui ........................... SKIPPED
[INFO] org.eclipse.rse.shells.ui .......................... SKIPPED
[INFO] org.eclipse.rse.examples.tutorial .................. SKIPPED
[INFO] org.eclipse.rse.examples ........................... SKIPPED
[INFO] org.eclipse.dstore.extra ........................... SKIPPED
[INFO] org.eclipse.dstore.core ............................ SKIPPED
[INFO] org.eclipse.rse.services.dstore .................... SKIPPED
[INFO] org.eclipse.rse.connectorservice.dstore ............ SKIPPED
[INFO] org.eclipse.rse.examples.dstore .................... SKIPPED
[INFO] org.eclipse.rse.connectorservice.local ............. SKIPPED
[INFO] org.eclipse.rse.services.ssh ....................... SKIPPED
[INFO] org.eclipse.rse.connectorservice.ssh ............... SKIPPED
[INFO] org.eclipse.rse.services.telnet .................... SKIPPED
[INFO] org.eclipse.rse.connectorservice.telnet ............ SKIPPED
[INFO] org.eclipse.rse.efs ................................ SKIPPED
[INFO] org.eclipse.rse.efs.ui ............................. SKIPPED
[INFO] org.eclipse.rse.importexport ....................... SKIPPED
[INFO] org.eclipse.rse.subsystems.processes.core .......... SKIPPED
[INFO] org.eclipse.rse.processes.ui ....................... SKIPPED
[INFO] org.eclipse.rse.subsystems.processes.shell.linux ... SKIPPED
[INFO] org.eclipse.rse.core ............................... SKIPPED
[INFO] org.eclipse.rse.subsystems.files.dstore ............ SKIPPED
[INFO] org.eclipse.rse.subsystems.processes.dstore ........ SKIPPED
[INFO] org.eclipse.rse.subsystems.shells.dstore ........... SKIPPED
[INFO] org.eclipse.rse.dstore.security .................... SKIPPED
[INFO] org.eclipse.rse.dstore ............................. SKIPPED
[INFO] org.eclipse.rse.services.files.ftp ................. SKIPPED
[INFO] org.eclipse.rse.subsystems.files.ftp ............... SKIPPED
[INFO] org.eclipse.rse.ftp ................................ SKIPPED
[INFO] org.eclipse.rse.services.local ..................... SKIPPED
[INFO] org.eclipse.rse.subsystems.files.local ............. SKIPPED
[INFO] org.eclipse.rse.subsystems.processes.local ......... SKIPPED
[INFO] org.eclipse.rse.subsystems.shells.local ............ SKIPPED
[INFO] org.eclipse.rse.local .............................. SKIPPED
[INFO] org.eclipse.rse.subsystems.files.ssh ............... SKIPPED
[INFO] org.eclipse.rse.subsystems.shells.ssh .............. SKIPPED
[INFO] org.eclipse.rse.ssh ................................ SKIPPED
[INFO] org.eclipse.rse.subsystems.shells.telnet ........... SKIPPED
[INFO] org.eclipse.rse.telnet ............................. SKIPPED
[INFO] org.eclipse.rse.subsystems.terminals.core .......... SKIPPED
[INFO] org.eclipse.rse.subsystems.terminals.ssh ........... SKIPPED
[INFO] org.eclipse.tm.terminal ............................ SKIPPED
[INFO] org.eclipse.tm.terminal ............................ SKIPPED
[INFO] org.eclipse.rse.terminals.ui ....................... SKIPPED
[INFO] org.eclipse.rse.terminals .......................... SKIPPED
[INFO] org.eclipse.rse .................................... SKIPPED
[INFO] org.eclipse.rse .................................... SKIPPED
[INFO] org.eclipse.rse.core.source ........................ SKIPPED
[INFO] org.eclipse.rse.dstore.source ...................... SKIPPED
[INFO] org.eclipse.rse.ftp.source ......................... SKIPPED
[INFO] org.eclipse.rse.local.source ....................... SKIPPED
[INFO] org.eclipse.rse.subsystems.files.scp ............... SKIPPED
[INFO] org.eclipse.rse.scp ................................ SKIPPED
[INFO] org.eclipse.rse.ssh.source ......................... SKIPPED
[INFO] org.eclipse.rse.telnet.source ...................... SKIPPED
[INFO] org.eclipse.rse.sdk ................................ SKIPPED
[INFO] org.eclipse.rse.sdk ................................ SKIPPED
[INFO] org.eclipse.rse.terminals.source ................... SKIPPED
[INFO] org.eclipse.rse.useractions ........................ SKIPPED
[INFO] org.eclipse.rse.useractions ........................ SKIPPED
[INFO] org.eclipse.rse.ui.capabilities .................... SKIPPED
[INFO] org.eclipse.tm.terminal.local ...................... SKIPPED
[INFO] org.eclipse.tm.terminal.view ....................... SKIPPED
[INFO] org.eclipse.tm.terminal.local ...................... SKIPPED
[INFO] org.eclipse.tm.terminal.view ....................... SKIPPED
[INFO] org.eclipse.tm.terminal.local.sdk .................. SKIPPED
[INFO] org.eclipse.tm.terminal.serial ..................... SKIPPED
[INFO] org.eclipse.tm.terminal.serial ..................... SKIPPED
[INFO] org.eclipse.tm.terminal.ssh ........................ SKIPPED
[INFO] org.eclipse.tm.terminal.ssh ........................ SKIPPED
[INFO] org.eclipse.tm.terminal.telnet ..................... SKIPPED
[INFO] org.eclipse.tm.terminal.telnet ..................... SKIPPED
[INFO] org.eclipse.tm.terminal.sdk ........................ SKIPPED
[INFO] org.eclipse.tm.terminal.core.sdk ................... SKIPPED
[INFO] org.eclipse.tm.repo ................................ SKIPPED
[INFO] org.eclipse.tm.terminal.test ....................... SKIPPED
[INFO] org.eclipse.tm.terminal.test ....................... SKIPPED
[INFO] org.eclipse.tm.rapi ................................ SKIPPED
[INFO] org.eclipse.rse.subsystems.wince ................... SKIPPED
[INFO] org.eclipse.rse.wince .............................. SKIPPED
[INFO] ------------------------------------------------------------------------
[INFO] BUILD FAILURE
[INFO] ------------------------------------------------------------------------
[INFO] Total time: 01:02 h
[INFO] Finished at: 2018-02-06T13:28:35-05:00
[INFO] Final Memory: 267M/1895M
[INFO] ------------------------------------------------------------------------
[ERROR] Failed to execute goal org.eclipse.tycho.extras:tycho-pack200b-plugin:0.20.0:pack (pack200-pack) on project org.eclipse.rse.subsystems.shells.core: Execution pack200-pack of goal org.eclipse.tycho.extras:tycho-pack200b-plugin:0.20.0:pack failed: MALFORMED -> [Help 1]
[ERROR] 
[ERROR] To see the full stack trace of the errors, re-run Maven with the -e switch.
[ERROR] Re-run Maven using the -X switch to enable full debug logging.
[ERROR] 
[ERROR] For more information about the errors and possible solutions, please read the following articles:
[ERROR] [Help 1] http://cwiki.apache.org/confluence/display/MAVEN/PluginExecutionException
[ERROR] 
[ERROR] After correcting the problems, you can resume the build with the command
[ERROR]   mvn <goals> -rf :org.eclipse.rse.subsystems.shells.core
Build step 'Invoke top-level Maven targets' marked build as failure
Terminating xvnc.
Sending e-mails to: g.watson@computer.org
Recording test results
ERROR: Step ‘Publish JUnit test result report’ failed: No test report files were found. Configuration error?
Archiving artifacts
Started calculate disk usage of build
Finished Calculation of disk usage of build in 0 seconds
Started calculate disk usage of workspace
Finished Calculation of disk usage of workspace in 0 seconds
Finished: FAILURE