FailedConsole Output

Skipping 1,292 KB.. Full Log
	return file.toURL().openStream();
	            ^^^^^^^
The method toURL() from the type File is deprecated
[WARNING] /jobs/genie.tm/rse-gerrit_master/workspace/rse/plugins/org.eclipse.rse.services.dstore/miners/org/eclipse/rse/dstore/universal/miners/UniversalFileSystemMiner.java:[2125] 
	simpleShellCommand("chown " + permAttributes[1] + ":" + permAttributes[2], file); //$NON-NLS-1$
	                                                  ^^^
Non-externalized string literal; it should be followed by //$NON-NLS-<n>$
[WARNING] /jobs/genie.tm/rse-gerrit_master/workspace/rse/plugins/org.eclipse.rse.services.dstore/miners/org/eclipse/rse/dstore/universal/miners/UniversalServerUtilities.java:[24] 
	import java.io.File;
	       ^^^^^^^^^^^^
The import java.io.File is never used
[WARNING] /jobs/genie.tm/rse-gerrit_master/workspace/rse/plugins/org.eclipse.rse.services.dstore/miners/org/eclipse/rse/dstore/universal/miners/UniversalServerUtilities.java:[56] 
	* @param minerName
	         ^^^^^^^^^
Javadoc: Description expected after this reference
[WARNING] /jobs/genie.tm/rse-gerrit_master/workspace/rse/plugins/org.eclipse.rse.services.dstore/miners/org/eclipse/rse/dstore/universal/miners/UniversalServerUtilities.java:[69] 
	* @param minerName
	         ^^^^^^^^^
Javadoc: Description expected after this reference
[WARNING] /jobs/genie.tm/rse-gerrit_master/workspace/rse/plugins/org.eclipse.rse.services.dstore/miners/org/eclipse/rse/dstore/universal/miners/UniversalServerUtilities.java:[81] 
	* @param minerName
	         ^^^^^^^^^
Javadoc: Description expected after this reference
[WARNING] /jobs/genie.tm/rse-gerrit_master/workspace/rse/plugins/org.eclipse.rse.services.dstore/miners/org/eclipse/rse/dstore/universal/miners/UniversalServerUtilities.java:[95] 
	* @param minerName
	         ^^^^^^^^^
Javadoc: Description expected after this reference
[WARNING] /jobs/genie.tm/rse-gerrit_master/workspace/rse/plugins/org.eclipse.rse.services.dstore/miners/org/eclipse/rse/dstore/universal/miners/UniversalServerUtilities.java:[109] 
	* @param dataStore
	         ^^^^^^^^^
Javadoc: Description expected after this reference
[WARNING] /jobs/genie.tm/rse-gerrit_master/workspace/rse/plugins/org.eclipse.rse.services.dstore/miners/org/eclipse/rse/internal/dstore/universal/miners/filesystem/RenameThread.java:[114] 
	_subject.setAttribute(DE.A_SOURCE, _miner.setProperties(handler
	                                                        ^^^^^^^
Null pointer access: The variable handler can only be null at this location
[WARNING] /jobs/genie.tm/rse-gerrit_master/workspace/rse/plugins/org.eclipse.rse.services.dstore/miners/org/eclipse/rse/internal/dstore/universal/miners/command/CommandMinerThread.java:[584] 
	boolean unsupportedPrompt = theShell.endsWith("bsh") ||   //$NON-NLS-1$//$NON-NLS-2$
	                                                                       ^^^^^^^^^^^^^
Unnecessary $NON-NLS$ tag
[WARNING] /jobs/genie.tm/rse-gerrit_master/workspace/rse/plugins/org.eclipse.rse.services.dstore/src/org/eclipse/rse/internal/services/dstore/shells/DStoreShellThread.java:[57] 
	* @param encoding
	         ^^^^^^^^
Javadoc: Description expected after this reference
[WARNING] /jobs/genie.tm/rse-gerrit_master/workspace/rse/plugins/org.eclipse.rse.services.dstore/src/org/eclipse/rse/internal/services/dstore/shells/DStoreShellThread.java:[306] 
	output.append("&#38;");
	              ^^^^^^^
Non-externalized string literal; it should be followed by //$NON-NLS-<n>$
[WARNING] /jobs/genie.tm/rse-gerrit_master/workspace/rse/plugins/org.eclipse.rse.services.dstore/src/org/eclipse/rse/internal/services/dstore/shells/DStoreShellThread.java:[309] 
	output.append("&#59;");
	              ^^^^^^^
Non-externalized string literal; it should be followed by //$NON-NLS-<n>$
[WARNING] /jobs/genie.tm/rse-gerrit_master/workspace/rse/plugins/org.eclipse.rse.services.dstore/src/org/eclipse/rse/services/dstore/AbstractDStoreService.java:[53] 
	* @param dataStoreProvider
	         ^^^^^^^^^^^^^^^^^
Javadoc: Description expected after this reference
[WARNING] /jobs/genie.tm/rse-gerrit_master/workspace/rse/plugins/org.eclipse.rse.services.dstore/src/org/eclipse/rse/services/dstore/AbstractDStoreService.java:[107] 
	* @param monitor
	         ^^^^^^^
Javadoc: Description expected after this reference
[WARNING] /jobs/genie.tm/rse-gerrit_master/workspace/rse/plugins/org.eclipse.rse.services.dstore/src/org/eclipse/rse/internal/services/dstore/files/DStoreFileService.java:[105] 
	import org.eclipse.rse.internal.services.RSEServicesMessages;
	       ^^^^^^^^^^^^^^^^^^^^^^^^^^^^^^^^^^^^^^^^^^^^^^^^^^^^^
Discouraged access: The type 'RSEServicesMessages' is not API (restriction on classpath entry '/jobs/genie.tm/rse-gerrit_master/workspace/rse/plugins/org.eclipse.rse.services/target/classes')
[WARNING] /jobs/genie.tm/rse-gerrit_master/workspace/rse/plugins/org.eclipse.rse.services.dstore/src/org/eclipse/rse/internal/services/dstore/files/DStoreFileService.java:[136] 
	import org.eclipse.rse.services.files.RemoteFileSecurityException;
	       ^^^^^^^^^^^^^^^^^^^^^^^^^^^^^^^^^^^^^^^^^^^^^^^^^^^^^^^^^^
The type RemoteFileSecurityException is deprecated
[WARNING] /jobs/genie.tm/rse-gerrit_master/workspace/rse/plugins/org.eclipse.rse.services.dstore/src/org/eclipse/rse/internal/services/dstore/files/DStoreFileService.java:[374] 
	long totalSent = 0;
	     ^^^^^^^^^
The value of the local variable totalSent is not used
[WARNING] /jobs/genie.tm/rse-gerrit_master/workspace/rse/plugins/org.eclipse.rse.services.dstore/src/org/eclipse/rse/internal/services/dstore/files/DStoreFileService.java:[866] 
	StringBuffer msgTxtBuffer = new StringBuffer(RSEServicesMessages.FILEMSG_OPERATION_FAILED);
	                                             ^^^^^^^^^^^^^^^^^^^^^^^^^^^^^^^^^^^^^^^^^^^^
Discouraged access: The type 'RSEServicesMessages' is not API (restriction on classpath entry '/jobs/genie.tm/rse-gerrit_master/workspace/rse/plugins/org.eclipse.rse.services/target/classes')
[WARNING] /jobs/genie.tm/rse-gerrit_master/workspace/rse/plugins/org.eclipse.rse.services.dstore/src/org/eclipse/rse/internal/services/dstore/files/DStoreFileService.java:[866] 
	StringBuffer msgTxtBuffer = new StringBuffer(RSEServicesMessages.FILEMSG_OPERATION_FAILED);
	                                                                 ^^^^^^^^^^^^^^^^^^^^^^^^
Discouraged access: The field 'RSEServicesMessages.FILEMSG_OPERATION_FAILED' is not API (restriction on classpath entry '/jobs/genie.tm/rse-gerrit_master/workspace/rse/plugins/org.eclipse.rse.services/target/classes')
[WARNING] /jobs/genie.tm/rse-gerrit_master/workspace/rse/plugins/org.eclipse.rse.services.dstore/src/org/eclipse/rse/internal/services/dstore/files/DStoreFileService.java:[872] 
	msgTxtBuffer.append(" -> ");
	                    ^^^^^^
Non-externalized string literal; it should be followed by //$NON-NLS-<n>$
[WARNING] /jobs/genie.tm/rse-gerrit_master/workspace/rse/plugins/org.eclipse.rse.services.dstore/src/org/eclipse/rse/internal/services/dstore/files/DStoreFileService.java:[1118] 
	StringBuffer msgTxtBuffer = new StringBuffer(RSEServicesMessages.FILEMSG_OPERATION_FAILED);
	                                             ^^^^^^^^^^^^^^^^^^^^^^^^^^^^^^^^^^^^^^^^^^^^
Discouraged access: The type 'RSEServicesMessages' is not API (restriction on classpath entry '/jobs/genie.tm/rse-gerrit_master/workspace/rse/plugins/org.eclipse.rse.services/target/classes')
[WARNING] /jobs/genie.tm/rse-gerrit_master/workspace/rse/plugins/org.eclipse.rse.services.dstore/src/org/eclipse/rse/internal/services/dstore/files/DStoreFileService.java:[1118] 
	StringBuffer msgTxtBuffer = new StringBuffer(RSEServicesMessages.FILEMSG_OPERATION_FAILED);
	                                                                 ^^^^^^^^^^^^^^^^^^^^^^^^
Discouraged access: The field 'RSEServicesMessages.FILEMSG_OPERATION_FAILED' is not API (restriction on classpath entry '/jobs/genie.tm/rse-gerrit_master/workspace/rse/plugins/org.eclipse.rse.services/target/classes')
[WARNING] /jobs/genie.tm/rse-gerrit_master/workspace/rse/plugins/org.eclipse.rse.services.dstore/src/org/eclipse/rse/internal/services/dstore/files/DStoreFileService.java:[1124] 
	msgTxtBuffer.append(" -> ");
	                    ^^^^^^
Non-externalized string literal; it should be followed by //$NON-NLS-<n>$
[WARNING] /jobs/genie.tm/rse-gerrit_master/workspace/rse/plugins/org.eclipse.rse.services.dstore/src/org/eclipse/rse/internal/services/dstore/files/DStoreFileService.java:[1482] 
	RemoteFileSecurityException messageException = new RemoteFileSecurityException(e);
	^^^^^^^^^^^^^^^^^^^^^^^^^^^
The type RemoteFileSecurityException is deprecated
[WARNING] /jobs/genie.tm/rse-gerrit_master/workspace/rse/plugins/org.eclipse.rse.services.dstore/src/org/eclipse/rse/internal/services/dstore/files/DStoreFileService.java:[1482] 
	RemoteFileSecurityException messageException = new RemoteFileSecurityException(e);
	                                                   ^^^^^^^^^^^^^^^^^^^^^^^^^^^
The type RemoteFileSecurityException is deprecated
[WARNING] /jobs/genie.tm/rse-gerrit_master/workspace/rse/plugins/org.eclipse.rse.services.dstore/src/org/eclipse/rse/internal/services/dstore/files/DStoreFileService.java:[1482] 
	RemoteFileSecurityException messageException = new RemoteFileSecurityException(e);
	                                                   ^^^^^^^^^^^^^^^^^^^^^^^^^^^^^^
The constructor RemoteFileSecurityException(Exception) is deprecated
[WARNING] /jobs/genie.tm/rse-gerrit_master/workspace/rse/plugins/org.eclipse.rse.services.dstore/src/org/eclipse/rse/internal/services/dstore/files/DStoreFileService.java:[1526] 
	RemoteFileSecurityException messageException = new RemoteFileSecurityException(e);
	^^^^^^^^^^^^^^^^^^^^^^^^^^^
The type RemoteFileSecurityException is deprecated
[WARNING] /jobs/genie.tm/rse-gerrit_master/workspace/rse/plugins/org.eclipse.rse.services.dstore/src/org/eclipse/rse/internal/services/dstore/files/DStoreFileService.java:[1526] 
	RemoteFileSecurityException messageException = new RemoteFileSecurityException(e);
	                                                   ^^^^^^^^^^^^^^^^^^^^^^^^^^^
The type RemoteFileSecurityException is deprecated
[WARNING] /jobs/genie.tm/rse-gerrit_master/workspace/rse/plugins/org.eclipse.rse.services.dstore/src/org/eclipse/rse/internal/services/dstore/files/DStoreFileService.java:[1526] 
	RemoteFileSecurityException messageException = new RemoteFileSecurityException(e);
	                                                   ^^^^^^^^^^^^^^^^^^^^^^^^^^^^^^
The constructor RemoteFileSecurityException(Exception) is deprecated
[WARNING] /jobs/genie.tm/rse-gerrit_master/workspace/rse/plugins/org.eclipse.rse.services.dstore/src/org/eclipse/rse/internal/services/dstore/files/DStoreFileService.java:[1671] 
	if (status != null && status.getAttribute(DE.A_SOURCE).equals("failed"))
	                                                              ^^^^^^^^
Non-externalized string literal; it should be followed by //$NON-NLS-<n>$
[WARNING] /jobs/genie.tm/rse-gerrit_master/workspace/rse/plugins/org.eclipse.rse.services.dstore/src/org/eclipse/rse/internal/services/dstore/files/DStoreFileService.java:[2386] 
	public OutputStream getOutputStream(String remoteParent, String remoteFile, boolean isBinary, IProgressMonitor monitor) throws SystemMessageException {
	                    ^^^^^^^^^^^^^^^^^^^^^^^^^^^^^^^^^^^^^^^^^^^^^^^^^^^^^^^^^^^^^^^^^^^^^^^^^^^^^^^^^^^^^^^^^^^^^^^^^^^^^^^^^^^^^^^^^^^^^^^^^^^^^^^^^
The method DStoreFileService.getOutputStream(String, String, boolean, IProgressMonitor) overrides a deprecated method from IFileService
[WARNING] /jobs/genie.tm/rse-gerrit_master/workspace/rse/plugins/org.eclipse.rse.services.dstore/miners/org/eclipse/rse/internal/dstore/universal/miners/filesystem/UniversalDownloadHandler.java:[32] 
	import java.lang.reflect.Method;
	       ^^^^^^^^^^^^^^^^^^^^^^^^
The import java.lang.reflect.Method is never used
[WARNING] /jobs/genie.tm/rse-gerrit_master/workspace/rse/plugins/org.eclipse.rse.services.dstore/src/org/eclipse/rse/services/dstore/util/DStoreStatusMonitor.java:[288] 
	!status.getDataStore().getStatus().getName().equals("okay")) // datastore not okay?
	                                                    ^^^^^^
Non-externalized string literal; it should be followed by //$NON-NLS-<n>$
[WARNING] /jobs/genie.tm/rse-gerrit_master/workspace/rse/plugins/org.eclipse.rse.services.dstore/src/org/eclipse/rse/services/dstore/util/DStoreStatusMonitor.java:[333] 
	* @param cmdDescriptor
	         ^^^^^^^^^^^^^
Javadoc: Description expected after this reference
[WARNING] /jobs/genie.tm/rse-gerrit_master/workspace/rse/plugins/org.eclipse.rse.services.dstore/src/org/eclipse/rse/services/dstore/util/DStoreStatusMonitor.java:[334] 
	* @param subject
	         ^^^^^^^
Javadoc: Description expected after this reference
[WARNING] /jobs/genie.tm/rse-gerrit_master/workspace/rse/plugins/org.eclipse.rse.services.dstore/miners/org/eclipse/rse/internal/dstore/universal/miners/filesystem/FileClassifier.java:[118] 
	private DataStore _dataStore;
	                  ^^^^^^^^^^
The field FileClassifier._dataStore is hiding a field from type SecuredThread
[WARNING] /jobs/genie.tm/rse-gerrit_master/workspace/rse/plugins/org.eclipse.rse.services.dstore/miners/org/eclipse/rse/internal/dstore/universal/miners/filesystem/FileClassifier.java:[957] 
	_dataStore.trace("out of loop");
	                 ^^^^^^^^^^^^^
Non-externalized string literal; it should be followed by //$NON-NLS-<n>$
[WARNING] /jobs/genie.tm/rse-gerrit_master/workspace/rse/plugins/org.eclipse.rse.services.dstore/miners/org/eclipse/rse/internal/dstore/universal/miners/filesystem/FileClassifier.java:[965] 
	_dataStore.trace("has links");
	                 ^^^^^^^^^^^
Non-externalized string literal; it should be followed by //$NON-NLS-<n>$
[WARNING] /jobs/genie.tm/rse-gerrit_master/workspace/rse/plugins/org.eclipse.rse.services.dstore/src/org/eclipse/rse/internal/services/dstore/processes/DStoreHostProcess.java:[391] 
	* @param allProperties
	         ^^^^^^^^^^^^^
Javadoc: Description expected after this reference
[WARNING] /jobs/genie.tm/rse-gerrit_master/workspace/rse/plugins/org.eclipse.rse.services.dstore/src/org/eclipse/rse/internal/services/dstore/processes/DStoreHostProcess.java:[486] 
	* @param attIndex
	         ^^^^^^^^
Javadoc: Description expected after this reference
[WARNING] /jobs/genie.tm/rse-gerrit_master/workspace/rse/plugins/org.eclipse.rse.services.dstore/src/org/eclipse/rse/internal/services/dstore/processes/DStoreHostProcess.java:[487] 
	* @param newSubAttribute
	         ^^^^^^^^^^^^^^^
Javadoc: Description expected after this reference
54 problems (54 warnings)
[INFO] 
[INFO] --- maven-resources-plugin:2.7:testResources (default-testResources) @ org.eclipse.rse.services.dstore ---
[INFO] Not copying test resources
[INFO] 
[INFO] --- target-platform-configuration:1.6.0:target-platform (default-target-platform) @ org.eclipse.rse.services.dstore ---
[INFO] 
[INFO] --- tycho-packaging-plugin:1.6.0:package-plugin (default-package-plugin) @ org.eclipse.rse.services.dstore ---
[INFO] Building jar: /jobs/genie.tm/rse-gerrit_master/workspace/rse/plugins/org.eclipse.rse.services.dstore/dstore_miners.jar
[INFO] Building jar: /jobs/genie.tm/rse-gerrit_master/workspace/rse/plugins/org.eclipse.rse.services.dstore/target/org.eclipse.rse.services.dstore-4.5.100-SNAPSHOT.jar
[INFO] 
[INFO] --- tycho-p2-plugin:1.6.0:p2-metadata-default (default-p2-metadata-default) @ org.eclipse.rse.services.dstore ---
[INFO] 
[INFO] --- maven-install-plugin:2.3.1:install (default-install) @ org.eclipse.rse.services.dstore ---
[INFO] Installing /jobs/genie.tm/rse-gerrit_master/workspace/rse/plugins/org.eclipse.rse.services.dstore/target/org.eclipse.rse.services.dstore-4.5.100-SNAPSHOT.jar to /home/hudson/genie.tm/.jenkins/jobs/rse-gerrit_master/workspace/.repository/org/eclipse/tm/org.eclipse.rse.services.dstore/4.5.100-SNAPSHOT/org.eclipse.rse.services.dstore-4.5.100-SNAPSHOT.jar
[INFO] Installing /jobs/genie.tm/rse-gerrit_master/workspace/rse/plugins/org.eclipse.rse.services.dstore/pom.xml to /home/hudson/genie.tm/.jenkins/jobs/rse-gerrit_master/workspace/.repository/org/eclipse/tm/org.eclipse.rse.services.dstore/4.5.100-SNAPSHOT/org.eclipse.rse.services.dstore-4.5.100-SNAPSHOT.pom
[INFO] Installing /jobs/genie.tm/rse-gerrit_master/workspace/rse/plugins/org.eclipse.rse.services.dstore/target/p2content.xml to /home/hudson/genie.tm/.jenkins/jobs/rse-gerrit_master/workspace/.repository/org/eclipse/tm/org.eclipse.rse.services.dstore/4.5.100-SNAPSHOT/org.eclipse.rse.services.dstore-4.5.100-SNAPSHOT-p2metadata.xml
[INFO] Installing /jobs/genie.tm/rse-gerrit_master/workspace/rse/plugins/org.eclipse.rse.services.dstore/target/p2artifacts.xml to /home/hudson/genie.tm/.jenkins/jobs/rse-gerrit_master/workspace/.repository/org/eclipse/tm/org.eclipse.rse.services.dstore/4.5.100-SNAPSHOT/org.eclipse.rse.services.dstore-4.5.100-SNAPSHOT-p2artifacts.xml
[INFO] 
[INFO] --- tycho-p2-plugin:1.6.0:update-local-index (default-update-local-index) @ org.eclipse.rse.services.dstore ---
[INFO] 
[INFO] ------------------------------------------------------------------------
[INFO] Skipping org.eclipse.rse.connectorservice.dstore
[INFO] This project has been banned from the build due to previous failures.
[INFO] ------------------------------------------------------------------------
[INFO] 
[INFO] ------------------------------------------------------------------------
[INFO] Skipping org.eclipse.rse.examples.dstore
[INFO] This project has been banned from the build due to previous failures.
[INFO] ------------------------------------------------------------------------
[INFO] 
[INFO] ------------------------------------------------------------------------
[INFO] Skipping org.eclipse.rse.subsystems.shells.core
[INFO] This project has been banned from the build due to previous failures.
[INFO] ------------------------------------------------------------------------
[INFO] 
[INFO] ------------------------------------------------------------------------
[INFO] Skipping org.eclipse.rse.files.ui
[INFO] This project has been banned from the build due to previous failures.
[INFO] ------------------------------------------------------------------------
[INFO] 
[INFO] ------------------------------------------------------------------------
[INFO] Skipping org.eclipse.rse.shells.ui
[INFO] This project has been banned from the build due to previous failures.
[INFO] ------------------------------------------------------------------------
[INFO] 
[INFO] ------------------------------------------------------------------------
[INFO] Skipping org.eclipse.rse.examples.tutorial
[INFO] This project has been banned from the build due to previous failures.
[INFO] ------------------------------------------------------------------------
[INFO] 
[INFO] ------------------------------------------------------------------------
[INFO] Skipping org.eclipse.rse.examples
[INFO] This project has been banned from the build due to previous failures.
[INFO] ------------------------------------------------------------------------
[INFO] 
[INFO] -----------< org.eclipse.tm.rse:org.eclipse.tm.rse.features >-----------
[INFO] Building org.eclipse.tm.rse.features 4.5.100-SNAPSHOT            [17/81]
[INFO] --------------------------------[ pom ]---------------------------------
[INFO] 
[INFO] --- maven-clean-plugin:2.5:clean (default-clean) @ org.eclipse.tm.rse.features ---
[INFO] 
[INFO] --- maven-install-plugin:2.4:install (default-install) @ org.eclipse.tm.rse.features ---
[INFO] Installing /jobs/genie.tm/rse-gerrit_master/workspace/rse/features/pom.xml to /home/hudson/genie.tm/.jenkins/jobs/rse-gerrit_master/workspace/.repository/org/eclipse/tm/rse/org.eclipse.tm.rse.features/4.5.100-SNAPSHOT/org.eclipse.tm.rse.features-4.5.100-SNAPSHOT.pom
[INFO] 
[INFO] ------------------------------------------------------------------------
[INFO] Skipping org.eclipse.rse.efs
[INFO] This project has been banned from the build due to previous failures.
[INFO] ------------------------------------------------------------------------
[INFO] 
[INFO] ------------------------------------------------------------------------
[INFO] Skipping org.eclipse.rse.efs.ui
[INFO] This project has been banned from the build due to previous failures.
[INFO] ------------------------------------------------------------------------
[INFO] 
[INFO] ------------------------------------------------------------------------
[INFO] Skipping org.eclipse.rse.importexport
[INFO] This project has been banned from the build due to previous failures.
[INFO] ------------------------------------------------------------------------
[INFO] 
[INFO] ------------------------------------------------------------------------
[INFO] Skipping org.eclipse.rse.subsystems.processes.core
[INFO] This project has been banned from the build due to previous failures.
[INFO] ------------------------------------------------------------------------
[INFO] 
[INFO] ------------------------------------------------------------------------
[INFO] Skipping org.eclipse.rse.processes.ui
[INFO] This project has been banned from the build due to previous failures.
[INFO] ------------------------------------------------------------------------
[INFO] 
[INFO] ------------------------------------------------------------------------
[INFO] Skipping org.eclipse.rse.subsystems.processes.shell.linux
[INFO] This project has been banned from the build due to previous failures.
[INFO] ------------------------------------------------------------------------
[INFO] 
[INFO] ------------------------------------------------------------------------
[INFO] Skipping org.eclipse.rse.core
[INFO] This project has been banned from the build due to previous failures.
[INFO] ------------------------------------------------------------------------
[INFO] 
[INFO] ------------------------------------------------------------------------
[INFO] Skipping org.eclipse.rse.subsystems.files.dstore
[INFO] This project has been banned from the build due to previous failures.
[INFO] ------------------------------------------------------------------------
[INFO] 
[INFO] ------------------------------------------------------------------------
[INFO] Skipping org.eclipse.rse.subsystems.processes.dstore
[INFO] This project has been banned from the build due to previous failures.
[INFO] ------------------------------------------------------------------------
[INFO] 
[INFO] ------------------------------------------------------------------------
[INFO] Skipping org.eclipse.rse.subsystems.shells.dstore
[INFO] This project has been banned from the build due to previous failures.
[INFO] ------------------------------------------------------------------------
[INFO] 
[INFO] ------------------------------------------------------------------------
[INFO] Skipping org.eclipse.rse.dstore.security
[INFO] This project has been banned from the build due to previous failures.
[INFO] ------------------------------------------------------------------------
[INFO] 
[INFO] ------------------------------------------------------------------------
[INFO] Skipping org.eclipse.rse.dstore
[INFO] This project has been banned from the build due to previous failures.
[INFO] ------------------------------------------------------------------------
[INFO] 
[INFO] -------------------< org.eclipse.tm:org.eclipse.rse >-------------------
[INFO] Building org.eclipse.rse 4.5.100-SNAPSHOT                        [18/81]
[INFO] ---------------------------[ eclipse-plugin ]---------------------------
[INFO] 
[INFO] --- maven-clean-plugin:2.5:clean (default-clean) @ org.eclipse.rse ---
[INFO] 
[INFO] --- tycho-packaging-plugin:1.6.0:build-qualifier (default-build-qualifier) @ org.eclipse.rse ---
[INFO] The project's OSGi version is 4.5.100.201901312252
[INFO] 
[INFO] --- tycho-packaging-plugin:1.6.0:validate-id (default-validate-id) @ org.eclipse.rse ---
[INFO] 
[INFO] --- tycho-packaging-plugin:1.6.0:validate-version (default-validate-version) @ org.eclipse.rse ---
[INFO] 
[INFO] --- maven-resources-plugin:2.7:resources (default-resources) @ org.eclipse.rse ---
[INFO] Using 'UTF-8' encoding to copy filtered resources.
[INFO] skip non existing resourceDirectory /jobs/genie.tm/rse-gerrit_master/workspace/rse/plugins/org.eclipse.rse/src/main/resources
[INFO] 
[INFO] --- tycho-compiler-plugin:1.6.0:compile (default-compile) @ org.eclipse.rse ---
[INFO] Nothing to compile - all classes are up to date
[INFO] 
[INFO] --- maven-resources-plugin:2.7:testResources (default-testResources) @ org.eclipse.rse ---
[INFO] Not copying test resources
[INFO] 
[INFO] --- target-platform-configuration:1.6.0:target-platform (default-target-platform) @ org.eclipse.rse ---
[INFO] 
[INFO] --- tycho-packaging-plugin:1.6.0:package-plugin (default-package-plugin) @ org.eclipse.rse ---
[INFO] Building jar: /jobs/genie.tm/rse-gerrit_master/workspace/rse/plugins/org.eclipse.rse/target/org.eclipse.rse-4.5.100-SNAPSHOT.jar
[INFO] 
[INFO] --- tycho-p2-plugin:1.6.0:p2-metadata-default (default-p2-metadata-default) @ org.eclipse.rse ---
[INFO] 
[INFO] --- maven-install-plugin:2.3.1:install (default-install) @ org.eclipse.rse ---
[INFO] Installing /jobs/genie.tm/rse-gerrit_master/workspace/rse/plugins/org.eclipse.rse/target/org.eclipse.rse-4.5.100-SNAPSHOT.jar to /home/hudson/genie.tm/.jenkins/jobs/rse-gerrit_master/workspace/.repository/org/eclipse/tm/org.eclipse.rse/4.5.100-SNAPSHOT/org.eclipse.rse-4.5.100-SNAPSHOT.jar
[INFO] Installing /jobs/genie.tm/rse-gerrit_master/workspace/rse/plugins/org.eclipse.rse/pom.xml to /home/hudson/genie.tm/.jenkins/jobs/rse-gerrit_master/workspace/.repository/org/eclipse/tm/org.eclipse.rse/4.5.100-SNAPSHOT/org.eclipse.rse-4.5.100-SNAPSHOT.pom
[INFO] Installing /jobs/genie.tm/rse-gerrit_master/workspace/rse/plugins/org.eclipse.rse/target/p2content.xml to /home/hudson/genie.tm/.jenkins/jobs/rse-gerrit_master/workspace/.repository/org/eclipse/tm/org.eclipse.rse/4.5.100-SNAPSHOT/org.eclipse.rse-4.5.100-SNAPSHOT-p2metadata.xml
[INFO] Installing /jobs/genie.tm/rse-gerrit_master/workspace/rse/plugins/org.eclipse.rse/target/p2artifacts.xml to /home/hudson/genie.tm/.jenkins/jobs/rse-gerrit_master/workspace/.repository/org/eclipse/tm/org.eclipse.rse/4.5.100-SNAPSHOT/org.eclipse.rse-4.5.100-SNAPSHOT-p2artifacts.xml
[INFO] 
[INFO] --- tycho-p2-plugin:1.6.0:update-local-index (default-update-local-index) @ org.eclipse.rse ---
[INFO] 
[INFO] ------------------------------------------------------------------------
[INFO] Skipping org.eclipse.rse.connectorservice.local
[INFO] This project has been banned from the build due to previous failures.
[INFO] ------------------------------------------------------------------------
[INFO] 
[INFO] ------------< org.eclipse.tm:org.eclipse.rse.services.ssh >-------------
[INFO] Building org.eclipse.rse.services.ssh 4.5.100-SNAPSHOT           [19/81]
[INFO] ---------------------------[ eclipse-plugin ]---------------------------
[INFO] 
[INFO] --- maven-clean-plugin:2.5:clean (default-clean) @ org.eclipse.rse.services.ssh ---
[INFO] 
[INFO] --- tycho-packaging-plugin:1.6.0:build-qualifier (default-build-qualifier) @ org.eclipse.rse.services.ssh ---
[INFO] The project's OSGi version is 4.5.100.202004221802
[INFO] 
[INFO] --- tycho-packaging-plugin:1.6.0:validate-id (default-validate-id) @ org.eclipse.rse.services.ssh ---
[INFO] 
[INFO] --- tycho-packaging-plugin:1.6.0:validate-version (default-validate-version) @ org.eclipse.rse.services.ssh ---
[INFO] 
[INFO] --- maven-resources-plugin:2.7:resources (default-resources) @ org.eclipse.rse.services.ssh ---
[INFO] Using 'UTF-8' encoding to copy filtered resources.
[INFO] skip non existing resourceDirectory /jobs/genie.tm/rse-gerrit_master/workspace/rse/plugins/org.eclipse.rse.services.ssh/src/main/resources
[INFO] 
[INFO] --- tycho-compiler-plugin:1.6.0:compile (default-compile) @ org.eclipse.rse.services.ssh ---
[INFO] Compiling 11 source files to /jobs/genie.tm/rse-gerrit_master/workspace/rse/plugins/org.eclipse.rse.services.ssh/target/classes
[WARNING] /jobs/genie.tm/rse-gerrit_master/workspace/rse/plugins/org.eclipse.rse.services.ssh/src/org/eclipse/rse/internal/services/ssh/files/SftpFileService.java:[72] 
	import org.eclipse.core.runtime.SubProgressMonitor;
	       ^^^^^^^^^^^^^^^^^^^^^^^^^^^^^^^^^^^^^^^^^^^
The type SubProgressMonitor is deprecated
[WARNING] /jobs/genie.tm/rse-gerrit_master/workspace/rse/plugins/org.eclipse.rse.services.ssh/src/org/eclipse/rse/internal/services/ssh/files/SftpFileService.java:[108] 
	import org.eclipse.rse.services.files.RemoteFileSecurityException;
	       ^^^^^^^^^^^^^^^^^^^^^^^^^^^^^^^^^^^^^^^^^^^^^^^^^^^^^^^^^^
The type RemoteFileSecurityException is deprecated
[WARNING] /jobs/genie.tm/rse-gerrit_master/workspace/rse/plugins/org.eclipse.rse.services.ssh/src/org/eclipse/rse/internal/services/ssh/files/SftpFileService.java:[593] 
	messageException = new RemoteFileSecurityException(e);
	                       ^^^^^^^^^^^^^^^^^^^^^^^^^^^
The type RemoteFileSecurityException is deprecated
[WARNING] /jobs/genie.tm/rse-gerrit_master/workspace/rse/plugins/org.eclipse.rse.services.ssh/src/org/eclipse/rse/internal/services/ssh/files/SftpFileService.java:[593] 
	messageException = new RemoteFileSecurityException(e);
	                       ^^^^^^^^^^^^^^^^^^^^^^^^^^^^^^
The constructor RemoteFileSecurityException(Exception) is deprecated
[WARNING] /jobs/genie.tm/rse-gerrit_master/workspace/rse/plugins/org.eclipse.rse.services.ssh/src/org/eclipse/rse/internal/services/ssh/files/SftpFileService.java:[680] 
	monitor = new SubProgressMonitor(monitor, 40);
	              ^^^^^^^^^^^^^^^^^^
The type SubProgressMonitor is deprecated
[WARNING] /jobs/genie.tm/rse-gerrit_master/workspace/rse/plugins/org.eclipse.rse.services.ssh/src/org/eclipse/rse/internal/services/ssh/files/SftpFileService.java:[680] 
	monitor = new SubProgressMonitor(monitor, 40);
	              ^^^^^^^^^^^^^^^^^^^^^^^^^^^^^^^
The constructor SubProgressMonitor(IProgressMonitor, int) is deprecated
[WARNING] /jobs/genie.tm/rse-gerrit_master/workspace/rse/plugins/org.eclipse.rse.services.ssh/src/org/eclipse/rse/internal/services/ssh/files/SftpFileService.java:[1411] 
	* @see org.eclipse.rse.services.files.AbstractFileService#getOutputStream(String, String, boolean, IProgressMonitor)
	                                                          ^^^^^^^^^^^^^^^^^^^^^^^^^^^^^^^^^^^^^^^^^^^^^^^^^^^^^^^^^^
Javadoc: The method getOutputStream(String, String, boolean, IProgressMonitor) from the type AbstractFileService is deprecated
[WARNING] /jobs/genie.tm/rse-gerrit_master/workspace/rse/plugins/org.eclipse.rse.services.ssh/src/org/eclipse/rse/internal/services/ssh/files/SftpFileService.java:[1413] 
	public OutputStream getOutputStream(String remoteParent, String remoteFile, boolean isBinary, IProgressMonitor monitor) throws SystemMessageException {
	                    ^^^^^^^^^^^^^^^^^^^^^^^^^^^^^^^^^^^^^^^^^^^^^^^^^^^^^^^^^^^^^^^^^^^^^^^^^^^^^^^^^^^^^^^^^^^^^^^^^^^^^^^^^^^^^^^^^^^^^^^^^^^^^^^^^
The method SftpFileService.getOutputStream(String, String, boolean, IProgressMonitor) overrides a deprecated method from AbstractFileService
8 problems (8 warnings)
[INFO] 
[INFO] --- maven-resources-plugin:2.7:testResources (default-testResources) @ org.eclipse.rse.services.ssh ---
[INFO] Not copying test resources
[INFO] 
[INFO] --- target-platform-configuration:1.6.0:target-platform (default-target-platform) @ org.eclipse.rse.services.ssh ---
[INFO] 
[INFO] --- tycho-packaging-plugin:1.6.0:package-plugin (default-package-plugin) @ org.eclipse.rse.services.ssh ---
[INFO] Building jar: /jobs/genie.tm/rse-gerrit_master/workspace/rse/plugins/org.eclipse.rse.services.ssh/target/org.eclipse.rse.services.ssh-4.5.100-SNAPSHOT.jar
[INFO] 
[INFO] --- tycho-p2-plugin:1.6.0:p2-metadata-default (default-p2-metadata-default) @ org.eclipse.rse.services.ssh ---
[INFO] 
[INFO] --- maven-install-plugin:2.3.1:install (default-install) @ org.eclipse.rse.services.ssh ---
[INFO] Installing /jobs/genie.tm/rse-gerrit_master/workspace/rse/plugins/org.eclipse.rse.services.ssh/target/org.eclipse.rse.services.ssh-4.5.100-SNAPSHOT.jar to /home/hudson/genie.tm/.jenkins/jobs/rse-gerrit_master/workspace/.repository/org/eclipse/tm/org.eclipse.rse.services.ssh/4.5.100-SNAPSHOT/org.eclipse.rse.services.ssh-4.5.100-SNAPSHOT.jar
[INFO] Installing /jobs/genie.tm/rse-gerrit_master/workspace/rse/plugins/org.eclipse.rse.services.ssh/pom.xml to /home/hudson/genie.tm/.jenkins/jobs/rse-gerrit_master/workspace/.repository/org/eclipse/tm/org.eclipse.rse.services.ssh/4.5.100-SNAPSHOT/org.eclipse.rse.services.ssh-4.5.100-SNAPSHOT.pom
[INFO] Installing /jobs/genie.tm/rse-gerrit_master/workspace/rse/plugins/org.eclipse.rse.services.ssh/target/p2content.xml to /home/hudson/genie.tm/.jenkins/jobs/rse-gerrit_master/workspace/.repository/org/eclipse/tm/org.eclipse.rse.services.ssh/4.5.100-SNAPSHOT/org.eclipse.rse.services.ssh-4.5.100-SNAPSHOT-p2metadata.xml
[INFO] Installing /jobs/genie.tm/rse-gerrit_master/workspace/rse/plugins/org.eclipse.rse.services.ssh/target/p2artifacts.xml to /home/hudson/genie.tm/.jenkins/jobs/rse-gerrit_master/workspace/.repository/org/eclipse/tm/org.eclipse.rse.services.ssh/4.5.100-SNAPSHOT/org.eclipse.rse.services.ssh-4.5.100-SNAPSHOT-p2artifacts.xml
[INFO] 
[INFO] --- tycho-p2-plugin:1.6.0:update-local-index (default-update-local-index) @ org.eclipse.rse.services.ssh ---
[INFO] 
[INFO] ------------------------------------------------------------------------
[INFO] Skipping org.eclipse.rse.connectorservice.ssh
[INFO] This project has been banned from the build due to previous failures.
[INFO] ------------------------------------------------------------------------
[INFO] 
[INFO] -----------< org.eclipse.tm:org.eclipse.rse.services.telnet >-----------
[INFO] Building org.eclipse.rse.services.telnet 4.5.100-SNAPSHOT        [20/81]
[INFO] ---------------------------[ eclipse-plugin ]---------------------------
[INFO] 
[INFO] --- maven-clean-plugin:2.5:clean (default-clean) @ org.eclipse.rse.services.telnet ---
[INFO] 
[INFO] --- tycho-packaging-plugin:1.6.0:build-qualifier (default-build-qualifier) @ org.eclipse.rse.services.telnet ---
[INFO] The project's OSGi version is 4.5.100.202004221802
[INFO] 
[INFO] --- tycho-packaging-plugin:1.6.0:validate-id (default-validate-id) @ org.eclipse.rse.services.telnet ---
[INFO] 
[INFO] --- tycho-packaging-plugin:1.6.0:validate-version (default-validate-version) @ org.eclipse.rse.services.telnet ---
[INFO] 
[INFO] --- maven-resources-plugin:2.7:resources (default-resources) @ org.eclipse.rse.services.telnet ---
[INFO] Using 'UTF-8' encoding to copy filtered resources.
[INFO] skip non existing resourceDirectory /jobs/genie.tm/rse-gerrit_master/workspace/rse/plugins/org.eclipse.rse.services.telnet/src/main/resources
[INFO] 
[INFO] --- tycho-compiler-plugin:1.6.0:compile (default-compile) @ org.eclipse.rse.services.telnet ---
[INFO] Compiling 7 source files to /jobs/genie.tm/rse-gerrit_master/workspace/rse/plugins/org.eclipse.rse.services.telnet/target/classes
[INFO] 
[INFO] --- maven-resources-plugin:2.7:testResources (default-testResources) @ org.eclipse.rse.services.telnet ---
[INFO] Not copying test resources
[INFO] 
[INFO] --- target-platform-configuration:1.6.0:target-platform (default-target-platform) @ org.eclipse.rse.services.telnet ---
[INFO] 
[INFO] --- tycho-packaging-plugin:1.6.0:package-plugin (default-package-plugin) @ org.eclipse.rse.services.telnet ---
[INFO] Building jar: /jobs/genie.tm/rse-gerrit_master/workspace/rse/plugins/org.eclipse.rse.services.telnet/target/org.eclipse.rse.services.telnet-4.5.100-SNAPSHOT.jar
[INFO] 
[INFO] --- tycho-p2-plugin:1.6.0:p2-metadata-default (default-p2-metadata-default) @ org.eclipse.rse.services.telnet ---
[INFO] 
[INFO] --- maven-install-plugin:2.3.1:install (default-install) @ org.eclipse.rse.services.telnet ---
[INFO] Installing /jobs/genie.tm/rse-gerrit_master/workspace/rse/plugins/org.eclipse.rse.services.telnet/target/org.eclipse.rse.services.telnet-4.5.100-SNAPSHOT.jar to /home/hudson/genie.tm/.jenkins/jobs/rse-gerrit_master/workspace/.repository/org/eclipse/tm/org.eclipse.rse.services.telnet/4.5.100-SNAPSHOT/org.eclipse.rse.services.telnet-4.5.100-SNAPSHOT.jar
[INFO] Installing /jobs/genie.tm/rse-gerrit_master/workspace/rse/plugins/org.eclipse.rse.services.telnet/pom.xml to /home/hudson/genie.tm/.jenkins/jobs/rse-gerrit_master/workspace/.repository/org/eclipse/tm/org.eclipse.rse.services.telnet/4.5.100-SNAPSHOT/org.eclipse.rse.services.telnet-4.5.100-SNAPSHOT.pom
[INFO] Installing /jobs/genie.tm/rse-gerrit_master/workspace/rse/plugins/org.eclipse.rse.services.telnet/target/p2content.xml to /home/hudson/genie.tm/.jenkins/jobs/rse-gerrit_master/workspace/.repository/org/eclipse/tm/org.eclipse.rse.services.telnet/4.5.100-SNAPSHOT/org.eclipse.rse.services.telnet-4.5.100-SNAPSHOT-p2metadata.xml
[INFO] Installing /jobs/genie.tm/rse-gerrit_master/workspace/rse/plugins/org.eclipse.rse.services.telnet/target/p2artifacts.xml to /home/hudson/genie.tm/.jenkins/jobs/rse-gerrit_master/workspace/.repository/org/eclipse/tm/org.eclipse.rse.services.telnet/4.5.100-SNAPSHOT/org.eclipse.rse.services.telnet-4.5.100-SNAPSHOT-p2artifacts.xml
[INFO] 
[INFO] --- tycho-p2-plugin:1.6.0:update-local-index (default-update-local-index) @ org.eclipse.rse.services.telnet ---
[INFO] 
[INFO] ------------------------------------------------------------------------
[INFO] Skipping org.eclipse.rse.connectorservice.telnet
[INFO] This project has been banned from the build due to previous failures.
[INFO] ------------------------------------------------------------------------
[INFO] 
[INFO] ------------------------------------------------------------------------
[INFO] Skipping org.eclipse.rse.services.files.ftp
[INFO] This project has been banned from the build due to previous failures.
[INFO] ------------------------------------------------------------------------
[INFO] 
[INFO] ------------------------------------------------------------------------
[INFO] Skipping org.eclipse.rse.subsystems.files.ftp
[INFO] This project has been banned from the build due to previous failures.
[INFO] ------------------------------------------------------------------------
[INFO] 
[INFO] ------------------------------------------------------------------------
[INFO] Skipping org.eclipse.rse.ftp
[INFO] This project has been banned from the build due to previous failures.
[INFO] ------------------------------------------------------------------------
[INFO] 
[INFO] -----------< org.eclipse.tm:org.eclipse.rse.services.local >------------
[INFO] Building org.eclipse.rse.services.local 4.5.100-SNAPSHOT         [21/81]
[INFO] ---------------------------[ eclipse-plugin ]---------------------------
[INFO] 
[INFO] --- maven-clean-plugin:2.5:clean (default-clean) @ org.eclipse.rse.services.local ---
[INFO] 
[INFO] --- tycho-packaging-plugin:1.6.0:build-qualifier (default-build-qualifier) @ org.eclipse.rse.services.local ---
[INFO] The project's OSGi version is 4.5.100.202004221802
[INFO] 
[INFO] --- tycho-packaging-plugin:1.6.0:validate-id (default-validate-id) @ org.eclipse.rse.services.local ---
[INFO] 
[INFO] --- tycho-packaging-plugin:1.6.0:validate-version (default-validate-version) @ org.eclipse.rse.services.local ---
[INFO] 
[INFO] --- maven-resources-plugin:2.7:resources (default-resources) @ org.eclipse.rse.services.local ---
[INFO] Using 'UTF-8' encoding to copy filtered resources.
[INFO] skip non existing resourceDirectory /jobs/genie.tm/rse-gerrit_master/workspace/rse/plugins/org.eclipse.rse.services.local/src/main/resources
[INFO] 
[INFO] --- tycho-compiler-plugin:1.6.0:compile (default-compile) @ org.eclipse.rse.services.local ---
[INFO] Compiling 15 source files to /jobs/genie.tm/rse-gerrit_master/workspace/rse/plugins/org.eclipse.rse.services.local/target/classes
[WARNING] /jobs/genie.tm/rse-gerrit_master/workspace/rse/plugins/org.eclipse.rse.services.local/src/org/eclipse/rse/internal/services/local/search/LocalSearchService.java:[38] 
	_searches.put(searchConfig, handler);
	^^^^^^^^^^^^^^^^^^^^^^^^^^^^^^^^^^^^
Type safety: The method put(Object, Object) belongs to the raw type Map. References to generic type Map<K,V> should be parameterized
[WARNING] /jobs/genie.tm/rse-gerrit_master/workspace/rse/plugins/org.eclipse.rse.services.local/src/org/eclipse/rse/internal/services/local/files/LocalHostFile.java:[32] 
	import org.eclipse.core.internal.filesystem.local.LocalFileNativesManager;
	       ^^^^^^^^^^^^^^^^^^^^^^^^^^^^^^^^^^^^^^^^^^^^^^^^^^^^^^^^^^^^^^^^^^
Discouraged access: The type 'LocalFileNativesManager' is not API (restriction on classpath entry '/home/hudson/genie.tm/.jenkins/jobs/rse-gerrit_master/workspace/.repository/p2/osgi/bundle/org.eclipse.core.filesystem/1.7.700.v20200110-1734/org.eclipse.core.filesystem-1.7.700.v20200110-1734.jar')
[WARNING] /jobs/genie.tm/rse-gerrit_master/workspace/rse/plugins/org.eclipse.rse.services.local/src/org/eclipse/rse/internal/services/local/files/LocalHostFile.java:[75] 
	_info = LocalFileNativesManager.fetchFileInfo(_file.getAbsolutePath());
	        ^^^^^^^^^^^^^^^^^^^^^^^
Discouraged access: The type 'LocalFileNativesManager' is not API (restriction on classpath entry '/home/hudson/genie.tm/.jenkins/jobs/rse-gerrit_master/workspace/.repository/p2/osgi/bundle/org.eclipse.core.filesystem/1.7.700.v20200110-1734/org.eclipse.core.filesystem-1.7.700.v20200110-1734.jar')
[WARNING] /jobs/genie.tm/rse-gerrit_master/workspace/rse/plugins/org.eclipse.rse.services.local/src/org/eclipse/rse/internal/services/local/files/LocalHostFile.java:[75] 
	_info = LocalFileNativesManager.fetchFileInfo(_file.getAbsolutePath());
	                                ^^^^^^^^^^^^^
Discouraged access: The method 'LocalFileNativesManager.fetchFileInfo(String)' is not API (restriction on classpath entry '/home/hudson/genie.tm/.jenkins/jobs/rse-gerrit_master/workspace/.repository/p2/osgi/bundle/org.eclipse.core.filesystem/1.7.700.v20200110-1734/org.eclipse.core.filesystem-1.7.700.v20200110-1734.jar')
[WARNING] /jobs/genie.tm/rse-gerrit_master/workspace/rse/plugins/org.eclipse.rse.services.local/src/org/eclipse/rse/internal/services/local/shells/LocalShellService.java:[73] 
	List envVars = new ArrayList();
	^^^^
List is a raw type. References to generic type List<E> should be parameterized
[WARNING] /jobs/genie.tm/rse-gerrit_master/workspace/rse/plugins/org.eclipse.rse.services.local/src/org/eclipse/rse/internal/services/local/shells/LocalShellService.java:[73] 
	List envVars = new ArrayList();
	                   ^^^^^^^^^
ArrayList is a raw type. References to generic type ArrayList<E> should be parameterized
[WARNING] /jobs/genie.tm/rse-gerrit_master/workspace/rse/plugins/org.eclipse.rse.services.local/src/org/eclipse/rse/internal/services/local/shells/LocalShellService.java:[103] 
	envVars.add(curLine);
	^^^^^^^^^^^^^^^^^^^^
Type safety: The method add(Object) belongs to the raw type List. References to generic type List<E> should be parameterized
[WARNING] /jobs/genie.tm/rse-gerrit_master/workspace/rse/plugins/org.eclipse.rse.services.local/src/org/eclipse/rse/internal/services/local/shells/LocalShellService.java:[122] 
	_envVars = (String[])envVars.toArray(new String[envVars.size()]);
	                     ^^^^^^^^^^^^^^^^^^^^^^^^^^^^^^^^^^^^^^^^^^^
Type safety: The method toArray(Object[]) belongs to the raw type List. References to generic type List<E> should be parameterized
[WARNING] /jobs/genie.tm/rse-gerrit_master/workspace/rse/plugins/org.eclipse.rse.services.local/src/org/eclipse/rse/internal/services/local/processes/LocalProcessService.java:[67] 
	SortedSet results = handler.lookupProcesses(filter);
	^^^^^^^^^
SortedSet is a raw type. References to generic type SortedSet<E> should be parameterized
[WARNING] /jobs/genie.tm/rse-gerrit_master/workspace/rse/plugins/org.eclipse.rse.services.local/src/org/eclipse/rse/internal/services/local/processes/LocalProcessService.java:[68] 
	processes = (IHostProcess[]) results.toArray(new IHostProcess[results.size()]);
	                             ^^^^^^^^^^^^^^^^^^^^^^^^^^^^^^^^^^^^^^^^^^^^^^^^^
Type safety: The method toArray(Object[]) belongs to the raw type Set. References to generic type Set<E> should be parameterized
[WARNING] /jobs/genie.tm/rse-gerrit_master/workspace/rse/plugins/org.eclipse.rse.services.local/src/org/eclipse/rse/internal/services/local/processes/LocalProcessService.java:[72] 
	throw new SystemMessageException(getMessage("RSEPG1301")); //$NON-NLS-1$
	                                 ^^^^^^^^^^^^^^^^^^^^^^^
The method getMessage(String) from the type AbstractProcessService is deprecated
[WARNING] /jobs/genie.tm/rse-gerrit_master/workspace/rse/plugins/org.eclipse.rse.services.local/src/org/eclipse/rse/internal/services/local/processes/LocalProcessService.java:[94] 
	throw new SystemMessageException(getMessage("RSEG1067")); //$NON-NLS-1$
	                                 ^^^^^^^^^^^^^^^^^^^^^^
The method getMessage(String) from the type AbstractProcessService is deprecated
[WARNING] /jobs/genie.tm/rse-gerrit_master/workspace/rse/plugins/org.eclipse.rse.services.local/src/org/eclipse/rse/internal/services/local/processes/LocalProcessService.java:[103] 
	SystemMessage msg = getMessage("RSEPG1300"); //$NON-NLS-1$
	                    ^^^^^^^^^^^^^^^^^^^^^^^
The method getMessage(String) from the type AbstractProcessService is deprecated
[WARNING] /jobs/genie.tm/rse-gerrit_master/workspace/rse/plugins/org.eclipse.rse.services.local/src/org/eclipse/rse/internal/services/local/search/LocalSearchHandler.java:[63] 
	protected HashSet _alreadySearched;
	          ^^^^^^^
HashSet is a raw type. References to generic type HashSet<E> should be parameterized
[WARNING] /jobs/genie.tm/rse-gerrit_master/workspace/rse/plugins/org.eclipse.rse.services.local/src/org/eclipse/rse/internal/services/local/search/LocalSearchHandler.java:[134] 
	_alreadySearched = new HashSet();
	                       ^^^^^^^
HashSet is a raw type. References to generic type HashSet<E> should be parameterized
[WARNING] /jobs/genie.tm/rse-gerrit_master/workspace/rse/plugins/org.eclipse.rse.services.local/src/org/eclipse/rse/internal/services/local/search/LocalSearchHandler.java:[325] 
	_alreadySearched.add(theFile.getCanonicalFile());
	^^^^^^^^^^^^^^^^^^^^^^^^^^^^^^^^^^^^^^^^^^^^^^^^
Type safety: The method add(Object) belongs to the raw type HashSet. References to generic type HashSet<E> should be parameterized
[WARNING] /jobs/genie.tm/rse-gerrit_master/workspace/rse/plugins/org.eclipse.rse.services.local/src/org/eclipse/rse/internal/services/local/search/LocalSearchHandler.java:[329] 
	_alreadySearched.add(theFile);
	^^^^^^^^^^^^^^^^^^^^^^^^^^^^^
Type safety: The method add(Object) belongs to the raw type HashSet. References to generic type HashSet<E> should be parameterized
[WARNING] /jobs/genie.tm/rse-gerrit_master/workspace/rse/plugins/org.eclipse.rse.services.local/src/org/eclipse/rse/internal/services/local/search/LocalSearchHandler.java:[384] 
	boolean isRoot = false; //TODO
	        ^^^^^^
The value of the local variable isRoot is not used
[WARNING] /jobs/genie.tm/rse-gerrit_master/workspace/rse/plugins/org.eclipse.rse.services.local/src/org/eclipse/rse/internal/services/local/search/LocalSearchHandler.java:[505] 
	Iterator iter = lineMatches[i].getMatches();
	^^^^^^^^
Iterator is a raw type. References to generic type Iterator<E> should be parameterized
[WARNING] /jobs/genie.tm/rse-gerrit_master/workspace/rse/plugins/org.eclipse.rse.services.local/src/org/eclipse/rse/internal/services/local/files/LocalFileService.java:[83] 
	import java.net.URL;
	       ^^^^^^^^^^^^
The import java.net.URL is never used
[WARNING] /jobs/genie.tm/rse-gerrit_master/workspace/rse/plugins/org.eclipse.rse.services.local/src/org/eclipse/rse/internal/services/local/files/LocalFileService.java:[89] 
	import org.eclipse.core.internal.filesystem.local.LocalFileNativesManager;
	       ^^^^^^^^^^^^^^^^^^^^^^^^^^^^^^^^^^^^^^^^^^^^^^^^^^^^^^^^^^^^^^^^^^
Discouraged access: The type 'LocalFileNativesManager' is not API (restriction on classpath entry '/home/hudson/genie.tm/.jenkins/jobs/rse-gerrit_master/workspace/.repository/p2/osgi/bundle/org.eclipse.core.filesystem/1.7.700.v20200110-1734/org.eclipse.core.filesystem-1.7.700.v20200110-1734.jar')
[WARNING] /jobs/genie.tm/rse-gerrit_master/workspace/rse/plugins/org.eclipse.rse.services.local/src/org/eclipse/rse/internal/services/local/files/LocalFileService.java:[96] 
	import org.eclipse.osgi.service.datalocation.Location;
	       ^^^^^^^^^^^^^^^^^^^^^^^^^^^^^^^^^^^^^^^^^^^^^^
The import org.eclipse.osgi.service.datalocation.Location is never used
[WARNING] /jobs/genie.tm/rse-gerrit_master/workspace/rse/plugins/org.eclipse.rse.services.local/src/org/eclipse/rse/internal/services/local/files/LocalFileService.java:[131] 
	import org.eclipse.rse.services.files.RemoteFileSecurityException;
	       ^^^^^^^^^^^^^^^^^^^^^^^^^^^^^^^^^^^^^^^^^^^^^^^^^^^^^^^^^^
The type RemoteFileSecurityException is deprecated
[WARNING] /jobs/genie.tm/rse-gerrit_master/workspace/rse/plugins/org.eclipse.rse.services.local/src/org/eclipse/rse/internal/services/local/files/LocalFileService.java:[837] 
	throw new RemoteFileIOException(new IOException("Error listing: " + localParent.getAbsolutePath()));
	                                                ^^^^^^^^^^^^^^^^^
Non-externalized string literal; it should be followed by //$NON-NLS-<n>$
[WARNING] /jobs/genie.tm/rse-gerrit_master/workspace/rse/plugins/org.eclipse.rse.services.local/src/org/eclipse/rse/internal/services/local/files/LocalFileService.java:[841] 
	throw new SystemElementNotFoundException(localParent.getAbsolutePath(), "list");
	                                                                        ^^^^^^
Non-externalized string literal; it should be followed by //$NON-NLS-<n>$
[WARNING] /jobs/genie.tm/rse-gerrit_master/workspace/rse/plugins/org.eclipse.rse.services.local/src/org/eclipse/rse/internal/services/local/files/LocalFileService.java:[848] 
	List results = new ArrayList();
	^^^^
List is a raw type. References to generic type List<E> should be parameterized
[WARNING] /jobs/genie.tm/rse-gerrit_master/workspace/rse/plugins/org.eclipse.rse.services.local/src/org/eclipse/rse/internal/services/local/files/LocalFileService.java:[848] 
	List results = new ArrayList();
	                   ^^^^^^^^^
ArrayList is a raw type. References to generic type ArrayList<E> should be parameterized
[WARNING] /jobs/genie.tm/rse-gerrit_master/workspace/rse/plugins/org.eclipse.rse.services.local/src/org/eclipse/rse/internal/services/local/files/LocalFileService.java:[870] 
	results.add(new LocalHostFile(file, false, info));
	^^^^^^^^^^^^^^^^^^^^^^^^^^^^^^^^^^^^^^^^^^^^^^^^^
Type safety: The method add(Object) belongs to the raw type List. References to generic type List<E> should be parameterized
[WARNING] /jobs/genie.tm/rse-gerrit_master/workspace/rse/plugins/org.eclipse.rse.services.local/src/org/eclipse/rse/internal/services/local/files/LocalFileService.java:[878] 
	results.add(new LocalHostFile(file, false, info));
	^^^^^^^^^^^^^^^^^^^^^^^^^^^^^^^^^^^^^^^^^^^^^^^^^
Type safety: The method add(Object) belongs to the raw type List. References to generic type List<E> should be parameterized
[WARNING] /jobs/genie.tm/rse-gerrit_master/workspace/rse/plugins/org.eclipse.rse.services.local/src/org/eclipse/rse/internal/services/local/files/LocalFileService.java:[883] 
	results.add(new LocalHostFile(file, false, info));
	^^^^^^^^^^^^^^^^^^^^^^^^^^^^^^^^^^^^^^^^^^^^^^^^^
Type safety: The method add(Object) belongs to the raw type List. References to generic type List<E> should be parameterized
[WARNING] /jobs/genie.tm/rse-gerrit_master/workspace/rse/plugins/org.eclipse.rse.services.local/src/org/eclipse/rse/internal/services/local/files/LocalFileService.java:[888] 
	results.add(new LocalHostFile(file, false, info));
	^^^^^^^^^^^^^^^^^^^^^^^^^^^^^^^^^^^^^^^^^^^^^^^^^
Type safety: The method add(Object) belongs to the raw type List. References to generic type List<E> should be parameterized
[WARNING] /jobs/genie.tm/rse-gerrit_master/workspace/rse/plugins/org.eclipse.rse.services.local/src/org/eclipse/rse/internal/services/local/files/LocalFileService.java:[892] 
	return (IHostFile[])results.toArray(new IHostFile[results.size()]);
	                    ^^^^^^^^^^^^^^^^^^^^^^^^^^^^^^^^^^^^^^^^^^^^^^
Type safety: The method toArray(Object[]) belongs to the raw type List. References to generic type List<E> should be parameterized
[WARNING] /jobs/genie.tm/rse-gerrit_master/workspace/rse/plugins/org.eclipse.rse.services.local/src/org/eclipse/rse/internal/services/local/files/LocalFileService.java:[897] 
	FileInfo info = LocalFileNativesManager.fetchFileInfo(file.getAbsolutePath());
	                ^^^^^^^^^^^^^^^^^^^^^^^
Discouraged access: The type 'LocalFileNativesManager' is not API (restriction on classpath entry '/home/hudson/genie.tm/.jenkins/jobs/rse-gerrit_master/workspace/.repository/p2/osgi/bundle/org.eclipse.core.filesystem/1.7.700.v20200110-1734/org.eclipse.core.filesystem-1.7.700.v20200110-1734.jar')
[WARNING] /jobs/genie.tm/rse-gerrit_master/workspace/rse/plugins/org.eclipse.rse.services.local/src/org/eclipse/rse/internal/services/local/files/LocalFileService.java:[897] 
	FileInfo info = LocalFileNativesManager.fetchFileInfo(file.getAbsolutePath());
	                                        ^^^^^^^^^^^^^
Discouraged access: The method 'LocalFileNativesManager.fetchFileInfo(String)' is not API (restriction on classpath entry '/home/hudson/genie.tm/.jenkins/jobs/rse-gerrit_master/workspace/.repository/p2/osgi/bundle/org.eclipse.core.filesystem/1.7.700.v20200110-1734/org.eclipse.core.filesystem-1.7.700.v20200110-1734.jar')
[WARNING] /jobs/genie.tm/rse-gerrit_master/workspace/rse/plugins/org.eclipse.rse.services.local/src/org/eclipse/rse/internal/services/local/files/LocalFileService.java:[914] 
	return LocalFileNativesManager.isUsingNatives();
	       ^^^^^^^^^^^^^^^^^^^^^^^
Discouraged access: The type 'LocalFileNativesManager' is not API (restriction on classpath entry '/home/hudson/genie.tm/.jenkins/jobs/rse-gerrit_master/workspace/.repository/p2/osgi/bundle/org.eclipse.core.filesystem/1.7.700.v20200110-1734/org.eclipse.core.filesystem-1.7.700.v20200110-1734.jar')
[WARNING] /jobs/genie.tm/rse-gerrit_master/workspace/rse/plugins/org.eclipse.rse.services.local/src/org/eclipse/rse/internal/services/local/files/LocalFileService.java:[914] 
	return LocalFileNativesManager.isUsingNatives();
	                               ^^^^^^^^^^^^^^
Discouraged access: The method 'LocalFileNativesManager.isUsingNatives()' is not API (restriction on classpath entry '/home/hudson/genie.tm/.jenkins/jobs/rse-gerrit_master/workspace/.repository/p2/osgi/bundle/org.eclipse.core.filesystem/1.7.700.v20200110-1734/org.eclipse.core.filesystem-1.7.700.v20200110-1734.jar')
[WARNING] /jobs/genie.tm/rse-gerrit_master/workspace/rse/plugins/org.eclipse.rse.services.local/src/org/eclipse/rse/internal/services/local/files/LocalFileService.java:[930] 
	List v = new ArrayList();
	^^^^
List is a raw type. References to generic type List<E> should be parameterized
[WARNING] /jobs/genie.tm/rse-gerrit_master/workspace/rse/plugins/org.eclipse.rse.services.local/src/org/eclipse/rse/internal/services/local/files/LocalFileService.java:[930] 
	List v = new ArrayList();
	             ^^^^^^^^^
ArrayList is a raw type. References to generic type ArrayList<E> should be parameterized
[WARNING] /jobs/genie.tm/rse-gerrit_master/workspace/rse/plugins/org.eclipse.rse.services.local/src/org/eclipse/rse/internal/services/local/files/LocalFileService.java:[940] 
	v.add(drive.getAbsoluteFile());
	^^^^^^^^^^^^^^^^^^^^^^^^^^^^^^
Type safety: The method add(Object) belongs to the raw type List. References to generic type List<E> should be parameterized
[WARNING] /jobs/genie.tm/rse-gerrit_master/workspace/rse/plugins/org.eclipse.rse.services.local/src/org/eclipse/rse/internal/services/local/files/LocalFileService.java:[949] 
	v.add(new File("/")); //$NON-NLS-1$
	^^^^^^^^^^^^^^^^^^^^
Type safety: The method add(Object) belongs to the raw type List. References to generic type List<E> should be parameterized
[WARNING] /jobs/genie.tm/rse-gerrit_master/workspace/rse/plugins/org.eclipse.rse.services.local/src/org/eclipse/rse/internal/services/local/files/LocalFileService.java:[1030] 
	throw new RemoteFileSecurityException(e);
	          ^^^^^^^^^^^^^^^^^^^^^^^^^^^
The type RemoteFileSecurityException is deprecated
[WARNING] /jobs/genie.tm/rse-gerrit_master/workspace/rse/plugins/org.eclipse.rse.services.local/src/org/eclipse/rse/internal/services/local/files/LocalFileService.java:[1030] 
	throw new RemoteFileSecurityException(e);
	          ^^^^^^^^^^^^^^^^^^^^^^^^^^^^^^
The constructor RemoteFileSecurityException(Exception) is deprecated
[WARNING] /jobs/genie.tm/rse-gerrit_master/workspace/rse/plugins/org.eclipse.rse.services.local/src/org/eclipse/rse/internal/services/local/files/LocalFileService.java:[1118] 
	throw new RemoteFileSecurityException(new IOException());
	          ^^^^^^^^^^^^^^^^^^^^^^^^^^^
The type RemoteFileSecurityException is deprecated
[WARNING] /jobs/genie.tm/rse-gerrit_master/workspace/rse/plugins/org.eclipse.rse.services.local/src/org/eclipse/rse/internal/services/local/files/LocalFileService.java:[1118] 
	throw new RemoteFileSecurityException(new IOException());
	          ^^^^^^^^^^^^^^^^^^^^^^^^^^^^^^^^^^^^^^^^^^^^^^
The constructor RemoteFileSecurityException(Exception) is deprecated
[WARNING] /jobs/genie.tm/rse-gerrit_master/workspace/rse/plugins/org.eclipse.rse.services.local/src/org/eclipse/rse/internal/services/local/files/LocalFileService.java:[1199] 
	throw new SystemOperationFailedException(Activator.PLUGIN_ID, "Failed to delete: " + fileToDelete.getAbsolutePath());
	                                                              ^^^^^^^^^^^^^^^^^^^^
Non-externalized string literal; it should be followed by //$NON-NLS-<n>$
[WARNING] /jobs/genie.tm/rse-gerrit_master/workspace/rse/plugins/org.eclipse.rse.services.local/src/org/eclipse/rse/internal/services/local/files/LocalFileService.java:[1201] 
	throw new SystemElementNotFoundException(fileToDelete.getAbsolutePath(), "delete");
	                                                                         ^^^^^^^^
Non-externalized string literal; it should be followed by //$NON-NLS-<n>$
[WARNING] /jobs/genie.tm/rse-gerrit_master/workspace/rse/plugins/org.eclipse.rse.services.local/src/org/eclipse/rse/internal/services/local/files/LocalFileService.java:[1726] 
	throw new SystemElementNotFoundException(Activator.PLUGIN_ID, file.getAbsolutePath(), "setLastModified");
	                                                                                      ^^^^^^^^^^^^^^^^^
Non-externalized string literal; it should be followed by //$NON-NLS-<n>$
[WARNING] /jobs/genie.tm/rse-gerrit_master/workspace/rse/plugins/org.eclipse.rse.services.local/src/org/eclipse/rse/internal/services/local/files/LocalFileService.java:[1728] 
	throw new SystemOperationFailedException(Activator.PLUGIN_ID, "setLastModified: " + file.getAbsolutePath());
	                                                              ^^^^^^^^^^^^^^^^^^^
Non-externalized string literal; it should be followed by //$NON-NLS-<n>$
[WARNING] /jobs/genie.tm/rse-gerrit_master/workspace/rse/plugins/org.eclipse.rse.services.local/src/org/eclipse/rse/internal/services/local/files/LocalFileService.java:[1740] 
	String messageText = "File not found";
	       ^^^^^^^^^^^
The value of the local variable messageText is not used
[WARNING] /jobs/genie.tm/rse-gerrit_master/workspace/rse/plugins/org.eclipse.rse.services.local/src/org/eclipse/rse/internal/services/local/files/LocalFileService.java:[1740] 
	String messageText = "File not found";
	                     ^^^^^^^^^^^^^^^^
Non-externalized string literal; it should be followed by //$NON-NLS-<n>$
[WARNING] /jobs/genie.tm/rse-gerrit_master/workspace/rse/plugins/org.eclipse.rse.services.local/src/org/eclipse/rse/internal/services/local/files/LocalFileService.java:[1742] 
	throw new SystemElementNotFoundException(Activator.PLUGIN_ID, file.getAbsolutePath(), "setReadOnly");
	                                                                                      ^^^^^^^^^^^^^
Non-externalized string literal; it should be followed by //$NON-NLS-<n>$
[WARNING] /jobs/genie.tm/rse-gerrit_master/workspace/rse/plugins/org.eclipse.rse.services.local/src/org/eclipse/rse/internal/services/local/files/LocalFileService.java:[1751] 
	throw new SystemOperationFailedException(Activator.PLUGIN_ID, "Failed to setReadOnly: " + file.getAbsolutePath());
	                                                              ^^^^^^^^^^^^^^^^^^^^^^^^^
Non-externalized string literal; it should be followed by //$NON-NLS-<n>$
[WARNING] /jobs/genie.tm/rse-gerrit_master/workspace/rse/plugins/org.eclipse.rse.services.local/src/org/eclipse/rse/internal/services/local/files/LocalFileService.java:[1783] 
	throw new SystemOperationFailedException(Activator.PLUGIN_ID, "Failed to setWritable: " + remoteError, remoteException);
	                                                              ^^^^^^^^^^^^^^^^^^^^^^^^^
Non-externalized string literal; it should be followed by //$NON-NLS-<n>$
[WARNING] /jobs/genie.tm/rse-gerrit_master/workspace/rse/plugins/org.eclipse.rse.services.local/src/org/eclipse/rse/internal/services/local/files/LocalFileService.java:[1810] 
	throw new SystemOperationFailedException(Activator.PLUGIN_ID, "Failed to setWritable: " + remoteError, remoteException);
	                                                              ^^^^^^^^^^^^^^^^^^^^^^^^^
Non-externalized string literal; it should be followed by //$NON-NLS-<n>$
[WARNING] /jobs/genie.tm/rse-gerrit_master/workspace/rse/plugins/org.eclipse.rse.services.local/src/org/eclipse/rse/internal/services/local/files/LocalFileService.java:[1817] 
	remoteError = "Failed to setWritable: " + file.getAbsolutePath();
	              ^^^^^^^^^^^^^^^^^^^^^^^^^
Non-externalized string literal; it should be followed by //$NON-NLS-<n>$
[WARNING] /jobs/genie.tm/rse-gerrit_master/workspace/rse/plugins/org.eclipse.rse.services.local/src/org/eclipse/rse/internal/services/local/files/LocalFileService.java:[1841] 
	throw new SystemElementNotFoundException(Activator.PLUGIN_ID, file.getAbsolutePath(), "getInputStream");
	                                                                                      ^^^^^^^^^^^^^^^^
Non-externalized string literal; it should be followed by //$NON-NLS-<n>$
[WARNING] /jobs/genie.tm/rse-gerrit_master/workspace/rse/plugins/org.eclipse.rse.services.local/src/org/eclipse/rse/internal/services/local/files/LocalFileService.java:[1856] 
	* @see org.eclipse.rse.services.files.AbstractFileService#getOutputStream(String, String, boolean, IProgressMonitor)
	                                                          ^^^^^^^^^^^^^^^^^^^^^^^^^^^^^^^^^^^^^^^^^^^^^^^^^^^^^^^^^^
Javadoc: The method getOutputStream(String, String, boolean, IProgressMonitor) from the type AbstractFileService is deprecated
[WARNING] /jobs/genie.tm/rse-gerrit_master/workspace/rse/plugins/org.eclipse.rse.services.local/src/org/eclipse/rse/internal/services/local/files/LocalFileService.java:[1858] 
	public OutputStream getOutputStream(String remoteParent, String remoteFile, boolean isBinary, IProgressMonitor monitor) throws SystemMessageException {
	                    ^^^^^^^^^^^^^^^^^^^^^^^^^^^^^^^^^^^^^^^^^^^^^^^^^^^^^^^^^^^^^^^^^^^^^^^^^^^^^^^^^^^^^^^^^^^^^^^^^^^^^^^^^^^^^^^^^^^^^^^^^^^^^^^^^
The method LocalFileService.getOutputStream(String, String, boolean, IProgressMonitor) overrides a deprecated method from AbstractFileService
[WARNING] /jobs/genie.tm/rse-gerrit_master/workspace/rse/plugins/org.eclipse.rse.services.local/src/org/eclipse/rse/internal/services/local/files/LocalFileService.java:[1880] 
	throw new SystemElementNotFoundException(Activator.PLUGIN_ID, file.getAbsolutePath(), "getOutputStream");
	                                                                                      ^^^^^^^^^^^^^^^^^
Non-externalized string literal; it should be followed by //$NON-NLS-<n>$
59 problems (59 warnings)
[INFO] 
[INFO] --- maven-resources-plugin:2.7:testResources (default-testResources) @ org.eclipse.rse.services.local ---
[INFO] Not copying test resources
[INFO] 
[INFO] --- target-platform-configuration:1.6.0:target-platform (default-target-platform) @ org.eclipse.rse.services.local ---
[INFO] 
[INFO] --- tycho-packaging-plugin:1.6.0:package-plugin (default-package-plugin) @ org.eclipse.rse.services.local ---
[INFO] Building jar: /jobs/genie.tm/rse-gerrit_master/workspace/rse/plugins/org.eclipse.rse.services.local/target/org.eclipse.rse.services.local-4.5.100-SNAPSHOT.jar
[INFO] 
[INFO] --- tycho-p2-plugin:1.6.0:p2-metadata-default (default-p2-metadata-default) @ org.eclipse.rse.services.local ---
[INFO] 
[INFO] --- maven-install-plugin:2.3.1:install (default-install) @ org.eclipse.rse.services.local ---
[INFO] Installing /jobs/genie.tm/rse-gerrit_master/workspace/rse/plugins/org.eclipse.rse.services.local/target/org.eclipse.rse.services.local-4.5.100-SNAPSHOT.jar to /home/hudson/genie.tm/.jenkins/jobs/rse-gerrit_master/workspace/.repository/org/eclipse/tm/org.eclipse.rse.services.local/4.5.100-SNAPSHOT/org.eclipse.rse.services.local-4.5.100-SNAPSHOT.jar
[INFO] Installing /jobs/genie.tm/rse-gerrit_master/workspace/rse/plugins/org.eclipse.rse.services.local/pom.xml to /home/hudson/genie.tm/.jenkins/jobs/rse-gerrit_master/workspace/.repository/org/eclipse/tm/org.eclipse.rse.services.local/4.5.100-SNAPSHOT/org.eclipse.rse.services.local-4.5.100-SNAPSHOT.pom
[INFO] Installing /jobs/genie.tm/rse-gerrit_master/workspace/rse/plugins/org.eclipse.rse.services.local/target/p2content.xml to /home/hudson/genie.tm/.jenkins/jobs/rse-gerrit_master/workspace/.repository/org/eclipse/tm/org.eclipse.rse.services.local/4.5.100-SNAPSHOT/org.eclipse.rse.services.local-4.5.100-SNAPSHOT-p2metadata.xml
[INFO] Installing /jobs/genie.tm/rse-gerrit_master/workspace/rse/plugins/org.eclipse.rse.services.local/target/p2artifacts.xml to /home/hudson/genie.tm/.jenkins/jobs/rse-gerrit_master/workspace/.repository/org/eclipse/tm/org.eclipse.rse.services.local/4.5.100-SNAPSHOT/org.eclipse.rse.services.local-4.5.100-SNAPSHOT-p2artifacts.xml
[INFO] 
[INFO] --- tycho-p2-plugin:1.6.0:update-local-index (default-update-local-index) @ org.eclipse.rse.services.local ---
[INFO] 
[INFO] ------------------------------------------------------------------------
[INFO] Skipping org.eclipse.rse.subsystems.files.local
[INFO] This project has been banned from the build due to previous failures.
[INFO] ------------------------------------------------------------------------
[INFO] 
[INFO] ------------------------------------------------------------------------
[INFO] Skipping org.eclipse.rse.subsystems.processes.local
[INFO] This project has been banned from the build due to previous failures.
[INFO] ------------------------------------------------------------------------
[INFO] 
[INFO] ------------------------------------------------------------------------
[INFO] Skipping org.eclipse.rse.subsystems.shells.local
[INFO] This project has been banned from the build due to previous failures.
[INFO] ------------------------------------------------------------------------
[INFO] 
[INFO] ------------------------------------------------------------------------
[INFO] Skipping org.eclipse.rse.local
[INFO] This project has been banned from the build due to previous failures.
[INFO] ------------------------------------------------------------------------
[INFO] 
[INFO] ------------------------------------------------------------------------
[INFO] Skipping org.eclipse.rse.subsystems.files.ssh
[INFO] This project has been banned from the build due to previous failures.
[INFO] ------------------------------------------------------------------------
[INFO] 
[INFO] ------------------------------------------------------------------------
[INFO] Skipping org.eclipse.rse.subsystems.shells.ssh
[INFO] This project has been banned from the build due to previous failures.
[INFO] ------------------------------------------------------------------------
[INFO] 
[INFO] ------------------------------------------------------------------------
[INFO] Skipping org.eclipse.rse.ssh
[INFO] This project has been banned from the build due to previous failures.
[INFO] ------------------------------------------------------------------------
[INFO] 
[INFO] ------------------------------------------------------------------------
[INFO] Skipping org.eclipse.rse.subsystems.shells.telnet
[INFO] This project has been banned from the build due to previous failures.
[INFO] ------------------------------------------------------------------------
[INFO] 
[INFO] ------------------------------------------------------------------------
[INFO] Skipping org.eclipse.rse.telnet
[INFO] This project has been banned from the build due to previous failures.
[INFO] ------------------------------------------------------------------------
[INFO] 
[INFO] ------------------------------------------------------------------------
[INFO] Skipping org.eclipse.rse
[INFO] This project has been banned from the build due to previous failures.
[INFO] ------------------------------------------------------------------------
[INFO] 
[INFO] ------------------------------------------------------------------------
[INFO] Skipping org.eclipse.rse.subsystems.files.scp
[INFO] This project has been banned from the build due to previous failures.
[INFO] ------------------------------------------------------------------------
[INFO] 
[INFO] ------------------------------------------------------------------------
[INFO] Skipping org.eclipse.rse.scp
[INFO] This project has been banned from the build due to previous failures.
[INFO] ------------------------------------------------------------------------
[INFO] 
[INFO] -----------------< org.eclipse.tm:org.eclipse.rse.sdk >-----------------
[INFO] Building org.eclipse.rse.sdk 4.5.100-SNAPSHOT                    [22/81]
[INFO] ---------------------------[ eclipse-plugin ]---------------------------
[INFO] 
[INFO] --- maven-clean-plugin:2.5:clean (default-clean) @ org.eclipse.rse.sdk ---
[INFO] 
[INFO] --- tycho-packaging-plugin:1.6.0:build-qualifier (default-build-qualifier) @ org.eclipse.rse.sdk ---
[INFO] The project's OSGi version is 4.5.100.201901312252
[INFO] 
[INFO] --- tycho-packaging-plugin:1.6.0:validate-id (default-validate-id) @ org.eclipse.rse.sdk ---
[INFO] 
[INFO] --- tycho-packaging-plugin:1.6.0:validate-version (default-validate-version) @ org.eclipse.rse.sdk ---
[INFO] 
[INFO] --- maven-resources-plugin:2.7:resources (default-resources) @ org.eclipse.rse.sdk ---
[INFO] Using 'UTF-8' encoding to copy filtered resources.
[INFO] skip non existing resourceDirectory /jobs/genie.tm/rse-gerrit_master/workspace/rse/plugins/org.eclipse.rse.sdk/src/main/resources
[INFO] 
[INFO] --- tycho-compiler-plugin:1.6.0:compile (default-compile) @ org.eclipse.rse.sdk ---
[INFO] Nothing to compile - all classes are up to date
[INFO] 
[INFO] --- maven-resources-plugin:2.7:testResources (default-testResources) @ org.eclipse.rse.sdk ---
[INFO] Not copying test resources
[INFO] 
[INFO] --- target-platform-configuration:1.6.0:target-platform (default-target-platform) @ org.eclipse.rse.sdk ---
[INFO] 
[INFO] --- tycho-packaging-plugin:1.6.0:package-plugin (default-package-plugin) @ org.eclipse.rse.sdk ---
[INFO] Building jar: /jobs/genie.tm/rse-gerrit_master/workspace/rse/plugins/org.eclipse.rse.sdk/target/org.eclipse.rse.sdk-4.5.100-SNAPSHOT.jar
[INFO] 
[INFO] --- tycho-p2-plugin:1.6.0:p2-metadata-default (default-p2-metadata-default) @ org.eclipse.rse.sdk ---
[INFO] 
[INFO] --- maven-install-plugin:2.3.1:install (default-install) @ org.eclipse.rse.sdk ---
[INFO] Installing /jobs/genie.tm/rse-gerrit_master/workspace/rse/plugins/org.eclipse.rse.sdk/target/org.eclipse.rse.sdk-4.5.100-SNAPSHOT.jar to /home/hudson/genie.tm/.jenkins/jobs/rse-gerrit_master/workspace/.repository/org/eclipse/tm/org.eclipse.rse.sdk/4.5.100-SNAPSHOT/org.eclipse.rse.sdk-4.5.100-SNAPSHOT.jar
[INFO] Installing /jobs/genie.tm/rse-gerrit_master/workspace/rse/plugins/org.eclipse.rse.sdk/pom.xml to /home/hudson/genie.tm/.jenkins/jobs/rse-gerrit_master/workspace/.repository/org/eclipse/tm/org.eclipse.rse.sdk/4.5.100-SNAPSHOT/org.eclipse.rse.sdk-4.5.100-SNAPSHOT.pom
[INFO] Installing /jobs/genie.tm/rse-gerrit_master/workspace/rse/plugins/org.eclipse.rse.sdk/target/p2content.xml to /home/hudson/genie.tm/.jenkins/jobs/rse-gerrit_master/workspace/.repository/org/eclipse/tm/org.eclipse.rse.sdk/4.5.100-SNAPSHOT/org.eclipse.rse.sdk-4.5.100-SNAPSHOT-p2metadata.xml
[INFO] Installing /jobs/genie.tm/rse-gerrit_master/workspace/rse/plugins/org.eclipse.rse.sdk/target/p2artifacts.xml to /home/hudson/genie.tm/.jenkins/jobs/rse-gerrit_master/workspace/.repository/org/eclipse/tm/org.eclipse.rse.sdk/4.5.100-SNAPSHOT/org.eclipse.rse.sdk-4.5.100-SNAPSHOT-p2artifacts.xml
[INFO] 
[INFO] --- tycho-p2-plugin:1.6.0:update-local-index (default-update-local-index) @ org.eclipse.rse.sdk ---
[INFO] 
[INFO] ------------------------------------------------------------------------
[INFO] Skipping org.eclipse.rse.sdk
[INFO] This project has been banned from the build due to previous failures.
[INFO] ------------------------------------------------------------------------
[INFO] 
[INFO] ------------------------------------------------------------------------
[INFO] Skipping org.eclipse.rse.subsystems.terminals.core
[INFO] This project has been banned from the build due to previous failures.
[INFO] ------------------------------------------------------------------------
[INFO] 
[INFO] ------------------------------------------------------------------------
[INFO] Skipping org.eclipse.rse.subsystems.terminals.ssh
[INFO] This project has been banned from the build due to previous failures.
[INFO] ------------------------------------------------------------------------
[INFO] 
[INFO] ------------------------------------------------------------------------
[INFO] Skipping org.eclipse.rse.terminals.ui
[INFO] This project has been banned from the build due to previous failures.
[INFO] ------------------------------------------------------------------------
[INFO] 
[INFO] ------------------------------------------------------------------------
[INFO] Skipping org.eclipse.rse.terminals
[INFO] This project has been banned from the build due to previous failures.
[INFO] ------------------------------------------------------------------------
[INFO] 
[INFO] ------------------------------------------------------------------------
[INFO] Skipping org.eclipse.rse.useractions
[INFO] This project has been banned from the build due to previous failures.
[INFO] ------------------------------------------------------------------------
[INFO] 
[INFO] ------------------------------------------------------------------------
[INFO] Skipping org.eclipse.rse.useractions
[INFO] This project has been banned from the build due to previous failures.
[INFO] ------------------------------------------------------------------------
[INFO] 
[INFO] -----------< org.eclipse.tm:org.eclipse.rse.useractions.sdk >-----------
[INFO] Building org.eclipse.rse.useractions.sdk 4.5.100-SNAPSHOT        [23/81]
[INFO] ---------------------------[ eclipse-plugin ]---------------------------
[INFO] 
[INFO] --- maven-clean-plugin:2.5:clean (default-clean) @ org.eclipse.rse.useractions.sdk ---
[INFO] 
[INFO] --- tycho-packaging-plugin:1.6.0:build-qualifier (default-build-qualifier) @ org.eclipse.rse.useractions.sdk ---
[INFO] The project's OSGi version is 4.5.100.201901312252
[INFO] 
[INFO] --- tycho-packaging-plugin:1.6.0:validate-id (default-validate-id) @ org.eclipse.rse.useractions.sdk ---
[INFO] 
[INFO] --- tycho-packaging-plugin:1.6.0:validate-version (default-validate-version) @ org.eclipse.rse.useractions.sdk ---
[INFO] 
[INFO] --- maven-resources-plugin:2.7:resources (default-resources) @ org.eclipse.rse.useractions.sdk ---
[INFO] Using 'UTF-8' encoding to copy filtered resources.
[INFO] skip non existing resourceDirectory /jobs/genie.tm/rse-gerrit_master/workspace/rse/plugins/org.eclipse.rse.useractions.sdk/src/main/resources
[INFO] 
[INFO] --- tycho-compiler-plugin:1.6.0:compile (default-compile) @ org.eclipse.rse.useractions.sdk ---
[INFO] Nothing to compile - all classes are up to date
[INFO] 
[INFO] --- maven-resources-plugin:2.7:testResources (default-testResources) @ org.eclipse.rse.useractions.sdk ---
[INFO] Not copying test resources
[INFO] 
[INFO] --- target-platform-configuration:1.6.0:target-platform (default-target-platform) @ org.eclipse.rse.useractions.sdk ---
[INFO] 
[INFO] --- tycho-packaging-plugin:1.6.0:package-plugin (default-package-plugin) @ org.eclipse.rse.useractions.sdk ---
[INFO] Building jar: /jobs/genie.tm/rse-gerrit_master/workspace/rse/plugins/org.eclipse.rse.useractions.sdk/target/org.eclipse.rse.useractions.sdk-4.5.100-SNAPSHOT.jar
[INFO] 
[INFO] --- tycho-p2-plugin:1.6.0:p2-metadata-default (default-p2-metadata-default) @ org.eclipse.rse.useractions.sdk ---
[INFO] 
[INFO] --- maven-install-plugin:2.3.1:install (default-install) @ org.eclipse.rse.useractions.sdk ---
[INFO] Installing /jobs/genie.tm/rse-gerrit_master/workspace/rse/plugins/org.eclipse.rse.useractions.sdk/target/org.eclipse.rse.useractions.sdk-4.5.100-SNAPSHOT.jar to /home/hudson/genie.tm/.jenkins/jobs/rse-gerrit_master/workspace/.repository/org/eclipse/tm/org.eclipse.rse.useractions.sdk/4.5.100-SNAPSHOT/org.eclipse.rse.useractions.sdk-4.5.100-SNAPSHOT.jar
[INFO] Installing /jobs/genie.tm/rse-gerrit_master/workspace/rse/plugins/org.eclipse.rse.useractions.sdk/pom.xml to /home/hudson/genie.tm/.jenkins/jobs/rse-gerrit_master/workspace/.repository/org/eclipse/tm/org.eclipse.rse.useractions.sdk/4.5.100-SNAPSHOT/org.eclipse.rse.useractions.sdk-4.5.100-SNAPSHOT.pom
[INFO] Installing /jobs/genie.tm/rse-gerrit_master/workspace/rse/plugins/org.eclipse.rse.useractions.sdk/target/p2content.xml to /home/hudson/genie.tm/.jenkins/jobs/rse-gerrit_master/workspace/.repository/org/eclipse/tm/org.eclipse.rse.useractions.sdk/4.5.100-SNAPSHOT/org.eclipse.rse.useractions.sdk-4.5.100-SNAPSHOT-p2metadata.xml
[INFO] Installing /jobs/genie.tm/rse-gerrit_master/workspace/rse/plugins/org.eclipse.rse.useractions.sdk/target/p2artifacts.xml to /home/hudson/genie.tm/.jenkins/jobs/rse-gerrit_master/workspace/.repository/org/eclipse/tm/org.eclipse.rse.useractions.sdk/4.5.100-SNAPSHOT/org.eclipse.rse.useractions.sdk-4.5.100-SNAPSHOT-p2artifacts.xml
[INFO] 
[INFO] --- tycho-p2-plugin:1.6.0:update-local-index (default-update-local-index) @ org.eclipse.rse.useractions.sdk ---
[INFO] 
[INFO] ------------------------------------------------------------------------
[INFO] Skipping org.eclipse.rse.useractions.sdk
[INFO] This project has been banned from the build due to previous failures.
[INFO] ------------------------------------------------------------------------
[INFO] 
[INFO] -----------< org.eclipse.tm:org.eclipse.rse.ui.capabilities >-----------
[INFO] Building org.eclipse.rse.ui.capabilities 4.5.100-SNAPSHOT        [24/81]
[INFO] ---------------------------[ eclipse-plugin ]---------------------------
[INFO] 
[INFO] --- maven-clean-plugin:2.5:clean (default-clean) @ org.eclipse.rse.ui.capabilities ---
[INFO] 
[INFO] --- tycho-packaging-plugin:1.6.0:build-qualifier (default-build-qualifier) @ org.eclipse.rse.ui.capabilities ---
[INFO] The project's OSGi version is 4.5.100.201901312252
[INFO] 
[INFO] --- tycho-packaging-plugin:1.6.0:validate-id (default-validate-id) @ org.eclipse.rse.ui.capabilities ---
[INFO] 
[INFO] --- tycho-packaging-plugin:1.6.0:validate-version (default-validate-version) @ org.eclipse.rse.ui.capabilities ---
[INFO] 
[INFO] --- maven-resources-plugin:2.7:resources (default-resources) @ org.eclipse.rse.ui.capabilities ---
[INFO] Using 'UTF-8' encoding to copy filtered resources.
[INFO] skip non existing resourceDirectory /jobs/genie.tm/rse-gerrit_master/workspace/rse/plugins/org.eclipse.rse.ui.capabilities/src/main/resources
[INFO] 
[INFO] --- tycho-compiler-plugin:1.6.0:compile (default-compile) @ org.eclipse.rse.ui.capabilities ---
[INFO] 
[INFO] --- maven-resources-plugin:2.7:testResources (default-testResources) @ org.eclipse.rse.ui.capabilities ---
[INFO] Not copying test resources
[INFO] 
[INFO] --- target-platform-configuration:1.6.0:target-platform (default-target-platform) @ org.eclipse.rse.ui.capabilities ---
[INFO] 
[INFO] --- tycho-packaging-plugin:1.6.0:package-plugin (default-package-plugin) @ org.eclipse.rse.ui.capabilities ---
[INFO] Building jar: /jobs/genie.tm/rse-gerrit_master/workspace/rse/plugins/org.eclipse.rse.ui.capabilities/target/org.eclipse.rse.ui.capabilities-4.5.100-SNAPSHOT.jar
[INFO] 
[INFO] --- tycho-p2-plugin:1.6.0:p2-metadata-default (default-p2-metadata-default) @ org.eclipse.rse.ui.capabilities ---
[INFO] 
[INFO] --- maven-install-plugin:2.3.1:install (default-install) @ org.eclipse.rse.ui.capabilities ---
[INFO] Installing /jobs/genie.tm/rse-gerrit_master/workspace/rse/plugins/org.eclipse.rse.ui.capabilities/target/org.eclipse.rse.ui.capabilities-4.5.100-SNAPSHOT.jar to /home/hudson/genie.tm/.jenkins/jobs/rse-gerrit_master/workspace/.repository/org/eclipse/tm/org.eclipse.rse.ui.capabilities/4.5.100-SNAPSHOT/org.eclipse.rse.ui.capabilities-4.5.100-SNAPSHOT.jar
[INFO] Installing /jobs/genie.tm/rse-gerrit_master/workspace/rse/plugins/org.eclipse.rse.ui.capabilities/pom.xml to /home/hudson/genie.tm/.jenkins/jobs/rse-gerrit_master/workspace/.repository/org/eclipse/tm/org.eclipse.rse.ui.capabilities/4.5.100-SNAPSHOT/org.eclipse.rse.ui.capabilities-4.5.100-SNAPSHOT.pom
[INFO] Installing /jobs/genie.tm/rse-gerrit_master/workspace/rse/plugins/org.eclipse.rse.ui.capabilities/target/p2content.xml to /home/hudson/genie.tm/.jenkins/jobs/rse-gerrit_master/workspace/.repository/org/eclipse/tm/org.eclipse.rse.ui.capabilities/4.5.100-SNAPSHOT/org.eclipse.rse.ui.capabilities-4.5.100-SNAPSHOT-p2metadata.xml
[INFO] Installing /jobs/genie.tm/rse-gerrit_master/workspace/rse/plugins/org.eclipse.rse.ui.capabilities/target/p2artifacts.xml to /home/hudson/genie.tm/.jenkins/jobs/rse-gerrit_master/workspace/.repository/org/eclipse/tm/org.eclipse.rse.ui.capabilities/4.5.100-SNAPSHOT/org.eclipse.rse.ui.capabilities-4.5.100-SNAPSHOT-p2artifacts.xml
[INFO] 
[INFO] --- tycho-p2-plugin:1.6.0:update-local-index (default-update-local-index) @ org.eclipse.rse.ui.capabilities ---
[INFO] 
[INFO] ------------< org.eclipse.tm.rse:org.eclipse.tm.rse.tests >-------------
[INFO] Building org.eclipse.tm.rse.tests 4.5.100-SNAPSHOT               [25/81]
[INFO] --------------------------------[ pom ]---------------------------------
[INFO] 
[INFO] --- maven-clean-plugin:2.5:clean (default-clean) @ org.eclipse.tm.rse.tests ---
[INFO] 
[INFO] --- maven-install-plugin:2.4:install (default-install) @ org.eclipse.tm.rse.tests ---
[INFO] Installing /jobs/genie.tm/rse-gerrit_master/workspace/rse/tests/pom.xml to /home/hudson/genie.tm/.jenkins/jobs/rse-gerrit_master/workspace/.repository/org/eclipse/tm/rse/org.eclipse.tm.rse.tests/4.5.100-SNAPSHOT/org.eclipse.tm.rse.tests-4.5.100-SNAPSHOT.pom
[INFO] 
[INFO] -----------< org.eclipse.tm:org.eclipse.rse.tests.framework >-----------
[INFO] Building org.eclipse.rse.tests.framework 4.5.100-SNAPSHOT        [26/81]
[INFO] ---------------------------[ eclipse-plugin ]---------------------------
[INFO] 
[INFO] --- maven-clean-plugin:2.5:clean (default-clean) @ org.eclipse.rse.tests.framework ---
[INFO] 
[INFO] --- tycho-packaging-plugin:1.6.0:build-qualifier (default-build-qualifier) @ org.eclipse.rse.tests.framework ---
[INFO] The project's OSGi version is 4.5.100.201901312252
[INFO] 
[INFO] --- tycho-packaging-plugin:1.6.0:validate-id (default-validate-id) @ org.eclipse.rse.tests.framework ---
[INFO] 
[INFO] --- tycho-packaging-plugin:1.6.0:validate-version (default-validate-version) @ org.eclipse.rse.tests.framework ---
[INFO] 
[INFO] --- maven-resources-plugin:2.7:resources (default-resources) @ org.eclipse.rse.tests.framework ---
[INFO] Using 'UTF-8' encoding to copy filtered resources.
[INFO] skip non existing resourceDirectory /jobs/genie.tm/rse-gerrit_master/workspace/rse/tests/org.eclipse.rse.tests.framework/src/main/resources
[INFO] 
[INFO] --- tycho-compiler-plugin:1.6.0:compile (default-compile) @ org.eclipse.rse.tests.framework ---
[INFO] Compiling 34 source files to /jobs/genie.tm/rse-gerrit_master/workspace/rse/tests/org.eclipse.rse.tests.framework/target/classes
[WARNING] /jobs/genie.tm/rse-gerrit_master/workspace/rse/tests/org.eclipse.rse.tests.framework/src/org/eclipse/rse/internal/tests/framework/ui/TestSuiteHolderView.java:[36] 
	import org.eclipse.jface.viewers.ViewerSorter;
	       ^^^^^^^^^^^^^^^^^^^^^^^^^^^^^^^^^^^^^^
The type ViewerSorter is deprecated
[WARNING] /jobs/genie.tm/rse-gerrit_master/workspace/rse/tests/org.eclipse.rse.tests.framework/src/org/eclipse/rse/internal/tests/framework/ui/TestSuiteHolderView.java:[127] 
	private abstract class ColumnSorter extends ViewerSorter {
	                                            ^^^^^^^^^^^^
The type ViewerSorter is deprecated
[WARNING] /jobs/genie.tm/rse-gerrit_master/workspace/rse/tests/org.eclipse.rse.tests.framework/src/org/eclipse/rse/internal/tests/framework/ui/TestSuiteHolderView.java:[188] 
	holderViewer.setSorter(sorter);
	             ^^^^^^^^^^^^^^^^^
The method setSorter(ViewerSorter) from the type StructuredViewer is deprecated
[WARNING] /jobs/genie.tm/rse-gerrit_master/workspace/rse/tests/org.eclipse.rse.tests.framework/src/org/eclipse/rse/internal/tests/framework/scripting/ConsoleContext.java:[31] 
	* @param home
	         ^^^^
Javadoc: Description expected after this reference
[WARNING] /jobs/genie.tm/rse-gerrit_master/workspace/rse/tests/org.eclipse.rse.tests.framework/src/org/eclipse/rse/internal/tests/framework/scripting/ConsoleContext.java:[50] 
	ImageData data = descriptor.getImageData();
	                            ^^^^^^^^^^^^^^
The method getImageData() from the type ImageDescriptor is deprecated
[WARNING] /jobs/genie.tm/rse-gerrit_master/workspace/rse/tests/org.eclipse.rse.tests.framework/src/org/eclipse/rse/internal/tests/framework/scripting/ScriptInterpreter.java:[33] 
	* @throws IOException
	          ^^^^^^^^^^^
Javadoc: Description expected after this reference
[WARNING] /jobs/genie.tm/rse-gerrit_master/workspace/rse/tests/org.eclipse.rse.tests.framework/src/org/eclipse/rse/internal/tests/framework/scripting/ScriptParser.java:[35] 
	* @param messageList
	         ^^^^^^^^^^^
Javadoc: Description expected after this reference
[WARNING] /jobs/genie.tm/rse-gerrit_master/workspace/rse/tests/org.eclipse.rse.tests.framework/src/org/eclipse/rse/tests/framework/ITestSuiteHolderListener.java:[22] 
	* @param holder
	         ^^^^^^
Javadoc: Description expected after this reference
[WARNING] /jobs/genie.tm/rse-gerrit_master/workspace/rse/tests/org.eclipse.rse.tests.framework/src/org/eclipse/rse/tests/framework/ITestSuiteHolderListener.java:[28] 
	* @param holder
	         ^^^^^^
Javadoc: Description expected after this reference
[WARNING] /jobs/genie.tm/rse-gerrit_master/workspace/rse/tests/org.eclipse.rse.tests.framework/src/org/eclipse/rse/internal/tests/framework/scripting/SyntaxTreeVisitor.java:[22] 
	* @param node
	         ^^^^
Javadoc: Description expected after this reference
[WARNING] /jobs/genie.tm/rse-gerrit_master/workspace/rse/tests/org.eclipse.rse.tests.framework/src/org/eclipse/rse/internal/tests/framework/scripting/SyntaxTreeVisitor.java:[28] 
	* @param node
	         ^^^^
Javadoc: Description expected after this reference
[WARNING] /jobs/genie.tm/rse-gerrit_master/workspace/rse/tests/org.eclipse.rse.tests.framework/src/org/eclipse/rse/internal/tests/framework/actions/RunHolderDelegate.java:[21] 
	import org.eclipse.core.runtime.SubProgressMonitor;
	       ^^^^^^^^^^^^^^^^^^^^^^^^^^^^^^^^^^^^^^^^^^^
The type SubProgressMonitor is deprecated
[WARNING] /jobs/genie.tm/rse-gerrit_master/workspace/rse/tests/org.eclipse.rse.tests.framework/src/org/eclipse/rse/internal/tests/framework/actions/RunHolderDelegate.java:[118] 
	IProgressMonitor subMonitor = new SubProgressMonitor(monitor, 1);
	                                  ^^^^^^^^^^^^^^^^^^
The type SubProgressMonitor is deprecated
[WARNING] /jobs/genie.tm/rse-gerrit_master/workspace/rse/tests/org.eclipse.rse.tests.framework/src/org/eclipse/rse/internal/tests/framework/actions/RunHolderDelegate.java:[118] 
	IProgressMonitor subMonitor = new SubProgressMonitor(monitor, 1);
	                                  ^^^^^^^^^^^^^^^^^^^^^^^^^^^^^^
The constructor SubProgressMonitor(IProgressMonitor, int) is deprecated
[WARNING] /jobs/genie.tm/rse-gerrit_master/workspace/rse/tests/org.eclipse.rse.tests.framework/src/org/eclipse/rse/internal/tests/framework/scripting/SyntaxNode.java:[31] 
	* @param lineNumber
	         ^^^^^^^^^^
Javadoc: Description expected after this reference
[WARNING] /jobs/genie.tm/rse-gerrit_master/workspace/rse/tests/org.eclipse.rse.tests.framework/src/org/eclipse/rse/internal/tests/framework/scripting/SyntaxNode.java:[48] 
	* @param visitor
	         ^^^^^^^
Javadoc: Description expected after this reference
16 problems (16 warnings)
[INFO] 
[INFO] --- maven-resources-plugin:2.7:testResources (default-testResources) @ org.eclipse.rse.tests.framework ---
[INFO] Not copying test resources
[INFO] 
[INFO] --- target-platform-configuration:1.6.0:target-platform (default-target-platform) @ org.eclipse.rse.tests.framework ---
[INFO] 
[INFO] --- tycho-packaging-plugin:1.6.0:package-plugin (default-package-plugin) @ org.eclipse.rse.tests.framework ---
[INFO] Building jar: /jobs/genie.tm/rse-gerrit_master/workspace/rse/tests/org.eclipse.rse.tests.framework/target/org.eclipse.rse.tests.framework-4.5.100-SNAPSHOT.jar
[INFO] 
[INFO] --- tycho-p2-plugin:1.6.0:p2-metadata-default (default-p2-metadata-default) @ org.eclipse.rse.tests.framework ---
[INFO] 
[INFO] --- maven-install-plugin:2.3.1:install (default-install) @ org.eclipse.rse.tests.framework ---
[INFO] Installing /jobs/genie.tm/rse-gerrit_master/workspace/rse/tests/org.eclipse.rse.tests.framework/target/org.eclipse.rse.tests.framework-4.5.100-SNAPSHOT.jar to /home/hudson/genie.tm/.jenkins/jobs/rse-gerrit_master/workspace/.repository/org/eclipse/tm/org.eclipse.rse.tests.framework/4.5.100-SNAPSHOT/org.eclipse.rse.tests.framework-4.5.100-SNAPSHOT.jar
[INFO] Installing /jobs/genie.tm/rse-gerrit_master/workspace/rse/tests/org.eclipse.rse.tests.framework/pom.xml to /home/hudson/genie.tm/.jenkins/jobs/rse-gerrit_master/workspace/.repository/org/eclipse/tm/org.eclipse.rse.tests.framework/4.5.100-SNAPSHOT/org.eclipse.rse.tests.framework-4.5.100-SNAPSHOT.pom
[INFO] Installing /jobs/genie.tm/rse-gerrit_master/workspace/rse/tests/org.eclipse.rse.tests.framework/target/p2content.xml to /home/hudson/genie.tm/.jenkins/jobs/rse-gerrit_master/workspace/.repository/org/eclipse/tm/org.eclipse.rse.tests.framework/4.5.100-SNAPSHOT/org.eclipse.rse.tests.framework-4.5.100-SNAPSHOT-p2metadata.xml
[INFO] Installing /jobs/genie.tm/rse-gerrit_master/workspace/rse/tests/org.eclipse.rse.tests.framework/target/p2artifacts.xml to /home/hudson/genie.tm/.jenkins/jobs/rse-gerrit_master/workspace/.repository/org/eclipse/tm/org.eclipse.rse.tests.framework/4.5.100-SNAPSHOT/org.eclipse.rse.tests.framework-4.5.100-SNAPSHOT-p2artifacts.xml
[INFO] 
[INFO] --- tycho-p2-plugin:1.6.0:update-local-index (default-update-local-index) @ org.eclipse.rse.tests.framework ---
[INFO] 
[INFO] ------------------------------------------------------------------------
[INFO] Skipping org.eclipse.rse.tests
[INFO] This project has been banned from the build due to previous failures.
[INFO] ------------------------------------------------------------------------
[INFO] 
[INFO] ------------------------------------------------------------------------
[INFO] Skipping org.eclipse.rse.tests
[INFO] This project has been banned from the build due to previous failures.
[INFO] ------------------------------------------------------------------------
[INFO] 
[INFO] ------< org.eclipse.tm:org.eclipse.rse.tests.framework.examples >-------
[INFO] Building org.eclipse.rse.tests.framework.examples 4.5.100-SNAPSHOT [27/81]
[INFO] ---------------------------[ eclipse-plugin ]---------------------------
[INFO] 
[INFO] --- maven-clean-plugin:2.5:clean (default-clean) @ org.eclipse.rse.tests.framework.examples ---
[INFO] 
[INFO] --- tycho-packaging-plugin:1.6.0:build-qualifier (default-build-qualifier) @ org.eclipse.rse.tests.framework.examples ---
[INFO] The project's OSGi version is 4.5.100.201901312252
[INFO] 
[INFO] --- tycho-packaging-plugin:1.6.0:validate-id (default-validate-id) @ org.eclipse.rse.tests.framework.examples ---
[INFO] 
[INFO] --- tycho-packaging-plugin:1.6.0:validate-version (default-validate-version) @ org.eclipse.rse.tests.framework.examples ---
[INFO] 
[INFO] --- maven-resources-plugin:2.7:resources (default-resources) @ org.eclipse.rse.tests.framework.examples ---
[INFO] Using 'UTF-8' encoding to copy filtered resources.
[INFO] skip non existing resourceDirectory /jobs/genie.tm/rse-gerrit_master/workspace/rse/tests/org.eclipse.rse.tests.framework.examples/src/main/resources
[INFO] 
[INFO] --- tycho-compiler-plugin:1.6.0:compile (default-compile) @ org.eclipse.rse.tests.framework.examples ---
[INFO] Compiling 11 source files to /jobs/genie.tm/rse-gerrit_master/workspace/rse/tests/org.eclipse.rse.tests.framework.examples/target/classes
[INFO] 
[INFO] --- maven-resources-plugin:2.7:testResources (default-testResources) @ org.eclipse.rse.tests.framework.examples ---
[INFO] Not copying test resources
[INFO] 
[INFO] --- target-platform-configuration:1.6.0:target-platform (default-target-platform) @ org.eclipse.rse.tests.framework.examples ---
[INFO] 
[INFO] --- tycho-packaging-plugin:1.6.0:package-plugin (default-package-plugin) @ org.eclipse.rse.tests.framework.examples ---
[INFO] Building jar: /jobs/genie.tm/rse-gerrit_master/workspace/rse/tests/org.eclipse.rse.tests.framework.examples/target/org.eclipse.rse.tests.framework.examples-4.5.100-SNAPSHOT.jar
[INFO] 
[INFO] --- tycho-p2-plugin:1.6.0:p2-metadata-default (default-p2-metadata-default) @ org.eclipse.rse.tests.framework.examples ---
[INFO] 
[INFO] --- maven-install-plugin:2.3.1:install (default-install) @ org.eclipse.rse.tests.framework.examples ---
[INFO] Installing /jobs/genie.tm/rse-gerrit_master/workspace/rse/tests/org.eclipse.rse.tests.framework.examples/target/org.eclipse.rse.tests.framework.examples-4.5.100-SNAPSHOT.jar to /home/hudson/genie.tm/.jenkins/jobs/rse-gerrit_master/workspace/.repository/org/eclipse/tm/org.eclipse.rse.tests.framework.examples/4.5.100-SNAPSHOT/org.eclipse.rse.tests.framework.examples-4.5.100-SNAPSHOT.jar
[INFO] Installing /jobs/genie.tm/rse-gerrit_master/workspace/rse/tests/org.eclipse.rse.tests.framework.examples/pom.xml to /home/hudson/genie.tm/.jenkins/jobs/rse-gerrit_master/workspace/.repository/org/eclipse/tm/org.eclipse.rse.tests.framework.examples/4.5.100-SNAPSHOT/org.eclipse.rse.tests.framework.examples-4.5.100-SNAPSHOT.pom
[INFO] Installing /jobs/genie.tm/rse-gerrit_master/workspace/rse/tests/org.eclipse.rse.tests.framework.examples/target/p2content.xml to /home/hudson/genie.tm/.jenkins/jobs/rse-gerrit_master/workspace/.repository/org/eclipse/tm/org.eclipse.rse.tests.framework.examples/4.5.100-SNAPSHOT/org.eclipse.rse.tests.framework.examples-4.5.100-SNAPSHOT-p2metadata.xml
[INFO] Installing /jobs/genie.tm/rse-gerrit_master/workspace/rse/tests/org.eclipse.rse.tests.framework.examples/target/p2artifacts.xml to /home/hudson/genie.tm/.jenkins/jobs/rse-gerrit_master/workspace/.repository/org/eclipse/tm/org.eclipse.rse.tests.framework.examples/4.5.100-SNAPSHOT/org.eclipse.rse.tests.framework.examples-4.5.100-SNAPSHOT-p2artifacts.xml
[INFO] 
[INFO] --- tycho-p2-plugin:1.6.0:update-local-index (default-update-local-index) @ org.eclipse.rse.tests.framework.examples ---
[INFO] 
[INFO] ------------------------------------------------------------------------
[INFO] Skipping org.eclipse.tm.site
[INFO] This project has been banned from the build due to previous failures.
[INFO] ------------------------------------------------------------------------
[INFO] ------------------------------------------------------------------------
[INFO] Reactor Summary:
[INFO] 
[INFO] Target Management Parent 4.5.100-SNAPSHOT .......... SUCCESS [  9.745 s]
[INFO] org.eclipse.tm.rse ................................. SUCCESS [  0.025 s]
[INFO] org.eclipse.tm.rse.plugins ......................... SUCCESS [  0.030 s]
[INFO] org.eclipse.rse.services ........................... SUCCESS [ 26.508 s]
[INFO] org.eclipse.rse.core ............................... FAILURE [  0.844 s]
[INFO] org.eclipse.rse.ui ................................. SKIPPED
[INFO] org.eclipse.rse.subsystems.files.core .............. SKIPPED
[INFO] org.eclipse.tm.terminal.view.ui.rse ................ SKIPPED
[INFO] org.eclipse.tm.terminal.plugins .................... SUCCESS [  0.026 s]
[INFO] org.eclipse.tm.terminal.features ................... SUCCESS [  0.023 s]
[INFO] org.eclipse.tm.terminal.view.rse.feature ........... SKIPPED
[INFO] org.eclipse.tm.terminal.view.rse.sdk.feature 4.5.101-SNAPSHOT SKIPPED
[INFO] TM Terminal, Maven Master .......................... SUCCESS [  0.025 s]
[INFO] org.eclipse.tm.rse.doc ............................. SUCCESS [  0.017 s]
[INFO] org.eclipse.dstore.doc.isv ......................... SUCCESS [  0.235 s]
[INFO] org.eclipse.rse.doc.isv ............................ SUCCESS [  0.162 s]
[INFO] org.eclipse.rse.doc.user ........................... SUCCESS [  0.359 s]
[INFO] org.eclipse.tm.rse.examples ........................ SUCCESS [  0.027 s]
[INFO] org.eclipse.rse.examples.daytime ................... SKIPPED
[INFO] org.eclipse.dstore.extra ........................... SUCCESS [  0.478 s]
[INFO] org.eclipse.dstore.core ............................ SUCCESS [  0.999 s]
[INFO] org.eclipse.rse.services.dstore .................... SUCCESS [  0.697 s]
[INFO] org.eclipse.rse.connectorservice.dstore ............ SKIPPED
[INFO] org.eclipse.rse.examples.dstore .................... SKIPPED
[INFO] org.eclipse.rse.subsystems.shells.core ............. SKIPPED
[INFO] org.eclipse.rse.files.ui ........................... SKIPPED
[INFO] org.eclipse.rse.shells.ui .......................... SKIPPED
[INFO] org.eclipse.rse.examples.tutorial .................. SKIPPED
[INFO] org.eclipse.rse.examples ........................... SKIPPED
[INFO] org.eclipse.tm.rse.features ........................ SUCCESS [  0.038 s]
[INFO] org.eclipse.rse.efs ................................ SKIPPED
[INFO] org.eclipse.rse.efs.ui ............................. SKIPPED
[INFO] org.eclipse.rse.importexport 4.5.101-SNAPSHOT ...... SKIPPED
[INFO] org.eclipse.rse.subsystems.processes.core .......... SKIPPED
[INFO] org.eclipse.rse.processes.ui ....................... SKIPPED
[INFO] org.eclipse.rse.subsystems.processes.shell.linux ... SKIPPED
[INFO] org.eclipse.rse.core ............................... SKIPPED
[INFO] org.eclipse.rse.subsystems.files.dstore ............ SKIPPED
[INFO] org.eclipse.rse.subsystems.processes.dstore ........ SKIPPED
[INFO] org.eclipse.rse.subsystems.shells.dstore ........... SKIPPED
[INFO] org.eclipse.rse.dstore.security .................... SKIPPED
[INFO] org.eclipse.rse.dstore ............................. SKIPPED
[INFO] org.eclipse.rse .................................... SUCCESS [  0.405 s]
[INFO] org.eclipse.rse.connectorservice.local ............. SKIPPED
[INFO] org.eclipse.rse.services.ssh ....................... SUCCESS [  0.346 s]
[INFO] org.eclipse.rse.connectorservice.ssh ............... SKIPPED
[INFO] org.eclipse.rse.services.telnet .................... SUCCESS [  0.306 s]
[INFO] org.eclipse.rse.connectorservice.telnet ............ SKIPPED
[INFO] org.eclipse.rse.services.files.ftp ................. SKIPPED
[INFO] org.eclipse.rse.subsystems.files.ftp ............... SKIPPED
[INFO] org.eclipse.rse.ftp ................................ SKIPPED
[INFO] org.eclipse.rse.services.local ..................... SUCCESS [  0.358 s]
[INFO] org.eclipse.rse.subsystems.files.local ............. SKIPPED
[INFO] org.eclipse.rse.subsystems.processes.local ......... SKIPPED
[INFO] org.eclipse.rse.subsystems.shells.local ............ SKIPPED
[INFO] org.eclipse.rse.local .............................. SKIPPED
[INFO] org.eclipse.rse.subsystems.files.ssh ............... SKIPPED
[INFO] org.eclipse.rse.subsystems.shells.ssh .............. SKIPPED
[INFO] org.eclipse.rse.ssh ................................ SKIPPED
[INFO] org.eclipse.rse.subsystems.shells.telnet ........... SKIPPED
[INFO] org.eclipse.rse.telnet ............................. SKIPPED
[INFO] org.eclipse.rse .................................... SKIPPED
[INFO] org.eclipse.rse.subsystems.files.scp ............... SKIPPED
[INFO] org.eclipse.rse.scp ................................ SKIPPED
[INFO] org.eclipse.rse.sdk ................................ SUCCESS [  0.259 s]
[INFO] org.eclipse.rse.sdk ................................ SKIPPED
[INFO] org.eclipse.rse.subsystems.terminals.core .......... SKIPPED
[INFO] org.eclipse.rse.subsystems.terminals.ssh ........... SKIPPED
[INFO] org.eclipse.rse.terminals.ui ....................... SKIPPED
[INFO] org.eclipse.rse.terminals .......................... SKIPPED
[INFO] org.eclipse.rse.useractions ........................ SKIPPED
[INFO] org.eclipse.rse.useractions ........................ SKIPPED
[INFO] org.eclipse.rse.useractions.sdk .................... SUCCESS [  0.291 s]
[INFO] org.eclipse.rse.useractions.sdk .................... SKIPPED
[INFO] org.eclipse.rse.ui.capabilities .................... SUCCESS [  0.145 s]
[INFO] org.eclipse.tm.rse.tests ........................... SUCCESS [  0.036 s]
[INFO] org.eclipse.rse.tests.framework .................... SUCCESS [  0.540 s]
[INFO] org.eclipse.rse.tests .............................. SKIPPED
[INFO] org.eclipse.rse.tests .............................. SKIPPED
[INFO] org.eclipse.rse.tests.framework.examples ........... SUCCESS [  0.271 s]
[INFO] org.eclipse.tm.site 4.5.200-SNAPSHOT ............... SKIPPED
[INFO] ------------------------------------------------------------------------
[INFO] BUILD FAILURE
[INFO] ------------------------------------------------------------------------
[INFO] Total time: 03:53 min
[INFO] Finished at: 2020-04-27T16:37:39-04:00
[INFO] ------------------------------------------------------------------------
[ERROR] Failed to execute goal org.eclipse.tycho:tycho-compiler-plugin:1.6.0:compile (default-compile) on project org.eclipse.rse.core: Compilation failure: Compilation failure: 
[ERROR] /jobs/genie.tm/rse-gerrit_master/workspace/rse/plugins/org.eclipse.rse.core/src/org/eclipse/rse/internal/persistence/SerializingProvider.java:[180] 
[ERROR] 	result = new Status(IStatus.ERROR, null, IRSECoreStatusCodes.EXCEPTION_OCCURRED, RSECoreMessages.SerializingProvider_UnexpectedException, e);
[ERROR] 	         ^^^^^^^^^^^^^^^^^^^^^^^^^^^^^^^^^^^^^^^^^^^^^^^^^^^^^^^^^^^^^^^^^^^^^^^^^^^^^^^^^^^^^^^^^^^^^^^^^^^^^^^^^^^^^^^^^^^^^^^^^^^^^^^^^^^
[ERROR] The constructor Status(int, Class, int, String, Throwable) is ambiguous
[ERROR] -> [Help 1]
[ERROR] 
[ERROR] To see the full stack trace of the errors, re-run Maven with the -e switch.
[ERROR] Re-run Maven using the -X switch to enable full debug logging.
[ERROR] 
[ERROR] For more information about the errors and possible solutions, please read the following articles:
[ERROR] [Help 1] http://cwiki.apache.org/confluence/display/MAVEN/MojoFailureException
[ERROR] 
[ERROR] After correcting the problems, you can resume the build with the command
[ERROR]   mvn <goals> -rf org.eclipse.tm:org.eclipse.rse.core
Build step 'Invoke top-level Maven targets' marked build as failure
Terminating xvnc.
Archiving artifacts
append disk usage
Started calculate disk usage of build
Finished Calculation of disk usage of build in 0 seconds
Started calculate disk usage of workspace
Finished Calculation of disk usage of workspace in 0 seconds
Recording test results
Skipping calculation of disk usage, it was already done in post build step.
Finished: FAILURE