UnstableConsole Output

Skipping 3,019 KB.. Full Log
genie.tm/tm.gerrit/workspace/rse/tests/org.eclipse.rse.tests/src/org/eclipse/rse/tests/subsystems/files/RSEFileStoreTest.java:[146] 
	fTestStore = RSEFileSystem.getInstance().getStore(testURI);
	             ^^^^^^^^^^^^^^^^^^^^^^^^^^^
Discouraged access: The method 'RSEFileSystem.getInstance()' is not API (restriction on classpath entry '/jobs/genie.tm/tm.gerrit/workspace/rse/plugins/org.eclipse.rse.efs/target/classes')
[WARNING] /jobs/genie.tm/tm.gerrit/workspace/rse/tests/org.eclipse.rse.tests/src/org/eclipse/rse/tests/subsystems/files/RSEFileStoreTest.java:[146] 
	fTestStore = RSEFileSystem.getInstance().getStore(testURI);
	             ^^^^^^^^^^^^^^^^^^^^^^^^^^^^^^^^^^^^^^^^^^^^^
Discouraged access: The method 'RSEFileSystem.getStore(URI)' is not API (restriction on classpath entry '/jobs/genie.tm/tm.gerrit/workspace/rse/plugins/org.eclipse.rse.efs/target/classes')
[WARNING] /jobs/genie.tm/tm.gerrit/workspace/rse/tests/org.eclipse.rse.tests/src/org/eclipse/rse/tests/internal/testsubsystem/TestSubSystemNodeAdapter.java:[20] 
	import org.eclipse.rse.internal.ui.view.SystemPerspectiveHelpers;
	       ^^^^^^^^^^^^^^^^^^^^^^^^^^^^^^^^^^^^^^^^^^^^^^^^^^^^^^^^^
Discouraged access: The type 'SystemPerspectiveHelpers' is not API (restriction on classpath entry '/jobs/genie.tm/tm.gerrit/workspace/rse/plugins/org.eclipse.rse.ui/target/classes')
[WARNING] /jobs/genie.tm/tm.gerrit/workspace/rse/tests/org.eclipse.rse.tests/src/org/eclipse/rse/tests/internal/testsubsystem/TestSubSystemNodeAdapter.java:[21] 
	import org.eclipse.rse.internal.ui.view.SystemView;
	       ^^^^^^^^^^^^^^^^^^^^^^^^^^^^^^^^^^^^^^^^^^^
Discouraged access: The type 'SystemView' is not API (restriction on classpath entry '/jobs/genie.tm/tm.gerrit/workspace/rse/plugins/org.eclipse.rse.ui/target/classes')
[WARNING] /jobs/genie.tm/tm.gerrit/workspace/rse/tests/org.eclipse.rse.tests/src/org/eclipse/rse/tests/internal/testsubsystem/TestSubSystemNodeAdapter.java:[280] 
	SystemView view = SystemPerspectiveHelpers.findRSEView(); 
	^^^^^^^^^^
Discouraged access: The type 'SystemView' is not API (restriction on classpath entry '/jobs/genie.tm/tm.gerrit/workspace/rse/plugins/org.eclipse.rse.ui/target/classes')
[WARNING] /jobs/genie.tm/tm.gerrit/workspace/rse/tests/org.eclipse.rse.tests/src/org/eclipse/rse/tests/internal/testsubsystem/TestSubSystemNodeAdapter.java:[280] 
	SystemView view = SystemPerspectiveHelpers.findRSEView(); 
	                  ^^^^^^^^^^^^^^^^^^^^^^^^
Discouraged access: The type 'SystemPerspectiveHelpers' is not API (restriction on classpath entry '/jobs/genie.tm/tm.gerrit/workspace/rse/plugins/org.eclipse.rse.ui/target/classes')
[WARNING] /jobs/genie.tm/tm.gerrit/workspace/rse/tests/org.eclipse.rse.tests/src/org/eclipse/rse/tests/internal/testsubsystem/TestSubSystemNodeAdapter.java:[280] 
	SystemView view = SystemPerspectiveHelpers.findRSEView(); 
	                  ^^^^^^^^^^^^^^^^^^^^^^^^^^^^^^^^^^^^^^
Discouraged access: The method 'SystemPerspectiveHelpers.findRSEView()' is not API (restriction on classpath entry '/jobs/genie.tm/tm.gerrit/workspace/rse/plugins/org.eclipse.rse.ui/target/classes')
[WARNING] /jobs/genie.tm/tm.gerrit/workspace/rse/tests/org.eclipse.rse.tests/src/org/eclipse/rse/tests/internal/testsubsystem/TestSubSystemNodeAdapter.java:[282] 
	view.expandSelected();
	^^^^^^^^^^^^^^^^^^^^^
Discouraged access: The method 'SystemView.expandSelected()' is not API (restriction on classpath entry '/jobs/genie.tm/tm.gerrit/workspace/rse/plugins/org.eclipse.rse.ui/target/classes')
[WARNING] /jobs/genie.tm/tm.gerrit/workspace/rse/tests/org.eclipse.rse.tests/src/org/eclipse/rse/tests/core/registries/SubSystemConfigurationProxyTestCase.java:[131] 
	if ("Unix".equalsIgnoreCase(systemType.getName()) || "Linux".equalsIgnoreCase(systemType.getName())) { //$NON-NLS-1$ //$NON-NLS-2$
	                                       ^^^^^^^^^
The method getName() from the type IRSESystemType is deprecated
[WARNING] /jobs/genie.tm/tm.gerrit/workspace/rse/tests/org.eclipse.rse.tests/src/org/eclipse/rse/tests/core/registries/SubSystemConfigurationProxyTestCase.java:[131] 
	if ("Unix".equalsIgnoreCase(systemType.getName()) || "Linux".equalsIgnoreCase(systemType.getName())) { //$NON-NLS-1$ //$NON-NLS-2$
	                                                                                         ^^^^^^^^^
The method getName() from the type IRSESystemType is deprecated
[WARNING] /jobs/genie.tm/tm.gerrit/workspace/rse/tests/org.eclipse.rse.tests/src/org/eclipse/rse/tests/subsystems/files/FileServiceBaseTest.java:[196] 
	HashMap childrenMap = new HashMap();
	^^^^^^^
HashMap is a raw type. References to generic type HashMap<K,V> should be parameterized
[WARNING] /jobs/genie.tm/tm.gerrit/workspace/rse/tests/org.eclipse.rse.tests/src/org/eclipse/rse/tests/subsystems/files/FileServiceBaseTest.java:[196] 
	HashMap childrenMap = new HashMap();
	                          ^^^^^^^
HashMap is a raw type. References to generic type HashMap<K,V> should be parameterized
[WARNING] /jobs/genie.tm/tm.gerrit/workspace/rse/tests/org.eclipse.rse.tests/src/org/eclipse/rse/tests/subsystems/files/FileServiceBaseTest.java:[201] 
	childrenMap.put(thisName, children[i]);
	^^^^^^^^^^^^^^^^^^^^^^^^^^^^^^^^^^^^^^
Type safety: The method put(Object, Object) belongs to the raw type HashMap. References to generic type HashMap<K,V> should be parameterized
[WARNING] /jobs/genie.tm/tm.gerrit/workspace/rse/tests/org.eclipse.rse.tests/src/org/eclipse/rse/tests/internal/RSEInternalFrameworkTestCase.java:[74] 
	private final List params;
	              ^^^^
List is a raw type. References to generic type List<E> should be parameterized
[WARNING] /jobs/genie.tm/tm.gerrit/workspace/rse/tests/org.eclipse.rse.tests/src/org/eclipse/rse/tests/internal/RSEInternalFrameworkTestCase.java:[75] 
	public TestWaiter(List params) {
	                  ^^^^
List is a raw type. References to generic type List<E> should be parameterized
[WARNING] /jobs/genie.tm/tm.gerrit/workspace/rse/tests/org.eclipse.rse.tests/src/org/eclipse/rse/tests/internal/RSEInternalFrameworkTestCase.java:[84] 
	final List params;
	      ^^^^
List is a raw type. References to generic type List<E> should be parameterized
[WARNING] /jobs/genie.tm/tm.gerrit/workspace/rse/tests/org.eclipse.rse.tests/src/org/eclipse/rse/tests/internal/RSEInternalFrameworkTestCase.java:[85] 
	public TestJob(List params) {
	               ^^^^
List is a raw type. References to generic type List<E> should be parameterized
[WARNING] /jobs/genie.tm/tm.gerrit/workspace/rse/tests/org.eclipse.rse.tests/src/org/eclipse/rse/tests/internal/RSEInternalFrameworkTestCase.java:[94] 
	params.add(Boolean.TRUE);
	^^^^^^^^^^^^^^^^^^^^^^^^
Type safety: The method add(Object) belongs to the raw type List. References to generic type List<E> should be parameterized
[WARNING] /jobs/genie.tm/tm.gerrit/workspace/rse/tests/org.eclipse.rse.tests/src/org/eclipse/rse/tests/internal/RSEInternalFrameworkTestCase.java:[117] 
	final List params = new ArrayList();
	      ^^^^
List is a raw type. References to generic type List<E> should be parameterized
[WARNING] /jobs/genie.tm/tm.gerrit/workspace/rse/tests/org.eclipse.rse.tests/src/org/eclipse/rse/tests/internal/RSEInternalFrameworkTestCase.java:[117] 
	final List params = new ArrayList();
	                        ^^^^^^^^^
ArrayList is a raw type. References to generic type ArrayList<E> should be parameterized
[WARNING] /jobs/genie.tm/tm.gerrit/workspace/rse/tests/org.eclipse.rse.tests/src/org/eclipse/rse/tests/internal/RSEDefaultTestLogCollectorDelegate.java:[38] 
	private final List locationsToDispose = new ArrayList();
	              ^^^^
List is a raw type. References to generic type List<E> should be parameterized
[WARNING] /jobs/genie.tm/tm.gerrit/workspace/rse/tests/org.eclipse.rse.tests/src/org/eclipse/rse/tests/internal/RSEDefaultTestLogCollectorDelegate.java:[38] 
	private final List locationsToDispose = new ArrayList();
	                                            ^^^^^^^^^
ArrayList is a raw type. References to generic type ArrayList<E> should be parameterized
[WARNING] /jobs/genie.tm/tm.gerrit/workspace/rse/tests/org.eclipse.rse.tests/src/org/eclipse/rse/tests/internal/RSEDefaultTestLogCollectorDelegate.java:[45] 
	Iterator iterator = locationsToDispose.iterator();
	^^^^^^^^
Iterator is a raw type. References to generic type Iterator<E> should be parameterized
[WARNING] /jobs/genie.tm/tm.gerrit/workspace/rse/tests/org.eclipse.rse.tests/src/org/eclipse/rse/tests/internal/RSEDefaultTestLogCollectorDelegate.java:[61] 
	List locations = new ArrayList();
	^^^^
List is a raw type. References to generic type List<E> should be parameterized
[WARNING] /jobs/genie.tm/tm.gerrit/workspace/rse/tests/org.eclipse.rse.tests/src/org/eclipse/rse/tests/internal/RSEDefaultTestLogCollectorDelegate.java:[61] 
	List locations = new ArrayList();
	                     ^^^^^^^^^
ArrayList is a raw type. References to generic type ArrayList<E> should be parameterized
[WARNING] /jobs/genie.tm/tm.gerrit/workspace/rse/tests/org.eclipse.rse.tests/src/org/eclipse/rse/tests/internal/RSEDefaultTestLogCollectorDelegate.java:[67] 
	return (IPath[])locations.toArray(new IPath[locations.size()]);
	                ^^^^^^^^^^^^^^^^^^^^^^^^^^^^^^^^^^^^^^^^^^^^^^
Type safety: The method toArray(Object[]) belongs to the raw type List. References to generic type List<E> should be parameterized
[WARNING] /jobs/genie.tm/tm.gerrit/workspace/rse/tests/org.eclipse.rse.tests/src/org/eclipse/rse/tests/internal/RSEDefaultTestLogCollectorDelegate.java:[76] 
	private void internalCollectEclipsePlatformLog(final List locations) {
	                                                     ^^^^
List is a raw type. References to generic type List<E> should be parameterized
[WARNING] /jobs/genie.tm/tm.gerrit/workspace/rse/tests/org.eclipse.rse.tests/src/org/eclipse/rse/tests/internal/RSEDefaultTestLogCollectorDelegate.java:[87] 
	if (platformLog.toFile().canRead()) locations.add(platformLog);
	                                    ^^^^^^^^^^^^^^^^^^^^^^^^^^
Type safety: The method add(Object) belongs to the raw type List. References to generic type List<E> should be parameterized
[WARNING] /jobs/genie.tm/tm.gerrit/workspace/rse/tests/org.eclipse.rse.tests/src/org/eclipse/rse/tests/internal/RSEDefaultTestLogCollectorDelegate.java:[90] 
	locations.add(osgi_logfile_path);
	^^^^^^^^^^^^^^^^^^^^^^^^^^^^^^^^
Type safety: The method add(Object) belongs to the raw type List. References to generic type List<E> should be parameterized
[WARNING] /jobs/genie.tm/tm.gerrit/workspace/rse/tests/org.eclipse.rse.tests/src/org/eclipse/rse/tests/internal/RSEDefaultTestLogCollectorDelegate.java:[100] 
	private void internalCollectJavaSystemProperties(final List locations) {
	                                                       ^^^^
List is a raw type. References to generic type List<E> should be parameterized
[WARNING] /jobs/genie.tm/tm.gerrit/workspace/rse/tests/org.eclipse.rse.tests/src/org/eclipse/rse/tests/internal/RSEDefaultTestLogCollectorDelegate.java:[113] 
	locationsToDispose.add(tmpdirPath);
	^^^^^^^^^^^^^^^^^^^^^^^^^^^^^^^^^^
Type safety: The method add(Object) belongs to the raw type List. References to generic type List<E> should be parameterized
[WARNING] /jobs/genie.tm/tm.gerrit/workspace/rse/tests/org.eclipse.rse.tests/src/org/eclipse/rse/tests/internal/RSEDefaultTestLogCollectorDelegate.java:[124] 
	Enumeration names = properties.propertyNames();
	^^^^^^^^^^^
Enumeration is a raw type. References to generic type Enumeration<E> should be parameterized
[WARNING] /jobs/genie.tm/tm.gerrit/workspace/rse/tests/org.eclipse.rse.tests/src/org/eclipse/rse/tests/internal/RSEDefaultTestLogCollectorDelegate.java:[125] 
	List propertyKeys = new ArrayList();
	^^^^
List is a raw type. References to generic type List<E> should be parameterized
[WARNING] /jobs/genie.tm/tm.gerrit/workspace/rse/tests/org.eclipse.rse.tests/src/org/eclipse/rse/tests/internal/RSEDefaultTestLogCollectorDelegate.java:[125] 
	List propertyKeys = new ArrayList();
	                        ^^^^^^^^^
ArrayList is a raw type. References to generic type ArrayList<E> should be parameterized
[WARNING] /jobs/genie.tm/tm.gerrit/workspace/rse/tests/org.eclipse.rse.tests/src/org/eclipse/rse/tests/internal/RSEDefaultTestLogCollectorDelegate.java:[127] 
	propertyKeys.add(names.nextElement());
	^^^^^^^^^^^^^^^^^^^^^^^^^^^^^^^^^^^^^
Type safety: The method add(Object) belongs to the raw type List. References to generic type List<E> should be parameterized
[WARNING] /jobs/genie.tm/tm.gerrit/workspace/rse/tests/org.eclipse.rse.tests/src/org/eclipse/rse/tests/internal/RSEDefaultTestLogCollectorDelegate.java:[129] 
	Collections.sort(propertyKeys);
	^^^^^^^^^^^^^^^^^^^^^^^^^^^^^^
Type safety: Unchecked invocation sort(List) of the generic method sort(List<T>) of type Collections
[WARNING] /jobs/genie.tm/tm.gerrit/workspace/rse/tests/org.eclipse.rse.tests/src/org/eclipse/rse/tests/internal/RSEDefaultTestLogCollectorDelegate.java:[129] 
	Collections.sort(propertyKeys);
	                 ^^^^^^^^^^^^
Type safety: The expression of type List needs unchecked conversion to conform to List<Comparable<? super Comparable<? super T>>>
[WARNING] /jobs/genie.tm/tm.gerrit/workspace/rse/tests/org.eclipse.rse.tests/src/org/eclipse/rse/tests/internal/RSEDefaultTestLogCollectorDelegate.java:[131] 
	Iterator iterator = propertyKeys.iterator();
	^^^^^^^^
Iterator is a raw type. References to generic type Iterator<E> should be parameterized
[WARNING] /jobs/genie.tm/tm.gerrit/workspace/rse/tests/org.eclipse.rse.tests/src/org/eclipse/rse/tests/internal/RSEDefaultTestLogCollectorDelegate.java:[143] 
	locations.add(tmpdirPath);
	^^^^^^^^^^^^^^^^^^^^^^^^^
Type safety: The method add(Object) belongs to the raw type List. References to generic type List<E> should be parameterized
[WARNING] /jobs/genie.tm/tm.gerrit/workspace/rse/tests/org.eclipse.rse.tests/src/org/eclipse/rse/tests/subsystems/files/FileServiceArchiveBaseTest.java:[14] 
	import java.io.File;
	       ^^^^^^^^^^^^
The import java.io.File is never used
[WARNING] /jobs/genie.tm/tm.gerrit/workspace/rse/tests/org.eclipse.rse.tests/src/org/eclipse/rse/tests/subsystems/files/FileServiceArchiveBaseTest.java:[21] 
	import org.eclipse.core.runtime.NullProgressMonitor;
	       ^^^^^^^^^^^^^^^^^^^^^^^^^^^^^^^^^^^^^^^^^^^^
The import org.eclipse.core.runtime.NullProgressMonitor is never used
[WARNING] /jobs/genie.tm/tm.gerrit/workspace/rse/tests/org.eclipse.rse.tests/src/org/eclipse/rse/tests/subsystems/files/FileServiceArchiveBaseTest.java:[109] 
	ISystemDragDropAdapter srcAdapter3 = (ISystemDragDropAdapter) ((IAdaptable) sourceFolderToCopy3).getAdapter(ISystemDragDropAdapter.class);
	                                     ^^^^^^^^^^^^^^^^^^^^^^^^^^^^^^^^^^^^^^^^^^^^^^^^^^^^^^^^^^^^^^^^^^^^^^^^^^^^^^^^^^^^^^^^^^^^^^^^^^^^
Unnecessary cast from ISystemDragDropAdapter to ISystemDragDropAdapter
[WARNING] /jobs/genie.tm/tm.gerrit/workspace/rse/tests/org.eclipse.rse.tests/src/org/eclipse/rse/tests/subsystems/files/FileServiceArchiveBaseTest.java:[308] 
	ISystemDragDropAdapter srcAdapter1 = (ISystemDragDropAdapter) ((IAdaptable) META_INF_folder).getAdapter(ISystemDragDropAdapter.class);
	                                     ^^^^^^^^^^^^^^^^^^^^^^^^^^^^^^^^^^^^^^^^^^^^^^^^^^^^^^^^^^^^^^^^^^^^^^^^^^^^^^^^^^^^^^^^^^^^^^^^
Unnecessary cast from ISystemDragDropAdapter to ISystemDragDropAdapter
[WARNING] /jobs/genie.tm/tm.gerrit/workspace/rse/tests/org.eclipse.rse.tests/src/org/eclipse/rse/tests/subsystems/files/FileServiceArchiveBaseTest.java:[317] 
	ISystemDragDropAdapter srcAdapter2 = (ISystemDragDropAdapter) ((IAdaptable) org_folder).getAdapter(ISystemDragDropAdapter.class);
	                                     ^^^^^^^^^^^^^^^^^^^^^^^^^^^^^^^^^^^^^^^^^^^^^^^^^^^^^^^^^^^^^^^^^^^^^^^^^^^^^^^^^^^^^^^^^^^
Unnecessary cast from ISystemDragDropAdapter to ISystemDragDropAdapter
[WARNING] /jobs/genie.tm/tm.gerrit/workspace/rse/tests/org.eclipse.rse.tests/src/org/eclipse/rse/tests/subsystems/files/FileServiceArchiveBaseTest.java:[476] 
	ISystemDragDropAdapter srcAdapter1 = (ISystemDragDropAdapter) ((IAdaptable) META_INF_folder).getAdapter(ISystemDragDropAdapter.class);
	                                     ^^^^^^^^^^^^^^^^^^^^^^^^^^^^^^^^^^^^^^^^^^^^^^^^^^^^^^^^^^^^^^^^^^^^^^^^^^^^^^^^^^^^^^^^^^^^^^^^
Unnecessary cast from ISystemDragDropAdapter to ISystemDragDropAdapter
[WARNING] /jobs/genie.tm/tm.gerrit/workspace/rse/tests/org.eclipse.rse.tests/src/org/eclipse/rse/tests/subsystems/files/FileServiceArchiveBaseTest.java:[485] 
	ISystemDragDropAdapter srcAdapter2 = (ISystemDragDropAdapter) ((IAdaptable) org_folder).getAdapter(ISystemDragDropAdapter.class);
	                                     ^^^^^^^^^^^^^^^^^^^^^^^^^^^^^^^^^^^^^^^^^^^^^^^^^^^^^^^^^^^^^^^^^^^^^^^^^^^^^^^^^^^^^^^^^^^
Unnecessary cast from ISystemDragDropAdapter to ISystemDragDropAdapter
[WARNING] /jobs/genie.tm/tm.gerrit/workspace/rse/tests/org.eclipse.rse.tests/src/org/eclipse/rse/tests/internal/RSEConnectionManager.java:[32] 
	import junit.framework.Assert;
	       ^^^^^^^^^^^^^^^^^^^^^^
The type Assert is deprecated
[WARNING] /jobs/genie.tm/tm.gerrit/workspace/rse/tests/org.eclipse.rse.tests/src/org/eclipse/rse/tests/internal/RSEConnectionManager.java:[158] 
	Enumeration names = properties.propertyNames();
	^^^^^^^^^^^
Enumeration is a raw type. References to generic type Enumeration<E> should be parameterized
[WARNING] /jobs/genie.tm/tm.gerrit/workspace/rse/tests/org.eclipse.rse.tests/src/org/eclipse/rse/tests/internal/RSEConnectionManager.java:[179] 
	Assert.assertNotNull("FAILED(findConnection): RSE system registry unavailable!", systemRegistry); //$NON-NLS-1$
	^^^^^^
The type Assert is deprecated
[WARNING] /jobs/genie.tm/tm.gerrit/workspace/rse/tests/org.eclipse.rse.tests/src/org/eclipse/rse/tests/internal/RSEConnectionManager.java:[179] 
	Assert.assertNotNull("FAILED(findConnection): RSE system registry unavailable!", systemRegistry); //$NON-NLS-1$
	       ^^^^^^^^^^^^^^^^^^^^^^^^^^^^^^^^^^^^^^^^^^^^^^^^^^^^^^^^^^^^^^^^^^^^^^^^^^^^^^^^^^^^^^^^^
The method assertNotNull(String, Object) from the type Assert is deprecated
[WARNING] /jobs/genie.tm/tm.gerrit/workspace/rse/tests/org.eclipse.rse.tests/src/org/eclipse/rse/tests/internal/RSEConnectionManager.java:[195] 
	Assert.assertNotNull("FAILED(copyConnection): RSE system registry unavailable!", systemRegistry); //$NON-NLS-1$
	^^^^^^
The type Assert is deprecated
[WARNING] /jobs/genie.tm/tm.gerrit/workspace/rse/tests/org.eclipse.rse.tests/src/org/eclipse/rse/tests/internal/RSEConnectionManager.java:[195] 
	Assert.assertNotNull("FAILED(copyConnection): RSE system registry unavailable!", systemRegistry); //$NON-NLS-1$
	       ^^^^^^^^^^^^^^^^^^^^^^^^^^^^^^^^^^^^^^^^^^^^^^^^^^^^^^^^^^^^^^^^^^^^^^^^^^^^^^^^^^^^^^^^^
The method assertNotNull(String, Object) from the type Assert is deprecated
[WARNING] /jobs/genie.tm/tm.gerrit/workspace/rse/tests/org.eclipse.rse.tests/src/org/eclipse/rse/tests/internal/RSEConnectionManager.java:[216] 
	Assert.assertNotNull("FAILED(findOrCreateConnection): RSE system registry unavailable!", systemRegistry); //$NON-NLS-1$
	^^^^^^
The type Assert is deprecated
[WARNING] /jobs/genie.tm/tm.gerrit/workspace/rse/tests/org.eclipse.rse.tests/src/org/eclipse/rse/tests/internal/RSEConnectionManager.java:[216] 
	Assert.assertNotNull("FAILED(findOrCreateConnection): RSE system registry unavailable!", systemRegistry); //$NON-NLS-1$
	       ^^^^^^^^^^^^^^^^^^^^^^^^^^^^^^^^^^^^^^^^^^^^^^^^^^^^^^^^^^^^^^^^^^^^^^^^^^^^^^^^^^^^^^^^^^^^^^^^^
The method assertNotNull(String, Object) from the type Assert is deprecated
[WARNING] /jobs/genie.tm/tm.gerrit/workspace/rse/tests/org.eclipse.rse.tests/src/org/eclipse/rse/tests/internal/RSEConnectionManager.java:[237] 
	Assert.assertNotNull("FAILED(findOrCreateConnection): RSE system registry unavailable!", systemRegistry); //$NON-NLS-1$
	^^^^^^
The type Assert is deprecated
[WARNING] /jobs/genie.tm/tm.gerrit/workspace/rse/tests/org.eclipse.rse.tests/src/org/eclipse/rse/tests/internal/RSEConnectionManager.java:[237] 
	Assert.assertNotNull("FAILED(findOrCreateConnection): RSE system registry unavailable!", systemRegistry); //$NON-NLS-1$
	       ^^^^^^^^^^^^^^^^^^^^^^^^^^^^^^^^^^^^^^^^^^^^^^^^^^^^^^^^^^^^^^^^^^^^^^^^^^^^^^^^^^^^^^^^^^^^^^^^^
The method assertNotNull(String, Object) from the type Assert is deprecated
[WARNING] /jobs/genie.tm/tm.gerrit/workspace/rse/tests/org.eclipse.rse.tests/src/org/eclipse/rse/tests/internal/RSEConnectionManager.java:[253] 
	Assert.assertNull("FAILED(findOrCreateConnection): Failed to create system profile '" + profileName + "'! Possible cause: " + cause, exception); //$NON-NLS-1$ //$NON-NLS-2$
	^^^^^^
The type Assert is deprecated
[WARNING] /jobs/genie.tm/tm.gerrit/workspace/rse/tests/org.eclipse.rse.tests/src/org/eclipse/rse/tests/internal/RSEConnectionManager.java:[253] 
	Assert.assertNull("FAILED(findOrCreateConnection): Failed to create system profile '" + profileName + "'! Possible cause: " + cause, exception); //$NON-NLS-1$ //$NON-NLS-2$
	       ^^^^^^^^^^^^^^^^^^^^^^^^^^^^^^^^^^^^^^^^^^^^^^^^^^^^^^^^^^^^^^^^^^^^^^^^^^^^^^^^^^^^^^^^^^^^^^^^^^^^^^^^^^^^^^^^^^^^^^^^^^^^^^^^^^^^^^^^
The method assertNull(String, Object) from the type Assert is deprecated
[WARNING] /jobs/genie.tm/tm.gerrit/workspace/rse/tests/org.eclipse.rse.tests/src/org/eclipse/rse/tests/internal/RSEConnectionManager.java:[256] 
	Assert.assertNotNull("FAILED(findOrCreateConnection): Failed to find and/or create system profile '" + profileName + "'!", profile); //$NON-NLS-1$ //$NON-NLS-2$
	^^^^^^
The type Assert is deprecated
[WARNING] /jobs/genie.tm/tm.gerrit/workspace/rse/tests/org.eclipse.rse.tests/src/org/eclipse/rse/tests/internal/RSEConnectionManager.java:[256] 
	Assert.assertNotNull("FAILED(findOrCreateConnection): Failed to find and/or create system profile '" + profileName + "'!", profile); //$NON-NLS-1$ //$NON-NLS-2$
	       ^^^^^^^^^^^^^^^^^^^^^^^^^^^^^^^^^^^^^^^^^^^^^^^^^^^^^^^^^^^^^^^^^^^^^^^^^^^^^^^^^^^^^^^^^^^^^^^^^^^^^^^^^^^^^^^^^^^^^^^^^^^^
The method assertNotNull(String, Object) from the type Assert is deprecated
[WARNING] /jobs/genie.tm/tm.gerrit/workspace/rse/tests/org.eclipse.rse.tests/src/org/eclipse/rse/tests/internal/RSEConnectionManager.java:[259] 
	Assert.assertFalse("FAILED(findOrCreateConnection): Invalid host name!", "unknown".equals(name)); //$NON-NLS-1$ //$NON-NLS-2$
	^^^^^^
The type Assert is deprecated
[WARNING] /jobs/genie.tm/tm.gerrit/workspace/rse/tests/org.eclipse.rse.tests/src/org/eclipse/rse/tests/internal/RSEConnectionManager.java:[259] 
	Assert.assertFalse("FAILED(findOrCreateConnection): Invalid host name!", "unknown".equals(name)); //$NON-NLS-1$ //$NON-NLS-2$
	       ^^^^^^^^^^^^^^^^^^^^^^^^^^^^^^^^^^^^^^^^^^^^^^^^^^^^^^^^^^^^^^^^^^^^^^^^^^^^^^^^^^^^^^^^^
The method assertFalse(String, boolean) from the type Assert is deprecated
[WARNING] /jobs/genie.tm/tm.gerrit/workspace/rse/tests/org.eclipse.rse.tests/src/org/eclipse/rse/tests/internal/RSEConnectionManager.java:[263] 
	Assert.assertFalse("FAILED(findOrCreateConnection): Invalid user id name!", "unknown".equals(userId)); //$NON-NLS-1$ //$NON-NLS-2$
	^^^^^^
The type Assert is deprecated
[WARNING] /jobs/genie.tm/tm.gerrit/workspace/rse/tests/org.eclipse.rse.tests/src/org/eclipse/rse/tests/internal/RSEConnectionManager.java:[263] 
	Assert.assertFalse("FAILED(findOrCreateConnection): Invalid user id name!", "unknown".equals(userId)); //$NON-NLS-1$ //$NON-NLS-2$
	       ^^^^^^^^^^^^^^^^^^^^^^^^^^^^^^^^^^^^^^^^^^^^^^^^^^^^^^^^^^^^^^^^^^^^^^^^^^^^^^^^^^^^^^^^^^^^^^
The method assertFalse(String, boolean) from the type Assert is deprecated
[WARNING] /jobs/genie.tm/tm.gerrit/workspace/rse/tests/org.eclipse.rse.tests/src/org/eclipse/rse/tests/internal/RSEConnectionManager.java:[265] 
	Assert.assertFalse("FAILED(findOrCreateConnection): Invalid user password name!", "unknown".equals(password)); //$NON-NLS-1$ //$NON-NLS-2$
	^^^^^^
The type Assert is deprecated
[WARNING] /jobs/genie.tm/tm.gerrit/workspace/rse/tests/org.eclipse.rse.tests/src/org/eclipse/rse/tests/internal/RSEConnectionManager.java:[265] 
	Assert.assertFalse("FAILED(findOrCreateConnection): Invalid user password name!", "unknown".equals(password)); //$NON-NLS-1$ //$NON-NLS-2$
	       ^^^^^^^^^^^^^^^^^^^^^^^^^^^^^^^^^^^^^^^^^^^^^^^^^^^^^^^^^^^^^^^^^^^^^^^^^^^^^^^^^^^^^^^^^^^^^^^^^^^^^^
The method assertFalse(String, boolean) from the type Assert is deprecated
[WARNING] /jobs/genie.tm/tm.gerrit/workspace/rse/tests/org.eclipse.rse.tests/src/org/eclipse/rse/tests/internal/RSEConnectionManager.java:[267] 
	Assert.assertFalse("FAILED(findOrCreateConnection): Invalid remote system ip address or dns name!", "unknown".equals(address)); //$NON-NLS-1$ //$NON-NLS-2$
	^^^^^^
The type Assert is deprecated
[WARNING] /jobs/genie.tm/tm.gerrit/workspace/rse/tests/org.eclipse.rse.tests/src/org/eclipse/rse/tests/internal/RSEConnectionManager.java:[267] 
	Assert.assertFalse("FAILED(findOrCreateConnection): Invalid remote system ip address or dns name!", "unknown".equals(address)); //$NON-NLS-1$ //$NON-NLS-2$
	       ^^^^^^^^^^^^^^^^^^^^^^^^^^^^^^^^^^^^^^^^^^^^^^^^^^^^^^^^^^^^^^^^^^^^^^^^^^^^^^^^^^^^^^^^^^^^^^^^^^^^^^^^^^^^^^^^^^^^^^^
The method assertFalse(String, boolean) from the type Assert is deprecated
[WARNING] /jobs/genie.tm/tm.gerrit/workspace/rse/tests/org.eclipse.rse.tests/src/org/eclipse/rse/tests/internal/RSEConnectionManager.java:[269] 
	Assert.assertFalse("FAILED(findOrCreateConnection): Invalid system type!", "unknown".equals(systemTypeId)); //$NON-NLS-1$ //$NON-NLS-2$
	^^^^^^
The type Assert is deprecated
[WARNING] /jobs/genie.tm/tm.gerrit/workspace/rse/tests/org.eclipse.rse.tests/src/org/eclipse/rse/tests/internal/RSEConnectionManager.java:[269] 
	Assert.assertFalse("FAILED(findOrCreateConnection): Invalid system type!", "unknown".equals(systemTypeId)); //$NON-NLS-1$ //$NON-NLS-2$
	       ^^^^^^^^^^^^^^^^^^^^^^^^^^^^^^^^^^^^^^^^^^^^^^^^^^^^^^^^^^^^^^^^^^^^^^^^^^^^^^^^^^^^^^^^^^^^^^^^^^^
The method assertFalse(String, boolean) from the type Assert is deprecated
[WARNING] /jobs/genie.tm/tm.gerrit/workspace/rse/tests/org.eclipse.rse.tests/src/org/eclipse/rse/tests/internal/RSEConnectionManager.java:[272] 
	Assert.assertFalse("FAILED(findOrCreateConnection): Invalid port!", "unknown".equals(daemonPort)); //$NON-NLS-1$ //$NON-NLS-2$
	^^^^^^
The type Assert is deprecated
[WARNING] /jobs/genie.tm/tm.gerrit/workspace/rse/tests/org.eclipse.rse.tests/src/org/eclipse/rse/tests/internal/RSEConnectionManager.java:[272] 
	Assert.assertFalse("FAILED(findOrCreateConnection): Invalid port!", "unknown".equals(daemonPort)); //$NON-NLS-1$ //$NON-NLS-2$
	       ^^^^^^^^^^^^^^^^^^^^^^^^^^^^^^^^^^^^^^^^^^^^^^^^^^^^^^^^^^^^^^^^^^^^^^^^^^^^^^^^^^^^^^^^^^
The method assertFalse(String, boolean) from the type Assert is deprecated
[WARNING] /jobs/genie.tm/tm.gerrit/workspace/rse/tests/org.eclipse.rse.tests/src/org/eclipse/rse/tests/internal/RSEConnectionManager.java:[287] 
	Assert.assertNull("FAILED(findOrCreateConnection): Failed to create connection IHost object! Possible cause: " + cause, exception); //$NON-NLS-1$
	^^^^^^
The type Assert is deprecated
[WARNING] /jobs/genie.tm/tm.gerrit/workspace/rse/tests/org.eclipse.rse.tests/src/org/eclipse/rse/tests/internal/RSEConnectionManager.java:[287] 
	Assert.assertNull("FAILED(findOrCreateConnection): Failed to create connection IHost object! Possible cause: " + cause, exception); //$NON-NLS-1$
	       ^^^^^^^^^^^^^^^^^^^^^^^^^^^^^^^^^^^^^^^^^^^^^^^^^^^^^^^^^^^^^^^^^^^^^^^^^^^^^^^^^^^^^^^^^^^^^^^^^^^^^^^^^^^^^^^^^^^^^^^^^^^
The method assertNull(String, Object) from the type Assert is deprecated
[WARNING] /jobs/genie.tm/tm.gerrit/workspace/rse/tests/org.eclipse.rse.tests/src/org/eclipse/rse/tests/internal/RSEConnectionManager.java:[316] 
	Assert.assertNotNull("FAILED(findOrCreateConnection): Failed to find and/or create connection IHost object!", connection); //$NON-NLS-1$
	^^^^^^
The type Assert is deprecated
[WARNING] /jobs/genie.tm/tm.gerrit/workspace/rse/tests/org.eclipse.rse.tests/src/org/eclipse/rse/tests/internal/RSEConnectionManager.java:[316] 
	Assert.assertNotNull("FAILED(findOrCreateConnection): Failed to find and/or create connection IHost object!", connection); //$NON-NLS-1$
	       ^^^^^^^^^^^^^^^^^^^^^^^^^^^^^^^^^^^^^^^^^^^^^^^^^^^^^^^^^^^^^^^^^^^^^^^^^^^^^^^^^^^^^^^^^^^^^^^^^^^^^^^^^^^^^^^^^^
The method assertNotNull(String, Object) from the type Assert is deprecated
[WARNING] /jobs/genie.tm/tm.gerrit/workspace/rse/tests/org.eclipse.rse.tests/src/org/eclipse/rse/tests/subsystems/files/FileSubsystemConsistencyTestCase.java:[38] 
	private List _subSystems;
	        ^^^^
List is a raw type. References to generic type List<E> should be parameterized
[WARNING] /jobs/genie.tm/tm.gerrit/workspace/rse/tests/org.eclipse.rse.tests/src/org/eclipse/rse/tests/subsystems/files/FileSubsystemConsistencyTestCase.java:[39] 
	private List _connections;
	        ^^^^
List is a raw type. References to generic type List<E> should be parameterized
[WARNING] /jobs/genie.tm/tm.gerrit/workspace/rse/tests/org.eclipse.rse.tests/src/org/eclipse/rse/tests/subsystems/files/FileSubsystemConsistencyTestCase.java:[40] 
	private List _samplePaths;
	        ^^^^
List is a raw type. References to generic type List<E> should be parameterized
[WARNING] /jobs/genie.tm/tm.gerrit/workspace/rse/tests/org.eclipse.rse.tests/src/org/eclipse/rse/tests/subsystems/files/FileSubsystemConsistencyTestCase.java:[81] 
	_connections = new ArrayList();
	                   ^^^^^^^^^
ArrayList is a raw type. References to generic type ArrayList<E> should be parameterized
[WARNING] /jobs/genie.tm/tm.gerrit/workspace/rse/tests/org.eclipse.rse.tests/src/org/eclipse/rse/tests/subsystems/files/FileSubsystemConsistencyTestCase.java:[82] 
	_subSystems = new ArrayList();
	                  ^^^^^^^^^
ArrayList is a raw type. References to generic type ArrayList<E> should be parameterized
[WARNING] /jobs/genie.tm/tm.gerrit/workspace/rse/tests/org.eclipse.rse.tests/src/org/eclipse/rse/tests/subsystems/files/FileSubsystemConsistencyTestCase.java:[95] 
	_samplePaths = new ArrayList();
	                   ^^^^^^^^^
ArrayList is a raw type. References to generic type ArrayList<E> should be parameterized
[WARNING] /jobs/genie.tm/tm.gerrit/workspace/rse/tests/org.eclipse.rse.tests/src/org/eclipse/rse/tests/subsystems/files/FileSubsystemConsistencyTestCase.java:[96] 
	_samplePaths.add("/usr");
	^^^^^^^^^^^^^^^^^^^^^^^^
Type safety: The method add(Object) belongs to the raw type List. References to generic type List<E> should be parameterized
[WARNING] /jobs/genie.tm/tm.gerrit/workspace/rse/tests/org.eclipse.rse.tests/src/org/eclipse/rse/tests/subsystems/files/FileSubsystemConsistencyTestCase.java:[97] 
	_samplePaths.add("/usr/lib");
	^^^^^^^^^^^^^^^^^^^^^^^^^^^^
Type safety: The method add(Object) belongs to the raw type List. References to generic type List<E> should be parameterized
[WARNING] /jobs/genie.tm/tm.gerrit/workspace/rse/tests/org.eclipse.rse.tests/src/org/eclipse/rse/tests/subsystems/files/FileSubsystemConsistencyTestCase.java:[98] 
	_samplePaths.add("/usr/bin");
	^^^^^^^^^^^^^^^^^^^^^^^^^^^^
Type safety: The method add(Object) belongs to the raw type List. References to generic type List<E> should be parameterized
[WARNING] /jobs/genie.tm/tm.gerrit/workspace/rse/tests/org.eclipse.rse.tests/src/org/eclipse/rse/tests/subsystems/files/FileSubsystemConsistencyTestCase.java:[99] 
	_samplePaths.add("/bin");
	^^^^^^^^^^^^^^^^^^^^^^^^
Type safety: The method add(Object) belongs to the raw type List. References to generic type List<E> should be parameterized
[WARNING] /jobs/genie.tm/tm.gerrit/workspace/rse/tests/org.eclipse.rse.tests/src/org/eclipse/rse/tests/subsystems/files/FileSubsystemConsistencyTestCase.java:[100] 
	_samplePaths.add("/etc");
	^^^^^^^^^^^^^^^^^^^^^^^^
Type safety: The method add(Object) belongs to the raw type List. References to generic type List<E> should be parameterized
[WARNING] /jobs/genie.tm/tm.gerrit/workspace/rse/tests/org.eclipse.rse.tests/src/org/eclipse/rse/tests/subsystems/files/FileSubsystemConsistencyTestCase.java:[101] 
	_samplePaths.add("/home");
	^^^^^^^^^^^^^^^^^^^^^^^^^
Type safety: The method add(Object) belongs to the raw type List. References to generic type List<E> should be parameterized
[WARNING] /jobs/genie.tm/tm.gerrit/workspace/rse/tests/org.eclipse.rse.tests/src/org/eclipse/rse/tests/subsystems/files/FileSubsystemConsistencyTestCase.java:[102] 
	_samplePaths.add("/sbin");
	^^^^^^^^^^^^^^^^^^^^^^^^^
Type safety: The method add(Object) belongs to the raw type List. References to generic type List<E> should be parameterized
[WARNING] /jobs/genie.tm/tm.gerrit/workspace/rse/tests/org.eclipse.rse.tests/src/org/eclipse/rse/tests/subsystems/files/FileSubsystemConsistencyTestCase.java:[116] 
	_subSystems.add(fss);
	^^^^^^^^^^^^^^^^^^^^
Type safety: The method add(Object) belongs to the raw type List. References to generic type List<E> should be parameterized
[WARNING] /jobs/genie.tm/tm.gerrit/workspace/rse/tests/org.eclipse.rse.tests/src/org/eclipse/rse/tests/subsystems/files/FileSubsystemConsistencyTestCase.java:[117] 
	_connections.add(host);
	^^^^^^^^^^^^^^^^^^^^^^
Type safety: The method add(Object) belongs to the raw type List. References to generic type List<E> should be parameterized
[WARNING] /jobs/genie.tm/tm.gerrit/workspace/rse/tests/org.eclipse.rse.tests/src/org/eclipse/rse/tests/subsystems/files/FileSubsystemConsistencyTestCase.java:[172] 
	String[] testPaths = (String[])_samplePaths.toArray(new String[_samplePaths.size()]);
	                               ^^^^^^^^^^^^^^^^^^^^^^^^^^^^^^^^^^^^^^^^^^^^^^^^^^^^^
Type safety: The method toArray(Object[]) belongs to the raw type List. References to generic type List<E> should be parameterized
[WARNING] /jobs/genie.tm/tm.gerrit/workspace/rse/tests/org.eclipse.rse.tests/src/org/eclipse/rse/tests/subsystems/files/FileSubsystemConsistencyTestCase.java:[212] 
	List consolidatedResults = new ArrayList();
	^^^^
List is a raw type. References to generic type List<E> should be parameterized
[WARNING] /jobs/genie.tm/tm.gerrit/workspace/rse/tests/org.eclipse.rse.tests/src/org/eclipse/rse/tests/subsystems/files/FileSubsystemConsistencyTestCase.java:[212] 
	List consolidatedResults = new ArrayList();
	                               ^^^^^^^^^
ArrayList is a raw type. References to generic type ArrayList<E> should be parameterized
[WARNING] /jobs/genie.tm/tm.gerrit/workspace/rse/tests/org.eclipse.rse.tests/src/org/eclipse/rse/tests/subsystems/files/FileSubsystemConsistencyTestCase.java:[221] 
	consolidatedResults.add(children[c]);
	^^^^^^^^^^^^^^^^^^^^^^^^^^^^^^^^^^^^
Type safety: The method add(Object) belongs to the raw type List. References to generic type List<E> should be parameterized
[WARNING] /jobs/genie.tm/tm.gerrit/workspace/rse/tests/org.eclipse.rse.tests/src/org/eclipse/rse/tests/subsystems/files/FileSubsystemConsistencyTestCase.java:[229] 
	results = (IRemoteFile[])consolidatedResults.toArray(new IRemoteFile[consolidatedResults.size()]);
	                         ^^^^^^^^^^^^^^^^^^^^^^^^^^^^^^^^^^^^^^^^^^^^^^^^^^^^^^^^^^^^^^^^^^^^^^^^
Type safety: The method toArray(Object[]) belongs to the raw type List. References to generic type List<E> should be parameterized
[WARNING] /jobs/genie.tm/tm.gerrit/workspace/rse/tests/org.eclipse.rse.tests/src/org/eclipse/rse/tests/subsystems/files/FileSubsystemConsistencyTestCase.java:[264] 
	String[] testPaths = (String[])_samplePaths.toArray(new String[_samplePaths.size()]);
	                               ^^^^^^^^^^^^^^^^^^^^^^^^^^^^^^^^^^^^^^^^^^^^^^^^^^^^^
Type safety: The method toArray(Object[]) belongs to the raw type List. References to generic type List<E> should be parameterized
[WARNING] /jobs/genie.tm/tm.gerrit/workspace/rse/tests/org.eclipse.rse.tests/src/org/eclipse/rse/tests/subsystems/files/FileServiceTest.java:[161] 
	ssvc = (IShellService) svc.getAdapter(IShellService.class);
	       ^^^^^^^^^^^^^^^^^^^^^^^^^^^^^^^^^^^^^^^^^^^^^^^^^^^
Unnecessary cast from IShellService to IShellService
[WARNING] /jobs/genie.tm/tm.gerrit/workspace/rse/tests/org.eclipse.rse.tests/src/org/eclipse/rse/tests/subsystems/shells/TerminalShellServiceTest.java:[33] 
	* @param name
	         ^^^^
Javadoc: Description expected after this reference
[WARNING] /jobs/genie.tm/tm.gerrit/workspace/rse/tests/org.eclipse.rse.tests/src/org/eclipse/rse/tests/subsystems/shells/TerminalShellServiceTest.java:[34] 
	* @param propertiesFileName
	         ^^^^^^^^^^^^^^^^^^
Javadoc: Description expected after this reference
[WARNING] /jobs/genie.tm/tm.gerrit/workspace/rse/tests/org.eclipse.rse.tests/src/org/eclipse/rse/tests/subsystems/shells/TerminalShellServiceTest.java:[41] 
	* @param name
	         ^^^^
Javadoc: Description expected after this reference
[WARNING] /jobs/genie.tm/tm.gerrit/workspace/rse/tests/org.eclipse.rse.tests/src/org/eclipse/rse/tests/subsystems/shells/TerminalShellServiceTest.java:[96] 
	shellService = (IShellService) terminalService.getAdapter(IShellService.class);
	               ^^^^^^^^^^^^^^^^^^^^^^^^^^^^^^^^^^^^^^^^^^^^^^^^^^^^^^^^^^^^^^^
Unnecessary cast from IShellService to IShellService
[WARNING] /jobs/genie.tm/tm.gerrit/workspace/rse/tests/org.eclipse.rse.tests/src/org/eclipse/rse/tests/subsystems/testsubsystem/TestSubsystemTestCase.java:[25] 
	import org.eclipse.rse.internal.ui.view.SystemView;
	       ^^^^^^^^^^^^^^^^^^^^^^^^^^^^^^^^^^^^^^^^^^^
Discouraged access: The type 'SystemView' is not API (restriction on classpath entry '/jobs/genie.tm/tm.gerrit/workspace/rse/plugins/org.eclipse.rse.ui/target/classes')
[WARNING] /jobs/genie.tm/tm.gerrit/workspace/rse/tests/org.eclipse.rse.tests/src/org/eclipse/rse/tests/subsystems/testsubsystem/TestSubsystemTestCase.java:[26] 
	import org.eclipse.rse.internal.ui.view.SystemViewPart;
	       ^^^^^^^^^^^^^^^^^^^^^^^^^^^^^^^^^^^^^^^^^^^^^^^
Discouraged access: The type 'SystemViewPart' is not API (restriction on classpath entry '/jobs/genie.tm/tm.gerrit/workspace/rse/plugins/org.eclipse.rse.ui/target/classes')
[WARNING] /jobs/genie.tm/tm.gerrit/workspace/rse/tests/org.eclipse.rse.tests/src/org/eclipse/rse/tests/subsystems/testsubsystem/TestSubsystemTestCase.java:[38] 
	SystemView rseSystemView;
	^^^^^^^^^^
Discouraged access: The type 'SystemView' is not API (restriction on classpath entry '/jobs/genie.tm/tm.gerrit/workspace/rse/plugins/org.eclipse.rse.ui/target/classes')
[WARNING] /jobs/genie.tm/tm.gerrit/workspace/rse/tests/org.eclipse.rse.tests/src/org/eclipse/rse/tests/subsystems/testsubsystem/TestSubsystemTestCase.java:[52] 
	if (viewPart instanceof SystemViewPart) {
	                        ^^^^^^^^^^^^^^
Discouraged access: The type 'SystemViewPart' is not API (restriction on classpath entry '/jobs/genie.tm/tm.gerrit/workspace/rse/plugins/org.eclipse.rse.ui/target/classes')
[WARNING] /jobs/genie.tm/tm.gerrit/workspace/rse/tests/org.eclipse.rse.tests/src/org/eclipse/rse/tests/subsystems/testsubsystem/TestSubsystemTestCase.java:[53] 
	rseSystemView = ((SystemViewPart)viewPart).getSystemView();
	                ^^^^^^^^^^^^^^^^^^^^^^^^^^^^^^^^^^^^^^^^^^
Discouraged access: The method 'SystemViewPart.getSystemView()' is not API (restriction on classpath entry '/jobs/genie.tm/tm.gerrit/workspace/rse/plugins/org.eclipse.rse.ui/target/classes')
[WARNING] /jobs/genie.tm/tm.gerrit/workspace/rse/tests/org.eclipse.rse.tests/src/org/eclipse/rse/tests/subsystems/testsubsystem/TestSubsystemTestCase.java:[53] 
	rseSystemView = ((SystemViewPart)viewPart).getSystemView();
	                  ^^^^^^^^^^^^^^
Discouraged access: The type 'SystemViewPart' is not API (restriction on classpath entry '/jobs/genie.tm/tm.gerrit/workspace/rse/plugins/org.eclipse.rse.ui/target/classes')
[WARNING] /jobs/genie.tm/tm.gerrit/workspace/rse/tests/org.eclipse.rse.tests/src/org/eclipse/rse/tests/preferences/PreferencesTest.java:[82] 
	IRSESystemType systemTypeDeprecated = registry.getSystemType("Local"); //$NON-NLS-1$
	                                               ^^^^^^^^^^^^^^^^^^^^^^
The method getSystemType(String) from the type IRSECoreRegistry is deprecated
323 problems (323 warnings)
[INFO] 
[INFO] --- maven-resources-plugin:2.6:testResources (default-testResources) @ org.eclipse.rse.tests ---
[INFO] Using 'UTF-8' encoding to copy filtered resources.
[INFO] skip non existing resourceDirectory /jobs/genie.tm/tm.gerrit/workspace/rse/tests/org.eclipse.rse.tests/src/test/resources
[INFO] 
[INFO] --- target-platform-configuration:1.0.0:target-platform (default-target-platform) @ org.eclipse.rse.tests ---
[INFO] 
[INFO] --- tycho-packaging-plugin:1.0.0:package-plugin (default-package-plugin) @ org.eclipse.rse.tests ---
[INFO] Building jar: /jobs/genie.tm/tm.gerrit/workspace/rse/tests/org.eclipse.rse.tests/target/org.eclipse.rse.tests-3.4.100-SNAPSHOT.jar
[INFO] 
[INFO] --- tycho-p2-plugin:1.0.0:p2-metadata-default (default-p2-metadata-default) @ org.eclipse.rse.tests ---
[INFO] 
[INFO] --- tycho-p2-plugin:1.0.0:p2-metadata (p2-metadata) @ org.eclipse.rse.tests ---
[INFO] 
[INFO] --- tycho-surefire-plugin:1.0.0:test (default-test) @ org.eclipse.rse.tests ---
[INFO] Expected eclipse log file: /jobs/genie.tm/tm.gerrit/workspace/rse/tests/org.eclipse.rse.tests/target/work/data/.metadata/.log
[INFO] Command line:
	[/opt/public/common/java/oracle/jdk1.8.0_162_x64/jre/bin/java, -Dosgi.noShutdown=false, -Dosgi.os=linux, -Dosgi.ws=gtk, -Dosgi.arch=x86_64, -Drse.enableSecureStoreAccess=false, -Dosgi.clean=true, -jar, /jobs/genie.tm/tm.gerrit/workspace/.repository/p2/osgi/bundle/org.eclipse.equinox.launcher/1.5.0.v20180119-0753/org.eclipse.equinox.launcher-1.5.0.v20180119-0753.jar, -data, /jobs/genie.tm/tm.gerrit/workspace/rse/tests/org.eclipse.rse.tests/target/work/data, -install, /jobs/genie.tm/tm.gerrit/workspace/rse/tests/org.eclipse.rse.tests/target/work, -configuration, /jobs/genie.tm/tm.gerrit/workspace/rse/tests/org.eclipse.rse.tests/target/work/configuration, -application, org.eclipse.tycho.surefire.osgibooter.uitest, -testproperties, /jobs/genie.tm/tm.gerrit/workspace/rse/tests/org.eclipse.rse.tests/target/surefire.properties, -product, org.eclipse.sdk.ide]
Picked up JAVA_TOOL_OPTIONS: -Xmx2G -Djava.io.tmpdir=/tmp/genie.tm

-------------------------------------------------------
 T E S T S
-------------------------------------------------------
Running org.eclipse.rse.tests.RSECombinedTestSuite

=== testMoveOneDown started at: February 21, 2018 2:17:49 PM EST
--> disabled due to rule: HostMoveTest.*
=== testMoveOneDown finished at: February 21, 2018 2:17:49 PM EST (duration: 1 ms)

=== testMoveFirstUp started at: February 21, 2018 2:17:49 PM EST
--> disabled due to rule: HostMoveTest.*
=== testMoveFirstUp finished at: February 21, 2018 2:17:49 PM EST (duration: 0 ms)

=== testMoveLastDown started at: February 21, 2018 2:17:49 PM EST
--> disabled due to rule: HostMoveTest.*
=== testMoveLastDown finished at: February 21, 2018 2:17:49 PM EST (duration: 1 ms)

=== testMoveManyDown started at: February 21, 2018 2:17:49 PM EST
--> disabled due to rule: HostMoveTest.*
=== testMoveManyDown finished at: February 21, 2018 2:17:49 PM EST (duration: 0 ms)

=== testNoHost started at: February 21, 2018 2:17:49 PM EST
--> disabled due to rule: HostMoveTest.*
=== testNoHost finished at: February 21, 2018 2:17:49 PM EST (duration: 1 ms)

=== testMoveOneUp started at: February 21, 2018 2:17:49 PM EST
--> disabled due to rule: HostMoveTest.*
=== testMoveOneUp finished at: February 21, 2018 2:17:49 PM EST (duration: 0 ms)

=== testMoveManyUp started at: February 21, 2018 2:17:49 PM EST
--> disabled due to rule: HostMoveTest.*
=== testMoveManyUp finished at: February 21, 2018 2:17:49 PM EST (duration: 0 ms)

=== testCopy started at: February 21, 2018 2:17:49 PM EST
=== testCopy finished at: February 21, 2018 2:17:49 PM EST (duration: 4 ms)

=== testAliasing started at: February 21, 2018 2:17:49 PM EST
=== testAliasing finished at: February 21, 2018 2:17:49 PM EST (duration: 0 ms)

=== testDisabledSecureStore started at: February 21, 2018 2:17:49 PM EST
=== testDisabledSecureStore finished at: February 21, 2018 2:17:49 PM EST (duration: 0 ms)

=== testBadArgs started at: February 21, 2018 2:17:49 PM EST
=== testBadArgs finished at: February 21, 2018 2:17:49 PM EST (duration: 0 ms)

=== testMigration started at: February 21, 2018 2:17:49 PM EST
=== testMigration finished at: February 21, 2018 2:17:49 PM EST (duration: 0 ms)

=== testSaveDenial started at: February 21, 2018 2:17:49 PM EST
=== testSaveDenial finished at: February 21, 2018 2:17:49 PM EST (duration: 0 ms)

=== testAddRemove started at: February 21, 2018 2:17:49 PM EST
=== testAddRemove finished at: February 21, 2018 2:17:49 PM EST (duration: 0 ms)

=== testConnectionCreation started at: February 21, 2018 2:17:49 PM EST
=== testConnectionCreation finished at: February 21, 2018 2:17:49 PM EST (duration: 49 ms)

=== testConnect started at: February 21, 2018 2:17:49 PM EST
=== testConnect finished at: February 21, 2018 2:17:49 PM EST (duration: 4 ms)

=== testConnectionCaseInSensitive started at: February 21, 2018 2:17:49 PM EST
=== testConnectionCaseInSensitive finished at: February 21, 2018 2:17:49 PM EST (duration: 10 ms)

=== testResolveFilterString started at: February 21, 2018 2:17:49 PM EST
=== testResolveFilterString finished at: February 21, 2018 2:17:49 PM EST (duration: 10 ms)

=== testConnectionRemoval started at: February 21, 2018 2:17:49 PM EST
=== testConnectionRemoval finished at: February 21, 2018 2:17:49 PM EST (duration: 12 ms)

=== testSubSystemConfigurationProxy started at: February 21, 2018 2:17:49 PM EST
=== testSubSystemConfigurationProxy finished at: February 21, 2018 2:17:49 PM EST (duration: 1 ms)

=== testPluginResourceBundle started at: February 21, 2018 2:17:49 PM EST
=== testPluginResourceBundle finished at: February 21, 2018 2:17:49 PM EST (duration: 1 ms)

=== testCoreTestPropertiesHandling started at: February 21, 2018 2:17:49 PM EST
=== testCoreTestPropertiesHandling finished at: February 21, 2018 2:17:49 PM EST (duration: 0 ms)

=== testTestDataLocationManagement started at: February 21, 2018 2:17:49 PM EST
=== testTestDataLocationManagement finished at: February 21, 2018 2:17:49 PM EST (duration: 1 ms)

=== testConnectionManager started at: February 21, 2018 2:17:49 PM EST
=== testConnectionManager finished at: February 21, 2018 2:17:49 PM EST (duration: 1 ms)

=== testWaitAndDispatch started at: February 21, 2018 2:17:49 PM EST
=== testWaitAndDispatch finished at: February 21, 2018 2:17:55 PM EST (duration: 5553 ms)

=== testPersistenceManagerStartup started at: February 21, 2018 2:17:55 PM EST
=== testPersistenceManagerStartup finished at: February 21, 2018 2:17:55 PM EST (duration: 1 ms)

=== testProfilePersistence started at: February 21, 2018 2:17:55 PM EST
=== testProfilePersistence finished at: February 21, 2018 2:17:55 PM EST (duration: 4 ms)

=== testHostPersistence started at: February 21, 2018 2:17:55 PM EST
=== testHostPersistence finished at: February 21, 2018 2:17:55 PM EST (duration: 3 ms)

=== testHost1 started at: February 21, 2018 2:17:55 PM EST
=== testHost1 finished at: February 21, 2018 2:17:55 PM EST (duration: 19 ms)

=== testFilterPool1 started at: February 21, 2018 2:17:55 PM EST
=== testFilterPool1 finished at: February 21, 2018 2:17:55 PM EST (duration: 7 ms)

=== testPropertySet started at: February 21, 2018 2:17:55 PM EST
=== testPropertySet finished at: February 21, 2018 2:17:55 PM EST (duration: 1 ms)

=== testProfileMigration started at: February 21, 2018 2:17:55 PM EST
=== testProfileMigration finished at: February 21, 2018 2:17:55 PM EST (duration: 0 ms)

=== testShowLocalConnection started at: February 21, 2018 2:17:55 PM EST
=== testShowLocalConnection finished at: February 21, 2018 2:17:55 PM EST (duration: 0 ms)

=== testUserIds started at: February 21, 2018 2:17:55 PM EST
=== testUserIds finished at: February 21, 2018 2:17:55 PM EST (duration: 1 ms)

=== testActiveProfiles started at: February 21, 2018 2:17:55 PM EST
=== testActiveProfiles finished at: February 21, 2018 2:17:55 PM EST (duration: 2 ms)

=== testDefaultUserIds started at: February 21, 2018 2:17:55 PM EST
=== testDefaultUserIds finished at: February 21, 2018 2:17:55 PM EST (duration: 2 ms)

=== testCopyBatchVirtualFileLevelTwo started at: February 21, 2018 2:17:55 PM EST
verifying the contents for folder: /opt/public/hipp/homes/genie.tm/rsetest7412187267/folder1/Team
=== testCopyBatchVirtualFileLevelTwo finished at: February 21, 2018 2:17:58 PM EST (duration: 2660 ms)

=== testCopyToTarVirtualFileLevelFour started at: February 21, 2018 2:17:58 PM EST
verifying the contents for folder: /opt/public/hipp/homes/genie.tm/rsetest11707157266/source.tar#virtual#/org/eclipse/dstore/core/folderToCopy
=== testCopyToTarVirtualFileLevelFour finished at: February 21, 2018 2:18:00 PM EST (duration: 2658 ms)

=== testMoveToVirtualFileLevelOne started at: February 21, 2018 2:18:00 PM EST
verifying the contents for folder: /opt/public/hipp/homes/genie.tm/rsetest16002127242/closedBefore.zip#virtual#/RemoteSystemsConnections/folderToCopy
=== testMoveToVirtualFileLevelOne finished at: February 21, 2018 2:18:03 PM EST (duration: 2544 ms)

=== testMoveToVirtualFileLevelTwo started at: February 21, 2018 2:18:03 PM EST
verifying the contents for folder: /opt/public/hipp/homes/genie.tm/rsetest20297097102/closedBefore.zip#virtual#/RemoteSystemsConnections/Team/folderToCopy
=== testMoveToVirtualFileLevelTwo finished at: February 21, 2018 2:18:06 PM EST (duration: 2639 ms)

=== testMoveToTarVirtualFileLevelOne started at: February 21, 2018 2:18:06 PM EST
verifying the contents for folder: /opt/public/hipp/homes/genie.tm/rsetest24592067059/source.tar#virtual#/META-INF/folderToCopy
=== testMoveToTarVirtualFileLevelOne finished at: February 21, 2018 2:18:13 PM EST (duration: 7523 ms)

=== testCopyBatchToVirtualFileLevelOne started at: February 21, 2018 2:18:13 PM EST
verifying the contents for folder: /opt/public/hipp/homes/genie.tm/rsetest28887041895/closedBefore.zip#virtual#/RemoteSystemsConnections/folderToCopy
=== testCopyBatchToVirtualFileLevelOne finished at: February 21, 2018 2:18:15 PM EST (duration: 1450 ms)

=== testCopyBatchToVirtualFileLevelTwo started at: February 21, 2018 2:18:15 PM EST
verifying the contents for folder: /opt/public/hipp/homes/genie.tm/rsetest33182010664/closedBefore.zip#virtual#/RemoteSystemsConnections/TypeFilters/aaaaaaaa
verifying the contents for folder: /opt/public/hipp/homes/genie.tm/rsetest33182010664/closedBefore.zip#virtual#/RemoteSystemsConnections/TypeFilters/aaaab
=== testCopyBatchToVirtualFileLevelTwo finished at: February 21, 2018 2:18:16 PM EST (duration: 1352 ms)

=== testCopyBatchVirtualFile started at: February 21, 2018 2:18:16 PM EST
verifying the contents for folder: /opt/public/hipp/homes/genie.tm/rsetest37476979335/folder1/Team
verifying the contents for folder: /opt/public/hipp/homes/genie.tm/rsetest37476979335/folder1/xuanchentp
=== testCopyBatchVirtualFile finished at: February 21, 2018 2:18:17 PM EST (duration: 1461 ms)

=== testCopyBatchTarVirtualFileLevelFive started at: February 21, 2018 2:18:17 PM EST
verifying the contents for folder: /opt/public/hipp/homes/genie.tm/rsetest41771948127/folder1/client
verifying the contents for folder: /opt/public/hipp/homes/genie.tm/rsetest41771948127/folder1/miners
=== testCopyBatchTarVirtualFileLevelFive finished at: February 21, 2018 2:18:23 PM EST (duration: 5941 ms)

=== testCopyToArchiveFile started at: February 21, 2018 2:18:23 PM EST
verifying the contents for folder: /opt/public/hipp/homes/genie.tm/rsetest46066921378/closedBefore.zip#virtual#/folderToCopy
=== testCopyToArchiveFile finished at: February 21, 2018 2:18:25 PM EST (duration: 1359 ms)

=== testCopyVirtualFile started at: February 21, 2018 2:18:25 PM EST
verifying the contents for folder: /opt/public/hipp/homes/genie.tm/rsetest50361890056/folder1/RemoteSystemsConnections
=== testCopyVirtualFile finished at: February 21, 2018 2:18:26 PM EST (duration: 995 ms)

=== testCopyVirtualBatchToArchiveFile started at: February 21, 2018 2:18:26 PM EST
verifying the contents for folder: /opt/public/hipp/homes/genie.tm/rsetest54656858384/closedBefore.zip#virtual#/6YLT5Xa
=== testCopyVirtualBatchToArchiveFile finished at: February 21, 2018 2:18:27 PM EST (duration: 958 ms)

=== testCreateZipFile started at: February 21, 2018 2:18:27 PM EST
verifying the contents for folder: /opt/public/hipp/homes/genie.tm/rsetest58951826658/dummy.zip
verifying the contents for folder: /opt/public/hipp/homes/genie.tm/rsetest58951826658/dummy.zip#virtual#/folder1
=== testCreateZipFile finished at: February 21, 2018 2:18:27 PM EST (duration: 25 ms)

=== testMoveToVirtualFileLevelFour started at: February 21, 2018 2:18:27 PM EST
verifying the contents for folder: /opt/public/hipp/homes/genie.tm/rsetest63246793985/source.tar#virtual#/org/eclipse/dstore/core/folderToCopy
=== testMoveToVirtualFileLevelFour finished at: February 21, 2018 2:18:28 PM EST (duration: 1233 ms)

=== testCopyVirtualBatchToVirtualFileLevelOne started at: February 21, 2018 2:18:28 PM EST
verifying the contents for folder: /opt/public/hipp/homes/genie.tm/rsetest67541762529/closedBefore.zip#virtual#/RemoteSystemsConnections/20070315a
verifying the contents for folder: /opt/public/hipp/homes/genie.tm/rsetest67541762529/closedBefore.zip#virtual#/RemoteSystemsConnections/20070319
verifying the contents for folder: /opt/public/hipp/homes/genie.tm/rsetest67541762529/closedBefore.zip#virtual#/RemoteSystemsConnections/dummyFolder
=== testCopyVirtualBatchToVirtualFileLevelOne finished at: February 21, 2018 2:18:29 PM EST (duration: 1027 ms)

=== testCopyVirtualBatchToVirtualFileLevelTwo started at: February 21, 2018 2:18:29 PM EST
verifying the contents for folder: /opt/public/hipp/homes/genie.tm/rsetest71836730876/mynewzip.zip#virtual#/6YLT5Xa/dummyFolder
=== testCopyVirtualBatchToVirtualFileLevelTwo finished at: February 21, 2018 2:18:30 PM EST (duration: 953 ms)

=== testMoveTarVirtualFileLevelFour started at: February 21, 2018 2:18:30 PM EST
verifying the contents for folder: /opt/public/hipp/homes/genie.tm/rsetest76131699145/folder1/core
=== testMoveTarVirtualFileLevelFour finished at: February 21, 2018 2:18:32 PM EST (duration: 1426 ms)

=== testCopyToVirtualFileLevelOne started at: February 21, 2018 2:18:32 PM EST
verifying the contents for folder: /opt/public/hipp/homes/genie.tm/rsetest80426667887/closedBefore.zip#virtual#/RemoteSystemsConnections/folderToCopy
=== testCopyToVirtualFileLevelOne finished at: February 21, 2018 2:18:35 PM EST (duration: 3014 ms)

=== testCopyToVirtualFileLevelTwo started at: February 21, 2018 2:18:35 PM EST
verifying the contents for folder: /opt/public/hipp/homes/genie.tm/rsetest84721638218/closedBefore.zip#virtual#/RemoteSystemsConnections/TypeFilters/folderToCopy
=== testCopyToVirtualFileLevelTwo finished at: February 21, 2018 2:18:37 PM EST (duration: 2223 ms)

=== testCopyBatchToArchiveFile started at: February 21, 2018 2:18:37 PM EST
verifying the contents for folder: /opt/public/hipp/homes/genie.tm/rsetest89016607762/closedBefore.zip#virtual#/aaaaaaaa
verifying the contents for folder: /opt/public/hipp/homes/genie.tm/rsetest89016607762/closedBefore.zip#virtual#/aaaab
=== testCopyBatchToArchiveFile finished at: February 21, 2018 2:18:39 PM EST (duration: 2496 ms)

=== testMoveVirtualFile started at: February 21, 2018 2:18:39 PM EST
verifying the contents for folder: /opt/public/hipp/homes/genie.tm/rsetest93311577576/folder1/RemoteSystemsConnections
=== testMoveVirtualFile finished at: February 21, 2018 2:18:40 PM EST (duration: 1107 ms)

=== testRenameVirtualFile started at: February 21, 2018 2:18:40 PM EST
verifying the contents for folder: /opt/public/hipp/homes/genie.tm/rsetest97606546013/dummy.zip
verifying the contents for folder: /opt/public/hipp/homes/genie.tm/rsetest97606546013/dummy.zip#virtual#/folder1
verifying the contents for folder: /opt/public/hipp/homes/genie.tm/rsetest97606546013/dummy.zip
verifying the contents for folder: /opt/public/hipp/homes/genie.tm/rsetest97606546013/dummy.zip#virtual#/folder2
=== testRenameVirtualFile finished at: February 21, 2018 2:18:41 PM EST (duration: 47 ms)

=== testCopyVirtualFileLevelTwo started at: February 21, 2018 2:18:41 PM EST
verifying the contents for folder: /opt/public/hipp/homes/genie.tm/rsetest101901513361/folder1/Team
=== testCopyVirtualFileLevelTwo finished at: February 21, 2018 2:18:42 PM EST (duration: 1047 ms)

=== testMoveToArchiveFile started at: February 21, 2018 2:18:42 PM EST
verifying the contents for folder: /opt/public/hipp/homes/genie.tm/rsetest106196481738/closedBefore.zip#virtual#/folderToCopy
=== testMoveToArchiveFile finished at: February 21, 2018 2:18:43 PM EST (duration: 1320 ms)

=== testCopyTarVirtualFileLevelFour started at: February 21, 2018 2:18:43 PM EST
verifying the contents for folder: /opt/public/hipp/homes/genie.tm/rsetest110491450375/folder1/core
=== testCopyTarVirtualFileLevelFour finished at: February 21, 2018 2:18:44 PM EST (duration: 933 ms)

=== testCopyToTarVirtualFileLevelOne started at: February 21, 2018 2:18:44 PM EST
verifying the contents for folder: /opt/public/hipp/homes/genie.tm/rsetest114786418624/source.tar#virtual#/org/folderToCopy
=== testCopyToTarVirtualFileLevelOne finished at: February 21, 2018 2:18:45 PM EST (duration: 1107 ms)

=== testCopyBatchToTarVirtualFileLevelFour started at: February 21, 2018 2:18:45 PM EST
verifying the contents for folder: /opt/public/hipp/homes/genie.tm/rsetest119081387044/source.tar#virtual#/org/eclipse/dstore/core/aaaaaaaa
verifying the contents for folder: /opt/public/hipp/homes/genie.tm/rsetest119081387044/source.tar#virtual#/org/eclipse/dstore/core/aaaab
=== testCopyBatchToTarVirtualFileLevelFour finished at: February 21, 2018 2:18:46 PM EST (duration: 1317 ms)

=== testMoveVirtualFileLevelTwo started at: February 21, 2018 2:18:46 PM EST
verifying the contents for folder: /opt/public/hipp/homes/genie.tm/rsetest123376355673/folder1/Team
=== testMoveVirtualFileLevelTwo finished at: February 21, 2018 2:18:48 PM EST (duration: 1202 ms)

=== testRenameTarVirtualFile started at: February 21, 2018 2:18:48 PM EST
verifying the contents for folder: /opt/public/hipp/homes/genie.tm/rsetest127671324203/dummy.tar
verifying the contents for folder: /opt/public/hipp/homes/genie.tm/rsetest127671324203/dummy.tar#virtual#/folder1
verifying the contents for folder: /opt/public/hipp/homes/genie.tm/rsetest127671324203/dummy.tar
verifying the contents for folder: /opt/public/hipp/homes/genie.tm/rsetest127671324203/dummy.tar#virtual#/folder2
=== testRenameTarVirtualFile finished at: February 21, 2018 2:18:48 PM EST (duration: 83 ms)

=== testCreateTarFile started at: February 21, 2018 2:18:48 PM EST
verifying the contents for folder: /opt/public/hipp/homes/genie.tm/rsetest131966291588/dummy.tar
verifying the contents for folder: /opt/public/hipp/homes/genie.tm/rsetest131966291588/dummy.tar#virtual#/folder1
=== testCreateTarFile finished at: February 21, 2018 2:18:48 PM EST (duration: 37 ms)

=== testCopyBatchToTarArchiveFile started at: February 21, 2018 2:18:48 PM EST
verifying the contents for folder: /opt/public/hipp/homes/genie.tm/rsetest136261258925/source.tar#virtual#/aaaaaaaa
verifying the contents for folder: /opt/public/hipp/homes/genie.tm/rsetest136261258925/source.tar#virtual#/aaaab
=== testCopyBatchToTarArchiveFile finished at: February 21, 2018 2:18:50 PM EST (duration: 2610 ms)

=== testDeleteTarVirtualFile started at: February 21, 2018 2:18:50 PM EST
verifying the contents for folder: /opt/public/hipp/homes/genie.tm/rsetest140556228849/source.tar#virtual#/org/eclipse/dstore/core
=== testDeleteTarVirtualFile finished at: February 21, 2018 2:18:51 PM EST (duration: 999 ms)

=== testMoveTarVirtualFile started at: February 21, 2018 2:18:52 PM EST
verifying the contents for folder: /opt/public/hipp/homes/genie.tm/rsetest144851197363/folder1/META-INF
=== testMoveTarVirtualFile finished at: February 21, 2018 2:18:52 PM EST (duration: 883 ms)

=== testCopyTarVirtualFile started at: February 21, 2018 2:18:52 PM EST
verifying the contents for folder: /opt/public/hipp/homes/genie.tm/rsetest149146165558/folder1/META-INF
=== testCopyTarVirtualFile finished at: February 21, 2018 2:18:53 PM EST (duration: 329 ms)

=== testCopyToTarArchiveFile started at: February 21, 2018 2:18:53 PM EST
verifying the contents for folder: /opt/public/hipp/homes/genie.tm/rsetest153441133199/source.tar#virtual#/folderToCopy
=== testCopyToTarArchiveFile finished at: February 21, 2018 2:18:54 PM EST (duration: 1172 ms)

=== testMoveToTarArchiveFile started at: February 21, 2018 2:18:54 PM EST
verifying the contents for folder: /opt/public/hipp/homes/genie.tm/rsetest157736101685/source.tar#virtual#/folderToCopy
=== testMoveToTarArchiveFile finished at: February 21, 2018 2:18:55 PM EST (duration: 1169 ms)

=== testListEmptyFolder started at: February 21, 2018 2:18:55 PM EST
=== testListEmptyFolder finished at: February 21, 2018 2:18:55 PM EST (duration: 2 ms)

=== testListNonExistentFolder started at: February 21, 2018 2:18:55 PM EST
=== testListNonExistentFolder finished at: February 21, 2018 2:18:55 PM EST (duration: 4 ms)

=== testCreateCaseSensitive started at: February 21, 2018 2:18:55 PM EST
=== testCreateCaseSensitive finished at: February 21, 2018 2:18:55 PM EST (duration: 2 ms)

=== testCreateFile started at: February 21, 2018 2:18:55 PM EST
=== testCreateFile finished at: February 21, 2018 2:18:55 PM EST (duration: 2 ms)

=== testCaseSensitive started at: February 21, 2018 2:18:55 PM EST
=== testCaseSensitive finished at: February 21, 2018 2:18:55 PM EST (duration: 1 ms)

=== testGetRootProperties started at: February 21, 2018 2:18:55 PM EST
/
=== testGetRootProperties finished at: February 21, 2018 2:18:55 PM EST (duration: 1 ms)

=== testListNotAFolder started at: February 21, 2018 2:18:55 PM EST
=== testListNotAFolder finished at: February 21, 2018 2:18:55 PM EST (duration: 2 ms)

=== testFTPReadAccessToRemoteHost started at: February 21, 2018 2:18:55 PM EST
=== testFTPReadAccessToRemoteHost finished at: February 21, 2018 2:18:55 PM EST (duration: 0 ms)

=== testScpAccessToRemoteHost started at: February 21, 2018 2:18:55 PM EST
--> disabled due to rule: ScpFileSubsystemTestCase.testScpAccessToRemoteHost
=== testScpAccessToRemoteHost finished at: February 21, 2018 2:18:55 PM EST (duration: 0 ms)

=== testRenameTarVirtualFile started at: February 21, 2018 2:18:55 PM EST
verifying the contents for folder: /opt/public/hipp/homes/genie.tm/rsetest162031070225/dummy.tGz
verifying the contents for folder: /opt/public/hipp/homes/genie.tm/rsetest162031070225/dummy.tGz#virtual#/folder1
verifying the contents for folder: /opt/public/hipp/homes/genie.tm/rsetest162031070225/dummy.tGz
verifying the contents for folder: /opt/public/hipp/homes/genie.tm/rsetest162031070225/dummy.tGz#virtual#/folder2
=== testRenameTarVirtualFile finished at: February 21, 2018 2:18:55 PM EST (duration: 88 ms)

=== testCreateTarFile started at: February 21, 2018 2:18:55 PM EST
verifying the contents for folder: /opt/public/hipp/homes/genie.tm/rsetest166326037618/dummy.tGz
verifying the contents for folder: /opt/public/hipp/homes/genie.tm/rsetest166326037618/dummy.tGz#virtual#/folder1
=== testCreateTarFile finished at: February 21, 2018 2:18:55 PM EST (duration: 41 ms)

=== testCopyBatchToTarArchiveFile started at: February 21, 2018 2:18:55 PM EST
verifying the contents for folder: /opt/public/hipp/homes/genie.tm/rsetest170621004964/source.tar.gz#virtual#/aaaaaaaa
verifying the contents for folder: /opt/public/hipp/homes/genie.tm/rsetest170621004964/source.tar.gz#virtual#/aaaab
=== testCopyBatchToTarArchiveFile finished at: February 21, 2018 2:18:57 PM EST (duration: 1485 ms)

=== testDeleteTarVirtualFile started at: February 21, 2018 2:18:57 PM EST
verifying the contents for folder: /opt/public/hipp/homes/genie.tm/rsetest174915973764/source.tar.gz#virtual#/org/eclipse/dstore/core
=== testDeleteTarVirtualFile finished at: February 21, 2018 2:18:58 PM EST (duration: 974 ms)

=== testMoveTarVirtualFile started at: February 21, 2018 2:18:58 PM EST
verifying the contents for folder: /opt/public/hipp/homes/genie.tm/rsetest179210942053/folder1/META-INF
=== testMoveTarVirtualFile finished at: February 21, 2018 2:18:59 PM EST (duration: 831 ms)

=== testCopyTarVirtualFile started at: February 21, 2018 2:18:59 PM EST
verifying the contents for folder: /opt/public/hipp/homes/genie.tm/rsetest183505910194/folder1/META-INF
=== testCopyTarVirtualFile finished at: February 21, 2018 2:18:59 PM EST (duration: 747 ms)

=== testCopyToTarArchiveFile started at: February 21, 2018 2:19:00 PM EST
verifying the contents for folder: /opt/public/hipp/homes/genie.tm/rsetest187800878251/source.tar.gz#virtual#/folderToCopy
=== testCopyToTarArchiveFile finished at: February 21, 2018 2:19:01 PM EST (duration: 1127 ms)

=== testMoveToTarArchiveFile started at: February 21, 2018 2:19:01 PM EST
verifying the contents for folder: /opt/public/hipp/homes/genie.tm/rsetest192095846690/source.tar.gz#virtual#/folderToCopy
=== testMoveToTarArchiveFile finished at: February 21, 2018 2:19:02 PM EST (duration: 1169 ms)
--> disabled due to rule: RSEFileStoreTest.testBrokenSymlink
--> disabled due to rule: RSEFileStoreTest.testBrokenSymlink
--> disabled due to rule: RSEFileStoreTest.testBrokenSymlink

=== testBrokenSymlink started at: February 21, 2018 2:19:02 PM EST
--> disabled due to rule: RSEFileStoreTest.testBrokenSymlink
=== testBrokenSymlink finished at: February 21, 2018 2:19:02 PM EST (duration: 1 ms)
--> disabled due to rule: RSEFileStoreTest.testDeleteSpecialCases
--> disabled due to rule: RSEFileStoreTest.testDeleteSpecialCases
--> disabled due to rule: RSEFileStoreTest.testDeleteSpecialCases

=== testDeleteSpecialCases started at: February 21, 2018 2:19:02 PM EST
--> disabled due to rule: RSEFileStoreTest.testDeleteSpecialCases
=== testDeleteSpecialCases finished at: February 21, 2018 2:19:02 PM EST (duration: 0 ms)
--> disabled due to rule: RSEFileStoreTest.testModifyNonExisting
--> disabled due to rule: RSEFileStoreTest.testModifyNonExisting
--> disabled due to rule: RSEFileStoreTest.testModifyNonExisting

=== testModifyNonExisting started at: February 21, 2018 2:19:02 PM EST
--> disabled due to rule: RSEFileStoreTest.testModifyNonExisting
=== testModifyNonExisting finished at: February 21, 2018 2:19:02 PM EST (duration: 1 ms)

=== testModifyReadOnly started at: February 21, 2018 2:19:02 PM EST
Good! appendReadOnly: Could not write file: /opt/public/hipp/homes/genie.tm/rseTest1519240742362/readOnly.txt.
=== testModifyReadOnly finished at: February 21, 2018 2:19:02 PM EST (duration: 5 ms)

=== testMakeDeleteTree started at: February 21, 2018 2:19:02 PM EST
Good! treeNegStore.mkdir: Cannot create file because existing file of wrong type exists: /opt/public/hipp/homes/genie.tm/rseTest1519240742373/treeNegTest.
Good! mkdirsShallow: File not found: /opt/public/hipp/homes/genie.tm/rseTest1519240742373/treeTest/foo/bar.
=== testMakeDeleteTree finished at: February 21, 2018 2:19:02 PM EST (duration: 2 ms)

=== test255files started at: February 21, 2018 2:19:02 PM EST
=== test255files finished at: February 21, 2018 2:19:02 PM EST (duration: 186 ms)

=== testRecursiveGetParent started at: February 21, 2018 2:19:02 PM EST
=== testRecursiveGetParent finished at: February 21, 2018 2:19:02 PM EST (duration: 0 ms)

=== testAppendOutputStream started at: February 21, 2018 2:19:02 PM EST
=== testAppendOutputStream finished at: February 21, 2018 2:19:02 PM EST (duration: 2 ms)

=== testPutInfo started at: February 21, 2018 2:19:02 PM EST
=== testPutInfo finished at: February 21, 2018 2:19:02 PM EST (duration: 1 ms)
--> disabled due to rule: RSEFileStoreTest.testBrokenSymlink
--> disabled due to rule: RSEFileStoreTest.testBrokenSymlink
--> disabled due to rule: RSEFileStoreTest.testBrokenSymlink

=== testBrokenSymlink started at: February 21, 2018 2:19:02 PM EST
--> disabled due to rule: RSEFileStoreTest.testBrokenSymlink
=== testBrokenSymlink finished at: February 21, 2018 2:19:02 PM EST (duration: 0 ms)
--> disabled due to rule: RSEFileStoreTest.testDeleteSpecialCases
--> disabled due to rule: RSEFileStoreTest.testDeleteSpecialCases
--> disabled due to rule: RSEFileStoreTest.testDeleteSpecialCases

=== testDeleteSpecialCases started at: February 21, 2018 2:19:02 PM EST
--> disabled due to rule: RSEFileStoreTest.testDeleteSpecialCases
=== testDeleteSpecialCases finished at: February 21, 2018 2:19:02 PM EST (duration: 1 ms)
--> disabled due to rule: RSEFileStoreTest.testModifyNonExisting
--> disabled due to rule: RSEFileStoreTest.testModifyNonExisting
--> disabled due to rule: RSEFileStoreTest.testModifyNonExisting

=== testModifyNonExisting started at: February 21, 2018 2:19:02 PM EST
--> disabled due to rule: RSEFileStoreTest.testModifyNonExisting
=== testModifyNonExisting finished at: February 21, 2018 2:19:02 PM EST (duration: 0 ms)

=== testModifyReadOnly started at: February 21, 2018 2:19:02 PM EST
Good! appendReadOnly: Operation failed. File system input or output error: rse://LOCALHOST/opt/public/hipp/homes/genie.tm/rseTest1519240742639/readOnly.txt
=== testModifyReadOnly finished at: February 21, 2018 2:19:02 PM EST (duration: 88 ms)

=== testMakeDeleteTree started at: February 21, 2018 2:19:02 PM EST
Good! treeNegStore.mkdir: A file of that name already exists
Good! mkdirsShallow: The file store does not exist
Good! openInputStream on folder: Can't open a stream on a folder
Good! openOutputStream on folder: Can't open a stream on a folder
Good! Exception while deleting tree with open File: Failed to delete: /opt/public/hipp/homes/genie.tm/rseTest1519240742735/treeTest: rse://LOCALHOST/opt/public/hipp/homes/genie.tm/rseTest1519240742735/treeTest
=== testMakeDeleteTree finished at: February 21, 2018 2:19:02 PM EST (duration: 19 ms)

=== test255files started at: February 21, 2018 2:19:02 PM EST
=== test255files finished at: February 21, 2018 2:19:04 PM EST (duration: 1582 ms)

=== testRecursiveGetParent started at: February 21, 2018 2:19:04 PM EST
=== testRecursiveGetParent finished at: February 21, 2018 2:19:04 PM EST (duration: 1 ms)

=== testAppendOutputStream started at: February 21, 2018 2:19:04 PM EST
=== testAppendOutputStream finished at: February 21, 2018 2:19:04 PM EST (duration: 3 ms)

=== testPutInfo started at: February 21, 2018 2:19:04 PM EST
=== testPutInfo finished at: February 21, 2018 2:19:04 PM EST (duration: 26 ms)

connection name = test_local
system type id = org.eclipse.rse.systemtype.local
all subsystems found = 2
subsystem id = local.files
subsystem id = org.eclipse.rse.tests.subsystems.TestSubSystem
shell service subsystems found = 0
Shell service subsystem was not found for host test_local.
=== testRunCommand started at: February 21, 2018 2:19:04 PM EST
=== testRunCommand finished at: February 21, 2018 2:19:04 PM EST (duration: 0 ms)

connection name = test_local
system type id = org.eclipse.rse.systemtype.local
all subsystems found = 2
subsystem id = local.files
subsystem id = org.eclipse.rse.tests.subsystems.TestSubSystem
shell service subsystems found = 0
Shell service subsystem was not found for host test_local.
=== testRunCommandViaHostShellProcessAdapter started at: February 21, 2018 2:19:04 PM EST
=== testRunCommandViaHostShellProcessAdapter finished at: February 21, 2018 2:19:04 PM EST (duration: 0 ms)

connection name = test_local
system type id = org.eclipse.rse.systemtype.local
all subsystems found = 2
subsystem id = local.files
subsystem id = org.eclipse.rse.tests.subsystems.TestSubSystem
shell service subsystems found = 0
Shell service subsystem was not found for host test_local.
=== testLaunchShell started at: February 21, 2018 2:19:04 PM EST
=== testLaunchShell finished at: February 21, 2018 2:19:04 PM EST (duration: 0 ms)

Shell subsystem not found for host test_local
=== testRunCommand started at: February 21, 2018 2:19:04 PM EST
=== testRunCommand finished at: February 21, 2018 2:19:04 PM EST (duration: 0 ms)

Shell subsystem not found for host test_local
=== testRunShell started at: February 21, 2018 2:19:04 PM EST
=== testRunShell finished at: February 21, 2018 2:19:04 PM EST (duration: 0 ms)

Shell subsystem not found for host test_local
=== testCancelShell started at: February 21, 2018 2:19:04 PM EST
=== testCancelShell finished at: February 21, 2018 2:19:04 PM EST (duration: 0 ms)

=== testAddAndDeleteDeepNodes started at: February 21, 2018 2:19:04 PM EST
=== testAddAndDeleteDeepNodes finished at: February 21, 2018 2:19:06 PM EST (duration: 2062 ms)

=== testAddAndDeleteFlatNodes started at: February 21, 2018 2:19:06 PM EST
=== testAddAndDeleteFlatNodes finished at: February 21, 2018 2:19:08 PM EST (duration: 2041 ms)

=== testBugzilla170728 started at: February 21, 2018 2:19:08 PM EST
=== testBugzilla170728 finished at: February 21, 2018 2:19:22 PM EST (duration: 14166 ms)

=== testConnectDisconnect started at: February 21, 2018 2:19:22 PM EST
=== testConnectDisconnect finished at: February 21, 2018 2:19:24 PM EST (duration: 2119 ms)

=== testExport started at: February 21, 2018 2:19:24 PM EST
=== testExport finished at: February 21, 2018 2:19:24 PM EST (duration: 65 ms)

=== testDefaultGeneration started at: February 21, 2018 2:19:24 PM EST
=== testDefaultGeneration finished at: February 21, 2018 2:19:24 PM EST (duration: 24 ms)

=== testAppendPolicies started at: February 21, 2018 2:19:24 PM EST
=== testAppendPolicies finished at: February 21, 2018 2:19:24 PM EST (duration: 1 ms)

=== testShowLists started at: February 21, 2018 2:19:24 PM EST
=== testShowLists finished at: February 21, 2018 2:19:24 PM EST (duration: 0 ms)
Tests run: 121, Failures: 1, Errors: 0, Skipped: 0, Time elapsed: 97.878 sec <<< FAILURE! - in org.eclipse.rse.tests.RSECombinedTestSuite
testMoveOneDown(org.eclipse.rse.tests.core.HostMoveTest)  Time elapsed: 2.069 sec
testMoveFirstUp(org.eclipse.rse.tests.core.HostMoveTest)  Time elapsed: 0.06 sec
testMoveLastDown(org.eclipse.rse.tests.core.HostMoveTest)  Time elapsed: 0.059 sec
testMoveManyDown(org.eclipse.rse.tests.core.HostMoveTest)  Time elapsed: 0.13 sec
testNoHost(org.eclipse.rse.tests.core.HostMoveTest)  Time elapsed: 0.037 sec
testMoveOneUp(org.eclipse.rse.tests.core.HostMoveTest)  Time elapsed: 0.098 sec
testMoveManyUp(org.eclipse.rse.tests.core.HostMoveTest)  Time elapsed: 0.039 sec
testCopy(org.eclipse.rse.tests.core.HostCopyTest)  Time elapsed: 0.021 sec
testAliasing(org.eclipse.rse.tests.core.passwords.PasswordsTest)  Time elapsed: 0.002 sec
testDisabledSecureStore(org.eclipse.rse.tests.core.passwords.PasswordsTest)  Time elapsed: 0.001 sec
testBadArgs(org.eclipse.rse.tests.core.passwords.PasswordsTest)  Time elapsed: 0.001 sec
testMigration(org.eclipse.rse.tests.core.passwords.PasswordsTest)  Time elapsed: 0.001 sec
testSaveDenial(org.eclipse.rse.tests.core.passwords.PasswordsTest)  Time elapsed: 0.002 sec
testAddRemove(org.eclipse.rse.tests.core.passwords.PasswordsTest)  Time elapsed: 0.002 sec
testConnectionCreation(org.eclipse.rse.tests.core.connection.RSEConnectionTestCase)  Time elapsed: 0.051 sec
testConnect(org.eclipse.rse.tests.core.connection.RSEConnectionTestCase)  Time elapsed: 0.019 sec
testConnectionCaseInSensitive(org.eclipse.rse.tests.core.connection.RSEConnectionTestCase)  Time elapsed: 0.013 sec
testResolveFilterString(org.eclipse.rse.tests.core.connection.RSEConnectionTestCase)  Time elapsed: 0.011 sec
testConnectionRemoval(org.eclipse.rse.tests.core.connection.RSEConnectionTestCase)  Time elapsed: 0.02 sec
testSubSystemConfigurationProxy(org.eclipse.rse.tests.core.registries.SubSystemConfigurationProxyTestCase)  Time elapsed: 0.002 sec
testPluginResourceBundle(org.eclipse.rse.tests.internal.RSETestsPluginTestCase)  Time elapsed: 0.002 sec
testCoreTestPropertiesHandling(org.eclipse.rse.tests.internal.RSEInternalFrameworkTestCase)  Time elapsed: 0.001 sec
testTestDataLocationManagement(org.eclipse.rse.tests.internal.RSEInternalFrameworkTestCase)  Time elapsed: 0.006 sec
testConnectionManager(org.eclipse.rse.tests.internal.RSEInternalFrameworkTestCase)  Time elapsed: 0.005 sec
testWaitAndDispatch(org.eclipse.rse.tests.internal.RSEInternalFrameworkTestCase)  Time elapsed: 5.556 sec
testPersistenceManagerStartup(org.eclipse.rse.tests.persistence.PersistenceTest)  Time elapsed: 0.008 sec
testProfilePersistence(org.eclipse.rse.tests.persistence.PersistenceTest)  Time elapsed: 0.005 sec
testHostPersistence(org.eclipse.rse.tests.persistence.PersistenceTest)  Time elapsed: 0.013 sec
testHost1(org.eclipse.rse.tests.persistence.ExportImportTest)  Time elapsed: 0.035 sec
testFilterPool1(org.eclipse.rse.tests.persistence.ExportImportTest)  Time elapsed: 0.024 sec
testPropertySet(org.eclipse.rse.tests.persistence.ExportImportTest)  Time elapsed: 0.006 sec
testProfileMigration(org.eclipse.rse.tests.persistence.MigrationTest)  Time elapsed: 0.011 sec
testShowLocalConnection(org.eclipse.rse.tests.preferences.PreferencesTest)  Time elapsed: 0.002 sec
testUserIds(org.eclipse.rse.tests.preferences.PreferencesTest)  Time elapsed: 0.002 sec
testActiveProfiles(org.eclipse.rse.tests.preferences.PreferencesTest)  Time elapsed: 0.003 sec
testDefaultUserIds(org.eclipse.rse.tests.preferences.PreferencesTest)  Time elapsed: 0.003 sec
testCopyBatchVirtualFileLevelTwo(org.eclipse.rse.tests.subsystems.files.FileServiceArchiveTest)  Time elapsed: 2.702 sec
testCopyToTarVirtualFileLevelFour(org.eclipse.rse.tests.subsystems.files.FileServiceArchiveTest)  Time elapsed: 2.679 sec
testMoveToVirtualFileLevelOne(org.eclipse.rse.tests.subsystems.files.FileServiceArchiveTest)  Time elapsed: 2.566 sec
testMoveToVirtualFileLevelTwo(org.eclipse.rse.tests.subsystems.files.FileServiceArchiveTest)  Time elapsed: 2.659 sec
testMoveToTarVirtualFileLevelOne(org.eclipse.rse.tests.subsystems.files.FileServiceArchiveTest)  Time elapsed: 7.541 sec
testCopyBatchToVirtualFileLevelOne(org.eclipse.rse.tests.subsystems.files.FileServiceArchiveTest)  Time elapsed: 1.474 sec
testCopyBatchToVirtualFileLevelTwo(org.eclipse.rse.tests.subsystems.files.FileServiceArchiveTest)  Time elapsed: 1.374 sec
testCopyBatchVirtualFile(org.eclipse.rse.tests.subsystems.files.FileServiceArchiveTest)  Time elapsed: 1.496 sec
testCopyBatchTarVirtualFileLevelFive(org.eclipse.rse.tests.subsystems.files.FileServiceArchiveTest)  Time elapsed: 5.955 sec
testCopyToArchiveFile(org.eclipse.rse.tests.subsystems.files.FileServiceArchiveTest)  Time elapsed: 1.381 sec
testCopyVirtualFile(org.eclipse.rse.tests.subsystems.files.FileServiceArchiveTest)  Time elapsed: 1.032 sec
testCopyVirtualBatchToArchiveFile(org.eclipse.rse.tests.subsystems.files.FileServiceArchiveTest)  Time elapsed: 0.979 sec
testCreateZipFile(org.eclipse.rse.tests.subsystems.files.FileServiceArchiveTest)  Time elapsed: 0.03 sec
testMoveToVirtualFileLevelFour(org.eclipse.rse.tests.subsystems.files.FileServiceArchiveTest)  Time elapsed: 1.247 sec
testCopyVirtualBatchToVirtualFileLevelOne(org.eclipse.rse.tests.subsystems.files.FileServiceArchiveTest)  Time elapsed: 1.051 sec
testCopyVirtualBatchToVirtualFileLevelTwo(org.eclipse.rse.tests.subsystems.files.FileServiceArchiveTest)  Time elapsed: 0.974 sec
testMoveTarVirtualFileLevelFour(org.eclipse.rse.tests.subsystems.files.FileServiceArchiveTest)  Time elapsed: 1.445 sec
testCopyToVirtualFileLevelOne(org.eclipse.rse.tests.subsystems.files.FileServiceArchiveTest)  Time elapsed: 3.036 sec
testCopyToVirtualFileLevelTwo(org.eclipse.rse.tests.subsystems.files.FileServiceArchiveTest)  Time elapsed: 2.246 sec
testCopyBatchToArchiveFile(org.eclipse.rse.tests.subsystems.files.FileServiceArchiveTest)  Time elapsed: 2.519 sec
testMoveVirtualFile(org.eclipse.rse.tests.subsystems.files.FileServiceArchiveTest)  Time elapsed: 1.141 sec
testRenameVirtualFile(org.eclipse.rse.tests.subsystems.files.FileServiceArchiveTest)  Time elapsed: 0.052 sec
testCopyVirtualFileLevelTwo(org.eclipse.rse.tests.subsystems.files.FileServiceArchiveTest)  Time elapsed: 1.08 sec
testMoveToArchiveFile(org.eclipse.rse.tests.subsystems.files.FileServiceArchiveTest)  Time elapsed: 1.34 sec
testCopyTarVirtualFileLevelFour(org.eclipse.rse.tests.subsystems.files.FileServiceArchiveTest)  Time elapsed: 0.954 sec
testCopyToTarVirtualFileLevelOne(org.eclipse.rse.tests.subsystems.files.FileServiceArchiveTest)  Time elapsed: 1.124 sec
testCopyBatchToTarVirtualFileLevelFour(org.eclipse.rse.tests.subsystems.files.FileServiceArchiveTest)  Time elapsed: 1.333 sec
testMoveVirtualFileLevelTwo(org.eclipse.rse.tests.subsystems.files.FileServiceArchiveTest)  Time elapsed: 1.233 sec
testRenameTarVirtualFile(org.eclipse.rse.tests.subsystems.files.FileServiceArchiveTest)  Time elapsed: 0.09 sec
testCreateTarFile(org.eclipse.rse.tests.subsystems.files.FileServiceArchiveTest)  Time elapsed: 0.042 sec
testCopyBatchToTarArchiveFile(org.eclipse.rse.tests.subsystems.files.FileServiceArchiveTest)  Time elapsed: 2.626 sec
testDeleteTarVirtualFile(org.eclipse.rse.tests.subsystems.files.FileServiceArchiveTest)  Time elapsed: 1.219 sec
testMoveTarVirtualFile(org.eclipse.rse.tests.subsystems.files.FileServiceArchiveTest)  Time elapsed: 0.899 sec
testCopyTarVirtualFile(org.eclipse.rse.tests.subsystems.files.FileServiceArchiveTest)  Time elapsed: 0.344 sec
testCopyToTarArchiveFile(org.eclipse.rse.tests.subsystems.files.FileServiceArchiveTest)  Time elapsed: 1.19 sec
testMoveToTarArchiveFile(org.eclipse.rse.tests.subsystems.files.FileServiceArchiveTest)  Time elapsed: 1.187 sec
testListEmptyFolder(org.eclipse.rse.tests.subsystems.files.FileServiceTest)  Time elapsed: 0.027 sec
testListNonExistentFolder(org.eclipse.rse.tests.subsystems.files.FileServiceTest)  Time elapsed: 0.007 sec
testCreateCaseSensitive(org.eclipse.rse.tests.subsystems.files.FileServiceTest)  Time elapsed: 0.005 sec
testCreateFile(org.eclipse.rse.tests.subsystems.files.FileServiceTest)  Time elapsed: 0.004 sec
testCaseSensitive(org.eclipse.rse.tests.subsystems.files.FileServiceTest)  Time elapsed: 0.002 sec
testGetRootProperties(org.eclipse.rse.tests.subsystems.files.FileServiceTest)  Time elapsed: 0.003 sec
testListNotAFolder(org.eclipse.rse.tests.subsystems.files.FileServiceTest)  Time elapsed: 0.005 sec
testFTPReadAccessToRemoteHost(org.eclipse.rse.tests.subsystems.files.FTPFileSubsystemTestCase)  Time elapsed: 0.002 sec
testScpAccessToRemoteHost(org.eclipse.rse.tests.subsystems.files.ScpFileSubsystemTestCase)  Time elapsed: 0.001 sec
testRenameTarVirtualFile(org.eclipse.rse.tests.subsystems.files.FileServiceTgzArchiveTest)  Time elapsed: 0.097 sec
testCreateTarFile(org.eclipse.rse.tests.subsystems.files.FileServiceTgzArchiveTest)  Time elapsed: 0.05 sec
testCopyBatchToTarArchiveFile(org.eclipse.rse.tests.subsystems.files.FileServiceTgzArchiveTest)  Time elapsed: 1.503 sec
testDeleteTarVirtualFile(org.eclipse.rse.tests.subsystems.files.FileServiceTgzArchiveTest)  Time elapsed: 0.991 sec
testMoveTarVirtualFile(org.eclipse.rse.tests.subsystems.files.FileServiceTgzArchiveTest)  Time elapsed: 0.848 sec
testCopyTarVirtualFile(org.eclipse.rse.tests.subsystems.files.FileServiceTgzArchiveTest)  Time elapsed: 0.761 sec
testCopyToTarArchiveFile(org.eclipse.rse.tests.subsystems.files.FileServiceTgzArchiveTest)  Time elapsed: 1.143 sec
testMoveToTarArchiveFile(org.eclipse.rse.tests.subsystems.files.FileServiceTgzArchiveTest)  Time elapsed: 1.183 sec
testBrokenSymlink(org.eclipse.rse.tests.subsystems.files.RSEFileStoreTest)  Time elapsed: 0.005 sec
testDeleteSpecialCases(org.eclipse.rse.tests.subsystems.files.RSEFileStoreTest)  Time elapsed: 0.004 sec
testModifyNonExisting(org.eclipse.rse.tests.subsystems.files.RSEFileStoreTest)  Time elapsed: 0.003 sec
testModifyReadOnly(org.eclipse.rse.tests.subsystems.files.RSEFileStoreTest)  Time elapsed: 0.012 sec
testMakeDeleteTree(org.eclipse.rse.tests.subsystems.files.RSEFileStoreTest)  Time elapsed: 0.009 sec  <<< FAILURE!
junit.framework.AssertionFailedError: 2.1
	at junit.framework.Assert.fail(Assert.java:57)
	at junit.framework.Assert.assertTrue(Assert.java:22)
	at junit.framework.TestCase.assertTrue(TestCase.java:192)
	at org.eclipse.rse.tests.subsystems.files.RSEFileStoreTest.testMakeDeleteTree(RSEFileStoreTest.java:616)

test255files(org.eclipse.rse.tests.subsystems.files.RSEFileStoreTest)  Time elapsed: 0.193 sec
testRecursiveGetParent(org.eclipse.rse.tests.subsystems.files.RSEFileStoreTest)  Time elapsed: 0.005 sec
testAppendOutputStream(org.eclipse.rse.tests.subsystems.files.RSEFileStoreTest)  Time elapsed: 0.007 sec
testPutInfo(org.eclipse.rse.tests.subsystems.files.RSEFileStoreTest)  Time elapsed: 0.007 sec
testBrokenSymlink(org.eclipse.rse.tests.subsystems.files.RSEFileStoreTest)  Time elapsed: 0.017 sec
testDeleteSpecialCases(org.eclipse.rse.tests.subsystems.files.RSEFileStoreTest)  Time elapsed: 0.003 sec
testModifyNonExisting(org.eclipse.rse.tests.subsystems.files.RSEFileStoreTest)  Time elapsed: 0.002 sec
testModifyReadOnly(org.eclipse.rse.tests.subsystems.files.RSEFileStoreTest)  Time elapsed: 0.094 sec
testMakeDeleteTree(org.eclipse.rse.tests.subsystems.files.RSEFileStoreTest)  Time elapsed: 0.025 sec
test255files(org.eclipse.rse.tests.subsystems.files.RSEFileStoreTest)  Time elapsed: 1.588 sec
testRecursiveGetParent(org.eclipse.rse.tests.subsystems.files.RSEFileStoreTest)  Time elapsed: 0.007 sec
testAppendOutputStream(org.eclipse.rse.tests.subsystems.files.RSEFileStoreTest)  Time elapsed: 0.007 sec
testPutInfo(org.eclipse.rse.tests.subsystems.files.RSEFileStoreTest)  Time elapsed: 0.032 sec
testRunCommand(org.eclipse.rse.tests.subsystems.shells.ShellServiceTest)  Time elapsed: 0.002 sec
testRunCommandViaHostShellProcessAdapter(org.eclipse.rse.tests.subsystems.shells.ShellServiceTest)  Time elapsed: 0.001 sec
testLaunchShell(org.eclipse.rse.tests.subsystems.shells.ShellServiceTest)  Time elapsed: 0.001 sec
testRunCommand(org.eclipse.rse.tests.subsystems.shells.ShellSubSystemTest)  Time elapsed: 0.001 sec
testRunShell(org.eclipse.rse.tests.subsystems.shells.ShellSubSystemTest)  Time elapsed: 0.001 sec
testCancelShell(org.eclipse.rse.tests.subsystems.shells.ShellSubSystemTest)  Time elapsed: 0.001 sec
testAddAndDeleteDeepNodes(org.eclipse.rse.tests.subsystems.testsubsystem.TestSubsystemTestCase)  Time elapsed: 2.064 sec
testAddAndDeleteFlatNodes(org.eclipse.rse.tests.subsystems.testsubsystem.TestSubsystemTestCase)  Time elapsed: 2.048 sec
testBugzilla170728(org.eclipse.rse.tests.subsystems.testsubsystem.TestSubsystemTestCase)  Time elapsed: 14.176 sec
testConnectDisconnect(org.eclipse.rse.tests.synchronize.RSESynchronizeTest)  Time elapsed: 2.131 sec
testExport(org.eclipse.rse.tests.synchronize.RSESynchronizeTest)  Time elapsed: 0.073 sec
testDefaultGeneration(org.eclipse.rse.tests.ui.mnemonics.MnemonicsTest)  Time elapsed: 0.028 sec
testAppendPolicies(org.eclipse.rse.tests.ui.mnemonics.MnemonicsTest)  Time elapsed: 0.003 sec
testShowLists(org.eclipse.rse.tests.ui.preferences.PreferencesTest)  Time elapsed: 0.001 sec

Results :

Failed tests: 
  RSEFileStoreTest>RSECoreTestCase.run:380->RSECoreTestCase.runBare:411->RSECoreTestCase.runTest:425->testMakeDeleteTree:616 2.1

Tests run: 121, Failures: 1, Errors: 0, Skipped: 0

[ERROR] There are test failures.

Please refer to /jobs/genie.tm/tm.gerrit/workspace/rse/tests/org.eclipse.rse.tests/target/surefire-reports for the individual test results.
[INFO] 
[INFO] --- maven-install-plugin:2.3.1:install (default-install) @ org.eclipse.rse.tests ---
[INFO] Installing /jobs/genie.tm/tm.gerrit/workspace/rse/tests/org.eclipse.rse.tests/target/org.eclipse.rse.tests-3.4.100-SNAPSHOT.jar to /home/hudson/genie.tm/.jenkins/jobs/tm.gerrit/workspace/.repository/org/eclipse/tm/org.eclipse.rse.tests/3.4.100-SNAPSHOT/org.eclipse.rse.tests-3.4.100-SNAPSHOT.jar
[INFO] Installing /jobs/genie.tm/tm.gerrit/workspace/rse/tests/org.eclipse.rse.tests/pom.xml to /home/hudson/genie.tm/.jenkins/jobs/tm.gerrit/workspace/.repository/org/eclipse/tm/org.eclipse.rse.tests/3.4.100-SNAPSHOT/org.eclipse.rse.tests-3.4.100-SNAPSHOT.pom
[INFO] Installing /jobs/genie.tm/tm.gerrit/workspace/rse/tests/org.eclipse.rse.tests/target/p2content.xml to /home/hudson/genie.tm/.jenkins/jobs/tm.gerrit/workspace/.repository/org/eclipse/tm/org.eclipse.rse.tests/3.4.100-SNAPSHOT/org.eclipse.rse.tests-3.4.100-SNAPSHOT-p2metadata.xml
[INFO] Installing /jobs/genie.tm/tm.gerrit/workspace/rse/tests/org.eclipse.rse.tests/target/p2artifacts.xml to /home/hudson/genie.tm/.jenkins/jobs/tm.gerrit/workspace/.repository/org/eclipse/tm/org.eclipse.rse.tests/3.4.100-SNAPSHOT/org.eclipse.rse.tests-3.4.100-SNAPSHOT-p2artifacts.xml
[INFO] 
[INFO] --- tycho-p2-plugin:1.0.0:update-local-index (default-update-local-index) @ org.eclipse.rse.tests ---
[INFO] 
[INFO] ------------------------------------------------------------------------
[INFO] Building org.eclipse.rse.tests 3.6.100-SNAPSHOT
[INFO] ------------------------------------------------------------------------
[INFO] 
[INFO] --- maven-clean-plugin:2.5:clean (default-clean) @ org.eclipse.rse.tests ---
[INFO] 
[INFO] --- tycho-packaging-plugin:1.0.0:build-qualifier-aggregator (default-build-qualifier-aggregator) @ org.eclipse.rse.tests ---
[INFO] The project's OSGi version is 3.6.100.201802211756
[INFO] 
[INFO] --- tycho-packaging-plugin:1.0.0:validate-id (default-validate-id) @ org.eclipse.rse.tests ---
[INFO] 
[INFO] --- tycho-packaging-plugin:1.0.0:validate-version (default-validate-version) @ org.eclipse.rse.tests ---
[INFO] 
[INFO] --- target-platform-configuration:1.0.0:target-platform (default-target-platform) @ org.eclipse.rse.tests ---
[INFO] 
[INFO] --- tycho-packaging-plugin:1.0.0:package-feature (default-package-feature) @ org.eclipse.rse.tests ---
[INFO] Building jar: /jobs/genie.tm/tm.gerrit/workspace/rse/tests/org.eclipse.rse.tests-feature/target/org.eclipse.rse.tests-3.6.100-SNAPSHOT.jar
[INFO] 
[INFO] --- tycho-p2-plugin:1.0.0:p2-metadata-default (default-p2-metadata-default) @ org.eclipse.rse.tests ---
[INFO] 
[INFO] --- tycho-p2-plugin:1.0.0:feature-p2-metadata (default-feature-p2-metadata) @ org.eclipse.rse.tests ---
[INFO] 
[INFO] --- tycho-p2-plugin:1.0.0:p2-metadata (p2-metadata) @ org.eclipse.rse.tests ---
[INFO] 
[INFO] --- maven-install-plugin:2.3.1:install (default-install) @ org.eclipse.rse.tests ---
[INFO] Installing /jobs/genie.tm/tm.gerrit/workspace/rse/tests/org.eclipse.rse.tests-feature/target/org.eclipse.rse.tests-3.6.100-SNAPSHOT.jar to /home/hudson/genie.tm/.jenkins/jobs/tm.gerrit/workspace/.repository/org/eclipse/tm/features/org.eclipse.rse.tests/3.6.100-SNAPSHOT/org.eclipse.rse.tests-3.6.100-SNAPSHOT.jar
[INFO] Installing /jobs/genie.tm/tm.gerrit/workspace/rse/tests/org.eclipse.rse.tests-feature/pom.xml to /home/hudson/genie.tm/.jenkins/jobs/tm.gerrit/workspace/.repository/org/eclipse/tm/features/org.eclipse.rse.tests/3.6.100-SNAPSHOT/org.eclipse.rse.tests-3.6.100-SNAPSHOT.pom
[INFO] Installing /jobs/genie.tm/tm.gerrit/workspace/rse/tests/org.eclipse.rse.tests-feature/target/p2content.xml to /home/hudson/genie.tm/.jenkins/jobs/tm.gerrit/workspace/.repository/org/eclipse/tm/features/org.eclipse.rse.tests/3.6.100-SNAPSHOT/org.eclipse.rse.tests-3.6.100-SNAPSHOT-p2metadata.xml
[INFO] Installing /jobs/genie.tm/tm.gerrit/workspace/rse/tests/org.eclipse.rse.tests-feature/target/p2artifacts.xml to /home/hudson/genie.tm/.jenkins/jobs/tm.gerrit/workspace/.repository/org/eclipse/tm/features/org.eclipse.rse.tests/3.6.100-SNAPSHOT/org.eclipse.rse.tests-3.6.100-SNAPSHOT-p2artifacts.xml
[INFO] 
[INFO] --- tycho-p2-plugin:1.0.0:update-local-index (default-update-local-index) @ org.eclipse.rse.tests ---
[INFO] 
[INFO] ------------------------------------------------------------------------
[INFO] Building org.eclipse.rse.tests.framework.examples 1.1.0-SNAPSHOT
[INFO] ------------------------------------------------------------------------
[INFO] 
[INFO] --- maven-clean-plugin:2.5:clean (default-clean) @ org.eclipse.rse.tests.framework.examples ---
[INFO] 
[INFO] --- tycho-packaging-plugin:1.0.0:build-qualifier (default-build-qualifier) @ org.eclipse.rse.tests.framework.examples ---
[INFO] The project's OSGi version is 1.1.0.201101042054
[INFO] 
[INFO] --- tycho-packaging-plugin:1.0.0:validate-id (default-validate-id) @ org.eclipse.rse.tests.framework.examples ---
[INFO] 
[INFO] --- tycho-packaging-plugin:1.0.0:validate-version (default-validate-version) @ org.eclipse.rse.tests.framework.examples ---
[INFO] 
[INFO] --- maven-resources-plugin:2.6:resources (default-resources) @ org.eclipse.rse.tests.framework.examples ---
[INFO] Using 'UTF-8' encoding to copy filtered resources.
[INFO] skip non existing resourceDirectory /jobs/genie.tm/tm.gerrit/workspace/rse/tests/org.eclipse.rse.tests.framework.examples/src/main/resources
[INFO] 
[INFO] --- tycho-compiler-plugin:1.0.0:compile (default-compile) @ org.eclipse.rse.tests.framework.examples ---
[INFO] Compiling 11 source files to /jobs/genie.tm/tm.gerrit/workspace/rse/tests/org.eclipse.rse.tests.framework.examples/target/classes
[INFO] 
[INFO] --- maven-resources-plugin:2.6:testResources (default-testResources) @ org.eclipse.rse.tests.framework.examples ---
[INFO] Using 'UTF-8' encoding to copy filtered resources.
[INFO] skip non existing resourceDirectory /jobs/genie.tm/tm.gerrit/workspace/rse/tests/org.eclipse.rse.tests.framework.examples/src/test/resources
[INFO] 
[INFO] --- target-platform-configuration:1.0.0:target-platform (default-target-platform) @ org.eclipse.rse.tests.framework.examples ---
[INFO] 
[INFO] --- tycho-packaging-plugin:1.0.0:package-plugin (default-package-plugin) @ org.eclipse.rse.tests.framework.examples ---
[INFO] Building jar: /jobs/genie.tm/tm.gerrit/workspace/rse/tests/org.eclipse.rse.tests.framework.examples/target/org.eclipse.rse.tests.framework.examples-1.1.0-SNAPSHOT.jar
[INFO] 
[INFO] --- tycho-p2-plugin:1.0.0:p2-metadata-default (default-p2-metadata-default) @ org.eclipse.rse.tests.framework.examples ---
[INFO] 
[INFO] --- tycho-p2-plugin:1.0.0:p2-metadata (p2-metadata) @ org.eclipse.rse.tests.framework.examples ---
[INFO] 
[INFO] --- maven-install-plugin:2.3.1:install (default-install) @ org.eclipse.rse.tests.framework.examples ---
[INFO] Installing /jobs/genie.tm/tm.gerrit/workspace/rse/tests/org.eclipse.rse.tests.framework.examples/target/org.eclipse.rse.tests.framework.examples-1.1.0-SNAPSHOT.jar to /home/hudson/genie.tm/.jenkins/jobs/tm.gerrit/workspace/.repository/org/eclipse/tm/org.eclipse.rse.tests.framework.examples/1.1.0-SNAPSHOT/org.eclipse.rse.tests.framework.examples-1.1.0-SNAPSHOT.jar
[INFO] Installing /jobs/genie.tm/tm.gerrit/workspace/rse/tests/org.eclipse.rse.tests.framework.examples/pom.xml to /home/hudson/genie.tm/.jenkins/jobs/tm.gerrit/workspace/.repository/org/eclipse/tm/org.eclipse.rse.tests.framework.examples/1.1.0-SNAPSHOT/org.eclipse.rse.tests.framework.examples-1.1.0-SNAPSHOT.pom
[INFO] Installing /jobs/genie.tm/tm.gerrit/workspace/rse/tests/org.eclipse.rse.tests.framework.examples/target/p2content.xml to /home/hudson/genie.tm/.jenkins/jobs/tm.gerrit/workspace/.repository/org/eclipse/tm/org.eclipse.rse.tests.framework.examples/1.1.0-SNAPSHOT/org.eclipse.rse.tests.framework.examples-1.1.0-SNAPSHOT-p2metadata.xml
[INFO] Installing /jobs/genie.tm/tm.gerrit/workspace/rse/tests/org.eclipse.rse.tests.framework.examples/target/p2artifacts.xml to /home/hudson/genie.tm/.jenkins/jobs/tm.gerrit/workspace/.repository/org/eclipse/tm/org.eclipse.rse.tests.framework.examples/1.1.0-SNAPSHOT/org.eclipse.rse.tests.framework.examples-1.1.0-SNAPSHOT-p2artifacts.xml
[INFO] 
[INFO] --- tycho-p2-plugin:1.0.0:update-local-index (default-update-local-index) @ org.eclipse.rse.tests.framework.examples ---
[INFO] 
[INFO] ------------------------------------------------------------------------
[INFO] Building org.eclipse.tm.rse.site 3.8.0-SNAPSHOT
[INFO] ------------------------------------------------------------------------
[INFO] 
[INFO] --- maven-clean-plugin:2.5:clean (default-clean) @ org.eclipse.tm.rse.site ---
[INFO] 
[INFO] --- tycho-packaging-plugin:1.0.0:build-qualifier-aggregator (default-build-qualifier-aggregator) @ org.eclipse.tm.rse.site ---
[INFO] The project's OSGi version is 3.8.0.201802211907
[INFO] 
[INFO] --- maven-clean-plugin:2.5:clean (default-clean-1) @ org.eclipse.tm.rse.site ---
[INFO] 
[INFO] --- maven-resources-plugin:2.6:resources (default-resources) @ org.eclipse.tm.rse.site ---
[INFO] Using 'UTF-8' encoding to copy filtered resources.
[INFO] skip non existing resourceDirectory /jobs/genie.tm/tm.gerrit/workspace/rse/site/src/main/resources
[INFO] 
[INFO] --- target-platform-configuration:1.0.0:target-platform (default-target-platform) @ org.eclipse.tm.rse.site ---
[INFO] 
[INFO] --- tycho-p2-publisher-plugin:1.0.0:publish-products (default-publish-products) @ org.eclipse.tm.rse.site ---
[INFO] 
[INFO] --- tycho-p2-publisher-plugin:1.0.0:publish-categories (default-publish-categories) @ org.eclipse.tm.rse.site ---
[INFO] 
[INFO] --- tycho-p2-publisher-plugin:1.0.0:attach-artifacts (default-attach-artifacts) @ org.eclipse.tm.rse.site ---
[INFO] 
[INFO] --- tycho-p2-repository-plugin:1.0.0:assemble-repository (default-assemble-repository) @ org.eclipse.tm.rse.site ---
[INFO] 
[INFO] --- tycho-p2-repository-plugin:1.0.0:archive-repository (default-archive-repository) @ org.eclipse.tm.rse.site ---
[INFO] Building zip: /jobs/genie.tm/tm.gerrit/workspace/rse/site/target/org.eclipse.tm.rse.site.zip
[INFO] 
[INFO] --- tycho-p2-plugin:1.0.0:p2-metadata (p2-metadata) @ org.eclipse.tm.rse.site ---
[INFO] 
[INFO] --- maven-install-plugin:2.3.1:install (default-install) @ org.eclipse.tm.rse.site ---
[INFO] Installing /jobs/genie.tm/tm.gerrit/workspace/rse/site/target/org.eclipse.tm.rse.site.zip to /home/hudson/genie.tm/.jenkins/jobs/tm.gerrit/workspace/.repository/org/eclipse/tm/rse/org.eclipse.tm.rse.site/3.8.0-SNAPSHOT/org.eclipse.tm.rse.site-3.8.0-SNAPSHOT.zip
[INFO] Installing /jobs/genie.tm/tm.gerrit/workspace/rse/site/pom.xml to /home/hudson/genie.tm/.jenkins/jobs/tm.gerrit/workspace/.repository/org/eclipse/tm/rse/org.eclipse.tm.rse.site/3.8.0-SNAPSHOT/org.eclipse.tm.rse.site-3.8.0-SNAPSHOT.pom
[INFO] Installing /jobs/genie.tm/tm.gerrit/workspace/rse/site/target/p2content.xml to /home/hudson/genie.tm/.jenkins/jobs/tm.gerrit/workspace/.repository/org/eclipse/tm/rse/org.eclipse.tm.rse.site/3.8.0-SNAPSHOT/org.eclipse.tm.rse.site-3.8.0-SNAPSHOT-p2metadata.xml
[INFO] Installing /jobs/genie.tm/tm.gerrit/workspace/rse/site/target/p2artifacts.xml to /home/hudson/genie.tm/.jenkins/jobs/tm.gerrit/workspace/.repository/org/eclipse/tm/rse/org.eclipse.tm.rse.site/3.8.0-SNAPSHOT/org.eclipse.tm.rse.site-3.8.0-SNAPSHOT-p2artifacts.xml
[INFO] 
[INFO] --- tycho-p2-plugin:1.0.0:update-local-index (default-update-local-index) @ org.eclipse.tm.rse.site ---
[INFO] 
[INFO] ------------------------------------------------------------------------
[INFO] Building org.eclipse.tm.wince 4.0.0-SNAPSHOT
[INFO] ------------------------------------------------------------------------
[INFO] 
[INFO] --- maven-clean-plugin:2.5:clean (default-clean) @ org.eclipse.tm.wince ---
[INFO] 
[INFO] --- maven-install-plugin:2.4:install (default-install) @ org.eclipse.tm.wince ---
[INFO] Installing /jobs/genie.tm/tm.gerrit/workspace/wince/pom.xml to /home/hudson/genie.tm/.jenkins/jobs/tm.gerrit/workspace/.repository/org/eclipse/tm/wince/org.eclipse.tm.wince/4.0.0-SNAPSHOT/org.eclipse.tm.wince-4.0.0-SNAPSHOT.pom
[INFO] 
[INFO] ------------------------------------------------------------------------
[INFO] Building org.eclipse.tm.rapi 0.2.300-SNAPSHOT
[INFO] ------------------------------------------------------------------------
[INFO] 
[INFO] --- maven-clean-plugin:2.5:clean (default-clean) @ org.eclipse.tm.rapi ---
[INFO] 
[INFO] --- tycho-packaging-plugin:1.0.0:build-qualifier (default-build-qualifier) @ org.eclipse.tm.rapi ---
[INFO] The project's OSGi version is 0.2.300.201205062159
[INFO] 
[INFO] --- tycho-packaging-plugin:1.0.0:validate-id (default-validate-id) @ org.eclipse.tm.rapi ---
[INFO] 
[INFO] --- tycho-packaging-plugin:1.0.0:validate-version (default-validate-version) @ org.eclipse.tm.rapi ---
[INFO] 
[INFO] --- maven-resources-plugin:2.6:resources (default-resources) @ org.eclipse.tm.rapi ---
[INFO] Using 'UTF-8' encoding to copy filtered resources.
[INFO] skip non existing resourceDirectory /jobs/genie.tm/tm.gerrit/workspace/wince/org.eclipse.tm.rapi/src/main/resources
[INFO] 
[INFO] --- tycho-compiler-plugin:1.0.0:compile (default-compile) @ org.eclipse.tm.rapi ---
[INFO] Compiling 15 source files to /jobs/genie.tm/tm.gerrit/workspace/wince/org.eclipse.tm.rapi/target/classes
[INFO] 
[INFO] --- maven-resources-plugin:2.6:testResources (default-testResources) @ org.eclipse.tm.rapi ---
[INFO] Using 'UTF-8' encoding to copy filtered resources.
[INFO] skip non existing resourceDirectory /jobs/genie.tm/tm.gerrit/workspace/wince/org.eclipse.tm.rapi/src/test/resources
[INFO] 
[INFO] --- target-platform-configuration:1.0.0:target-platform (default-target-platform) @ org.eclipse.tm.rapi ---
[INFO] 
[INFO] --- tycho-packaging-plugin:1.0.0:package-plugin (default-package-plugin) @ org.eclipse.tm.rapi ---
[INFO] Building jar: /jobs/genie.tm/tm.gerrit/workspace/wince/org.eclipse.tm.rapi/target/org.eclipse.tm.rapi-0.2.300-SNAPSHOT.jar
[INFO] 
[INFO] --- tycho-p2-plugin:1.0.0:p2-metadata-default (default-p2-metadata-default) @ org.eclipse.tm.rapi ---
[INFO] 
[INFO] --- tycho-p2-plugin:1.0.0:p2-metadata (p2-metadata) @ org.eclipse.tm.rapi ---
[INFO] 
[INFO] --- maven-install-plugin:2.3.1:install (default-install) @ org.eclipse.tm.rapi ---
[INFO] Installing /jobs/genie.tm/tm.gerrit/workspace/wince/org.eclipse.tm.rapi/target/org.eclipse.tm.rapi-0.2.300-SNAPSHOT.jar to /home/hudson/genie.tm/.jenkins/jobs/tm.gerrit/workspace/.repository/org/eclipse/tm/org.eclipse.tm.rapi/0.2.300-SNAPSHOT/org.eclipse.tm.rapi-0.2.300-SNAPSHOT.jar
[INFO] Installing /jobs/genie.tm/tm.gerrit/workspace/wince/org.eclipse.tm.rapi/pom.xml to /home/hudson/genie.tm/.jenkins/jobs/tm.gerrit/workspace/.repository/org/eclipse/tm/org.eclipse.tm.rapi/0.2.300-SNAPSHOT/org.eclipse.tm.rapi-0.2.300-SNAPSHOT.pom
[INFO] Installing /jobs/genie.tm/tm.gerrit/workspace/wince/org.eclipse.tm.rapi/target/p2content.xml to /home/hudson/genie.tm/.jenkins/jobs/tm.gerrit/workspace/.repository/org/eclipse/tm/org.eclipse.tm.rapi/0.2.300-SNAPSHOT/org.eclipse.tm.rapi-0.2.300-SNAPSHOT-p2metadata.xml
[INFO] Installing /jobs/genie.tm/tm.gerrit/workspace/wince/org.eclipse.tm.rapi/target/p2artifacts.xml to /home/hudson/genie.tm/.jenkins/jobs/tm.gerrit/workspace/.repository/org/eclipse/tm/org.eclipse.tm.rapi/0.2.300-SNAPSHOT/org.eclipse.tm.rapi-0.2.300-SNAPSHOT-p2artifacts.xml
[INFO] 
[INFO] --- tycho-p2-plugin:1.0.0:update-local-index (default-update-local-index) @ org.eclipse.tm.rapi ---
[INFO] 
[INFO] ------------------------------------------------------------------------
[INFO] Building org.eclipse.rse.subsystems.wince 0.1.500-SNAPSHOT
[INFO] ------------------------------------------------------------------------
[INFO] 
[INFO] --- maven-clean-plugin:2.5:clean (default-clean) @ org.eclipse.rse.subsystems.wince ---
[INFO] 
[INFO] --- tycho-packaging-plugin:1.0.0:build-qualifier (default-build-qualifier) @ org.eclipse.rse.subsystems.wince ---
[INFO] The project's OSGi version is 0.1.500.201305201712
[INFO] 
[INFO] --- tycho-packaging-plugin:1.0.0:validate-id (default-validate-id) @ org.eclipse.rse.subsystems.wince ---
[INFO] 
[INFO] --- tycho-packaging-plugin:1.0.0:validate-version (default-validate-version) @ org.eclipse.rse.subsystems.wince ---
[INFO] 
[INFO] --- maven-resources-plugin:2.6:resources (default-resources) @ org.eclipse.rse.subsystems.wince ---
[INFO] Using 'UTF-8' encoding to copy filtered resources.
[INFO] skip non existing resourceDirectory /jobs/genie.tm/tm.gerrit/workspace/wince/org.eclipse.rse.subsystems.wince/src/main/resources
[INFO] 
[INFO] --- tycho-compiler-plugin:1.0.0:compile (default-compile) @ org.eclipse.rse.subsystems.wince ---
[INFO] Compiling 14 source files to /jobs/genie.tm/tm.gerrit/workspace/wince/org.eclipse.rse.subsystems.wince/target/classes
[INFO] 
[INFO] --- maven-resources-plugin:2.6:testResources (default-testResources) @ org.eclipse.rse.subsystems.wince ---
[INFO] Using 'UTF-8' encoding to copy filtered resources.
[INFO] skip non existing resourceDirectory /jobs/genie.tm/tm.gerrit/workspace/wince/org.eclipse.rse.subsystems.wince/src/test/resources
[INFO] 
[INFO] --- target-platform-configuration:1.0.0:target-platform (default-target-platform) @ org.eclipse.rse.subsystems.wince ---
[INFO] 
[INFO] --- tycho-packaging-plugin:1.0.0:package-plugin (default-package-plugin) @ org.eclipse.rse.subsystems.wince ---
[INFO] Building jar: /jobs/genie.tm/tm.gerrit/workspace/wince/org.eclipse.rse.subsystems.wince/target/org.eclipse.rse.subsystems.wince-0.1.500-SNAPSHOT.jar
[INFO] 
[INFO] --- tycho-p2-plugin:1.0.0:p2-metadata-default (default-p2-metadata-default) @ org.eclipse.rse.subsystems.wince ---
[INFO] 
[INFO] --- tycho-p2-plugin:1.0.0:p2-metadata (p2-metadata) @ org.eclipse.rse.subsystems.wince ---
[INFO] 
[INFO] --- maven-install-plugin:2.3.1:install (default-install) @ org.eclipse.rse.subsystems.wince ---
[INFO] Installing /jobs/genie.tm/tm.gerrit/workspace/wince/org.eclipse.rse.subsystems.wince/target/org.eclipse.rse.subsystems.wince-0.1.500-SNAPSHOT.jar to /home/hudson/genie.tm/.jenkins/jobs/tm.gerrit/workspace/.repository/org/eclipse/tm/org.eclipse.rse.subsystems.wince/0.1.500-SNAPSHOT/org.eclipse.rse.subsystems.wince-0.1.500-SNAPSHOT.jar
[INFO] Installing /jobs/genie.tm/tm.gerrit/workspace/wince/org.eclipse.rse.subsystems.wince/pom.xml to /home/hudson/genie.tm/.jenkins/jobs/tm.gerrit/workspace/.repository/org/eclipse/tm/org.eclipse.rse.subsystems.wince/0.1.500-SNAPSHOT/org.eclipse.rse.subsystems.wince-0.1.500-SNAPSHOT.pom
[INFO] Installing /jobs/genie.tm/tm.gerrit/workspace/wince/org.eclipse.rse.subsystems.wince/target/p2content.xml to /home/hudson/genie.tm/.jenkins/jobs/tm.gerrit/workspace/.repository/org/eclipse/tm/org.eclipse.rse.subsystems.wince/0.1.500-SNAPSHOT/org.eclipse.rse.subsystems.wince-0.1.500-SNAPSHOT-p2metadata.xml
[INFO] Installing /jobs/genie.tm/tm.gerrit/workspace/wince/org.eclipse.rse.subsystems.wince/target/p2artifacts.xml to /home/hudson/genie.tm/.jenkins/jobs/tm.gerrit/workspace/.repository/org/eclipse/tm/org.eclipse.rse.subsystems.wince/0.1.500-SNAPSHOT/org.eclipse.rse.subsystems.wince-0.1.500-SNAPSHOT-p2artifacts.xml
[INFO] 
[INFO] --- tycho-p2-plugin:1.0.0:update-local-index (default-update-local-index) @ org.eclipse.rse.subsystems.wince ---
[INFO] 
[INFO] ------------------------------------------------------------------------
[INFO] Building org.eclipse.rse.wince 4.0.0-SNAPSHOT
[INFO] ------------------------------------------------------------------------
[INFO] 
[INFO] --- maven-clean-plugin:2.5:clean (default-clean) @ org.eclipse.rse.wince ---
[INFO] 
[INFO] --- tycho-packaging-plugin:1.0.0:build-qualifier-aggregator (default-build-qualifier-aggregator) @ org.eclipse.rse.wince ---
[INFO] The project's OSGi version is 4.0.0.201802211756
[INFO] 
[INFO] --- tycho-packaging-plugin:1.0.0:validate-id (default-validate-id) @ org.eclipse.rse.wince ---
[INFO] 
[INFO] --- tycho-packaging-plugin:1.0.0:validate-version (default-validate-version) @ org.eclipse.rse.wince ---
[INFO] 
[INFO] --- target-platform-configuration:1.0.0:target-platform (default-target-platform) @ org.eclipse.rse.wince ---
[INFO] 
[INFO] --- tycho-packaging-plugin:1.0.0:package-feature (default-package-feature) @ org.eclipse.rse.wince ---
[INFO] Building jar: /jobs/genie.tm/tm.gerrit/workspace/wince/org.eclipse.rse.wince-feature/target/org.eclipse.rse.wince-4.0.0-SNAPSHOT.jar
[INFO] 
[INFO] --- tycho-p2-plugin:1.0.0:p2-metadata-default (default-p2-metadata-default) @ org.eclipse.rse.wince ---
[INFO] 
[INFO] --- tycho-p2-plugin:1.0.0:feature-p2-metadata (default-feature-p2-metadata) @ org.eclipse.rse.wince ---
[INFO] 
[INFO] --- tycho-p2-plugin:1.0.0:p2-metadata (p2-metadata) @ org.eclipse.rse.wince ---
[INFO] 
[INFO] --- maven-install-plugin:2.3.1:install (default-install) @ org.eclipse.rse.wince ---
[INFO] Installing /jobs/genie.tm/tm.gerrit/workspace/wince/org.eclipse.rse.wince-feature/target/org.eclipse.rse.wince-4.0.0-SNAPSHOT.jar to /home/hudson/genie.tm/.jenkins/jobs/tm.gerrit/workspace/.repository/org/eclipse/tm/features/org.eclipse.rse.wince/4.0.0-SNAPSHOT/org.eclipse.rse.wince-4.0.0-SNAPSHOT.jar
[INFO] Installing /jobs/genie.tm/tm.gerrit/workspace/wince/org.eclipse.rse.wince-feature/pom.xml to /home/hudson/genie.tm/.jenkins/jobs/tm.gerrit/workspace/.repository/org/eclipse/tm/features/org.eclipse.rse.wince/4.0.0-SNAPSHOT/org.eclipse.rse.wince-4.0.0-SNAPSHOT.pom
[INFO] Installing /jobs/genie.tm/tm.gerrit/workspace/wince/org.eclipse.rse.wince-feature/target/p2content.xml to /home/hudson/genie.tm/.jenkins/jobs/tm.gerrit/workspace/.repository/org/eclipse/tm/features/org.eclipse.rse.wince/4.0.0-SNAPSHOT/org.eclipse.rse.wince-4.0.0-SNAPSHOT-p2metadata.xml
[INFO] Installing /jobs/genie.tm/tm.gerrit/workspace/wince/org.eclipse.rse.wince-feature/target/p2artifacts.xml to /home/hudson/genie.tm/.jenkins/jobs/tm.gerrit/workspace/.repository/org/eclipse/tm/features/org.eclipse.rse.wince/4.0.0-SNAPSHOT/org.eclipse.rse.wince-4.0.0-SNAPSHOT-p2artifacts.xml
[INFO] 
[INFO] --- tycho-p2-plugin:1.0.0:update-local-index (default-update-local-index) @ org.eclipse.rse.wince ---
[INFO] ------------------------------------------------------------------------
[INFO] Reactor Summary:
[INFO] 
[INFO] Target Management Parent ........................... SUCCESS [ 25.369 s]
[INFO] org.eclipse.tm.rse ................................. SUCCESS [  0.581 s]
[INFO] org.eclipse.tm.rse.doc ............................. SUCCESS [  0.056 s]
[INFO] org.eclipse.dstore.doc.isv ......................... SUCCESS [01:48 min]
[INFO] org.eclipse.rse.doc.isv ............................ SUCCESS [  3.754 s]
[INFO] org.eclipse.rse.doc.user ........................... SUCCESS [  2.937 s]
[INFO] org.eclipse.tm.rse.examples ........................ SUCCESS [  0.104 s]
[INFO] org.eclipse.tm.rse.plugins ......................... SUCCESS [  0.417 s]
[INFO] org.eclipse.rse.services ........................... SUCCESS [  4.656 s]
[INFO] org.eclipse.rse.core ............................... SUCCESS [  2.857 s]
[INFO] org.eclipse.rse.ui ................................. SUCCESS [  4.931 s]
[INFO] org.eclipse.rse.examples.daytime ................... SUCCESS [  0.822 s]
[INFO] org.eclipse.dstore.extra ........................... SUCCESS [  1.202 s]
[INFO] org.eclipse.dstore.core ............................ SUCCESS [  2.282 s]
[INFO] org.eclipse.rse.services.dstore .................... SUCCESS [  6.250 s]
[INFO] org.eclipse.rse.connectorservice.dstore ............ SUCCESS [  0.950 s]
[INFO] org.eclipse.rse.examples.dstore .................... SUCCESS [  0.751 s]
[INFO] org.eclipse.rse.subsystems.files.core .............. SUCCESS [  1.097 s]
[INFO] org.eclipse.rse.subsystems.shells.core ............. SUCCESS [  1.300 s]
[INFO] org.eclipse.rse.files.ui ........................... SUCCESS [  2.061 s]
[INFO] org.eclipse.rse.shells.ui .......................... SUCCESS [  6.294 s]
[INFO] org.eclipse.rse.examples.tutorial .................. SUCCESS [  2.505 s]
[INFO] org.eclipse.rse.examples ........................... SUCCESS [  0.400 s]
[INFO] org.eclipse.tm.rse.features ........................ SUCCESS [  0.030 s]
[INFO] org.eclipse.rse.efs ................................ SUCCESS [  4.554 s]
[INFO] org.eclipse.rse.efs.ui ............................. SUCCESS [  5.795 s]
[INFO] org.eclipse.rse.importexport ....................... SUCCESS [  2.040 s]
[INFO] org.eclipse.rse.subsystems.processes.core .......... SUCCESS [  1.205 s]
[INFO] org.eclipse.rse.processes.ui ....................... SUCCESS [  1.491 s]
[INFO] org.eclipse.rse.subsystems.processes.shell.linux ... SUCCESS [  1.855 s]
[INFO] org.eclipse.rse.core ............................... SUCCESS [  0.614 s]
[INFO] org.eclipse.rse.subsystems.files.dstore ............ SUCCESS [  0.914 s]
[INFO] org.eclipse.rse.subsystems.processes.dstore ........ SUCCESS [  0.937 s]
[INFO] org.eclipse.rse.subsystems.shells.dstore ........... SUCCESS [  0.940 s]
[INFO] org.eclipse.rse.dstore.security .................... SUCCESS [  9.877 s]
[INFO] org.eclipse.rse.dstore ............................. SUCCESS [  0.874 s]
[INFO] org.eclipse.rse.connectorservice.local ............. SUCCESS [  0.836 s]
[INFO] org.eclipse.rse.services.ssh ....................... SUCCESS [  0.835 s]
[INFO] org.eclipse.rse.connectorservice.ssh ............... SUCCESS [  0.965 s]
[INFO] org.eclipse.rse.services.telnet .................... SUCCESS [  1.407 s]
[INFO] org.eclipse.rse.connectorservice.telnet ............ SUCCESS [  0.914 s]
[INFO] org.eclipse.rse.services.files.ftp ................. SUCCESS [  0.921 s]
[INFO] org.eclipse.rse.subsystems.files.ftp ............... SUCCESS [  0.955 s]
[INFO] org.eclipse.rse.ftp ................................ SUCCESS [  0.376 s]
[INFO] org.eclipse.rse.services.local ..................... SUCCESS [  3.880 s]
[INFO] org.eclipse.rse.subsystems.files.local ............. SUCCESS [  0.882 s]
[INFO] org.eclipse.rse.subsystems.processes.local ......... SUCCESS [  0.933 s]
[INFO] org.eclipse.rse.subsystems.shells.local ............ SUCCESS [  2.125 s]
[INFO] org.eclipse.rse.local .............................. SUCCESS [  0.349 s]
[INFO] org.eclipse.rse.subsystems.files.ssh ............... SUCCESS [  0.967 s]
[INFO] org.eclipse.rse.subsystems.shells.ssh .............. SUCCESS [  0.896 s]
[INFO] org.eclipse.rse.ssh ................................ SUCCESS [  0.225 s]
[INFO] org.eclipse.rse.subsystems.shells.telnet ........... SUCCESS [  1.107 s]
[INFO] org.eclipse.rse.telnet ............................. SUCCESS [  1.344 s]
[INFO] org.eclipse.rse .................................... SUCCESS [  3.252 s]
[INFO] org.eclipse.rse .................................... SUCCESS [  0.399 s]
[INFO] org.eclipse.rse.subsystems.files.scp ............... SUCCESS [  0.901 s]
[INFO] org.eclipse.rse.scp ................................ SUCCESS [  2.346 s]
[INFO] org.eclipse.rse.sdk ................................ SUCCESS [  0.874 s]
[INFO] org.eclipse.rse.sdk ................................ SUCCESS [  0.331 s]
[INFO] org.eclipse.rse.subsystems.terminals.core .......... SUCCESS [  1.082 s]
[INFO] org.eclipse.rse.subsystems.terminals.ssh ........... SUCCESS [  0.724 s]
[INFO] org.eclipse.rse.terminals.ui ....................... SUCCESS [  0.961 s]
[INFO] org.eclipse.rse.terminals .......................... SUCCESS [  0.286 s]
[INFO] org.eclipse.rse.useractions ........................ SUCCESS [  1.317 s]
[INFO] org.eclipse.rse.useractions ........................ SUCCESS [  0.322 s]
[INFO] org.eclipse.rse.useractions.sdk .................... SUCCESS [  0.736 s]
[INFO] org.eclipse.rse.useractions.sdk .................... SUCCESS [  2.898 s]
[INFO] org.eclipse.rse.ui.capabilities .................... SUCCESS [  0.621 s]
[INFO] org.eclipse.tm.rse.tests ........................... SUCCESS [  0.028 s]
[INFO] org.eclipse.rse.tests.framework .................... SUCCESS [  0.744 s]
[INFO] org.eclipse.rse.tests .............................. SUCCESS [01:52 min]
[INFO] org.eclipse.rse.tests .............................. SUCCESS [  0.413 s]
[INFO] org.eclipse.rse.tests.framework.examples ........... SUCCESS [  0.344 s]
[INFO] org.eclipse.tm.rse.site ............................ SUCCESS [  6.878 s]
[INFO] org.eclipse.tm.wince ............................... SUCCESS [  0.033 s]
[INFO] org.eclipse.tm.rapi ................................ SUCCESS [  0.246 s]
[INFO] org.eclipse.rse.subsystems.wince ................... SUCCESS [  0.296 s]
[INFO] org.eclipse.rse.wince .............................. SUCCESS [  0.194 s]
[INFO] ------------------------------------------------------------------------
[INFO] BUILD SUCCESS
[INFO] ------------------------------------------------------------------------
[INFO] Total time: 12:12 min
[INFO] Finished at: 2018-02-21T14:19:36-05:00
[INFO] Final Memory: 132M/1991M
[INFO] ------------------------------------------------------------------------
Terminating xvnc.
Archiving artifacts
append disk usage
Started calculate disk usage of build
Finished Calculation of disk usage of build in 0 seconds
Started calculate disk usage of workspace
Finished Calculation of disk usage of workspace in 0 seconds
Recording test results
Build step 'Publish JUnit test result report' changed build result to UNSTABLE
Skipping calculation of disk usage, it was already done in post build step.
Finished: UNSTABLE