FailedConsole Output

Triggered by Gerrit: https://git.eclipse.org/r/83902
Cleaning the workspace because project is configured to clean the workspace before each build.
Checkout:workspace / /home/hudson/genie.tm/.hudson/jobs/target-management.gerrit/workspace - hudson.remoting.LocalChannel@5506a99f
Using strategy: Default
Last Built Revision: Revision d27e6765f7c5f35f6ba2028ae7617911df23dee0 (origin/master)
Checkout:workspace / /home/hudson/genie.tm/.hudson/jobs/target-management.gerrit/workspace - hudson.remoting.LocalChannel@5506a99f
Cloning the remote Git repository
Cloning repository origin
Fetching upstream changes from git://git.eclipse.org/gitroot/tm/org.eclipse.tm.git
Commencing build of Revision d27e6765f7c5f35f6ba2028ae7617911df23dee0 (origin/master)
Checking out Revision d27e6765f7c5f35f6ba2028ae7617911df23dee0 (origin/master)
Starting xvnc
[workspace] $ Xvnc :374 -geometry 1024x768 -depth 24 -ac
[workspace] $ /bin/sh -x /tmp/genie.tm/hudson2027745842504960829.sh
+ git fetch git://git.eclipse.org/gitroot/tm/org.eclipse.tm refs/changes/02/83902/4
25/10/2016 17:48:07 Xvnc version X.org/xf4vnc custom version
25/10/2016 17:48:07 Copyright (C) 2001-2004 Alan Hourihane.
25/10/2016 17:48:07 Copyright (C) 2000-2004 Constantin Kaplinsky
25/10/2016 17:48:07 Copyright (C) 1999 AT&T Laboratories Cambridge
25/10/2016 17:48:07 All Rights Reserved.
25/10/2016 17:48:07 See http://www.tightvnc.com/ for information on TightVNC
25/10/2016 17:48:07 See http://xf4vnc.sf.net for xf4vnc-specific information
25/10/2016 17:48:07 Desktop name 'x11' (hipp6:374)
25/10/2016 17:48:07 Protocol versions supported: 3.7, 3.3
25/10/2016 17:48:07 RGB format 8 8 8
25/10/2016 17:48:07 Listening for VNC connections on TCP port 6274
[dix] Could not init font path element /usr/share/fonts/TTF/, removing from list!
[dix] Could not init font path element /usr/share/fonts/OTF, removing from list!
(EE) config/hal: NewInputDeviceRequest failed (2)
(EE) config/hal: NewInputDeviceRequest failed (2)
From git://git.eclipse.org/gitroot/tm/org.eclipse.tm
 * branch            refs/changes/02/83902/4 -> FETCH_HEAD
+ git checkout FETCH_HEAD
Previous HEAD position was d27e676... Bump +100 service version of org.eclipse.rse.ui
HEAD is now at 0cf26f2... Update dependencies for Oxygen
+ CODE=0
+ '[' 0 -ne 0 ']'
[INFO] Using bundled Maven 3 installation
[INFO] Checking Maven 3 installation environment
[workspace] $ /home/hudson/genie.tm/.hudson/maven/slavebundle/bundled-maven/bin/mvn --help
[INFO] Checking Maven 3 installation version
[INFO] Detected Maven 3 installation version: 3.1.1
[workspace] $ /home/hudson/genie.tm/.hudson/maven/slavebundle/bundled-maven/bin/mvn clean install -V -B "-DGERRIT_EVENT_ACCOUNT_NAME=Kaloyan Raev" '-DGERRIT_PATCHSET_UPLOADER=\"Kaloyan Raev\" <kaloyan.r@zend.com>' -DGERRIT_CHANGE_URL=https://git.eclipse.org/r/83902 -DGERRIT_CHANGE_ID=I322f493560a2e950185b40bd839329b2353bbce8 -DGERRIT_CHANGE_NUMBER=83902 "-DGERRIT_PATCHSET_UPLOADER_NAME=Kaloyan Raev" "-DGERRIT_CHANGE_SUBJECT=Update dependencies for Oxygen" -DGERRIT_PATCHSET_UPLOADER_EMAIL=kaloyan.r@zend.com -DGERRIT_EVENT_HASH=-897986626 -DGERRIT_BRANCH=master -DGERRIT_REFSPEC=refs/changes/02/83902/4 -DGERRIT_PATCHSET_NUMBER=4 "-DGERRIT_CHANGE_OWNER_NAME=Kaloyan Raev" '-DGERRIT_EVENT_ACCOUNT=\"Kaloyan Raev\" <kaloyan.r@zend.com>' -DGERRIT_EVENT_ACCOUNT_EMAIL=kaloyan.r@zend.com -DGERRIT_PATCHSET_REVISION=0cf26f25cbf9251e2c0791fa62c36ba78d6315bd -DGERRIT_PROJECT=tm/org.eclipse.tm '-DGERRIT_CHANGE_OWNER=\"Kaloyan Raev\" <kaloyan.r@zend.com>' -DGERRIT_CHANGE_OWNER_EMAIL=kaloyan.r@zend.com -Dmaven.test.failure.ignore=true -Dtycho.localArtifacts=ignore -Dmaven.ext.class.path=/home/hudson/genie.tm/.hudson/maven/slavebundle/resources:/home/hudson/genie.tm/.hudson/maven/slavebundle/lib/maven3-eventspy-3.1.jar:/home/hudson/genie.tm/.hudson/war/webapp/WEB-INF/lib/hudson-remoting-3.0.0.jar -Dhudson.eventspy.port=55033 -Dmaven.repo.local=/home/hudson/genie.tm/.hudson/jobs/target-management.gerrit/workspace/.maven/repo -f pom.xml
[DEBUG] Waiting for connection on port: 55033
Apache Maven 3.1.1 (0728685237757ffbf44136acec0402957f723d9a; 2013-09-17 11:22:22-0400)
Maven home: /home/hudson/genie.tm/.hudson/maven/slavebundle/bundled-maven
Java version: 1.7.0_80, vendor: Oracle Corporation
Java home: /opt/public/common/jdk1.7.0_80/jre
Default locale: en_US, platform encoding: UTF-8
OS name: "linux", version: "3.0.101-0.47.71-default", arch: "amd64", family: "unix"
SLF4J: Class path contains multiple SLF4J bindings.
SLF4J: Found binding in [jar:file:/home/hudson/genie.tm/.hudson/maven/slavebundle/lib/maven3-eventspy-runtime.jar!/org/slf4j/impl/StaticLoggerBinder.class]
SLF4J: Found binding in [jar:file:/home/hudson/genie.tm/.hudson/maven/slavebundle/bundled-maven/lib/slf4j-simple-1.7.5.jar!/org/slf4j/impl/StaticLoggerBinder.class]
SLF4J: See http://www.slf4j.org/codes.html#multiple_bindings for an explanation.
[DEBUG] Connected to remote
[INFO] Scanning for projects...
Downloading: https://oss.sonatype.org/content/repositories/public/org/eclipse/tycho/tycho-maven-plugin/0.26.0/tycho-maven-plugin-0.26.0.pom
Downloaded: https://oss.sonatype.org/content/repositories/public/org/eclipse/tycho/tycho-maven-plugin/0.26.0/tycho-maven-plugin-0.26.0.pom (3 KB at 3.2 KB/sec)
Downloading: https://oss.sonatype.org/content/repositories/public/org/eclipse/tycho/tycho/0.26.0/tycho-0.26.0.pom
Downloaded: https://oss.sonatype.org/content/repositories/public/org/eclipse/tycho/tycho/0.26.0/tycho-0.26.0.pom (19 KB at 117.1 KB/sec)
Downloading: https://oss.sonatype.org/content/repositories/public/org/eclipse/tycho/tycho-core/0.26.0/tycho-core-0.26.0.pom
Downloaded: https://oss.sonatype.org/content/repositories/public/org/eclipse/tycho/tycho-core/0.26.0/tycho-core-0.26.0.pom (5 KB at 39.6 KB/sec)
Downloading: https://oss.sonatype.org/content/repositories/public/org/apache/maven/maven-core/3.0/maven-core-3.0.pom
Downloading: https://repo.eclipse.org/content/repositories/cbi-releases/org/apache/maven/maven-core/3.0/maven-core-3.0.pom
Downloading: https://repo.eclipse.org/content/repositories/cbi-snapshots/org/apache/maven/maven-core/3.0/maven-core-3.0.pom
Downloading: http://repo.maven.apache.org/maven2/org/apache/maven/maven-core/3.0/maven-core-3.0.pom
Downloaded: http://repo.maven.apache.org/maven2/org/apache/maven/maven-core/3.0/maven-core-3.0.pom (7 KB at 23.5 KB/sec)
Downloading: https://oss.sonatype.org/content/repositories/public/org/apache/maven/maven/3.0/maven-3.0.pom
Downloading: https://repo.eclipse.org/content/repositories/cbi-releases/org/apache/maven/maven/3.0/maven-3.0.pom
Downloading: https://repo.eclipse.org/content/repositories/cbi-snapshots/org/apache/maven/maven/3.0/maven-3.0.pom
Downloading: http://repo.maven.apache.org/maven2/org/apache/maven/maven/3.0/maven-3.0.pom
Downloaded: http://repo.maven.apache.org/maven2/org/apache/maven/maven/3.0/maven-3.0.pom (22 KB at 62.9 KB/sec)
Downloading: https://oss.sonatype.org/content/repositories/public/org/apache/maven/maven-parent/15/maven-parent-15.pom
Downloading: https://repo.eclipse.org/content/repositories/cbi-releases/org/apache/maven/maven-parent/15/maven-parent-15.pom
Downloading: https://repo.eclipse.org/content/repositories/cbi-snapshots/org/apache/maven/maven-parent/15/maven-parent-15.pom
Downloading: http://repo.maven.apache.org/maven2/org/apache/maven/maven-parent/15/maven-parent-15.pom
Downloaded: http://repo.maven.apache.org/maven2/org/apache/maven/maven-parent/15/maven-parent-15.pom (24 KB at 232.1 KB/sec)
Downloading: https://oss.sonatype.org/content/repositories/public/org/apache/apache/6/apache-6.pom
Downloading: https://repo.eclipse.org/content/repositories/cbi-releases/org/apache/apache/6/apache-6.pom
Downloading: https://repo.eclipse.org/content/repositories/cbi-snapshots/org/apache/apache/6/apache-6.pom
Downloading: http://repo.maven.apache.org/maven2/org/apache/apache/6/apache-6.pom
Downloaded: http://repo.maven.apache.org/maven2/org/apache/apache/6/apache-6.pom (13 KB at 154.3 KB/sec)
Downloading: https://oss.sonatype.org/content/repositories/public/org/apache/maven/maven-model/3.0/maven-model-3.0.pom
Downloading: https://repo.eclipse.org/content/repositories/cbi-releases/org/apache/maven/maven-model/3.0/maven-model-3.0.pom
Downloading: https://repo.eclipse.org/content/repositories/cbi-snapshots/org/apache/maven/maven-model/3.0/maven-model-3.0.pom
Downloading: http://repo.maven.apache.org/maven2/org/apache/maven/maven-model/3.0/maven-model-3.0.pom
Downloaded: http://repo.maven.apache.org/maven2/org/apache/maven/maven-model/3.0/maven-model-3.0.pom (4 KB at 46.4 KB/sec)
Downloading: https://oss.sonatype.org/content/repositories/public/org/codehaus/plexus/plexus-utils/3.0.7/plexus-utils-3.0.7.pom
Downloading: https://repo.eclipse.org/content/repositories/cbi-releases/org/codehaus/plexus/plexus-utils/3.0.7/plexus-utils-3.0.7.pom
Downloading: https://repo.eclipse.org/content/repositories/cbi-snapshots/org/codehaus/plexus/plexus-utils/3.0.7/plexus-utils-3.0.7.pom
Downloading: http://repo.maven.apache.org/maven2/org/codehaus/plexus/plexus-utils/3.0.7/plexus-utils-3.0.7.pom
Downloaded: http://repo.maven.apache.org/maven2/org/codehaus/plexus/plexus-utils/3.0.7/plexus-utils-3.0.7.pom (3 KB at 30.3 KB/sec)
Downloading: https://oss.sonatype.org/content/repositories/public/org/codehaus/plexus/plexus/3.1/plexus-3.1.pom
Downloading: https://repo.eclipse.org/content/repositories/cbi-releases/org/codehaus/plexus/plexus/3.1/plexus-3.1.pom
Downloading: https://repo.eclipse.org/content/repositories/cbi-snapshots/org/codehaus/plexus/plexus/3.1/plexus-3.1.pom
Downloading: http://repo.maven.apache.org/maven2/org/codehaus/plexus/plexus/3.1/plexus-3.1.pom
Downloaded: http://repo.maven.apache.org/maven2/org/codehaus/plexus/plexus/3.1/plexus-3.1.pom (19 KB at 183.6 KB/sec)
Downloading: https://oss.sonatype.org/content/repositories/public/org/sonatype/spice/spice-parent/17/spice-parent-17.pom
Downloading: https://repo.eclipse.org/content/repositories/cbi-releases/org/sonatype/spice/spice-parent/17/spice-parent-17.pom
Downloading: https://repo.eclipse.org/content/repositories/cbi-snapshots/org/sonatype/spice/spice-parent/17/spice-parent-17.pom
Downloading: http://repo.maven.apache.org/maven2/org/sonatype/spice/spice-parent/17/spice-parent-17.pom
Downloaded: http://repo.maven.apache.org/maven2/org/sonatype/spice/spice-parent/17/spice-parent-17.pom (7 KB at 81.5 KB/sec)
Downloading: https://oss.sonatype.org/content/repositories/public/org/sonatype/forge/forge-parent/10/forge-parent-10.pom
Downloading: https://repo.eclipse.org/content/repositories/cbi-releases/org/sonatype/forge/forge-parent/10/forge-parent-10.pom
Downloading: https://repo.eclipse.org/content/repositories/cbi-snapshots/org/sonatype/forge/forge-parent/10/forge-parent-10.pom
Downloading: http://repo.maven.apache.org/maven2/org/sonatype/forge/forge-parent/10/forge-parent-10.pom
Downloaded: http://repo.maven.apache.org/maven2/org/sonatype/forge/forge-parent/10/forge-parent-10.pom (14 KB at 155.8 KB/sec)
Downloading: https://oss.sonatype.org/content/repositories/public/org/apache/maven/maven-settings/3.0/maven-settings-3.0.pom
Downloading: https://repo.eclipse.org/content/repositories/cbi-releases/org/apache/maven/maven-settings/3.0/maven-settings-3.0.pom
Downloading: https://repo.eclipse.org/content/repositories/cbi-snapshots/org/apache/maven/maven-settings/3.0/maven-settings-3.0.pom
Downloading: http://repo.maven.apache.org/maven2/org/apache/maven/maven-settings/3.0/maven-settings-3.0.pom
Downloaded: http://repo.maven.apache.org/maven2/org/apache/maven/maven-settings/3.0/maven-settings-3.0.pom (2 KB at 22.7 KB/sec)
Downloading: https://oss.sonatype.org/content/repositories/public/org/apache/maven/maven-settings-builder/3.0/maven-settings-builder-3.0.pom
Downloading: https://repo.eclipse.org/content/repositories/cbi-releases/org/apache/maven/maven-settings-builder/3.0/maven-settings-builder-3.0.pom
Downloading: https://repo.eclipse.org/content/repositories/cbi-snapshots/org/apache/maven/maven-settings-builder/3.0/maven-settings-builder-3.0.pom
Downloading: http://repo.maven.apache.org/maven2/org/apache/maven/maven-settings-builder/3.0/maven-settings-builder-3.0.pom
Downloaded: http://repo.maven.apache.org/maven2/org/apache/maven/maven-settings-builder/3.0/maven-settings-builder-3.0.pom (3 KB at 26.8 KB/sec)
Downloading: https://oss.sonatype.org/content/repositories/public/org/codehaus/plexus/plexus-interpolation/1.14/plexus-interpolation-1.14.pom
Downloading: https://repo.eclipse.org/content/repositories/cbi-releases/org/codehaus/plexus/plexus-interpolation/1.14/plexus-interpolation-1.14.pom
Downloading: https://repo.eclipse.org/content/repositories/cbi-snapshots/org/codehaus/plexus/plexus-interpolation/1.14/plexus-interpolation-1.14.pom
Downloading: http://repo.maven.apache.org/maven2/org/codehaus/plexus/plexus-interpolation/1.14/plexus-interpolation-1.14.pom
Downloaded: http://repo.maven.apache.org/maven2/org/codehaus/plexus/plexus-interpolation/1.14/plexus-interpolation-1.14.pom (910 B at 11.1 KB/sec)
Downloading: https://oss.sonatype.org/content/repositories/public/org/codehaus/plexus/plexus-components/1.1.18/plexus-components-1.1.18.pom
Downloading: https://repo.eclipse.org/content/repositories/cbi-releases/org/codehaus/plexus/plexus-components/1.1.18/plexus-components-1.1.18.pom
Downloading: https://repo.eclipse.org/content/repositories/cbi-snapshots/org/codehaus/plexus/plexus-components/1.1.18/plexus-components-1.1.18.pom
Downloading: http://repo.maven.apache.org/maven2/org/codehaus/plexus/plexus-components/1.1.18/plexus-components-1.1.18.pom
Downloaded: http://repo.maven.apache.org/maven2/org/codehaus/plexus/plexus-components/1.1.18/plexus-components-1.1.18.pom (6 KB at 63.8 KB/sec)
Downloading: https://oss.sonatype.org/content/repositories/public/org/codehaus/plexus/plexus/2.0.7/plexus-2.0.7.pom
Downloading: https://repo.eclipse.org/content/repositories/cbi-releases/org/codehaus/plexus/plexus/2.0.7/plexus-2.0.7.pom
Downloading: https://repo.eclipse.org/content/repositories/cbi-snapshots/org/codehaus/plexus/plexus/2.0.7/plexus-2.0.7.pom
Downloading: http://repo.maven.apache.org/maven2/org/codehaus/plexus/plexus/2.0.7/plexus-2.0.7.pom
Downloaded: http://repo.maven.apache.org/maven2/org/codehaus/plexus/plexus/2.0.7/plexus-2.0.7.pom (17 KB at 174.1 KB/sec)
Downloading: https://oss.sonatype.org/content/repositories/public/org/codehaus/plexus/plexus-component-annotations/1.5.5/plexus-component-annotations-1.5.5.pom
Downloading: https://repo.eclipse.org/content/repositories/cbi-releases/org/codehaus/plexus/plexus-component-annotations/1.5.5/plexus-component-annotations-1.5.5.pom
Downloading: https://repo.eclipse.org/content/repositories/cbi-snapshots/org/codehaus/plexus/plexus-component-annotations/1.5.5/plexus-component-annotations-1.5.5.pom
Downloading: http://repo.maven.apache.org/maven2/org/codehaus/plexus/plexus-component-annotations/1.5.5/plexus-component-annotations-1.5.5.pom
Downloaded: http://repo.maven.apache.org/maven2/org/codehaus/plexus/plexus-component-annotations/1.5.5/plexus-component-annotations-1.5.5.pom (815 B at 9.3 KB/sec)
Downloading: https://oss.sonatype.org/content/repositories/public/org/codehaus/plexus/plexus-containers/1.5.5/plexus-containers-1.5.5.pom
Downloading: https://repo.eclipse.org/content/repositories/cbi-releases/org/codehaus/plexus/plexus-containers/1.5.5/plexus-containers-1.5.5.pom
Downloading: https://repo.eclipse.org/content/repositories/cbi-snapshots/org/codehaus/plexus/plexus-containers/1.5.5/plexus-containers-1.5.5.pom
Downloading: http://repo.maven.apache.org/maven2/org/codehaus/plexus/plexus-containers/1.5.5/plexus-containers-1.5.5.pom
Downloaded: http://repo.maven.apache.org/maven2/org/codehaus/plexus/plexus-containers/1.5.5/plexus-containers-1.5.5.pom (5 KB at 50.5 KB/sec)
Downloading: https://oss.sonatype.org/content/repositories/public/org/sonatype/plexus/plexus-sec-dispatcher/1.3/plexus-sec-dispatcher-1.3.pom
Downloading: https://repo.eclipse.org/content/repositories/cbi-releases/org/sonatype/plexus/plexus-sec-dispatcher/1.3/plexus-sec-dispatcher-1.3.pom
Downloading: https://repo.eclipse.org/content/repositories/cbi-snapshots/org/sonatype/plexus/plexus-sec-dispatcher/1.3/plexus-sec-dispatcher-1.3.pom
Downloading: http://repo.maven.apache.org/maven2/org/sonatype/plexus/plexus-sec-dispatcher/1.3/plexus-sec-dispatcher-1.3.pom
Downloaded: http://repo.maven.apache.org/maven2/org/sonatype/plexus/plexus-sec-dispatcher/1.3/plexus-sec-dispatcher-1.3.pom (3 KB at 36.1 KB/sec)
Downloading: https://oss.sonatype.org/content/repositories/public/org/sonatype/spice/spice-parent/12/spice-parent-12.pom
Downloading: https://repo.eclipse.org/content/repositories/cbi-releases/org/sonatype/spice/spice-parent/12/spice-parent-12.pom
Downloading: https://repo.eclipse.org/content/repositories/cbi-snapshots/org/sonatype/spice/spice-parent/12/spice-parent-12.pom
Downloading: http://repo.maven.apache.org/maven2/org/sonatype/spice/spice-parent/12/spice-parent-12.pom
Downloaded: http://repo.maven.apache.org/maven2/org/sonatype/spice/spice-parent/12/spice-parent-12.pom (7 KB at 81.0 KB/sec)
Downloading: https://oss.sonatype.org/content/repositories/public/org/sonatype/forge/forge-parent/4/forge-parent-4.pom
Downloading: https://repo.eclipse.org/content/repositories/cbi-releases/org/sonatype/forge/forge-parent/4/forge-parent-4.pom
Downloading: https://repo.eclipse.org/content/repositories/cbi-snapshots/org/sonatype/forge/forge-parent/4/forge-parent-4.pom
Downloading: http://repo.maven.apache.org/maven2/org/sonatype/forge/forge-parent/4/forge-parent-4.pom
Downloaded: http://repo.maven.apache.org/maven2/org/sonatype/forge/forge-parent/4/forge-parent-4.pom (9 KB at 101.2 KB/sec)
Downloading: https://oss.sonatype.org/content/repositories/public/org/sonatype/plexus/plexus-cipher/1.7/plexus-cipher-1.7.pom
Downloading: https://repo.eclipse.org/content/repositories/cbi-releases/org/sonatype/plexus/plexus-cipher/1.7/plexus-cipher-1.7.pom
Downloading: https://repo.eclipse.org/content/repositories/cbi-snapshots/org/sonatype/plexus/plexus-cipher/1.7/plexus-cipher-1.7.pom
Downloading: http://repo.maven.apache.org/maven2/org/sonatype/plexus/plexus-cipher/1.7/plexus-cipher-1.7.pom
Downloaded: http://repo.maven.apache.org/maven2/org/sonatype/plexus/plexus-cipher/1.7/plexus-cipher-1.7.pom (5 KB at 49.1 KB/sec)
Downloading: https://oss.sonatype.org/content/repositories/public/org/sonatype/spice/spice-parent/15/spice-parent-15.pom
Downloading: https://repo.eclipse.org/content/repositories/cbi-releases/org/sonatype/spice/spice-parent/15/spice-parent-15.pom
Downloading: https://repo.eclipse.org/content/repositories/cbi-snapshots/org/sonatype/spice/spice-parent/15/spice-parent-15.pom
Downloading: http://repo.maven.apache.org/maven2/org/sonatype/spice/spice-parent/15/spice-parent-15.pom
Downloaded: http://repo.maven.apache.org/maven2/org/sonatype/spice/spice-parent/15/spice-parent-15.pom (9 KB at 96.0 KB/sec)
Downloading: https://oss.sonatype.org/content/repositories/public/org/sonatype/forge/forge-parent/5/forge-parent-5.pom
Downloading: https://repo.eclipse.org/content/repositories/cbi-releases/org/sonatype/forge/forge-parent/5/forge-parent-5.pom
Downloading: https://repo.eclipse.org/content/repositories/cbi-snapshots/org/sonatype/forge/forge-parent/5/forge-parent-5.pom
Downloading: http://repo.maven.apache.org/maven2/org/sonatype/forge/forge-parent/5/forge-parent-5.pom
Downloaded: http://repo.maven.apache.org/maven2/org/sonatype/forge/forge-parent/5/forge-parent-5.pom (9 KB at 97.2 KB/sec)
Downloading: https://oss.sonatype.org/content/repositories/public/org/apache/maven/maven-repository-metadata/3.0/maven-repository-metadata-3.0.pom
Downloading: https://repo.eclipse.org/content/repositories/cbi-releases/org/apache/maven/maven-repository-metadata/3.0/maven-repository-metadata-3.0.pom
Downloading: https://repo.eclipse.org/content/repositories/cbi-snapshots/org/apache/maven/maven-repository-metadata/3.0/maven-repository-metadata-3.0.pom
Downloading: http://repo.maven.apache.org/maven2/org/apache/maven/maven-repository-metadata/3.0/maven-repository-metadata-3.0.pom
Downloaded: http://repo.maven.apache.org/maven2/org/apache/maven/maven-repository-metadata/3.0/maven-repository-metadata-3.0.pom (2 KB at 23.5 KB/sec)
Downloading: https://oss.sonatype.org/content/repositories/public/org/apache/maven/maven-artifact/3.0/maven-artifact-3.0.pom
Downloading: https://repo.eclipse.org/content/repositories/cbi-releases/org/apache/maven/maven-artifact/3.0/maven-artifact-3.0.pom
Downloading: https://repo.eclipse.org/content/repositories/cbi-snapshots/org/apache/maven/maven-artifact/3.0/maven-artifact-3.0.pom
Downloading: http://repo.maven.apache.org/maven2/org/apache/maven/maven-artifact/3.0/maven-artifact-3.0.pom
Downloaded: http://repo.maven.apache.org/maven2/org/apache/maven/maven-artifact/3.0/maven-artifact-3.0.pom (2 KB at 23.5 KB/sec)
Downloading: https://oss.sonatype.org/content/repositories/public/org/apache/maven/maven-plugin-api/3.0/maven-plugin-api-3.0.pom
Downloading: https://repo.eclipse.org/content/repositories/cbi-releases/org/apache/maven/maven-plugin-api/3.0/maven-plugin-api-3.0.pom
Downloading: https://repo.eclipse.org/content/repositories/cbi-snapshots/org/apache/maven/maven-plugin-api/3.0/maven-plugin-api-3.0.pom
Downloading: http://repo.maven.apache.org/maven2/org/apache/maven/maven-plugin-api/3.0/maven-plugin-api-3.0.pom
Downloaded: http://repo.maven.apache.org/maven2/org/apache/maven/maven-plugin-api/3.0/maven-plugin-api-3.0.pom (3 KB at 28.3 KB/sec)
Downloading: https://oss.sonatype.org/content/repositories/public/org/sonatype/sisu/sisu-inject-plexus/1.4.2/sisu-inject-plexus-1.4.2.pom
Downloading: https://repo.eclipse.org/content/repositories/cbi-releases/org/sonatype/sisu/sisu-inject-plexus/1.4.2/sisu-inject-plexus-1.4.2.pom
Downloading: https://repo.eclipse.org/content/repositories/cbi-snapshots/org/sonatype/sisu/sisu-inject-plexus/1.4.2/sisu-inject-plexus-1.4.2.pom
Downloading: http://repo.maven.apache.org/maven2/org/sonatype/sisu/sisu-inject-plexus/1.4.2/sisu-inject-plexus-1.4.2.pom
Downloaded: http://repo.maven.apache.org/maven2/org/sonatype/sisu/sisu-inject-plexus/1.4.2/sisu-inject-plexus-1.4.2.pom (6 KB at 63.2 KB/sec)
Downloading: https://oss.sonatype.org/content/repositories/public/org/sonatype/sisu/inject/guice-plexus/1.4.2/guice-plexus-1.4.2.pom
Downloading: https://repo.eclipse.org/content/repositories/cbi-releases/org/sonatype/sisu/inject/guice-plexus/1.4.2/guice-plexus-1.4.2.pom
Downloading: https://repo.eclipse.org/content/repositories/cbi-snapshots/org/sonatype/sisu/inject/guice-plexus/1.4.2/guice-plexus-1.4.2.pom
Downloading: http://repo.maven.apache.org/maven2/org/sonatype/sisu/inject/guice-plexus/1.4.2/guice-plexus-1.4.2.pom
Downloaded: http://repo.maven.apache.org/maven2/org/sonatype/sisu/inject/guice-plexus/1.4.2/guice-plexus-1.4.2.pom (4 KB at 37.7 KB/sec)
Downloading: https://oss.sonatype.org/content/repositories/public/org/sonatype/sisu/inject/guice-bean/1.4.2/guice-bean-1.4.2.pom
Downloading: https://repo.eclipse.org/content/repositories/cbi-releases/org/sonatype/sisu/inject/guice-bean/1.4.2/guice-bean-1.4.2.pom
Downloading: https://repo.eclipse.org/content/repositories/cbi-snapshots/org/sonatype/sisu/inject/guice-bean/1.4.2/guice-bean-1.4.2.pom
Downloading: http://repo.maven.apache.org/maven2/org/sonatype/sisu/inject/guice-bean/1.4.2/guice-bean-1.4.2.pom
Downloaded: http://repo.maven.apache.org/maven2/org/sonatype/sisu/inject/guice-bean/1.4.2/guice-bean-1.4.2.pom (3 KB at 31.4 KB/sec)
Downloading: https://oss.sonatype.org/content/repositories/public/org/sonatype/sisu/sisu-inject/1.4.2/sisu-inject-1.4.2.pom
Downloading: https://repo.eclipse.org/content/repositories/cbi-releases/org/sonatype/sisu/sisu-inject/1.4.2/sisu-inject-1.4.2.pom
Downloading: https://repo.eclipse.org/content/repositories/cbi-snapshots/org/sonatype/sisu/sisu-inject/1.4.2/sisu-inject-1.4.2.pom
Downloading: http://repo.maven.apache.org/maven2/org/sonatype/sisu/sisu-inject/1.4.2/sisu-inject-1.4.2.pom
Downloaded: http://repo.maven.apache.org/maven2/org/sonatype/sisu/sisu-inject/1.4.2/sisu-inject-1.4.2.pom (2 KB at 15.2 KB/sec)
Downloading: https://oss.sonatype.org/content/repositories/public/org/sonatype/sisu/sisu-parent/1.4.2/sisu-parent-1.4.2.pom
Downloading: https://repo.eclipse.org/content/repositories/cbi-releases/org/sonatype/sisu/sisu-parent/1.4.2/sisu-parent-1.4.2.pom
Downloading: https://repo.eclipse.org/content/repositories/cbi-snapshots/org/sonatype/sisu/sisu-parent/1.4.2/sisu-parent-1.4.2.pom
Downloading: http://repo.maven.apache.org/maven2/org/sonatype/sisu/sisu-parent/1.4.2/sisu-parent-1.4.2.pom
Downloaded: http://repo.maven.apache.org/maven2/org/sonatype/sisu/sisu-parent/1.4.2/sisu-parent-1.4.2.pom (8 KB at 93.8 KB/sec)
Downloading: https://oss.sonatype.org/content/repositories/public/org/sonatype/forge/forge-parent/6/forge-parent-6.pom
Downloading: https://repo.eclipse.org/content/repositories/cbi-releases/org/sonatype/forge/forge-parent/6/forge-parent-6.pom
Downloading: https://repo.eclipse.org/content/repositories/cbi-snapshots/org/sonatype/forge/forge-parent/6/forge-parent-6.pom
Downloading: http://repo.maven.apache.org/maven2/org/sonatype/forge/forge-parent/6/forge-parent-6.pom
Downloaded: http://repo.maven.apache.org/maven2/org/sonatype/forge/forge-parent/6/forge-parent-6.pom (11 KB at 128.1 KB/sec)
Downloading: https://oss.sonatype.org/content/repositories/public/org/codehaus/plexus/plexus-classworlds/2.2.3/plexus-classworlds-2.2.3.pom
Downloading: https://repo.eclipse.org/content/repositories/cbi-releases/org/codehaus/plexus/plexus-classworlds/2.2.3/plexus-classworlds-2.2.3.pom
Downloading: https://repo.eclipse.org/content/repositories/cbi-snapshots/org/codehaus/plexus/plexus-classworlds/2.2.3/plexus-classworlds-2.2.3.pom
Downloading: http://repo.maven.apache.org/maven2/org/codehaus/plexus/plexus-classworlds/2.2.3/plexus-classworlds-2.2.3.pom
Downloaded: http://repo.maven.apache.org/maven2/org/codehaus/plexus/plexus-classworlds/2.2.3/plexus-classworlds-2.2.3.pom (4 KB at 48.8 KB/sec)
Downloading: https://oss.sonatype.org/content/repositories/public/org/codehaus/plexus/plexus/2.0.6/plexus-2.0.6.pom
Downloading: https://repo.eclipse.org/content/repositories/cbi-releases/org/codehaus/plexus/plexus/2.0.6/plexus-2.0.6.pom
Downloading: https://repo.eclipse.org/content/repositories/cbi-snapshots/org/codehaus/plexus/plexus/2.0.6/plexus-2.0.6.pom
Downloading: http://repo.maven.apache.org/maven2/org/codehaus/plexus/plexus/2.0.6/plexus-2.0.6.pom
Downloaded: http://repo.maven.apache.org/maven2/org/codehaus/plexus/plexus/2.0.6/plexus-2.0.6.pom (17 KB at 168.8 KB/sec)
Downloading: https://oss.sonatype.org/content/repositories/public/org/sonatype/sisu/sisu-inject-bean/1.4.2/sisu-inject-bean-1.4.2.pom
Downloading: https://repo.eclipse.org/content/repositories/cbi-releases/org/sonatype/sisu/sisu-inject-bean/1.4.2/sisu-inject-bean-1.4.2.pom
Downloading: https://repo.eclipse.org/content/repositories/cbi-snapshots/org/sonatype/sisu/sisu-inject-bean/1.4.2/sisu-inject-bean-1.4.2.pom
Downloading: http://repo.maven.apache.org/maven2/org/sonatype/sisu/sisu-inject-bean/1.4.2/sisu-inject-bean-1.4.2.pom
Downloaded: http://repo.maven.apache.org/maven2/org/sonatype/sisu/sisu-inject-bean/1.4.2/sisu-inject-bean-1.4.2.pom (6 KB at 65.8 KB/sec)
Downloading: https://oss.sonatype.org/content/repositories/public/org/sonatype/sisu/sisu-guice/2.1.7/sisu-guice-2.1.7.pom
Downloading: https://repo.eclipse.org/content/repositories/cbi-releases/org/sonatype/sisu/sisu-guice/2.1.7/sisu-guice-2.1.7.pom
Downloading: https://repo.eclipse.org/content/repositories/cbi-snapshots/org/sonatype/sisu/sisu-guice/2.1.7/sisu-guice-2.1.7.pom
Downloading: http://repo.maven.apache.org/maven2/org/sonatype/sisu/sisu-guice/2.1.7/sisu-guice-2.1.7.pom
Downloaded: http://repo.maven.apache.org/maven2/org/sonatype/sisu/sisu-guice/2.1.7/sisu-guice-2.1.7.pom (11 KB at 130.1 KB/sec)
Downloading: https://oss.sonatype.org/content/repositories/public/org/apache/maven/maven-model-builder/3.0/maven-model-builder-3.0.pom
Downloading: https://repo.eclipse.org/content/repositories/cbi-releases/org/apache/maven/maven-model-builder/3.0/maven-model-builder-3.0.pom
Downloading: https://repo.eclipse.org/content/repositories/cbi-snapshots/org/apache/maven/maven-model-builder/3.0/maven-model-builder-3.0.pom
Downloading: http://repo.maven.apache.org/maven2/org/apache/maven/maven-model-builder/3.0/maven-model-builder-3.0.pom
Downloaded: http://repo.maven.apache.org/maven2/org/apache/maven/maven-model-builder/3.0/maven-model-builder-3.0.pom (3 KB at 27.4 KB/sec)
Downloading: https://oss.sonatype.org/content/repositories/public/org/apache/maven/maven-aether-provider/3.0/maven-aether-provider-3.0.pom
Downloading: https://repo.eclipse.org/content/repositories/cbi-releases/org/apache/maven/maven-aether-provider/3.0/maven-aether-provider-3.0.pom
Downloading: https://repo.eclipse.org/content/repositories/cbi-snapshots/org/apache/maven/maven-aether-provider/3.0/maven-aether-provider-3.0.pom
Downloading: http://repo.maven.apache.org/maven2/org/apache/maven/maven-aether-provider/3.0/maven-aether-provider-3.0.pom
Downloaded: http://repo.maven.apache.org/maven2/org/apache/maven/maven-aether-provider/3.0/maven-aether-provider-3.0.pom (3 KB at 30.2 KB/sec)
Downloading: https://oss.sonatype.org/content/repositories/public/org/sonatype/aether/aether-api/1.7/aether-api-1.7.pom
Downloading: https://repo.eclipse.org/content/repositories/cbi-releases/org/sonatype/aether/aether-api/1.7/aether-api-1.7.pom
Downloading: https://repo.eclipse.org/content/repositories/cbi-snapshots/org/sonatype/aether/aether-api/1.7/aether-api-1.7.pom
Downloading: http://repo.maven.apache.org/maven2/org/sonatype/aether/aether-api/1.7/aether-api-1.7.pom
Downloaded: http://repo.maven.apache.org/maven2/org/sonatype/aether/aether-api/1.7/aether-api-1.7.pom (2 KB at 20.4 KB/sec)
Downloading: https://oss.sonatype.org/content/repositories/public/org/sonatype/aether/aether-parent/1.7/aether-parent-1.7.pom
Downloading: https://repo.eclipse.org/content/repositories/cbi-releases/org/sonatype/aether/aether-parent/1.7/aether-parent-1.7.pom
Downloading: https://repo.eclipse.org/content/repositories/cbi-snapshots/org/sonatype/aether/aether-parent/1.7/aether-parent-1.7.pom
Downloading: http://repo.maven.apache.org/maven2/org/sonatype/aether/aether-parent/1.7/aether-parent-1.7.pom
Downloaded: http://repo.maven.apache.org/maven2/org/sonatype/aether/aether-parent/1.7/aether-parent-1.7.pom (8 KB at 93.1 KB/sec)
Downloading: https://oss.sonatype.org/content/repositories/public/org/sonatype/aether/aether-util/1.7/aether-util-1.7.pom
Downloading: https://repo.eclipse.org/content/repositories/cbi-releases/org/sonatype/aether/aether-util/1.7/aether-util-1.7.pom
Downloading: https://repo.eclipse.org/content/repositories/cbi-snapshots/org/sonatype/aether/aether-util/1.7/aether-util-1.7.pom
Downloading: http://repo.maven.apache.org/maven2/org/sonatype/aether/aether-util/1.7/aether-util-1.7.pom
Downloaded: http://repo.maven.apache.org/maven2/org/sonatype/aether/aether-util/1.7/aether-util-1.7.pom (3 KB at 24.9 KB/sec)
Downloading: https://oss.sonatype.org/content/repositories/public/org/sonatype/aether/aether-impl/1.7/aether-impl-1.7.pom
Downloading: https://repo.eclipse.org/content/repositories/cbi-releases/org/sonatype/aether/aether-impl/1.7/aether-impl-1.7.pom
Downloading: https://repo.eclipse.org/content/repositories/cbi-snapshots/org/sonatype/aether/aether-impl/1.7/aether-impl-1.7.pom
Downloading: http://repo.maven.apache.org/maven2/org/sonatype/aether/aether-impl/1.7/aether-impl-1.7.pom
Downloaded: http://repo.maven.apache.org/maven2/org/sonatype/aether/aether-impl/1.7/aether-impl-1.7.pom (4 KB at 45.1 KB/sec)
Downloading: https://oss.sonatype.org/content/repositories/public/org/sonatype/aether/aether-spi/1.7/aether-spi-1.7.pom
Downloading: https://repo.eclipse.org/content/repositories/cbi-releases/org/sonatype/aether/aether-spi/1.7/aether-spi-1.7.pom
Downloading: https://repo.eclipse.org/content/repositories/cbi-snapshots/org/sonatype/aether/aether-spi/1.7/aether-spi-1.7.pom
Downloading: http://repo.maven.apache.org/maven2/org/sonatype/aether/aether-spi/1.7/aether-spi-1.7.pom
Downloaded: http://repo.maven.apache.org/maven2/org/sonatype/aether/aether-spi/1.7/aether-spi-1.7.pom (2 KB at 21.3 KB/sec)
Downloading: https://oss.sonatype.org/content/repositories/public/org/codehaus/plexus/plexus-archiver/2.9.1/plexus-archiver-2.9.1.pom
Downloading: https://repo.eclipse.org/content/repositories/cbi-releases/org/codehaus/plexus/plexus-archiver/2.9.1/plexus-archiver-2.9.1.pom
Downloading: https://repo.eclipse.org/content/repositories/cbi-snapshots/org/codehaus/plexus/plexus-archiver/2.9.1/plexus-archiver-2.9.1.pom
Downloading: http://repo.maven.apache.org/maven2/org/codehaus/plexus/plexus-archiver/2.9.1/plexus-archiver-2.9.1.pom
Downloaded: http://repo.maven.apache.org/maven2/org/codehaus/plexus/plexus-archiver/2.9.1/plexus-archiver-2.9.1.pom (5 KB at 52.1 KB/sec)
Downloading: https://oss.sonatype.org/content/repositories/public/org/codehaus/plexus/plexus-components/1.3/plexus-components-1.3.pom
Downloading: https://repo.eclipse.org/content/repositories/cbi-releases/org/codehaus/plexus/plexus-components/1.3/plexus-components-1.3.pom
Downloading: https://repo.eclipse.org/content/repositories/cbi-snapshots/org/codehaus/plexus/plexus-components/1.3/plexus-components-1.3.pom
Downloading: http://repo.maven.apache.org/maven2/org/codehaus/plexus/plexus-components/1.3/plexus-components-1.3.pom
Downloaded: http://repo.maven.apache.org/maven2/org/codehaus/plexus/plexus-components/1.3/plexus-components-1.3.pom (3 KB at 36.9 KB/sec)
Downloading: https://oss.sonatype.org/content/repositories/public/org/codehaus/plexus/plexus/3.3/plexus-3.3.pom
Downloading: https://repo.eclipse.org/content/repositories/cbi-releases/org/codehaus/plexus/plexus/3.3/plexus-3.3.pom
Downloading: https://repo.eclipse.org/content/repositories/cbi-snapshots/org/codehaus/plexus/plexus/3.3/plexus-3.3.pom
Downloading: http://repo.maven.apache.org/maven2/org/codehaus/plexus/plexus/3.3/plexus-3.3.pom
Downloaded: http://repo.maven.apache.org/maven2/org/codehaus/plexus/plexus/3.3/plexus-3.3.pom (20 KB at 194.3 KB/sec)
Downloading: https://oss.sonatype.org/content/repositories/public/org/codehaus/plexus/plexus-io/2.4.1/plexus-io-2.4.1.pom
Downloading: https://repo.eclipse.org/content/repositories/cbi-releases/org/codehaus/plexus/plexus-io/2.4.1/plexus-io-2.4.1.pom
Downloading: https://repo.eclipse.org/content/repositories/cbi-snapshots/org/codehaus/plexus/plexus-io/2.4.1/plexus-io-2.4.1.pom
Downloading: http://repo.maven.apache.org/maven2/org/codehaus/plexus/plexus-io/2.4.1/plexus-io-2.4.1.pom
Downloaded: http://repo.maven.apache.org/maven2/org/codehaus/plexus/plexus-io/2.4.1/plexus-io-2.4.1.pom (4 KB at 45.6 KB/sec)
Downloading: https://oss.sonatype.org/content/repositories/public/org/codehaus/plexus/plexus-components/1.2/plexus-components-1.2.pom
Downloading: https://repo.eclipse.org/content/repositories/cbi-releases/org/codehaus/plexus/plexus-components/1.2/plexus-components-1.2.pom
Downloading: https://repo.eclipse.org/content/repositories/cbi-snapshots/org/codehaus/plexus/plexus-components/1.2/plexus-components-1.2.pom
Downloading: http://repo.maven.apache.org/maven2/org/codehaus/plexus/plexus-components/1.2/plexus-components-1.2.pom
Downloaded: http://repo.maven.apache.org/maven2/org/codehaus/plexus/plexus-components/1.2/plexus-components-1.2.pom (3 KB at 36.9 KB/sec)
Downloading: https://oss.sonatype.org/content/repositories/public/org/codehaus/plexus/plexus/3.2/plexus-3.2.pom
Downloading: https://repo.eclipse.org/content/repositories/cbi-releases/org/codehaus/plexus/plexus/3.2/plexus-3.2.pom
Downloading: https://repo.eclipse.org/content/repositories/cbi-snapshots/org/codehaus/plexus/plexus/3.2/plexus-3.2.pom
Downloading: http://repo.maven.apache.org/maven2/org/codehaus/plexus/plexus/3.2/plexus-3.2.pom
Downloaded: http://repo.maven.apache.org/maven2/org/codehaus/plexus/plexus/3.2/plexus-3.2.pom (19 KB at 186.8 KB/sec)
Downloading: https://oss.sonatype.org/content/repositories/public/commons-io/commons-io/2.2/commons-io-2.2.pom
Downloading: https://repo.eclipse.org/content/repositories/cbi-releases/commons-io/commons-io/2.2/commons-io-2.2.pom
Downloading: https://repo.eclipse.org/content/repositories/cbi-snapshots/commons-io/commons-io/2.2/commons-io-2.2.pom
Downloading: http://repo.maven.apache.org/maven2/commons-io/commons-io/2.2/commons-io-2.2.pom
Downloaded: http://repo.maven.apache.org/maven2/commons-io/commons-io/2.2/commons-io-2.2.pom (11 KB at 133.0 KB/sec)
Downloading: https://oss.sonatype.org/content/repositories/public/org/apache/commons/commons-parent/24/commons-parent-24.pom
Downloading: https://repo.eclipse.org/content/repositories/cbi-releases/org/apache/commons/commons-parent/24/commons-parent-24.pom
Downloading: https://repo.eclipse.org/content/repositories/cbi-snapshots/org/apache/commons/commons-parent/24/commons-parent-24.pom
Downloading: http://repo.maven.apache.org/maven2/org/apache/commons/commons-parent/24/commons-parent-24.pom
Downloaded: http://repo.maven.apache.org/maven2/org/apache/commons/commons-parent/24/commons-parent-24.pom (47 KB at 401.4 KB/sec)
Downloading: https://oss.sonatype.org/content/repositories/public/org/apache/apache/9/apache-9.pom
Downloading: https://repo.eclipse.org/content/repositories/cbi-releases/org/apache/apache/9/apache-9.pom
Downloading: https://repo.eclipse.org/content/repositories/cbi-snapshots/org/apache/apache/9/apache-9.pom
Downloading: http://repo.maven.apache.org/maven2/org/apache/apache/9/apache-9.pom
Downloaded: http://repo.maven.apache.org/maven2/org/apache/apache/9/apache-9.pom (15 KB at 154.2 KB/sec)
Downloading: https://oss.sonatype.org/content/repositories/public/org/apache/commons/commons-compress/1.9/commons-compress-1.9.pom
Downloading: https://repo.eclipse.org/content/repositories/cbi-releases/org/apache/commons/commons-compress/1.9/commons-compress-1.9.pom
Downloading: https://repo.eclipse.org/content/repositories/cbi-snapshots/org/apache/commons/commons-compress/1.9/commons-compress-1.9.pom
Downloading: http://repo.maven.apache.org/maven2/org/apache/commons/commons-compress/1.9/commons-compress-1.9.pom
Downloaded: http://repo.maven.apache.org/maven2/org/apache/commons/commons-compress/1.9/commons-compress-1.9.pom (12 KB at 137.8 KB/sec)
Downloading: https://oss.sonatype.org/content/repositories/public/org/apache/commons/commons-parent/34/commons-parent-34.pom
Downloading: https://repo.eclipse.org/content/repositories/cbi-releases/org/apache/commons/commons-parent/34/commons-parent-34.pom
Downloading: https://repo.eclipse.org/content/repositories/cbi-snapshots/org/apache/commons/commons-parent/34/commons-parent-34.pom
Downloading: http://repo.maven.apache.org/maven2/org/apache/commons/commons-parent/34/commons-parent-34.pom
Downloaded: http://repo.maven.apache.org/maven2/org/apache/commons/commons-parent/34/commons-parent-34.pom (55 KB at 466.9 KB/sec)
Downloading: https://oss.sonatype.org/content/repositories/public/org/apache/apache/13/apache-13.pom
Downloading: https://repo.eclipse.org/content/repositories/cbi-releases/org/apache/apache/13/apache-13.pom
Downloading: https://repo.eclipse.org/content/repositories/cbi-snapshots/org/apache/apache/13/apache-13.pom
Downloading: http://repo.maven.apache.org/maven2/org/apache/apache/13/apache-13.pom
Downloaded: http://repo.maven.apache.org/maven2/org/apache/apache/13/apache-13.pom (14 KB at 168.5 KB/sec)
Downloading: https://oss.sonatype.org/content/repositories/public/org/eclipse/tycho/org.eclipse.osgi.compatibility.state/1.0.200.v20160504-1419/org.eclipse.osgi.compatibility.state-1.0.200.v20160504-1419.pom
Downloaded: https://oss.sonatype.org/content/repositories/public/org/eclipse/tycho/org.eclipse.osgi.compatibility.state/1.0.200.v20160504-1419/org.eclipse.osgi.compatibility.state-1.0.200.v20160504-1419.pom (2 KB at 4.1 KB/sec)
Downloading: https://oss.sonatype.org/content/repositories/public/org/eclipse/tycho/sisu-equinox-embedder/0.26.0/sisu-equinox-embedder-0.26.0.pom
Downloaded: https://oss.sonatype.org/content/repositories/public/org/eclipse/tycho/sisu-equinox-embedder/0.26.0/sisu-equinox-embedder-0.26.0.pom (2 KB at 16.3 KB/sec)
Downloading: https://oss.sonatype.org/content/repositories/public/org/eclipse/tycho/sisu-equinox/0.26.0/sisu-equinox-0.26.0.pom
Downloaded: https://oss.sonatype.org/content/repositories/public/org/eclipse/tycho/sisu-equinox/0.26.0/sisu-equinox-0.26.0.pom (2 KB at 9.5 KB/sec)
Downloading: https://oss.sonatype.org/content/repositories/public/org/eclipse/tycho/org.eclipse.osgi/3.11.0.v20160603-1336/org.eclipse.osgi-3.11.0.v20160603-1336.pom
Downloaded: https://oss.sonatype.org/content/repositories/public/org/eclipse/tycho/org.eclipse.osgi/3.11.0.v20160603-1336/org.eclipse.osgi-3.11.0.v20160603-1336.pom (2 KB at 9.0 KB/sec)
Downloading: https://oss.sonatype.org/content/repositories/public/org/eclipse/tycho/sisu-equinox-api/0.26.0/sisu-equinox-api-0.26.0.pom
Downloaded: https://oss.sonatype.org/content/repositories/public/org/eclipse/tycho/sisu-equinox-api/0.26.0/sisu-equinox-api-0.26.0.pom (2 KB at 15.8 KB/sec)
Downloading: https://oss.sonatype.org/content/repositories/public/org/eclipse/tycho/tycho-metadata-model/0.26.0/tycho-metadata-model-0.26.0.pom
Downloaded: https://oss.sonatype.org/content/repositories/public/org/eclipse/tycho/tycho-metadata-model/0.26.0/tycho-metadata-model-0.26.0.pom (2 KB at 10.0 KB/sec)
Downloading: https://oss.sonatype.org/content/repositories/public/de/pdark/decentxml/1.3/decentxml-1.3.pom
Downloaded: https://oss.sonatype.org/content/repositories/public/de/pdark/decentxml/1.3/decentxml-1.3.pom (7 KB at 60.0 KB/sec)
Downloading: https://oss.sonatype.org/content/repositories/public/org/eclipse/tycho/tycho-embedder-api/0.26.0/tycho-embedder-api-0.26.0.pom
Downloaded: https://oss.sonatype.org/content/repositories/public/org/eclipse/tycho/tycho-embedder-api/0.26.0/tycho-embedder-api-0.26.0.pom (3 KB at 19.3 KB/sec)
Downloading: https://oss.sonatype.org/content/repositories/public/org/eclipse/tycho/org.eclipse.tycho.embedder.shared/0.26.0/org.eclipse.tycho.embedder.shared-0.26.0.pom
Downloaded: https://oss.sonatype.org/content/repositories/public/org/eclipse/tycho/org.eclipse.tycho.embedder.shared/0.26.0/org.eclipse.tycho.embedder.shared-0.26.0.pom (2 KB at 9.6 KB/sec)
Downloading: https://oss.sonatype.org/content/repositories/public/org/eclipse/tycho/tycho-bundles/0.26.0/tycho-bundles-0.26.0.pom
Downloaded: https://oss.sonatype.org/content/repositories/public/org/eclipse/tycho/tycho-bundles/0.26.0/tycho-bundles-0.26.0.pom (4 KB at 29.1 KB/sec)
Downloading: https://oss.sonatype.org/content/repositories/public/org/eclipse/tycho/org.eclipse.tycho.core.shared/0.26.0/org.eclipse.tycho.core.shared-0.26.0.pom
Downloaded: https://oss.sonatype.org/content/repositories/public/org/eclipse/tycho/org.eclipse.tycho.core.shared/0.26.0/org.eclipse.tycho.core.shared-0.26.0.pom (2 KB at 9.5 KB/sec)
Downloading: https://oss.sonatype.org/content/repositories/public/org/eclipse/tycho/tycho-p2-facade/0.26.0/tycho-p2-facade-0.26.0.pom
Downloaded: https://oss.sonatype.org/content/repositories/public/org/eclipse/tycho/tycho-p2-facade/0.26.0/tycho-p2-facade-0.26.0.pom (3 KB at 19.1 KB/sec)
Downloading: https://oss.sonatype.org/content/repositories/public/org/eclipse/tycho/tycho-p2/0.26.0/tycho-p2-0.26.0.pom
Downloaded: https://oss.sonatype.org/content/repositories/public/org/eclipse/tycho/tycho-p2/0.26.0/tycho-p2-0.26.0.pom (2 KB at 9.3 KB/sec)
Downloading: https://oss.sonatype.org/content/repositories/public/org/eclipse/tycho/org.eclipse.tycho.p2.resolver.shared/0.26.0/org.eclipse.tycho.p2.resolver.shared-0.26.0.pom
Downloaded: https://oss.sonatype.org/content/repositories/public/org/eclipse/tycho/org.eclipse.tycho.p2.resolver.shared/0.26.0/org.eclipse.tycho.p2.resolver.shared-0.26.0.pom (2 KB at 9.0 KB/sec)
Downloading: https://oss.sonatype.org/content/repositories/public/org/eclipse/tycho/org.eclipse.tycho.p2.tools.shared/0.26.0/org.eclipse.tycho.p2.tools.shared-0.26.0.pom
Downloaded: https://oss.sonatype.org/content/repositories/public/org/eclipse/tycho/org.eclipse.tycho.p2.tools.shared/0.26.0/org.eclipse.tycho.p2.tools.shared-0.26.0.pom (2 KB at 9.5 KB/sec)
Downloading: https://oss.sonatype.org/content/repositories/public/org/eclipse/tycho/tycho-maven-plugin/0.26.0/tycho-maven-plugin-0.26.0.jar
Downloading: https://oss.sonatype.org/content/repositories/public/org/eclipse/tycho/tycho-core/0.26.0/tycho-core-0.26.0.jar
Downloading: https://oss.sonatype.org/content/repositories/public/org/sonatype/aether/aether-util/1.7/aether-util-1.7.jar
Downloading: https://oss.sonatype.org/content/repositories/public/org/sonatype/sisu/sisu-inject-bean/1.4.2/sisu-inject-bean-1.4.2.jar
Downloading: https://oss.sonatype.org/content/repositories/public/org/sonatype/sisu/sisu-guice/2.1.7/sisu-guice-2.1.7-noaop.jar
Downloaded: https://oss.sonatype.org/content/repositories/public/org/eclipse/tycho/tycho-maven-plugin/0.26.0/tycho-maven-plugin-0.26.0.jar (6 KB at 48.7 KB/sec)
Downloading: https://oss.sonatype.org/content/repositories/public/org/codehaus/plexus/plexus-interpolation/1.14/plexus-interpolation-1.14.jar
Downloading: https://oss.sonatype.org/content/repositories/public/org/sonatype/plexus/plexus-sec-dispatcher/1.3/plexus-sec-dispatcher-1.3.jar
Downloading: https://oss.sonatype.org/content/repositories/public/org/sonatype/plexus/plexus-cipher/1.7/plexus-cipher-1.7.jar
Downloading: https://oss.sonatype.org/content/repositories/public/org/codehaus/plexus/plexus-utils/3.0.7/plexus-utils-3.0.7.jar
Downloading: https://oss.sonatype.org/content/repositories/public/org/codehaus/plexus/plexus-archiver/2.9.1/plexus-archiver-2.9.1.jar
Downloading: https://oss.sonatype.org/content/repositories/public/org/codehaus/plexus/plexus-io/2.4.1/plexus-io-2.4.1.jar
Downloading: https://oss.sonatype.org/content/repositories/public/commons-io/commons-io/2.2/commons-io-2.2.jar
Downloading: https://oss.sonatype.org/content/repositories/public/org/apache/commons/commons-compress/1.9/commons-compress-1.9.jar
Downloading: https://oss.sonatype.org/content/repositories/public/org/eclipse/tycho/org.eclipse.osgi.compatibility.state/1.0.200.v20160504-1419/org.eclipse.osgi.compatibility.state-1.0.200.v20160504-1419.jar
Downloaded: https://oss.sonatype.org/content/repositories/public/org/eclipse/tycho/tycho-core/0.26.0/tycho-core-0.26.0.jar (191 KB at 504.8 KB/sec)
Downloading: https://oss.sonatype.org/content/repositories/public/org/eclipse/tycho/sisu-equinox-embedder/0.26.0/sisu-equinox-embedder-0.26.0.jar
Downloading: https://oss.sonatype.org/content/repositories/public/org/eclipse/tycho/org.eclipse.osgi/3.11.0.v20160603-1336/org.eclipse.osgi-3.11.0.v20160603-1336.jar
Downloading: https://oss.sonatype.org/content/repositories/public/org/eclipse/tycho/sisu-equinox-api/0.26.0/sisu-equinox-api-0.26.0.jar
Downloading: https://oss.sonatype.org/content/repositories/public/org/eclipse/tycho/tycho-metadata-model/0.26.0/tycho-metadata-model-0.26.0.jar
Downloaded: https://oss.sonatype.org/content/repositories/public/org/eclipse/tycho/sisu-equinox-embedder/0.26.0/sisu-equinox-embedder-0.26.0.jar (13 KB at 127.9 KB/sec)
Downloading: https://oss.sonatype.org/content/repositories/public/de/pdark/decentxml/1.3/decentxml-1.3.jar
Downloaded: https://oss.sonatype.org/content/repositories/public/org/eclipse/tycho/sisu-equinox-api/0.26.0/sisu-equinox-api-0.26.0.jar (4 KB at 15.9 KB/sec)
Downloading: https://oss.sonatype.org/content/repositories/public/org/eclipse/tycho/tycho-embedder-api/0.26.0/tycho-embedder-api-0.26.0.jar
Downloaded: https://oss.sonatype.org/content/repositories/public/de/pdark/decentxml/1.3/decentxml-1.3.jar (109 KB at 605.3 KB/sec)
Downloading: https://oss.sonatype.org/content/repositories/public/org/eclipse/tycho/org.eclipse.tycho.embedder.shared/0.26.0/org.eclipse.tycho.embedder.shared-0.26.0.jar
Downloaded: https://oss.sonatype.org/content/repositories/public/org/eclipse/tycho/tycho-metadata-model/0.26.0/tycho-metadata-model-0.26.0.jar (36 KB at 123.5 KB/sec)
Downloading: https://oss.sonatype.org/content/repositories/public/org/eclipse/tycho/org.eclipse.tycho.core.shared/0.26.0/org.eclipse.tycho.core.shared-0.26.0.jar
Downloaded: https://oss.sonatype.org/content/repositories/public/org/eclipse/tycho/tycho-embedder-api/0.26.0/tycho-embedder-api-0.26.0.jar (7 KB at 64.0 KB/sec)
Downloading: https://oss.sonatype.org/content/repositories/public/org/eclipse/tycho/tycho-p2-facade/0.26.0/tycho-p2-facade-0.26.0.jar
Downloaded: https://oss.sonatype.org/content/repositories/public/org/eclipse/tycho/org.eclipse.tycho.embedder.shared/0.26.0/org.eclipse.tycho.embedder.shared-0.26.0.jar (10 KB at 90.1 KB/sec)
Downloading: https://oss.sonatype.org/content/repositories/public/org/codehaus/plexus/plexus-component-annotations/1.5.5/plexus-component-annotations-1.5.5.jar
Downloaded: https://oss.sonatype.org/content/repositories/public/org/eclipse/tycho/org.eclipse.osgi.compatibility.state/1.0.200.v20160504-1419/org.eclipse.osgi.compatibility.state-1.0.200.v20160504-1419.jar (239 KB at 493.4 KB/sec)
Downloading: https://oss.sonatype.org/content/repositories/public/org/eclipse/tycho/org.eclipse.tycho.p2.resolver.shared/0.26.0/org.eclipse.tycho.p2.resolver.shared-0.26.0.jar
Downloading: https://oss.sonatype.org/content/repositories/public/org/eclipse/tycho/org.eclipse.tycho.p2.tools.shared/0.26.0/org.eclipse.tycho.p2.tools.shared-0.26.0.jar
Downloaded: https://oss.sonatype.org/content/repositories/public/org/eclipse/tycho/tycho-p2-facade/0.26.0/tycho-p2-facade-0.26.0.jar (34 KB at 238.4 KB/sec)
Downloaded: https://oss.sonatype.org/content/repositories/public/org/eclipse/tycho/org.eclipse.tycho.core.shared/0.26.0/org.eclipse.tycho.core.shared-0.26.0.jar (37 KB at 207.7 KB/sec)
Downloaded: https://oss.sonatype.org/content/repositories/public/org/eclipse/tycho/org.eclipse.tycho.p2.resolver.shared/0.26.0/org.eclipse.tycho.p2.resolver.shared-0.26.0.jar (27 KB at 247.7 KB/sec)
Downloaded: https://oss.sonatype.org/content/repositories/public/org/eclipse/tycho/org.eclipse.tycho.p2.tools.shared/0.26.0/org.eclipse.tycho.p2.tools.shared-0.26.0.jar (21 KB at 80.5 KB/sec)
Downloaded: https://oss.sonatype.org/content/repositories/public/org/eclipse/tycho/org.eclipse.osgi/3.11.0.v20160603-1336/org.eclipse.osgi-3.11.0.v20160603-1336.jar (1352 KB at 1939.5 KB/sec)
Downloading: https://repo.eclipse.org/content/repositories/cbi-releases/org/sonatype/aether/aether-util/1.7/aether-util-1.7.jar
Downloading: https://repo.eclipse.org/content/repositories/cbi-releases/org/sonatype/sisu/sisu-inject-bean/1.4.2/sisu-inject-bean-1.4.2.jar
Downloading: https://repo.eclipse.org/content/repositories/cbi-releases/org/sonatype/sisu/sisu-guice/2.1.7/sisu-guice-2.1.7-noaop.jar
Downloading: https://repo.eclipse.org/content/repositories/cbi-releases/org/codehaus/plexus/plexus-interpolation/1.14/plexus-interpolation-1.14.jar
Downloading: https://repo.eclipse.org/content/repositories/cbi-releases/org/sonatype/plexus/plexus-sec-dispatcher/1.3/plexus-sec-dispatcher-1.3.jar
Downloading: https://repo.eclipse.org/content/repositories/cbi-releases/org/sonatype/plexus/plexus-cipher/1.7/plexus-cipher-1.7.jar
Downloading: https://repo.eclipse.org/content/repositories/cbi-releases/org/codehaus/plexus/plexus-utils/3.0.7/plexus-utils-3.0.7.jar
Downloading: https://repo.eclipse.org/content/repositories/cbi-releases/org/codehaus/plexus/plexus-archiver/2.9.1/plexus-archiver-2.9.1.jar
Downloading: https://repo.eclipse.org/content/repositories/cbi-releases/org/codehaus/plexus/plexus-io/2.4.1/plexus-io-2.4.1.jar
Downloading: https://repo.eclipse.org/content/repositories/cbi-releases/commons-io/commons-io/2.2/commons-io-2.2.jar
Downloading: https://repo.eclipse.org/content/repositories/cbi-releases/org/apache/commons/commons-compress/1.9/commons-compress-1.9.jar
Downloading: https://repo.eclipse.org/content/repositories/cbi-releases/org/codehaus/plexus/plexus-component-annotations/1.5.5/plexus-component-annotations-1.5.5.jar
Downloading: https://repo.eclipse.org/content/repositories/cbi-snapshots/org/sonatype/aether/aether-util/1.7/aether-util-1.7.jar
Downloading: https://repo.eclipse.org/content/repositories/cbi-snapshots/org/sonatype/sisu/sisu-inject-bean/1.4.2/sisu-inject-bean-1.4.2.jar
Downloading: https://repo.eclipse.org/content/repositories/cbi-snapshots/org/sonatype/sisu/sisu-guice/2.1.7/sisu-guice-2.1.7-noaop.jar
Downloading: https://repo.eclipse.org/content/repositories/cbi-snapshots/org/sonatype/plexus/plexus-sec-dispatcher/1.3/plexus-sec-dispatcher-1.3.jar
Downloading: https://repo.eclipse.org/content/repositories/cbi-snapshots/org/codehaus/plexus/plexus-interpolation/1.14/plexus-interpolation-1.14.jar
Downloading: https://repo.eclipse.org/content/repositories/cbi-snapshots/org/sonatype/plexus/plexus-cipher/1.7/plexus-cipher-1.7.jar
Downloading: https://repo.eclipse.org/content/repositories/cbi-snapshots/org/codehaus/plexus/plexus-utils/3.0.7/plexus-utils-3.0.7.jar
Downloading: https://repo.eclipse.org/content/repositories/cbi-snapshots/org/codehaus/plexus/plexus-archiver/2.9.1/plexus-archiver-2.9.1.jar
Downloading: https://repo.eclipse.org/content/repositories/cbi-snapshots/org/codehaus/plexus/plexus-io/2.4.1/plexus-io-2.4.1.jar
Downloading: https://repo.eclipse.org/content/repositories/cbi-snapshots/commons-io/commons-io/2.2/commons-io-2.2.jar
Downloading: https://repo.eclipse.org/content/repositories/cbi-snapshots/org/apache/commons/commons-compress/1.9/commons-compress-1.9.jar
Downloading: https://repo.eclipse.org/content/repositories/cbi-snapshots/org/codehaus/plexus/plexus-component-annotations/1.5.5/plexus-component-annotations-1.5.5.jar
Downloading: http://repo.maven.apache.org/maven2/org/sonatype/aether/aether-util/1.7/aether-util-1.7.jar
Downloading: http://repo.maven.apache.org/maven2/org/sonatype/sisu/sisu-inject-bean/1.4.2/sisu-inject-bean-1.4.2.jar
Downloading: http://repo.maven.apache.org/maven2/org/sonatype/sisu/sisu-guice/2.1.7/sisu-guice-2.1.7-noaop.jar
Downloading: http://repo.maven.apache.org/maven2/org/codehaus/plexus/plexus-interpolation/1.14/plexus-interpolation-1.14.jar
Downloading: http://repo.maven.apache.org/maven2/org/sonatype/plexus/plexus-sec-dispatcher/1.3/plexus-sec-dispatcher-1.3.jar
Downloaded: http://repo.maven.apache.org/maven2/org/sonatype/plexus/plexus-sec-dispatcher/1.3/plexus-sec-dispatcher-1.3.jar (28 KB at 273.4 KB/sec)
Downloading: http://repo.maven.apache.org/maven2/org/sonatype/plexus/plexus-cipher/1.7/plexus-cipher-1.7.jar
Downloaded: http://repo.maven.apache.org/maven2/org/sonatype/aether/aether-util/1.7/aether-util-1.7.jar (106 KB at 769.5 KB/sec)
Downloading: http://repo.maven.apache.org/maven2/org/codehaus/plexus/plexus-utils/3.0.7/plexus-utils-3.0.7.jar
Downloaded: http://repo.maven.apache.org/maven2/org/sonatype/sisu/sisu-inject-bean/1.4.2/sisu-inject-bean-1.4.2.jar (150 KB at 970.2 KB/sec)
Downloading: http://repo.maven.apache.org/maven2/org/codehaus/plexus/plexus-archiver/2.9.1/plexus-archiver-2.9.1.jar
Downloaded: http://repo.maven.apache.org/maven2/org/codehaus/plexus/plexus-interpolation/1.14/plexus-interpolation-1.14.jar (60 KB at 338.9 KB/sec)
Downloading: http://repo.maven.apache.org/maven2/org/codehaus/plexus/plexus-io/2.4.1/plexus-io-2.4.1.jar
Downloaded: http://repo.maven.apache.org/maven2/org/sonatype/plexus/plexus-cipher/1.7/plexus-cipher-1.7.jar (14 KB at 165.0 KB/sec)
Downloading: http://repo.maven.apache.org/maven2/commons-io/commons-io/2.2/commons-io-2.2.jar
Downloaded: http://repo.maven.apache.org/maven2/org/codehaus/plexus/plexus-archiver/2.9.1/plexus-archiver-2.9.1.jar (142 KB at 1006.9 KB/sec)
Downloading: http://repo.maven.apache.org/maven2/org/apache/commons/commons-compress/1.9/commons-compress-1.9.jar
Downloaded: http://repo.maven.apache.org/maven2/org/sonatype/sisu/sisu-guice/2.1.7/sisu-guice-2.1.7-noaop.jar (461 KB at 1551.1 KB/sec)
Downloading: http://repo.maven.apache.org/maven2/org/codehaus/plexus/plexus-component-annotations/1.5.5/plexus-component-annotations-1.5.5.jar
Downloaded: http://repo.maven.apache.org/maven2/org/codehaus/plexus/plexus-io/2.4.1/plexus-io-2.4.1.jar (81 KB at 605.5 KB/sec)
Downloaded: http://repo.maven.apache.org/maven2/org/codehaus/plexus/plexus-utils/3.0.7/plexus-utils-3.0.7.jar (226 KB at 1271.6 KB/sec)
Downloaded: http://repo.maven.apache.org/maven2/commons-io/commons-io/2.2/commons-io-2.2.jar (170 KB at 1072.9 KB/sec)
Downloaded: http://repo.maven.apache.org/maven2/org/codehaus/plexus/plexus-component-annotations/1.5.5/plexus-component-annotations-1.5.5.jar (5 KB at 49.5 KB/sec)
Downloaded: http://repo.maven.apache.org/maven2/org/apache/commons/commons-compress/1.9/commons-compress-1.9.jar (370 KB at 1710.0 KB/sec)
[WARNING] Error injecting: org.eclipse.tycho.core.p2.P2ArtifactRepositoryLayout
java.lang.TypeNotPresentException: Type org.eclipse.tycho.core.p2.P2ArtifactRepositoryLayout not present
	at org.eclipse.sisu.space.URLClassSpace.loadClass(URLClassSpace.java:115)
	at org.eclipse.sisu.space.NamedClass.load(NamedClass.java:46)
	at org.eclipse.sisu.space.AbstractDeferredClass.get(AbstractDeferredClass.java:48)
	at com.google.inject.internal.ProviderInternalFactory.provision(ProviderInternalFactory.java:86)
	at com.google.inject.internal.InternalFactoryToInitializableAdapter.provision(InternalFactoryToInitializableAdapter.java:55)
	at com.google.inject.internal.ProviderInternalFactory$1.call(ProviderInternalFactory.java:70)
	at com.google.inject.internal.ProvisionListenerStackCallback$Provision.provision(ProvisionListenerStackCallback.java:100)
	at org.eclipse.sisu.plexus.PlexusLifecycleManager.onProvision(PlexusLifecycleManager.java:133)
	at com.google.inject.internal.ProvisionListenerStackCallback$Provision.provision(ProvisionListenerStackCallback.java:109)
	at com.google.inject.internal.ProvisionListenerStackCallback.provision(ProvisionListenerStackCallback.java:55)
	at com.google.inject.internal.ProviderInternalFactory.circularGet(ProviderInternalFactory.java:68)
	at com.google.inject.internal.InternalFactoryToInitializableAdapter.get(InternalFactoryToInitializableAdapter.java:47)
	at com.google.inject.internal.ProviderToInternalFactoryAdapter$1.call(ProviderToInternalFactoryAdapter.java:46)
	at com.google.inject.internal.InjectorImpl.callInContext(InjectorImpl.java:1054)
	at com.google.inject.internal.ProviderToInternalFactoryAdapter.get(ProviderToInternalFactoryAdapter.java:40)
	at com.google.inject.Scopes$1$1.get(Scopes.java:59)
	at com.google.inject.internal.InternalFactoryToProviderAdapter.get(InternalFactoryToProviderAdapter.java:41)
	at com.google.inject.internal.InjectorImpl$2$1.call(InjectorImpl.java:997)
	at com.google.inject.internal.InjectorImpl.callInContext(InjectorImpl.java:1047)
	at com.google.inject.internal.InjectorImpl$2.get(InjectorImpl.java:993)
	at org.eclipse.sisu.inject.LazyBeanEntry.getValue(LazyBeanEntry.java:82)
	at org.eclipse.sisu.plexus.LazyPlexusBean.getValue(LazyPlexusBean.java:51)
	at java.util.AbstractMap.get(AbstractMap.java:182)
	at org.apache.maven.repository.legacy.LegacyRepositorySystem.getLayout(LegacyRepositorySystem.java:848)
	at org.apache.maven.repository.legacy.LegacyRepositorySystem.buildArtifactRepository(LegacyRepositorySystem.java:794)
	at org.apache.maven.project.DefaultProjectBuildingHelper.createArtifactRepositories(DefaultProjectBuildingHelper.java:112)
	at org.apache.maven.project.DefaultModelBuildingListener.buildExtensionsAssembled(DefaultModelBuildingListener.java:135)
	at org.apache.maven.model.building.ModelBuildingEventCatapult$1.fire(ModelBuildingEventCatapult.java:43)
	at org.apache.maven.model.building.DefaultModelBuilder.fireEvent(DefaultModelBuilder.java:1069)
	at org.apache.maven.model.building.DefaultModelBuilder.build(DefaultModelBuilder.java:385)
	at org.apache.maven.model.building.DefaultModelBuilder.build(DefaultModelBuilder.java:368)
	at org.apache.maven.project.DefaultProjectBuilder.build(DefaultProjectBuilder.java:561)
	at org.apache.maven.project.DefaultProjectBuilder.build(DefaultProjectBuilder.java:353)
	at org.apache.maven.DefaultMaven.collectProjects(DefaultMaven.java:637)
	at org.apache.maven.DefaultMaven.getProjectsForMavenReactor(DefaultMaven.java:586)
	at org.apache.maven.DefaultMaven.doExecute(DefaultMaven.java:229)
	at org.apache.maven.DefaultMaven.execute(DefaultMaven.java:152)
	at org.apache.maven.cli.MavenCli.execute(MavenCli.java:555)
	at org.apache.maven.cli.MavenCli.doMain(MavenCli.java:214)
	at org.apache.maven.cli.MavenCli.main(MavenCli.java:158)
	at sun.reflect.NativeMethodAccessorImpl.invoke0(Native Method)
	at sun.reflect.NativeMethodAccessorImpl.invoke(NativeMethodAccessorImpl.java:57)
	at sun.reflect.DelegatingMethodAccessorImpl.invoke(DelegatingMethodAccessorImpl.java:43)
	at java.lang.reflect.Method.invoke(Method.java:606)
	at org.codehaus.plexus.classworlds.launcher.Launcher.launchEnhanced(Launcher.java:289)
	at org.codehaus.plexus.classworlds.launcher.Launcher.launch(Launcher.java:229)
	at org.codehaus.plexus.classworlds.launcher.Launcher.mainWithExitCode(Launcher.java:415)
	at org.codehaus.plexus.classworlds.launcher.Launcher.main(Launcher.java:356)
Caused by: java.lang.UnsupportedClassVersionError: org/eclipse/tycho/core/p2/P2ArtifactRepositoryLayout : Unsupported major.minor version 52.0
	at java.lang.ClassLoader.defineClass1(Native Method)
	at java.lang.ClassLoader.defineClass(ClassLoader.java:800)
	at java.security.SecureClassLoader.defineClass(SecureClassLoader.java:142)
	at java.net.URLClassLoader.defineClass(URLClassLoader.java:449)
	at java.net.URLClassLoader.access$100(URLClassLoader.java:71)
	at java.net.URLClassLoader$1.run(URLClassLoader.java:361)
	at java.net.URLClassLoader$1.run(URLClassLoader.java:355)
	at java.security.AccessController.doPrivileged(Native Method)
	at java.net.URLClassLoader.findClass(URLClassLoader.java:354)
	at org.codehaus.plexus.classworlds.realm.ClassRealm.loadClassFromSelf(ClassRealm.java:389)
	at org.codehaus.plexus.classworlds.strategy.SelfFirstStrategy.loadClass(SelfFirstStrategy.java:42)
	at org.codehaus.plexus.classworlds.realm.ClassRealm.unsynchronizedLoadClass(ClassRealm.java:259)
	at org.codehaus.plexus.classworlds.realm.ClassRealm.loadClass(ClassRealm.java:235)
	at org.codehaus.plexus.classworlds.realm.ClassRealm.loadClass(ClassRealm.java:227)
	at org.eclipse.sisu.space.URLClassSpace.loadClass(URLClassSpace.java:107)
	... 47 more
[INFO] o.h.m.e.h.MavenExecutionResultHandler - Build failed with exception(s)
[INFO] o.h.m.e.h.MavenExecutionResultHandler - [1] org.apache.maven.project.ProjectBuildingException: Some problems were encountered while processing the POMs:
[ERROR] Invalid artifact repository: Guice provision errors:

1) Error in custom provider, java.lang.TypeNotPresentException: Type org.eclipse.tycho.core.p2.P2ArtifactRepositoryLayout not present
  at ClassRealm[extension>org.eclipse.tycho:tycho-maven-plugin:0.26.0, parent: sun.misc.Launcher$AppClassLoader@26f44031]
  at ClassRealm[extension>org.eclipse.tycho:tycho-maven-plugin:0.26.0, parent: sun.misc.Launcher$AppClassLoader@26f44031]
  while locating org.apache.maven.artifact.repository.layout.ArtifactRepositoryLayout annotated with @com.google.inject.name.Named(value=p2)

1 error @ 

[DEBUG] Closing connection to remote
[ERROR] The build could not read 1 project -> [Help 1]
[ERROR]   
[ERROR]   The project org.eclipse.tm:tm-parent-old:4.0.0-SNAPSHOT (/jobs/genie.tm/target-management.gerrit/workspace/pom.xml) has 1 error
[ERROR]     Invalid artifact repository: Guice provision errors:
[ERROR]     
[ERROR]     1) Error in custom provider, java.lang.TypeNotPresentException: Type org.eclipse.tycho.core.p2.P2ArtifactRepositoryLayout not present
[ERROR]     at ClassRealm[extension>org.eclipse.tycho:tycho-maven-plugin:0.26.0, parent: sun.misc.Launcher$AppClassLoader@26f44031]
[ERROR]     at ClassRealm[extension>org.eclipse.tycho:tycho-maven-plugin:0.26.0, parent: sun.misc.Launcher$AppClassLoader@26f44031]
[ERROR]     while locating org.apache.maven.artifact.repository.layout.ArtifactRepositoryLayout annotated with @com.google.inject.name.Named(value=p2)
[ERROR]     
[ERROR]     1 error: org/eclipse/tycho/core/p2/P2ArtifactRepositoryLayout : Unsupported major.minor version 52.0
[ERROR] 
[ERROR] To see the full stack trace of the errors, re-run Maven with the -e switch.
[ERROR] Re-run Maven using the -X switch to enable full debug logging.
[ERROR] 
[ERROR] For more information about the errors and possible solutions, please read the following articles:
[ERROR] [Help 1] http://cwiki.apache.org/confluence/display/MAVEN/ProjectBuildingException
[DEBUG] Waiting for process to finish
[DEBUG] Result: 1
Terminating xvnc.
Finished: FAILURE