UnstableConsole Output

Skipping 1,199 KB.. Full Log
tusHandlerTestCase.testDefaultStatusHandler(StatusHandlerTestCase.java:151)
	at sun.reflect.NativeMethodAccessorImpl.invoke0(Native Method)
	at sun.reflect.NativeMethodAccessorImpl.invoke(NativeMethodAccessorImpl.java:62)
	at sun.reflect.DelegatingMethodAccessorImpl.invoke(DelegatingMethodAccessorImpl.java:43)
	at java.lang.reflect.Method.invoke(Method.java:498)
	at junit.framework.TestCase.runTest(TestCase.java:176)
	at junit.framework.TestCase.runBare(TestCase.java:141)
	at org.eclipse.tcf.te.tests.CoreTestCase.runBare(CoreTestCase.java:256)
	at junit.framework.TestResult$1.protect(TestResult.java:122)
	at junit.framework.TestResult.runProtected(TestResult.java:142)
	at junit.framework.TestResult.run(TestResult.java:125)
	at junit.framework.TestCase.run(TestCase.java:129)
	at org.eclipse.tcf.te.tests.CoreTestCase.run(CoreTestCase.java:233)
	at junit.framework.TestSuite.runTest(TestSuite.java:252)
	at junit.framework.TestSuite.run(TestSuite.java:247)
	at junit.framework.TestSuite.runTest(TestSuite.java:252)
	at junit.framework.TestSuite.run(TestSuite.java:247)
	at junit.framework.TestSuite.runTest(TestSuite.java:252)
	at junit.framework.TestSuite.run(TestSuite.java:247)
	at org.junit.internal.runners.JUnit38ClassRunner.run(JUnit38ClassRunner.java:86)
	at org.apache.maven.surefire.junit4.JUnit4Provider.execute(JUnit4Provider.java:264)
	at org.apache.maven.surefire.junit4.JUnit4Provider.executeTestSet(JUnit4Provider.java:153)
	at org.apache.maven.surefire.junit4.JUnit4Provider.invoke(JUnit4Provider.java:124)
	at sun.reflect.NativeMethodAccessorImpl.invoke0(Native Method)
	at sun.reflect.NativeMethodAccessorImpl.invoke(NativeMethodAccessorImpl.java:62)
	at sun.reflect.DelegatingMethodAccessorImpl.invoke(DelegatingMethodAccessorImpl.java:43)
	at java.lang.reflect.Method.invoke(Method.java:498)
	at org.apache.maven.surefire.util.ReflectionUtils.invokeMethodWithArray2(ReflectionUtils.java:208)
	at org.apache.maven.surefire.booter.ProviderFactory$ProviderProxy.invoke(ProviderFactory.java:156)
	at org.apache.maven.surefire.booter.ProviderFactory.invokeProvider(ProviderFactory.java:82)
	at org.eclipse.tycho.surefire.osgibooter.OsgiSurefireBooter.run(OsgiSurefireBooter.java:95)
	at org.eclipse.tycho.surefire.osgibooter.AbstractUITestApplication$1.run(AbstractUITestApplication.java:35)
	at org.eclipse.swt.widgets.RunnableLock.run(RunnableLock.java:37)
	at org.eclipse.swt.widgets.Synchronizer.runAsyncMessages(Synchronizer.java:182)
	at org.eclipse.swt.widgets.Display.runAsyncMessages(Display.java:4497)
	at org.eclipse.swt.widgets.Display.readAndDispatch(Display.java:4110)
	at org.eclipse.e4.ui.internal.workbench.swt.PartRenderingEngine$5.run(PartRenderingEngine.java:1155)
	at org.eclipse.core.databinding.observable.Realm.runWithDefault(Realm.java:336)
	at org.eclipse.e4.ui.internal.workbench.swt.PartRenderingEngine.run(PartRenderingEngine.java:1044)
	at org.eclipse.e4.ui.internal.workbench.E4Workbench.createAndRunUI(E4Workbench.java:153)
	at org.eclipse.ui.internal.Workbench.lambda$3(Workbench.java:680)
	at org.eclipse.core.databinding.observable.Realm.runWithDefault(Realm.java:336)
	at org.eclipse.ui.internal.Workbench.createAndRunWorkbench(Workbench.java:594)
	at org.eclipse.ui.PlatformUI.createAndRunWorkbench(PlatformUI.java:148)
	at org.eclipse.ui.internal.ide.application.IDEApplication.start(IDEApplication.java:151)
	at org.eclipse.tycho.surefire.osgibooter.UITestApplication.runApplication(UITestApplication.java:31)
	at org.eclipse.tycho.surefire.osgibooter.AbstractUITestApplication.run(AbstractUITestApplication.java:120)
	at org.eclipse.tycho.surefire.osgibooter.UITestApplication.start(UITestApplication.java:37)
	at org.eclipse.equinox.internal.app.EclipseAppHandle.run(EclipseAppHandle.java:196)
	at org.eclipse.core.runtime.internal.adaptor.EclipseAppLauncher.runApplication(EclipseAppLauncher.java:134)
	at org.eclipse.core.runtime.internal.adaptor.EclipseAppLauncher.start(EclipseAppLauncher.java:104)
	at org.eclipse.core.runtime.adaptor.EclipseStarter.run(EclipseStarter.java:388)
	at org.eclipse.core.runtime.adaptor.EclipseStarter.run(EclipseStarter.java:243)
	at sun.reflect.NativeMethodAccessorImpl.invoke0(Native Method)
	at sun.reflect.NativeMethodAccessorImpl.invoke(NativeMethodAccessorImpl.java:62)
	at sun.reflect.DelegatingMethodAccessorImpl.invoke(DelegatingMethodAccessorImpl.java:43)
	at java.lang.reflect.Method.invoke(Method.java:498)
	at org.eclipse.equinox.launcher.Main.invokeFramework(Main.java:653)
	at org.eclipse.equinox.launcher.Main.basicRun(Main.java:590)
	at org.eclipse.equinox.launcher.Main.run(Main.java:1499)
	at org.eclipse.equinox.launcher.Main.main(Main.java:1472)

!ENTRY org.eclipse.tcf.te.tests 0 1 2017-10-10 15:14:28.088
!MESSAGE Question
!STACK 0
java.lang.Throwable
	at org.eclipse.tcf.te.tests.statushandler.StatusHandlerTestCase.testDefaultStatusHandler(StatusHandlerTestCase.java:154)
	at sun.reflect.NativeMethodAccessorImpl.invoke0(Native Method)
	at sun.reflect.NativeMethodAccessorImpl.invoke(NativeMethodAccessorImpl.java:62)
	at sun.reflect.DelegatingMethodAccessorImpl.invoke(DelegatingMethodAccessorImpl.java:43)
	at java.lang.reflect.Method.invoke(Method.java:498)
	at junit.framework.TestCase.runTest(TestCase.java:176)
	at junit.framework.TestCase.runBare(TestCase.java:141)
	at org.eclipse.tcf.te.tests.CoreTestCase.runBare(CoreTestCase.java:256)
	at junit.framework.TestResult$1.protect(TestResult.java:122)
	at junit.framework.TestResult.runProtected(TestResult.java:142)
	at junit.framework.TestResult.run(TestResult.java:125)
	at junit.framework.TestCase.run(TestCase.java:129)
	at org.eclipse.tcf.te.tests.CoreTestCase.run(CoreTestCase.java:233)
	at junit.framework.TestSuite.runTest(TestSuite.java:252)
	at junit.framework.TestSuite.run(TestSuite.java:247)
	at junit.framework.TestSuite.runTest(TestSuite.java:252)
	at junit.framework.TestSuite.run(TestSuite.java:247)
	at junit.framework.TestSuite.runTest(TestSuite.java:252)
	at junit.framework.TestSuite.run(TestSuite.java:247)
	at org.junit.internal.runners.JUnit38ClassRunner.run(JUnit38ClassRunner.java:86)
	at org.apache.maven.surefire.junit4.JUnit4Provider.execute(JUnit4Provider.java:264)
	at org.apache.maven.surefire.junit4.JUnit4Provider.executeTestSet(JUnit4Provider.java:153)
	at org.apache.maven.surefire.junit4.JUnit4Provider.invoke(JUnit4Provider.java:124)
	at sun.reflect.NativeMethodAccessorImpl.invoke0(Native Method)
	at sun.reflect.NativeMethodAccessorImpl.invoke(NativeMethodAccessorImpl.java:62)
	at sun.reflect.DelegatingMethodAccessorImpl.invoke(DelegatingMethodAccessorImpl.java:43)
	at java.lang.reflect.Method.invoke(Method.java:498)
	at org.apache.maven.surefire.util.ReflectionUtils.invokeMethodWithArray2(ReflectionUtils.java:208)
	at org.apache.maven.surefire.booter.ProviderFactory$ProviderProxy.invoke(ProviderFactory.java:156)
	at org.apache.maven.surefire.booter.ProviderFactory.invokeProvider(ProviderFactory.java:82)
	at org.eclipse.tycho.surefire.osgibooter.OsgiSurefireBooter.run(OsgiSurefireBooter.java:95)
	at org.eclipse.tycho.surefire.osgibooter.AbstractUITestApplication$1.run(AbstractUITestApplication.java:35)
	at org.eclipse.swt.widgets.RunnableLock.run(RunnableLock.java:37)
	at org.eclipse.swt.widgets.Synchronizer.runAsyncMessages(Synchronizer.java:182)
	at org.eclipse.swt.widgets.Display.runAsyncMessages(Display.java:4497)
	at org.eclipse.swt.widgets.Display.readAndDispatch(Display.java:4110)
	at org.eclipse.e4.ui.internal.workbench.swt.PartRenderingEngine$5.run(PartRenderingEngine.java:1155)
	at org.eclipse.core.databinding.observable.Realm.runWithDefault(Realm.java:336)
	at org.eclipse.e4.ui.internal.workbench.swt.PartRenderingEngine.run(PartRenderingEngine.java:1044)
	at org.eclipse.e4.ui.internal.workbench.E4Workbench.createAndRunUI(E4Workbench.java:153)
	at org.eclipse.ui.internal.Workbench.lambda$3(Workbench.java:680)
	at org.eclipse.core.databinding.observable.Realm.runWithDefault(Realm.java:336)
	at org.eclipse.ui.internal.Workbench.createAndRunWorkbench(Workbench.java:594)
	at org.eclipse.ui.PlatformUI.createAndRunWorkbench(PlatformUI.java:148)
	at org.eclipse.ui.internal.ide.application.IDEApplication.start(IDEApplication.java:151)
	at org.eclipse.tycho.surefire.osgibooter.UITestApplication.runApplication(UITestApplication.java:31)
	at org.eclipse.tycho.surefire.osgibooter.AbstractUITestApplication.run(AbstractUITestApplication.java:120)
	at org.eclipse.tycho.surefire.osgibooter.UITestApplication.start(UITestApplication.java:37)
	at org.eclipse.equinox.internal.app.EclipseAppHandle.run(EclipseAppHandle.java:196)
	at org.eclipse.core.runtime.internal.adaptor.EclipseAppLauncher.runApplication(EclipseAppLauncher.java:134)
	at org.eclipse.core.runtime.internal.adaptor.EclipseAppLauncher.start(EclipseAppLauncher.java:104)
	at org.eclipse.core.runtime.adaptor.EclipseStarter.run(EclipseStarter.java:388)
	at org.eclipse.core.runtime.adaptor.EclipseStarter.run(EclipseStarter.java:243)
	at sun.reflect.NativeMethodAccessorImpl.invoke0(Native Method)
	at sun.reflect.NativeMethodAccessorImpl.invoke(NativeMethodAccessorImpl.java:62)
	at sun.reflect.DelegatingMethodAccessorImpl.invoke(DelegatingMethodAccessorImpl.java:43)
	at java.lang.reflect.Method.invoke(Method.java:498)
	at org.eclipse.equinox.launcher.Main.invokeFramework(Main.java:653)
	at org.eclipse.equinox.launcher.Main.basicRun(Main.java:590)
	at org.eclipse.equinox.launcher.Main.run(Main.java:1499)
	at org.eclipse.equinox.launcher.Main.main(Main.java:1472)

!ENTRY org.eclipse.tcf.te.tests 0 0 2017-10-10 15:14:28.095
!MESSAGE YesNoCancel

!ENTRY org.eclipse.tcf.te.tests 0 0 2017-10-10 15:14:28.097
!MESSAGE YesNoCancel
!STACK 0
java.lang.Throwable
	at org.eclipse.tcf.te.tests.statushandler.StatusHandlerTestCase.testDefaultStatusHandler(StatusHandlerTestCase.java:160)
	at sun.reflect.NativeMethodAccessorImpl.invoke0(Native Method)
	at sun.reflect.NativeMethodAccessorImpl.invoke(NativeMethodAccessorImpl.java:62)
	at sun.reflect.DelegatingMethodAccessorImpl.invoke(DelegatingMethodAccessorImpl.java:43)
	at java.lang.reflect.Method.invoke(Method.java:498)
	at junit.framework.TestCase.runTest(TestCase.java:176)
	at junit.framework.TestCase.runBare(TestCase.java:141)
	at org.eclipse.tcf.te.tests.CoreTestCase.runBare(CoreTestCase.java:256)
	at junit.framework.TestResult$1.protect(TestResult.java:122)
	at junit.framework.TestResult.runProtected(TestResult.java:142)
	at junit.framework.TestResult.run(TestResult.java:125)
	at junit.framework.TestCase.run(TestCase.java:129)
	at org.eclipse.tcf.te.tests.CoreTestCase.run(CoreTestCase.java:233)
	at junit.framework.TestSuite.runTest(TestSuite.java:252)
	at junit.framework.TestSuite.run(TestSuite.java:247)
	at junit.framework.TestSuite.runTest(TestSuite.java:252)
	at junit.framework.TestSuite.run(TestSuite.java:247)
	at junit.framework.TestSuite.runTest(TestSuite.java:252)
	at junit.framework.TestSuite.run(TestSuite.java:247)
	at org.junit.internal.runners.JUnit38ClassRunner.run(JUnit38ClassRunner.java:86)
	at org.apache.maven.surefire.junit4.JUnit4Provider.execute(JUnit4Provider.java:264)
	at org.apache.maven.surefire.junit4.JUnit4Provider.executeTestSet(JUnit4Provider.java:153)
	at org.apache.maven.surefire.junit4.JUnit4Provider.invoke(JUnit4Provider.java:124)
	at sun.reflect.NativeMethodAccessorImpl.invoke0(Native Method)
	at sun.reflect.NativeMethodAccessorImpl.invoke(NativeMethodAccessorImpl.java:62)
	at sun.reflect.DelegatingMethodAccessorImpl.invoke(DelegatingMethodAccessorImpl.java:43)
	at java.lang.reflect.Method.invoke(Method.java:498)
	at org.apache.maven.surefire.util.ReflectionUtils.invokeMethodWithArray2(ReflectionUtils.java:208)
	at org.apache.maven.surefire.booter.ProviderFactory$ProviderProxy.invoke(ProviderFactory.java:156)
	at org.apache.maven.surefire.booter.ProviderFactory.invokeProvider(ProviderFactory.java:82)
	at org.eclipse.tycho.surefire.osgibooter.OsgiSurefireBooter.run(OsgiSurefireBooter.java:95)
	at org.eclipse.tycho.surefire.osgibooter.AbstractUITestApplication$1.run(AbstractUITestApplication.java:35)
	at org.eclipse.swt.widgets.RunnableLock.run(RunnableLock.java:37)
	at org.eclipse.swt.widgets.Synchronizer.runAsyncMessages(Synchronizer.java:182)
	at org.eclipse.swt.widgets.Display.runAsyncMessages(Display.java:4497)
	at org.eclipse.swt.widgets.Display.readAndDispatch(Display.java:4110)
	at org.eclipse.e4.ui.internal.workbench.swt.PartRenderingEngine$5.run(PartRenderingEngine.java:1155)
	at org.eclipse.core.databinding.observable.Realm.runWithDefault(Realm.java:336)
	at org.eclipse.e4.ui.internal.workbench.swt.PartRenderingEngine.run(PartRenderingEngine.java:1044)
	at org.eclipse.e4.ui.internal.workbench.E4Workbench.createAndRunUI(E4Workbench.java:153)
	at org.eclipse.ui.internal.Workbench.lambda$3(Workbench.java:680)
	at org.eclipse.core.databinding.observable.Realm.runWithDefault(Realm.java:336)
	at org.eclipse.ui.internal.Workbench.createAndRunWorkbench(Workbench.java:594)
	at org.eclipse.ui.PlatformUI.createAndRunWorkbench(PlatformUI.java:148)
	at org.eclipse.ui.internal.ide.application.IDEApplication.start(IDEApplication.java:151)
	at org.eclipse.tycho.surefire.osgibooter.UITestApplication.runApplication(UITestApplication.java:31)
	at org.eclipse.tycho.surefire.osgibooter.AbstractUITestApplication.run(AbstractUITestApplication.java:120)
	at org.eclipse.tycho.surefire.osgibooter.UITestApplication.start(UITestApplication.java:37)
	at org.eclipse.equinox.internal.app.EclipseAppHandle.run(EclipseAppHandle.java:196)
	at org.eclipse.core.runtime.internal.adaptor.EclipseAppLauncher.runApplication(EclipseAppLauncher.java:134)
	at org.eclipse.core.runtime.internal.adaptor.EclipseAppLauncher.start(EclipseAppLauncher.java:104)
	at org.eclipse.core.runtime.adaptor.EclipseStarter.run(EclipseStarter.java:388)
	at org.eclipse.core.runtime.adaptor.EclipseStarter.run(EclipseStarter.java:243)
	at sun.reflect.NativeMethodAccessorImpl.invoke0(Native Method)
	at sun.reflect.NativeMethodAccessorImpl.invoke(NativeMethodAccessorImpl.java:62)
	at sun.reflect.DelegatingMethodAccessorImpl.invoke(DelegatingMethodAccessorImpl.java:43)
	at java.lang.reflect.Method.invoke(Method.java:498)
	at org.eclipse.equinox.launcher.Main.invokeFramework(Main.java:653)
	at org.eclipse.equinox.launcher.Main.basicRun(Main.java:590)
	at org.eclipse.equinox.launcher.Main.run(Main.java:1499)
	at org.eclipse.equinox.launcher.Main.main(Main.java:1472)

!ENTRY org.eclipse.tcf.te.tests 0 1 2017-10-10 15:14:28.102
!MESSAGE YesNoCancel
!STACK 0
java.lang.Throwable
	at org.eclipse.tcf.te.tests.statushandler.StatusHandlerTestCase.testDefaultStatusHandler(StatusHandlerTestCase.java:163)
	at sun.reflect.NativeMethodAccessorImpl.invoke0(Native Method)
	at sun.reflect.NativeMethodAccessorImpl.invoke(NativeMethodAccessorImpl.java:62)
	at sun.reflect.DelegatingMethodAccessorImpl.invoke(DelegatingMethodAccessorImpl.java:43)
	at java.lang.reflect.Method.invoke(Method.java:498)
	at junit.framework.TestCase.runTest(TestCase.java:176)
	at junit.framework.TestCase.runBare(TestCase.java:141)
	at org.eclipse.tcf.te.tests.CoreTestCase.runBare(CoreTestCase.java:256)
	at junit.framework.TestResult$1.protect(TestResult.java:122)
	at junit.framework.TestResult.runProtected(TestResult.java:142)
	at junit.framework.TestResult.run(TestResult.java:125)
	at junit.framework.TestCase.run(TestCase.java:129)
	at org.eclipse.tcf.te.tests.CoreTestCase.run(CoreTestCase.java:233)
	at junit.framework.TestSuite.runTest(TestSuite.java:252)
	at junit.framework.TestSuite.run(TestSuite.java:247)
	at junit.framework.TestSuite.runTest(TestSuite.java:252)
	at junit.framework.TestSuite.run(TestSuite.java:247)
	at junit.framework.TestSuite.runTest(TestSuite.java:252)
	at junit.framework.TestSuite.run(TestSuite.java:247)
	at org.junit.internal.runners.JUnit38ClassRunner.run(JUnit38ClassRunner.java:86)
	at org.apache.maven.surefire.junit4.JUnit4Provider.execute(JUnit4Provider.java:264)
	at org.apache.maven.surefire.junit4.JUnit4Provider.executeTestSet(JUnit4Provider.java:153)
	at org.apache.maven.surefire.junit4.JUnit4Provider.invoke(JUnit4Provider.java:124)
	at sun.reflect.NativeMethodAccessorImpl.invoke0(Native Method)
	at sun.reflect.NativeMethodAccessorImpl.invoke(NativeMethodAccessorImpl.java:62)
	at sun.reflect.DelegatingMethodAccessorImpl.invoke(DelegatingMethodAccessorImpl.java:43)
	at java.lang.reflect.Method.invoke(Method.java:498)
	at org.apache.maven.surefire.util.ReflectionUtils.invokeMethodWithArray2(ReflectionUtils.java:208)
	at org.apache.maven.surefire.booter.ProviderFactory$ProviderProxy.invoke(ProviderFactory.java:156)
	at org.apache.maven.surefire.booter.ProviderFactory.invokeProvider(ProviderFactory.java:82)
	at org.eclipse.tycho.surefire.osgibooter.OsgiSurefireBooter.run(OsgiSurefireBooter.java:95)
	at org.eclipse.tycho.surefire.osgibooter.AbstractUITestApplication$1.run(AbstractUITestApplication.java:35)
	at org.eclipse.swt.widgets.RunnableLock.run(RunnableLock.java:37)
	at org.eclipse.swt.widgets.Synchronizer.runAsyncMessages(Synchronizer.java:182)
	at org.eclipse.swt.widgets.Display.runAsyncMessages(Display.java:4497)
	at org.eclipse.swt.widgets.Display.readAndDispatch(Display.java:4110)
	at org.eclipse.e4.ui.internal.workbench.swt.PartRenderingEngine$5.run(PartRenderingEngine.java:1155)
	at org.eclipse.core.databinding.observable.Realm.runWithDefault(Realm.java:336)
	at org.eclipse.e4.ui.internal.workbench.swt.PartRenderingEngine.run(PartRenderingEngine.java:1044)
	at org.eclipse.e4.ui.internal.workbench.E4Workbench.createAndRunUI(E4Workbench.java:153)
	at org.eclipse.ui.internal.Workbench.lambda$3(Workbench.java:680)
	at org.eclipse.core.databinding.observable.Realm.runWithDefault(Realm.java:336)
	at org.eclipse.ui.internal.Workbench.createAndRunWorkbench(Workbench.java:594)
	at org.eclipse.ui.PlatformUI.createAndRunWorkbench(PlatformUI.java:148)
	at org.eclipse.ui.internal.ide.application.IDEApplication.start(IDEApplication.java:151)
	at org.eclipse.tycho.surefire.osgibooter.UITestApplication.runApplication(UITestApplication.java:31)
	at org.eclipse.tycho.surefire.osgibooter.AbstractUITestApplication.run(AbstractUITestApplication.java:120)
	at org.eclipse.tycho.surefire.osgibooter.UITestApplication.start(UITestApplication.java:37)
	at org.eclipse.equinox.internal.app.EclipseAppHandle.run(EclipseAppHandle.java:196)
	at org.eclipse.core.runtime.internal.adaptor.EclipseAppLauncher.runApplication(EclipseAppLauncher.java:134)
	at org.eclipse.core.runtime.internal.adaptor.EclipseAppLauncher.start(EclipseAppLauncher.java:104)
	at org.eclipse.core.runtime.adaptor.EclipseStarter.run(EclipseStarter.java:388)
	at org.eclipse.core.runtime.adaptor.EclipseStarter.run(EclipseStarter.java:243)
	at sun.reflect.NativeMethodAccessorImpl.invoke0(Native Method)
	at sun.reflect.NativeMethodAccessorImpl.invoke(NativeMethodAccessorImpl.java:62)
	at sun.reflect.DelegatingMethodAccessorImpl.invoke(DelegatingMethodAccessorImpl.java:43)
	at java.lang.reflect.Method.invoke(Method.java:498)
	at org.eclipse.equinox.launcher.Main.invokeFramework(Main.java:653)
	at org.eclipse.equinox.launcher.Main.basicRun(Main.java:590)
	at org.eclipse.equinox.launcher.Main.run(Main.java:1499)
	at org.eclipse.equinox.launcher.Main.main(Main.java:1472)
=== testDefaultStatusHandler finished at: October 10, 2017 3:14:28 PM EDT (duration: 211 ms)

=== testContributionsWithContext started at: October 10, 2017 3:14:28 PM EDT
=== testContributionsWithContext finished at: October 10, 2017 3:14:28 PM EDT (duration: 45 ms)

=== testModel started at: October 10, 2017 3:14:28 PM EDT
=== testModel finished at: October 10, 2017 3:14:28 PM EDT (duration: 40 ms)

=== testStepperContributions started at: October 10, 2017 3:14:28 PM EDT
=== testStepperContributions finished at: October 10, 2017 3:14:28 PM EDT (duration: 60 ms)

=== testStepGroupContributions started at: October 10, 2017 3:14:28 PM EDT
=== testStepGroupContributions finished at: October 10, 2017 3:14:28 PM EDT (duration: 148 ms)

=== testStepContributions started at: October 10, 2017 3:14:28 PM EDT
=== testStepContributions finished at: October 10, 2017 3:14:28 PM EDT (duration: 207 ms)

=== testExecuteStepGroup started at: October 10, 2017 3:14:28 PM EDT
=== testExecuteStepGroup finished at: October 10, 2017 3:14:28 PM EDT (duration: 98 ms)

=== testProcessModel started at: October 10, 2017 3:14:28 PM EDT
=== testProcessModel finished at: October 10, 2017 3:14:40 PM EDT (duration: 11275 ms)

=== testProcessLauncher started at: October 10, 2017 3:14:40 PM EDT
=== testProcessLauncher finished at: October 10, 2017 3:14:41 PM EDT (duration: 1637 ms)

!ENTRY org.eclipse.tcf.te.tests 4 1 2017-10-10 15:14:41.758
!MESSAGE Test case 'testProcessLauncher(org.eclipse.tcf.te.tests.tcf.processes.launcher.ProcessLauncherTestCase)' failed. Failure: Unexpected output from helloWorls test application. expected:<[Hello World]> but was:<[]>
!STACK 0
junit.framework.ComparisonFailure: Unexpected output from helloWorls test application. expected:<[Hello World]> but was:<[]>
	at junit.framework.Assert.assertEquals(Assert.java:100)
	at junit.framework.TestCase.assertEquals(TestCase.java:261)
	at org.eclipse.tcf.te.tests.tcf.processes.launcher.ProcessLauncherTestCase.testProcessLauncher(ProcessLauncherTestCase.java:154)
	at sun.reflect.NativeMethodAccessorImpl.invoke0(Native Method)
	at sun.reflect.NativeMethodAccessorImpl.invoke(NativeMethodAccessorImpl.java:62)
	at sun.reflect.DelegatingMethodAccessorImpl.invoke(DelegatingMethodAccessorImpl.java:43)
	at java.lang.reflect.Method.invoke(Method.java:498)
	at junit.framework.TestCase.runTest(TestCase.java:176)
	at junit.framework.TestCase.runBare(TestCase.java:141)
	at org.eclipse.tcf.te.tests.CoreTestCase.runBare(CoreTestCase.java:256)
	at junit.framework.TestResult$1.protect(TestResult.java:122)
	at junit.framework.TestResult.runProtected(TestResult.java:142)
	at junit.framework.TestResult.run(TestResult.java:125)
	at junit.framework.TestCase.run(TestCase.java:129)
	at org.eclipse.tcf.te.tests.CoreTestCase.run(CoreTestCase.java:233)
	at junit.framework.TestSuite.runTest(TestSuite.java:252)
	at junit.framework.TestSuite.run(TestSuite.java:247)
	at junit.framework.TestSuite.runTest(TestSuite.java:252)
	at junit.framework.TestSuite.run(TestSuite.java:247)
	at junit.framework.TestSuite.runTest(TestSuite.java:252)
	at junit.framework.TestSuite.run(TestSuite.java:247)
	at org.junit.internal.runners.JUnit38ClassRunner.run(JUnit38ClassRunner.java:86)
	at org.apache.maven.surefire.junit4.JUnit4Provider.execute(JUnit4Provider.java:264)
	at org.apache.maven.surefire.junit4.JUnit4Provider.executeTestSet(JUnit4Provider.java:153)
	at org.apache.maven.surefire.junit4.JUnit4Provider.invoke(JUnit4Provider.java:124)
	at sun.reflect.NativeMethodAccessorImpl.invoke0(Native Method)
	at sun.reflect.NativeMethodAccessorImpl.invoke(NativeMethodAccessorImpl.java:62)
	at sun.reflect.DelegatingMethodAccessorImpl.invoke(DelegatingMethodAccessorImpl.java:43)
	at java.lang.reflect.Method.invoke(Method.java:498)
	at org.apache.maven.surefire.util.ReflectionUtils.invokeMethodWithArray2(ReflectionUtils.java:208)
	at org.apache.maven.surefire.booter.ProviderFactory$ProviderProxy.invoke(ProviderFactory.java:156)
	at org.apache.maven.surefire.booter.ProviderFactory.invokeProvider(ProviderFactory.java:82)
	at org.eclipse.tycho.surefire.osgibooter.OsgiSurefireBooter.run(OsgiSurefireBooter.java:95)
	at org.eclipse.tycho.surefire.osgibooter.AbstractUITestApplication$1.run(AbstractUITestApplication.java:35)
	at org.eclipse.swt.widgets.RunnableLock.run(RunnableLock.java:37)
	at org.eclipse.swt.widgets.Synchronizer.runAsyncMessages(Synchronizer.java:182)
	at org.eclipse.swt.widgets.Display.runAsyncMessages(Display.java:4497)
	at org.eclipse.swt.widgets.Display.readAndDispatch(Display.java:4110)
	at org.eclipse.e4.ui.internal.workbench.swt.PartRenderingEngine$5.run(PartRenderingEngine.java:1155)
	at org.eclipse.core.databinding.observable.Realm.runWithDefault(Realm.java:336)
	at org.eclipse.e4.ui.internal.workbench.swt.PartRenderingEngine.run(PartRenderingEngine.java:1044)
	at org.eclipse.e4.ui.internal.workbench.E4Workbench.createAndRunUI(E4Workbench.java:153)
	at org.eclipse.ui.internal.Workbench.lambda$3(Workbench.java:680)
	at org.eclipse.core.databinding.observable.Realm.runWithDefault(Realm.java:336)
	at org.eclipse.ui.internal.Workbench.createAndRunWorkbench(Workbench.java:594)
	at org.eclipse.ui.PlatformUI.createAndRunWorkbench(PlatformUI.java:148)
	at org.eclipse.ui.internal.ide.application.IDEApplication.start(IDEApplication.java:151)
	at org.eclipse.tycho.surefire.osgibooter.UITestApplication.runApplication(UITestApplication.java:31)
	at org.eclipse.tycho.surefire.osgibooter.AbstractUITestApplication.run(AbstractUITestApplication.java:120)
	at org.eclipse.tycho.surefire.osgibooter.UITestApplication.start(UITestApplication.java:37)
	at org.eclipse.equinox.internal.app.EclipseAppHandle.run(EclipseAppHandle.java:196)
	at org.eclipse.core.runtime.internal.adaptor.EclipseAppLauncher.runApplication(EclipseAppLauncher.java:134)
	at org.eclipse.core.runtime.internal.adaptor.EclipseAppLauncher.start(EclipseAppLauncher.java:104)
	at org.eclipse.core.runtime.adaptor.EclipseStarter.run(EclipseStarter.java:388)
	at org.eclipse.core.runtime.adaptor.EclipseStarter.run(EclipseStarter.java:243)
	at sun.reflect.NativeMethodAccessorImpl.invoke0(Native Method)
	at sun.reflect.NativeMethodAccessorImpl.invoke(NativeMethodAccessorImpl.java:62)
	at sun.reflect.DelegatingMethodAccessorImpl.invoke(DelegatingMethodAccessorImpl.java:43)
	at java.lang.reflect.Method.invoke(Method.java:498)
	at org.eclipse.equinox.launcher.Main.invokeFramework(Main.java:653)
	at org.eclipse.equinox.launcher.Main.basicRun(Main.java:590)
	at org.eclipse.equinox.launcher.Main.run(Main.java:1499)
	at org.eclipse.equinox.launcher.Main.main(Main.java:1472)
Tests run: 20, Failures: 1, Errors: 0, Skipped: 0, Time elapsed: 20.207 sec <<< FAILURE! - in org.eclipse.tcf.te.tests.suites.AllTests
testModelNode(org.eclipse.tcf.te.tests.model.ModelTestCase)  Time elapsed: 4.582 sec
testPropertiesContainer(org.eclipse.tcf.te.tests.model.ModelTestCase)  Time elapsed: 0.044 sec
testPendingOperationModelNode(org.eclipse.tcf.te.tests.model.ModelTestCase)  Time elapsed: 0.044 sec
testFileTransferItem(org.eclipse.tcf.te.tests.model.ModelTestCase)  Time elapsed: 0.058 sec
testModel(org.eclipse.tcf.te.tests.tcf.model.ModelTestCase)  Time elapsed: 0.055 sec
testElfUtils(org.eclipse.tcf.te.tests.utils.UtilityTestCase)  Time elapsed: 0.078 sec
testSingleThreadExecutorService(org.eclipse.tcf.te.tests.concurrent.ConcurrentTestCase)  Time elapsed: 1.191 sec
testPrivateOrInternalClasses(org.eclipse.tcf.te.tests.concurrent.ConcurrentTestCase)  Time elapsed: 0.067 sec
testAbstractDelegatingExecutorService(org.eclipse.tcf.te.tests.concurrent.ConcurrentTestCase)  Time elapsed: 0.046 sec
testStatusHandler(org.eclipse.tcf.te.tests.statushandler.StatusHandlerTestCase)  Time elapsed: 0.064 sec
testContributions(org.eclipse.tcf.te.tests.statushandler.StatusHandlerTestCase)  Time elapsed: 0.08 sec
testDefaultStatusHandler(org.eclipse.tcf.te.tests.statushandler.StatusHandlerTestCase)  Time elapsed: 0.211 sec
testContributionsWithContext(org.eclipse.tcf.te.tests.statushandler.StatusHandlerTestCase)  Time elapsed: 0.046 sec
testModel(org.eclipse.tcf.te.tests.tcf.model.ModelTestCase)  Time elapsed: 0.041 sec
testStepperContributions(org.eclipse.tcf.te.tests.stepper.StepperTests)  Time elapsed: 0.06 sec
testStepGroupContributions(org.eclipse.tcf.te.tests.stepper.StepperTests)  Time elapsed: 0.148 sec
testStepContributions(org.eclipse.tcf.te.tests.stepper.StepperTests)  Time elapsed: 0.207 sec
testExecuteStepGroup(org.eclipse.tcf.te.tests.stepper.StepperTests)  Time elapsed: 0.099 sec
testProcessModel(org.eclipse.tcf.te.tests.tcf.processes.model.ProcessModelTestCase)  Time elapsed: 11.276 sec
testProcessLauncher(org.eclipse.tcf.te.tests.tcf.processes.launcher.ProcessLauncherTestCase)  Time elapsed: 1.645 sec  <<< FAILURE!
junit.framework.ComparisonFailure: Unexpected output from helloWorls test application. expected:<[Hello World]> but was:<[]>
	at junit.framework.Assert.assertEquals(Assert.java:100)
	at junit.framework.TestCase.assertEquals(TestCase.java:261)
	at org.eclipse.tcf.te.tests.tcf.processes.launcher.ProcessLauncherTestCase.testProcessLauncher(ProcessLauncherTestCase.java:154)


Results :

Failed tests: 
  ProcessLauncherTestCase>CoreTestCase.run:233->CoreTestCase.runBare:256->testProcessLauncher:154 Unexpected output from helloWorls test application. expected:<[Hello World]> but was:<[]>

Tests run: 20, Failures: 1, Errors: 0, Skipped: 0

[ERROR] There are test failures.

Please refer to /jobs/genie.tcf/tcf-master-tests-4.7/workspace/target_explorer/plugins/org.eclipse.tcf.te.tests/target/surefire-reports for the individual test results.
[INFO] 
[INFO] --- maven-antrun-plugin:1.8:run (generate-report) @ org.eclipse.tcf.te.tests ---
Downloading: https://oss.sonatype.org/content/repositories/public/org/jacoco/org.jacoco.ant/0.7.9/org.jacoco.ant-0.7.9.pom
Downloaded: https://oss.sonatype.org/content/repositories/public/org/jacoco/org.jacoco.ant/0.7.9/org.jacoco.ant-0.7.9.pom (4 KB at 37.0 KB/sec)
Downloading: https://oss.sonatype.org/content/repositories/public/org/codehaus/plexus/plexus-utils/3.0.20/plexus-utils-3.0.20.pom
Downloading: https://repo.eclipse.org/content/repositories/cbi-releases/org/codehaus/plexus/plexus-utils/3.0.20/plexus-utils-3.0.20.pom
Downloading: https://repo.eclipse.org/content/repositories/cbi-snapshots/org/codehaus/plexus/plexus-utils/3.0.20/plexus-utils-3.0.20.pom
Downloading: https://repo.eclipse.org/content/repositories/maven_central/org/codehaus/plexus/plexus-utils/3.0.20/plexus-utils-3.0.20.pom
Downloaded: https://repo.eclipse.org/content/repositories/maven_central/org/codehaus/plexus/plexus-utils/3.0.20/plexus-utils-3.0.20.pom (4 KB at 177.2 KB/sec)
Downloading: https://oss.sonatype.org/content/repositories/public/org/apache/ant/ant/1.9.4/ant-1.9.4.pom
Downloading: https://repo.eclipse.org/content/repositories/cbi-releases/org/apache/ant/ant/1.9.4/ant-1.9.4.pom
Downloading: https://repo.eclipse.org/content/repositories/cbi-snapshots/org/apache/ant/ant/1.9.4/ant-1.9.4.pom
Downloading: https://repo.eclipse.org/content/repositories/maven_central/org/apache/ant/ant/1.9.4/ant-1.9.4.pom
Downloaded: https://repo.eclipse.org/content/repositories/maven_central/org/apache/ant/ant/1.9.4/ant-1.9.4.pom (10 KB at 447.6 KB/sec)
Downloading: https://oss.sonatype.org/content/repositories/public/org/apache/ant/ant-parent/1.9.4/ant-parent-1.9.4.pom
Downloading: https://repo.eclipse.org/content/repositories/cbi-releases/org/apache/ant/ant-parent/1.9.4/ant-parent-1.9.4.pom
Downloading: https://repo.eclipse.org/content/repositories/cbi-snapshots/org/apache/ant/ant-parent/1.9.4/ant-parent-1.9.4.pom
Downloading: https://repo.eclipse.org/content/repositories/maven_central/org/apache/ant/ant-parent/1.9.4/ant-parent-1.9.4.pom
Downloaded: https://repo.eclipse.org/content/repositories/maven_central/org/apache/ant/ant-parent/1.9.4/ant-parent-1.9.4.pom (6 KB at 260.6 KB/sec)
Downloading: https://oss.sonatype.org/content/repositories/public/org/apache/ant/ant-launcher/1.9.4/ant-launcher-1.9.4.pom
Downloading: https://repo.eclipse.org/content/repositories/cbi-releases/org/apache/ant/ant-launcher/1.9.4/ant-launcher-1.9.4.pom
Downloading: https://repo.eclipse.org/content/repositories/cbi-snapshots/org/apache/ant/ant-launcher/1.9.4/ant-launcher-1.9.4.pom
Downloading: https://repo.eclipse.org/content/repositories/maven_central/org/apache/ant/ant-launcher/1.9.4/ant-launcher-1.9.4.pom
Downloaded: https://repo.eclipse.org/content/repositories/maven_central/org/apache/ant/ant-launcher/1.9.4/ant-launcher-1.9.4.pom (3 KB at 108.6 KB/sec)
Downloading: https://oss.sonatype.org/content/repositories/public/org/jacoco/org.jacoco.ant/0.7.9/org.jacoco.ant-0.7.9.jar
Downloading: https://oss.sonatype.org/content/repositories/public/org/jacoco/org.jacoco.agent/0.7.9/org.jacoco.agent-0.7.9.jar
Downloading: https://oss.sonatype.org/content/repositories/public/org/codehaus/plexus/plexus-utils/3.0.20/plexus-utils-3.0.20.jar
Downloading: https://oss.sonatype.org/content/repositories/public/org/apache/ant/ant/1.9.4/ant-1.9.4.jar
Downloading: https://oss.sonatype.org/content/repositories/public/org/apache/ant/ant-launcher/1.9.4/ant-launcher-1.9.4.jar
Downloaded: https://oss.sonatype.org/content/repositories/public/org/jacoco/org.jacoco.ant/0.7.9/org.jacoco.ant-0.7.9.jar (32 KB at 150.3 KB/sec)
Downloaded: https://oss.sonatype.org/content/repositories/public/org/jacoco/org.jacoco.agent/0.7.9/org.jacoco.agent-0.7.9.jar (231 KB at 653.8 KB/sec)
Downloading: https://repo.eclipse.org/content/repositories/cbi-releases/org/codehaus/plexus/plexus-utils/3.0.20/plexus-utils-3.0.20.jar
Downloading: https://repo.eclipse.org/content/repositories/cbi-releases/org/apache/ant/ant/1.9.4/ant-1.9.4.jar
Downloading: https://repo.eclipse.org/content/repositories/cbi-releases/org/apache/ant/ant-launcher/1.9.4/ant-launcher-1.9.4.jar
Downloading: https://repo.eclipse.org/content/repositories/cbi-snapshots/org/codehaus/plexus/plexus-utils/3.0.20/plexus-utils-3.0.20.jar
Downloading: https://repo.eclipse.org/content/repositories/cbi-snapshots/org/apache/ant/ant/1.9.4/ant-1.9.4.jar
Downloading: https://repo.eclipse.org/content/repositories/cbi-snapshots/org/apache/ant/ant-launcher/1.9.4/ant-launcher-1.9.4.jar
Downloading: https://repo.eclipse.org/content/repositories/maven_central/org/codehaus/plexus/plexus-utils/3.0.20/plexus-utils-3.0.20.jar
Downloading: https://repo.eclipse.org/content/repositories/maven_central/org/apache/ant/ant/1.9.4/ant-1.9.4.jar
Downloading: https://repo.eclipse.org/content/repositories/maven_central/org/apache/ant/ant-launcher/1.9.4/ant-launcher-1.9.4.jar
Downloaded: https://repo.eclipse.org/content/repositories/maven_central/org/apache/ant/ant-launcher/1.9.4/ant-launcher-1.9.4.jar (18 KB at 815.9 KB/sec)
Downloaded: https://repo.eclipse.org/content/repositories/maven_central/org/codehaus/plexus/plexus-utils/3.0.20/plexus-utils-3.0.20.jar (238 KB at 5791.0 KB/sec)
Downloaded: https://repo.eclipse.org/content/repositories/maven_central/org/apache/ant/ant/1.9.4/ant-1.9.4.jar (1972 KB at 19524.2 KB/sec)
[INFO] Executing tasks

main:
     [echo] Coverage report
   [report] Loading execution data file /jobs/genie.tcf/tcf-master-tests-4.7/workspace/target_explorer/plugins/org.eclipse.tcf.te.tests/target/jacoco.exec
   [report] Writing bundle 'org.eclipse.tcf.te.core' with 11 classes
   [report] Writing bundle 'org.eclipse.tcf.te.core.cdt' with 4 classes
   [report] Writing bundle 'org.eclipse.tcf.te.launch.core' with 55 classes
   [report] Writing bundle 'org.eclipse.tcf.te.runtime' with 45 classes
   [report] Writing bundle 'org.eclipse.tcf.te.runtime.concurrent' with 14 classes
   [report] Writing bundle 'org.eclipse.tcf.te.runtime.model' with 16 classes
   [report] Writing bundle 'org.eclipse.tcf.te.runtime.persistence' with 21 classes
   [report] Writing bundle 'org.eclipse.tcf.te.runtime.services' with 14 classes
   [report] Writing bundle 'org.eclipse.tcf.te.runtime.statushandler' with 13 classes
   [report] Writing bundle 'org.eclipse.tcf.te.runtime.stepper' with 33 classes
   [report] Writing bundle 'org.eclipse.tcf.te.tcf.core' with 100 classes
   [report] Writing bundle 'org.eclipse.tcf.te.tcf.core.model' with 8 classes
   [report] Writing bundle 'org.eclipse.tcf.te.tcf.filesystem.core' with 195 classes
   [report] Writing bundle 'org.eclipse.tcf.te.tcf.launch.core' with 39 classes
   [report] Writing bundle 'org.eclipse.tcf.te.tcf.locator' with 132 classes
   [report] Writing bundle 'org.eclipse.tcf.te.tcf.log.core' with 23 classes
   [report] Writing bundle 'org.eclipse.tcf.te.tcf.processes.core' with 136 classes
   [report] Writing bundle 'org.eclipse.tcf.te.tcf.services.contexts' with 5 classes
   [report] Writing bundle 'org.eclipse.tcf.te.tcf.terminals.core' with 31 classes
[INFO] Executed tasks
[INFO] 
[INFO] --- maven-install-plugin:2.3.1:install (default-install) @ org.eclipse.tcf.te.tests ---
[INFO] Installing /jobs/genie.tcf/tcf-master-tests-4.7/workspace/target_explorer/plugins/org.eclipse.tcf.te.tests/target/org.eclipse.tcf.te.tests-1.5.0-SNAPSHOT.jar to /home/hudson/genie.tcf/.hudson/jobs/tcf-master-tests-4.7/workspace/.maven/repo/org/eclipse/tcf/org.eclipse.tcf.te.tests/1.5.0-SNAPSHOT/org.eclipse.tcf.te.tests-1.5.0-SNAPSHOT.jar
[INFO] Installing /jobs/genie.tcf/tcf-master-tests-4.7/workspace/target_explorer/plugins/org.eclipse.tcf.te.tests/pom.xml to /home/hudson/genie.tcf/.hudson/jobs/tcf-master-tests-4.7/workspace/.maven/repo/org/eclipse/tcf/org.eclipse.tcf.te.tests/1.5.0-SNAPSHOT/org.eclipse.tcf.te.tests-1.5.0-SNAPSHOT.pom
[INFO] Installing /jobs/genie.tcf/tcf-master-tests-4.7/workspace/target_explorer/plugins/org.eclipse.tcf.te.tests/target/org.eclipse.tcf.te.tests-1.5.0-SNAPSHOT-sources.jar to /home/hudson/genie.tcf/.hudson/jobs/tcf-master-tests-4.7/workspace/.maven/repo/org/eclipse/tcf/org.eclipse.tcf.te.tests/1.5.0-SNAPSHOT/org.eclipse.tcf.te.tests-1.5.0-SNAPSHOT-sources.jar
[INFO] Installing /jobs/genie.tcf/tcf-master-tests-4.7/workspace/target_explorer/plugins/org.eclipse.tcf.te.tests/target/p2content.xml to /home/hudson/genie.tcf/.hudson/jobs/tcf-master-tests-4.7/workspace/.maven/repo/org/eclipse/tcf/org.eclipse.tcf.te.tests/1.5.0-SNAPSHOT/org.eclipse.tcf.te.tests-1.5.0-SNAPSHOT-p2metadata.xml
[INFO] Installing /jobs/genie.tcf/tcf-master-tests-4.7/workspace/target_explorer/plugins/org.eclipse.tcf.te.tests/target/p2artifacts.xml to /home/hudson/genie.tcf/.hudson/jobs/tcf-master-tests-4.7/workspace/.maven/repo/org/eclipse/tcf/org.eclipse.tcf.te.tests/1.5.0-SNAPSHOT/org.eclipse.tcf.te.tests-1.5.0-SNAPSHOT-p2artifacts.xml
[INFO] 
[INFO] --- tycho-p2-plugin:1.0.0:update-local-index (default-update-local-index) @ org.eclipse.tcf.te.tests ---
[INFO]                                                                         
[INFO] ------------------------------------------------------------------------
[INFO] Building org.eclipse.tcf.debug.test 1.5.0-SNAPSHOT
[INFO] ------------------------------------------------------------------------
[INFO] 
[INFO] --- maven-clean-plugin:2.4.1:clean (default-clean) @ org.eclipse.tcf.debug.test ---
[INFO] 
[INFO] --- tycho-packaging-plugin:1.0.0:build-qualifier (default-build-qualifier) @ org.eclipse.tcf.debug.test ---
[INFO] The project's OSGi version is 1.5.0.201609121142
[INFO] 
[INFO] --- tycho-packaging-plugin:1.0.0:validate-id (default-validate-id) @ org.eclipse.tcf.debug.test ---
[INFO] 
[INFO] --- tycho-packaging-plugin:1.0.0:validate-version (default-validate-version) @ org.eclipse.tcf.debug.test ---
[INFO] 
[INFO] --- gmaven-plugin:1.5:execute (default) @ org.eclipse.tcf.debug.test ---
[INFO] 
[INFO] --- jacoco-maven-plugin:0.7.9:prepare-agent (default) @ org.eclipse.tcf.debug.test ---
[INFO] tycho.testArgLine set to -javaagent:/home/hudson/genie.tcf/.hudson/jobs/tcf-master-tests-4.7/workspace/.maven/repo/org/jacoco/org.jacoco.agent/0.7.9/org.jacoco.agent-0.7.9-runtime.jar=destfile=/jobs/genie.tcf/tcf-master-tests-4.7/workspace/tests/plugins/org.eclipse.tcf.debug.test/target/jacoco.exec,append=true,includes=org.eclipse.tcf*,excludes=org.eclipse.tcf.debug.test*:org.eclipse.tcf.te.tests.*,dumponexit=true,output=file
[INFO] 
[INFO] --- maven-resources-plugin:2.7:resources (default-resources) @ org.eclipse.tcf.debug.test ---
[INFO] Using 'UTF-8' encoding to copy filtered resources.
[INFO] skip non existing resourceDirectory /jobs/genie.tcf/tcf-master-tests-4.7/workspace/tests/plugins/org.eclipse.tcf.debug.test/src/main/resources
[INFO] 
[INFO] --- tycho-compiler-plugin:1.0.0:compile (default-compile) @ org.eclipse.tcf.debug.test ---
[INFO] Compiling 56 source files to /jobs/genie.tcf/tcf-master-tests-4.7/workspace/tests/plugins/org.eclipse.tcf.debug.test/target/classes
[WARNING] /jobs/genie.tcf/tcf-master-tests-4.7/workspace/tests/plugins/org.eclipse.tcf.debug.test/src/org/eclipse/tcf/debug/test/CacheTests.java:[18] 
	import junit.framework.Assert;
	       ^^^^^^^^^^^^^^^^^^^^^^
The type Assert is deprecated
[WARNING] /jobs/genie.tcf/tcf-master-tests-4.7/workspace/tests/plugins/org.eclipse.tcf.debug.test/src/org/eclipse/tcf/debug/test/CacheTests.java:[93] 
	Assert.assertTrue(fTestCache.isValid());
	^^^^^^
The type Assert is deprecated
[WARNING] /jobs/genie.tcf/tcf-master-tests-4.7/workspace/tests/plugins/org.eclipse.tcf.debug.test/src/org/eclipse/tcf/debug/test/CacheTests.java:[93] 
	Assert.assertTrue(fTestCache.isValid());
	       ^^^^^^^^^^^^^^^^^^^^^^^^^^^^^^^^
The method assertTrue(boolean) from the type Assert is deprecated
[WARNING] /jobs/genie.tcf/tcf-master-tests-4.7/workspace/tests/plugins/org.eclipse.tcf.debug.test/src/org/eclipse/tcf/debug/test/CacheTests.java:[94] 
	Assert.assertEquals(data, fTestCache.getData());
	^^^^^^
The type Assert is deprecated
[WARNING] /jobs/genie.tcf/tcf-master-tests-4.7/workspace/tests/plugins/org.eclipse.tcf.debug.test/src/org/eclipse/tcf/debug/test/CacheTests.java:[94] 
	Assert.assertEquals(data, fTestCache.getData());
	       ^^^^^^^^^^^^^^^^^^^^^^^^^^^^^^^^^^^^^^^^
The method assertEquals(Object, Object) from the type Assert is deprecated
[WARNING] /jobs/genie.tcf/tcf-master-tests-4.7/workspace/tests/plugins/org.eclipse.tcf.debug.test/src/org/eclipse/tcf/debug/test/CacheTests.java:[95] 
	Assert.assertNull(fTestCache.getError());
	^^^^^^
The type Assert is deprecated
[WARNING] /jobs/genie.tcf/tcf-master-tests-4.7/workspace/tests/plugins/org.eclipse.tcf.debug.test/src/org/eclipse/tcf/debug/test/CacheTests.java:[95] 
	Assert.assertNull(fTestCache.getError());
	       ^^^^^^^^^^^^^^^^^^^^^^^^^^^^^^^^^
The method assertNull(Object) from the type Assert is deprecated
[WARNING] /jobs/genie.tcf/tcf-master-tests-4.7/workspace/tests/plugins/org.eclipse.tcf.debug.test/src/org/eclipse/tcf/debug/test/CacheTests.java:[99] 
	Assert.assertFalse(fTestCache.isValid());
	^^^^^^
The type Assert is deprecated
[WARNING] /jobs/genie.tcf/tcf-master-tests-4.7/workspace/tests/plugins/org.eclipse.tcf.debug.test/src/org/eclipse/tcf/debug/test/CacheTests.java:[99] 
	Assert.assertFalse(fTestCache.isValid());
	       ^^^^^^^^^^^^^^^^^^^^^^^^^^^^^^^^^
The method assertFalse(boolean) from the type Assert is deprecated
[WARNING] /jobs/genie.tcf/tcf-master-tests-4.7/workspace/tests/plugins/org.eclipse.tcf.debug.test/src/org/eclipse/tcf/debug/test/CacheTests.java:[102] 
	Assert.fail("Expected an IllegalStateException");
	^^^^^^
The type Assert is deprecated
[WARNING] /jobs/genie.tcf/tcf-master-tests-4.7/workspace/tests/plugins/org.eclipse.tcf.debug.test/src/org/eclipse/tcf/debug/test/CacheTests.java:[102] 
	Assert.fail("Expected an IllegalStateException");
	       ^^^^^^^^^^^^^^^^^^^^^^^^^^^^^^^^^^^^^^^^^
The method fail(String) from the type Assert is deprecated
[WARNING] /jobs/genie.tcf/tcf-master-tests-4.7/workspace/tests/plugins/org.eclipse.tcf.debug.test/src/org/eclipse/tcf/debug/test/CacheTests.java:[106] 
	Assert.fail("Expected an IllegalStateException");
	^^^^^^
The type Assert is deprecated
[WARNING] /jobs/genie.tcf/tcf-master-tests-4.7/workspace/tests/plugins/org.eclipse.tcf.debug.test/src/org/eclipse/tcf/debug/test/CacheTests.java:[106] 
	Assert.fail("Expected an IllegalStateException");
	       ^^^^^^^^^^^^^^^^^^^^^^^^^^^^^^^^^^^^^^^^^
The method fail(String) from the type Assert is deprecated
[WARNING] /jobs/genie.tcf/tcf-master-tests-4.7/workspace/tests/plugins/org.eclipse.tcf.debug.test/src/org/eclipse/tcf/debug/test/CacheTests.java:[111] 
	Assert.assertTrue(fTestCache.isValid());
	^^^^^^
The type Assert is deprecated
[WARNING] /jobs/genie.tcf/tcf-master-tests-4.7/workspace/tests/plugins/org.eclipse.tcf.debug.test/src/org/eclipse/tcf/debug/test/CacheTests.java:[111] 
	Assert.assertTrue(fTestCache.isValid());
	       ^^^^^^^^^^^^^^^^^^^^^^^^^^^^^^^^
The method assertTrue(boolean) from the type Assert is deprecated
[WARNING] /jobs/genie.tcf/tcf-master-tests-4.7/workspace/tests/plugins/org.eclipse.tcf.debug.test/src/org/eclipse/tcf/debug/test/CacheTests.java:[112] 
	Assert.assertEquals(null, fTestCache.getData());
	^^^^^^
The type Assert is deprecated
[WARNING] /jobs/genie.tcf/tcf-master-tests-4.7/workspace/tests/plugins/org.eclipse.tcf.debug.test/src/org/eclipse/tcf/debug/test/CacheTests.java:[112] 
	Assert.assertEquals(null, fTestCache.getData());
	       ^^^^^^^^^^^^^^^^^^^^^^^^^^^^^^^^^^^^^^^^
The method assertEquals(Object, Object) from the type Assert is deprecated
[WARNING] /jobs/genie.tcf/tcf-master-tests-4.7/workspace/tests/plugins/org.eclipse.tcf.debug.test/src/org/eclipse/tcf/debug/test/CacheTests.java:[113] 
	Assert.assertNotNull(fTestCache.getError());
	^^^^^^
The type Assert is deprecated
[WARNING] /jobs/genie.tcf/tcf-master-tests-4.7/workspace/tests/plugins/org.eclipse.tcf.debug.test/src/org/eclipse/tcf/debug/test/CacheTests.java:[113] 
	Assert.assertNotNull(fTestCache.getError());
	       ^^^^^^^^^^^^^^^^^^^^^^^^^^^^^^^^^^^^
The method assertNotNull(Object) from the type Assert is deprecated
[WARNING] /jobs/genie.tcf/tcf-master-tests-4.7/workspace/tests/plugins/org.eclipse.tcf.debug.test/src/org/eclipse/tcf/debug/test/CacheTests.java:[114] 
	Assert.assertEquals(fTestCache.getError(), ERROR_TARGET_RUNNING);
	^^^^^^
The type Assert is deprecated
[WARNING] /jobs/genie.tcf/tcf-master-tests-4.7/workspace/tests/plugins/org.eclipse.tcf.debug.test/src/org/eclipse/tcf/debug/test/CacheTests.java:[114] 
	Assert.assertEquals(fTestCache.getError(), ERROR_TARGET_RUNNING);
	       ^^^^^^^^^^^^^^^^^^^^^^^^^^^^^^^^^^^^^^^^^^^^^^^^^^^^^^^^^
The method assertEquals(Object, Object) from the type Assert is deprecated
[WARNING] /jobs/genie.tcf/tcf-master-tests-4.7/workspace/tests/plugins/org.eclipse.tcf.debug.test/src/org/eclipse/tcf/debug/test/CacheTests.java:[118] 
	Assert.assertFalse(fTestCache.isValid());
	^^^^^^
The type Assert is deprecated
[WARNING] /jobs/genie.tcf/tcf-master-tests-4.7/workspace/tests/plugins/org.eclipse.tcf.debug.test/src/org/eclipse/tcf/debug/test/CacheTests.java:[118] 
	Assert.assertFalse(fTestCache.isValid());
	       ^^^^^^^^^^^^^^^^^^^^^^^^^^^^^^^^^
The method assertFalse(boolean) from the type Assert is deprecated
[WARNING] /jobs/genie.tcf/tcf-master-tests-4.7/workspace/tests/plugins/org.eclipse.tcf.debug.test/src/org/eclipse/tcf/debug/test/CacheTests.java:[121] 
	Assert.fail("Expected an IllegalStateException");
	^^^^^^
The type Assert is deprecated
[WARNING] /jobs/genie.tcf/tcf-master-tests-4.7/workspace/tests/plugins/org.eclipse.tcf.debug.test/src/org/eclipse/tcf/debug/test/CacheTests.java:[121] 
	Assert.fail("Expected an IllegalStateException");
	       ^^^^^^^^^^^^^^^^^^^^^^^^^^^^^^^^^^^^^^^^^
The method fail(String) from the type Assert is deprecated
[WARNING] /jobs/genie.tcf/tcf-master-tests-4.7/workspace/tests/plugins/org.eclipse.tcf.debug.test/src/org/eclipse/tcf/debug/test/CacheTests.java:[125] 
	Assert.fail("Expected an IllegalStateException");
	^^^^^^
The type Assert is deprecated
[WARNING] /jobs/genie.tcf/tcf-master-tests-4.7/workspace/tests/plugins/org.eclipse.tcf.debug.test/src/org/eclipse/tcf/debug/test/CacheTests.java:[125] 
	Assert.fail("Expected an IllegalStateException");
	       ^^^^^^^^^^^^^^^^^^^^^^^^^^^^^^^^^^^^^^^^^
The method fail(String) from the type Assert is deprecated
[WARNING] /jobs/genie.tcf/tcf-master-tests-4.7/workspace/tests/plugins/org.eclipse.tcf.debug.test/src/org/eclipse/tcf/debug/test/CacheTests.java:[127] 
	Assert.assertFalse(fRetrieveRm.isCanceled());
	^^^^^^
The type Assert is deprecated
[WARNING] /jobs/genie.tcf/tcf-master-tests-4.7/workspace/tests/plugins/org.eclipse.tcf.debug.test/src/org/eclipse/tcf/debug/test/CacheTests.java:[127] 
	Assert.assertFalse(fRetrieveRm.isCanceled());
	       ^^^^^^^^^^^^^^^^^^^^^^^^^^^^^^^^^^^^^
The method assertFalse(boolean) from the type Assert is deprecated
[WARNING] /jobs/genie.tcf/tcf-master-tests-4.7/workspace/tests/plugins/org.eclipse.tcf.debug.test/src/org/eclipse/tcf/debug/test/CacheTests.java:[131] 
	Assert.assertFalse(fTestCache.isValid());
	^^^^^^
The type Assert is deprecated
[WARNING] /jobs/genie.tcf/tcf-master-tests-4.7/workspace/tests/plugins/org.eclipse.tcf.debug.test/src/org/eclipse/tcf/debug/test/CacheTests.java:[131] 
	Assert.assertFalse(fTestCache.isValid());
	       ^^^^^^^^^^^^^^^^^^^^^^^^^^^^^^^^^
The method assertFalse(boolean) from the type Assert is deprecated
[WARNING] /jobs/genie.tcf/tcf-master-tests-4.7/workspace/tests/plugins/org.eclipse.tcf.debug.test/src/org/eclipse/tcf/debug/test/CacheTests.java:[134] 
	Assert.fail("Expected an IllegalStateException");
	^^^^^^
The type Assert is deprecated
[WARNING] /jobs/genie.tcf/tcf-master-tests-4.7/workspace/tests/plugins/org.eclipse.tcf.debug.test/src/org/eclipse/tcf/debug/test/CacheTests.java:[134] 
	Assert.fail("Expected an IllegalStateException");
	       ^^^^^^^^^^^^^^^^^^^^^^^^^^^^^^^^^^^^^^^^^
The method fail(String) from the type Assert is deprecated
[WARNING] /jobs/genie.tcf/tcf-master-tests-4.7/workspace/tests/plugins/org.eclipse.tcf.debug.test/src/org/eclipse/tcf/debug/test/CacheTests.java:[138] 
	Assert.fail("Expected an IllegalStateException");
	^^^^^^
The type Assert is deprecated
[WARNING] /jobs/genie.tcf/tcf-master-tests-4.7/workspace/tests/plugins/org.eclipse.tcf.debug.test/src/org/eclipse/tcf/debug/test/CacheTests.java:[138] 
	Assert.fail("Expected an IllegalStateException");
	       ^^^^^^^^^^^^^^^^^^^^^^^^^^^^^^^^^^^^^^^^^
The method fail(String) from the type Assert is deprecated
[WARNING] /jobs/genie.tcf/tcf-master-tests-4.7/workspace/tests/plugins/org.eclipse.tcf.debug.test/src/org/eclipse/tcf/debug/test/CacheTests.java:[140] 
	Assert.assertTrue(fRetrieveRm.isCanceled());
	^^^^^^
The type Assert is deprecated
[WARNING] /jobs/genie.tcf/tcf-master-tests-4.7/workspace/tests/plugins/org.eclipse.tcf.debug.test/src/org/eclipse/tcf/debug/test/CacheTests.java:[140] 
	Assert.assertTrue(fRetrieveRm.isCanceled());
	       ^^^^^^^^^^^^^^^^^^^^^^^^^^^^^^^^^^^^
The method assertTrue(boolean) from the type Assert is deprecated
[WARNING] /jobs/genie.tcf/tcf-master-tests-4.7/workspace/tests/plugins/org.eclipse.tcf.debug.test/src/org/eclipse/tcf/debug/test/CacheTests.java:[148] 
	Assert.assertFalse(fTestCache.isValid());
	^^^^^^
The type Assert is deprecated
[WARNING] /jobs/genie.tcf/tcf-master-tests-4.7/workspace/tests/plugins/org.eclipse.tcf.debug.test/src/org/eclipse/tcf/debug/test/CacheTests.java:[148] 
	Assert.assertFalse(fTestCache.isValid());
	       ^^^^^^^^^^^^^^^^^^^^^^^^^^^^^^^^^
The method assertFalse(boolean) from the type Assert is deprecated
[WARNING] /jobs/genie.tcf/tcf-master-tests-4.7/workspace/tests/plugins/org.eclipse.tcf.debug.test/src/org/eclipse/tcf/debug/test/CacheTests.java:[156] 
	Assert.assertFalse(fTestCache.isValid());
	^^^^^^
The type Assert is deprecated
[WARNING] /jobs/genie.tcf/tcf-master-tests-4.7/workspace/tests/plugins/org.eclipse.tcf.debug.test/src/org/eclipse/tcf/debug/test/CacheTests.java:[156] 
	Assert.assertFalse(fTestCache.isValid());
	       ^^^^^^^^^^^^^^^^^^^^^^^^^^^^^^^^^
The method assertFalse(boolean) from the type Assert is deprecated
[WARNING] /jobs/genie.tcf/tcf-master-tests-4.7/workspace/tests/plugins/org.eclipse.tcf.debug.test/src/org/eclipse/tcf/debug/test/CacheTests.java:[166] 
	Assert.assertEquals(1, (int)fTestCache.getData());
	^^^^^^
The type Assert is deprecated
[WARNING] /jobs/genie.tcf/tcf-master-tests-4.7/workspace/tests/plugins/org.eclipse.tcf.debug.test/src/org/eclipse/tcf/debug/test/CacheTests.java:[166] 
	Assert.assertEquals(1, (int)fTestCache.getData());
	       ^^^^^^^^^^^^^^^^^^^^^^^^^^^^^^^^^^^^^^^^^^
The method assertEquals(int, int) from the type Assert is deprecated
[WARNING] /jobs/genie.tcf/tcf-master-tests-4.7/workspace/tests/plugins/org.eclipse.tcf.debug.test/src/org/eclipse/tcf/debug/test/CacheTests.java:[167] 
	Assert.assertTrue(fTestCache.isValid());
	^^^^^^
The type Assert is deprecated
[WARNING] /jobs/genie.tcf/tcf-master-tests-4.7/workspace/tests/plugins/org.eclipse.tcf.debug.test/src/org/eclipse/tcf/debug/test/CacheTests.java:[167] 
	Assert.assertTrue(fTestCache.isValid());
	       ^^^^^^^^^^^^^^^^^^^^^^^^^^^^^^^^
The method assertTrue(boolean) from the type Assert is deprecated
[WARNING] /jobs/genie.tcf/tcf-master-tests-4.7/workspace/tests/plugins/org.eclipse.tcf.debug.test/src/org/eclipse/tcf/debug/test/CacheTests.java:[171] 
	Assert.assertEquals(1, (int)q.get());
	^^^^^^
The type Assert is deprecated
[WARNING] /jobs/genie.tcf/tcf-master-tests-4.7/workspace/tests/plugins/org.eclipse.tcf.debug.test/src/org/eclipse/tcf/debug/test/CacheTests.java:[171] 
	Assert.assertEquals(1, (int)q.get());
	       ^^^^^^^^^^^^^^^^^^^^^^^^^^^^^
The method assertEquals(int, int) from the type Assert is deprecated
[WARNING] /jobs/genie.tcf/tcf-master-tests-4.7/workspace/tests/plugins/org.eclipse.tcf.debug.test/src/org/eclipse/tcf/debug/test/CacheTests.java:[179] 
	Assert.assertFalse(fTestCache.isValid());
	^^^^^^
The type Assert is deprecated
[WARNING] /jobs/genie.tcf/tcf-master-tests-4.7/workspace/tests/plugins/org.eclipse.tcf.debug.test/src/org/eclipse/tcf/debug/test/CacheTests.java:[179] 
	Assert.assertFalse(fTestCache.isValid());
	       ^^^^^^^^^^^^^^^^^^^^^^^^^^^^^^^^^
The method assertFalse(boolean) from the type Assert is deprecated
[WARNING] /jobs/genie.tcf/tcf-master-tests-4.7/workspace/tests/plugins/org.eclipse.tcf.debug.test/src/org/eclipse/tcf/debug/test/CacheTests.java:[189] 
	Assert.assertFalse(fTestCache.isValid());
	^^^^^^
The type Assert is deprecated
[WARNING] /jobs/genie.tcf/tcf-master-tests-4.7/workspace/tests/plugins/org.eclipse.tcf.debug.test/src/org/eclipse/tcf/debug/test/CacheTests.java:[189] 
	Assert.assertFalse(fTestCache.isValid());
	       ^^^^^^^^^^^^^^^^^^^^^^^^^^^^^^^^^
The method assertFalse(boolean) from the type Assert is deprecated
[WARNING] /jobs/genie.tcf/tcf-master-tests-4.7/workspace/tests/plugins/org.eclipse.tcf.debug.test/src/org/eclipse/tcf/debug/test/CacheTests.java:[202] 
	Assert.assertEquals(1, (int)q.get());
	^^^^^^
The type Assert is deprecated
[WARNING] /jobs/genie.tcf/tcf-master-tests-4.7/workspace/tests/plugins/org.eclipse.tcf.debug.test/src/org/eclipse/tcf/debug/test/CacheTests.java:[202] 
	Assert.assertEquals(1, (int)q.get());
	       ^^^^^^^^^^^^^^^^^^^^^^^^^^^^^
The method assertEquals(int, int) from the type Assert is deprecated
[WARNING] /jobs/genie.tcf/tcf-master-tests-4.7/workspace/tests/plugins/org.eclipse.tcf.debug.test/src/org/eclipse/tcf/debug/test/CacheTests.java:[210] 
	Assert.assertFalse(fTestCache.isValid());
	^^^^^^
The type Assert is deprecated
[WARNING] /jobs/genie.tcf/tcf-master-tests-4.7/workspace/tests/plugins/org.eclipse.tcf.debug.test/src/org/eclipse/tcf/debug/test/CacheTests.java:[210] 
	Assert.assertFalse(fTestCache.isValid());
	       ^^^^^^^^^^^^^^^^^^^^^^^^^^^^^^^^^
The method assertFalse(boolean) from the type Assert is deprecated
[WARNING] /jobs/genie.tcf/tcf-master-tests-4.7/workspace/tests/plugins/org.eclipse.tcf.debug.test/src/org/eclipse/tcf/debug/test/CacheTests.java:[224] 
	Assert.assertFalse(fTestCache.isValid());
	^^^^^^
The type Assert is deprecated
[WARNING] /jobs/genie.tcf/tcf-master-tests-4.7/workspace/tests/plugins/org.eclipse.tcf.debug.test/src/org/eclipse/tcf/debug/test/CacheTests.java:[224] 
	Assert.assertFalse(fTestCache.isValid());
	       ^^^^^^^^^^^^^^^^^^^^^^^^^^^^^^^^^
The method assertFalse(boolean) from the type Assert is deprecated
[WARNING] /jobs/genie.tcf/tcf-master-tests-4.7/workspace/tests/plugins/org.eclipse.tcf.debug.test/src/org/eclipse/tcf/debug/test/CacheTests.java:[235] 
	Assert.assertEquals(1, (int)q1.get());
	^^^^^^
The type Assert is deprecated
[WARNING] /jobs/genie.tcf/tcf-master-tests-4.7/workspace/tests/plugins/org.eclipse.tcf.debug.test/src/org/eclipse/tcf/debug/test/CacheTests.java:[235] 
	Assert.assertEquals(1, (int)q1.get());
	       ^^^^^^^^^^^^^^^^^^^^^^^^^^^^^^
The method assertEquals(int, int) from the type Assert is deprecated
[WARNING] /jobs/genie.tcf/tcf-master-tests-4.7/workspace/tests/plugins/org.eclipse.tcf.debug.test/src/org/eclipse/tcf/debug/test/CacheTests.java:[236] 
	Assert.assertEquals(1, (int)q2.get());
	^^^^^^
The type Assert is deprecated
[WARNING] /jobs/genie.tcf/tcf-master-tests-4.7/workspace/tests/plugins/org.eclipse.tcf.debug.test/src/org/eclipse/tcf/debug/test/CacheTests.java:[236] 
	Assert.assertEquals(1, (int)q2.get());
	       ^^^^^^^^^^^^^^^^^^^^^^^^^^^^^^
The method assertEquals(int, int) from the type Assert is deprecated
[WARNING] /jobs/genie.tcf/tcf-master-tests-4.7/workspace/tests/plugins/org.eclipse.tcf.debug.test/src/org/eclipse/tcf/debug/test/CacheTests.java:[244] 
	Assert.assertFalse(fTestCache.isValid());
	^^^^^^
The type Assert is deprecated
[WARNING] /jobs/genie.tcf/tcf-master-tests-4.7/workspace/tests/plugins/org.eclipse.tcf.debug.test/src/org/eclipse/tcf/debug/test/CacheTests.java:[244] 
	Assert.assertFalse(fTestCache.isValid());
	       ^^^^^^^^^^^^^^^^^^^^^^^^^^^^^^^^^
The method assertFalse(boolean) from the type Assert is deprecated
[WARNING] /jobs/genie.tcf/tcf-master-tests-4.7/workspace/tests/plugins/org.eclipse.tcf.debug.test/src/org/eclipse/tcf/debug/test/CacheTests.java:[257] 
	Assert.assertFalse(fTestCache.isValid());
	^^^^^^
The type Assert is deprecated
[WARNING] /jobs/genie.tcf/tcf-master-tests-4.7/workspace/tests/plugins/org.eclipse.tcf.debug.test/src/org/eclipse/tcf/debug/test/CacheTests.java:[257] 
	Assert.assertFalse(fTestCache.isValid());
	       ^^^^^^^^^^^^^^^^^^^^^^^^^^^^^^^^^
The method assertFalse(boolean) from the type Assert is deprecated
[WARNING] /jobs/genie.tcf/tcf-master-tests-4.7/workspace/tests/plugins/org.eclipse.tcf.debug.test/src/org/eclipse/tcf/debug/test/CacheTests.java:[269] 
	Assert.assertEquals(1, (int)q.get());            
	^^^^^^
The type Assert is deprecated
[WARNING] /jobs/genie.tcf/tcf-master-tests-4.7/workspace/tests/plugins/org.eclipse.tcf.debug.test/src/org/eclipse/tcf/debug/test/CacheTests.java:[269] 
	Assert.assertEquals(1, (int)q.get());            
	       ^^^^^^^^^^^^^^^^^^^^^^^^^^^^^
The method assertEquals(int, int) from the type Assert is deprecated
[WARNING] /jobs/genie.tcf/tcf-master-tests-4.7/workspace/tests/plugins/org.eclipse.tcf.debug.test/src/org/eclipse/tcf/debug/test/CacheTests.java:[315] 
	Assert.assertEquals(null, fRetrieveRm);
	^^^^^^
The type Assert is deprecated
[WARNING] /jobs/genie.tcf/tcf-master-tests-4.7/workspace/tests/plugins/org.eclipse.tcf.debug.test/src/org/eclipse/tcf/debug/test/CacheTests.java:[315] 
	Assert.assertEquals(null, fRetrieveRm);
	       ^^^^^^^^^^^^^^^^^^^^^^^^^^^^^^^
The method assertEquals(Object, Object) from the type Assert is deprecated
[WARNING] /jobs/genie.tcf/tcf-master-tests-4.7/workspace/tests/plugins/org.eclipse.tcf.debug.test/src/org/eclipse/tcf/debug/test/CacheTests.java:[327] 
	Assert.fail("expected an exeption");
	^^^^^^
The type Assert is deprecated
[WARNING] /jobs/genie.tcf/tcf-master-tests-4.7/workspace/tests/plugins/org.eclipse.tcf.debug.test/src/org/eclipse/tcf/debug/test/CacheTests.java:[327] 
	Assert.fail("expected an exeption");
	       ^^^^^^^^^^^^^^^^^^^^^^^^^^^^
The method fail(String) from the type Assert is deprecated
[WARNING] /jobs/genie.tcf/tcf-master-tests-4.7/workspace/tests/plugins/org.eclipse.tcf.debug.test/src/org/eclipse/tcf/debug/test/CacheTests.java:[387] 
	Assert.assertEquals(Integer.valueOf(1), q.get());
	^^^^^^
The type Assert is deprecated
[WARNING] /jobs/genie.tcf/tcf-master-tests-4.7/workspace/tests/plugins/org.eclipse.tcf.debug.test/src/org/eclipse/tcf/debug/test/CacheTests.java:[387] 
	Assert.assertEquals(Integer.valueOf(1), q.get());
	       ^^^^^^^^^^^^^^^^^^^^^^^^^^^^^^^^^^^^^^^^^
The method assertEquals(Object, Object) from the type Assert is deprecated
[WARNING] /jobs/genie.tcf/tcf-master-tests-4.7/workspace/tests/plugins/org.eclipse.tcf.debug.test/src/org/eclipse/tcf/debug/test/CacheTests.java:[425] 
	Assert.fail("Expected a cancellation exception");
	^^^^^^
The type Assert is deprecated
[WARNING] /jobs/genie.tcf/tcf-master-tests-4.7/workspace/tests/plugins/org.eclipse.tcf.debug.test/src/org/eclipse/tcf/debug/test/CacheTests.java:[425] 
	Assert.fail("Expected a cancellation exception");
	       ^^^^^^^^^^^^^^^^^^^^^^^^^^^^^^^^^^^^^^^^^
The method fail(String) from the type Assert is deprecated
[WARNING] /jobs/genie.tcf/tcf-master-tests-4.7/workspace/tests/plugins/org.eclipse.tcf.debug.test/src/org/eclipse/tcf/debug/test/CacheTests.java:[456] 
	Assert.fail("Expected a cancellation exception");
	^^^^^^
The type Assert is deprecated
[WARNING] /jobs/genie.tcf/tcf-master-tests-4.7/workspace/tests/plugins/org.eclipse.tcf.debug.test/src/org/eclipse/tcf/debug/test/CacheTests.java:[456] 
	Assert.fail("Expected a cancellation exception");
	       ^^^^^^^^^^^^^^^^^^^^^^^^^^^^^^^^^^^^^^^^^
The method fail(String) from the type Assert is deprecated
[WARNING] /jobs/genie.tcf/tcf-master-tests-4.7/workspace/tests/plugins/org.eclipse.tcf.debug.test/src/org/eclipse/tcf/debug/test/CacheTests.java:[490] 
	Assert.fail("Expected a cancellation exception");
	^^^^^^
The type Assert is deprecated
[WARNING] /jobs/genie.tcf/tcf-master-tests-4.7/workspace/tests/plugins/org.eclipse.tcf.debug.test/src/org/eclipse/tcf/debug/test/CacheTests.java:[490] 
	Assert.fail("Expected a cancellation exception");
	       ^^^^^^^^^^^^^^^^^^^^^^^^^^^^^^^^^^^^^^^^^
The method fail(String) from the type Assert is deprecated
[WARNING] /jobs/genie.tcf/tcf-master-tests-4.7/workspace/tests/plugins/org.eclipse.tcf.debug.test/src/org/eclipse/tcf/debug/test/CacheTests.java:[555] 
	Assert.assertTrue(canceledCalled[0]);        
	^^^^^^
The type Assert is deprecated
[WARNING] /jobs/genie.tcf/tcf-master-tests-4.7/workspace/tests/plugins/org.eclipse.tcf.debug.test/src/org/eclipse/tcf/debug/test/CacheTests.java:[555] 
	Assert.assertTrue(canceledCalled[0]);        
	       ^^^^^^^^^^^^^^^^^^^^^^^^^^^^^
The method assertTrue(boolean) from the type Assert is deprecated
[WARNING] /jobs/genie.tcf/tcf-master-tests-4.7/workspace/tests/plugins/org.eclipse.tcf.debug.test/src/org/eclipse/tcf/debug/test/CacheTests.java:[559] 
	Assert.fail("Expected a cancellation exception");
	^^^^^^
The type Assert is deprecated
[WARNING] /jobs/genie.tcf/tcf-master-tests-4.7/workspace/tests/plugins/org.eclipse.tcf.debug.test/src/org/eclipse/tcf/debug/test/CacheTests.java:[559] 
	Assert.fail("Expected a cancellation exception");
	       ^^^^^^^^^^^^^^^^^^^^^^^^^^^^^^^^^^^^^^^^^
The method fail(String) from the type Assert is deprecated
[WARNING] /jobs/genie.tcf/tcf-master-tests-4.7/workspace/tests/plugins/org.eclipse.tcf.debug.test/src/org/eclipse/tcf/debug/test/CacheTests.java:[646] 
	Assert.assertFalse(fRetrieveRm.isCanceled());
	^^^^^^
The type Assert is deprecated
[WARNING] /jobs/genie.tcf/tcf-master-tests-4.7/workspace/tests/plugins/org.eclipse.tcf.debug.test/src/org/eclipse/tcf/debug/test/CacheTests.java:[646] 
	Assert.assertFalse(fRetrieveRm.isCanceled());
	       ^^^^^^^^^^^^^^^^^^^^^^^^^^^^^^^^^^^^^
The method assertFalse(boolean) from the type Assert is deprecated
[WARNING] /jobs/genie.tcf/tcf-master-tests-4.7/workspace/tests/plugins/org.eclipse.tcf.debug.test/src/org/eclipse/tcf/debug/test/CacheTests.java:[682] 
	Assert.fail("Expected a cancellation exception");
	^^^^^^
The type Assert is deprecated
[WARNING] /jobs/genie.tcf/tcf-master-tests-4.7/workspace/tests/plugins/org.eclipse.tcf.debug.test/src/org/eclipse/tcf/debug/test/CacheTests.java:[682] 
	Assert.fail("Expected a cancellation exception");
	       ^^^^^^^^^^^^^^^^^^^^^^^^^^^^^^^^^^^^^^^^^
The method fail(String) from the type Assert is deprecated
[WARNING] /jobs/genie.tcf/tcf-master-tests-4.7/workspace/tests/plugins/org.eclipse.tcf.debug.test/src/org/eclipse/tcf/debug/test/CacheTests.java:[690] 
	Assert.fail("Expected a cancellation exception");
	^^^^^^
The type Assert is deprecated
[WARNING] /jobs/genie.tcf/tcf-master-tests-4.7/workspace/tests/plugins/org.eclipse.tcf.debug.test/src/org/eclipse/tcf/debug/test/CacheTests.java:[690] 
	Assert.fail("Expected a cancellation exception");
	       ^^^^^^^^^^^^^^^^^^^^^^^^^^^^^^^^^^^^^^^^^
The method fail(String) from the type Assert is deprecated
[WARNING] /jobs/genie.tcf/tcf-master-tests-4.7/workspace/tests/plugins/org.eclipse.tcf.debug.test/src/org/eclipse/tcf/debug/test/CacheTests.java:[729] 
	Assert.fail("Expected a cancellation exception");
	^^^^^^
The type Assert is deprecated
[WARNING] /jobs/genie.tcf/tcf-master-tests-4.7/workspace/tests/plugins/org.eclipse.tcf.debug.test/src/org/eclipse/tcf/debug/test/CacheTests.java:[729] 
	Assert.fail("Expected a cancellation exception");
	       ^^^^^^^^^^^^^^^^^^^^^^^^^^^^^^^^^^^^^^^^^
The method fail(String) from the type Assert is deprecated
[WARNING] /jobs/genie.tcf/tcf-master-tests-4.7/workspace/tests/plugins/org.eclipse.tcf.debug.test/src/org/eclipse/tcf/debug/test/CacheTests.java:[823] 
	Assert.fail("Expected InvalidCacheException");
	^^^^^^
The type Assert is deprecated
[WARNING] /jobs/genie.tcf/tcf-master-tests-4.7/workspace/tests/plugins/org.eclipse.tcf.debug.test/src/org/eclipse/tcf/debug/test/CacheTests.java:[823] 
	Assert.fail("Expected InvalidCacheException");
	       ^^^^^^^^^^^^^^^^^^^^^^^^^^^^^^^^^^^^^^
The method fail(String) from the type Assert is deprecated
[WARNING] /jobs/genie.tcf/tcf-master-tests-4.7/workspace/tests/plugins/org.eclipse.tcf.debug.test/src/org/eclipse/tcf/debug/test/SourceDisplayListener.java:[15] 
	import org.eclipse.cdt.debug.internal.core.sourcelookup.CSourceNotFoundElement;
	       ^^^^^^^^^^^^^^^^^^^^^^^^^^^^^^^^^^^^^^^^^^^^^^^^^^^^^^^^^^^^^^^^^^^^^^^
Discouraged access: The type 'CSourceNotFoundElement' is not API (restriction on classpath entry '/home/hudson/genie.tcf/.hudson/jobs/tcf-master-tests-4.7/workspace/.maven/repo/p2/osgi/bundle/org.eclipse.cdt.debug.core/8.2.0.201709131603/org.eclipse.cdt.debug.core-8.2.0.201709131603.jar')
[WARNING] /jobs/genie.tcf/tcf-master-tests-4.7/workspace/tests/plugins/org.eclipse.tcf.debug.test/src/org/eclipse/tcf/debug/test/SourceDisplayListener.java:[154] 
	if (artifact instanceof CSourceNotFoundElement) {
	                        ^^^^^^^^^^^^^^^^^^^^^^
Discouraged access: The type 'CSourceNotFoundElement' is not API (restriction on classpath entry '/home/hudson/genie.tcf/.hudson/jobs/tcf-master-tests-4.7/workspace/.maven/repo/p2/osgi/bundle/org.eclipse.cdt.debug.core/8.2.0.201709131603/org.eclipse.cdt.debug.core-8.2.0.201709131603.jar')
[WARNING] /jobs/genie.tcf/tcf-master-tests-4.7/workspace/tests/plugins/org.eclipse.tcf.debug.test/src/org/eclipse/tcf/debug/test/SourceDisplayListener.java:[155] 
	location = new Path( ((CSourceNotFoundElement)artifact).getFile() );
	                     ^^^^^^^^^^^^^^^^^^^^^^^^^^^^^^^^^^^^^^^^^^^^
Discouraged access: The method 'CSourceNotFoundElement.getFile()' is not API (restriction on classpath entry '/home/hudson/genie.tcf/.hudson/jobs/tcf-master-tests-4.7/workspace/.maven/repo/p2/osgi/bundle/org.eclipse.cdt.debug.core/8.2.0.201709131603/org.eclipse.cdt.debug.core-8.2.0.201709131603.jar')
[WARNING] /jobs/genie.tcf/tcf-master-tests-4.7/workspace/tests/plugins/org.eclipse.tcf.debug.test/src/org/eclipse/tcf/debug/test/SourceDisplayListener.java:[155] 
	location = new Path( ((CSourceNotFoundElement)artifact).getFile() );
	                       ^^^^^^^^^^^^^^^^^^^^^^
Discouraged access: The type 'CSourceNotFoundElement' is not API (restriction on classpath entry '/home/hudson/genie.tcf/.hudson/jobs/tcf-master-tests-4.7/workspace/.maven/repo/p2/osgi/bundle/org.eclipse.cdt.debug.core/8.2.0.201709131603/org.eclipse.cdt.debug.core-8.2.0.201709131603.jar')
[WARNING] /jobs/genie.tcf/tcf-master-tests-4.7/workspace/tests/plugins/org.eclipse.tcf.debug.test/src/org/eclipse/tcf/debug/test/TransactionTests.java:[18] 
	import junit.framework.Assert;
	       ^^^^^^^^^^^^^^^^^^^^^^
The type Assert is deprecated
[WARNING] /jobs/genie.tcf/tcf-master-tests-4.7/workspace/tests/plugins/org.eclipse.tcf.debug.test/src/org/eclipse/tcf/debug/test/TransactionTests.java:[38] 
	final private int fIndex;
	                  ^^^^^^
The value of the field TransactionTests.TestCache.fIndex is not used
[WARNING] /jobs/genie.tcf/tcf-master-tests-4.7/workspace/tests/plugins/org.eclipse.tcf.debug.test/src/org/eclipse/tcf/debug/test/TransactionTests.java:[186] 
	Assert.assertEquals(1, (int)q.get());
	^^^^^^
The type Assert is deprecated
[WARNING] /jobs/genie.tcf/tcf-master-tests-4.7/workspace/tests/plugins/org.eclipse.tcf.debug.test/src/org/eclipse/tcf/debug/test/TransactionTests.java:[186] 
	Assert.assertEquals(1, (int)q.get());
	       ^^^^^^^^^^^^^^^^^^^^^^^^^^^^^
The method assertEquals(int, int) from the type Assert is deprecated
[WARNING] /jobs/genie.tcf/tcf-master-tests-4.7/workspace/tests/plugins/org.eclipse.tcf.debug.test/src/org/eclipse/tcf/debug/test/TransactionTests.java:[228] 
	Assert.assertEquals(NUM_CACHES, (int)q.get());
	^^^^^^
The type Assert is deprecated
[WARNING] /jobs/genie.tcf/tcf-master-tests-4.7/workspace/tests/plugins/org.eclipse.tcf.debug.test/src/org/eclipse/tcf/debug/test/TransactionTests.java:[228] 
	Assert.assertEquals(NUM_CACHES, (int)q.get());
	       ^^^^^^^^^^^^^^^^^^^^^^^^^^^^^^^^^^^^^^
The method assertEquals(int, int) from the type Assert is deprecated
[WARNING] /jobs/genie.tcf/tcf-master-tests-4.7/workspace/tests/plugins/org.eclipse.tcf.debug.test/src/org/eclipse/tcf/debug/test/RangeCacheTests.java:[20] 
	import junit.framework.Assert;
	       ^^^^^^^^^^^^^^^^^^^^^^
The type Assert is deprecated
[WARNING] /jobs/genie.tcf/tcf-master-tests-4.7/workspace/tests/plugins/org.eclipse.tcf.debug.test/src/org/eclipse/tcf/debug/test/RangeCacheTests.java:[137] 
	Assert.assertTrue(cache.isValid());
	^^^^^^
The type Assert is deprecated
[WARNING] /jobs/genie.tcf/tcf-master-tests-4.7/workspace/tests/plugins/org.eclipse.tcf.debug.test/src/org/eclipse/tcf/debug/test/RangeCacheTests.java:[137] 
	Assert.assertTrue(cache.isValid());
	       ^^^^^^^^^^^^^^^^^^^^^^^^^^^
The method assertTrue(boolean) from the type Assert is deprecated
[WARNING] /jobs/genie.tcf/tcf-master-tests-4.7/workspace/tests/plugins/org.eclipse.tcf.debug.test/src/org/eclipse/tcf/debug/test/RangeCacheTests.java:[138] 
	Assert.assertEquals(makeList(offset, count), cache.getData());
	^^^^^^
The type Assert is deprecated
[WARNING] /jobs/genie.tcf/tcf-master-tests-4.7/workspace/tests/plugins/org.eclipse.tcf.debug.test/src/org/eclipse/tcf/debug/test/RangeCacheTests.java:[138] 
	Assert.assertEquals(makeList(offset, count), cache.getData());
	       ^^^^^^^^^^^^^^^^^^^^^^^^^^^^^^^^^^^^^^^^^^^^^^^^^^^^^^
The method assertEquals(Object, Object) from the type Assert is deprecated
[WARNING] /jobs/genie.tcf/tcf-master-tests-4.7/workspace/tests/plugins/org.eclipse.tcf.debug.test/src/org/eclipse/tcf/debug/test/RangeCacheTests.java:[139] 
	Assert.assertTrue(cache.getError() == null);
	^^^^^^
The type Assert is deprecated
[WARNING] /jobs/genie.tcf/tcf-master-tests-4.7/workspace/tests/plugins/org.eclipse.tcf.debug.test/src/org/eclipse/tcf/debug/test/RangeCacheTests.java:[139] 
	Assert.assertTrue(cache.getError() == null);
	       ^^^^^^^^^^^^^^^^^^^^^^^^^^^^^^^^^^^^
The method assertTrue(boolean) from the type Assert is deprecated
[WARNING] /jobs/genie.tcf/tcf-master-tests-4.7/workspace/tests/plugins/org.eclipse.tcf.debug.test/src/org/eclipse/tcf/debug/test/RangeCacheTests.java:[143] 
	Assert.assertTrue(cache.isValid());
	^^^^^^
The type Assert is deprecated
[WARNING] /jobs/genie.tcf/tcf-master-tests-4.7/workspace/tests/plugins/org.eclipse.tcf.debug.test/src/org/eclipse/tcf/debug/test/RangeCacheTests.java:[143] 
	Assert.assertTrue(cache.isValid());
	       ^^^^^^^^^^^^^^^^^^^^^^^^^^^
The method assertTrue(boolean) from the type Assert is deprecated
[WARNING] /jobs/genie.tcf/tcf-master-tests-4.7/workspace/tests/plugins/org.eclipse.tcf.debug.test/src/org/eclipse/tcf/debug/test/RangeCacheTests.java:[144] 
	Assert.assertFalse(cache.getError() == null);
	^^^^^^
The type Assert is deprecated
[WARNING] /jobs/genie.tcf/tcf-master-tests-4.7/workspace/tests/plugins/org.eclipse.tcf.debug.test/src/org/eclipse/tcf/debug/test/RangeCacheTests.java:[144] 
	Assert.assertFalse(cache.getError() == null);
	       ^^^^^^^^^^^^^^^^^^^^^^^^^^^^^^^^^^^^^
The method assertFalse(boolean) from the type Assert is deprecated
[WARNING] /jobs/genie.tcf/tcf-master-tests-4.7/workspace/tests/plugins/org.eclipse.tcf.debug.test/src/org/eclipse/tcf/debug/test/RangeCacheTests.java:[148] 
	Assert.assertFalse(cache.isValid());
	^^^^^^
The type Assert is deprecated
[WARNING] /jobs/genie.tcf/tcf-master-tests-4.7/workspace/tests/plugins/org.eclipse.tcf.debug.test/src/org/eclipse/tcf/debug/test/RangeCacheTests.java:[148] 
	Assert.assertFalse(cache.isValid());
	       ^^^^^^^^^^^^^^^^^^^^^^^^^^^^
The method assertFalse(boolean) from the type Assert is deprecated
[WARNING] /jobs/genie.tcf/tcf-master-tests-4.7/workspace/tests/plugins/org.eclipse.tcf.debug.test/src/org/eclipse/tcf/debug/test/RangeCacheTests.java:[151] 
	Assert.fail("Expected an IllegalStateException");
	^^^^^^
The type Assert is deprecated
[WARNING] /jobs/genie.tcf/tcf-master-tests-4.7/workspace/tests/plugins/org.eclipse.tcf.debug.test/src/org/eclipse/tcf/debug/test/RangeCacheTests.java:[151] 
	Assert.fail("Expected an IllegalStateException");
	       ^^^^^^^^^^^^^^^^^^^^^^^^^^^^^^^^^^^^^^^^^
The method fail(String) from the type Assert is deprecated
[WARNING] /jobs/genie.tcf/tcf-master-tests-4.7/workspace/tests/plugins/org.eclipse.tcf.debug.test/src/org/eclipse/tcf/debug/test/RangeCacheTests.java:[155] 
	Assert.fail("Expected an IllegalStateException");
	^^^^^^
The type Assert is deprecated
[WARNING] /jobs/genie.tcf/tcf-master-tests-4.7/workspace/tests/plugins/org.eclipse.tcf.debug.test/src/org/eclipse/tcf/debug/test/RangeCacheTests.java:[155] 
	Assert.fail("Expected an IllegalStateException");
	       ^^^^^^^^^^^^^^^^^^^^^^^^^^^^^^^^^^^^^^^^^
The method fail(String) from the type Assert is deprecated
[WARNING] /jobs/genie.tcf/tcf-master-tests-4.7/workspace/tests/plugins/org.eclipse.tcf.debug.test/src/org/eclipse/tcf/debug/test/RangeCacheTests.java:[187] 
	Assert.assertEquals(retrieveCount, fRetrieveInfos.size());
	^^^^^^
The type Assert is deprecated
[WARNING] /jobs/genie.tcf/tcf-master-tests-4.7/workspace/tests/plugins/org.eclipse.tcf.debug.test/src/org/eclipse/tcf/debug/test/RangeCacheTests.java:[187] 
	Assert.assertEquals(retrieveCount, fRetrieveInfos.size());
	       ^^^^^^^^^^^^^^^^^^^^^^^^^^^^^^^^^^^^^^^^^^^^^^^^^^
The method assertEquals(int, int) from the type Assert is deprecated
[WARNING] /jobs/genie.tcf/tcf-master-tests-4.7/workspace/tests/plugins/org.eclipse.tcf.debug.test/src/org/eclipse/tcf/debug/test/RangeCacheTests.java:[196] 
	Assert.assertEquals(makeList(queryOffset, queryCount), q.get());
	^^^^^^
The type Assert is deprecated
[WARNING] /jobs/genie.tcf/tcf-master-tests-4.7/workspace/tests/plugins/org.eclipse.tcf.debug.test/src/org/eclipse/tcf/debug/test/RangeCacheTests.java:[196] 
	Assert.assertEquals(makeList(queryOffset, queryCount), q.get());
	       ^^^^^^^^^^^^^^^^^^^^^^^^^^^^^^^^^^^^^^^^^^^^^^^^^^^^^^^^
The method assertEquals(Object, Object) from the type Assert is deprecated
[WARNING] /jobs/genie.tcf/tcf-master-tests-4.7/workspace/tests/plugins/org.eclipse.tcf.debug.test/src/org/eclipse/tcf/debug/test/RangeCacheTests.java:[248] 
	Assert.assertEquals(retrieveCount, fRetrieveInfos.size());
	^^^^^^
The type Assert is deprecated
[WARNING] /jobs/genie.tcf/tcf-master-tests-4.7/workspace/tests/plugins/org.eclipse.tcf.debug.test/src/org/eclipse/tcf/debug/test/RangeCacheTests.java:[248] 
	Assert.assertEquals(retrieveCount, fRetrieveInfos.size());
	       ^^^^^^^^^^^^^^^^^^^^^^^^^^^^^^^^^^^^^^^^^^^^^^^^^^
The method assertEquals(int, int) from the type Assert is deprecated
[WARNING] /jobs/genie.tcf/tcf-master-tests-4.7/workspace/tests/plugins/org.eclipse.tcf.debug.test/src/org/eclipse/tcf/debug/test/RangeCacheTests.java:[258] 
	Assert.assertEquals(100, data.size());
	^^^^^^
The type Assert is deprecated
[WARNING] /jobs/genie.tcf/tcf-master-tests-4.7/workspace/tests/plugins/org.eclipse.tcf.debug.test/src/org/eclipse/tcf/debug/test/RangeCacheTests.java:[258] 
	Assert.assertEquals(100, data.size());
	       ^^^^^^^^^^^^^^^^^^^^^^^^^^^^^^
The method assertEquals(int, int) from the type Assert is deprecated
[WARNING] /jobs/genie.tcf/tcf-master-tests-4.7/workspace/tests/plugins/org.eclipse.tcf.debug.test/src/org/eclipse/tcf/debug/test/RangeCacheTests.java:[260] 
	Assert.assertEquals(null, data.get(i));
	^^^^^^
The type Assert is deprecated
[WARNING] /jobs/genie.tcf/tcf-master-tests-4.7/workspace/tests/plugins/org.eclipse.tcf.debug.test/src/org/eclipse/tcf/debug/test/RangeCacheTests.java:[260] 
	Assert.assertEquals(null, data.get(i));
	       ^^^^^^^^^^^^^^^^^^^^^^^^^^^^^^^
The method assertEquals(Object, Object) from the type Assert is deprecated
[WARNING] /jobs/genie.tcf/tcf-master-tests-4.7/workspace/tests/plugins/org.eclipse.tcf.debug.test/src/org/eclipse/tcf/debug/test/RangeCacheTests.java:[264] 
	Assert.assertEquals(new Integer(i), data.get(i));
	^^^^^^
The type Assert is deprecated
[WARNING] /jobs/genie.tcf/tcf-master-tests-4.7/workspace/tests/plugins/org.eclipse.tcf.debug.test/src/org/eclipse/tcf/debug/test/RangeCacheTests.java:[264] 
	Assert.assertEquals(new Integer(i), data.get(i));
	       ^^^^^^^^^^^^^^^^^^^^^^^^^^^^^^^^^^^^^^^^^
The method assertEquals(Object, Object) from the type Assert is deprecated
[WARNING] /jobs/genie.tcf/tcf-master-tests-4.7/workspace/tests/plugins/org.eclipse.tcf.debug.test/src/org/eclipse/tcf/debug/test/RangeCacheTests.java:[286] 
	Assert.assertEquals(retrieveCount, fRetrieveInfos.size());
	^^^^^^
The type Assert is deprecated
[WARNING] /jobs/genie.tcf/tcf-master-tests-4.7/workspace/tests/plugins/org.eclipse.tcf.debug.test/src/org/eclipse/tcf/debug/test/RangeCacheTests.java:[286] 
	Assert.assertEquals(retrieveCount, fRetrieveInfos.size());
	       ^^^^^^^^^^^^^^^^^^^^^^^^^^^^^^^^^^^^^^^^^^^^^^^^^^
The method assertEquals(int, int) from the type Assert is deprecated
[WARNING] /jobs/genie.tcf/tcf-master-tests-4.7/workspace/tests/plugins/org.eclipse.tcf.debug.test/src/org/eclipse/tcf/debug/test/RangeCacheTests.java:[289] 
	Assert.assertEquals(retrieveOffsets[i], info.fOffset);
	^^^^^^
The type Assert is deprecated
[WARNING] /jobs/genie.tcf/tcf-master-tests-4.7/workspace/tests/plugins/org.eclipse.tcf.debug.test/src/org/eclipse/tcf/debug/test/RangeCacheTests.java:[289] 
	Assert.assertEquals(retrieveOffsets[i], info.fOffset);
	       ^^^^^^^^^^^^^^^^^^^^^^^^^^^^^^^^^^^^^^^^^^^^^^
The method assertEquals(long, long) from the type Assert is deprecated
[WARNING] /jobs/genie.tcf/tcf-master-tests-4.7/workspace/tests/plugins/org.eclipse.tcf.debug.test/src/org/eclipse/tcf/debug/test/RangeCacheTests.java:[290] 
	Assert.assertEquals(retrieveCounts[i], info.fCount);
	^^^^^^
The type Assert is deprecated
[WARNING] /jobs/genie.tcf/tcf-master-tests-4.7/workspace/tests/plugins/org.eclipse.tcf.debug.test/src/org/eclipse/tcf/debug/test/RangeCacheTests.java:[290] 
	Assert.assertEquals(retrieveCounts[i], info.fCount);
	       ^^^^^^^^^^^^^^^^^^^^^^^^^^^^^^^^^^^^^^^^^^^^
The method assertEquals(int, int) from the type Assert is deprecated
[WARNING] /jobs/genie.tcf/tcf-master-tests-4.7/workspace/tests/plugins/org.eclipse.tcf.debug.test/src/org/eclipse/tcf/debug/test/RangeCacheTests.java:[291] 
	Assert.assertFalse(info.fRm.isCanceled());
	^^^^^^
The type Assert is deprecated
[WARNING] /jobs/genie.tcf/tcf-master-tests-4.7/workspace/tests/plugins/org.eclipse.tcf.debug.test/src/org/eclipse/tcf/debug/test/RangeCacheTests.java:[291] 
	Assert.assertFalse(info.fRm.isCanceled());
	       ^^^^^^^^^^^^^^^^^^^^^^^^^^^^^^^^^^
The method assertFalse(boolean) from the type Assert is deprecated
[WARNING] /jobs/genie.tcf/tcf-master-tests-4.7/workspace/tests/plugins/org.eclipse.tcf.debug.test/src/org/eclipse/tcf/debug/test/RangeCacheTests.java:[298] 
	Assert.fail("Expected a cancellation exception");
	^^^^^^
The type Assert is deprecated
[WARNING] /jobs/genie.tcf/tcf-master-tests-4.7/workspace/tests/plugins/org.eclipse.tcf.debug.test/src/org/eclipse/tcf/debug/test/RangeCacheTests.java:[298] 
	Assert.fail("Expected a cancellation exception");
	       ^^^^^^^^^^^^^^^^^^^^^^^^^^^^^^^^^^^^^^^^^
The method fail(String) from the type Assert is deprecated
[WARNING] /jobs/genie.tcf/tcf-master-tests-4.7/workspace/tests/plugins/org.eclipse.tcf.debug.test/src/org/eclipse/tcf/debug/test/RangeCacheTests.java:[302] 
	Assert.assertTrue(info.fRm.isCanceled());
	^^^^^^
The type Assert is deprecated
[WARNING] /jobs/genie.tcf/tcf-master-tests-4.7/workspace/tests/plugins/org.eclipse.tcf.debug.test/src/org/eclipse/tcf/debug/test/RangeCacheTests.java:[302] 
	Assert.assertTrue(info.fRm.isCanceled());
	       ^^^^^^^^^^^^^^^^^^^^^^^^^^^^^^^^^
The method assertTrue(boolean) from the type Assert is deprecated
[WARNING] /jobs/genie.tcf/tcf-master-tests-4.7/workspace/tests/plugins/org.eclipse.tcf.debug.test/src/org/eclipse/tcf/debug/test/RangeCacheTests.java:[401] 
	Assert.assertEquals(1, fRetrieveInfos.size());
	^^^^^^
The type Assert is deprecated
[WARNING] /jobs/genie.tcf/tcf-master-tests-4.7/workspace/tests/plugins/org.eclipse.tcf.debug.test/src/org/eclipse/tcf/debug/test/RangeCacheTests.java:[401] 
	Assert.assertEquals(1, fRetrieveInfos.size());
	       ^^^^^^^^^^^^^^^^^^^^^^^^^^^^^^^^^^^^^^
The method assertEquals(int, int) from the type Assert is deprecated
[WARNING] /jobs/genie.tcf/tcf-master-tests-4.7/workspace/tests/plugins/org.eclipse.tcf.debug.test/src/org/eclipse/tcf/debug/test/RangeCacheTests.java:[405] 
	Assert.assertEquals(makeList(10, 100), q.get());
	^^^^^^
The type Assert is deprecated
[WARNING] /jobs/genie.tcf/tcf-master-tests-4.7/workspace/tests/plugins/org.eclipse.tcf.debug.test/src/org/eclipse/tcf/debug/test/RangeCacheTests.java:[405] 
	Assert.assertEquals(makeList(10, 100), q.get());
	       ^^^^^^^^^^^^^^^^^^^^^^^^^^^^^^^^^^^^^^^^
The method assertEquals(Object, Object) from the type Assert is deprecated
[WARNING] /jobs/genie.tcf/tcf-master-tests-4.7/workspace/tests/plugins/org.eclipse.tcf.debug.test/src/org/eclipse/tcf/debug/test/RangeCacheTests.java:[443] 
	Assert.fail("Expected an ExecutionException");            
	^^^^^^
The type Assert is deprecated
[WARNING] /jobs/genie.tcf/tcf-master-tests-4.7/workspace/tests/plugins/org.eclipse.tcf.debug.test/src/org/eclipse/tcf/debug/test/RangeCacheTests.java:[443] 
	Assert.fail("Expected an ExecutionException");            
	       ^^^^^^^^^^^^^^^^^^^^^^^^^^^^^^^^^^^^^^
The method fail(String) from the type Assert is deprecated
[WARNING] /jobs/genie.tcf/tcf-master-tests-4.7/workspace/tests/plugins/org.eclipse.tcf.debug.test/src/org/eclipse/tcf/debug/test/RangeCacheTests.java:[462] 
	Assert.assertEquals(1, fRetrieveInfos.size());
	^^^^^^
The type Assert is deprecated
[WARNING] /jobs/genie.tcf/tcf-master-tests-4.7/workspace/tests/plugins/org.eclipse.tcf.debug.test/src/org/eclipse/tcf/debug/test/RangeCacheTests.java:[462] 
	Assert.assertEquals(1, fRetrieveInfos.size());
	       ^^^^^^^^^^^^^^^^^^^^^^^^^^^^^^^^^^^^^^
The method assertEquals(int, int) from the type Assert is deprecated
[WARNING] /jobs/genie.tcf/tcf-master-tests-4.7/workspace/tests/plugins/org.eclipse.tcf.debug.test/src/org/eclipse/tcf/debug/test/QueryTests.java:[18] 
	import junit.framework.Assert;
	       ^^^^^^^^^^^^^^^^^^^^^^
The type Assert is deprecated
[WARNING] /jobs/genie.tcf/tcf-master-tests-4.7/workspace/tests/plugins/org.eclipse.tcf.debug.test/src/org/eclipse/tcf/debug/test/QueryTests.java:[26] 
	import org.junit.Test;
	       ^^^^^^^^^^^^^^
The import org.junit.Test is never used
[WARNING] /jobs/genie.tcf/tcf-master-tests-4.7/workspace/tests/plugins/org.eclipse.tcf.debug.test/src/org/eclipse/tcf/debug/test/QueryTests.java:[42] 
	Assert.assertTrue(!q.isDone());
	^^^^^^
The type Assert is deprecated
[WARNING] /jobs/genie.tcf/tcf-master-tests-4.7/workspace/tests/plugins/org.eclipse.tcf.debug.test/src/org/eclipse/tcf/debug/test/QueryTests.java:[42] 
	Assert.assertTrue(!q.isDone());
	       ^^^^^^^^^^^^^^^^^^^^^^^
The method assertTrue(boolean) from the type Assert is deprecated
[WARNING] /jobs/genie.tcf/tcf-master-tests-4.7/workspace/tests/plugins/org.eclipse.tcf.debug.test/src/org/eclipse/tcf/debug/test/QueryTests.java:[43] 
	Assert.assertTrue(!q.isCancelled());
	^^^^^^
The type Assert is deprecated
[WARNING] /jobs/genie.tcf/tcf-master-tests-4.7/workspace/tests/plugins/org.eclipse.tcf.debug.test/src/org/eclipse/tcf/debug/test/QueryTests.java:[43] 
	Assert.assertTrue(!q.isCancelled());
	       ^^^^^^^^^^^^^^^^^^^^^^^^^^^^
The method assertTrue(boolean) from the type Assert is deprecated
[WARNING] /jobs/genie.tcf/tcf-master-tests-4.7/workspace/tests/plugins/org.eclipse.tcf.debug.test/src/org/eclipse/tcf/debug/test/QueryTests.java:[46] 
	Assert.assertEquals(1, (int)q.get());
	^^^^^^
The type Assert is deprecated
[WARNING] /jobs/genie.tcf/tcf-master-tests-4.7/workspace/tests/plugins/org.eclipse.tcf.debug.test/src/org/eclipse/tcf/debug/test/QueryTests.java:[46] 
	Assert.assertEquals(1, (int)q.get());
	       ^^^^^^^^^^^^^^^^^^^^^^^^^^^^^
The method assertEquals(int, int) from the type Assert is deprecated
[WARNING] /jobs/genie.tcf/tcf-master-tests-4.7/workspace/tests/plugins/org.eclipse.tcf.debug.test/src/org/eclipse/tcf/debug/test/QueryTests.java:[49] 
	Assert.assertTrue(q.isDone());
	^^^^^^
The type Assert is deprecated
[WARNING] /jobs/genie.tcf/tcf-master-tests-4.7/workspace/tests/plugins/org.eclipse.tcf.debug.test/src/org/eclipse/tcf/debug/test/QueryTests.java:[49] 
	Assert.assertTrue(q.isDone());
	       ^^^^^^^^^^^^^^^^^^^^^^
The method assertTrue(boolean) from the type Assert is deprecated
[WARNING] /jobs/genie.tcf/tcf-master-tests-4.7/workspace/tests/plugins/org.eclipse.tcf.debug.test/src/org/eclipse/tcf/debug/test/QueryTests.java:[50] 
	Assert.assertTrue(!q.isCancelled());
	^^^^^^
The type Assert is deprecated
[WARNING] /jobs/genie.tcf/tcf-master-tests-4.7/workspace/tests/plugins/org.eclipse.tcf.debug.test/src/org/eclipse/tcf/debug/test/QueryTests.java:[50] 
	Assert.assertTrue(!q.isCancelled());
	       ^^^^^^^^^^^^^^^^^^^^^^^^^^^^
The method assertTrue(boolean) from the type Assert is deprecated
[WARNING] /jobs/genie.tcf/tcf-master-tests-4.7/workspace/tests/plugins/org.eclipse.tcf.debug.test/src/org/eclipse/tcf/debug/test/QueryTests.java:[66] 
	Assert.assertTrue(!q.isDone());
	^^^^^^
The type Assert is deprecated
[WARNING] /jobs/genie.tcf/tcf-master-tests-4.7/workspace/tests/plugins/org.eclipse.tcf.debug.test/src/org/eclipse/tcf/debug/test/QueryTests.java:[66] 
	Assert.assertTrue(!q.isDone());
	       ^^^^^^^^^^^^^^^^^^^^^^^
The method assertTrue(boolean) from the type Assert is deprecated
[WARNING] /jobs/genie.tcf/tcf-master-tests-4.7/workspace/tests/plugins/org.eclipse.tcf.debug.test/src/org/eclipse/tcf/debug/test/QueryTests.java:[67] 
	Assert.assertTrue(!q.isCancelled());
	^^^^^^
The type Assert is deprecated
[WARNING] /jobs/genie.tcf/tcf-master-tests-4.7/workspace/tests/plugins/org.eclipse.tcf.debug.test/src/org/eclipse/tcf/debug/test/QueryTests.java:[67] 
	Assert.assertTrue(!q.isCancelled());
	       ^^^^^^^^^^^^^^^^^^^^^^^^^^^^
The method assertTrue(boolean) from the type Assert is deprecated
[WARNING] /jobs/genie.tcf/tcf-master-tests-4.7/workspace/tests/plugins/org.eclipse.tcf.debug.test/src/org/eclipse/tcf/debug/test/QueryTests.java:[73] 
	Assert.fail("Expected exception");
	^^^^^^
The type Assert is deprecated
[WARNING] /jobs/genie.tcf/tcf-master-tests-4.7/workspace/tests/plugins/org.eclipse.tcf.debug.test/src/org/eclipse/tcf/debug/test/QueryTests.java:[73] 
	Assert.fail("Expected exception");
	       ^^^^^^^^^^^^^^^^^^^^^^^^^^
The method fail(String) from the type Assert is deprecated
[WARNING] /jobs/genie.tcf/tcf-master-tests-4.7/workspace/tests/plugins/org.eclipse.tcf.debug.test/src/org/eclipse/tcf/debug/test/QueryTests.java:[75] 
	Assert.assertEquals(e.getCause().getMessage(), error_message);
	^^^^^^
The type Assert is deprecated
[WARNING] /jobs/genie.tcf/tcf-master-tests-4.7/workspace/tests/plugins/org.eclipse.tcf.debug.test/src/org/eclipse/tcf/debug/test/QueryTests.java:[75] 
	Assert.assertEquals(e.getCause().getMessage(), error_message);
	       ^^^^^^^^^^^^^^^^^^^^^^^^^^^^^^^^^^^^^^^^^^^^^^^^^^^^^^
The method assertEquals(String, String) from the type Assert is deprecated
[WARNING] /jobs/genie.tcf/tcf-master-tests-4.7/workspace/tests/plugins/org.eclipse.tcf.debug.test/src/org/eclipse/tcf/debug/test/QueryTests.java:[79] 
	Assert.assertTrue(q.isDone());
	^^^^^^
The type Assert is deprecated
[WARNING] /jobs/genie.tcf/tcf-master-tests-4.7/workspace/tests/plugins/org.eclipse.tcf.debug.test/src/org/eclipse/tcf/debug/test/QueryTests.java:[79] 
	Assert.assertTrue(q.isDone());
	       ^^^^^^^^^^^^^^^^^^^^^^
The method assertTrue(boolean) from the type Assert is deprecated
[WARNING] /jobs/genie.tcf/tcf-master-tests-4.7/workspace/tests/plugins/org.eclipse.tcf.debug.test/src/org/eclipse/tcf/debug/test/QueryTests.java:[80] 
	Assert.assertTrue(!q.isCancelled());
	^^^^^^
The type Assert is deprecated
[WARNING] /jobs/genie.tcf/tcf-master-tests-4.7/workspace/tests/plugins/org.eclipse.tcf.debug.test/src/org/eclipse/tcf/debug/test/QueryTests.java:[80] 
	Assert.assertTrue(!q.isCancelled());
	       ^^^^^^^^^^^^^^^^^^^^^^^^^^^^
The method assertTrue(boolean) from the type Assert is deprecated
[WARNING] /jobs/genie.tcf/tcf-master-tests-4.7/workspace/tests/plugins/org.eclipse.tcf.debug.test/src/org/eclipse/tcf/debug/test/QueryTests.java:[101] 
	Assert.assertEquals(1, (int)q.get()); 
	^^^^^^
The type Assert is deprecated
[WARNING] /jobs/genie.tcf/tcf-master-tests-4.7/workspace/tests/plugins/org.eclipse.tcf.debug.test/src/org/eclipse/tcf/debug/test/QueryTests.java:[101] 
	Assert.assertEquals(1, (int)q.get()); 
	       ^^^^^^^^^^^^^^^^^^^^^^^^^^^^^
The method assertEquals(int, int) from the type Assert is deprecated
[WARNING] /jobs/genie.tcf/tcf-master-tests-4.7/workspace/tests/plugins/org.eclipse.tcf.debug.test/src/org/eclipse/tcf/debug/test/QueryTests.java:[117] 
	Assert.fail("Excpected ExecutionExeption");
	^^^^^^
The type Assert is deprecated
[WARNING] /jobs/genie.tcf/tcf-master-tests-4.7/workspace/tests/plugins/org.eclipse.tcf.debug.test/src/org/eclipse/tcf/debug/test/QueryTests.java:[117] 
	Assert.fail("Excpected ExecutionExeption");
	       ^^^^^^^^^^^^^^^^^^^^^^^^^^^^^^^^^^^
The method fail(String) from the type Assert is deprecated
[WARNING] /jobs/genie.tcf/tcf-master-tests-4.7/workspace/tests/plugins/org.eclipse.tcf.debug.test/src/org/eclipse/tcf/debug/test/QueryTests.java:[120] 
	Assert.assertTrue(q.isDone());
	^^^^^^
The type Assert is deprecated
[WARNING] /jobs/genie.tcf/tcf-master-tests-4.7/workspace/tests/plugins/org.eclipse.tcf.debug.test/src/org/eclipse/tcf/debug/test/QueryTests.java:[120] 
	Assert.assertTrue(q.isDone());
	       ^^^^^^^^^^^^^^^^^^^^^^
The method assertTrue(boolean) from the type Assert is deprecated
[WARNING] /jobs/genie.tcf/tcf-master-tests-4.7/workspace/tests/plugins/org.eclipse.tcf.debug.test/src/org/eclipse/tcf/debug/test/QueryTests.java:[121] 
	Assert.assertTrue(!q.isCancelled());
	^^^^^^
The type Assert is deprecated
[WARNING] /jobs/genie.tcf/tcf-master-tests-4.7/workspace/tests/plugins/org.eclipse.tcf.debug.test/src/org/eclipse/tcf/debug/test/QueryTests.java:[121] 
	Assert.assertTrue(!q.isCancelled());
	       ^^^^^^^^^^^^^^^^^^^^^^^^^^^^
The method assertTrue(boolean) from the type Assert is deprecated
[WARNING] /jobs/genie.tcf/tcf-master-tests-4.7/workspace/tests/plugins/org.eclipse.tcf.debug.test/src/org/eclipse/tcf/debug/test/QueryTests.java:[128] 
	Assert.fail("Query was cancelled, it should not be called."); //$NON-NLS-1$
	^^^^^^
The type Assert is deprecated
[WARNING] /jobs/genie.tcf/tcf-master-tests-4.7/workspace/tests/plugins/org.eclipse.tcf.debug.test/src/org/eclipse/tcf/debug/test/QueryTests.java:[128] 
	Assert.fail("Query was cancelled, it should not be called."); //$NON-NLS-1$
	       ^^^^^^^^^^^^^^^^^^^^^^^^^^^^^^^^^^^^^^^^^^^^^^^^^^^^^
The method fail(String) from the type Assert is deprecated
[WARNING] /jobs/genie.tcf/tcf-master-tests-4.7/workspace/tests/plugins/org.eclipse.tcf.debug.test/src/org/eclipse/tcf/debug/test/QueryTests.java:[136] 
	Assert.assertTrue(q.isDone());
	^^^^^^
The type Assert is deprecated
[WARNING] /jobs/genie.tcf/tcf-master-tests-4.7/workspace/tests/plugins/org.eclipse.tcf.debug.test/src/org/eclipse/tcf/debug/test/QueryTests.java:[136] 
	Assert.assertTrue(q.isDone());
	       ^^^^^^^^^^^^^^^^^^^^^^
The method assertTrue(boolean) from the type Assert is deprecated
[WARNING] /jobs/genie.tcf/tcf-master-tests-4.7/workspace/tests/plugins/org.eclipse.tcf.debug.test/src/org/eclipse/tcf/debug/test/QueryTests.java:[137] 
	Assert.assertTrue(q.isCancelled());            
	^^^^^^
The type Assert is deprecated
[WARNING] /jobs/genie.tcf/tcf-master-tests-4.7/workspace/tests/plugins/org.eclipse.tcf.debug.test/src/org/eclipse/tcf/debug/test/QueryTests.java:[137] 
	Assert.assertTrue(q.isCancelled());            
	       ^^^^^^^^^^^^^^^^^^^^^^^^^^^
The method assertTrue(boolean) from the type Assert is deprecated
[WARNING] /jobs/genie.tcf/tcf-master-tests-4.7/workspace/tests/plugins/org.eclipse.tcf.debug.test/src/org/eclipse/tcf/debug/test/QueryTests.java:[150] 
	Assert.assertTrue(q.isDone());
	^^^^^^
The type Assert is deprecated
[WARNING] /jobs/genie.tcf/tcf-master-tests-4.7/workspace/tests/plugins/org.eclipse.tcf.debug.test/src/org/eclipse/tcf/debug/test/QueryTests.java:[150] 
	Assert.assertTrue(q.isDone());
	       ^^^^^^^^^^^^^^^^^^^^^^
The method assertTrue(boolean) from the type Assert is deprecated
[WARNING] /jobs/genie.tcf/tcf-master-tests-4.7/workspace/tests/plugins/org.eclipse.tcf.debug.test/src/org/eclipse/tcf/debug/test/QueryTests.java:[151] 
	Assert.assertTrue(q.isCancelled());            
	^^^^^^
The type Assert is deprecated
[WARNING] /jobs/genie.tcf/tcf-master-tests-4.7/workspace/tests/plugins/org.eclipse.tcf.debug.test/src/org/eclipse/tcf/debug/test/QueryTests.java:[151] 
	Assert.assertTrue(q.isCancelled());            
	       ^^^^^^^^^^^^^^^^^^^^^^^^^^^
The method assertTrue(boolean) from the type Assert is deprecated
[WARNING] /jobs/genie.tcf/tcf-master-tests-4.7/workspace/tests/plugins/org.eclipse.tcf.debug.test/src/org/eclipse/tcf/debug/test/QueryTests.java:[153] 
	Assert.assertTrue("CancellationException should have been thrown", false); //$NON-NLS-1$
	^^^^^^
The type Assert is deprecated
[WARNING] /jobs/genie.tcf/tcf-master-tests-4.7/workspace/tests/plugins/org.eclipse.tcf.debug.test/src/org/eclipse/tcf/debug/test/QueryTests.java:[153] 
	Assert.assertTrue("CancellationException should have been thrown", false); //$NON-NLS-1$
	       ^^^^^^^^^^^^^^^^^^^^^^^^^^^^^^^^^^^^^^^^^^^^^^^^^^^^^^^^^^^^^^^^^^
The method assertTrue(String, boolean) from the type Assert is deprecated
[WARNING] /jobs/genie.tcf/tcf-master-tests-4.7/workspace/tests/plugins/org.eclipse.tcf.debug.test/src/org/eclipse/tcf/debug/test/QueryTests.java:[190] 
	Assert.assertTrue(cancelCalled[0]);
	^^^^^^
The type Assert is deprecated
[WARNING] /jobs/genie.tcf/tcf-master-tests-4.7/workspace/tests/plugins/org.eclipse.tcf.debug.test/src/org/eclipse/tcf/debug/test/QueryTests.java:[190] 
	Assert.assertTrue(cancelCalled[0]);
	       ^^^^^^^^^^^^^^^^^^^^^^^^^^^
The method assertTrue(boolean) from the type Assert is deprecated
[WARNING] /jobs/genie.tcf/tcf-master-tests-4.7/workspace/tests/plugins/org.eclipse.tcf.debug.test/src/org/eclipse/tcf/debug/test/QueryTests.java:[191] 
	Assert.assertTrue(rmHolder[0].isCanceled());
	^^^^^^
The type Assert is deprecated
[WARNING] /jobs/genie.tcf/tcf-master-tests-4.7/workspace/tests/plugins/org.eclipse.tcf.debug.test/src/org/eclipse/tcf/debug/test/QueryTests.java:[191] 
	Assert.assertTrue(rmHolder[0].isCanceled());
	       ^^^^^^^^^^^^^^^^^^^^^^^^^^^^^^^^^^^^
The method assertTrue(boolean) from the type Assert is deprecated
[WARNING] /jobs/genie.tcf/tcf-master-tests-4.7/workspace/tests/plugins/org.eclipse.tcf.debug.test/src/org/eclipse/tcf/debug/test/QueryTests.java:[192] 
	Assert.assertTrue(q.isCancelled());
	^^^^^^
The type Assert is deprecated
[WARNING] /jobs/genie.tcf/tcf-master-tests-4.7/workspace/tests/plugins/org.eclipse.tcf.debug.test/src/org/eclipse/tcf/debug/test/QueryTests.java:[192] 
	Assert.assertTrue(q.isCancelled());
	       ^^^^^^^^^^^^^^^^^^^^^^^^^^^
The method assertTrue(boolean) from the type Assert is deprecated
[WARNING] /jobs/genie.tcf/tcf-master-tests-4.7/workspace/tests/plugins/org.eclipse.tcf.debug.test/src/org/eclipse/tcf/debug/test/QueryTests.java:[193] 
	Assert.assertTrue(q.isDone());
	^^^^^^
The type Assert is deprecated
[WARNING] /jobs/genie.tcf/tcf-master-tests-4.7/workspace/tests/plugins/org.eclipse.tcf.debug.test/src/org/eclipse/tcf/debug/test/QueryTests.java:[193] 
	Assert.assertTrue(q.isDone());
	       ^^^^^^^^^^^^^^^^^^^^^^
The method assertTrue(boolean) from the type Assert is deprecated
[WARNING] /jobs/genie.tcf/tcf-master-tests-4.7/workspace/tests/plugins/org.eclipse.tcf.debug.test/src/org/eclipse/tcf/debug/test/QueryTests.java:[201] 
	Assert.assertTrue(q.isDone());
	^^^^^^
The type Assert is deprecated
[WARNING] /jobs/genie.tcf/tcf-master-tests-4.7/workspace/tests/plugins/org.eclipse.tcf.debug.test/src/org/eclipse/tcf/debug/test/QueryTests.java:[201] 
	Assert.assertTrue(q.isDone());
	       ^^^^^^^^^^^^^^^^^^^^^^
The method assertTrue(boolean) from the type Assert is deprecated
[WARNING] /jobs/genie.tcf/tcf-master-tests-4.7/workspace/tests/plugins/org.eclipse.tcf.debug.test/src/org/eclipse/tcf/debug/test/QueryTests.java:[202] 
	Assert.assertTrue(q.isCancelled());            
	^^^^^^
The type Assert is deprecated
[WARNING] /jobs/genie.tcf/tcf-master-tests-4.7/workspace/tests/plugins/org.eclipse.tcf.debug.test/src/org/eclipse/tcf/debug/test/QueryTests.java:[202] 
	Assert.assertTrue(q.isCancelled());            
	       ^^^^^^^^^^^^^^^^^^^^^^^^^^^
The method assertTrue(boolean) from the type Assert is deprecated
[WARNING] /jobs/genie.tcf/tcf-master-tests-4.7/workspace/tests/plugins/org.eclipse.tcf.debug.test/src/org/eclipse/tcf/debug/test/QueryTests.java:[218] 
	Assert.assertTrue(q.isDone());
	^^^^^^
The type Assert is deprecated
[WARNING] /jobs/genie.tcf/tcf-master-tests-4.7/workspace/tests/plugins/org.eclipse.tcf.debug.test/src/org/eclipse/tcf/debug/test/QueryTests.java:[218] 
	Assert.assertTrue(q.isDone());
	       ^^^^^^^^^^^^^^^^^^^^^^
The method assertTrue(boolean) from the type Assert is deprecated
[WARNING] /jobs/genie.tcf/tcf-master-tests-4.7/workspace/tests/plugins/org.eclipse.tcf.debug.test/src/org/eclipse/tcf/debug/test/QueryTests.java:[219] 
	Assert.assertTrue(q.isCancelled());            
	^^^^^^
The type Assert is deprecated
[WARNING] /jobs/genie.tcf/tcf-master-tests-4.7/workspace/tests/plugins/org.eclipse.tcf.debug.test/src/org/eclipse/tcf/debug/test/QueryTests.java:[219] 
	Assert.assertTrue(q.isCancelled());            
	       ^^^^^^^^^^^^^^^^^^^^^^^^^^^
The method assertTrue(boolean) from the type Assert is deprecated
[WARNING] /jobs/genie.tcf/tcf-master-tests-4.7/workspace/tests/plugins/org.eclipse.tcf.debug.test/src/org/eclipse/tcf/debug/test/QueryTests.java:[223] 
	Assert.assertTrue("CancellationException should have been thrown", false); //$NON-NLS-1$
	^^^^^^
The type Assert is deprecated
[WARNING] /jobs/genie.tcf/tcf-master-tests-4.7/workspace/tests/plugins/org.eclipse.tcf.debug.test/src/org/eclipse/tcf/debug/test/QueryTests.java:[223] 
	Assert.assertTrue("CancellationException should have been thrown", false); //$NON-NLS-1$
	       ^^^^^^^^^^^^^^^^^^^^^^^^^^^^^^^^^^^^^^^^^^^^^^^^^^^^^^^^^^^^^^^^^^
The method assertTrue(String, boolean) from the type Assert is deprecated
[WARNING] /jobs/genie.tcf/tcf-master-tests-4.7/workspace/tests/plugins/org.eclipse.tcf.debug.test/src/org/eclipse/tcf/debug/test/QueryTests.java:[250] 
	Assert.assertFalse("Query should not be done yet, it should have timed out first.", q.isDone()); //$NON-NLS-1$
	^^^^^^
The type Assert is deprecated
[WARNING] /jobs/genie.tcf/tcf-master-tests-4.7/workspace/tests/plugins/org.eclipse.tcf.debug.test/src/org/eclipse/tcf/debug/test/QueryTests.java:[250] 
	Assert.assertFalse("Query should not be done yet, it should have timed out first.", q.isDone()); //$NON-NLS-1$
	       ^^^^^^^^^^^^^^^^^^^^^^^^^^^^^^^^^^^^^^^^^^^^^^^^^^^^^^^^^^^^^^^^^^^^^^^^^^^^^^^^^^^^^^^^
The method assertFalse(String, boolean) from the type Assert is deprecated
[WARNING] /jobs/genie.tcf/tcf-master-tests-4.7/workspace/tests/plugins/org.eclipse.tcf.debug.test/src/org/eclipse/tcf/debug/test/QueryTests.java:[252] 
	Assert.assertTrue("TimeoutException should have been thrown", false); //$NON-NLS-1$
	^^^^^^
The type Assert is deprecated
[WARNING] /jobs/genie.tcf/tcf-master-tests-4.7/workspace/tests/plugins/org.eclipse.tcf.debug.test/src/org/eclipse/tcf/debug/test/QueryTests.java:[252] 
	Assert.assertTrue("TimeoutException should have been thrown", false); //$NON-NLS-1$
	       ^^^^^^^^^^^^^^^^^^^^^^^^^^^^^^^^^^^^^^^^^^^^^^^^^^^^^^^^^^^^^
The method assertTrue(String, boolean) from the type Assert is deprecated
[WARNING] /jobs/genie.tcf/tcf-master-tests-4.7/workspace/tests/plugins/org.eclipse.tcf.debug.test/src/org/eclipse/tcf/debug/test/AbstractTcfUITest.java:[154] 
	@Override public Object getAdapter(@SuppressWarnings("rawtypes") Class adapter) { return null; }
	                 ^^^^^^
Type safety: The return type Object for getAdapter(Class) from the type new ITCFObject(){} needs unchecked conversion to conform to T from the type IAdaptable
[WARNING] /jobs/genie.tcf/tcf-master-tests-4.7/workspace/tests/plugins/org.eclipse.tcf.debug.test/src/org/eclipse/tcf/debug/test/AbstractTcfUITest.java:[161] 
	@Override public Object getAdapter(@SuppressWarnings("rawtypes") Class adapter) { return null; }
	                 ^^^^^^
Type safety: The return type Object for getAdapter(Class) from the type new ITCFObject(){} needs unchecked conversion to conform to T from the type IAdaptable
[WARNING] /jobs/genie.tcf/tcf-master-tests-4.7/workspace/tests/plugins/org.eclipse.tcf.debug.test/src/org/eclipse/tcf/debug/test/AbstractTcfUITest.java:[186] 
	@Override public Object getAdapter(@SuppressWarnings("rawtypes") Class adapter) { return null; }
	                 ^^^^^^
Type safety: The return type Object for getAdapter(Class) from the type new ITCFObject(){} needs unchecked conversion to conform to T from the type IAdaptable
[WARNING] /jobs/genie.tcf/tcf-master-tests-4.7/workspace/tests/plugins/org.eclipse.tcf.debug.test/src/org/eclipse/tcf/debug/test/LineNumbersCMTest.java:[74] 
	CodeArea[] areas3 = validate(fLineNumbersCM.mapToMemory(processInfo.fProcessId, pcCodeAreas[0].file, pcCodeAreas[0].start_line, pcCodeAreas[0].start_column));
	           ^^^^^^
The value of the local variable areas3 is not used
[WARNING] /jobs/genie.tcf/tcf-master-tests-4.7/workspace/tests/plugins/org.eclipse.tcf.debug.test/src/org/eclipse/tcf/debug/test/BreakpointsTest.java:[120] 
	ICLineBreakpoint bp = createLineBreakpoint(bpCodeArea.file, bpCodeArea.start_line);
	                 ^^
The value of the local variable bp is not used
[WARNING] /jobs/genie.tcf/tcf-master-tests-4.7/workspace/tests/plugins/org.eclipse.tcf.debug.test/src/org/eclipse/tcf/debug/test/ViewerUpdatesListener.java:[20] 
	import junit.framework.Assert;
	       ^^^^^^^^^^^^^^^^^^^^^^
The type Assert is deprecated
[WARNING] /jobs/genie.tcf/tcf-master-tests-4.7/workspace/tests/plugins/org.eclipse.tcf.debug.test/src/org/eclipse/tcf/debug/test/ViewerUpdatesListener.java:[23] 
	import org.eclipse.debug.internal.ui.viewers.model.ITreeModelViewer;
	       ^^^^^^^^^^^^^^^^^^^^^^^^^^^^^^^^^^^^^^^^^^^^^^^^^^^^^^^^^^^^
The type ITreeModelViewer is deprecated
[WARNING] /jobs/genie.tcf/tcf-master-tests-4.7/workspace/tests/plugins/org.eclipse.tcf.debug.test/src/org/eclipse/tcf/debug/test/ViewerUpdatesListener.java:[46] 
	private ITreeModelViewer fViewer;
	        ^^^^^^^^^^^^^^^^
The type ITreeModelViewer is deprecated
[WARNING] /jobs/genie.tcf/tcf-master-tests-4.7/workspace/tests/plugins/org.eclipse.tcf.debug.test/src/org/eclipse/tcf/debug/test/ViewerUpdatesListener.java:[95] 
	public ViewerUpdatesListener(ITreeModelViewer viewer, boolean failOnRedundantUpdates, boolean failOnMultipleModelUpdateSequences) {
	                             ^^^^^^^^^^^^^^^^
The type ITreeModelViewer is deprecated
[WARNING] /jobs/genie.tcf/tcf-master-tests-4.7/workspace/tests/plugins/org.eclipse.tcf.debug.test/src/org/eclipse/tcf/debug/test/ViewerUpdatesListener.java:[105] 
	public ViewerUpdatesListener(ITreeModelViewer viewer) {
	                             ^^^^^^^^^^^^^^^^
The type ITreeModelViewer is deprecated
[WARNING] /jobs/genie.tcf/tcf-master-tests-4.7/workspace/tests/plugins/org.eclipse.tcf.debug.test/src/org/eclipse/tcf/debug/test/ViewerUpdatesListener.java:[275] 
	Assert.fail("Redundant Updates: " + fRedundantUpdates.toString());
	^^^^^^
The type Assert is deprecated
[WARNING] /jobs/genie.tcf/tcf-master-tests-4.7/workspace/tests/plugins/org.eclipse.tcf.debug.test/src/org/eclipse/tcf/debug/test/ViewerUpdatesListener.java:[275] 
	Assert.fail("Redundant Updates: " + fRedundantUpdates.toString());
	       ^^^^^^^^^^^^^^^^^^^^^^^^^^^^^^^^^^^^^^^^^^^^^^^^^^^^^^^^^^
The method fail(String) from the type Assert is deprecated
[WARNING] /jobs/genie.tcf/tcf-master-tests-4.7/workspace/tests/plugins/org.eclipse.tcf.debug.test/src/org/eclipse/tcf/debug/test/ViewerUpdatesListener.java:[278] 
	Assert.fail("Multiple label update sequences detected");
	^^^^^^
The type Assert is deprecated
[WARNING] /jobs/genie.tcf/tcf-master-tests-4.7/workspace/tests/plugins/org.eclipse.tcf.debug.test/src/org/eclipse/tcf/debug/test/ViewerUpdatesListener.java:[278] 
	Assert.fail("Multiple label update sequences detected");
	       ^^^^^^^^^^^^^^^^^^^^^^^^^^^^^^^^^^^^^^^^^^^^^^^^
The method fail(String) from the type Assert is deprecated
[WARNING] /jobs/genie.tcf/tcf-master-tests-4.7/workspace/tests/plugins/org.eclipse.tcf.debug.test/src/org/eclipse/tcf/debug/test/ViewerUpdatesListener.java:[281] 
	Assert.fail("Multiple viewer update sequences detected");
	^^^^^^
The type Assert is deprecated
[WARNING] /jobs/genie.tcf/tcf-master-tests-4.7/workspace/tests/plugins/org.eclipse.tcf.debug.test/src/org/eclipse/tcf/debug/test/ViewerUpdatesListener.java:[281] 
	Assert.fail("Multiple viewer update sequences detected");
	       ^^^^^^^^^^^^^^^^^^^^^^^^^^^^^^^^^^^^^^^^^^^^^^^^^
The method fail(String) from the type Assert is deprecated
234 problems (234 warnings)
[INFO] 
[INFO] --- maven-resources-plugin:2.7:testResources (default-testResources) @ org.eclipse.tcf.debug.test ---
[INFO] Using 'UTF-8' encoding to copy filtered resources.
[INFO] skip non existing resourceDirectory /jobs/genie.tcf/tcf-master-tests-4.7/workspace/tests/plugins/org.eclipse.tcf.debug.test/src/test/resources
[INFO] 
[INFO] --- tycho-source-plugin:1.0.0:plugin-source (plugin-source) @ org.eclipse.tcf.debug.test ---
[WARNING] bundle localization file /jobs/genie.tcf/tcf-master-tests-4.7/workspace/tests/plugins/org.eclipse.tcf.debug.test/plugin.properties not found
[WARNING] Bundle-Vendor header not found in /jobs/genie.tcf/tcf-master-tests-4.7/workspace/tests/plugins/org.eclipse.tcf.debug.test/META-INF/MANIFEST.MF, fallback to 'unknown' for source bundle
[INFO] Building jar: /jobs/genie.tcf/tcf-master-tests-4.7/workspace/tests/plugins/org.eclipse.tcf.debug.test/target/org.eclipse.tcf.debug.test-1.5.0-SNAPSHOT-sources.jar
[INFO] 
[INFO] --- target-platform-configuration:1.0.0:target-platform (default-target-platform) @ org.eclipse.tcf.debug.test ---
[INFO] 
[INFO] --- tycho-packaging-plugin:1.0.0:package-plugin (default-package-plugin) @ org.eclipse.tcf.debug.test ---
[WARNING] /jobs/genie.tcf/tcf-master-tests-4.7/workspace/tests/plugins/org.eclipse.tcf.debug.test/build.properties: bin.includes value(s) [data/] do not match any files.
[INFO] Building jar: /jobs/genie.tcf/tcf-master-tests-4.7/workspace/tests/plugins/org.eclipse.tcf.debug.test/target/org.eclipse.tcf.debug.test-1.5.0-SNAPSHOT.jar
[INFO] 
[INFO] --- tycho-p2-plugin:1.0.0:p2-metadata-default (default-p2-metadata-default) @ org.eclipse.tcf.debug.test ---
[INFO] 
[INFO] --- tycho-p2-plugin:1.0.0:p2-metadata (p2-metadata) @ org.eclipse.tcf.debug.test ---
[INFO] 
[INFO] --- tycho-surefire-plugin:1.0.0:test (default-test) @ org.eclipse.tcf.debug.test ---
[INFO] Publishing 2 bundles to /jobs/genie.tcf/tcf-master-tests-4.7/workspace/tests/plugins/org.eclipse.tcf.debug.test/target/p2temp/additionalBundles
[INFO] Command line:
	[/opt/public/common/jdk1.8.0_131.x64/jre/bin/java, -jar, /jobs/genie.tcf/tcf-master-tests-4.7/workspace/.maven/repo/org/eclipse/tycho/tycho-bundles-external/1.0.0/eclipse/plugins/org.eclipse.equinox.launcher_1.3.201.v20161025-1711.jar, -configuration, /tmp/tycho-p2-runtime1334135741853786168.tmp/configuration, -nosplash, -application, org.eclipse.equinox.p2.publisher.FeaturesAndBundlesPublisher, -artifactRepository, file:/jobs/genie.tcf/tcf-master-tests-4.7/workspace/target_explorer/plugins/org.eclipse.tcf.te.tests/target/p2temp/additionalBundles/, -metadataRepository, file:/jobs/genie.tcf/tcf-master-tests-4.7/workspace/target_explorer/plugins/org.eclipse.tcf.te.tests/target/p2temp/additionalBundles/, -compress, -publishArtifacts, -source, /jobs/genie.tcf/tcf-master-tests-4.7/workspace/target_explorer/plugins/org.eclipse.tcf.te.tests/target/p2temp/additionalBundles, -artifactRepository, file:/jobs/genie.tcf/tcf-master-tests-4.7/workspace/tests/plugins/org.eclipse.tcf.debug.test/target/p2temp/additionalBundles/, -metadataRepository, file:/jobs/genie.tcf/tcf-master-tests-4.7/workspace/tests/plugins/org.eclipse.tcf.debug.test/target/p2temp/additionalBundles/, -compress, -publishArtifacts, -source, /jobs/genie.tcf/tcf-master-tests-4.7/workspace/tests/plugins/org.eclipse.tcf.debug.test/target/p2temp/additionalBundles]
Generating metadata for ..
Generation completed with success [0 seconds].
[INFO] Installing IUs [org.eclipse.tcf.debug.test, org.eclipse.tycho.surefire.osgibooter, org.eclipse.tycho.surefire.junit4, org.eclipse.platform.ide, org.eclipse.sdk.feature.group, org.eclipse.cdt.platform.feature.group, org.eclipse.remote.feature.group, org.eclipse.swtbot.eclipse.feature.group] to /jobs/genie.tcf/tcf-master-tests-4.7/workspace/tests/plugins/org.eclipse.tcf.debug.test/target/work
Installing org.eclipse.tcf.debug.test 1.5.0.201609121142.
Installing org.eclipse.tycho.surefire.osgibooter 1.0.0.
Installing org.eclipse.tycho.surefire.junit4 1.0.0.
Installing org.eclipse.platform.ide 4.7.0.I20170612-0950.
Installing org.eclipse.sdk.feature.group 4.7.0.v20170612-1255.
Installing org.eclipse.cdt.platform.feature.group 9.3.2.201709131603.
Installing org.eclipse.remote.feature.group 3.0.0.201706052031.
Installing org.eclipse.swtbot.eclipse.feature.group 2.6.0.201706141832.
Operation completed in 15351 ms.
[INFO] Expected eclipse log file: /jobs/genie.tcf/tcf-master-tests-4.7/workspace/tests/plugins/org.eclipse.tcf.debug.test/target/work/data/.metadata/.log
[INFO] Command line:
	[/opt/public/common/jdk1.8.0_131.x64/jre/bin/java, -Dosgi.noShutdown=false, -Dosgi.os=linux, -Dosgi.ws=gtk, -Dosgi.arch=x86_64, -javaagent:/home/hudson/genie.tcf/.hudson/jobs/tcf-master-tests-4.7/workspace/.maven/repo/org/jacoco/org.jacoco.agent/0.7.9/org.jacoco.agent-0.7.9-runtime.jar=destfile=/jobs/genie.tcf/tcf-master-tests-4.7/workspace/tests/plugins/org.eclipse.tcf.debug.test/target/jacoco.exec,append=true,includes=org.eclipse.tcf*,excludes=org.eclipse.tcf.debug.test*:org.eclipse.tcf.te.tests.*,dumponexit=true,output=file, -Xmx512m, -XX:MaxPermSize=256m, -Dosgi.clean=true, -Dosgi.debug=/jobs/genie.tcf/tcf-master-tests-4.7/workspace/tests/plugins/org.eclipse.tcf.debug.test/tracing/.options, -Dtcf.agent.path=/home/hudson/genie.tcf/.hudson/jobs/tcf-master-tests-4.7/workspace/.agent, -jar, /jobs/genie.tcf/tcf-master-tests-4.7/workspace/tests/plugins/org.eclipse.tcf.debug.test/target/work/plugins/org.eclipse.equinox.launcher_1.4.0.v20161219-1356.jar, -debug, -consolelog, -data, /jobs/genie.tcf/tcf-master-tests-4.7/workspace/tests/plugins/org.eclipse.tcf.debug.test/target/work/data, -install, /jobs/genie.tcf/tcf-master-tests-4.7/workspace/tests/plugins/org.eclipse.tcf.debug.test/target/work, -configuration, /jobs/genie.tcf/tcf-master-tests-4.7/workspace/tests/plugins/org.eclipse.tcf.debug.test/target/work/configuration, -application, org.eclipse.tycho.surefire.osgibooter.uitest, -testproperties, /jobs/genie.tcf/tcf-master-tests-4.7/workspace/tests/plugins/org.eclipse.tcf.debug.test/target/surefire.properties, -testApplication, org.eclipse.ui.ide.workbench, -product, org.eclipse.platform.ide, -nouithread]
Java HotSpot(TM) 64-Bit Server VM warning: ignoring option MaxPermSize=256m; support was removed in 8.0
Configuration location:
    file:/jobs/genie.tcf/tcf-master-tests-4.7/workspace/tests/plugins/org.eclipse.tcf.debug.test/target/work/configuration/
Configuration file:
    file:/jobs/genie.tcf/tcf-master-tests-4.7/workspace/tests/plugins/org.eclipse.tcf.debug.test/target/work/configuration/config.ini loaded
Install location:
    file:/jobs/genie.tcf/tcf-master-tests-4.7/workspace/tests/plugins/org.eclipse.tcf.debug.test/target/work/
Framework located:
    file:/jobs/genie.tcf/tcf-master-tests-4.7/workspace/tests/plugins/org.eclipse.tcf.debug.test/target/work/plugins/org.eclipse.osgi_3.12.0.v20170512-1932.jar
Loading extension: reference:file:org.eclipse.osgi.compatibility.state_1.1.0.v20170516-1513.jar
	eclipse.properties not found
Framework classpath:
    file:/jobs/genie.tcf/tcf-master-tests-4.7/workspace/tests/plugins/org.eclipse.tcf.debug.test/target/work/plugins/org.eclipse.osgi_3.12.0.v20170512-1932.jar
    file:/jobs/genie.tcf/tcf-master-tests-4.7/workspace/tests/plugins/org.eclipse.tcf.debug.test/target/work/plugins/
    file:/jobs/genie.tcf/tcf-master-tests-4.7/workspace/tests/plugins/org.eclipse.tcf.debug.test/target/work/plugins/org.eclipse.osgi.compatibility.state_1.1.0.v20170516-1513.jar
Debug options:
    file:/jobs/genie.tcf/tcf-master-tests-4.7/workspace/tests/plugins/org.eclipse.tcf.debug.test/.options not found
Time to load bundles: 49
Starting application: 9303
Launching application org.eclipse.ui.ide.workbench...
Cannot send datagram packet to /172.25.255.255
java.io.IOException: Operation not permitted (sendto failed)
	at java.net.PlainDatagramSocketImpl.send(Native Method)
	at java.net.DatagramSocket.send(DatagramSocket.java:693)
	at org.eclipse.tcf.internal.services.local.LocatorService.sendDatagramPacket(LocatorService.java:948)
	at org.eclipse.tcf.internal.services.local.LocatorService.sendPeersRequest(LocatorService.java:1031)
	at org.eclipse.tcf.internal.services.local.LocatorService.refresh_timer(LocatorService.java:693)
	at org.eclipse.tcf.internal.services.local.LocatorService.access$1(LocatorService.java:650)
	at org.eclipse.tcf.internal.services.local.LocatorService$1$1.run(LocatorService.java:230)
	at org.eclipse.tcf.protocol.Protocol$3.run(Protocol.java:242)
	at org.eclipse.tcf.EventQueue.run(EventQueue.java:95)
	at java.lang.Thread.run(Thread.java:748)
Cannot send datagram packet to /172.25.102.110
java.io.IOException: Operation not permitted (sendto failed)
	at java.net.PlainDatagramSocketImpl.send(Native Method)
	at java.net.DatagramSocket.send(DatagramSocket.java:693)
	at org.eclipse.tcf.internal.services.local.LocatorService.sendDatagramPacket(LocatorService.java:948)
	at org.eclipse.tcf.internal.services.local.LocatorService.sendPeersRequest(LocatorService.java:1031)
	at org.eclipse.tcf.internal.services.local.LocatorService.access$15(LocatorService.java:1028)
	at org.eclipse.tcf.internal.services.local.LocatorService$7.run(LocatorService.java:728)
	at org.eclipse.tcf.EventQueue.run(EventQueue.java:95)
	at java.lang.Thread.run(Thread.java:748)
Application Started: 11844
!SESSION 2017-10-10 15:15:15.905 -----------------------------------------------
eclipse.buildId=4.7.0.I20170612-0950
java.version=1.8.0_131
java.vendor=Oracle Corporation
BootLoader constants: OS=linux, ARCH=x86_64, WS=gtk, NL=en_US
Framework arguments:  -application org.eclipse.tycho.surefire.osgibooter.uitest -testproperties /jobs/genie.tcf/tcf-master-tests-4.7/workspace/tests/plugins/org.eclipse.tcf.debug.test/target/surefire.properties -testApplication org.eclipse.ui.ide.workbench -product org.eclipse.platform.ide -nouithread
Command-line arguments:  -debug -consolelog -data /jobs/genie.tcf/tcf-master-tests-4.7/workspace/tests/plugins/org.eclipse.tcf.debug.test/target/work/data -application org.eclipse.tycho.surefire.osgibooter.uitest -testproperties /jobs/genie.tcf/tcf-master-tests-4.7/workspace/tests/plugins/org.eclipse.tcf.debug.test/target/surefire.properties -testApplication org.eclipse.ui.ide.workbench -product org.eclipse.platform.ide -nouithread

!ENTRY org.eclipse.tcf 4 0 2017-10-10 15:15:27.774
!MESSAGE Cannot send datagram packet to /172.25.102.110
!STACK 0
java.io.IOException: Operation not permitted (sendto failed)
	at java.net.PlainDatagramSocketImpl.send(Native Method)
	at java.net.DatagramSocket.send(DatagramSocket.java:693)
	at org.eclipse.tcf.internal.services.local.LocatorService.sendDatagramPacket(LocatorService.java:948)
	at org.eclipse.tcf.internal.services.local.LocatorService.sendPeersRequest(LocatorService.java:1031)
	at org.eclipse.tcf.internal.services.local.LocatorService.access$15(LocatorService.java:1028)
	at org.eclipse.tcf.internal.services.local.LocatorService$7.run(LocatorService.java:728)
	at org.eclipse.tcf.EventQueue.run(EventQueue.java:95)
	at java.lang.Thread.run(Thread.java:748)

!ENTRY org.eclipse.tcf 4 0 2017-10-10 15:15:27.776
!MESSAGE Cannot send datagram packet to /172.25.255.255
!STACK 0
java.io.IOException: Operation not permitted (sendto failed)
	at java.net.PlainDatagramSocketImpl.send(Native Method)
	at java.net.DatagramSocket.send(DatagramSocket.java:693)
	at org.eclipse.tcf.internal.services.local.LocatorService.sendDatagramPacket(LocatorService.java:948)
	at org.eclipse.tcf.internal.services.local.LocatorService.sendPeersRequest(LocatorService.java:1031)
	at org.eclipse.tcf.internal.services.local.LocatorService.refresh_timer(LocatorService.java:693)
	at org.eclipse.tcf.internal.services.local.LocatorService.access$1(LocatorService.java:650)
	at org.eclipse.tcf.internal.services.local.LocatorService$1$1.run(LocatorService.java:230)
	at org.eclipse.tcf.protocol.Protocol$3.run(Protocol.java:242)
	at org.eclipse.tcf.EventQueue.run(EventQueue.java:95)
	at java.lang.Thread.run(Thread.java:748)

-------------------------------------------------------
 T E S T S
-------------------------------------------------------
Running org.eclipse.tcf.debug.test.RunControlCMTest

=== testMappingCommandCaches started at: October 10, 2017 3:15:27 PM EDT
=== testMappingCommandCaches finished at: October 10, 2017 3:15:36 PM EDT (duration: 8657 ms)

=== testStateResetOnResumeSuspend started at: October 10, 2017 3:15:36 PM EDT
=== testStateResetOnResumeSuspend finished at: October 10, 2017 3:15:40 PM EDT (duration: 3720 ms)

=== testChildrenResetOnAddedRemoved started at: October 10, 2017 3:15:40 PM EDT
=== testChildrenResetOnAddedRemoved finished at: October 10, 2017 3:15:42 PM EDT (duration: 2506 ms)

=== testRunControlCMChildrenInvalidation started at: October 10, 2017 3:15:42 PM EDT
=== testRunControlCMChildrenInvalidation finished at: October 10, 2017 3:15:43 PM EDT (duration: 885 ms)

=== testStateResetOnTerminate started at: October 10, 2017 3:15:43 PM EDT
=== testStateResetOnTerminate finished at: October 10, 2017 3:15:44 PM EDT (duration: 268 ms)
Tests run: 5, Failures: 0, Errors: 0, Skipped: 0, Time elapsed: 16.095 sec - in org.eclipse.tcf.debug.test.RunControlCMTest
testMappingCommandCaches(org.eclipse.tcf.debug.test.RunControlCMTest)  Time elapsed: 8.66 sec
testStateResetOnResumeSuspend(org.eclipse.tcf.debug.test.RunControlCMTest)  Time elapsed: 3.72 sec
testChildrenResetOnAddedRemoved(org.eclipse.tcf.debug.test.RunControlCMTest)  Time elapsed: 2.507 sec
testRunControlCMChildrenInvalidation(org.eclipse.tcf.debug.test.RunControlCMTest)  Time elapsed: 0.885 sec
testStateResetOnTerminate(org.eclipse.tcf.debug.test.RunControlCMTest)  Time elapsed: 0.268 sec
Running org.eclipse.tcf.debug.test.CacheTests
Tests run: 17, Failures: 0, Errors: 0, Skipped: 0, Time elapsed: 0.237 sec - in org.eclipse.tcf.debug.test.CacheTests
testResetWhileValid(org.eclipse.tcf.debug.test.CacheTests)  Time elapsed: 0.002 sec
testDisableWhileValid(org.eclipse.tcf.debug.test.CacheTests)  Time elapsed: 0.001 sec
testCancelWhilePending(org.eclipse.tcf.debug.test.CacheTests)  Time elapsed: 0.002 sec
testGet(org.eclipse.tcf.debug.test.CacheTests)  Time elapsed: 0.001 sec
testCancelWhilePendingWithTwoClients(org.eclipse.tcf.debug.test.CacheTests)  Time elapsed: 0.001 sec
testGetWithCompletionDelay(org.eclipse.tcf.debug.test.CacheTests)  Time elapsed: 0.101 sec
testSetWithValue(org.eclipse.tcf.debug.test.CacheTests)  Time elapsed: 0.001 sec
testGetWithManyClients(org.eclipse.tcf.debug.test.CacheTests)  Time elapsed: 0.001 sec
testGetWithTwoClients(org.eclipse.tcf.debug.test.CacheTests)  Time elapsed: 0.001 sec
testSetAndReset(org.eclipse.tcf.debug.test.CacheTests)  Time elapsed: 0.001 sec
testDisableWhilePending(org.eclipse.tcf.debug.test.CacheTests)  Time elapsed: 0.001 sec
testCancelWhilePending2(org.eclipse.tcf.debug.test.CacheTests)  Time elapsed: 0.001 sec
testCancelWhilePending3(org.eclipse.tcf.debug.test.CacheTests)  Time elapsed: 0.001 sec
testDisableBeforeRequest(org.eclipse.tcf.debug.test.CacheTests)  Time elapsed: 0.101 sec
testCancelWhilePendingWithoutClientNotification(org.eclipse.tcf.debug.test.CacheTests)  Time elapsed: 0.005 sec
testCancelWhilePendingWithManyClients(org.eclipse.tcf.debug.test.CacheTests)  Time elapsed: 0.005 sec
testCancelAfterCompletedRaceCondition(org.eclipse.tcf.debug.test.CacheTests)  Time elapsed: 0.003 sec
Running org.eclipse.tcf.debug.test.BreakpointDetailPaneTest

=== testContextQueryFilter started at: October 10, 2017 3:15:44 PM EDT
=== testContextQueryFilter finished at: October 10, 2017 3:16:44 PM EDT (duration: 60394 ms)

!ENTRY org.eclipse.tcf.te.tests 4 1 2017-10-10 15:16:44.686
!MESSAGE Test case 'testContextQueryFilter(org.eclipse.tcf.debug.test.BreakpointDetailPaneTest)' failed with error. Possible cause: Timed Out: Viewer Update Listener
	fContentSequenceComplete = false
	fModelChangedComplete = false
	fTimeoutInterval = 60000
Viewer:
org.eclipse.debug.internal.core.LaunchManager@731a5a39
  test (Disconnected): Cannot locate peer TCP:127.0.0.1:43597

!STACK 0
java.lang.RuntimeException: Timed Out: Viewer Update Listener
	fContentSequenceComplete = false
	fModelChangedComplete = false
	fTimeoutInterval = 60000
Viewer:
org.eclipse.debug.internal.core.LaunchManager@731a5a39
  test (Disconnected): Cannot locate peer TCP:127.0.0.1:43597

	at org.eclipse.tcf.debug.test.ViewerUpdatesListener.isFinished(ViewerUpdatesListener.java:271)
	at org.eclipse.tcf.debug.test.ViewerUpdatesListener.waitTillFinished(ViewerUpdatesListener.java:263)
	at org.eclipse.tcf.debug.test.AbstractTcfUITest.initProcessModel(AbstractTcfUITest.java:168)
	at org.eclipse.tcf.debug.test.BreakpointDetailPaneTest.testContextQueryFilter(BreakpointDetailPaneTest.java:76)
	at sun.reflect.NativeMethodAccessorImpl.invoke0(Native Method)
	at sun.reflect.NativeMethodAccessorImpl.invoke(NativeMethodAccessorImpl.java:62)
	at sun.reflect.DelegatingMethodAccessorImpl.invoke(DelegatingMethodAccessorImpl.java:43)
	at java.lang.reflect.Method.invoke(Method.java:498)
	at junit.framework.TestCase.runTest(TestCase.java:176)
	at junit.framework.TestCase.runBare(TestCase.java:141)
	at org.eclipse.tcf.te.tests.CoreTestCase.runBare(CoreTestCase.java:256)
	at junit.framework.TestResult$1.protect(TestResult.java:122)
	at junit.framework.TestResult.runProtected(TestResult.java:142)
	at junit.framework.TestResult.run(TestResult.java:125)
	at junit.framework.TestCase.run(TestCase.java:129)
	at org.eclipse.tcf.te.tests.CoreTestCase.run(CoreTestCase.java:233)
	at junit.framework.TestSuite.runTest(TestSuite.java:252)
	at junit.framework.TestSuite.run(TestSuite.java:247)
	at org.junit.internal.runners.JUnit38ClassRunner.run(JUnit38ClassRunner.java:86)
	at org.apache.maven.surefire.junit4.JUnit4Provider.execute(JUnit4Provider.java:264)
	at org.apache.maven.surefire.junit4.JUnit4Provider.executeTestSet(JUnit4Provider.java:153)
	at org.apache.maven.surefire.junit4.JUnit4Provider.invoke(JUnit4Provider.java:124)
	at sun.reflect.NativeMethodAccessorImpl.invoke0(Native Method)
	at sun.reflect.NativeMethodAccessorImpl.invoke(NativeMethodAccessorImpl.java:62)
	at sun.reflect.DelegatingMethodAccessorImpl.invoke(DelegatingMethodAccessorImpl.java:43)
	at java.lang.reflect.Method.invoke(Method.java:498)
	at org.apache.maven.surefire.util.ReflectionUtils.invokeMethodWithArray2(ReflectionUtils.java:208)
	at org.apache.maven.surefire.booter.ProviderFactory$ProviderProxy.invoke(ProviderFactory.java:156)
	at org.apache.maven.surefire.booter.ProviderFactory.invokeProvider(ProviderFactory.java:82)
	at org.eclipse.tycho.surefire.osgibooter.OsgiSurefireBooter.run(OsgiSurefireBooter.java:95)
	at org.eclipse.tycho.surefire.osgibooter.AbstractUITestApplication.runTests(AbstractUITestApplication.java:44)
	at org.eclipse.e4.ui.internal.workbench.swt.E4Testable.lambda$0(E4Testable.java:73)
	at java.lang.Thread.run(Thread.java:748)

=== testContextsFilter started at: October 10, 2017 3:16:44 PM EDT
=== testContextsFilter finished at: October 10, 2017 3:17:45 PM EDT (duration: 60333 ms)

!ENTRY org.eclipse.tcf.te.tests 4 1 2017-10-10 15:17:45.025
!MESSAGE Test case 'testContextsFilter(org.eclipse.tcf.debug.test.BreakpointDetailPaneTest)' failed with error. Possible cause: Timed Out: Viewer Update Listener
	fContentSequenceComplete = true
	fModelChangedComplete = false
	fTimeoutInterval = 60000
Viewer:
org.eclipse.debug.internal.core.LaunchManager@731a5a39
  test (Disconnected): Cannot locate peer TCP:127.0.0.1:49871

!STACK 0
java.lang.RuntimeException: Timed Out: Viewer Update Listener
	fContentSequenceComplete = true
	fModelChangedComplete = false
	fTimeoutInterval = 60000
Viewer:
org.eclipse.debug.internal.core.LaunchManager@731a5a39
  test (Disconnected): Cannot locate peer TCP:127.0.0.1:49871

	at org.eclipse.tcf.debug.test.ViewerUpdatesListener.isFinished(ViewerUpdatesListener.java:271)
	at org.eclipse.tcf.debug.test.ViewerUpdatesListener.waitTillFinished(ViewerUpdatesListener.java:263)
	at org.eclipse.tcf.debug.test.AbstractTcfUITest.initProcessModel(AbstractTcfUITest.java:168)
	at org.eclipse.tcf.debug.test.BreakpointDetailPaneTest.testContextsFilter(BreakpointDetailPaneTest.java:149)
	at sun.reflect.NativeMethodAccessorImpl.invoke0(Native Method)
	at sun.reflect.NativeMethodAccessorImpl.invoke(NativeMethodAccessorImpl.java:62)
	at sun.reflect.DelegatingMethodAccessorImpl.invoke(DelegatingMethodAccessorImpl.java:43)
	at java.lang.reflect.Method.invoke(Method.java:498)
	at junit.framework.TestCase.runTest(TestCase.java:176)
	at junit.framework.TestCase.runBare(TestCase.java:141)
	at org.eclipse.tcf.te.tests.CoreTestCase.runBare(CoreTestCase.java:256)
	at junit.framework.TestResult$1.protect(TestResult.java:122)
	at junit.framework.TestResult.runProtected(TestResult.java:142)
	at junit.framework.TestResult.run(TestResult.java:125)
	at junit.framework.TestCase.run(TestCase.java:129)
	at org.eclipse.tcf.te.tests.CoreTestCase.run(CoreTestCase.java:233)
	at junit.framework.TestSuite.runTest(TestSuite.java:252)
	at junit.framework.TestSuite.run(TestSuite.java:247)
	at org.junit.internal.runners.JUnit38ClassRunner.run(JUnit38ClassRunner.java:86)
	at org.apache.maven.surefire.junit4.JUnit4Provider.execute(JUnit4Provider.java:264)
	at org.apache.maven.surefire.junit4.JUnit4Provider.executeTestSet(JUnit4Provider.java:153)
	at org.apache.maven.surefire.junit4.JUnit4Provider.invoke(JUnit4Provider.java:124)
	at sun.reflect.NativeMethodAccessorImpl.invoke0(Native Method)
	at sun.reflect.NativeMethodAccessorImpl.invoke(NativeMethodAccessorImpl.java:62)
	at sun.reflect.DelegatingMethodAccessorImpl.invoke(DelegatingMethodAccessorImpl.java:43)
	at java.lang.reflect.Method.invoke(Method.java:498)
	at org.apache.maven.surefire.util.ReflectionUtils.invokeMethodWithArray2(ReflectionUtils.java:208)
	at org.apache.maven.surefire.booter.ProviderFactory$ProviderProxy.invoke(ProviderFactory.java:156)
	at org.apache.maven.surefire.booter.ProviderFactory.invokeProvider(ProviderFactory.java:82)
	at org.eclipse.tycho.surefire.osgibooter.OsgiSurefireBooter.run(OsgiSurefireBooter.java:95)
	at org.eclipse.tycho.surefire.osgibooter.AbstractUITestApplication.runTests(AbstractUITestApplication.java:44)
	at org.eclipse.e4.ui.internal.workbench.swt.E4Testable.lambda$0(E4Testable.java:73)
	at java.lang.Thread.run(Thread.java:748)
Tests run: 2, Failures: 0, Errors: 2, Skipped: 0, Time elapsed: 120.749 sec <<< FAILURE! - in org.eclipse.tcf.debug.test.BreakpointDetailPaneTest
testContextQueryFilter(org.eclipse.tcf.debug.test.BreakpointDetailPaneTest)  Time elapsed: 60.398 sec  <<< ERROR!
java.lang.RuntimeException: Timed Out: Viewer Update Listener
	fContentSequenceComplete = false
	fModelChangedComplete = false
	fTimeoutInterval = 60000
Viewer:
org.eclipse.debug.internal.core.LaunchManager@731a5a39
  test (Disconnected): Cannot locate peer TCP:127.0.0.1:43597

	at org.eclipse.tcf.debug.test.ViewerUpdatesListener.isFinished(ViewerUpdatesListener.java:271)
	at org.eclipse.tcf.debug.test.ViewerUpdatesListener.waitTillFinished(ViewerUpdatesListener.java:263)
	at org.eclipse.tcf.debug.test.AbstractTcfUITest.initProcessModel(AbstractTcfUITest.java:168)
	at org.eclipse.tcf.debug.test.BreakpointDetailPaneTest.testContextQueryFilter(BreakpointDetailPaneTest.java:76)

testContextsFilter(org.eclipse.tcf.debug.test.BreakpointDetailPaneTest)  Time elapsed: 60.335 sec  <<< ERROR!
java.lang.RuntimeException: Timed Out: Viewer Update Listener
	fContentSequenceComplete = true
	fModelChangedComplete = false
	fTimeoutInterval = 60000
Viewer:
org.eclipse.debug.internal.core.LaunchManager@731a5a39
  test (Disconnected): Cannot locate peer TCP:127.0.0.1:49871

	at org.eclipse.tcf.debug.test.ViewerUpdatesListener.isFinished(ViewerUpdatesListener.java:271)
	at org.eclipse.tcf.debug.test.ViewerUpdatesListener.waitTillFinished(ViewerUpdatesListener.java:263)
	at org.eclipse.tcf.debug.test.AbstractTcfUITest.initProcessModel(AbstractTcfUITest.java:168)
	at org.eclipse.tcf.debug.test.BreakpointDetailPaneTest.testContextsFilter(BreakpointDetailPaneTest.java:149)

Running org.eclipse.tcf.debug.test.TransactionTests
Tests run: 5, Failures: 0, Errors: 0, Skipped: 0, Time elapsed: 0.017 sec - in org.eclipse.tcf.debug.test.TransactionTests
testSingleTransactionUnchecked(org.eclipse.tcf.debug.test.TransactionTests)  Time elapsed: 0.001 sec
testSingleTransaction(org.eclipse.tcf.debug.test.TransactionTests)  Time elapsed: 0 sec
testSumTransaction(org.eclipse.tcf.debug.test.TransactionTests)  Time elapsed: 0.001 sec
testSumTransactionIterative(org.eclipse.tcf.debug.test.TransactionTests)  Time elapsed: 0.001 sec
testSumTransactionUnchecked(org.eclipse.tcf.debug.test.TransactionTests)  Time elapsed: 0.001 sec
Running org.eclipse.tcf.debug.test.RangeCacheTests
Tests run: 11, Failures: 0, Errors: 0, Skipped: 0, Time elapsed: 3.54 sec - in org.eclipse.tcf.debug.test.RangeCacheTests
testGetMultipleRangesTest(org.eclipse.tcf.debug.test.RangeCacheTests)  Time elapsed: 0.709 sec
testGetOneRangeUsingDifferentRangeInstanceTest(org.eclipse.tcf.debug.test.RangeCacheTests)  Time elapsed: 0.101 sec
testCancelOneRangeTest(org.eclipse.tcf.debug.test.RangeCacheTests)  Time elapsed: 0.102 sec
testResetOneRangeTest(org.eclipse.tcf.debug.test.RangeCacheTests)  Time elapsed: 0.202 sec
testGetIncompleteRangeTest(org.eclipse.tcf.debug.test.RangeCacheTests)  Time elapsed: 0.101 sec
testResetWhileInvalidTest(org.eclipse.tcf.debug.test.RangeCacheTests)  Time elapsed: 0.101 sec
testResetMultipleRangesTest(org.eclipse.tcf.debug.test.RangeCacheTests)  Time elapsed: 1.411 sec
testCancelMultipleRangesTest(org.eclipse.tcf.debug.test.RangeCacheTests)  Time elapsed: 0.303 sec
testSetRangeErrorTest(org.eclipse.tcf.debug.test.RangeCacheTests)  Time elapsed: 0.103 sec
testGetOneRangeTest(org.eclipse.tcf.debug.test.RangeCacheTests)  Time elapsed: 0.1 sec
testGetAndCancelMultipleRangesTest(org.eclipse.tcf.debug.test.RangeCacheTests)  Time elapsed: 0.303 sec
Running org.eclipse.tcf.debug.test.StackTraceCMTest

=== testStackTraceCMResetOnMemoryMapChange started at: October 10, 2017 3:17:48 PM EDT
=== testStackTraceCMResetOnMemoryMapChange finished at: October 10, 2017 3:17:48 PM EDT (duration: 311 ms)

=== testStackTraceCMResetOnMemoryChange started at: October 10, 2017 3:17:48 PM EDT
=== testStackTraceCMResetOnMemoryChange finished at: October 10, 2017 3:17:49 PM EDT (duration: 271 ms)

=== testStackTraceCMResetOnResumeSuspend started at: October 10, 2017 3:17:49 PM EDT
=== testStackTraceCMResetOnResumeSuspend finished at: October 10, 2017 3:17:49 PM EDT (duration: 281 ms)

=== testStackTraceCMResetOnContextChange started at: October 10, 2017 3:17:49 PM EDT
=== testStackTraceCMResetOnContextChange finished at: October 10, 2017 3:17:49 PM EDT (duration: 279 ms)
Tests run: 4, Failures: 0, Errors: 0, Skipped: 0, Time elapsed: 1.145 sec - in org.eclipse.tcf.debug.test.StackTraceCMTest
testStackTraceCMResetOnMemoryMapChange(org.eclipse.tcf.debug.test.StackTraceCMTest)  Time elapsed: 0.311 sec
testStackTraceCMResetOnMemoryChange(org.eclipse.tcf.debug.test.StackTraceCMTest)  Time elapsed: 0.271 sec
testStackTraceCMResetOnResumeSuspend(org.eclipse.tcf.debug.test.StackTraceCMTest)  Time elapsed: 0.282 sec
testStackTraceCMResetOnContextChange(org.eclipse.tcf.debug.test.StackTraceCMTest)  Time elapsed: 0.279 sec
Running org.eclipse.tcf.debug.test.QueryTests
Tests run: 7, Failures: 0, Errors: 0, Skipped: 0, Time elapsed: 0.01 sec - in org.eclipse.tcf.debug.test.QueryTests
testGetError(org.eclipse.tcf.debug.test.QueryTests)  Time elapsed: 0 sec
testSimpleGet(org.eclipse.tcf.debug.test.QueryTests)  Time elapsed: 0 sec
testCancelBeforeWaiting(org.eclipse.tcf.debug.test.QueryTests)  Time elapsed: 0 sec
testExceptionOnGet(org.eclipse.tcf.debug.test.QueryTests)  Time elapsed: 0.001 sec
testGetTimeout(org.eclipse.tcf.debug.test.QueryTests)  Time elapsed: 0.002 sec
testCancelWhileWaiting(org.eclipse.tcf.debug.test.QueryTests)  Time elapsed: 0 sec
testGetWithMultipleDispatches(org.eclipse.tcf.debug.test.QueryTests)  Time elapsed: 0.001 sec
Running org.eclipse.tcf.debug.test.BreakpointsViewTest

=== testScopeGrouping started at: October 10, 2017 3:17:49 PM EDT
=== testScopeGrouping finished at: October 10, 2017 3:17:51 PM EDT (duration: 1243 ms)
Tests run: 1, Failures: 0, Errors: 0, Skipped: 0, Time elapsed: 1.247 sec - in org.eclipse.tcf.debug.test.BreakpointsViewTest
testScopeGrouping(org.eclipse.tcf.debug.test.BreakpointsViewTest)  Time elapsed: 1.244 sec
Running org.eclipse.tcf.debug.test.SampleTest

=== testSteppingWithVariablesAndRegisters started at: October 10, 2017 3:17:51 PM EDT
=== testSteppingWithVariablesAndRegisters finished at: October 10, 2017 3:17:57 PM EDT (duration: 6690 ms)

=== testSteppingDebugViewOnly started at: October 10, 2017 3:17:57 PM EDT
=== testSteppingDebugViewOnly finished at: October 10, 2017 3:18:03 PM EDT (duration: 6215 ms)

=== testSymbolsCMResetOnContextStateChange started at: October 10, 2017 3:18:03 PM EDT
=== testSymbolsCMResetOnContextStateChange finished at: October 10, 2017 3:18:04 PM EDT (duration: 512 ms)

=== testSteppingPerformanceWithSourceDisplay started at: October 10, 2017 3:18:04 PM EDT
Scenario 'org.eclipse.tcf.debug.test.SampleTest#testSteppingPerformanceWithSourceDisplay()' (average over 100 samples):
  System Time:              54ms        (95% in [48ms, 60ms])          Measurable effect: 12ms (0.4 SDs) (required sample size for an effect of 5% of mean: 2045)
  Used Java Heap:       213.56K         (95% in [-1.87M, 2.29M])       Measurable effect: 4.19M (0.4 SDs) (required sample size for an effect of 5% of stdev: 6400)
  Working Set:           50.32K         (95% in [-198.05K, 298.69K])   Measurable effect: 500.69K (0.4 SDs) (required sample size for an effect of 5% of stdev: 6401)
  Elapsed Process:          54ms        (95% in [48ms, 60ms])          Measurable effect: 12ms (0.4 SDs) (required sample size for an effect of 5% of mean: 2045)
  Kernel time:               6ms        (95% in [4ms, 8ms])            Measurable effect: 3ms (0.4 SDs) (required sample size for an effect of 5% of stdev: 6401)
  CPU Time:                 96ms        (95% in [79ms, 112ms])         Measurable effect: 33ms (0.4 SDs) (required sample size for an effect of 5% of mean: 4901)
  Hard Page Faults:          0          (95% in [0, 0])               
  Soft Page Faults:       1.61K         (95% in [1.15K, 2.08K])        Measurable effect: 938 (0.4 SDs) (required sample size for an effect of 5% of stdev: 6401)
  Text Size:                 0          (95% in [0, 0])               
  Data Size:                 0          (95% in [0, 0])               
  Library Size:          20.48K         (95% in [-96.77K, 137.73K])    Measurable effect: 236.38K (0.4 SDs) (required sample size for an effect of 5% of stdev: 6401)


!ENTRY org.eclipse.test.performance 2 0 2017-10-10 15:18:10.445
!MESSAGE refkeys was null. eclipse.perf.assertAgainst was null
=== testSteppingPerformanceWithSourceDisplay finished at: October 10, 2017 3:18:10 PM EDT (duration: 6032 ms)

=== testSymbolsCMResetOnContextRemove started at: October 10, 2017 3:18:10 PM EDT
=== testSymbolsCMResetOnContextRemove finished at: October 10, 2017 3:18:11 PM EDT (duration: 560 ms)

=== testDebugViewContent started at: October 10, 2017 3:18:11 PM EDT
=== testDebugViewContent finished at: October 10, 2017 3:18:11 PM EDT (duration: 347 ms)
Tests run: 6, Failures: 0, Errors: 0, Skipped: 0, Time elapsed: 20.365 sec - in org.eclipse.tcf.debug.test.SampleTest
testSteppingWithVariablesAndRegisters(org.eclipse.tcf.debug.test.SampleTest)  Time elapsed: 6.691 sec
testSteppingDebugViewOnly(org.eclipse.tcf.debug.test.SampleTest)  Time elapsed: 6.216 sec
testSymbolsCMResetOnContextStateChange(org.eclipse.tcf.debug.test.SampleTest)  Time elapsed: 0.513 sec
testSteppingPerformanceWithSourceDisplay(org.eclipse.tcf.debug.test.SampleTest)  Time elapsed: 6.033 sec
testSymbolsCMResetOnContextRemove(org.eclipse.tcf.debug.test.SampleTest)  Time elapsed: 0.56 sec
testDebugViewContent(org.eclipse.tcf.debug.test.SampleTest)  Time elapsed: 0.348 sec
Running org.eclipse.tcf.debug.test.BreakpointsTest

=== testContextAddedOnLineBrakpointCreate started at: October 10, 2017 3:18:11 PM EDT
=== testContextAddedOnLineBrakpointCreate finished at: October 10, 2017 3:18:12 PM EDT (duration: 1047 ms)

=== testForeignBreakpointCreate started at: October 10, 2017 3:18:12 PM EDT

!ENTRY org.eclipse.debug.core 4 2 2017-10-10 15:18:12.788
!MESSAGE Problems occurred when invoking code from plug-in: "org.eclipse.debug.core".
!STACK 0
java.lang.IllegalMonitorStateException
	at java.lang.Object.notify(Native Method)
	at org.eclipse.tcf.debug.test.BreakpointsTest$5.breakpointsAdded(BreakpointsTest.java:132)
	at org.eclipse.debug.internal.core.BreakpointManager$BreakpointsNotifier.run(BreakpointManager.java:1122)
	at org.eclipse.core.runtime.SafeRunner.run(SafeRunner.java:42)
	at org.eclipse.debug.internal.core.BreakpointManager$BreakpointsNotifier.notify(BreakpointManager.java:1148)
	at org.eclipse.debug.internal.core.BreakpointManager.fireUpdate(BreakpointManager.java:993)
	at org.eclipse.debug.internal.core.BreakpointManager.addBreakpoints(BreakpointManager.java:632)
	at org.eclipse.debug.internal.core.BreakpointManager.addBreakpoints(BreakpointManager.java:603)
	at org.eclipse.debug.internal.core.BreakpointManager.addBreakpoint(BreakpointManager.java:595)
	at org.eclipse.cdt.debug.internal.core.breakpoints.CBreakpoint.register(CBreakpoint.java:181)
	at org.eclipse.cdt.debug.internal.core.breakpoints.CBreakpoint$1.run(CBreakpoint.java:90)
	at org.eclipse.core.internal.resources.Workspace.run(Workspace.java:2240)
	at org.eclipse.core.internal.resources.Workspace.run(Workspace.java:2262)
	at org.eclipse.cdt.debug.internal.core.breakpoints.CBreakpoint.run(CBreakpoint.java:168)
	at org.eclipse.cdt.debug.internal.core.breakpoints.CBreakpoint.<init>(CBreakpoint.java:93)
	at org.eclipse.cdt.debug.internal.core.breakpoints.AbstractLineBreakpoint.<init>(AbstractLineBreakpoint.java:46)
	at org.eclipse.cdt.debug.internal.core.breakpoints.CFunctionBreakpoint.<init>(CFunctionBreakpoint.java:37)
	at org.eclipse.tcf.internal.cdt.ui.TCFBreakpointStatusListener$BreakpointListener$6.runInWorkspace(TCFBreakpointStatusListener.java:297)
	at org.eclipse.core.internal.resources.InternalWorkspaceJob.run(InternalWorkspaceJob.java:39)
	at org.eclipse.core.internal.jobs.Worker.run(Worker.java:56)

!ENTRY org.eclipse.debug.core 4 120 2017-10-10 15:18:12.790
!MESSAGE An exception occurred during breakpoint change notification.
!STACK 0
java.lang.IllegalMonitorStateException
	at java.lang.Object.notify(Native Method)
	at org.eclipse.tcf.debug.test.BreakpointsTest$5.breakpointsAdded(BreakpointsTest.java:132)
	at org.eclipse.debug.internal.core.BreakpointManager$BreakpointsNotifier.run(BreakpointManager.java:1122)
	at org.eclipse.core.runtime.SafeRunner.run(SafeRunner.java:42)
	at org.eclipse.debug.internal.core.BreakpointManager$BreakpointsNotifier.notify(BreakpointManager.java:1148)
	at org.eclipse.debug.internal.core.BreakpointManager.fireUpdate(BreakpointManager.java:993)
	at org.eclipse.debug.internal.core.BreakpointManager.addBreakpoints(BreakpointManager.java:632)
	at org.eclipse.debug.internal.core.BreakpointManager.addBreakpoints(BreakpointManager.java:603)
	at org.eclipse.debug.internal.core.BreakpointManager.addBreakpoint(BreakpointManager.java:595)
	at org.eclipse.cdt.debug.internal.core.breakpoints.CBreakpoint.register(CBreakpoint.java:181)
	at org.eclipse.cdt.debug.internal.core.breakpoints.CBreakpoint$1.run(CBreakpoint.java:90)
	at org.eclipse.core.internal.resources.Workspace.run(Workspace.java:2240)
	at org.eclipse.core.internal.resources.Workspace.run(Workspace.java:2262)
	at org.eclipse.cdt.debug.internal.core.breakpoints.CBreakpoint.run(CBreakpoint.java:168)
	at org.eclipse.cdt.debug.internal.core.breakpoints.CBreakpoint.<init>(CBreakpoint.java:93)
	at org.eclipse.cdt.debug.internal.core.breakpoints.AbstractLineBreakpoint.<init>(AbstractLineBreakpoint.java:46)
	at org.eclipse.cdt.debug.internal.core.breakpoints.CFunctionBreakpoint.<init>(CFunctionBreakpoint.java:37)
	at org.eclipse.tcf.internal.cdt.ui.TCFBreakpointStatusListener$BreakpointListener$6.runInWorkspace(TCFBreakpointStatusListener.java:297)
	at org.eclipse.core.internal.resources.InternalWorkspaceJob.run(InternalWorkspaceJob.java:39)
	at org.eclipse.core.internal.jobs.Worker.run(Worker.java:56)
=== testForeignBreakpointCreate finished at: October 10, 2017 3:18:12 PM EDT (duration: 464 ms)
Tests run: 2, Failures: 0, Errors: 0, Skipped: 0, Time elapsed: 1.515 sec - in org.eclipse.tcf.debug.test.BreakpointsTest
testContextAddedOnLineBrakpointCreate(org.eclipse.tcf.debug.test.BreakpointsTest)  Time elapsed: 1.047 sec
testForeignBreakpointCreate(org.eclipse.tcf.debug.test.BreakpointsTest)  Time elapsed: 0.464 sec

Results :

Tests in error: 
  BreakpointDetailPaneTest>CoreTestCase.run:233->CoreTestCase.runBare:256->testContextQueryFilter:76->AbstractTcfUITest.initProcessModel:168 » Runtime
  BreakpointDetailPaneTest>CoreTestCase.run:233->CoreTestCase.runBare:256->testContextsFilter:149->AbstractTcfUITest.initProcessModel:168 » Runtime

Tests run: 60, Failures: 0, Errors: 2, Skipped: 0

no new datapoints in DB
disconnecting from DB
[ERROR] There are test failures.

Please refer to /jobs/genie.tcf/tcf-master-tests-4.7/workspace/tests/plugins/org.eclipse.tcf.debug.test/target/surefire-reports for the individual test results.
[INFO] 
[INFO] --- maven-antrun-plugin:1.8:run (generate-report) @ org.eclipse.tcf.debug.test ---
[INFO] Executing tasks

main:
     [echo] Coverage report
   [report] Loading execution data file /jobs/genie.tcf/tcf-master-tests-4.7/workspace/tests/plugins/org.eclipse.tcf.debug.test/target/jacoco.exec
   [report] Writing bundle 'org.eclipse.tcf' with 11 classes
   [report] Writing bundle 'org.eclipse.tcf.core' with 326 classes
   [report] Writing bundle 'org.eclipse.tcf.debug' with 354 classes
   [report] Writing bundle 'org.eclipse.tcf.debug.ui' with 690 classes
   [report] Writing bundle 'org.eclipse.tcf.cdt.ui' with 213 classes
[INFO] Executed tasks
[INFO] 
[INFO] --- maven-install-plugin:2.3.1:install (default-install) @ org.eclipse.tcf.debug.test ---
[INFO] Installing /jobs/genie.tcf/tcf-master-tests-4.7/workspace/tests/plugins/org.eclipse.tcf.debug.test/target/org.eclipse.tcf.debug.test-1.5.0-SNAPSHOT.jar to /home/hudson/genie.tcf/.hudson/jobs/tcf-master-tests-4.7/workspace/.maven/repo/org/eclipse/tcf/org.eclipse.tcf.debug.test/1.5.0-SNAPSHOT/org.eclipse.tcf.debug.test-1.5.0-SNAPSHOT.jar
[INFO] Installing /jobs/genie.tcf/tcf-master-tests-4.7/workspace/tests/plugins/org.eclipse.tcf.debug.test/pom.xml to /home/hudson/genie.tcf/.hudson/jobs/tcf-master-tests-4.7/workspace/.maven/repo/org/eclipse/tcf/org.eclipse.tcf.debug.test/1.5.0-SNAPSHOT/org.eclipse.tcf.debug.test-1.5.0-SNAPSHOT.pom
[INFO] Installing /jobs/genie.tcf/tcf-master-tests-4.7/workspace/tests/plugins/org.eclipse.tcf.debug.test/target/org.eclipse.tcf.debug.test-1.5.0-SNAPSHOT-sources.jar to /home/hudson/genie.tcf/.hudson/jobs/tcf-master-tests-4.7/workspace/.maven/repo/org/eclipse/tcf/org.eclipse.tcf.debug.test/1.5.0-SNAPSHOT/org.eclipse.tcf.debug.test-1.5.0-SNAPSHOT-sources.jar
[INFO] Installing /jobs/genie.tcf/tcf-master-tests-4.7/workspace/tests/plugins/org.eclipse.tcf.debug.test/target/p2content.xml to /home/hudson/genie.tcf/.hudson/jobs/tcf-master-tests-4.7/workspace/.maven/repo/org/eclipse/tcf/org.eclipse.tcf.debug.test/1.5.0-SNAPSHOT/org.eclipse.tcf.debug.test-1.5.0-SNAPSHOT-p2metadata.xml
[INFO] Installing /jobs/genie.tcf/tcf-master-tests-4.7/workspace/tests/plugins/org.eclipse.tcf.debug.test/target/p2artifacts.xml to /home/hudson/genie.tcf/.hudson/jobs/tcf-master-tests-4.7/workspace/.maven/repo/org/eclipse/tcf/org.eclipse.tcf.debug.test/1.5.0-SNAPSHOT/org.eclipse.tcf.debug.test-1.5.0-SNAPSHOT-p2artifacts.xml
[INFO] 
[INFO] --- tycho-p2-plugin:1.0.0:update-local-index (default-update-local-index) @ org.eclipse.tcf.debug.test ---
[INFO]                                                                         
[INFO] ------------------------------------------------------------------------
[INFO] Building TCF and Target Explorer, Maven Master 1.5.0-SNAPSHOT
[INFO] ------------------------------------------------------------------------
[INFO] 
[INFO] --- maven-clean-plugin:2.4.1:clean (default-clean) @ tcf-parent ---
[INFO] 
[INFO] --- jacoco-maven-plugin:0.7.9:prepare-agent (default) @ tcf-parent ---
[INFO] argLine set to -javaagent:/home/hudson/genie.tcf/.hudson/jobs/tcf-master-tests-4.7/workspace/.maven/repo/org/jacoco/org.jacoco.agent/0.7.9/org.jacoco.agent-0.7.9-runtime.jar=destfile=/jobs/genie.tcf/tcf-master-tests-4.7/workspace/target/jacoco.exec,includes=org.eclipse.tcf*,excludes=org.eclipse.tcf.debug.test*:org.eclipse.tcf.te.tests.*,dumponexit=true,output=file
[INFO] 
[INFO] --- tycho-source-plugin:1.0.0:plugin-source (plugin-source) @ tcf-parent ---
[INFO] 
[INFO] --- maven-install-plugin:2.3.1:install (default-install) @ tcf-parent ---
[INFO] Installing /jobs/genie.tcf/tcf-master-tests-4.7/workspace/pom.xml to /home/hudson/genie.tcf/.hudson/jobs/tcf-master-tests-4.7/workspace/.maven/repo/org/eclipse/tcf/tcf-parent/1.5.0-SNAPSHOT/tcf-parent-1.5.0-SNAPSHOT.pom
[INFO] ------------------------------------------------------------------------
[INFO] Reactor Summary:
[INFO] 
[INFO] org.eclipse.tcf.core .............................. SUCCESS [1:15.083s]
[INFO] org.eclipse.tcf ................................... SUCCESS [3.305s]
[INFO] org.eclipse.tcf.debug ............................. SUCCESS [1.528s]
[INFO] org.eclipse.tcf.debug.ui .......................... SUCCESS [3.265s]
[INFO] org.eclipse.tcf.cdt.ui ............................ SUCCESS [1.186s]
[INFO] org.eclipse.tcf.rse ............................... SUCCESS [0.819s]
[INFO] org.eclipse.tcf.core.feature ...................... SUCCESS [0.571s]
[INFO] org.eclipse.tcf.core.sdk.feature .................. SUCCESS [0.763s]
[INFO] org.eclipse.tcf.feature ........................... SUCCESS [0.906s]
[INFO] org.eclipse.tcf.sdk.feature ....................... SUCCESS [0.922s]
[INFO] org.eclipse.tcf.cdt.feature ....................... SUCCESS [0.589s]
[INFO] org.eclipse.tcf.cdt.sdk.feature ................... SUCCESS [0.595s]
[INFO] org.eclipse.tcf.rse.feature ....................... SUCCESS [0.585s]
[INFO] org.eclipse.tcf.rse.sdk.feature ................... SUCCESS [0.534s]
[INFO] org.eclipse.tcf.te ................................ SUCCESS [3.381s]
[INFO] org.eclipse.tcf.te.runtime ........................ SUCCESS [1.485s]
[INFO] org.eclipse.tcf.te.runtime.concurrent ............. SUCCESS [3.608s]
[INFO] org.eclipse.tcf.te.runtime.model .................. SUCCESS [0.667s]
[INFO] org.eclipse.tcf.te.runtime.services ............... SUCCESS [0.694s]
[INFO] org.eclipse.tcf.te.runtime.persistence ............ SUCCESS [0.699s]
[INFO] org.eclipse.tcf.te.runtime.statushandler .......... SUCCESS [0.748s]
[INFO] org.eclipse.tcf.te.runtime.stepper ................ SUCCESS [1.174s]
[INFO] org.eclipse.tcf.te.core ........................... SUCCESS [1.428s]
[INFO] org.eclipse.tcf.te.core.cdt ....................... SUCCESS [1.763s]
[INFO] org.eclipse.tcf.te.launch.core .................... SUCCESS [1.075s]
[INFO] org.eclipse.tcf.te.ui.swt ......................... SUCCESS [0.883s]
[INFO] org.eclipse.tcf.te.ui.forms ....................... SUCCESS [3.626s]
[INFO] org.eclipse.tcf.te.ui ............................. SUCCESS [1.239s]
[INFO] org.eclipse.tcf.te.ui.controls .................... SUCCESS [3.385s]
[INFO] org.eclipse.tcf.te.ui.views ....................... SUCCESS [1.396s]
[INFO] org.eclipse.tcf.te.launch.ui ...................... SUCCESS [1.129s]
[INFO] org.eclipse.tcf.te.tcf.core ....................... SUCCESS [0.865s]
[INFO] org.eclipse.tcf.te.tcf.core.model ................. SUCCESS [0.720s]
[INFO] org.eclipse.tcf.te.tcf.core.scripting ............. SUCCESS [0.718s]
[INFO] org.eclipse.tcf.te.tcf.locator .................... SUCCESS [0.964s]
[INFO] org.eclipse.tcf.te.tcf.filesystem.core ............ SUCCESS [1.633s]
[INFO] org.eclipse.tcf.te.tcf.log.core ................... SUCCESS [2.467s]
[INFO] org.eclipse.tcf.te.tcf.ui ......................... SUCCESS [1.351s]
[INFO] org.eclipse.tcf.te.tcf.filesystem.ui .............. SUCCESS [3.657s]
[INFO] org.eclipse.tcf.te.tcf.processes.core ............. SUCCESS [1.852s]
[INFO] org.eclipse.tcf.te.tcf.launch.cdt ................. SUCCESS [1.300s]
[INFO] org.eclipse.tcf.te.tcf.launch.core ................ SUCCESS [1.681s]
[INFO] org.eclipse.tcf.te.tcf.launch.ui .................. SUCCESS [1.697s]
[INFO] org.eclipse.tcf.te.tcf.processes.ui ............... SUCCESS [2.817s]
[INFO] org.eclipse.tcf.te.tcf.remote.core ................ SUCCESS [1.451s]
[INFO] org.eclipse.tcf.te.tcf.remote.ui .................. SUCCESS [1.204s]
[INFO] org.eclipse.tcf.te.tcf.services.contexts .......... SUCCESS [0.557s]
[INFO] org.eclipse.tcf.te.tcf.terminals.core ............. SUCCESS [0.666s]
[INFO] org.eclipse.tcf.te.tcf.terminals.ui ............... SUCCESS [0.747s]
[INFO] org.eclipse.tcf.te.tcf.ui.console ................. SUCCESS [0.666s]
[INFO] org.eclipse.tcf.te.tcf.ui.views ................... SUCCESS [1.222s]
[INFO] org.eclipse.tcf.te.ui.notifications ............... SUCCESS [1.166s]
[INFO] org.eclipse.tcf.te.feature ........................ SUCCESS [0.710s]
[INFO] org.eclipse.tcf.te.sdk.feature .................... SUCCESS [0.545s]
[INFO] org.eclipse.tcf.te.tcf.core.feature ............... SUCCESS [0.574s]
[INFO] org.eclipse.tcf.te.tcf.core.sdk.feature ........... SUCCESS [0.618s]
[INFO] org.eclipse.tcf.te.tcf.feature .................... SUCCESS [0.621s]
[INFO] org.eclipse.tcf.te.tcf.sdk.feature ................ SUCCESS [0.544s]
[INFO] org.eclipse.tcf.te.tcf.launch.cdt.feature ......... SUCCESS [2.147s]
[INFO] org.eclipse.tcf.te.tcf.launch.cdt.sdk.feature ..... SUCCESS [0.567s]
[INFO] org.eclipse.tcf.te.tcf.remote.feature ............. SUCCESS [0.600s]
[INFO] org.eclipse.tcf.te.tcf.remote.sdk.feature ......... SUCCESS [0.623s]
[INFO] org.eclipse.tcf.repo .............................. SUCCESS [24.108s]
[INFO] org.eclipse.tcf.te.tests .......................... SUCCESS [2:14.986s]
[INFO] org.eclipse.tcf.debug.test ........................ SUCCESS [3:27.819s]
[INFO] TCF and Target Explorer, Maven Master ............. SUCCESS [0.036s]
[INFO] ------------------------------------------------------------------------
[INFO] BUILD SUCCESS
[INFO] ------------------------------------------------------------------------
[INFO] Total time: 15:10.055s
[INFO] Finished at: Tue Oct 10 15:18:19 EDT 2017
[INFO] Final Memory: 564M/11190M
[INFO] ------------------------------------------------------------------------
[DEBUG] Closing connection to remote
[DEBUG] Waiting for process to finish
[DEBUG] Result: 0
Terminating xvnc.
Recording test results
Sending e-mails to: mober.at+eclipse@gmail.com eugene.tarassov@xilinx.com uwe.st@kaos-group.de
Triggering a new build of ps_ef #225
Finished: UNSTABLE