AbortedConsole Output

Skipping 2,096 KB.. Full Log
nt/repositories/cbi-releases/org/apache/maven/doxia/doxia-module-fml/1.0-alpha-10/doxia-module-fml-1.0-alpha-10.pom
Downloading from cbi-snapshots: https://repo.eclipse.org/content/repositories/cbi-snapshots/org/apache/maven/doxia/doxia-module-fml/1.0-alpha-10/doxia-module-fml-1.0-alpha-10.pom
Downloading from eclipse.maven.central.mirror: https://repo.eclipse.org/content/repositories/maven_central/org/apache/maven/doxia/doxia-module-fml/1.0-alpha-10/doxia-module-fml-1.0-alpha-10.pom
Progress (1): 2.5 kB
                    
Downloaded from eclipse.maven.central.mirror: https://repo.eclipse.org/content/repositories/maven_central/org/apache/maven/doxia/doxia-module-fml/1.0-alpha-10/doxia-module-fml-1.0-alpha-10.pom (2.5 kB at 85 kB/s)
Downloading from sonatype: https://oss.sonatype.org/content/repositories/public/org/apache/maven/doxia/doxia-module-xdoc/1.0-alpha-10/doxia-module-xdoc-1.0-alpha-10.pom
Downloading from cbi: https://repo.eclipse.org/content/repositories/cbi-releases/org/apache/maven/doxia/doxia-module-xdoc/1.0-alpha-10/doxia-module-xdoc-1.0-alpha-10.pom
Downloading from cbi-snapshots: https://repo.eclipse.org/content/repositories/cbi-snapshots/org/apache/maven/doxia/doxia-module-xdoc/1.0-alpha-10/doxia-module-xdoc-1.0-alpha-10.pom
Downloading from eclipse.maven.central.mirror: https://repo.eclipse.org/content/repositories/maven_central/org/apache/maven/doxia/doxia-module-xdoc/1.0-alpha-10/doxia-module-xdoc-1.0-alpha-10.pom
Progress (1): 2.2 kB
                    
Downloaded from eclipse.maven.central.mirror: https://repo.eclipse.org/content/repositories/maven_central/org/apache/maven/doxia/doxia-module-xdoc/1.0-alpha-10/doxia-module-xdoc-1.0-alpha-10.pom (2.2 kB at 73 kB/s)
Downloading from sonatype: https://oss.sonatype.org/content/repositories/public/org/apache/maven/doxia/doxia-module-xhtml/1.0-alpha-10/doxia-module-xhtml-1.0-alpha-10.pom
Downloading from cbi: https://repo.eclipse.org/content/repositories/cbi-releases/org/apache/maven/doxia/doxia-module-xhtml/1.0-alpha-10/doxia-module-xhtml-1.0-alpha-10.pom
Downloading from cbi-snapshots: https://repo.eclipse.org/content/repositories/cbi-snapshots/org/apache/maven/doxia/doxia-module-xhtml/1.0-alpha-10/doxia-module-xhtml-1.0-alpha-10.pom
Downloading from eclipse.maven.central.mirror: https://repo.eclipse.org/content/repositories/maven_central/org/apache/maven/doxia/doxia-module-xhtml/1.0-alpha-10/doxia-module-xhtml-1.0-alpha-10.pom
Progress (1): 1.6 kB
                    
Downloaded from eclipse.maven.central.mirror: https://repo.eclipse.org/content/repositories/maven_central/org/apache/maven/doxia/doxia-module-xhtml/1.0-alpha-10/doxia-module-xhtml-1.0-alpha-10.pom (1.6 kB at 44 kB/s)
Downloading from sonatype: https://oss.sonatype.org/content/repositories/public/org/codehaus/gmaven/runtime/gmaven-runtime-api/1.5/gmaven-runtime-api-1.5.jar
Downloading from sonatype: https://oss.sonatype.org/content/repositories/public/org/codehaus/gmaven/feature/gmaven-feature-api/1.5/gmaven-feature-api-1.5.jar
Downloading from sonatype: https://oss.sonatype.org/content/repositories/public/org/codehaus/gmaven/runtime/gmaven-runtime-loader/1.5/gmaven-runtime-loader-1.5.jar
Downloading from sonatype: https://oss.sonatype.org/content/repositories/public/org/codehaus/gmaven/feature/gmaven-feature-support/1.5/gmaven-feature-support-1.5.jar
Downloading from sonatype: https://oss.sonatype.org/content/repositories/public/org/codehaus/plexus/plexus-classworlds/2.4/plexus-classworlds-2.4.jar
Downloading from sonatype: https://oss.sonatype.org/content/repositories/public/org/codehaus/gmaven/runtime/gmaven-runtime-support/1.5/gmaven-runtime-support-1.5.jar
Progress (1): 3.8/17 kB
Progress (2): 3.8/17 kB | 4.1/25 kB
Progress (2): 3.8/17 kB | 7.8/25 kB
Progress (2): 3.8/17 kB | 12/25 kB 
Progress (2): 3.8/17 kB | 12/25 kB
Progress (3): 3.8/17 kB | 12/25 kB | 3.8/13 kB
Progress (3): 3.8/17 kB | 12/25 kB | 7.9/13 kB
Progress (3): 3.8/17 kB | 12/25 kB | 12/13 kB 
Progress (3): 3.8/17 kB | 12/25 kB | 13 kB   
Progress (4): 3.8/17 kB | 12/25 kB | 13 kB | 3.8/22 kB
Progress (4): 7.9/17 kB | 12/25 kB | 13 kB | 3.8/22 kB
Progress (4): 12/17 kB | 12/25 kB | 13 kB | 3.8/22 kB 
Progress (4): 12/17 kB | 16/25 kB | 13 kB | 3.8/22 kB
Progress (4): 12/17 kB | 20/25 kB | 13 kB | 3.8/22 kB
Progress (4): 16/17 kB | 20/25 kB | 13 kB | 3.8/22 kB
Progress (4): 16/17 kB | 24/25 kB | 13 kB | 3.8/22 kB
Progress (4): 17 kB | 24/25 kB | 13 kB | 3.8/22 kB   
Progress (4): 17 kB | 25 kB | 13 kB | 3.8/22 kB   
Progress (4): 17 kB | 25 kB | 13 kB | 7.9/22 kB
Progress (4): 17 kB | 25 kB | 13 kB | 12/22 kB 
Progress (4): 17 kB | 25 kB | 13 kB | 16/22 kB
Progress (4): 17 kB | 25 kB | 13 kB | 20/22 kB
Progress (4): 17 kB | 25 kB | 13 kB | 22 kB   
                                           
Downloaded from sonatype: https://oss.sonatype.org/content/repositories/public/org/codehaus/gmaven/feature/gmaven-feature-support/1.5/gmaven-feature-support-1.5.jar (13 kB at 71 kB/s)
Downloading from sonatype: https://oss.sonatype.org/content/repositories/public/org/sonatype/gshell/gshell-io/2.4/gshell-io-2.4.jar
Downloaded from sonatype: https://oss.sonatype.org/content/repositories/public/org/codehaus/gmaven/runtime/gmaven-runtime-loader/1.5/gmaven-runtime-loader-1.5.jar (25 kB at 117 kB/s)
Downloading from sonatype: https://oss.sonatype.org/content/repositories/public/com/thoughtworks/qdox/qdox/1.12/qdox-1.12.jar
Downloaded from sonatype: https://oss.sonatype.org/content/repositories/public/org/codehaus/gmaven/runtime/gmaven-runtime-api/1.5/gmaven-runtime-api-1.5.jar (22 kB at 103 kB/s)
Downloading from sonatype: https://oss.sonatype.org/content/repositories/public/org/apache/maven/maven-plugin-api/2.0.10/maven-plugin-api-2.0.10.jar
Downloaded from sonatype: https://oss.sonatype.org/content/repositories/public/org/codehaus/gmaven/feature/gmaven-feature-api/1.5/gmaven-feature-api-1.5.jar (17 kB at 80 kB/s)
Downloading from sonatype: https://oss.sonatype.org/content/repositories/public/org/apache/maven/maven-artifact-manager/2.0.2/maven-artifact-manager-2.0.2.jar
Downloading from sonatype: https://oss.sonatype.org/content/repositories/public/org/apache/maven/maven-repository-metadata/2.0.2/maven-repository-metadata-2.0.2.jar
Progress (1): 4.1/80 kB
Progress (1): 7.8/80 kB
Progress (1): 12/80 kB 
Progress (1): 12/80 kB
                      
Downloading from sonatype: https://oss.sonatype.org/content/repositories/public/org/codehaus/plexus/plexus-container-default/1.5.5/plexus-container-default-1.5.5.jar
Downloading from sonatype: https://oss.sonatype.org/content/repositories/public/org/apache/xbean/xbean-reflect/3.4/xbean-reflect-3.4.jar
Progress (2): 12/80 kB | 4.1/180 kB
Progress (2): 12/80 kB | 7.8/180 kB
Progress (2): 12/80 kB | 7.9/180 kB
Progress (2): 12/80 kB | 12/180 kB 
Progress (2): 12/80 kB | 16/180 kB
Progress (2): 12/80 kB | 20/180 kB
Progress (2): 12/80 kB | 24/180 kB
Progress (2): 12/80 kB | 28/180 kB
Progress (2): 12/80 kB | 32/180 kB
Progress (2): 12/80 kB | 37/180 kB
Progress (2): 12/80 kB | 37/180 kB
Progress (2): 16/80 kB | 37/180 kB
Progress (2): 20/80 kB | 37/180 kB
Progress (2): 24/80 kB | 37/180 kB
Progress (2): 28/80 kB | 37/180 kB
Progress (2): 28/80 kB | 41/180 kB
Progress (2): 28/80 kB | 45/180 kB
Progress (2): 28/80 kB | 49/180 kB
Progress (2): 28/80 kB | 53/180 kB
Progress (2): 32/80 kB | 53/180 kB
Progress (2): 37/80 kB | 53/180 kB
Progress (2): 41/80 kB | 53/180 kB
Progress (2): 45/80 kB | 53/180 kB
Progress (2): 49/80 kB | 53/180 kB
Progress (2): 53/80 kB | 53/180 kB
Progress (2): 57/80 kB | 53/180 kB
Progress (2): 61/80 kB | 53/180 kB
Progress (2): 65/80 kB | 53/180 kB
Progress (2): 69/80 kB | 53/180 kB
Progress (2): 73/80 kB | 53/180 kB
Progress (2): 77/80 kB | 53/180 kB
Progress (2): 80 kB | 53/180 kB   
Progress (2): 80 kB | 57/180 kB
Progress (2): 80 kB | 61/180 kB
Progress (2): 80 kB | 66/180 kB
Progress (2): 80 kB | 70/180 kB
Progress (2): 80 kB | 74/180 kB
Progress (2): 80 kB | 78/180 kB
Progress (2): 80 kB | 82/180 kB
Progress (2): 80 kB | 86/180 kB
Progress (2): 80 kB | 90/180 kB
Progress (2): 80 kB | 94/180 kB
Progress (2): 80 kB | 98/180 kB
Progress (2): 80 kB | 102/180 kB
Progress (2): 80 kB | 106/180 kB
Progress (2): 80 kB | 111/180 kB
Progress (2): 80 kB | 115/180 kB
Progress (2): 80 kB | 119/180 kB
Progress (2): 80 kB | 123/180 kB
Progress (2): 80 kB | 127/180 kB
Progress (2): 80 kB | 131/180 kB
Progress (2): 80 kB | 135/180 kB
                                
Downloading from sonatype: https://oss.sonatype.org/content/repositories/public/log4j/log4j/1.2.12/log4j-1.2.12.jar
Downloaded from sonatype: https://oss.sonatype.org/content/repositories/public/org/codehaus/gmaven/runtime/gmaven-runtime-support/1.5/gmaven-runtime-support-1.5.jar (80 kB at 221 kB/s)
Downloading from sonatype: https://oss.sonatype.org/content/repositories/public/commons-logging/commons-logging-api/1.1/commons-logging-api-1.1.jar
Progress (1): 139/180 kB
Progress (1): 143/180 kB
Progress (1): 147/180 kB
Progress (1): 152/180 kB
Progress (1): 156/180 kB
Progress (1): 160/180 kB
Progress (1): 164/180 kB
Progress (1): 168/180 kB
Progress (1): 172/180 kB
Progress (1): 176/180 kB
Progress (1): 180 kB    
                    
Downloading from sonatype: https://oss.sonatype.org/content/repositories/public/com/google/collections/google-collections/1.0/google-collections-1.0.jar
Downloading from sonatype: https://oss.sonatype.org/content/repositories/public/org/apache/maven/maven-artifact/2.0.10/maven-artifact-2.0.10.jar
Downloading from sonatype: https://oss.sonatype.org/content/repositories/public/org/apache/maven/maven-plugin-descriptor/2.0.10/maven-plugin-descriptor-2.0.10.jar
Downloaded from sonatype: https://oss.sonatype.org/content/repositories/public/com/thoughtworks/qdox/qdox/1.12/qdox-1.12.jar (180 kB at 427 kB/s)
Downloading from sonatype: https://oss.sonatype.org/content/repositories/public/org/apache/maven/reporting/maven-reporting-impl/2.0.4.1/maven-reporting-impl-2.0.4.1.jar
Downloading from sonatype: https://oss.sonatype.org/content/repositories/public/org/apache/maven/maven-model/2.0.10/maven-model-2.0.10.jar
Progress (1): 4.1/358 kB
Progress (1): 7.8/358 kB
Progress (1): 12/358 kB 
Progress (1): 16/358 kB
Progress (1): 16/358 kB
Progress (1): 20/358 kB
Progress (1): 24/358 kB
Progress (1): 28/358 kB
Progress (1): 32/358 kB
                       
Downloading from sonatype: https://oss.sonatype.org/content/repositories/public/org/apache/maven/doxia/doxia-core/1.0-alpha-10/doxia-core-1.0-alpha-10.jar
Downloading from sonatype: https://oss.sonatype.org/content/repositories/public/org/apache/maven/doxia/doxia-sink-api/1.0-alpha-10/doxia-sink-api-1.0-alpha-10.jar
Downloading from sonatype: https://oss.sonatype.org/content/repositories/public/org/apache/maven/reporting/maven-reporting-api/2.0.4/maven-reporting-api-2.0.4.jar
Progress (1): 37/358 kB
Progress (1): 41/358 kB
Progress (1): 45/358 kB
Progress (1): 49/358 kB
Progress (1): 53/358 kB
Progress (1): 57/358 kB
Progress (1): 61/358 kB
Progress (1): 65/358 kB
Progress (1): 69/358 kB
Progress (1): 73/358 kB
Progress (1): 77/358 kB
Progress (1): 82/358 kB
Progress (1): 86/358 kB
Progress (1): 90/358 kB
Progress (1): 94/358 kB
Progress (1): 98/358 kB
Progress (1): 102/358 kB
Progress (1): 106/358 kB
Progress (1): 110/358 kB
Progress (1): 114/358 kB
Progress (1): 118/358 kB
Progress (1): 123/358 kB
Progress (1): 127/358 kB
Progress (1): 131/358 kB
Progress (1): 135/358 kB
Progress (1): 139/358 kB
Progress (1): 143/358 kB
Progress (1): 147/358 kB
                        
Downloading from sonatype: https://oss.sonatype.org/content/repositories/public/org/apache/maven/doxia/doxia-site-renderer/1.0-alpha-10/doxia-site-renderer-1.0-alpha-10.jar
Progress (1): 151/358 kB
Progress (1): 155/358 kB
Progress (1): 159/358 kB
Progress (1): 164/358 kB
Progress (1): 168/358 kB
Progress (1): 172/358 kB
Progress (1): 176/358 kB
Progress (1): 180/358 kB
Progress (1): 184/358 kB
Progress (1): 188/358 kB
Progress (1): 192/358 kB
Progress (1): 196/358 kB
Progress (1): 200/358 kB
Progress (1): 204/358 kB
Progress (1): 209/358 kB
Progress (1): 213/358 kB
                        
Downloading from sonatype: https://oss.sonatype.org/content/repositories/public/org/apache/maven/doxia/doxia-decoration-model/1.0-alpha-10/doxia-decoration-model-1.0-alpha-10.jar
Progress (1): 217/358 kB
Progress (1): 221/358 kB
Progress (1): 225/358 kB
Progress (1): 229/358 kB
Progress (1): 233/358 kB
Progress (1): 237/358 kB
Progress (1): 241/358 kB
Progress (1): 245/358 kB
Progress (1): 250/358 kB
                        
Downloading from sonatype: https://oss.sonatype.org/content/repositories/public/org/apache/maven/doxia/doxia-module-apt/1.0-alpha-10/doxia-module-apt-1.0-alpha-10.jar
Progress (1): 254/358 kB
Progress (1): 258/358 kB
Progress (1): 262/358 kB
Progress (1): 266/358 kB
Progress (1): 270/358 kB
Progress (1): 274/358 kB
Progress (1): 278/358 kB
Progress (1): 282/358 kB
Progress (1): 286/358 kB
Progress (1): 290/358 kB
Progress (1): 295/358 kB
Progress (1): 299/358 kB
Progress (1): 303/358 kB
Progress (1): 307/358 kB
Progress (1): 311/358 kB
Progress (1): 315/358 kB
Progress (1): 319/358 kB
Progress (1): 323/358 kB
Progress (1): 327/358 kB
Progress (1): 331/358 kB
Progress (1): 336/358 kB
Progress (1): 340/358 kB
Progress (1): 344/358 kB
Progress (1): 348/358 kB
Progress (1): 352/358 kB
Progress (1): 356/358 kB
Progress (1): 358 kB    
                    
Downloading from sonatype: https://oss.sonatype.org/content/repositories/public/org/apache/maven/doxia/doxia-module-fml/1.0-alpha-10/doxia-module-fml-1.0-alpha-10.jar
Downloaded from sonatype: https://oss.sonatype.org/content/repositories/public/log4j/log4j/1.2.12/log4j-1.2.12.jar (358 kB at 519 kB/s)
Downloading from sonatype: https://oss.sonatype.org/content/repositories/public/org/apache/maven/doxia/doxia-module-xdoc/1.0-alpha-10/doxia-module-xdoc-1.0-alpha-10.jar
Downloading from sonatype: https://oss.sonatype.org/content/repositories/public/org/apache/maven/doxia/doxia-module-xhtml/1.0-alpha-10/doxia-module-xhtml-1.0-alpha-10.jar
Downloading from sonatype: https://oss.sonatype.org/content/repositories/public/org/slf4j/slf4j-api/1.5.10/slf4j-api-1.5.10.jar
Downloading from sonatype: https://oss.sonatype.org/content/repositories/public/org/sonatype/gossip/gossip/1.2/gossip-1.2.jar
Progress (1): 3.8/24 kB
Progress (1): 7.9/24 kB
Progress (1): 12/24 kB 
Progress (1): 16/24 kB
Progress (1): 20/24 kB
Progress (1): 24 kB   
                   
Downloaded from sonatype: https://oss.sonatype.org/content/repositories/public/org/slf4j/slf4j-api/1.5.10/slf4j-api-1.5.10.jar (24 kB at 25 kB/s)
Downloading from cbi: https://repo.eclipse.org/content/repositories/cbi-releases/org/codehaus/plexus/plexus-classworlds/2.4/plexus-classworlds-2.4.jar
Downloading from cbi: https://repo.eclipse.org/content/repositories/cbi-releases/org/sonatype/gshell/gshell-io/2.4/gshell-io-2.4.jar
Downloading from cbi: https://repo.eclipse.org/content/repositories/cbi-releases/org/apache/maven/maven-plugin-api/2.0.10/maven-plugin-api-2.0.10.jar
Downloading from cbi: https://repo.eclipse.org/content/repositories/cbi-releases/org/apache/maven/maven-artifact-manager/2.0.2/maven-artifact-manager-2.0.2.jar
Downloading from cbi: https://repo.eclipse.org/content/repositories/cbi-releases/org/apache/maven/maven-repository-metadata/2.0.2/maven-repository-metadata-2.0.2.jar
Downloading from cbi: https://repo.eclipse.org/content/repositories/cbi-releases/org/codehaus/plexus/plexus-container-default/1.5.5/plexus-container-default-1.5.5.jar
Downloading from cbi: https://repo.eclipse.org/content/repositories/cbi-releases/org/apache/xbean/xbean-reflect/3.4/xbean-reflect-3.4.jar
Downloading from cbi: https://repo.eclipse.org/content/repositories/cbi-releases/commons-logging/commons-logging-api/1.1/commons-logging-api-1.1.jar
Downloading from cbi: https://repo.eclipse.org/content/repositories/cbi-releases/com/google/collections/google-collections/1.0/google-collections-1.0.jar
Downloading from cbi: https://repo.eclipse.org/content/repositories/cbi-releases/org/apache/maven/maven-artifact/2.0.10/maven-artifact-2.0.10.jar
Downloading from cbi: https://repo.eclipse.org/content/repositories/cbi-releases/org/apache/maven/maven-plugin-descriptor/2.0.10/maven-plugin-descriptor-2.0.10.jar
Downloading from cbi: https://repo.eclipse.org/content/repositories/cbi-releases/org/apache/maven/reporting/maven-reporting-impl/2.0.4.1/maven-reporting-impl-2.0.4.1.jar
Downloading from cbi: https://repo.eclipse.org/content/repositories/cbi-releases/org/apache/maven/maven-model/2.0.10/maven-model-2.0.10.jar
Downloading from cbi: https://repo.eclipse.org/content/repositories/cbi-releases/org/apache/maven/doxia/doxia-core/1.0-alpha-10/doxia-core-1.0-alpha-10.jar
Downloading from cbi: https://repo.eclipse.org/content/repositories/cbi-releases/org/apache/maven/doxia/doxia-sink-api/1.0-alpha-10/doxia-sink-api-1.0-alpha-10.jar
Downloading from cbi: https://repo.eclipse.org/content/repositories/cbi-releases/org/apache/maven/reporting/maven-reporting-api/2.0.4/maven-reporting-api-2.0.4.jar
Downloading from cbi: https://repo.eclipse.org/content/repositories/cbi-releases/org/apache/maven/doxia/doxia-site-renderer/1.0-alpha-10/doxia-site-renderer-1.0-alpha-10.jar
Downloading from cbi: https://repo.eclipse.org/content/repositories/cbi-releases/org/apache/maven/doxia/doxia-decoration-model/1.0-alpha-10/doxia-decoration-model-1.0-alpha-10.jar
Downloading from cbi: https://repo.eclipse.org/content/repositories/cbi-releases/org/apache/maven/doxia/doxia-module-apt/1.0-alpha-10/doxia-module-apt-1.0-alpha-10.jar
Downloading from cbi: https://repo.eclipse.org/content/repositories/cbi-releases/org/apache/maven/doxia/doxia-module-fml/1.0-alpha-10/doxia-module-fml-1.0-alpha-10.jar
Downloading from cbi: https://repo.eclipse.org/content/repositories/cbi-releases/org/apache/maven/doxia/doxia-module-xdoc/1.0-alpha-10/doxia-module-xdoc-1.0-alpha-10.jar
Downloading from cbi: https://repo.eclipse.org/content/repositories/cbi-releases/org/apache/maven/doxia/doxia-module-xhtml/1.0-alpha-10/doxia-module-xhtml-1.0-alpha-10.jar
Downloading from cbi: https://repo.eclipse.org/content/repositories/cbi-releases/org/sonatype/gossip/gossip/1.2/gossip-1.2.jar
Downloading from cbi-snapshots: https://repo.eclipse.org/content/repositories/cbi-snapshots/org/codehaus/plexus/plexus-classworlds/2.4/plexus-classworlds-2.4.jar
Downloading from cbi-snapshots: https://repo.eclipse.org/content/repositories/cbi-snapshots/org/sonatype/gshell/gshell-io/2.4/gshell-io-2.4.jar
Downloading from cbi-snapshots: https://repo.eclipse.org/content/repositories/cbi-snapshots/org/apache/maven/maven-plugin-api/2.0.10/maven-plugin-api-2.0.10.jar
Downloading from cbi-snapshots: https://repo.eclipse.org/content/repositories/cbi-snapshots/org/apache/maven/maven-artifact-manager/2.0.2/maven-artifact-manager-2.0.2.jar
Downloading from cbi-snapshots: https://repo.eclipse.org/content/repositories/cbi-snapshots/org/apache/maven/maven-repository-metadata/2.0.2/maven-repository-metadata-2.0.2.jar
Downloading from cbi-snapshots: https://repo.eclipse.org/content/repositories/cbi-snapshots/org/codehaus/plexus/plexus-container-default/1.5.5/plexus-container-default-1.5.5.jar
Downloading from cbi-snapshots: https://repo.eclipse.org/content/repositories/cbi-snapshots/org/apache/xbean/xbean-reflect/3.4/xbean-reflect-3.4.jar
Downloading from cbi-snapshots: https://repo.eclipse.org/content/repositories/cbi-snapshots/commons-logging/commons-logging-api/1.1/commons-logging-api-1.1.jar
Downloading from cbi-snapshots: https://repo.eclipse.org/content/repositories/cbi-snapshots/com/google/collections/google-collections/1.0/google-collections-1.0.jar
Downloading from cbi-snapshots: https://repo.eclipse.org/content/repositories/cbi-snapshots/org/apache/maven/maven-artifact/2.0.10/maven-artifact-2.0.10.jar
Downloading from cbi-snapshots: https://repo.eclipse.org/content/repositories/cbi-snapshots/org/apache/maven/maven-plugin-descriptor/2.0.10/maven-plugin-descriptor-2.0.10.jar
Downloading from cbi-snapshots: https://repo.eclipse.org/content/repositories/cbi-snapshots/org/apache/maven/reporting/maven-reporting-impl/2.0.4.1/maven-reporting-impl-2.0.4.1.jar
Downloading from cbi-snapshots: https://repo.eclipse.org/content/repositories/cbi-snapshots/org/apache/maven/maven-model/2.0.10/maven-model-2.0.10.jar
Downloading from cbi-snapshots: https://repo.eclipse.org/content/repositories/cbi-snapshots/org/apache/maven/doxia/doxia-core/1.0-alpha-10/doxia-core-1.0-alpha-10.jar
Downloading from cbi-snapshots: https://repo.eclipse.org/content/repositories/cbi-snapshots/org/apache/maven/doxia/doxia-sink-api/1.0-alpha-10/doxia-sink-api-1.0-alpha-10.jar
Downloading from cbi-snapshots: https://repo.eclipse.org/content/repositories/cbi-snapshots/org/apache/maven/reporting/maven-reporting-api/2.0.4/maven-reporting-api-2.0.4.jar
Downloading from cbi-snapshots: https://repo.eclipse.org/content/repositories/cbi-snapshots/org/apache/maven/doxia/doxia-site-renderer/1.0-alpha-10/doxia-site-renderer-1.0-alpha-10.jar
Downloading from cbi-snapshots: https://repo.eclipse.org/content/repositories/cbi-snapshots/org/apache/maven/doxia/doxia-decoration-model/1.0-alpha-10/doxia-decoration-model-1.0-alpha-10.jar
Downloading from cbi-snapshots: https://repo.eclipse.org/content/repositories/cbi-snapshots/org/apache/maven/doxia/doxia-module-apt/1.0-alpha-10/doxia-module-apt-1.0-alpha-10.jar
Downloading from cbi-snapshots: https://repo.eclipse.org/content/repositories/cbi-snapshots/org/apache/maven/doxia/doxia-module-fml/1.0-alpha-10/doxia-module-fml-1.0-alpha-10.jar
Downloading from cbi-snapshots: https://repo.eclipse.org/content/repositories/cbi-snapshots/org/apache/maven/doxia/doxia-module-xdoc/1.0-alpha-10/doxia-module-xdoc-1.0-alpha-10.jar
Downloading from cbi-snapshots: https://repo.eclipse.org/content/repositories/cbi-snapshots/org/apache/maven/doxia/doxia-module-xhtml/1.0-alpha-10/doxia-module-xhtml-1.0-alpha-10.jar
Downloading from cbi-snapshots: https://repo.eclipse.org/content/repositories/cbi-snapshots/org/sonatype/gossip/gossip/1.2/gossip-1.2.jar
Downloading from eclipse.maven.central.mirror: https://repo.eclipse.org/content/repositories/maven_central/org/codehaus/plexus/plexus-classworlds/2.4/plexus-classworlds-2.4.jar
Downloading from eclipse.maven.central.mirror: https://repo.eclipse.org/content/repositories/maven_central/org/sonatype/gshell/gshell-io/2.4/gshell-io-2.4.jar
Downloading from eclipse.maven.central.mirror: https://repo.eclipse.org/content/repositories/maven_central/org/apache/maven/maven-plugin-api/2.0.10/maven-plugin-api-2.0.10.jar
Downloading from eclipse.maven.central.mirror: https://repo.eclipse.org/content/repositories/maven_central/org/apache/maven/maven-artifact-manager/2.0.2/maven-artifact-manager-2.0.2.jar
Downloading from eclipse.maven.central.mirror: https://repo.eclipse.org/content/repositories/maven_central/org/apache/maven/maven-repository-metadata/2.0.2/maven-repository-metadata-2.0.2.jar
Progress (1): 4.1/20 kB
Progress (1): 7.7/20 kB
Progress (1): 12/20 kB 
Progress (1): 16/20 kB
Progress (1): 20 kB   
Progress (2): 20 kB | 4.1/47 kB
Progress (2): 20 kB | 7.7/47 kB
Progress (2): 20 kB | 12/47 kB 
Progress (2): 20 kB | 16/47 kB
Progress (2): 20 kB | 20/47 kB
Progress (2): 20 kB | 24/47 kB
Progress (2): 20 kB | 28/47 kB
Progress (2): 20 kB | 32/47 kB
Progress (2): 20 kB | 36/47 kB
Progress (2): 20 kB | 40/47 kB
Progress (2): 20 kB | 44/47 kB
Progress (3): 20 kB | 44/47 kB | 4.1/49 kB
Progress (3): 20 kB | 47 kB | 4.1/49 kB   
Progress (3): 20 kB | 47 kB | 7.7/49 kB
Progress (3): 20 kB | 47 kB | 12/49 kB 
Progress (3): 20 kB | 47 kB | 16/49 kB
Progress (3): 20 kB | 47 kB | 20/49 kB
Progress (3): 20 kB | 47 kB | 24/49 kB
Progress (3): 20 kB | 47 kB | 28/49 kB
Progress (3): 20 kB | 47 kB | 32/49 kB
Progress (3): 20 kB | 47 kB | 36/49 kB
Progress (3): 20 kB | 47 kB | 40/49 kB
Progress (3): 20 kB | 47 kB | 44/49 kB
Progress (3): 20 kB | 47 kB | 48/49 kB
                                      
Downloaded from eclipse.maven.central.mirror: https://repo.eclipse.org/content/repositories/maven_central/org/apache/maven/maven-repository-metadata/2.0.2/maven-repository-metadata-2.0.2.jar (20 kB at 679 kB/s)
Progress (2): 47 kB | 49 kB
                           
Downloading from eclipse.maven.central.mirror: https://repo.eclipse.org/content/repositories/maven_central/org/codehaus/plexus/plexus-container-default/1.5.5/plexus-container-default-1.5.5.jar
Downloaded from eclipse.maven.central.mirror: https://repo.eclipse.org/content/repositories/maven_central/org/codehaus/plexus/plexus-classworlds/2.4/plexus-classworlds-2.4.jar (47 kB at 1.4 MB/s)
Downloading from eclipse.maven.central.mirror: https://repo.eclipse.org/content/repositories/maven_central/org/apache/xbean/xbean-reflect/3.4/xbean-reflect-3.4.jar
Progress (2): 49 kB | 4.1/29 kB
Progress (2): 49 kB | 7.7/29 kB
Progress (2): 49 kB | 12/29 kB 
Progress (2): 49 kB | 16/29 kB
Progress (2): 49 kB | 20/29 kB
Progress (2): 49 kB | 24/29 kB
Progress (2): 49 kB | 28/29 kB
Progress (2): 49 kB | 29 kB   
Progress (3): 49 kB | 29 kB | 4.1/13 kB
Progress (3): 49 kB | 29 kB | 7.7/13 kB
Progress (3): 49 kB | 29 kB | 12/13 kB 
Progress (3): 49 kB | 29 kB | 13 kB   
                                   
Downloaded from eclipse.maven.central.mirror: https://repo.eclipse.org/content/repositories/maven_central/org/apache/maven/maven-artifact-manager/2.0.2/maven-artifact-manager-2.0.2.jar (49 kB at 927 kB/s)
Downloading from eclipse.maven.central.mirror: https://repo.eclipse.org/content/repositories/maven_central/commons-logging/commons-logging-api/1.1/commons-logging-api-1.1.jar
Downloaded from eclipse.maven.central.mirror: https://repo.eclipse.org/content/repositories/maven_central/org/sonatype/gshell/gshell-io/2.4/gshell-io-2.4.jar (29 kB at 526 kB/s)
Downloading from eclipse.maven.central.mirror: https://repo.eclipse.org/content/repositories/maven_central/com/google/collections/google-collections/1.0/google-collections-1.0.jar
Downloaded from eclipse.maven.central.mirror: https://repo.eclipse.org/content/repositories/maven_central/org/apache/maven/maven-plugin-api/2.0.10/maven-plugin-api-2.0.10.jar (13 kB at 215 kB/s)
Downloading from eclipse.maven.central.mirror: https://repo.eclipse.org/content/repositories/maven_central/org/apache/maven/maven-artifact/2.0.10/maven-artifact-2.0.10.jar
Progress (1): 4.1/217 kB
Progress (1): 7.7/217 kB
Progress (1): 12/217 kB 
Progress (1): 16/217 kB
Progress (1): 20/217 kB
Progress (1): 24/217 kB
Progress (1): 28/217 kB
Progress (1): 32/217 kB
Progress (1): 33/217 kB
Progress (1): 37/217 kB
Progress (1): 41/217 kB
Progress (1): 45/217 kB
Progress (2): 45/217 kB | 4.1/134 kB
Progress (2): 49/217 kB | 4.1/134 kB
Progress (2): 49/217 kB | 7.7/134 kB
Progress (2): 53/217 kB | 7.7/134 kB
Progress (2): 53/217 kB | 12/134 kB 
Progress (2): 57/217 kB | 12/134 kB
Progress (2): 57/217 kB | 16/134 kB
Progress (2): 61/217 kB | 16/134 kB
Progress (2): 61/217 kB | 20/134 kB
Progress (2): 65/217 kB | 20/134 kB
Progress (2): 65/217 kB | 24/134 kB
Progress (2): 69/217 kB | 24/134 kB
Progress (2): 69/217 kB | 28/134 kB
Progress (2): 73/217 kB | 28/134 kB
Progress (2): 73/217 kB | 32/134 kB
Progress (2): 73/217 kB | 33/134 kB
Progress (2): 77/217 kB | 33/134 kB
Progress (2): 81/217 kB | 33/134 kB
Progress (2): 81/217 kB | 37/134 kB
Progress (2): 81/217 kB | 41/134 kB
Progress (2): 85/217 kB | 41/134 kB
Progress (2): 85/217 kB | 45/134 kB
Progress (2): 89/217 kB | 45/134 kB
Progress (2): 89/217 kB | 49/134 kB
Progress (3): 89/217 kB | 49/134 kB | 4.1/45 kB
Progress (3): 89/217 kB | 49/134 kB | 7.7/45 kB
Progress (3): 93/217 kB | 49/134 kB | 7.7/45 kB
Progress (3): 93/217 kB | 53/134 kB | 7.7/45 kB
Progress (3): 97/217 kB | 53/134 kB | 7.7/45 kB
Progress (3): 97/217 kB | 57/134 kB | 7.7/45 kB
Progress (3): 97/217 kB | 57/134 kB | 12/45 kB 
Progress (3): 97/217 kB | 57/134 kB | 16/45 kB
Progress (3): 101/217 kB | 57/134 kB | 16/45 kB
Progress (3): 101/217 kB | 61/134 kB | 16/45 kB
Progress (3): 105/217 kB | 61/134 kB | 16/45 kB
Progress (3): 105/217 kB | 65/134 kB | 16/45 kB
Progress (3): 105/217 kB | 65/134 kB | 20/45 kB
Progress (3): 105/217 kB | 65/134 kB | 24/45 kB
Progress (3): 109/217 kB | 65/134 kB | 24/45 kB
Progress (3): 109/217 kB | 69/134 kB | 24/45 kB
Progress (3): 113/217 kB | 69/134 kB | 24/45 kB
Progress (3): 113/217 kB | 69/134 kB | 28/45 kB
Progress (3): 113/217 kB | 73/134 kB | 28/45 kB
Progress (3): 113/217 kB | 73/134 kB | 32/45 kB
Progress (3): 113/217 kB | 73/134 kB | 33/45 kB
Progress (3): 117/217 kB | 73/134 kB | 33/45 kB
Progress (3): 117/217 kB | 77/134 kB | 33/45 kB
Progress (3): 121/217 kB | 77/134 kB | 33/45 kB
Progress (3): 121/217 kB | 81/134 kB | 33/45 kB
Progress (3): 121/217 kB | 81/134 kB | 37/45 kB
Progress (3): 121/217 kB | 81/134 kB | 41/45 kB
Progress (3): 125/217 kB | 81/134 kB | 41/45 kB
Progress (3): 125/217 kB | 85/134 kB | 41/45 kB
Progress (3): 129/217 kB | 85/134 kB | 41/45 kB
Progress (3): 129/217 kB | 85/134 kB | 45 kB   
Progress (3): 129/217 kB | 89/134 kB | 45 kB
Progress (3): 133/217 kB | 89/134 kB | 45 kB
Progress (3): 133/217 kB | 93/134 kB | 45 kB
Progress (3): 137/217 kB | 93/134 kB | 45 kB
Progress (3): 137/217 kB | 97/134 kB | 45 kB
Progress (3): 141/217 kB | 97/134 kB | 45 kB
Progress (3): 141/217 kB | 101/134 kB | 45 kB
Progress (3): 145/217 kB | 101/134 kB | 45 kB
Progress (4): 145/217 kB | 101/134 kB | 45 kB | 4.1/640 kB
Progress (4): 145/217 kB | 105/134 kB | 45 kB | 4.1/640 kB
Progress (4): 145/217 kB | 105/134 kB | 45 kB | 7.7/640 kB
Progress (4): 149/217 kB | 105/134 kB | 45 kB | 7.7/640 kB
Progress (4): 153/217 kB | 105/134 kB | 45 kB | 7.7/640 kB
Progress (4): 153/217 kB | 109/134 kB | 45 kB | 7.7/640 kB
Progress (4): 153/217 kB | 113/134 kB | 45 kB | 7.7/640 kB
Progress (4): 153/217 kB | 113/134 kB | 45 kB | 12/640 kB 
Progress (4): 157/217 kB | 113/134 kB | 45 kB | 12/640 kB
Progress (4): 157/217 kB | 113/134 kB | 45 kB | 16/640 kB
Progress (4): 161/217 kB | 113/134 kB | 45 kB | 16/640 kB
Progress (4): 161/217 kB | 117/134 kB | 45 kB | 16/640 kB
Progress (4): 161/217 kB | 121/134 kB | 45 kB | 16/640 kB
Progress (4): 165/217 kB | 121/134 kB | 45 kB | 16/640 kB
Progress (4): 165/217 kB | 121/134 kB | 45 kB | 20/640 kB
Progress (4): 169/217 kB | 121/134 kB | 45 kB | 20/640 kB
Progress (4): 169/217 kB | 125/134 kB | 45 kB | 20/640 kB
Progress (4): 169/217 kB | 125/134 kB | 45 kB | 24/640 kB
Progress (4): 169/217 kB | 129/134 kB | 45 kB | 24/640 kB
Progress (4): 173/217 kB | 129/134 kB | 45 kB | 24/640 kB
Progress (4): 173/217 kB | 133/134 kB | 45 kB | 24/640 kB
Progress (4): 177/217 kB | 133/134 kB | 45 kB | 24/640 kB
Progress (4): 177/217 kB | 133/134 kB | 45 kB | 28/640 kB
Progress (4): 177/217 kB | 134 kB | 45 kB | 28/640 kB    
Progress (4): 177/217 kB | 134 kB | 45 kB | 32/640 kB
Progress (4): 181/217 kB | 134 kB | 45 kB | 32/640 kB
Progress (4): 181/217 kB | 134 kB | 45 kB | 33/640 kB
Progress (4): 185/217 kB | 134 kB | 45 kB | 33/640 kB
Progress (4): 189/217 kB | 134 kB | 45 kB | 33/640 kB
Progress (4): 189/217 kB | 134 kB | 45 kB | 37/640 kB
Progress (4): 193/217 kB | 134 kB | 45 kB | 37/640 kB
Progress (4): 193/217 kB | 134 kB | 45 kB | 41/640 kB
Progress (4): 197/217 kB | 134 kB | 45 kB | 41/640 kB
Progress (4): 201/217 kB | 134 kB | 45 kB | 41/640 kB
Progress (4): 201/217 kB | 134 kB | 45 kB | 45/640 kB
Progress (4): 201/217 kB | 134 kB | 45 kB | 49/640 kB
Progress (4): 205/217 kB | 134 kB | 45 kB | 49/640 kB
Progress (4): 209/217 kB | 134 kB | 45 kB | 49/640 kB
Progress (4): 209/217 kB | 134 kB | 45 kB | 53/640 kB
Progress (4): 213/217 kB | 134 kB | 45 kB | 53/640 kB
Progress (4): 213/217 kB | 134 kB | 45 kB | 57/640 kB
Progress (4): 217 kB | 134 kB | 45 kB | 57/640 kB    
Progress (4): 217 kB | 134 kB | 45 kB | 61/640 kB
Progress (4): 217 kB | 134 kB | 45 kB | 65/640 kB
Progress (5): 217 kB | 134 kB | 45 kB | 65/640 kB | 4.1/89 kB
Progress (5): 217 kB | 134 kB | 45 kB | 65/640 kB | 7.7/89 kB
Progress (5): 217 kB | 134 kB | 45 kB | 69/640 kB | 7.7/89 kB
Progress (5): 217 kB | 134 kB | 45 kB | 73/640 kB | 7.7/89 kB
Progress (5): 217 kB | 134 kB | 45 kB | 73/640 kB | 12/89 kB 
Progress (5): 217 kB | 134 kB | 45 kB | 73/640 kB | 16/89 kB
Progress (5): 217 kB | 134 kB | 45 kB | 77/640 kB | 16/89 kB
Progress (5): 217 kB | 134 kB | 45 kB | 81/640 kB | 16/89 kB
Progress (5): 217 kB | 134 kB | 45 kB | 81/640 kB | 20/89 kB
                                                            
Downloaded from eclipse.maven.central.mirror: https://repo.eclipse.org/content/repositories/maven_central/commons-logging/commons-logging-api/1.1/commons-logging-api-1.1.jar (45 kB at 544 kB/s)
Progress (4): 217 kB | 134 kB | 85/640 kB | 20/89 kB
Progress (4): 217 kB | 134 kB | 85/640 kB | 24/89 kB
                                                    
Downloading from eclipse.maven.central.mirror: https://repo.eclipse.org/content/repositories/maven_central/org/apache/maven/maven-plugin-descriptor/2.0.10/maven-plugin-descriptor-2.0.10.jar
Progress (4): 217 kB | 134 kB | 89/640 kB | 24/89 kB
Progress (4): 217 kB | 134 kB | 89/640 kB | 28/89 kB
Progress (4): 217 kB | 134 kB | 93/640 kB | 28/89 kB
Progress (4): 217 kB | 134 kB | 93/640 kB | 32/89 kB
Progress (4): 217 kB | 134 kB | 97/640 kB | 32/89 kB
Progress (4): 217 kB | 134 kB | 97/640 kB | 33/89 kB
Progress (4): 217 kB | 134 kB | 101/640 kB | 33/89 kB
Progress (4): 217 kB | 134 kB | 105/640 kB | 33/89 kB
Progress (4): 217 kB | 134 kB | 105/640 kB | 37/89 kB
Progress (4): 217 kB | 134 kB | 105/640 kB | 41/89 kB
Progress (4): 217 kB | 134 kB | 109/640 kB | 41/89 kB
Progress (4): 217 kB | 134 kB | 113/640 kB | 41/89 kB
Progress (4): 217 kB | 134 kB | 113/640 kB | 45/89 kB
Progress (4): 217 kB | 134 kB | 113/640 kB | 49/89 kB
Progress (4): 217 kB | 134 kB | 117/640 kB | 49/89 kB
Progress (4): 217 kB | 134 kB | 121/640 kB | 49/89 kB
                                                     
Downloaded from eclipse.maven.central.mirror: https://repo.eclipse.org/content/repositories/maven_central/org/codehaus/plexus/plexus-container-default/1.5.5/plexus-container-default-1.5.5.jar (217 kB at 2.5 MB/s)
Progress (3): 134 kB | 121/640 kB | 53/89 kB
                                            
Downloading from eclipse.maven.central.mirror: https://repo.eclipse.org/content/repositories/maven_central/org/apache/maven/reporting/maven-reporting-impl/2.0.4.1/maven-reporting-impl-2.0.4.1.jar
Progress (3): 134 kB | 121/640 kB | 57/89 kB
Progress (3): 134 kB | 125/640 kB | 57/89 kB
Progress (3): 134 kB | 129/640 kB | 57/89 kB
Progress (3): 134 kB | 129/640 kB | 61/89 kB
Progress (3): 134 kB | 129/640 kB | 65/89 kB
Progress (3): 134 kB | 133/640 kB | 65/89 kB
Progress (3): 134 kB | 133/640 kB | 66/89 kB
Progress (3): 134 kB | 137/640 kB | 66/89 kB
Progress (3): 134 kB | 137/640 kB | 70/89 kB
Progress (3): 134 kB | 141/640 kB | 70/89 kB
Progress (3): 134 kB | 141/640 kB | 74/89 kB
Progress (3): 134 kB | 145/640 kB | 74/89 kB
Progress (3): 134 kB | 145/640 kB | 78/89 kB
Progress (3): 134 kB | 149/640 kB | 78/89 kB
Progress (3): 134 kB | 149/640 kB | 82/89 kB
Progress (3): 134 kB | 153/640 kB | 82/89 kB
Progress (3): 134 kB | 153/640 kB | 86/89 kB
Progress (3): 134 kB | 157/640 kB | 86/89 kB
Progress (3): 134 kB | 157/640 kB | 89 kB   
Progress (3): 134 kB | 161/640 kB | 89 kB
Progress (3): 134 kB | 165/640 kB | 89 kB
Progress (3): 134 kB | 169/640 kB | 89 kB
Progress (3): 134 kB | 173/640 kB | 89 kB
Progress (3): 134 kB | 177/640 kB | 89 kB
Progress (3): 134 kB | 181/640 kB | 89 kB
Progress (3): 134 kB | 185/640 kB | 89 kB
Progress (3): 134 kB | 189/640 kB | 89 kB
Progress (3): 134 kB | 193/640 kB | 89 kB
Progress (3): 134 kB | 197/640 kB | 89 kB
Progress (3): 134 kB | 201/640 kB | 89 kB
Progress (3): 134 kB | 205/640 kB | 89 kB
Progress (3): 134 kB | 209/640 kB | 89 kB
Progress (3): 134 kB | 213/640 kB | 89 kB
Progress (3): 134 kB | 217/640 kB | 89 kB
Progress (3): 134 kB | 221/640 kB | 89 kB
Progress (3): 134 kB | 225/640 kB | 89 kB
Progress (3): 134 kB | 229/640 kB | 89 kB
Progress (3): 134 kB | 233/640 kB | 89 kB
Progress (3): 134 kB | 237/640 kB | 89 kB
Progress (3): 134 kB | 241/640 kB | 89 kB
Progress (3): 134 kB | 245/640 kB | 89 kB
Progress (3): 134 kB | 249/640 kB | 89 kB
Progress (4): 134 kB | 249/640 kB | 89 kB | 4.1/39 kB
Progress (4): 134 kB | 253/640 kB | 89 kB | 4.1/39 kB
Progress (4): 134 kB | 253/640 kB | 89 kB | 7.7/39 kB
Progress (4): 134 kB | 257/640 kB | 89 kB | 7.7/39 kB
                                                     
Downloaded from eclipse.maven.central.mirror: https://repo.eclipse.org/content/repositories/maven_central/org/apache/xbean/xbean-reflect/3.4/xbean-reflect-3.4.jar (134 kB at 1.4 MB/s)
Downloading from eclipse.maven.central.mirror: https://repo.eclipse.org/content/repositories/maven_central/org/apache/maven/maven-model/2.0.10/maven-model-2.0.10.jar
Progress (3): 257/640 kB | 89 kB | 12/39 kB
Progress (3): 261/640 kB | 89 kB | 12/39 kB
Progress (3): 261/640 kB | 89 kB | 16/39 kB
Progress (3): 265/640 kB | 89 kB | 16/39 kB
Progress (3): 265/640 kB | 89 kB | 20/39 kB
Progress (3): 269/640 kB | 89 kB | 20/39 kB
Progress (3): 269/640 kB | 89 kB | 24/39 kB
Progress (3): 273/640 kB | 89 kB | 24/39 kB
Progress (3): 273/640 kB | 89 kB | 28/39 kB
Progress (3): 273/640 kB | 89 kB | 32/39 kB
Progress (3): 277/640 kB | 89 kB | 32/39 kB
Progress (3): 277/640 kB | 89 kB | 33/39 kB
Progress (3): 281/640 kB | 89 kB | 33/39 kB
Progress (3): 281/640 kB | 89 kB | 37/39 kB
Progress (3): 281/640 kB | 89 kB | 39 kB   
Progress (3): 285/640 kB | 89 kB | 39 kB
Progress (3): 289/640 kB | 89 kB | 39 kB
                                        
Downloaded from eclipse.maven.central.mirror: https://repo.eclipse.org/content/repositories/maven_central/org/apache/maven/maven-artifact/2.0.10/maven-artifact-2.0.10.jar (89 kB at 911 kB/s)
Downloading from eclipse.maven.central.mirror: https://repo.eclipse.org/content/repositories/maven_central/org/apache/maven/doxia/doxia-core/1.0-alpha-10/doxia-core-1.0-alpha-10.jar
Progress (2): 293/640 kB | 39 kB
Progress (2): 297/640 kB | 39 kB
Progress (2): 301/640 kB | 39 kB
Progress (2): 305/640 kB | 39 kB
Progress (2): 309/640 kB | 39 kB
Progress (2): 313/640 kB | 39 kB
Progress (2): 317/640 kB | 39 kB
Progress (2): 321/640 kB | 39 kB
Progress (2): 325/640 kB | 39 kB
Progress (2): 329/640 kB | 39 kB
Progress (2): 333/640 kB | 39 kB
Progress (2): 337/640 kB | 39 kB
Progress (2): 341/640 kB | 39 kB
Progress (2): 345/640 kB | 39 kB
Progress (2): 349/640 kB | 39 kB
Progress (2): 353/640 kB | 39 kB
Progress (3): 353/640 kB | 39 kB | 4.1/19 kB
Progress (3): 353/640 kB | 39 kB | 7.7/19 kB
Progress (3): 357/640 kB | 39 kB | 7.7/19 kB
Progress (3): 361/640 kB | 39 kB | 7.7/19 kB
Progress (3): 361/640 kB | 39 kB | 12/19 kB 
Progress (3): 361/640 kB | 39 kB | 16/19 kB
Progress (3): 361/640 kB | 39 kB | 19 kB   
Progress (3): 365/640 kB | 39 kB | 19 kB
Progress (3): 369/640 kB | 39 kB | 19 kB
Progress (3): 373/640 kB | 39 kB | 19 kB
Progress (3): 377/640 kB | 39 kB | 19 kB
Progress (3): 381/640 kB | 39 kB | 19 kB
Progress (3): 385/640 kB | 39 kB | 19 kB
Progress (3): 389/640 kB | 39 kB | 19 kB
Progress (3): 393/640 kB | 39 kB | 19 kB
Progress (3): 397/640 kB | 39 kB | 19 kB
Progress (3): 401/640 kB | 39 kB | 19 kB
Progress (3): 405/640 kB | 39 kB | 19 kB
Progress (3): 409/640 kB | 39 kB | 19 kB
Progress (3): 413/640 kB | 39 kB | 19 kB
Progress (3): 417/640 kB | 39 kB | 19 kB
Progress (3): 421/640 kB | 39 kB | 19 kB
Progress (3): 425/640 kB | 39 kB | 19 kB
Progress (3): 429/640 kB | 39 kB | 19 kB
Progress (3): 433/640 kB | 39 kB | 19 kB
Progress (3): 437/640 kB | 39 kB | 19 kB
Progress (3): 441/640 kB | 39 kB | 19 kB
                                        
Downloaded from eclipse.maven.central.mirror: https://repo.eclipse.org/content/repositories/maven_central/org/apache/maven/maven-plugin-descriptor/2.0.10/maven-plugin-descriptor-2.0.10.jar (39 kB at 364 kB/s)
Downloading from eclipse.maven.central.mirror: https://repo.eclipse.org/content/repositories/maven_central/org/apache/maven/doxia/doxia-sink-api/1.0-alpha-10/doxia-sink-api-1.0-alpha-10.jar
Progress (2): 445/640 kB | 19 kB
Progress (2): 449/640 kB | 19 kB
Progress (2): 453/640 kB | 19 kB
Progress (2): 457/640 kB | 19 kB
Progress (2): 461/640 kB | 19 kB
Progress (2): 465/640 kB | 19 kB
Progress (2): 469/640 kB | 19 kB
Progress (2): 473/640 kB | 19 kB
Progress (2): 477/640 kB | 19 kB
                                
Downloaded from eclipse.maven.central.mirror: https://repo.eclipse.org/content/repositories/maven_central/org/apache/maven/reporting/maven-reporting-impl/2.0.4.1/maven-reporting-impl-2.0.4.1.jar (19 kB at 169 kB/s)
Progress (1): 481/640 kB
                        
Downloading from eclipse.maven.central.mirror: https://repo.eclipse.org/content/repositories/maven_central/org/apache/maven/reporting/maven-reporting-api/2.0.4/maven-reporting-api-2.0.4.jar
Progress (1): 485/640 kB
Progress (1): 489/640 kB
Progress (1): 493/640 kB
Progress (1): 497/640 kB
Progress (1): 501/640 kB
Progress (1): 505/640 kB
Progress (1): 509/640 kB
Progress (1): 513/640 kB
Progress (1): 517/640 kB
Progress (1): 521/640 kB
Progress (1): 525/640 kB
Progress (1): 529/640 kB
Progress (1): 533/640 kB
Progress (1): 537/640 kB
Progress (1): 541/640 kB
Progress (1): 545/640 kB
Progress (1): 549/640 kB
Progress (1): 553/640 kB
Progress (1): 557/640 kB
Progress (1): 561/640 kB
Progress (1): 565/640 kB
Progress (1): 569/640 kB
Progress (1): 573/640 kB
Progress (1): 577/640 kB
Progress (1): 581/640 kB
Progress (1): 585/640 kB
Progress (1): 589/640 kB
Progress (1): 593/640 kB
Progress (1): 597/640 kB
Progress (1): 601/640 kB
Progress (1): 605/640 kB
Progress (1): 609/640 kB
Progress (1): 613/640 kB
Progress (1): 617/640 kB
Progress (1): 621/640 kB
Progress (1): 625/640 kB
Progress (1): 629/640 kB
Progress (1): 633/640 kB
Progress (1): 637/640 kB
Progress (1): 640 kB    
Progress (2): 640 kB | 4.1/55 kB
Progress (2): 640 kB | 7.7/55 kB
Progress (2): 640 kB | 12/55 kB 
Progress (2): 640 kB | 16/55 kB
Progress (3): 640 kB | 16/55 kB | 4.1/96 kB
Progress (3): 640 kB | 20/55 kB | 4.1/96 kB
Progress (3): 640 kB | 20/55 kB | 7.7/96 kB
Progress (3): 640 kB | 24/55 kB | 7.7/96 kB
Progress (3): 640 kB | 24/55 kB | 12/96 kB 
Progress (3): 640 kB | 28/55 kB | 12/96 kB
Progress (3): 640 kB | 28/55 kB | 16/96 kB
Progress (3): 640 kB | 32/55 kB | 16/96 kB
                                          
Downloaded from eclipse.maven.central.mirror: https://repo.eclipse.org/content/repositories/maven_central/com/google/collections/google-collections/1.0/google-collections-1.0.jar (640 kB at 5.1 MB/s)
Progress (2): 33/55 kB | 16/96 kB
                                 
Downloading from eclipse.maven.central.mirror: https://repo.eclipse.org/content/repositories/maven_central/org/apache/maven/doxia/doxia-site-renderer/1.0-alpha-10/doxia-site-renderer-1.0-alpha-10.jar
Progress (2): 33/55 kB | 20/96 kB
Progress (2): 33/55 kB | 24/96 kB
Progress (2): 37/55 kB | 24/96 kB
Progress (2): 41/55 kB | 24/96 kB
Progress (2): 41/55 kB | 28/96 kB
Progress (2): 41/55 kB | 32/96 kB
Progress (2): 41/55 kB | 33/96 kB
Progress (2): 45/55 kB | 33/96 kB
Progress (2): 49/55 kB | 33/96 kB
Progress (2): 49/55 kB | 37/96 kB
Progress (2): 49/55 kB | 41/96 kB
Progress (2): 53/55 kB | 41/96 kB
Progress (2): 55 kB | 41/96 kB   
Progress (2): 55 kB | 45/96 kB
Progress (2): 55 kB | 49/96 kB
Progress (2): 55 kB | 53/96 kB
Progress (2): 55 kB | 57/96 kB
Progress (3): 55 kB | 57/96 kB | 4.1/9.9 kB
Progress (3): 55 kB | 57/96 kB | 7.7/9.9 kB
Progress (3): 55 kB | 61/96 kB | 7.7/9.9 kB
Progress (3): 55 kB | 61/96 kB | 9.9 kB    
Progress (3): 55 kB | 65/96 kB | 9.9 kB
Progress (3): 55 kB | 66/96 kB | 9.9 kB
Progress (3): 55 kB | 70/96 kB | 9.9 kB
Progress (3): 55 kB | 74/96 kB | 9.9 kB
Progress (3): 55 kB | 78/96 kB | 9.9 kB
Progress (3): 55 kB | 82/96 kB | 9.9 kB
Progress (3): 55 kB | 86/96 kB | 9.9 kB
Progress (3): 55 kB | 90/96 kB | 9.9 kB
Progress (3): 55 kB | 94/96 kB | 9.9 kB
Progress (3): 55 kB | 96 kB | 9.9 kB   
                                    
Downloaded from eclipse.maven.central.mirror: https://repo.eclipse.org/content/repositories/maven_central/org/apache/maven/doxia/doxia-sink-api/1.0-alpha-10/doxia-sink-api-1.0-alpha-10.jar (9.9 kB at 74 kB/s)
Downloading from eclipse.maven.central.mirror: https://repo.eclipse.org/content/repositories/maven_central/org/apache/maven/doxia/doxia-decoration-model/1.0-alpha-10/doxia-decoration-model-1.0-alpha-10.jar
Downloaded from eclipse.maven.central.mirror: https://repo.eclipse.org/content/repositories/maven_central/org/apache/maven/doxia/doxia-core/1.0-alpha-10/doxia-core-1.0-alpha-10.jar (55 kB at 408 kB/s)
Downloading from eclipse.maven.central.mirror: https://repo.eclipse.org/content/repositories/maven_central/org/apache/maven/doxia/doxia-module-apt/1.0-alpha-10/doxia-module-apt-1.0-alpha-10.jar
Progress (2): 96 kB | 4.1/5.0 kB
Progress (2): 96 kB | 5.0 kB    
Progress (3): 96 kB | 5.0 kB | 4.1/46 kB
Progress (3): 96 kB | 5.0 kB | 7.7/46 kB
Progress (3): 96 kB | 5.0 kB | 12/46 kB 
Progress (3): 96 kB | 5.0 kB | 16/46 kB
Progress (4): 96 kB | 5.0 kB | 16/46 kB | 4.1/50 kB
Progress (4): 96 kB | 5.0 kB | 20/46 kB | 4.1/50 kB
Progress (4): 96 kB | 5.0 kB | 20/46 kB | 7.7/50 kB
Progress (4): 96 kB | 5.0 kB | 24/46 kB | 7.7/50 kB
Progress (4): 96 kB | 5.0 kB | 28/46 kB | 7.7/50 kB
Progress (4): 96 kB | 5.0 kB | 28/46 kB | 12/50 kB 
Progress (4): 96 kB | 5.0 kB | 32/46 kB | 12/50 kB
Progress (4): 96 kB | 5.0 kB | 32/46 kB | 16/50 kB
Progress (4): 96 kB | 5.0 kB | 36/46 kB | 16/50 kB
Progress (4): 96 kB | 5.0 kB | 40/46 kB | 16/50 kB
Progress (4): 96 kB | 5.0 kB | 40/46 kB | 20/50 kB
Progress (4): 96 kB | 5.0 kB | 44/46 kB | 20/50 kB
Progress (4): 96 kB | 5.0 kB | 44/46 kB | 24/50 kB
Progress (4): 96 kB | 5.0 kB | 46 kB | 24/50 kB   
Progress (4): 96 kB | 5.0 kB | 46 kB | 28/50 kB
Progress (4): 96 kB | 5.0 kB | 46 kB | 32/50 kB
Progress (5): 96 kB | 5.0 kB | 46 kB | 32/50 kB | 4.1/47 kB
Progress (5): 96 kB | 5.0 kB | 46 kB | 32/50 kB | 7.7/47 kB
Progress (5): 96 kB | 5.0 kB | 46 kB | 36/50 kB | 7.7/47 kB
Progress (5): 96 kB | 5.0 kB | 46 kB | 40/50 kB | 7.7/47 kB
Progress (5): 96 kB | 5.0 kB | 46 kB | 40/50 kB | 12/47 kB 
Progress (5): 96 kB | 5.0 kB | 46 kB | 40/50 kB | 16/47 kB
Progress (5): 96 kB | 5.0 kB | 46 kB | 44/50 kB | 16/47 kB
Progress (5): 96 kB | 5.0 kB | 46 kB | 48/50 kB | 16/47 kB
Progress (5): 96 kB | 5.0 kB | 46 kB | 48/50 kB | 20/47 kB
Progress (5): 96 kB | 5.0 kB | 46 kB | 50 kB | 20/47 kB   
Progress (5): 96 kB | 5.0 kB | 46 kB | 50 kB | 24/47 kB
Progress (5): 96 kB | 5.0 kB | 46 kB | 50 kB | 28/47 kB
Progress (5): 96 kB | 5.0 kB | 46 kB | 50 kB | 32/47 kB
Progress (5): 96 kB | 5.0 kB | 46 kB | 50 kB | 33/47 kB
Progress (5): 96 kB | 5.0 kB | 46 kB | 50 kB | 37/47 kB
Progress (5): 96 kB | 5.0 kB | 46 kB | 50 kB | 41/47 kB
Progress (5): 96 kB | 5.0 kB | 46 kB | 50 kB | 45/47 kB
Progress (5): 96 kB | 5.0 kB | 46 kB | 50 kB | 47 kB   
                                                    
Downloaded from eclipse.maven.central.mirror: https://repo.eclipse.org/content/repositories/maven_central/org/apache/maven/doxia/doxia-site-renderer/1.0-alpha-10/doxia-site-renderer-1.0-alpha-10.jar (46 kB at 287 kB/s)
Downloaded from eclipse.maven.central.mirror: https://repo.eclipse.org/content/repositories/maven_central/org/apache/maven/doxia/doxia-decoration-model/1.0-alpha-10/doxia-decoration-model-1.0-alpha-10.jar (50 kB at 313 kB/s)
Downloaded from eclipse.maven.central.mirror: https://repo.eclipse.org/content/repositories/maven_central/org/apache/maven/maven-model/2.0.10/maven-model-2.0.10.jar (96 kB at 601 kB/s)
Downloading from eclipse.maven.central.mirror: https://repo.eclipse.org/content/repositories/maven_central/org/apache/maven/doxia/doxia-module-fml/1.0-alpha-10/doxia-module-fml-1.0-alpha-10.jar
Downloading from eclipse.maven.central.mirror: https://repo.eclipse.org/content/repositories/maven_central/org/apache/maven/doxia/doxia-module-xhtml/1.0-alpha-10/doxia-module-xhtml-1.0-alpha-10.jar
Downloading from eclipse.maven.central.mirror: https://repo.eclipse.org/content/repositories/maven_central/org/apache/maven/doxia/doxia-module-xdoc/1.0-alpha-10/doxia-module-xdoc-1.0-alpha-10.jar
Downloaded from eclipse.maven.central.mirror: https://repo.eclipse.org/content/repositories/maven_central/org/apache/maven/doxia/doxia-module-apt/1.0-alpha-10/doxia-module-apt-1.0-alpha-10.jar (47 kB at 285 kB/s)
Downloading from eclipse.maven.central.mirror: https://repo.eclipse.org/content/repositories/maven_central/org/sonatype/gossip/gossip/1.2/gossip-1.2.jar
Downloaded from eclipse.maven.central.mirror: https://repo.eclipse.org/content/repositories/maven_central/org/apache/maven/reporting/maven-reporting-api/2.0.4/maven-reporting-api-2.0.4.jar (5.0 kB at 30 kB/s)
Progress (1): 4.1/18 kB
Progress (1): 7.7/18 kB
Progress (1): 12/18 kB 
Progress (1): 16/18 kB
Progress (1): 18 kB   
Progress (2): 18 kB | 4.1/27 kB
Progress (2): 18 kB | 7.7/27 kB
Progress (2): 18 kB | 12/27 kB 
Progress (2): 18 kB | 16/27 kB
Progress (2): 18 kB | 20/27 kB
Progress (2): 18 kB | 24/27 kB
Progress (2): 18 kB | 27 kB   
Progress (3): 18 kB | 27 kB | 4.1/21 kB
Progress (3): 18 kB | 27 kB | 7.7/21 kB
Progress (3): 18 kB | 27 kB | 12/21 kB 
Progress (3): 18 kB | 27 kB | 16/21 kB
Progress (3): 18 kB | 27 kB | 20/21 kB
Progress (3): 18 kB | 27 kB | 21 kB   
                                   
Downloaded from eclipse.maven.central.mirror: https://repo.eclipse.org/content/repositories/maven_central/org/apache/maven/doxia/doxia-module-fml/1.0-alpha-10/doxia-module-fml-1.0-alpha-10.jar (18 kB at 94 kB/s)
Downloaded from eclipse.maven.central.mirror: https://repo.eclipse.org/content/repositories/maven_central/org/apache/maven/doxia/doxia-module-xdoc/1.0-alpha-10/doxia-module-xdoc-1.0-alpha-10.jar (27 kB at 142 kB/s)
Downloaded from eclipse.maven.central.mirror: https://repo.eclipse.org/content/repositories/maven_central/org/apache/maven/doxia/doxia-module-xhtml/1.0-alpha-10/doxia-module-xhtml-1.0-alpha-10.jar (21 kB at 111 kB/s)
Progress (1): 4.1/77 kB
Progress (1): 7.7/77 kB
Progress (1): 12/77 kB 
Progress (1): 16/77 kB
Progress (1): 20/77 kB
Progress (1): 24/77 kB
Progress (1): 28/77 kB
Progress (1): 32/77 kB
Progress (1): 33/77 kB
Progress (1): 37/77 kB
Progress (1): 41/77 kB
Progress (1): 45/77 kB
Progress (1): 49/77 kB
Progress (1): 53/77 kB
Progress (1): 57/77 kB
Progress (1): 61/77 kB
Progress (1): 65/77 kB
Progress (1): 66/77 kB
Progress (1): 70/77 kB
Progress (1): 74/77 kB
Progress (1): 77 kB   
                   
Downloaded from eclipse.maven.central.mirror: https://repo.eclipse.org/content/repositories/maven_central/org/sonatype/gossip/gossip/1.2/gossip-1.2.jar (77 kB at 376 kB/s)
Downloading from sonatype: https://oss.sonatype.org/content/repositories/public/org/codehaus/gmaven/runtime/gmaven-runtime-1.6/1.5/gmaven-runtime-1.6-1.5.pom
Progress (1): 3.1 kB
                    
Downloaded from sonatype: https://oss.sonatype.org/content/repositories/public/org/codehaus/gmaven/runtime/gmaven-runtime-1.6/1.5/gmaven-runtime-1.6-1.5.pom (3.1 kB at 1.2 kB/s)
Downloading from sonatype: https://oss.sonatype.org/content/repositories/public/org/sonatype/gossip/gossip/1.3/gossip-1.3.pom
Downloading from cbi: https://repo.eclipse.org/content/repositories/cbi-releases/org/sonatype/gossip/gossip/1.3/gossip-1.3.pom
Downloading from cbi-snapshots: https://repo.eclipse.org/content/repositories/cbi-snapshots/org/sonatype/gossip/gossip/1.3/gossip-1.3.pom
Downloading from eclipse.maven.central.mirror: https://repo.eclipse.org/content/repositories/maven_central/org/sonatype/gossip/gossip/1.3/gossip-1.3.pom
Progress (1): 4.1/20 kB
Progress (1): 7.7/20 kB
Progress (1): 12/20 kB 
Progress (1): 16/20 kB
Progress (1): 20 kB   
                   
Downloaded from eclipse.maven.central.mirror: https://repo.eclipse.org/content/repositories/maven_central/org/sonatype/gossip/gossip/1.3/gossip-1.3.pom (20 kB at 724 kB/s)
Downloading from sonatype: https://oss.sonatype.org/content/repositories/public/org/codehaus/groovy/groovy-all/1.6.9/groovy-all-1.6.9.pom
Progress (1): 4.1/25 kB
Progress (1): 7.9/25 kB
Progress (1): 7.9/25 kB
Progress (1): 12/25 kB 
Progress (1): 16/25 kB
Progress (1): 20/25 kB
Progress (1): 24/25 kB
Progress (1): 25 kB   
                   
Downloaded from sonatype: https://oss.sonatype.org/content/repositories/public/org/codehaus/groovy/groovy-all/1.6.9/groovy-all-1.6.9.pom (25 kB at 119 kB/s)
Downloading from sonatype: https://oss.sonatype.org/content/repositories/public/org/apache/ant/ant/1.7.1/ant-1.7.1.pom
Downloading from cbi: https://repo.eclipse.org/content/repositories/cbi-releases/org/apache/ant/ant/1.7.1/ant-1.7.1.pom
Downloading from cbi-snapshots: https://repo.eclipse.org/content/repositories/cbi-snapshots/org/apache/ant/ant/1.7.1/ant-1.7.1.pom
Downloading from eclipse.maven.central.mirror: https://repo.eclipse.org/content/repositories/maven_central/org/apache/ant/ant/1.7.1/ant-1.7.1.pom
Progress (1): 4.1/9.8 kB
Progress (1): 7.7/9.8 kB
Progress (1): 9.8 kB    
                    
Downloaded from eclipse.maven.central.mirror: https://repo.eclipse.org/content/repositories/maven_central/org/apache/ant/ant/1.7.1/ant-1.7.1.pom (9.8 kB at 375 kB/s)
Downloading from sonatype: https://oss.sonatype.org/content/repositories/public/org/apache/ant/ant-parent/1.7.1/ant-parent-1.7.1.pom
Downloading from cbi: https://repo.eclipse.org/content/repositories/cbi-releases/org/apache/ant/ant-parent/1.7.1/ant-parent-1.7.1.pom
Downloading from cbi-snapshots: https://repo.eclipse.org/content/repositories/cbi-snapshots/org/apache/ant/ant-parent/1.7.1/ant-parent-1.7.1.pom
Downloading from eclipse.maven.central.mirror: https://repo.eclipse.org/content/repositories/maven_central/org/apache/ant/ant-parent/1.7.1/ant-parent-1.7.1.pom
Progress (1): 4.1/4.4 kB
Progress (1): 4.4 kB    
                    
Downloaded from eclipse.maven.central.mirror: https://repo.eclipse.org/content/repositories/maven_central/org/apache/ant/ant-parent/1.7.1/ant-parent-1.7.1.pom (4.4 kB at 162 kB/s)
Downloading from sonatype: https://oss.sonatype.org/content/repositories/public/org/apache/ant/ant-launcher/1.7.1/ant-launcher-1.7.1.pom
Downloading from cbi: https://repo.eclipse.org/content/repositories/cbi-releases/org/apache/ant/ant-launcher/1.7.1/ant-launcher-1.7.1.pom
Downloading from cbi-snapshots: https://repo.eclipse.org/content/repositories/cbi-snapshots/org/apache/ant/ant-launcher/1.7.1/ant-launcher-1.7.1.pom
Downloading from eclipse.maven.central.mirror: https://repo.eclipse.org/content/repositories/maven_central/org/apache/ant/ant-launcher/1.7.1/ant-launcher-1.7.1.pom
Progress (1): 2.4 kB
                    
Downloaded from eclipse.maven.central.mirror: https://repo.eclipse.org/content/repositories/maven_central/org/apache/ant/ant-launcher/1.7.1/ant-launcher-1.7.1.pom (2.4 kB at 85 kB/s)
Downloading from sonatype: https://oss.sonatype.org/content/repositories/public/jline/jline/0.9.94/jline-0.9.94.pom
Progress (1): 4.1/6.4 kB
Progress (1): 6.4 kB    
                    
Downloaded from sonatype: https://oss.sonatype.org/content/repositories/public/jline/jline/0.9.94/jline-0.9.94.pom (6.4 kB at 35 kB/s)
Downloading from sonatype: https://oss.sonatype.org/content/repositories/public/org/codehaus/gmaven/runtime/gmaven-runtime-1.6/1.5/gmaven-runtime-1.6-1.5.jar
Downloading from sonatype: https://oss.sonatype.org/content/repositories/public/org/codehaus/groovy/groovy-all/1.6.9/groovy-all-1.6.9.jar
Downloading from sonatype: https://oss.sonatype.org/content/repositories/public/org/apache/ant/ant/1.7.1/ant-1.7.1.jar
Downloading from sonatype: https://oss.sonatype.org/content/repositories/public/org/apache/ant/ant-launcher/1.7.1/ant-launcher-1.7.1.jar
Downloading from sonatype: https://oss.sonatype.org/content/repositories/public/jline/jline/0.9.94/jline-0.9.94.jar
Progress (1): 0/4.6 MB
Progress (1): 0/4.6 MB
Progress (1): 0/4.6 MB
Progress (1): 0/4.6 MB
Progress (1): 0/4.6 MB
Progress (1): 0/4.6 MB
Progress (1): 0/4.6 MB
Progress (1): 0/4.6 MB
Progress (1): 0/4.6 MB
Progress (1): 0/4.6 MB
Progress (1): 0/4.6 MB
Progress (1): 0/4.6 MB
Progress (1): 0/4.6 MB
Progress (1): 0.1/4.6 MB
Progress (1): 0.1/4.6 MB
                        
Progress (2): 0.1/4.6 MB | 4.1/87 kB
Progress (2): 0.1/4.6 MB | 7.8/87 kB
Progress (3): 0.1/4.6 MB | 7.8/87 kB | 3.8/43 kB
Progress (3): 0.1/4.6 MB | 12/87 kB | 3.8/43 kB 
Progress (3): 0.1/4.6 MB | 12/87 kB | 3.8/43 kB
Progress (3): 0.1/4.6 MB | 12/87 kB | 3.8/43 kB
Progress (3): 0.1/4.6 MB | 12/87 kB | 3.8/43 kB
Progress (3): 0.1/4.6 MB | 12/87 kB | 3.8/43 kB
Progress (3): 0.1/4.6 MB | 12/87 kB | 3.8/43 kB
Progress (3): 0.1/4.6 MB | 12/87 kB | 3.8/43 kB
Progress (3): 0.1/4.6 MB | 12/87 kB | 3.8/43 kB
Progress (3): 0.1/4.6 MB | 12/87 kB | 3.8/43 kB
Progress (3): 0.1/4.6 MB | 12/87 kB | 3.8/43 kB
Progress (3): 0.1/4.6 MB | 12/87 kB | 3.8/43 kB
                                               
Progress (3): 0.1/4.6 MB | 12/87 kB | 3.8/43 kB
Progress (3): 0.1/4.6 MB | 12/87 kB | 3.8/43 kB
Progress (3): 0.1/4.6 MB | 12/87 kB | 3.8/43 kB
Progress (3): 0.1/4.6 MB | 12/87 kB | 3.8/43 kB
Progress (3): 0.1/4.6 MB | 12/87 kB | 3.8/43 kB
Progress (3): 0.1/4.6 MB | 12/87 kB | 3.8/43 kB
Progress (3): 0.1/4.6 MB | 12/87 kB | 3.8/43 kB
Progress (3): 0.1/4.6 MB | 12/87 kB | 3.8/43 kB
Progress (3): 0.1/4.6 MB | 12/87 kB | 3.8/43 kB
Progress (3): 0.1/4.6 MB | 12/87 kB | 3.8/43 kB
Progress (3): 0.1/4.6 MB | 12/87 kB | 3.8/43 kB
Progress (3): 0.1/4.6 MB | 16/87 kB | 3.8/43 kB
Progress (3): 0.1/4.6 MB | 20/87 kB | 3.8/43 kB
Progress (3): 0.1/4.6 MB | 24/87 kB | 3.8/43 kB
Progress (3): 0.1/4.6 MB | 28/87 kB | 3.8/43 kB
Progress (3): 0.1/4.6 MB | 28/87 kB | 7.9/43 kB
Progress (3): 0.1/4.6 MB | 28/87 kB | 12/43 kB 
Progress (3): 0.1/4.6 MB | 28/87 kB | 16/43 kB
Progress (3): 0.1/4.6 MB | 28/87 kB | 20/43 kB
                                              
Downloading from cbi: https://repo.eclipse.org/content/repositories/cbi-releases/org/apache/ant/ant/1.7.1/ant-1.7.1.jar
Progress (3): 0.1/4.6 MB | 28/87 kB | 24/43 kB
Progress (3): 0.1/4.6 MB | 28/87 kB | 28/43 kB
Progress (3): 0.1/4.6 MB | 28/87 kB | 32/43 kB
Progress (3): 0.1/4.6 MB | 28/87 kB | 37/43 kB
Progress (3): 0.1/4.6 MB | 28/87 kB | 41/43 kB
Progress (3): 0.1/4.6 MB | 28/87 kB | 43 kB   
                                           
Downloading from cbi: https://repo.eclipse.org/content/repositories/cbi-releases/org/apache/ant/ant-launcher/1.7.1/ant-launcher-1.7.1.jar
Progress (3): 0.1/4.6 MB | 28/87 kB | 43 kB
Progress (3): 0.1/4.6 MB | 28/87 kB | 43 kB
Progress (3): 0.2/4.6 MB | 28/87 kB | 43 kB
Progress (3): 0.2/4.6 MB | 28/87 kB | 43 kB
Progress (3): 0.2/4.6 MB | 28/87 kB | 43 kB
Progress (3): 0.2/4.6 MB | 28/87 kB | 43 kB
Progress (3): 0.2/4.6 MB | 28/87 kB | 43 kB
Progress (3): 0.2/4.6 MB | 28/87 kB | 43 kB
Progress (3): 0.2/4.6 MB | 28/87 kB | 43 kB
Progress (3): 0.2/4.6 MB | 28/87 kB | 43 kB
Progress (3): 0.2/4.6 MB | 28/87 kB | 43 kB
Progress (3): 0.2/4.6 MB | 28/87 kB | 43 kB
Progress (3): 0.2/4.6 MB | 28/87 kB | 43 kB
Progress (3): 0.2/4.6 MB | 28/87 kB | 43 kB
Progress (3): 0.2/4.6 MB | 28/87 kB | 43 kB
Progress (3): 0.2/4.6 MB | 28/87 kB | 43 kB
Progress (3): 0.2/4.6 MB | 28/87 kB | 43 kB
Progress (3): 0.2/4.6 MB | 28/87 kB | 43 kB
Progress (3): 0.2/4.6 MB | 28/87 kB | 43 kB
Progress (3): 0.2/4.6 MB | 28/87 kB | 43 kB
                                           
Downloading from cbi-snapshots: https://repo.eclipse.org/content/repositories/cbi-snapshots/org/apache/ant/ant/1.7.1/ant-1.7.1.jar
Progress (3): 0.2/4.6 MB | 32/87 kB | 43 kB
Progress (3): 0.2/4.6 MB | 37/87 kB | 43 kB
Progress (3): 0.2/4.6 MB | 41/87 kB | 43 kB
Progress (3): 0.2/4.6 MB | 45/87 kB | 43 kB
Progress (3): 0.2/4.6 MB | 49/87 kB | 43 kB
Progress (3): 0.2/4.6 MB | 53/87 kB | 43 kB
Progress (3): 0.2/4.6 MB | 57/87 kB | 43 kB
Progress (3): 0.2/4.6 MB | 61/87 kB | 43 kB
                                           
Downloading from cbi-snapshots: https://repo.eclipse.org/content/repositories/cbi-snapshots/org/apache/ant/ant-launcher/1.7.1/ant-launcher-1.7.1.jar
Progress (3): 0.2/4.6 MB | 61/87 kB | 43 kB
                                           
Progress (3): 0.2/4.6 MB | 61/87 kB | 43 kB
Progress (3): 0.2/4.6 MB | 61/87 kB | 43 kB
Progress (3): 0.2/4.6 MB | 61/87 kB | 43 kB
Progress (3): 0.2/4.6 MB | 61/87 kB | 43 kB
Progress (3): 0.2/4.6 MB | 61/87 kB | 43 kB
Progress (3): 0.2/4.6 MB | 61/87 kB | 43 kB
Progress (3): 0.3/4.6 MB | 61/87 kB | 43 kB
                                           
Downloading from eclipse.maven.central.mirror: https://repo.eclipse.org/content/repositories/maven_central/org/apache/ant/ant/1.7.1/ant-1.7.1.jar
Progress (3): 0.3/4.6 MB | 61/87 kB | 43 kB
Progress (3): 0.3/4.6 MB | 61/87 kB | 43 kB
Progress (3): 0.3/4.6 MB | 61/87 kB | 43 kB
Progress (3): 0.3/4.6 MB | 61/87 kB | 43 kB
Progress (3): 0.3/4.6 MB | 61/87 kB | 43 kB
Progress (3): 0.3/4.6 MB | 61/87 kB | 43 kB
Progress (3): 0.3/4.6 MB | 61/87 kB | 43 kB
Progress (3): 0.3/4.6 MB | 61/87 kB | 43 kB
Progress (3): 0.3/4.6 MB | 61/87 kB | 43 kB
Progress (3): 0.3/4.6 MB | 61/87 kB | 43 kB
Progress (3): 0.3/4.6 MB | 61/87 kB | 43 kB
Progress (3): 0.3/4.6 MB | 61/87 kB | 43 kB
Progress (3): 0.3/4.6 MB | 61/87 kB | 43 kB
                                           
Downloaded from sonatype: https://oss.sonatype.org/content/repositories/public/org/codehaus/gmaven/runtime/gmaven-runtime-1.6/1.5/gmaven-runtime-1.6-1.5.jar (43 kB at 191 kB/s)
Progress (2): 0.3/4.6 MB | 61/87 kB
Progress (2): 0.3/4.6 MB | 61/87 kB
Progress (2): 0.3/4.6 MB | 61/87 kB
Progress (2): 0.3/4.6 MB | 61/87 kB
Progress (2): 0.3/4.6 MB | 61/87 kB
Progress (2): 0.3/4.6 MB | 61/87 kB
Progress (2): 0.3/4.6 MB | 61/87 kB
Progress (2): 0.3/4.6 MB | 61/87 kB
Progress (2): 0.3/4.6 MB | 61/87 kB
Progress (2): 0.3/4.6 MB | 61/87 kB
Progress (2): 0.4/4.6 MB | 61/87 kB
                                   
Downloading from eclipse.maven.central.mirror: https://repo.eclipse.org/content/repositories/maven_central/org/apache/ant/ant-launcher/1.7.1/ant-launcher-1.7.1.jar
Progress (2): 0.4/4.6 MB | 65/87 kB
Progress (2): 0.4/4.6 MB | 69/87 kB
Progress (2): 0.4/4.6 MB | 73/87 kB
Progress (2): 0.4/4.6 MB | 77/87 kB
Progress (2): 0.4/4.6 MB | 82/87 kB
Progress (2): 0.4/4.6 MB | 86/87 kB
Progress (2): 0.4/4.6 MB | 87 kB   
Progress (3): 0.4/4.6 MB | 87 kB | 0/1.3 MB
Progress (3): 0.4/4.6 MB | 87 kB | 0/1.3 MB
Progress (3): 0.4/4.6 MB | 87 kB | 0/1.3 MB
Progress (3): 0.4/4.6 MB | 87 kB | 0/1.3 MB
Progress (3): 0.4/4.6 MB | 87 kB | 0/1.3 MB
Progress (3): 0.4/4.6 MB | 87 kB | 0/1.3 MB
Progress (3): 0.4/4.6 MB | 87 kB | 0/1.3 MB
Progress (3): 0.4/4.6 MB | 87 kB | 0/1.3 MB
Progress (3): 0.4/4.6 MB | 87 kB | 0/1.3 MB
Progress (3): 0.4/4.6 MB | 87 kB | 0/1.3 MB
Progress (3): 0.4/4.6 MB | 87 kB | 0/1.3 MB
Progress (3): 0.4/4.6 MB | 87 kB | 0/1.3 MB
Progress (3): 0.4/4.6 MB | 87 kB | 0.1/1.3 MB
Progress (3): 0.4/4.6 MB | 87 kB | 0.1/1.3 MB
Progress (3): 0.4/4.6 MB | 87 kB | 0.1/1.3 MB
Progress (3): 0.4/4.6 MB | 87 kB | 0.1/1.3 MB
Progress (3): 0.4/4.6 MB | 87 kB | 0.1/1.3 MB
Progress (3): 0.4/4.6 MB | 87 kB | 0.1/1.3 MB
Progress (3): 0.4/4.6 MB | 87 kB | 0.1/1.3 MB
Progress (3): 0.4/4.6 MB | 87 kB | 0.1/1.3 MB
Progress (3): 0.4/4.6 MB | 87 kB | 0.1/1.3 MB
Progress (3): 0.4/4.6 MB | 87 kB | 0.1/1.3 MB
Progress (3): 0.4/4.6 MB | 87 kB | 0.1/1.3 MB
Progress (3): 0.4/4.6 MB | 87 kB | 0.1/1.3 MB
Progress (3): 0.4/4.6 MB | 87 kB | 0.1/1.3 MB
Progress (3): 0.4/4.6 MB | 87 kB | 0.1/1.3 MB
Progress (3): 0.4/4.6 MB | 87 kB | 0.1/1.3 MB
Progress (3): 0.4/4.6 MB | 87 kB | 0.1/1.3 MB
Progress (3): 0.4/4.6 MB | 87 kB | 0.1/1.3 MB
Progress (3): 0.4/4.6 MB | 87 kB | 0.1/1.3 MB
Progress (3): 0.4/4.6 MB | 87 kB | 0.1/1.3 MB
Progress (3): 0.4/4.6 MB | 87 kB | 0.1/1.3 MB
Progress (3): 0.4/4.6 MB | 87 kB | 0.1/1.3 MB
Progress (3): 0.4/4.6 MB | 87 kB | 0.1/1.3 MB
Progress (3): 0.4/4.6 MB | 87 kB | 0.1/1.3 MB
Progress (3): 0.4/4.6 MB | 87 kB | 0.1/1.3 MB
Progress (3): 0.4/4.6 MB | 87 kB | 0.1/1.3 MB
Progress (3): 0.4/4.6 MB | 87 kB | 0.2/1.3 MB
Progress (3): 0.4/4.6 MB | 87 kB | 0.2/1.3 MB
Progress (3): 0.4/4.6 MB | 87 kB | 0.2/1.3 MB
Progress (3): 0.4/4.6 MB | 87 kB | 0.2/1.3 MB
Progress (3): 0.4/4.6 MB | 87 kB | 0.2/1.3 MB
Progress (3): 0.4/4.6 MB | 87 kB | 0.2/1.3 MB
Progress (3): 0.4/4.6 MB | 87 kB | 0.2/1.3 MB
Progress (3): 0.4/4.6 MB | 87 kB | 0.2/1.3 MB
Progress (3): 0.4/4.6 MB | 87 kB | 0.2/1.3 MB
Progress (3): 0.4/4.6 MB | 87 kB | 0.2/1.3 MB
Progress (3): 0.4/4.6 MB | 87 kB | 0.2/1.3 MB
Progress (3): 0.4/4.6 MB | 87 kB | 0.2/1.3 MB
Progress (3): 0.4/4.6 MB | 87 kB | 0.2/1.3 MB
Progress (3): 0.4/4.6 MB | 87 kB | 0.2/1.3 MB
Progress (3): 0.4/4.6 MB | 87 kB | 0.2/1.3 MB
Progress (3): 0.4/4.6 MB | 87 kB | 0.2/1.3 MB
Progress (3): 0.4/4.6 MB | 87 kB | 0.2/1.3 MB
Progress (3): 0.4/4.6 MB | 87 kB | 0.2/1.3 MB
Progress (3): 0.4/4.6 MB | 87 kB | 0.2/1.3 MB
Progress (3): 0.4/4.6 MB | 87 kB | 0.2/1.3 MB
Progress (3): 0.4/4.6 MB | 87 kB | 0.2/1.3 MB
Progress (3): 0.4/4.6 MB | 87 kB | 0.2/1.3 MB
Progress (3): 0.4/4.6 MB | 87 kB | 0.2/1.3 MB
Progress (3): 0.4/4.6 MB | 87 kB | 0.2/1.3 MB
Progress (3): 0.4/4.6 MB | 87 kB | 0.2/1.3 MB
Progress (3): 0.4/4.6 MB | 87 kB | 0.2/1.3 MB
Progress (3): 0.4/4.6 MB | 87 kB | 0.2/1.3 MB
Progress (3): 0.4/4.6 MB | 87 kB | 0.2/1.3 MB
Progress (3): 0.4/4.6 MB | 87 kB | 0.2/1.3 MB
Progress (3): 0.4/4.6 MB | 87 kB | 0.2/1.3 MB
Progress (3): 0.4/4.6 MB | 87 kB | 0.2/1.3 MB
Progress (3): 0.4/4.6 MB | 87 kB | 0.2/1.3 MB
Progress (3): 0.4/4.6 MB | 87 kB | 0.2/1.3 MB
Progress (3): 0.4/4.6 MB | 87 kB | 0.2/1.3 MB
Progress (3): 0.4/4.6 MB | 87 kB | 0.2/1.3 MB
Progress (3): 0.4/4.6 MB | 87 kB | 0.2/1.3 MB
Progress (3): 0.4/4.6 MB | 87 kB | 0.2/1.3 MB
Progress (3): 0.4/4.6 MB | 87 kB | 0.2/1.3 MB
Progress (3): 0.4/4.6 MB | 87 kB | 0.2/1.3 MB
Progress (3): 0.4/4.6 MB | 87 kB | 0.2/1.3 MB
Progress (3): 0.4/4.6 MB | 87 kB | 0.2/1.3 MB
Progress (3): 0.4/4.6 MB | 87 kB | 0.2/1.3 MB
Progress (3): 0.4/4.6 MB | 87 kB | 0.3/1.3 MB
Progress (3): 0.4/4.6 MB | 87 kB | 0.3/1.3 MB
Progress (3): 0.4/4.6 MB | 87 kB | 0.3/1.3 MB
Progress (3): 0.4/4.6 MB | 87 kB | 0.3/1.3 MB
Progress (3): 0.4/4.6 MB | 87 kB | 0.3/1.3 MB
Progress (3): 0.4/4.6 MB | 87 kB | 0.3/1.3 MB
Progress (3): 0.4/4.6 MB | 87 kB | 0.3/1.3 MB
Progress (3): 0.4/4.6 MB | 87 kB | 0.3/1.3 MB
Progress (3): 0.4/4.6 MB | 87 kB | 0.3/1.3 MB
Progress (3): 0.4/4.6 MB | 87 kB | 0.3/1.3 MB
Progress (3): 0.4/4.6 MB | 87 kB | 0.3/1.3 MB
Progress (3): 0.4/4.6 MB | 87 kB | 0.3/1.3 MB
Progress (3): 0.4/4.6 MB | 87 kB | 0.3/1.3 MB
Progress (3): 0.4/4.6 MB | 87 kB | 0.3/1.3 MB
Progress (3): 0.4/4.6 MB | 87 kB | 0.3/1.3 MB
Progress (3): 0.4/4.6 MB | 87 kB | 0.3/1.3 MB
Progress (3): 0.4/4.6 MB | 87 kB | 0.3/1.3 MB
Progress (3): 0.4/4.6 MB | 87 kB | 0.3/1.3 MB
Progress (3): 0.4/4.6 MB | 87 kB | 0.3/1.3 MB
Progress (3): 0.4/4.6 MB | 87 kB | 0.3/1.3 MB
Progress (3): 0.4/4.6 MB | 87 kB | 0.3/1.3 MB
Progress (3): 0.4/4.6 MB | 87 kB | 0.3/1.3 MB
Progress (3): 0.4/4.6 MB | 87 kB | 0.3/1.3 MB
Progress (3): 0.4/4.6 MB | 87 kB | 0.3/1.3 MB
Progress (3): 0.4/4.6 MB | 87 kB | 0.3/1.3 MB
Progress (3): 0.4/4.6 MB | 87 kB | 0.3/1.3 MB
Progress (3): 0.4/4.6 MB | 87 kB | 0.3/1.3 MB
Progress (3): 0.4/4.6 MB | 87 kB | 0.3/1.3 MB
Progress (3): 0.4/4.6 MB | 87 kB | 0.3/1.3 MB
Progress (3): 0.4/4.6 MB | 87 kB | 0.3/1.3 MB
Progress (3): 0.4/4.6 MB | 87 kB | 0.3/1.3 MB
Progress (3): 0.4/4.6 MB | 87 kB | 0.4/1.3 MB
Progress (3): 0.4/4.6 MB | 87 kB | 0.4/1.3 MB
Progress (3): 0.4/4.6 MB | 87 kB | 0.4/1.3 MB
Progress (3): 0.4/4.6 MB | 87 kB | 0.4/1.3 MB
Progress (3): 0.4/4.6 MB | 87 kB | 0.4/1.3 MB
Progress (3): 0.4/4.6 MB | 87 kB | 0.4/1.3 MB
Progress (3): 0.5/4.6 MB | 87 kB | 0.4/1.3 MB
Progress (3): 0.5/4.6 MB | 87 kB | 0.4/1.3 MB
Progress (3): 0.5/4.6 MB | 87 kB | 0.4/1.3 MB
Progress (3): 0.5/4.6 MB | 87 kB | 0.4/1.3 MB
Progress (3): 0.5/4.6 MB | 87 kB | 0.4/1.3 MB
Progress (3): 0.5/4.6 MB | 87 kB | 0.4/1.3 MB
Progress (3): 0.5/4.6 MB | 87 kB | 0.4/1.3 MB
Progress (3): 0.5/4.6 MB | 87 kB | 0.4/1.3 MB
Progress (3): 0.5/4.6 MB | 87 kB | 0.4/1.3 MB
Progress (3): 0.5/4.6 MB | 87 kB | 0.4/1.3 MB
Progress (3): 0.5/4.6 MB | 87 kB | 0.4/1.3 MB
Progress (3): 0.5/4.6 MB | 87 kB | 0.4/1.3 MB
Progress (3): 0.5/4.6 MB | 87 kB | 0.4/1.3 MB
Progress (3): 0.5/4.6 MB | 87 kB | 0.4/1.3 MB
Progress (3): 0.5/4.6 MB | 87 kB | 0.4/1.3 MB
Progress (3): 0.5/4.6 MB | 87 kB | 0.4/1.3 MB
Progress (3): 0.5/4.6 MB | 87 kB | 0.4/1.3 MB
Progress (3): 0.5/4.6 MB | 87 kB | 0.4/1.3 MB
Progress (3): 0.5/4.6 MB | 87 kB | 0.4/1.3 MB
Progress (3): 0.5/4.6 MB | 87 kB | 0.4/1.3 MB
Progress (3): 0.5/4.6 MB | 87 kB | 0.4/1.3 MB
Progress (3): 0.5/4.6 MB | 87 kB | 0.4/1.3 MB
Progress (3): 0.5/4.6 MB | 87 kB | 0.4/1.3 MB
Progress (3): 0.5/4.6 MB | 87 kB | 0.4/1.3 MB
Progress (3): 0.5/4.6 MB | 87 kB | 0.4/1.3 MB
Progress (3): 0.5/4.6 MB | 87 kB | 0.4/1.3 MB
Progress (3): 0.5/4.6 MB | 87 kB | 0.4/1.3 MB
Progress (3): 0.5/4.6 MB | 87 kB | 0.5/1.3 MB
Progress (3): 0.5/4.6 MB | 87 kB | 0.5/1.3 MB
Progress (3): 0.5/4.6 MB | 87 kB | 0.5/1.3 MB
Progress (3): 0.5/4.6 MB | 87 kB | 0.5/1.3 MB
Progress (3): 0.5/4.6 MB | 87 kB | 0.5/1.3 MB
Progress (3): 0.5/4.6 MB | 87 kB | 0.5/1.3 MB
Progress (3): 0.5/4.6 MB | 87 kB | 0.5/1.3 MB
Progress (3): 0.5/4.6 MB | 87 kB | 0.5/1.3 MB
Progress (3): 0.5/4.6 MB | 87 kB | 0.5/1.3 MB
Progress (3): 0.5/4.6 MB | 87 kB | 0.5/1.3 MB
Progress (3): 0.5/4.6 MB | 87 kB | 0.5/1.3 MB
Progress (3): 0.5/4.6 MB | 87 kB | 0.5/1.3 MB
Progress (3): 0.5/4.6 MB | 87 kB | 0.5/1.3 MB
Progress (3): 0.5/4.6 MB | 87 kB | 0.5/1.3 MB
Progress (3): 0.5/4.6 MB | 87 kB | 0.5/1.3 MB
Progress (3): 0.5/4.6 MB | 87 kB | 0.5/1.3 MB
Progress (3): 0.5/4.6 MB | 87 kB | 0.5/1.3 MB
Progress (3): 0.5/4.6 MB | 87 kB | 0.5/1.3 MB
Progress (3): 0.5/4.6 MB | 87 kB | 0.5/1.3 MB
Progress (3): 0.5/4.6 MB | 87 kB | 0.5/1.3 MB
Progress (4): 0.5/4.6 MB | 87 kB | 0.5/1.3 MB | 4.1/12 kB
Progress (4): 0.5/4.6 MB | 87 kB | 0.5/1.3 MB | 4.1/12 kB
Progress (4): 0.5/4.6 MB | 87 kB | 0.5/1.3 MB | 7.7/12 kB
Progress (4): 0.5/4.6 MB | 87 kB | 0.5/1.3 MB | 7.7/12 kB
Progress (4): 0.5/4.6 MB | 87 kB | 0.5/1.3 MB | 12/12 kB 
Progress (4): 0.5/4.6 MB | 87 kB | 0.5/1.3 MB | 12 kB   
Progress (4): 0.5/4.6 MB | 87 kB | 0.5/1.3 MB | 12 kB
Progress (4): 0.5/4.6 MB | 87 kB | 0.5/1.3 MB | 12 kB
Progress (4): 0.5/4.6 MB | 87 kB | 0.5/1.3 MB | 12 kB
Progress (4): 0.5/4.6 MB | 87 kB | 0.6/1.3 MB | 12 kB
Progress (4): 0.5/4.6 MB | 87 kB | 0.6/1.3 MB | 12 kB
Progress (4): 0.5/4.6 MB | 87 kB | 0.6/1.3 MB | 12 kB
Progress (4): 0.5/4.6 MB | 87 kB | 0.6/1.3 MB | 12 kB
Progress (4): 0.5/4.6 MB | 87 kB | 0.6/1.3 MB | 12 kB
Progress (4): 0.5/4.6 MB | 87 kB | 0.6/1.3 MB | 12 kB
Progress (4): 0.5/4.6 MB | 87 kB | 0.6/1.3 MB | 12 kB
Progress (4): 0.5/4.6 MB | 87 kB | 0.6/1.3 MB | 12 kB
Progress (4): 0.5/4.6 MB | 87 kB | 0.6/1.3 MB | 12 kB
Progress (4): 0.5/4.6 MB | 87 kB | 0.6/1.3 MB | 12 kB
Progress (4): 0.5/4.6 MB | 87 kB | 0.6/1.3 MB | 12 kB
Progress (4): 0.5/4.6 MB | 87 kB | 0.6/1.3 MB | 12 kB
Progress (4): 0.5/4.6 MB | 87 kB | 0.6/1.3 MB | 12 kB
Progress (4): 0.5/4.6 MB | 87 kB | 0.6/1.3 MB | 12 kB
Progress (4): 0.5/4.6 MB | 87 kB | 0.6/1.3 MB | 12 kB
Progress (4): 0.5/4.6 MB | 87 kB | 0.6/1.3 MB | 12 kB
Progress (4): 0.5/4.6 MB | 87 kB | 0.6/1.3 MB | 12 kB
Progress (4): 0.5/4.6 MB | 87 kB | 0.6/1.3 MB | 12 kB
Progress (4): 0.5/4.6 MB | 87 kB | 0.6/1.3 MB | 12 kB
Progress (4): 0.5/4.6 MB | 87 kB | 0.6/1.3 MB | 12 kB
Progress (4): 0.5/4.6 MB | 87 kB | 0.6/1.3 MB | 12 kB
Progress (4): 0.5/4.6 MB | 87 kB | 0.6/1.3 MB | 12 kB
Progress (4): 0.5/4.6 MB | 87 kB | 0.6/1.3 MB | 12 kB
Progress (4): 0.5/4.6 MB | 87 kB | 0.6/1.3 MB | 12 kB
Progress (4): 0.5/4.6 MB | 87 kB | 0.6/1.3 MB | 12 kB
Progress (4): 0.5/4.6 MB | 87 kB | 0.7/1.3 MB | 12 kB
Progress (4): 0.5/4.6 MB | 87 kB | 0.7/1.3 MB | 12 kB
Progress (4): 0.5/4.6 MB | 87 kB | 0.7/1.3 MB | 12 kB
Progress (4): 0.5/4.6 MB | 87 kB | 0.7/1.3 MB | 12 kB
Progress (4): 0.5/4.6 MB | 87 kB | 0.7/1.3 MB | 12 kB
Progress (4): 0.5/4.6 MB | 87 kB | 0.7/1.3 MB | 12 kB
Progress (4): 0.5/4.6 MB | 87 kB | 0.7/1.3 MB | 12 kB
Progress (4): 0.5/4.6 MB | 87 kB | 0.7/1.3 MB | 12 kB
Progress (4): 0.5/4.6 MB | 87 kB | 0.7/1.3 MB | 12 kB
Progress (4): 0.5/4.6 MB | 87 kB | 0.7/1.3 MB | 12 kB
Progress (4): 0.5/4.6 MB | 87 kB | 0.7/1.3 MB | 12 kB
Progress (4): 0.5/4.6 MB | 87 kB | 0.7/1.3 MB | 12 kB
Progress (4): 0.5/4.6 MB | 87 kB | 0.7/1.3 MB | 12 kB
Progress (4): 0.5/4.6 MB | 87 kB | 0.7/1.3 MB | 12 kB
Progress (4): 0.5/4.6 MB | 87 kB | 0.7/1.3 MB | 12 kB
Progress (4): 0.5/4.6 MB | 87 kB | 0.7/1.3 MB | 12 kB
Progress (4): 0.5/4.6 MB | 87 kB | 0.7/1.3 MB | 12 kB
Progress (4): 0.5/4.6 MB | 87 kB | 0.7/1.3 MB | 12 kB
Progress (4): 0.5/4.6 MB | 87 kB | 0.7/1.3 MB | 12 kB
Progress (4): 0.5/4.6 MB | 87 kB | 0.7/1.3 MB | 12 kB
Progress (4): 0.5/4.6 MB | 87 kB | 0.7/1.3 MB | 12 kB
Progress (4): 0.5/4.6 MB | 87 kB | 0.7/1.3 MB | 12 kB
Progress (4): 0.5/4.6 MB | 87 kB | 0.7/1.3 MB | 12 kB
Progress (4): 0.5/4.6 MB | 87 kB | 0.7/1.3 MB | 12 kB
Progress (4): 0.5/4.6 MB | 87 kB | 0.7/1.3 MB | 12 kB
Progress (4): 0.5/4.6 MB | 87 kB | 0.8/1.3 MB | 12 kB
Progress (4): 0.5/4.6 MB | 87 kB | 0.8/1.3 MB | 12 kB
Progress (4): 0.5/4.6 MB | 87 kB | 0.8/1.3 MB | 12 kB
Progress (4): 0.5/4.6 MB | 87 kB | 0.8/1.3 MB | 12 kB
Progress (4): 0.5/4.6 MB | 87 kB | 0.8/1.3 MB | 12 kB
Progress (4): 0.5/4.6 MB | 87 kB | 0.8/1.3 MB | 12 kB
Progress (4): 0.5/4.6 MB | 87 kB | 0.8/1.3 MB | 12 kB
Progress (4): 0.5/4.6 MB | 87 kB | 0.8/1.3 MB | 12 kB
Progress (4): 0.5/4.6 MB | 87 kB | 0.8/1.3 MB | 12 kB
Progress (4): 0.5/4.6 MB | 87 kB | 0.8/1.3 MB | 12 kB
Progress (4): 0.5/4.6 MB | 87 kB | 0.8/1.3 MB | 12 kB
Progress (4): 0.5/4.6 MB | 87 kB | 0.8/1.3 MB | 12 kB
Progress (4): 0.5/4.6 MB | 87 kB | 0.8/1.3 MB | 12 kB
Progress (4): 0.5/4.6 MB | 87 kB | 0.8/1.3 MB | 12 kB
Progress (4): 0.5/4.6 MB | 87 kB | 0.8/1.3 MB | 12 kB
Progress (4): 0.5/4.6 MB | 87 kB | 0.8/1.3 MB | 12 kB
Progress (4): 0.5/4.6 MB | 87 kB | 0.8/1.3 MB | 12 kB
Progress (4): 0.5/4.6 MB | 87 kB | 0.8/1.3 MB | 12 kB
Progress (4): 0.5/4.6 MB | 87 kB | 0.8/1.3 MB | 12 kB
Progress (4): 0.5/4.6 MB | 87 kB | 0.8/1.3 MB | 12 kB
Progress (4): 0.5/4.6 MB | 87 kB | 0.8/1.3 MB | 12 kB
Progress (4): 0.5/4.6 MB | 87 kB | 0.8/1.3 MB | 12 kB
Progress (4): 0.5/4.6 MB | 87 kB | 0.8/1.3 MB | 12 kB
Progress (4): 0.5/4.6 MB | 87 kB | 0.8/1.3 MB | 12 kB
Progress (4): 0.5/4.6 MB | 87 kB | 0.8/1.3 MB | 12 kB
Progress (4): 0.5/4.6 MB | 87 kB | 0.9/1.3 MB | 12 kB
Progress (4): 0.5/4.6 MB | 87 kB | 0.9/1.3 MB | 12 kB
Progress (4): 0.5/4.6 MB | 87 kB | 0.9/1.3 MB | 12 kB
Progress (4): 0.5/4.6 MB | 87 kB | 0.9/1.3 MB | 12 kB
Progress (4): 0.5/4.6 MB | 87 kB | 0.9/1.3 MB | 12 kB
Progress (4): 0.5/4.6 MB | 87 kB | 0.9/1.3 MB | 12 kB
Progress (4): 0.5/4.6 MB | 87 kB | 0.9/1.3 MB | 12 kB
Progress (4): 0.5/4.6 MB | 87 kB | 0.9/1.3 MB | 12 kB
Progress (4): 0.5/4.6 MB | 87 kB | 0.9/1.3 MB | 12 kB
Progress (4): 0.5/4.6 MB | 87 kB | 0.9/1.3 MB | 12 kB
Progress (4): 0.5/4.6 MB | 87 kB | 0.9/1.3 MB | 12 kB
Progress (4): 0.5/4.6 MB | 87 kB | 0.9/1.3 MB | 12 kB
Progress (4): 0.5/4.6 MB | 87 kB | 0.9/1.3 MB | 12 kB
Progress (4): 0.5/4.6 MB | 87 kB | 0.9/1.3 MB | 12 kB
Progress (4): 0.5/4.6 MB | 87 kB | 0.9/1.3 MB | 12 kB
Progress (4): 0.5/4.6 MB | 87 kB | 0.9/1.3 MB | 12 kB
Progress (4): 0.5/4.6 MB | 87 kB | 0.9/1.3 MB | 12 kB
Progress (4): 0.5/4.6 MB | 87 kB | 0.9/1.3 MB | 12 kB
Progress (4): 0.5/4.6 MB | 87 kB | 0.9/1.3 MB | 12 kB
Progress (4): 0.5/4.6 MB | 87 kB | 0.9/1.3 MB | 12 kB
Progress (4): 0.5/4.6 MB | 87 kB | 0.9/1.3 MB | 12 kB
Progress (4): 0.5/4.6 MB | 87 kB | 0.9/1.3 MB | 12 kB
Progress (4): 0.5/4.6 MB | 87 kB | 0.9/1.3 MB | 12 kB
Progress (4): 0.5/4.6 MB | 87 kB | 0.9/1.3 MB | 12 kB
Progress (4): 0.5/4.6 MB | 87 kB | 0.9/1.3 MB | 12 kB
Progress (4): 0.5/4.6 MB | 87 kB | 1.0/1.3 MB | 12 kB
Progress (4): 0.5/4.6 MB | 87 kB | 1.0/1.3 MB | 12 kB
Progress (4): 0.5/4.6 MB | 87 kB | 1.0/1.3 MB | 12 kB
Progress (4): 0.5/4.6 MB | 87 kB | 1.0/1.3 MB | 12 kB
Progress (4): 0.5/4.6 MB | 87 kB | 1.0/1.3 MB | 12 kB
Progress (4): 0.5/4.6 MB | 87 kB | 1.0/1.3 MB | 12 kB
Progress (4): 0.5/4.6 MB | 87 kB | 1.0/1.3 MB | 12 kB
Progress (4): 0.5/4.6 MB | 87 kB | 1.0/1.3 MB | 12 kB
Progress (4): 0.5/4.6 MB | 87 kB | 1.0/1.3 MB | 12 kB
Progress (4): 0.5/4.6 MB | 87 kB | 1.0/1.3 MB | 12 kB
Progress (4): 0.5/4.6 MB | 87 kB | 1.0/1.3 MB | 12 kB
Progress (4): 0.5/4.6 MB | 87 kB | 1.0/1.3 MB | 12 kB
Progress (4): 0.5/4.6 MB | 87 kB | 1.0/1.3 MB | 12 kB
Progress (4): 0.5/4.6 MB | 87 kB | 1.0/1.3 MB | 12 kB
Progress (4): 0.5/4.6 MB | 87 kB | 1.0/1.3 MB | 12 kB
Progress (4): 0.5/4.6 MB | 87 kB | 1.0/1.3 MB | 12 kB
Progress (4): 0.5/4.6 MB | 87 kB | 1.0/1.3 MB | 12 kB
Progress (4): 0.5/4.6 MB | 87 kB | 1.0/1.3 MB | 12 kB
Progress (4): 0.5/4.6 MB | 87 kB | 1.0/1.3 MB | 12 kB
Progress (4): 0.5/4.6 MB | 87 kB | 1.0/1.3 MB | 12 kB
Progress (4): 0.5/4.6 MB | 87 kB | 1.0/1.3 MB | 12 kB
Progress (4): 0.5/4.6 MB | 87 kB | 1.0/1.3 MB | 12 kB
Progress (4): 0.5/4.6 MB | 87 kB | 1.0/1.3 MB | 12 kB
Progress (4): 0.5/4.6 MB | 87 kB | 1.0/1.3 MB | 12 kB
Progress (4): 0.5/4.6 MB | 87 kB | 1.0/1.3 MB | 12 kB
Progress (4): 0.5/4.6 MB | 87 kB | 1.1/1.3 MB | 12 kB
Progress (4): 0.5/4.6 MB | 87 kB | 1.1/1.3 MB | 12 kB
Progress (4): 0.5/4.6 MB | 87 kB | 1.1/1.3 MB | 12 kB
Progress (4): 0.5/4.6 MB | 87 kB | 1.1/1.3 MB | 12 kB
Progress (4): 0.5/4.6 MB | 87 kB | 1.1/1.3 MB | 12 kB
Progress (4): 0.5/4.6 MB | 87 kB | 1.1/1.3 MB | 12 kB
Progress (4): 0.5/4.6 MB | 87 kB | 1.1/1.3 MB | 12 kB
Progress (4): 0.5/4.6 MB | 87 kB | 1.1/1.3 MB | 12 kB
Progress (4): 0.5/4.6 MB | 87 kB | 1.1/1.3 MB | 12 kB
Progress (4): 0.5/4.6 MB | 87 kB | 1.1/1.3 MB | 12 kB
Progress (4): 0.5/4.6 MB | 87 kB | 1.1/1.3 MB | 12 kB
Progress (4): 0.5/4.6 MB | 87 kB | 1.1/1.3 MB | 12 kB
Progress (4): 0.5/4.6 MB | 87 kB | 1.1/1.3 MB | 12 kB
Progress (4): 0.5/4.6 MB | 87 kB | 1.1/1.3 MB | 12 kB
Progress (4): 0.5/4.6 MB | 87 kB | 1.1/1.3 MB | 12 kB
Progress (4): 0.5/4.6 MB | 87 kB | 1.1/1.3 MB | 12 kB
Progress (4): 0.5/4.6 MB | 87 kB | 1.1/1.3 MB | 12 kB
Progress (4): 0.5/4.6 MB | 87 kB | 1.1/1.3 MB | 12 kB
Progress (4): 0.5/4.6 MB | 87 kB | 1.1/1.3 MB | 12 kB
Progress (4): 0.5/4.6 MB | 87 kB | 1.1/1.3 MB | 12 kB
Progress (4): 0.5/4.6 MB | 87 kB | 1.1/1.3 MB | 12 kB
Progress (4): 0.5/4.6 MB | 87 kB | 1.1/1.3 MB | 12 kB
Progress (4): 0.5/4.6 MB | 87 kB | 1.1/1.3 MB | 12 kB
Progress (4): 0.5/4.6 MB | 87 kB | 1.1/1.3 MB | 12 kB
Progress (4): 0.5/4.6 MB | 87 kB | 1.1/1.3 MB | 12 kB
Progress (4): 0.5/4.6 MB | 87 kB | 1.1/1.3 MB | 12 kB
Progress (4): 0.5/4.6 MB | 87 kB | 1.1/1.3 MB | 12 kB
Progress (4): 0.5/4.6 MB | 87 kB | 1.1/1.3 MB | 12 kB
Progress (4): 0.5/4.6 MB | 87 kB | 1.1/1.3 MB | 12 kB
Progress (4): 0.5/4.6 MB | 87 kB | 1.1/1.3 MB | 12 kB
Progress (4): 0.5/4.6 MB | 87 kB | 1.1/1.3 MB | 12 kB
Progress (4): 0.5/4.6 MB | 87 kB | 1.1/1.3 MB | 12 kB
Progress (4): 0.5/4.6 MB | 87 kB | 1.1/1.3 MB | 12 kB
Progress (4): 0.5/4.6 MB | 87 kB | 1.1/1.3 MB | 12 kB
Progress (4): 0.5/4.6 MB | 87 kB | 1.1/1.3 MB | 12 kB
Progress (4): 0.5/4.6 MB | 87 kB | 1.2/1.3 MB | 12 kB
Progress (4): 0.5/4.6 MB | 87 kB | 1.2/1.3 MB | 12 kB
Progress (4): 0.5/4.6 MB | 87 kB | 1.2/1.3 MB | 12 kB
Progress (4): 0.5/4.6 MB | 87 kB | 1.2/1.3 MB | 12 kB
Progress (4): 0.5/4.6 MB | 87 kB | 1.2/1.3 MB | 12 kB
Progress (4): 0.5/4.6 MB | 87 kB | 1.2/1.3 MB | 12 kB
Progress (4): 0.5/4.6 MB | 87 kB | 1.2/1.3 MB | 12 kB
Progress (4): 0.5/4.6 MB | 87 kB | 1.2/1.3 MB | 12 kB
Progress (4): 0.5/4.6 MB | 87 kB | 1.2/1.3 MB | 12 kB
Progress (4): 0.5/4.6 MB | 87 kB | 1.2/1.3 MB | 12 kB
Progress (4): 0.5/4.6 MB | 87 kB | 1.2/1.3 MB | 12 kB
Progress (4): 0.5/4.6 MB | 87 kB | 1.2/1.3 MB | 12 kB
Progress (4): 0.5/4.6 MB | 87 kB | 1.2/1.3 MB | 12 kB
                                                     
Downloaded from sonatype: https://oss.sonatype.org/content/repositories/public/jline/jline/0.9.94/jline-0.9.94.jar (87 kB at 310 kB/s)
Progress (3): 0.5/4.6 MB | 1.2/1.3 MB | 12 kB
Progress (3): 0.5/4.6 MB | 1.2/1.3 MB | 12 kB
Progress (3): 0.5/4.6 MB | 1.2/1.3 MB | 12 kB
Progress (3): 0.5/4.6 MB | 1.2/1.3 MB | 12 kB
Progress (3): 0.5/4.6 MB | 1.2/1.3 MB | 12 kB
Progress (3): 0.5/4.6 MB | 1.2/1.3 MB | 12 kB
Progress (3): 0.5/4.6 MB | 1.2/1.3 MB | 12 kB
Progress (3): 0.5/4.6 MB | 1.2/1.3 MB | 12 kB
Progress (3): 0.6/4.6 MB | 1.2/1.3 MB | 12 kB
Progress (3): 0.6/4.6 MB | 1.2/1.3 MB | 12 kB
Progress (3): 0.6/4.6 MB | 1.2/1.3 MB | 12 kB
Progress (3): 0.6/4.6 MB | 1.2/1.3 MB | 12 kB
Progress (3): 0.6/4.6 MB | 1.2/1.3 MB | 12 kB
Progress (3): 0.6/4.6 MB | 1.2/1.3 MB | 12 kB
Progress (3): 0.6/4.6 MB | 1.2/1.3 MB | 12 kB
Progress (3): 0.6/4.6 MB | 1.2/1.3 MB | 12 kB
Progress (3): 0.6/4.6 MB | 1.2/1.3 MB | 12 kB
Progress (3): 0.6/4.6 MB | 1.2/1.3 MB | 12 kB
Progress (3): 0.6/4.6 MB | 1.2/1.3 MB | 12 kB
Progress (3): 0.6/4.6 MB | 1.2/1.3 MB | 12 kB
Progress (3): 0.6/4.6 MB | 1.2/1.3 MB | 12 kB
Progress (3): 0.6/4.6 MB | 1.2/1.3 MB | 12 kB
Progress (3): 0.6/4.6 MB | 1.2/1.3 MB | 12 kB
Progress (3): 0.6/4.6 MB | 1.2/1.3 MB | 12 kB
Progress (3): 0.6/4.6 MB | 1.2/1.3 MB | 12 kB
Progress (3): 0.6/4.6 MB | 1.2/1.3 MB | 12 kB
Progress (3): 0.6/4.6 MB | 1.2/1.3 MB | 12 kB
Progress (3): 0.6/4.6 MB | 1.2/1.3 MB | 12 kB
Progress (3): 0.6/4.6 MB | 1.2/1.3 MB | 12 kB
Progress (3): 0.6/4.6 MB | 1.2/1.3 MB | 12 kB
Progress (3): 0.6/4.6 MB | 1.2/1.3 MB | 12 kB
Progress (3): 0.6/4.6 MB | 1.2/1.3 MB | 12 kB
Progress (3): 0.6/4.6 MB | 1.2/1.3 MB | 12 kB
Progress (3): 0.6/4.6 MB | 1.2/1.3 MB | 12 kB
Progress (3): 0.6/4.6 MB | 1.2/1.3 MB | 12 kB
Progress (3): 0.6/4.6 MB | 1.2/1.3 MB | 12 kB
Progress (3): 0.6/4.6 MB | 1.2/1.3 MB | 12 kB
Progress (3): 0.6/4.6 MB | 1.2/1.3 MB | 12 kB
Progress (3): 0.6/4.6 MB | 1.2/1.3 MB | 12 kB
Progress (3): 0.6/4.6 MB | 1.2/1.3 MB | 12 kB
Progress (3): 0.6/4.6 MB | 1.3/1.3 MB | 12 kB
Progress (3): 0.6/4.6 MB | 1.3/1.3 MB | 12 kB
Progress (3): 0.6/4.6 MB | 1.3/1.3 MB | 12 kB
Progress (3): 0.6/4.6 MB | 1.3/1.3 MB | 12 kB
Progress (3): 0.6/4.6 MB | 1.3/1.3 MB | 12 kB
Progress (3): 0.6/4.6 MB | 1.3/1.3 MB | 12 kB
Progress (3): 0.6/4.6 MB | 1.3/1.3 MB | 12 kB
Progress (3): 0.6/4.6 MB | 1.3/1.3 MB | 12 kB
Progress (3): 0.6/4.6 MB | 1.3/1.3 MB | 12 kB
Progress (3): 0.6/4.6 MB | 1.3/1.3 MB | 12 kB
                                             
Downloaded from eclipse.maven.central.mirror: https://repo.eclipse.org/content/repositories/maven_central/org/apache/ant/ant-launcher/1.7.1/ant-launcher-1.7.1.jar (12 kB at 229 kB/s)
Progress (2): 0.6/4.6 MB | 1.3/1.3 MB
Progress (2): 0.6/4.6 MB | 1.3/1.3 MB
Progress (2): 0.6/4.6 MB | 1.3/1.3 MB
Progress (2): 0.6/4.6 MB | 1.3/1.3 MB
Progress (2): 0.6/4.6 MB | 1.3/1.3 MB
Progress (2): 0.6/4.6 MB | 1.3/1.3 MB
Progress (2): 0.6/4.6 MB | 1.3/1.3 MB
Progress (2): 0.6/4.6 MB | 1.3/1.3 MB
Progress (2): 0.6/4.6 MB | 1.3/1.3 MB
Progress (2): 0.6/4.6 MB | 1.3/1.3 MB
Progress (2): 0.6/4.6 MB | 1.3/1.3 MB
Progress (2): 0.6/4.6 MB | 1.3/1.3 MB
Progress (2): 0.7/4.6 MB | 1.3/1.3 MB
Progress (2): 0.7/4.6 MB | 1.3/1.3 MB
Progress (2): 0.7/4.6 MB | 1.3/1.3 MB
Progress (2): 0.7/4.6 MB | 1.3/1.3 MB
Progress (2): 0.7/4.6 MB | 1.3/1.3 MB
Progress (2): 0.7/4.6 MB | 1.3/1.3 MB
Progress (2): 0.7/4.6 MB | 1.3 MB    
Progress (2): 0.7/4.6 MB | 1.3 MB
Progress (2): 0.7/4.6 MB | 1.3 MB
Progress (2): 0.7/4.6 MB | 1.3 MB
Progress (2): 0.7/4.6 MB | 1.3 MB
                                 
Downloaded from eclipse.maven.central.mirror: https://repo.eclipse.org/content/repositories/maven_central/org/apache/ant/ant/1.7.1/ant-1.7.1.jar (1.3 MB at 18 MB/s)
Progress (1): 0.7/4.6 MB
Progress (1): 0.7/4.6 MB
Progress (1): 0.7/4.6 MB
Progress (1): 0.7/4.6 MB
Progress (1): 0.7/4.6 MB
Progress (1): 0.7/4.6 MB
Progress (1): 0.7/4.6 MB
Progress (1): 0.7/4.6 MB
Progress (1): 0.7/4.6 MB
Progress (1): 0.7/4.6 MB
Progress (1): 0.7/4.6 MB
Progress (1): 0.7/4.6 MB
Progress (1): 0.7/4.6 MB
Progress (1): 0.7/4.6 MB
Progress (1): 0.7/4.6 MB
Progress (1): 0.7/4.6 MB
Progress (1): 0.7/4.6 MB
Progress (1): 0.8/4.6 MB
Progress (1): 0.8/4.6 MB
Progress (1): 0.8/4.6 MB
Progress (1): 0.8/4.6 MB
Progress (1): 0.8/4.6 MB
Progress (1): 0.8/4.6 MB
Progress (1): 0.8/4.6 MB
Progress (1): 0.8/4.6 MB
Progress (1): 0.8/4.6 MB
Progress (1): 0.8/4.6 MB
Progress (1): 0.8/4.6 MB
Progress (1): 0.8/4.6 MB
Progress (1): 0.8/4.6 MB
Progress (1): 0.8/4.6 MB
Progress (1): 0.8/4.6 MB
Progress (1): 0.8/4.6 MB
Progress (1): 0.8/4.6 MB
Progress (1): 0.8/4.6 MB
Progress (1): 0.8/4.6 MB
Progress (1): 0.8/4.6 MB
Progress (1): 0.8/4.6 MB
Progress (1): 0.8/4.6 MB
Progress (1): 0.8/4.6 MB
Progress (1): 0.8/4.6 MB
Progress (1): 0.9/4.6 MB
Progress (1): 0.9/4.6 MB
Progress (1): 0.9/4.6 MB
Progress (1): 0.9/4.6 MB
Progress (1): 0.9/4.6 MB
Progress (1): 0.9/4.6 MB
Progress (1): 0.9/4.6 MB
Progress (1): 0.9/4.6 MB
Progress (1): 0.9/4.6 MB
Progress (1): 0.9/4.6 MB
Progress (1): 0.9/4.6 MB
Progress (1): 0.9/4.6 MB
Progress (1): 0.9/4.6 MB
Progress (1): 0.9/4.6 MB
Progress (1): 0.9/4.6 MB
Progress (1): 0.9/4.6 MB
Progress (1): 0.9/4.6 MB
Progress (1): 0.9/4.6 MB
Progress (1): 0.9/4.6 MB
Progress (1): 0.9/4.6 MB
Progress (1): 0.9/4.6 MB
Progress (1): 0.9/4.6 MB
Progress (1): 0.9/4.6 MB
Progress (1): 0.9/4.6 MB
Progress (1): 0.9/4.6 MB
Progress (1): 1.0/4.6 MB
Progress (1): 1.0/4.6 MB
Progress (1): 1.0/4.6 MB
Progress (1): 1.0/4.6 MB
Progress (1): 1.0/4.6 MB
Progress (1): 1.0/4.6 MB
Progress (1): 1.0/4.6 MB
Progress (1): 1.0/4.6 MB
Progress (1): 1.0/4.6 MB
Progress (1): 1.0/4.6 MB
Progress (1): 1.0/4.6 MB
Progress (1): 1.0/4.6 MB
Progress (1): 1.0/4.6 MB
Progress (1): 1.0/4.6 MB
Progress (1): 1.0/4.6 MB
Progress (1): 1.0/4.6 MB
Progress (1): 1.0/4.6 MB
Progress (1): 1.0/4.6 MB
Progress (1): 1.0/4.6 MB
Progress (1): 1.0/4.6 MB
Progress (1): 1.0/4.6 MB
Progress (1): 1.0/4.6 MB
Progress (1): 1.0/4.6 MB
Progress (1): 1.0/4.6 MB
Progress (1): 1.1/4.6 MB
Progress (1): 1.1/4.6 MB
Progress (1): 1.1/4.6 MB
Progress (1): 1.1/4.6 MB
Progress (1): 1.1/4.6 MB
Progress (1): 1.1/4.6 MB
Progress (1): 1.1/4.6 MB
Progress (1): 1.1/4.6 MB
Progress (1): 1.1/4.6 MB
Progress (1): 1.1/4.6 MB
Progress (1): 1.1/4.6 MB
Progress (1): 1.1/4.6 MB
Progress (1): 1.1/4.6 MB
Progress (1): 1.1/4.6 MB
Progress (1): 1.1/4.6 MB
Progress (1): 1.1/4.6 MB
Progress (1): 1.1/4.6 MB
Progress (1): 1.1/4.6 MB
Progress (1): 1.1/4.6 MB
Progress (1): 1.1/4.6 MB
Progress (1): 1.1/4.6 MB
Progress (1): 1.1/4.6 MB
Progress (1): 1.1/4.6 MB
Progress (1): 1.1/4.6 MB
Progress (1): 1.2/4.6 MB
Progress (1): 1.2/4.6 MB
Progress (1): 1.2/4.6 MB
Progress (1): 1.2/4.6 MB
Progress (1): 1.2/4.6 MB
Progress (1): 1.2/4.6 MB
Progress (1): 1.2/4.6 MB
Progress (1): 1.2/4.6 MB
Progress (1): 1.2/4.6 MB
Progress (1): 1.2/4.6 MB
Progress (1): 1.2/4.6 MB
Progress (1): 1.2/4.6 MB
Progress (1): 1.2/4.6 MB
Progress (1): 1.2/4.6 MB
Progress (1): 1.2/4.6 MB
Progress (1): 1.2/4.6 MB
Progress (1): 1.2/4.6 MB
Progress (1): 1.2/4.6 MB
Progress (1): 1.2/4.6 MB
Progress (1): 1.2/4.6 MB
Progress (1): 1.2/4.6 MB
Progress (1): 1.2/4.6 MB
Progress (1): 1.2/4.6 MB
Progress (1): 1.2/4.6 MB
Progress (1): 1.2/4.6 MB
Progress (1): 1.3/4.6 MB
Progress (1): 1.3/4.6 MB
Progress (1): 1.3/4.6 MB
Progress (1): 1.3/4.6 MB
Progress (1): 1.3/4.6 MB
Progress (1): 1.3/4.6 MB
Progress (1): 1.3/4.6 MB
Progress (1): 1.3/4.6 MB
Progress (1): 1.3/4.6 MB
Progress (1): 1.3/4.6 MB
Progress (1): 1.3/4.6 MB
Progress (1): 1.3/4.6 MB
Progress (1): 1.3/4.6 MB
Progress (1): 1.3/4.6 MB
Progress (1): 1.3/4.6 MB
Progress (1): 1.3/4.6 MB
Progress (1): 1.3/4.6 MB
Progress (1): 1.3/4.6 MB
Progress (1): 1.3/4.6 MB
Progress (1): 1.3/4.6 MB
Progress (1): 1.3/4.6 MB
Progress (1): 1.3/4.6 MB
Progress (1): 1.3/4.6 MB
Progress (1): 1.3/4.6 MB
Progress (1): 1.4/4.6 MB
Progress (1): 1.4/4.6 MB
Progress (1): 1.4/4.6 MB
Progress (1): 1.4/4.6 MB
Progress (1): 1.4/4.6 MB
Progress (1): 1.4/4.6 MB
Progress (1): 1.4/4.6 MB
Progress (1): 1.4/4.6 MB
Progress (1): 1.4/4.6 MB
Progress (1): 1.4/4.6 MB
Progress (1): 1.4/4.6 MB
Progress (1): 1.4/4.6 MB
Progress (1): 1.4/4.6 MB
Progress (1): 1.4/4.6 MB
Progress (1): 1.4/4.6 MB
Progress (1): 1.4/4.6 MB
Progress (1): 1.4/4.6 MB
Progress (1): 1.4/4.6 MB
Progress (1): 1.4/4.6 MB
Progress (1): 1.4/4.6 MB
Progress (1): 1.4/4.6 MB
Progress (1): 1.4/4.6 MB
Progress (1): 1.4/4.6 MB
Progress (1): 1.4/4.6 MB
Progress (1): 1.4/4.6 MB
Progress (1): 1.5/4.6 MB
Progress (1): 1.5/4.6 MB
Progress (1): 1.5/4.6 MB
Progress (1): 1.5/4.6 MB
Progress (1): 1.5/4.6 MB
Progress (1): 1.5/4.6 MB
Progress (1): 1.5/4.6 MB
Progress (1): 1.5/4.6 MB
Progress (1): 1.5/4.6 MB
Progress (1): 1.5/4.6 MB
Progress (1): 1.5/4.6 MB
Progress (1): 1.5/4.6 MB
Progress (1): 1.5/4.6 MB
Progress (1): 1.5/4.6 MB
Progress (1): 1.5/4.6 MB
Progress (1): 1.5/4.6 MB
Progress (1): 1.5/4.6 MB
Progress (1): 1.5/4.6 MB
Progress (1): 1.5/4.6 MB
Progress (1): 1.5/4.6 MB
Progress (1): 1.5/4.6 MB
Progress (1): 1.5/4.6 MB
Progress (1): 1.5/4.6 MB
Progress (1): 1.5/4.6 MB
Progress (1): 1.6/4.6 MB
Progress (1): 1.6/4.6 MB
Progress (1): 1.6/4.6 MB
Progress (1): 1.6/4.6 MB
Progress (1): 1.6/4.6 MB
Progress (1): 1.6/4.6 MB
Progress (1): 1.6/4.6 MB
Progress (1): 1.6/4.6 MB
Progress (1): 1.6/4.6 MB
Progress (1): 1.6/4.6 MB
Progress (1): 1.6/4.6 MB
Progress (1): 1.6/4.6 MB
Progress (1): 1.6/4.6 MB
Progress (1): 1.6/4.6 MB
Progress (1): 1.6/4.6 MB
Progress (1): 1.6/4.6 MB
Progress (1): 1.6/4.6 MB
Progress (1): 1.6/4.6 MB
Progress (1): 1.6/4.6 MB
Progress (1): 1.6/4.6 MB
Progress (1): 1.6/4.6 MB
Progress (1): 1.6/4.6 MB
Progress (1): 1.6/4.6 MB
Progress (1): 1.6/4.6 MB
Progress (1): 1.7/4.6 MB
Progress (1): 1.7/4.6 MB
Progress (1): 1.7/4.6 MB
Progress (1): 1.7/4.6 MB
Progress (1): 1.7/4.6 MB
Progress (1): 1.7/4.6 MB
Progress (1): 1.7/4.6 MB
Progress (1): 1.7/4.6 MB
Progress (1): 1.7/4.6 MB
Progress (1): 1.7/4.6 MB
Progress (1): 1.7/4.6 MB
Progress (1): 1.7/4.6 MB
Progress (1): 1.7/4.6 MB
Progress (1): 1.7/4.6 MB
Progress (1): 1.7/4.6 MB
Progress (1): 1.7/4.6 MB
Progress (1): 1.7/4.6 MB
Progress (1): 1.7/4.6 MB
Progress (1): 1.7/4.6 MB
Progress (1): 1.7/4.6 MB
Progress (1): 1.7/4.6 MB
Progress (1): 1.7/4.6 MB
Progress (1): 1.7/4.6 MB
Progress (1): 1.7/4.6 MB
Progress (1): 1.7/4.6 MB
Progress (1): 1.8/4.6 MB
Progress (1): 1.8/4.6 MB
Progress (1): 1.8/4.6 MB
Progress (1): 1.8/4.6 MB
Progress (1): 1.8/4.6 MB
Progress (1): 1.8/4.6 MB
Progress (1): 1.8/4.6 MB
Progress (1): 1.8/4.6 MB
Progress (1): 1.8/4.6 MB
Progress (1): 1.8/4.6 MB
Progress (1): 1.8/4.6 MB
Progress (1): 1.8/4.6 MB
Progress (1): 1.8/4.6 MB
Progress (1): 1.8/4.6 MB
Progress (1): 1.8/4.6 MB
Progress (1): 1.8/4.6 MB
Progress (1): 1.8/4.6 MB
Progress (1): 1.8/4.6 MB
Progress (1): 1.8/4.6 MB
Progress (1): 1.8/4.6 MB
Progress (1): 1.8/4.6 MB
Progress (1): 1.8/4.6 MB
Progress (1): 1.8/4.6 MB
Progress (1): 1.8/4.6 MB
Progress (1): 1.9/4.6 MB
Progress (1): 1.9/4.6 MB
Progress (1): 1.9/4.6 MB
Progress (1): 1.9/4.6 MB
Progress (1): 1.9/4.6 MB
Progress (1): 1.9/4.6 MB
Progress (1): 1.9/4.6 MB
Progress (1): 1.9/4.6 MB
Progress (1): 1.9/4.6 MB
Progress (1): 1.9/4.6 MB
Progress (1): 1.9/4.6 MB
Progress (1): 1.9/4.6 MB
Progress (1): 1.9/4.6 MB
Progress (1): 1.9/4.6 MB
Progress (1): 1.9/4.6 MB
Progress (1): 1.9/4.6 MB
Progress (1): 1.9/4.6 MB
Progress (1): 1.9/4.6 MB
Progress (1): 1.9/4.6 MB
Progress (1): 1.9/4.6 MB
Progress (1): 1.9/4.6 MB
Progress (1): 1.9/4.6 MB
Progress (1): 1.9/4.6 MB
Progress (1): 1.9/4.6 MB
Progress (1): 1.9/4.6 MB
Progress (1): 2.0/4.6 MB
Progress (1): 2.0/4.6 MB
Progress (1): 2.0/4.6 MB
Progress (1): 2.0/4.6 MB
Progress (1): 2.0/4.6 MB
Progress (1): 2.0/4.6 MB
Progress (1): 2.0/4.6 MB
Progress (1): 2.0/4.6 MB
Progress (1): 2.0/4.6 MB
Progress (1): 2.0/4.6 MB
Progress (1): 2.0/4.6 MB
Progress (1): 2.0/4.6 MB
Progress (1): 2.0/4.6 MB
Progress (1): 2.0/4.6 MB
Progress (1): 2.0/4.6 MB
Progress (1): 2.0/4.6 MB
Progress (1): 2.0/4.6 MB
Progress (1): 2.0/4.6 MB
Progress (1): 2.0/4.6 MB
Progress (1): 2.0/4.6 MB
Progress (1): 2.0/4.6 MB
Progress (1): 2.0/4.6 MB
Progress (1): 2.0/4.6 MB
Progress (1): 2.0/4.6 MB
Progress (1): 2.1/4.6 MB
Progress (1): 2.1/4.6 MB
Progress (1): 2.1/4.6 MB
Progress (1): 2.1/4.6 MB
Progress (1): 2.1/4.6 MB
Progress (1): 2.1/4.6 MB
Progress (1): 2.1/4.6 MB
Progress (1): 2.1/4.6 MB
Progress (1): 2.1/4.6 MB
Progress (1): 2.1/4.6 MB
Progress (1): 2.1/4.6 MB
Progress (1): 2.1/4.6 MB
Progress (1): 2.1/4.6 MB
Progress (1): 2.1/4.6 MB
Progress (1): 2.1/4.6 MB
Progress (1): 2.1/4.6 MB
Progress (1): 2.1/4.6 MB
Progress (1): 2.1/4.6 MB
Progress (1): 2.1/4.6 MB
Progress (1): 2.1/4.6 MB
Progress (1): 2.1/4.6 MB
Progress (1): 2.1/4.6 MB
Progress (1): 2.1/4.6 MB
Progress (1): 2.1/4.6 MB
Progress (1): 2.2/4.6 MB
Progress (1): 2.2/4.6 MB
Progress (1): 2.2/4.6 MB
Progress (1): 2.2/4.6 MB
Progress (1): 2.2/4.6 MB
Progress (1): 2.2/4.6 MB
Progress (1): 2.2/4.6 MB
Progress (1): 2.2/4.6 MB
Progress (1): 2.2/4.6 MB
Progress (1): 2.2/4.6 MB
Progress (1): 2.2/4.6 MB
Progress (1): 2.2/4.6 MB
Progress (1): 2.2/4.6 MB
Progress (1): 2.2/4.6 MB
Progress (1): 2.2/4.6 MB
Progress (1): 2.2/4.6 MB
Progress (1): 2.2/4.6 MB
Progress (1): 2.2/4.6 MB
Progress (1): 2.2/4.6 MB
Progress (1): 2.2/4.6 MB
Progress (1): 2.2/4.6 MB
Progress (1): 2.2/4.6 MB
Progress (1): 2.2/4.6 MB
Progress (1): 2.2/4.6 MB
Progress (1): 2.2/4.6 MB
Progress (1): 2.3/4.6 MB
Progress (1): 2.3/4.6 MB
Progress (1): 2.3/4.6 MB
Progress (1): 2.3/4.6 MB
Progress (1): 2.3/4.6 MB
Progress (1): 2.3/4.6 MB
Progress (1): 2.3/4.6 MB
Progress (1): 2.3/4.6 MB
Progress (1): 2.3/4.6 MB
Progress (1): 2.3/4.6 MB
Progress (1): 2.3/4.6 MB
Progress (1): 2.3/4.6 MB
Progress (1): 2.3/4.6 MB
Progress (1): 2.3/4.6 MB
Progress (1): 2.3/4.6 MB
Progress (1): 2.3/4.6 MB
Progress (1): 2.3/4.6 MB
Progress (1): 2.3/4.6 MB
Progress (1): 2.3/4.6 MB
Progress (1): 2.3/4.6 MB
Progress (1): 2.3/4.6 MB
Progress (1): 2.3/4.6 MB
Progress (1): 2.3/4.6 MB
Progress (1): 2.3/4.6 MB
Progress (1): 2.4/4.6 MB
Progress (1): 2.4/4.6 MB
Progress (1): 2.4/4.6 MB
Progress (1): 2.4/4.6 MB
Progress (1): 2.4/4.6 MB
Progress (1): 2.4/4.6 MB
Progress (1): 2.4/4.6 MB
Progress (1): 2.4/4.6 MB
Progress (1): 2.4/4.6 MB
Progress (1): 2.4/4.6 MB
Progress (1): 2.4/4.6 MB
Progress (1): 2.4/4.6 MB
Progress (1): 2.4/4.6 MB
Progress (1): 2.4/4.6 MB
Progress (1): 2.4/4.6 MB
Progress (1): 2.4/4.6 MB
Progress (1): 2.4/4.6 MB
Progress (1): 2.4/4.6 MB
Progress (1): 2.4/4.6 MB
Progress (1): 2.4/4.6 MB
Progress (1): 2.4/4.6 MB
Progress (1): 2.4/4.6 MB
Progress (1): 2.4/4.6 MB
Progress (1): 2.4/4.6 MB
Progress (1): 2.4/4.6 MB
Progress (1): 2.5/4.6 MB
Progress (1): 2.5/4.6 MB
Progress (1): 2.5/4.6 MB
Progress (1): 2.5/4.6 MB
Progress (1): 2.5/4.6 MB
Progress (1): 2.5/4.6 MB
Progress (1): 2.5/4.6 MB
Progress (1): 2.5/4.6 MB
Progress (1): 2.5/4.6 MB
Progress (1): 2.5/4.6 MB
Progress (1): 2.5/4.6 MB
Progress (1): 2.5/4.6 MB
Progress (1): 2.5/4.6 MB
Progress (1): 2.5/4.6 MB
Progress (1): 2.5/4.6 MB
Progress (1): 2.5/4.6 MB
Progress (1): 2.5/4.6 MB
Progress (1): 2.5/4.6 MB
Progress (1): 2.5/4.6 MB
Progress (1): 2.5/4.6 MB
Progress (1): 2.5/4.6 MB
Progress (1): 2.5/4.6 MB
Progress (1): 2.5/4.6 MB
Progress (1): 2.5/4.6 MB
Progress (1): 2.6/4.6 MB
Progress (1): 2.6/4.6 MB
Progress (1): 2.6/4.6 MB
Progress (1): 2.6/4.6 MB
Progress (1): 2.6/4.6 MB
Progress (1): 2.6/4.6 MB
Progress (1): 2.6/4.6 MB
Progress (1): 2.6/4.6 MB
Progress (1): 2.6/4.6 MB
Progress (1): 2.6/4.6 MB
Progress (1): 2.6/4.6 MB
Progress (1): 2.6/4.6 MB
Progress (1): 2.6/4.6 MB
Progress (1): 2.6/4.6 MB
Progress (1): 2.6/4.6 MB
Progress (1): 2.6/4.6 MB
Progress (1): 2.6/4.6 MB
Progress (1): 2.6/4.6 MB
Progress (1): 2.6/4.6 MB
Progress (1): 2.6/4.6 MB
Progress (1): 2.6/4.6 MB
Progress (1): 2.6/4.6 MB
Progress (1): 2.6/4.6 MB
Progress (1): 2.6/4.6 MB
Progress (1): 2.6/4.6 MB
Progress (1): 2.7/4.6 MB
Progress (1): 2.7/4.6 MB
Progress (1): 2.7/4.6 MB
Progress (1): 2.7/4.6 MB
Progress (1): 2.7/4.6 MB
Progress (1): 2.7/4.6 MB
Progress (1): 2.7/4.6 MB
Progress (1): 2.7/4.6 MB
Progress (1): 2.7/4.6 MB
Progress (1): 2.7/4.6 MB
Progress (1): 2.7/4.6 MB
Progress (1): 2.7/4.6 MB
Progress (1): 2.7/4.6 MB
Progress (1): 2.7/4.6 MB
Progress (1): 2.7/4.6 MB
Progress (1): 2.7/4.6 MB
Progress (1): 2.7/4.6 MB
Progress (1): 2.7/4.6 MB
Progress (1): 2.7/4.6 MB
Progress (1): 2.7/4.6 MB
Progress (1): 2.7/4.6 MB
Progress (1): 2.7/4.6 MB
Progress (1): 2.7/4.6 MB
Progress (1): 2.7/4.6 MB
Progress (1): 2.8/4.6 MB
Progress (1): 2.8/4.6 MB
Progress (1): 2.8/4.6 MB
Progress (1): 2.8/4.6 MB
Progress (1): 2.8/4.6 MB
Progress (1): 2.8/4.6 MB
Progress (1): 2.8/4.6 MB
Progress (1): 2.8/4.6 MB
Progress (1): 2.8/4.6 MB
Progress (1): 2.8/4.6 MB
Progress (1): 2.8/4.6 MB
Progress (1): 2.8/4.6 MB
Progress (1): 2.8/4.6 MB
Progress (1): 2.8/4.6 MB
Progress (1): 2.8/4.6 MB
Progress (1): 2.8/4.6 MB
Progress (1): 2.8/4.6 MB
Progress (1): 2.8/4.6 MB
Progress (1): 2.8/4.6 MB
Progress (1): 2.8/4.6 MB
Progress (1): 2.8/4.6 MB
Progress (1): 2.8/4.6 MB
Progress (1): 2.8/4.6 MB
Progress (1): 2.8/4.6 MB
Progress (1): 2.9/4.6 MB
Progress (1): 2.9/4.6 MB
Progress (1): 2.9/4.6 MB
Progress (1): 2.9/4.6 MB
Progress (1): 2.9/4.6 MB
Progress (1): 2.9/4.6 MB
Progress (1): 2.9/4.6 MB
Progress (1): 2.9/4.6 MB
Progress (1): 2.9/4.6 MB
Progress (1): 2.9/4.6 MB
Progress (1): 2.9/4.6 MB
Progress (1): 2.9/4.6 MB
Progress (1): 2.9/4.6 MB
Progress (1): 2.9/4.6 MB
Progress (1): 2.9/4.6 MB
Progress (1): 2.9/4.6 MB
Progress (1): 2.9/4.6 MB
Progress (1): 2.9/4.6 MB
Progress (1): 2.9/4.6 MB
Progress (1): 2.9/4.6 MB
Progress (1): 2.9/4.6 MB
Progress (1): 2.9/4.6 MB
Progress (1): 2.9/4.6 MB
Progress (1): 2.9/4.6 MB
Progress (1): 2.9/4.6 MB
Progress (1): 3.0/4.6 MB
Progress (1): 3.0/4.6 MB
Progress (1): 3.0/4.6 MB
Progress (1): 3.0/4.6 MB
Progress (1): 3.0/4.6 MB
Progress (1): 3.0/4.6 MB
Progress (1): 3.0/4.6 MB
Progress (1): 3.0/4.6 MB
Progress (1): 3.0/4.6 MB
Progress (1): 3.0/4.6 MB
Progress (1): 3.0/4.6 MB
Progress (1): 3.0/4.6 MB
Progress (1): 3.0/4.6 MB
Progress (1): 3.0/4.6 MB
Progress (1): 3.0/4.6 MB
Progress (1): 3.0/4.6 MB
Progress (1): 3.0/4.6 MB
Progress (1): 3.0/4.6 MB
Progress (1): 3.0/4.6 MB
Progress (1): 3.0/4.6 MB
Progress (1): 3.0/4.6 MB
Progress (1): 3.0/4.6 MB
Progress (1): 3.0/4.6 MB
Progress (1): 3.0/4.6 MB
Progress (1): 3.1/4.6 MB
Progress (1): 3.1/4.6 MB
Progress (1): 3.1/4.6 MB
Progress (1): 3.1/4.6 MB
Progress (1): 3.1/4.6 MB
Progress (1): 3.1/4.6 MB
Progress (1): 3.1/4.6 MB
Progress (1): 3.1/4.6 MB
Progress (1): 3.1/4.6 MB
Progress (1): 3.1/4.6 MB
Progress (1): 3.1/4.6 MB
Progress (1): 3.1/4.6 MB
Progress (1): 3.1/4.6 MB
Progress (1): 3.1/4.6 MB
Progress (1): 3.1/4.6 MB
Progress (1): 3.1/4.6 MB
Progress (1): 3.1/4.6 MB
Progress (1): 3.1/4.6 MB
Progress (1): 3.1/4.6 MB
Progress (1): 3.1/4.6 MB
Progress (1): 3.1/4.6 MB
Progress (1): 3.1/4.6 MB
Progress (1): 3.1/4.6 MB
Progress (1): 3.1/4.6 MB
Progress (1): 3.1/4.6 MB
Progress (1): 3.2/4.6 MB
Progress (1): 3.2/4.6 MB
Progress (1): 3.2/4.6 MB
Progress (1): 3.2/4.6 MB
Progress (1): 3.2/4.6 MB
Progress (1): 3.2/4.6 MB
Progress (1): 3.2/4.6 MB
Progress (1): 3.2/4.6 MB
Progress (1): 3.2/4.6 MB
Progress (1): 3.2/4.6 MB
Progress (1): 3.2/4.6 MB
Progress (1): 3.2/4.6 MB
Progress (1): 3.2/4.6 MB
Progress (1): 3.2/4.6 MB
Progress (1): 3.2/4.6 MB
Progress (1): 3.2/4.6 MB
Progress (1): 3.2/4.6 MB
Progress (1): 3.2/4.6 MB
Progress (1): 3.2/4.6 MB
Progress (1): 3.2/4.6 MB
Progress (1): 3.2/4.6 MB
Progress (1): 3.2/4.6 MB
Progress (1): 3.2/4.6 MB
Progress (1): 3.2/4.6 MB
Progress (1): 3.3/4.6 MB
Progress (1): 3.3/4.6 MB
Progress (1): 3.3/4.6 MB
Progress (1): 3.3/4.6 MB
Progress (1): 3.3/4.6 MB
Progress (1): 3.3/4.6 MB
Progress (1): 3.3/4.6 MB
Progress (1): 3.3/4.6 MB
Progress (1): 3.3/4.6 MB
Progress (1): 3.3/4.6 MB
Progress (1): 3.3/4.6 MB
Progress (1): 3.3/4.6 MB
Progress (1): 3.3/4.6 MB
Progress (1): 3.3/4.6 MB
Progress (1): 3.3/4.6 MB
Progress (1): 3.3/4.6 MB
Progress (1): 3.3/4.6 MB
Progress (1): 3.3/4.6 MB
Progress (1): 3.3/4.6 MB
Progress (1): 3.3/4.6 MB
Progress (1): 3.3/4.6 MB
Progress (1): 3.3/4.6 MB
Progress (1): 3.3/4.6 MB
Progress (1): 3.3/4.6 MB
Progress (1): 3.4/4.6 MB
Progress (1): 3.4/4.6 MB
Progress (1): 3.4/4.6 MB
Progress (1): 3.4/4.6 MB
Progress (1): 3.4/4.6 MB
Progress (1): 3.4/4.6 MB
Progress (1): 3.4/4.6 MB
Progress (1): 3.4/4.6 MB
Progress (1): 3.4/4.6 MB
Progress (1): 3.4/4.6 MB
Progress (1): 3.4/4.6 MB
Progress (1): 3.4/4.6 MB
Progress (1): 3.4/4.6 MB
Progress (1): 3.4/4.6 MB
Progress (1): 3.4/4.6 MB
Progress (1): 3.4/4.6 MB
Progress (1): 3.4/4.6 MB
Progress (1): 3.4/4.6 MB
Progress (1): 3.4/4.6 MB
Progress (1): 3.4/4.6 MB
Progress (1): 3.4/4.6 MB
Progress (1): 3.4/4.6 MB
Progress (1): 3.4/4.6 MB
Progress (1): 3.4/4.6 MB
Progress (1): 3.4/4.6 MB
Progress (1): 3.5/4.6 MB
Progress (1): 3.5/4.6 MB
Progress (1): 3.5/4.6 MB
Progress (1): 3.5/4.6 MB
Progress (1): 3.5/4.6 MB
Progress (1): 3.5/4.6 MB
Progress (1): 3.5/4.6 MB
Progress (1): 3.5/4.6 MB
Progress (1): 3.5/4.6 MB
Progress (1): 3.5/4.6 MB
Progress (1): 3.5/4.6 MB
Progress (1): 3.5/4.6 MB
Progress (1): 3.5/4.6 MB
Progress (1): 3.5/4.6 MB
Progress (1): 3.5/4.6 MB
Progress (1): 3.5/4.6 MB
Progress (1): 3.5/4.6 MB
Progress (1): 3.5/4.6 MB
Progress (1): 3.5/4.6 MB
Progress (1): 3.5/4.6 MB
Progress (1): 3.5/4.6 MB
Progress (1): 3.5/4.6 MB
Progress (1): 3.5/4.6 MB
Progress (1): 3.5/4.6 MB
Progress (1): 3.6/4.6 MB
Progress (1): 3.6/4.6 MB
Progress (1): 3.6/4.6 MB
Progress (1): 3.6/4.6 MB
Progress (1): 3.6/4.6 MB
Progress (1): 3.6/4.6 MB
Progress (1): 3.6/4.6 MB
Progress (1): 3.6/4.6 MB
Progress (1): 3.6/4.6 MB
Progress (1): 3.6/4.6 MB
Progress (1): 3.6/4.6 MB
Progress (1): 3.6/4.6 MB
Progress (1): 3.6/4.6 MB
Progress (1): 3.6/4.6 MB
Progress (1): 3.6/4.6 MB
Progress (1): 3.6/4.6 MB
Progress (1): 3.6/4.6 MB
Progress (1): 3.6/4.6 MB
Progress (1): 3.6/4.6 MB
Progress (1): 3.6/4.6 MB
Progress (1): 3.6/4.6 MB
Progress (1): 3.6/4.6 MB
Progress (1): 3.6/4.6 MB
Progress (1): 3.6/4.6 MB
Progress (1): 3.6/4.6 MB
Progress (1): 3.7/4.6 MB
Progress (1): 3.7/4.6 MB
Progress (1): 3.7/4.6 MB
Progress (1): 3.7/4.6 MB
Progress (1): 3.7/4.6 MB
Progress (1): 3.7/4.6 MB
Progress (1): 3.7/4.6 MB
Progress (1): 3.7/4.6 MB
Progress (1): 3.7/4.6 MB
Progress (1): 3.7/4.6 MB
Progress (1): 3.7/4.6 MB
Progress (1): 3.7/4.6 MB
Progress (1): 3.7/4.6 MB
Progress (1): 3.7/4.6 MB
Progress (1): 3.7/4.6 MB
Progress (1): 3.7/4.6 MB
Progress (1): 3.7/4.6 MB
Progress (1): 3.7/4.6 MB
Progress (1): 3.7/4.6 MB
Progress (1): 3.7/4.6 MB
Progress (1): 3.7/4.6 MB
Progress (1): 3.7/4.6 MB
Progress (1): 3.7/4.6 MB
Progress (1): 3.7/4.6 MB
Progress (1): 3.8/4.6 MB
Progress (1): 3.8/4.6 MB
Progress (1): 3.8/4.6 MB
Progress (1): 3.8/4.6 MB
Progress (1): 3.8/4.6 MB
Progress (1): 3.8/4.6 MB
Progress (1): 3.8/4.6 MB
Progress (1): 3.8/4.6 MB
Progress (1): 3.8/4.6 MB
Progress (1): 3.8/4.6 MB
Progress (1): 3.8/4.6 MB
Progress (1): 3.8/4.6 MB
Progress (1): 3.8/4.6 MB
Progress (1): 3.8/4.6 MB
Progress (1): 3.8/4.6 MB
Progress (1): 3.8/4.6 MB
Progress (1): 3.8/4.6 MB
Progress (1): 3.8/4.6 MB
Progress (1): 3.8/4.6 MB
Progress (1): 3.8/4.6 MB
Progress (1): 3.8/4.6 MB
Progress (1): 3.8/4.6 MB
Progress (1): 3.8/4.6 MB
Progress (1): 3.8/4.6 MB
Progress (1): 3.8/4.6 MB
Progress (1): 3.9/4.6 MB
Progress (1): 3.9/4.6 MB
Progress (1): 3.9/4.6 MB
Progress (1): 3.9/4.6 MB
Progress (1): 3.9/4.6 MB
Progress (1): 3.9/4.6 MB
Progress (1): 3.9/4.6 MB
Progress (1): 3.9/4.6 MB
Progress (1): 3.9/4.6 MB
Progress (1): 3.9/4.6 MB
Progress (1): 3.9/4.6 MB
Progress (1): 3.9/4.6 MB
Progress (1): 3.9/4.6 MB
Progress (1): 3.9/4.6 MB
Progress (1): 3.9/4.6 MB
Progress (1): 3.9/4.6 MB
Progress (1): 3.9/4.6 MB
Progress (1): 3.9/4.6 MB
Progress (1): 3.9/4.6 MB
Progress (1): 3.9/4.6 MB
Progress (1): 3.9/4.6 MB
Progress (1): 3.9/4.6 MB
Progress (1): 3.9/4.6 MB
Progress (1): 3.9/4.6 MB
Progress (1): 4.0/4.6 MB
Progress (1): 4.0/4.6 MB
Progress (1): 4.0/4.6 MB
Progress (1): 4.0/4.6 MB
Progress (1): 4.0/4.6 MB
Progress (1): 4.0/4.6 MB
Progress (1): 4.0/4.6 MB
Progress (1): 4.0/4.6 MB
Progress (1): 4.0/4.6 MB
Progress (1): 4.0/4.6 MB
Progress (1): 4.0/4.6 MB
Progress (1): 4.0/4.6 MB
Progress (1): 4.0/4.6 MB
Progress (1): 4.0/4.6 MB
Progress (1): 4.0/4.6 MB
Progress (1): 4.0/4.6 MB
Progress (1): 4.0/4.6 MB
Progress (1): 4.0/4.6 MB
Progress (1): 4.0/4.6 MB
Progress (1): 4.0/4.6 MB
Progress (1): 4.0/4.6 MB
Progress (1): 4.0/4.6 MB
Progress (1): 4.0/4.6 MB
Progress (1): 4.0/4.6 MB
Progress (1): 4.1/4.6 MB
Progress (1): 4.1/4.6 MB
Progress (1): 4.1/4.6 MB
Progress (1): 4.1/4.6 MB
Progress (1): 4.1/4.6 MB
Progress (1): 4.1/4.6 MB
Progress (1): 4.1/4.6 MB
Progress (1): 4.1/4.6 MB
Progress (1): 4.1/4.6 MB
Progress (1): 4.1/4.6 MB
Progress (1): 4.1/4.6 MB
Progress (1): 4.1/4.6 MB
Progress (1): 4.1/4.6 MB
Progress (1): 4.1/4.6 MB
Progress (1): 4.1/4.6 MB
Progress (1): 4.1/4.6 MB
Progress (1): 4.1/4.6 MB
Progress (1): 4.1/4.6 MB
Progress (1): 4.1/4.6 MB
Progress (1): 4.1/4.6 MB
Progress (1): 4.1/4.6 MB
Progress (1): 4.1/4.6 MB
Progress (1): 4.1/4.6 MB
Progress (1): 4.1/4.6 MB
Progress (1): 4.1/4.6 MB
Progress (1): 4.2/4.6 MB
Progress (1): 4.2/4.6 MB
Progress (1): 4.2/4.6 MB
Progress (1): 4.2/4.6 MB
Progress (1): 4.2/4.6 MB
Progress (1): 4.2/4.6 MB
Progress (1): 4.2/4.6 MB
Progress (1): 4.2/4.6 MB
Progress (1): 4.2/4.6 MB
Progress (1): 4.2/4.6 MB
Progress (1): 4.2/4.6 MB
Progress (1): 4.2/4.6 MB
Progress (1): 4.2/4.6 MB
Progress (1): 4.2/4.6 MB
Progress (1): 4.2/4.6 MB
Progress (1): 4.2/4.6 MB
Progress (1): 4.2/4.6 MB
Progress (1): 4.2/4.6 MB
Progress (1): 4.2/4.6 MB
Progress (1): 4.2/4.6 MB
Progress (1): 4.2/4.6 MB
Progress (1): 4.2/4.6 MB
Progress (1): 4.2/4.6 MB
Progress (1): 4.2/4.6 MB
Progress (1): 4.3/4.6 MB
Progress (1): 4.3/4.6 MB
Progress (1): 4.3/4.6 MB
Progress (1): 4.3/4.6 MB
Progress (1): 4.3/4.6 MB
Progress (1): 4.3/4.6 MB
Progress (1): 4.3/4.6 MB
Progress (1): 4.3/4.6 MB
Progress (1): 4.3/4.6 MB
Progress (1): 4.3/4.6 MB
Progress (1): 4.3/4.6 MB
Progress (1): 4.3/4.6 MB
Progress (1): 4.3/4.6 MB
Progress (1): 4.3/4.6 MB
Progress (1): 4.3/4.6 MB
Progress (1): 4.3/4.6 MB
Progress (1): 4.3/4.6 MB
Progress (1): 4.3/4.6 MB
Progress (1): 4.3/4.6 MB
Progress (1): 4.3/4.6 MB
Progress (1): 4.3/4.6 MB
Progress (1): 4.3/4.6 MB
Progress (1): 4.3/4.6 MB
Progress (1): 4.3/4.6 MB
Progress (1): 4.3/4.6 MB
Progress (1): 4.4/4.6 MB
Progress (1): 4.4/4.6 MB
Progress (1): 4.4/4.6 MB
Progress (1): 4.4/4.6 MB
Progress (1): 4.4/4.6 MB
Progress (1): 4.4/4.6 MB
Progress (1): 4.4/4.6 MB
Progress (1): 4.4/4.6 MB
Progress (1): 4.4/4.6 MB
Progress (1): 4.4/4.6 MB
Progress (1): 4.4/4.6 MB
Progress (1): 4.4/4.6 MB
Progress (1): 4.4/4.6 MB
Progress (1): 4.4/4.6 MB
Progress (1): 4.4/4.6 MB
Progress (1): 4.4/4.6 MB
Progress (1): 4.4/4.6 MB
Progress (1): 4.4/4.6 MB
Progress (1): 4.4/4.6 MB
Progress (1): 4.4/4.6 MB
Progress (1): 4.4/4.6 MB
Progress (1): 4.4/4.6 MB
Progress (1): 4.4/4.6 MB
Progress (1): 4.4/4.6 MB
Progress (1): 4.5/4.6 MB
Progress (1): 4.5/4.6 MB
Progress (1): 4.5/4.6 MB
Progress (1): 4.5/4.6 MB
Progress (1): 4.5/4.6 MB
Progress (1): 4.5/4.6 MB
Progress (1): 4.5/4.6 MB
Progress (1): 4.5/4.6 MB
Progress (1): 4.5/4.6 MB
Progress (1): 4.5/4.6 MB
Progress (1): 4.5/4.6 MB
Progress (1): 4.5/4.6 MB
Progress (1): 4.5/4.6 MB
Progress (1): 4.5/4.6 MB
Progress (1): 4.5/4.6 MB
Progress (1): 4.5/4.6 MB
Progress (1): 4.5/4.6 MB
Progress (1): 4.5/4.6 MB
Progress (1): 4.5/4.6 MB
Progress (1): 4.5/4.6 MB
Progress (1): 4.5/4.6 MB
Progress (1): 4.5/4.6 MB
Progress (1): 4.5/4.6 MB
Progress (1): 4.5/4.6 MB
Progress (1): 4.6/4.6 MB
Progress (1): 4.6/4.6 MB
Progress (1): 4.6/4.6 MB
Progress (1): 4.6/4.6 MB
Progress (1): 4.6/4.6 MB
Progress (1): 4.6/4.6 MB
Progress (1): 4.6/4.6 MB
Progress (1): 4.6/4.6 MB
Progress (1): 4.6/4.6 MB
Progress (1): 4.6/4.6 MB
Progress (1): 4.6 MB    
                    
Downloaded from sonatype: https://oss.sonatype.org/content/repositories/public/org/codehaus/groovy/groovy-all/1.6.9/groovy-all-1.6.9.jar (4.6 MB at 7.8 MB/s)
[INFO] 
[INFO] --- jacoco-maven-plugin:0.7.9:prepare-agent (default) @ org.eclipse.tcf.te.tests ---
[INFO] tycho.testArgLine set to -javaagent:/home/hudson/genie.tcf/.jenkins/jobs/tcf-1.5/workspace/.repository/org/jacoco/org.jacoco.agent/0.7.9/org.jacoco.agent-0.7.9-runtime.jar=destfile=/jobs/genie.tcf/tcf-1.5/workspace/target_explorer/plugins/org.eclipse.tcf.te.tests/target/jacoco.exec,append=true,includes=org.eclipse.tcf*,excludes=org.eclipse.tcf.debug.test*:org.eclipse.tcf.te.tests.*,dumponexit=true,output=file
[INFO] 
[INFO] --- maven-resources-plugin:2.7:resources (default-resources) @ org.eclipse.tcf.te.tests ---
[INFO] Using 'UTF-8' encoding to copy filtered resources.
[INFO] skip non existing resourceDirectory /jobs/genie.tcf/tcf-1.5/workspace/target_explorer/plugins/org.eclipse.tcf.te.tests/src/main/resources
[INFO] 
[INFO] --- tycho-compiler-plugin:0.23.1:compile (default-compile) @ org.eclipse.tcf.te.tests ---
[INFO] Compiling 68 source files to /jobs/genie.tcf/tcf-1.5/workspace/target_explorer/plugins/org.eclipse.tcf.te.tests/target/classes
[INFO] 
[INFO] --- maven-resources-plugin:2.7:testResources (default-testResources) @ org.eclipse.tcf.te.tests ---
[INFO] Using 'UTF-8' encoding to copy filtered resources.
[INFO] skip non existing resourceDirectory /jobs/genie.tcf/tcf-1.5/workspace/target_explorer/plugins/org.eclipse.tcf.te.tests/src/test/resources
[INFO] 
[INFO] --- tycho-source-plugin:0.23.1:plugin-source (plugin-source) @ org.eclipse.tcf.te.tests ---
[INFO] Building jar: /jobs/genie.tcf/tcf-1.5/workspace/target_explorer/plugins/org.eclipse.tcf.te.tests/target/org.eclipse.tcf.te.tests-1.5.0-SNAPSHOT-sources.jar
[INFO] 
[INFO] --- target-platform-configuration:0.23.1:target-platform (default-target-platform) @ org.eclipse.tcf.te.tests ---
[INFO] 
[INFO] --- tycho-packaging-plugin:0.23.1:package-plugin (default-package-plugin) @ org.eclipse.tcf.te.tests ---
[INFO] Building jar: /jobs/genie.tcf/tcf-1.5/workspace/target_explorer/plugins/org.eclipse.tcf.te.tests/target/org.eclipse.tcf.te.tests-1.5.0-SNAPSHOT.jar
[INFO] 
[INFO] --- tycho-p2-plugin:0.23.1:p2-metadata-default (default-p2-metadata-default) @ org.eclipse.tcf.te.tests ---
[INFO] 
[INFO] --- tycho-p2-plugin:0.23.1:p2-metadata (p2-metadata) @ org.eclipse.tcf.te.tests ---
[INFO] 
[INFO] --- tycho-surefire-plugin:0.23.1:test (default-test) @ org.eclipse.tcf.te.tests ---
[INFO] Publishing 2 bundles to /jobs/genie.tcf/tcf-1.5/workspace/target_explorer/plugins/org.eclipse.tcf.te.tests/target/p2temp/additionalBundles
[INFO] Command line:
	[/opt/public/common/jdk1.7.0_80/jre/bin/java, -jar, /jobs/genie.tcf/tcf-1.5/workspace/.repository/org/eclipse/tycho/tycho-bundles-external/0.23.1/eclipse/plugins/org.eclipse.equinox.launcher_1.3.100.v20150511-1540.jar, -configuration, /tmp/genie.tcf/tycho-p2-runtime1318403697099337832.tmp/configuration, -nosplash, -application, org.eclipse.equinox.p2.publisher.FeaturesAndBundlesPublisher, -artifactRepository, file:/jobs/genie.tcf/tcf-1.5/workspace/target_explorer/plugins/org.eclipse.tcf.te.tests/target/p2temp/additionalBundles/, -metadataRepository, file:/jobs/genie.tcf/tcf-1.5/workspace/target_explorer/plugins/org.eclipse.tcf.te.tests/target/p2temp/additionalBundles/, -compress, -publishArtifacts, -source, /jobs/genie.tcf/tcf-1.5/workspace/target_explorer/plugins/org.eclipse.tcf.te.tests/target/p2temp/additionalBundles]
Picked up JAVA_TOOL_OPTIONS: -Xmx2G -Djava.io.tmpdir=/tmp/genie.tcf
Generating metadata for ..
Generation completed with success [0 seconds].
[INFO] Installing IUs [org.eclipse.tcf.te.tests, org.eclipse.tycho.surefire.osgibooter, org.eclipse.tycho.surefire.junit4, org.eclipse.platform.ide, org.eclipse.sdk.feature.group, org.eclipse.cdt.platform.feature.group, org.eclipse.remote.feature.group, org.eclipse.swtbot.eclipse.feature.group] to /jobs/genie.tcf/tcf-1.5/workspace/target_explorer/plugins/org.eclipse.tcf.te.tests/target/work
Installing org.eclipse.tcf.te.tests 1.5.0.201609112106.
Installing org.eclipse.tycho.surefire.osgibooter 0.23.1.
Installing org.eclipse.tycho.surefire.junit4 0.23.1.
Installing org.eclipse.platform.ide 3.8.2.M20130131-0800.
Installing org.eclipse.sdk.feature.group 3.8.2.v20130116-114247-7Q85DVDQQ3JLtb_hNUm3_MTesRM5RqdjCSfXEI7waiJ_N.
Installing org.eclipse.cdt.platform.feature.group 8.3.0.201402142303.
Installing org.eclipse.remote.feature.group 2.0.0.201507010000.
Installing org.eclipse.swtbot.eclipse.feature.group 2.2.1.201402241301.
Operation completed in 19279 ms.
[INFO] Expected eclipse log file: /jobs/genie.tcf/tcf-1.5/workspace/target_explorer/plugins/org.eclipse.tcf.te.tests/target/work/data/.metadata/.log
[INFO] Command line:
	[/opt/public/common/jdk1.7.0_80/jre/bin/java, -Dosgi.noShutdown=false, -Dosgi.os=linux, -Dosgi.ws=gtk, -Dosgi.arch=x86_64, -javaagent:/home/hudson/genie.tcf/.jenkins/jobs/tcf-1.5/workspace/.repository/org/jacoco/org.jacoco.agent/0.7.9/org.jacoco.agent-0.7.9-runtime.jar=destfile=/jobs/genie.tcf/tcf-1.5/workspace/target_explorer/plugins/org.eclipse.tcf.te.tests/target/jacoco.exec,append=true,includes=org.eclipse.tcf*,excludes=org.eclipse.tcf.debug.test*:org.eclipse.tcf.te.tests.*,dumponexit=true,output=file, -Xint, -Xmx512m, -XX:MaxPermSize=256m, -Dosgi.clean=true, -Dosgi.debug=/jobs/genie.tcf/tcf-1.5/workspace/target_explorer/plugins/org.eclipse.tcf.te.tests/tracing/.options, -Dtcf.agent.path=/home/hudson/genie.tcf/.jenkins/jobs/tcf-1.5/workspace/.agent, -jar, /jobs/genie.tcf/tcf-1.5/workspace/target_explorer/plugins/org.eclipse.tcf.te.tests/target/work/plugins/org.eclipse.equinox.launcher_1.3.0.v20120522-1813.jar, -debug, -consolelog, -data, /jobs/genie.tcf/tcf-1.5/workspace/target_explorer/plugins/org.eclipse.tcf.te.tests/target/work/data, -install, /jobs/genie.tcf/tcf-1.5/workspace/target_explorer/plugins/org.eclipse.tcf.te.tests/target/work, -configuration, /jobs/genie.tcf/tcf-1.5/workspace/target_explorer/plugins/org.eclipse.tcf.te.tests/target/work/configuration, -application, org.eclipse.tycho.surefire.osgibooter.uitest, -testproperties, /jobs/genie.tcf/tcf-1.5/workspace/target_explorer/plugins/org.eclipse.tcf.te.tests/target/surefire.properties, -testApplication, org.eclipse.ui.ide.workbench, -product, org.eclipse.platform.ide]
Picked up JAVA_TOOL_OPTIONS: -Xmx2G -Djava.io.tmpdir=/tmp/genie.tcf
Configuration location:
    file:/jobs/genie.tcf/tcf-1.5/workspace/target_explorer/plugins/org.eclipse.tcf.te.tests/target/work/configuration/
Configuration file:
    file:/jobs/genie.tcf/tcf-1.5/workspace/target_explorer/plugins/org.eclipse.tcf.te.tests/target/work/configuration/config.ini loaded
Install location:
    file:/jobs/genie.tcf/tcf-1.5/workspace/target_explorer/plugins/org.eclipse.tcf.te.tests/target/work/
Framework located:
    file:/jobs/genie.tcf/tcf-1.5/workspace/target_explorer/plugins/org.eclipse.tcf.te.tests/target/work/plugins/org.eclipse.osgi_3.8.2.v20130124-134944.jar
Framework classpath:
    file:/jobs/genie.tcf/tcf-1.5/workspace/target_explorer/plugins/org.eclipse.tcf.te.tests/target/work/plugins/org.eclipse.osgi_3.8.2.v20130124-134944.jar
Debug options:
    file:/jobs/genie.tcf/tcf-1.5/workspace/target_explorer/plugins/org.eclipse.tcf.te.tests/tracing/.options loaded
Time to load bundles: 76
Starting application: 13237
Launching application org.eclipse.ui.ide.workbench...
Cannot send datagram packet to /172.25.255.255
java.io.IOException: Operation not permitted
	at java.net.PlainDatagramSocketImpl.send(Native Method)
	at java.net.DatagramSocket.send(DatagramSocket.java:698)
	at org.eclipse.tcf.internal.services.local.LocatorService.sendDatagramPacket(LocatorService.java:948)
	at org.eclipse.tcf.internal.services.local.LocatorService.sendPeersRequest(LocatorService.java:1031)
	at org.eclipse.tcf.internal.services.local.LocatorService.refresh_timer(LocatorService.java:693)
	at org.eclipse.tcf.internal.services.local.LocatorService.access$1(LocatorService.java:650)
	at org.eclipse.tcf.internal.services.local.LocatorService$1$1.run(LocatorService.java:230)
	at org.eclipse.tcf.protocol.Protocol$3.run(Protocol.java:242)
	at org.eclipse.tcf.EventQueue.run(EventQueue.java:95)
	at java.lang.Thread.run(Thread.java:745)
!SESSION 2018-02-24 13:17:38.819 -----------------------------------------------
eclipse.buildId=M20130131-0800
java.version=1.7.0_80
java.vendor=Oracle Corporation
BootLoader constants: OS=linux, ARCH=x86_64, WS=gtk, NL=en_US
Framework arguments:  -application org.eclipse.tycho.surefire.osgibooter.uitest -testproperties /jobs/genie.tcf/tcf-1.5/workspace/target_explorer/plugins/org.eclipse.tcf.te.tests/target/surefire.properties -testApplication org.eclipse.ui.ide.workbench -product org.eclipse.platform.ide
Command-line arguments:  -debug -consolelog -data /jobs/genie.tcf/tcf-1.5/workspace/target_explorer/plugins/org.eclipse.tcf.te.tests/target/work/data -application org.eclipse.tycho.surefire.osgibooter.uitest -testproperties /jobs/genie.tcf/tcf-1.5/workspace/target_explorer/plugins/org.eclipse.tcf.te.tests/target/surefire.properties -testApplication org.eclipse.ui.ide.workbench -product org.eclipse.platform.ide

!ENTRY org.eclipse.tcf 4 0 2018-02-24 13:17:54.890
!MESSAGE Cannot send datagram packet to /172.25.255.255
!STACK 0
java.io.IOException: Operation not permitted
	at java.net.PlainDatagramSocketImpl.send(Native Method)
	at java.net.DatagramSocket.send(DatagramSocket.java:698)
	at org.eclipse.tcf.internal.services.local.LocatorService.sendDatagramPacket(LocatorService.java:948)
	at org.eclipse.tcf.internal.services.local.LocatorService.sendPeersRequest(LocatorService.java:1031)
	at org.eclipse.tcf.internal.services.local.LocatorService.refresh_timer(LocatorService.java:693)
	at org.eclipse.tcf.internal.services.local.LocatorService.access$1(LocatorService.java:650)
	at org.eclipse.tcf.internal.services.local.LocatorService$1$1.run(LocatorService.java:230)
	at org.eclipse.tcf.protocol.Protocol$3.run(Protocol.java:242)
	at org.eclipse.tcf.EventQueue.run(EventQueue.java:95)
	at java.lang.Thread.run(Thread.java:745)
Application Started: 28223

-------------------------------------------------------
 T E S T S
-------------------------------------------------------
Running org.eclipse.tcf.te.tests.suites.AllTests

=== testPendingOperationModelNode started at: February 24, 2018 1:18:07 PM EST
=== testPendingOperationModelNode finished at: February 24, 2018 1:18:14 PM EST (duration: 6871 ms)

=== testFileTransferItem started at: February 24, 2018 1:18:14 PM EST
=== testFileTransferItem finished at: February 24, 2018 1:18:14 PM EST (duration: 26 ms)

=== testModelNode started at: February 24, 2018 1:18:14 PM EST
=== testModelNode finished at: February 24, 2018 1:18:14 PM EST (duration: 45 ms)

=== testPropertiesContainer started at: February 24, 2018 1:18:14 PM EST
=== testPropertiesContainer finished at: February 24, 2018 1:18:14 PM EST (duration: 3 ms)

=== testModel started at: February 24, 2018 1:18:14 PM EST
=== testModel finished at: February 24, 2018 1:18:14 PM EST (duration: 9 ms)

=== testElfUtils started at: February 24, 2018 1:18:14 PM EST
=== testElfUtils finished at: February 24, 2018 1:18:14 PM EST (duration: 80 ms)

=== testPrivateOrInternalClasses started at: February 24, 2018 1:18:14 PM EST
=== testPrivateOrInternalClasses finished at: February 24, 2018 1:18:14 PM EST (duration: 50 ms)

=== testSingleThreadExecutorService started at: February 24, 2018 1:18:14 PM EST
=== testSingleThreadExecutorService finished at: February 24, 2018 1:18:15 PM EST (duration: 1108 ms)

=== testAbstractDelegatingExecutorService started at: February 24, 2018 1:18:15 PM EST
=== testAbstractDelegatingExecutorService finished at: February 24, 2018 1:18:15 PM EST (duration: 9 ms)

=== testStatusHandler started at: February 24, 2018 1:18:15 PM EST
=== testStatusHandler finished at: February 24, 2018 1:18:15 PM EST (duration: 20 ms)

=== testContributionsWithContext started at: February 24, 2018 1:18:15 PM EST
=== testContributionsWithContext finished at: February 24, 2018 1:18:15 PM EST (duration: 24 ms)

=== testDefaultStatusHandler started at: February 24, 2018 1:18:15 PM EST

!ENTRY org.eclipse.tcf.te.tests 1 0 2018-02-24 13:18:15.752
!MESSAGE Info

!ENTRY org.eclipse.tcf.te.tests 2 0 2018-02-24 13:18:15.755
!MESSAGE Warning

!ENTRY org.eclipse.tcf.te.tests 4 0 2018-02-24 13:18:15.756
!MESSAGE Error

!ENTRY org.eclipse.tcf.te.tests 0 0 2018-02-24 13:18:15.759
!MESSAGE Question

!ENTRY org.eclipse.tcf.te.tests 0 0 2018-02-24 13:18:15.760
!MESSAGE Question
!STACK 0
java.lang.Throwable
	at org.eclipse.tcf.te.tests.statushandler.StatusHandlerTestCase.testDefaultStatusHandler(StatusHandlerTestCase.java:151)
	at sun.reflect.NativeMethodAccessorImpl.invoke0(Native Method)
	at sun.reflect.NativeMethodAccessorImpl.invoke(NativeMethodAccessorImpl.java:57)
	at sun.reflect.DelegatingMethodAccessorImpl.invoke(DelegatingMethodAccessorImpl.java:43)
	at java.lang.reflect.Method.invoke(Method.java:606)
	at junit.framework.TestCase.runTest(TestCase.java:168)
	at junit.framework.TestCase.runBare(TestCase.java:134)
	at org.eclipse.tcf.te.tests.CoreTestCase.runBare(CoreTestCase.java:256)
	at junit.framework.TestResult$1.protect(TestResult.java:110)
	at junit.framework.TestResult.runProtected(TestResult.java:128)
	at junit.framework.TestResult.run(TestResult.java:113)
	at junit.framework.TestCase.run(TestCase.java:124)
	at org.eclipse.tcf.te.tests.CoreTestCase.run(CoreTestCase.java:233)
	at junit.framework.TestSuite.runTest(TestSuite.java:243)
	at junit.framework.TestSuite.run(TestSuite.java:238)
	at junit.framework.TestSuite.runTest(TestSuite.java:243)
	at junit.framework.TestSuite.run(TestSuite.java:238)
	at junit.framework.TestSuite.runTest(TestSuite.java:243)
	at junit.framework.TestSuite.run(TestSuite.java:238)
	at org.junit.internal.runners.JUnit38ClassRunner.run(JUnit38ClassRunner.java:83)
	at org.apache.maven.surefire.junit4.JUnit4Provider.execute(JUnit4Provider.java:264)
	at org.apache.maven.surefire.junit4.JUnit4Provider.executeTestSet(JUnit4Provider.java:153)
	at org.apache.maven.surefire.junit4.JUnit4Provider.invoke(JUnit4Provider.java:124)
	at sun.reflect.NativeMethodAccessorImpl.invoke0(Native Method)
	at sun.reflect.NativeMethodAccessorImpl.invoke(NativeMethodAccessorImpl.java:57)
	at sun.reflect.DelegatingMethodAccessorImpl.invoke(DelegatingMethodAccessorImpl.java:43)
	at java.lang.reflect.Method.invoke(Method.java:606)
	at org.apache.maven.surefire.util.ReflectionUtils.invokeMethodWithArray2(ReflectionUtils.java:208)
	at org.apache.maven.surefire.booter.ProviderFactory$ProviderProxy.invoke(ProviderFactory.java:156)
	at org.apache.maven.surefire.booter.ProviderFactory.invokeProvider(ProviderFactory.java:82)
	at org.eclipse.tycho.surefire.osgibooter.OsgiSurefireBooter.run(OsgiSurefireBooter.java:91)
	at org.eclipse.tycho.surefire.osgibooter.AbstractUITestApplication$1.run(AbstractUITestApplication.java:35)
	at org.eclipse.swt.widgets.RunnableLock.run(RunnableLock.java:35)
	at org.eclipse.swt.widgets.Synchronizer.runAsyncMessages(Synchronizer.java:135)
	at org.eclipse.swt.widgets.Display.runAsyncMessages(Display.java:3537)
	at org.eclipse.swt.widgets.Display.readAndDispatch(Display.java:3189)
	at org.eclipse.ui.internal.Workbench.runEventLoop(Workbench.java:2701)
	at org.eclipse.ui.internal.Workbench.runUI(Workbench.java:2665)
	at org.eclipse.ui.internal.Workbench.access$4(Workbench.java:2499)
	at org.eclipse.ui.internal.Workbench$7.run(Workbench.java:679)
	at org.eclipse.core.databinding.observable.Realm.runWithDefault(Realm.java:332)
	at org.eclipse.ui.internal.Workbench.createAndRunWorkbench(Workbench.java:668)
	at org.eclipse.ui.PlatformUI.createAndRunWorkbench(PlatformUI.java:149)
	at org.eclipse.ui.internal.ide.application.IDEApplication.start(IDEApplication.java:124)
	at org.eclipse.tycho.surefire.osgibooter.UITestApplication.runApplication(UITestApplication.java:31)
	at org.eclipse.tycho.surefire.osgibooter.AbstractUITestApplication.run(AbstractUITestApplication.java:120)
	at org.eclipse.tycho.surefire.osgibooter.UITestApplication.start(UITestApplication.java:37)
	at org.eclipse.equinox.internal.app.EclipseAppHandle.run(EclipseAppHandle.java:196)
	at org.eclipse.core.runtime.internal.adaptor.EclipseAppLauncher.runApplication(EclipseAppLauncher.java:110)
	at org.eclipse.core.runtime.internal.adaptor.EclipseAppLauncher.start(EclipseAppLauncher.java:79)
	at org.eclipse.core.runtime.adaptor.EclipseStarter.run(EclipseStarter.java:353)
	at org.eclipse.core.runtime.adaptor.EclipseStarter.run(EclipseStarter.java:180)
	at sun.reflect.NativeMethodAccessorImpl.invoke0(Native Method)
	at sun.reflect.NativeMethodAccessorImpl.invoke(NativeMethodAccessorImpl.java:57)
	at sun.reflect.DelegatingMethodAccessorImpl.invoke(DelegatingMethodAccessorImpl.java:43)
	at java.lang.reflect.Method.invoke(Method.java:606)
	at org.eclipse.equinox.launcher.Main.invokeFramework(Main.java:629)
	at org.eclipse.equinox.launcher.Main.basicRun(Main.java:584)
	at org.eclipse.equinox.launcher.Main.run(Main.java:1438)
	at org.eclipse.equinox.launcher.Main.main(Main.java:1414)

!ENTRY org.eclipse.tcf.te.tests 0 1 2018-02-24 13:18:15.765
!MESSAGE Question
!STACK 0
java.lang.Throwable
	at org.eclipse.tcf.te.tests.statushandler.StatusHandlerTestCase.testDefaultStatusHandler(StatusHandlerTestCase.java:154)
	at sun.reflect.NativeMethodAccessorImpl.invoke0(Native Method)
	at sun.reflect.NativeMethodAccessorImpl.invoke(NativeMethodAccessorImpl.java:57)
	at sun.reflect.DelegatingMethodAccessorImpl.invoke(DelegatingMethodAccessorImpl.java:43)
	at java.lang.reflect.Method.invoke(Method.java:606)
	at junit.framework.TestCase.runTest(TestCase.java:168)
	at junit.framework.TestCase.runBare(TestCase.java:134)
	at org.eclipse.tcf.te.tests.CoreTestCase.runBare(CoreTestCase.java:256)
	at junit.framework.TestResult$1.protect(TestResult.java:110)
	at junit.framework.TestResult.runProtected(TestResult.java:128)
	at junit.framework.TestResult.run(TestResult.java:113)
	at junit.framework.TestCase.run(TestCase.java:124)
	at org.eclipse.tcf.te.tests.CoreTestCase.run(CoreTestCase.java:233)
	at junit.framework.TestSuite.runTest(TestSuite.java:243)
	at junit.framework.TestSuite.run(TestSuite.java:238)
	at junit.framework.TestSuite.runTest(TestSuite.java:243)
	at junit.framework.TestSuite.run(TestSuite.java:238)
	at junit.framework.TestSuite.runTest(TestSuite.java:243)
	at junit.framework.TestSuite.run(TestSuite.java:238)
	at org.junit.internal.runners.JUnit38ClassRunner.run(JUnit38ClassRunner.java:83)
	at org.apache.maven.surefire.junit4.JUnit4Provider.execute(JUnit4Provider.java:264)
	at org.apache.maven.surefire.junit4.JUnit4Provider.executeTestSet(JUnit4Provider.java:153)
	at org.apache.maven.surefire.junit4.JUnit4Provider.invoke(JUnit4Provider.java:124)
	at sun.reflect.NativeMethodAccessorImpl.invoke0(Native Method)
	at sun.reflect.NativeMethodAccessorImpl.invoke(NativeMethodAccessorImpl.java:57)
	at sun.reflect.DelegatingMethodAccessorImpl.invoke(DelegatingMethodAccessorImpl.java:43)
	at java.lang.reflect.Method.invoke(Method.java:606)
	at org.apache.maven.surefire.util.ReflectionUtils.invokeMethodWithArray2(ReflectionUtils.java:208)
	at org.apache.maven.surefire.booter.ProviderFactory$ProviderProxy.invoke(ProviderFactory.java:156)
	at org.apache.maven.surefire.booter.ProviderFactory.invokeProvider(ProviderFactory.java:82)
	at org.eclipse.tycho.surefire.osgibooter.OsgiSurefireBooter.run(OsgiSurefireBooter.java:91)
	at org.eclipse.tycho.surefire.osgibooter.AbstractUITestApplication$1.run(AbstractUITestApplication.java:35)
	at org.eclipse.swt.widgets.RunnableLock.run(RunnableLock.java:35)
	at org.eclipse.swt.widgets.Synchronizer.runAsyncMessages(Synchronizer.java:135)
	at org.eclipse.swt.widgets.Display.runAsyncMessages(Display.java:3537)
	at org.eclipse.swt.widgets.Display.readAndDispatch(Display.java:3189)
	at org.eclipse.ui.internal.Workbench.runEventLoop(Workbench.java:2701)
	at org.eclipse.ui.internal.Workbench.runUI(Workbench.java:2665)
	at org.eclipse.ui.internal.Workbench.access$4(Workbench.java:2499)
	at org.eclipse.ui.internal.Workbench$7.run(Workbench.java:679)
	at org.eclipse.core.databinding.observable.Realm.runWithDefault(Realm.java:332)
	at org.eclipse.ui.internal.Workbench.createAndRunWorkbench(Workbench.java:668)
	at org.eclipse.ui.PlatformUI.createAndRunWorkbench(PlatformUI.java:149)
	at org.eclipse.ui.internal.ide.application.IDEApplication.start(IDEApplication.java:124)
	at org.eclipse.tycho.surefire.osgibooter.UITestApplication.runApplication(UITestApplication.java:31)
	at org.eclipse.tycho.surefire.osgibooter.AbstractUITestApplication.run(AbstractUITestApplication.java:120)
	at org.eclipse.tycho.surefire.osgibooter.UITestApplication.start(UITestApplication.java:37)
	at org.eclipse.equinox.internal.app.EclipseAppHandle.run(EclipseAppHandle.java:196)
	at org.eclipse.core.runtime.internal.adaptor.EclipseAppLauncher.runApplication(EclipseAppLauncher.java:110)
	at org.eclipse.core.runtime.internal.adaptor.EclipseAppLauncher.start(EclipseAppLauncher.java:79)
	at org.eclipse.core.runtime.adaptor.EclipseStarter.run(EclipseStarter.java:353)
	at org.eclipse.core.runtime.adaptor.EclipseStarter.run(EclipseStarter.java:180)
	at sun.reflect.NativeMethodAccessorImpl.invoke0(Native Method)
	at sun.reflect.NativeMethodAccessorImpl.invoke(NativeMethodAccessorImpl.java:57)
	at sun.reflect.DelegatingMethodAccessorImpl.invoke(DelegatingMethodAccessorImpl.java:43)
	at java.lang.reflect.Method.invoke(Method.java:606)
	at org.eclipse.equinox.launcher.Main.invokeFramework(Main.java:629)
	at org.eclipse.equinox.launcher.Main.basicRun(Main.java:584)
	at org.eclipse.equinox.launcher.Main.run(Main.java:1438)
	at org.eclipse.equinox.launcher.Main.main(Main.java:1414)

!ENTRY org.eclipse.tcf.te.tests 0 0 2018-02-24 13:18:15.770
!MESSAGE YesNoCancel

!ENTRY org.eclipse.tcf.te.tests 0 0 2018-02-24 13:18:15.771
!MESSAGE YesNoCancel
!STACK 0
java.lang.Throwable
	at org.eclipse.tcf.te.tests.statushandler.StatusHandlerTestCase.testDefaultStatusHandler(StatusHandlerTestCase.java:160)
	at sun.reflect.NativeMethodAccessorImpl.invoke0(Native Method)
	at sun.reflect.NativeMethodAccessorImpl.invoke(NativeMethodAccessorImpl.java:57)
	at sun.reflect.DelegatingMethodAccessorImpl.invoke(DelegatingMethodAccessorImpl.java:43)
	at java.lang.reflect.Method.invoke(Method.java:606)
	at junit.framework.TestCase.runTest(TestCase.java:168)
	at junit.framework.TestCase.runBare(TestCase.java:134)
	at org.eclipse.tcf.te.tests.CoreTestCase.runBare(CoreTestCase.java:256)
	at junit.framework.TestResult$1.protect(TestResult.java:110)
	at junit.framework.TestResult.runProtected(TestResult.java:128)
	at junit.framework.TestResult.run(TestResult.java:113)
	at junit.framework.TestCase.run(TestCase.java:124)
	at org.eclipse.tcf.te.tests.CoreTestCase.run(CoreTestCase.java:233)
	at junit.framework.TestSuite.runTest(TestSuite.java:243)
	at junit.framework.TestSuite.run(TestSuite.java:238)
	at junit.framework.TestSuite.runTest(TestSuite.java:243)
	at junit.framework.TestSuite.run(TestSuite.java:238)
	at junit.framework.TestSuite.runTest(TestSuite.java:243)
	at junit.framework.TestSuite.run(TestSuite.java:238)
	at org.junit.internal.runners.JUnit38ClassRunner.run(JUnit38ClassRunner.java:83)
	at org.apache.maven.surefire.junit4.JUnit4Provider.execute(JUnit4Provider.java:264)
	at org.apache.maven.surefire.junit4.JUnit4Provider.executeTestSet(JUnit4Provider.java:153)
	at org.apache.maven.surefire.junit4.JUnit4Provider.invoke(JUnit4Provider.java:124)
	at sun.reflect.NativeMethodAccessorImpl.invoke0(Native Method)
	at sun.reflect.NativeMethodAccessorImpl.invoke(NativeMethodAccessorImpl.java:57)
	at sun.reflect.DelegatingMethodAccessorImpl.invoke(DelegatingMethodAccessorImpl.java:43)
	at java.lang.reflect.Method.invoke(Method.java:606)
	at org.apache.maven.surefire.util.ReflectionUtils.invokeMethodWithArray2(ReflectionUtils.java:208)
	at org.apache.maven.surefire.booter.ProviderFactory$ProviderProxy.invoke(ProviderFactory.java:156)
	at org.apache.maven.surefire.booter.ProviderFactory.invokeProvider(ProviderFactory.java:82)
	at org.eclipse.tycho.surefire.osgibooter.OsgiSurefireBooter.run(OsgiSurefireBooter.java:91)
	at org.eclipse.tycho.surefire.osgibooter.AbstractUITestApplication$1.run(AbstractUITestApplication.java:35)
	at org.eclipse.swt.widgets.RunnableLock.run(RunnableLock.java:35)
	at org.eclipse.swt.widgets.Synchronizer.runAsyncMessages(Synchronizer.java:135)
	at org.eclipse.swt.widgets.Display.runAsyncMessages(Display.java:3537)
	at org.eclipse.swt.widgets.Display.readAndDispatch(Display.java:3189)
	at org.eclipse.ui.internal.Workbench.runEventLoop(Workbench.java:2701)
	at org.eclipse.ui.internal.Workbench.runUI(Workbench.java:2665)
	at org.eclipse.ui.internal.Workbench.access$4(Workbench.java:2499)
	at org.eclipse.ui.internal.Workbench$7.run(Workbench.java:679)
	at org.eclipse.core.databinding.observable.Realm.runWithDefault(Realm.java:332)
	at org.eclipse.ui.internal.Workbench.createAndRunWorkbench(Workbench.java:668)
	at org.eclipse.ui.PlatformUI.createAndRunWorkbench(PlatformUI.java:149)
	at org.eclipse.ui.internal.ide.application.IDEApplication.start(IDEApplication.java:124)
	at org.eclipse.tycho.surefire.osgibooter.UITestApplication.runApplication(UITestApplication.java:31)
	at org.eclipse.tycho.surefire.osgibooter.AbstractUITestApplication.run(AbstractUITestApplication.java:120)
	at org.eclipse.tycho.surefire.osgibooter.UITestApplication.start(UITestApplication.java:37)
	at org.eclipse.equinox.internal.app.EclipseAppHandle.run(EclipseAppHandle.java:196)
	at org.eclipse.core.runtime.internal.adaptor.EclipseAppLauncher.runApplication(EclipseAppLauncher.java:110)
	at org.eclipse.core.runtime.internal.adaptor.EclipseAppLauncher.start(EclipseAppLauncher.java:79)
	at org.eclipse.core.runtime.adaptor.EclipseStarter.run(EclipseStarter.java:353)
	at org.eclipse.core.runtime.adaptor.EclipseStarter.run(EclipseStarter.java:180)
	at sun.reflect.NativeMethodAccessorImpl.invoke0(Native Method)
	at sun.reflect.NativeMethodAccessorImpl.invoke(NativeMethodAccessorImpl.java:57)
	at sun.reflect.DelegatingMethodAccessorImpl.invoke(DelegatingMethodAccessorImpl.java:43)
	at java.lang.reflect.Method.invoke(Method.java:606)
	at org.eclipse.equinox.launcher.Main.invokeFramework(Main.java:629)
	at org.eclipse.equinox.launcher.Main.basicRun(Main.java:584)
	at org.eclipse.equinox.launcher.Main.run(Main.java:1438)
	at org.eclipse.equinox.launcher.Main.main(Main.java:1414)

!ENTRY org.eclipse.tcf.te.tests 0 1 2018-02-24 13:18:15.775
!MESSAGE YesNoCancel
!STACK 0
java.lang.Throwable
	at org.eclipse.tcf.te.tests.statushandler.StatusHandlerTestCase.testDefaultStatusHandler(StatusHandlerTestCase.java:163)
	at sun.reflect.NativeMethodAccessorImpl.invoke0(Native Method)
	at sun.reflect.NativeMethodAccessorImpl.invoke(NativeMethodAccessorImpl.java:57)
	at sun.reflect.DelegatingMethodAccessorImpl.invoke(DelegatingMethodAccessorImpl.java:43)
	at java.lang.reflect.Method.invoke(Method.java:606)
	at junit.framework.TestCase.runTest(TestCase.java:168)
	at junit.framework.TestCase.runBare(TestCase.java:134)
	at org.eclipse.tcf.te.tests.CoreTestCase.runBare(CoreTestCase.java:256)
	at junit.framework.TestResult$1.protect(TestResult.java:110)
	at junit.framework.TestResult.runProtected(TestResult.java:128)
	at junit.framework.TestResult.run(TestResult.java:113)
	at junit.framework.TestCase.run(TestCase.java:124)
	at org.eclipse.tcf.te.tests.CoreTestCase.run(CoreTestCase.java:233)
	at junit.framework.TestSuite.runTest(TestSuite.java:243)
	at junit.framework.TestSuite.run(TestSuite.java:238)
	at junit.framework.TestSuite.runTest(TestSuite.java:243)
	at junit.framework.TestSuite.run(TestSuite.java:238)
	at junit.framework.TestSuite.runTest(TestSuite.java:243)
	at junit.framework.TestSuite.run(TestSuite.java:238)
	at org.junit.internal.runners.JUnit38ClassRunner.run(JUnit38ClassRunner.java:83)
	at org.apache.maven.surefire.junit4.JUnit4Provider.execute(JUnit4Provider.java:264)
	at org.apache.maven.surefire.junit4.JUnit4Provider.executeTestSet(JUnit4Provider.java:153)
	at org.apache.maven.surefire.junit4.JUnit4Provider.invoke(JUnit4Provider.java:124)
	at sun.reflect.NativeMethodAccessorImpl.invoke0(Native Method)
	at sun.reflect.NativeMethodAccessorImpl.invoke(NativeMethodAccessorImpl.java:57)
	at sun.reflect.DelegatingMethodAccessorImpl.invoke(DelegatingMethodAccessorImpl.java:43)
	at java.lang.reflect.Method.invoke(Method.java:606)
	at org.apache.maven.surefire.util.ReflectionUtils.invokeMethodWithArray2(ReflectionUtils.java:208)
	at org.apache.maven.surefire.booter.ProviderFactory$ProviderProxy.invoke(ProviderFactory.java:156)
	at org.apache.maven.surefire.booter.ProviderFactory.invokeProvider(ProviderFactory.java:82)
	at org.eclipse.tycho.surefire.osgibooter.OsgiSurefireBooter.run(OsgiSurefireBooter.java:91)
	at org.eclipse.tycho.surefire.osgibooter.AbstractUITestApplication$1.run(AbstractUITestApplication.java:35)
	at org.eclipse.swt.widgets.RunnableLock.run(RunnableLock.java:35)
	at org.eclipse.swt.widgets.Synchronizer.runAsyncMessages(Synchronizer.java:135)
	at org.eclipse.swt.widgets.Display.runAsyncMessages(Display.java:3537)
	at org.eclipse.swt.widgets.Display.readAndDispatch(Display.java:3189)
	at org.eclipse.ui.internal.Workbench.runEventLoop(Workbench.java:2701)
	at org.eclipse.ui.internal.Workbench.runUI(Workbench.java:2665)
	at org.eclipse.ui.internal.Workbench.access$4(Workbench.java:2499)
	at org.eclipse.ui.internal.Workbench$7.run(Workbench.java:679)
	at org.eclipse.core.databinding.observable.Realm.runWithDefault(Realm.java:332)
	at org.eclipse.ui.internal.Workbench.createAndRunWorkbench(Workbench.java:668)
	at org.eclipse.ui.PlatformUI.createAndRunWorkbench(PlatformUI.java:149)
	at org.eclipse.ui.internal.ide.application.IDEApplication.start(IDEApplication.java:124)
	at org.eclipse.tycho.surefire.osgibooter.UITestApplication.runApplication(UITestApplication.java:31)
	at org.eclipse.tycho.surefire.osgibooter.AbstractUITestApplication.run(AbstractUITestApplication.java:120)
	at org.eclipse.tycho.surefire.osgibooter.UITestApplication.start(UITestApplication.java:37)
	at org.eclipse.equinox.internal.app.EclipseAppHandle.run(EclipseAppHandle.java:196)
	at org.eclipse.core.runtime.internal.adaptor.EclipseAppLauncher.runApplication(EclipseAppLauncher.java:110)
	at org.eclipse.core.runtime.internal.adaptor.EclipseAppLauncher.start(EclipseAppLauncher.java:79)
	at org.eclipse.core.runtime.adaptor.EclipseStarter.run(EclipseStarter.java:353)
	at org.eclipse.core.runtime.adaptor.EclipseStarter.run(EclipseStarter.java:180)
	at sun.reflect.NativeMethodAccessorImpl.invoke0(Native Method)
	at sun.reflect.NativeMethodAccessorImpl.invoke(NativeMethodAccessorImpl.java:57)
	at sun.reflect.DelegatingMethodAccessorImpl.invoke(DelegatingMethodAccessorImpl.java:43)
	at java.lang.reflect.Method.invoke(Method.java:606)
	at org.eclipse.equinox.launcher.Main.invokeFramework(Main.java:629)
	at org.eclipse.equinox.launcher.Main.basicRun(Main.java:584)
	at org.eclipse.equinox.launcher.Main.run(Main.java:1438)
	at org.eclipse.equinox.launcher.Main.main(Main.java:1414)
=== testDefaultStatusHandler finished at: February 24, 2018 1:18:15 PM EST (duration: 189 ms)

=== testContributions started at: February 24, 2018 1:18:15 PM EST
=== testContributions finished at: February 24, 2018 1:18:15 PM EST (duration: 3 ms)

=== testModel started at: February 24, 2018 1:18:15 PM EST
=== testModel finished at: February 24, 2018 1:18:15 PM EST (duration: 1 ms)

=== testStepperContributions started at: February 24, 2018 1:18:15 PM EST
=== testStepperContributions finished at: February 24, 2018 1:18:15 PM EST (duration: 16 ms)

=== testStepGroupContributions started at: February 24, 2018 1:18:15 PM EST
=== testStepGroupContributions finished at: February 24, 2018 1:18:16 PM EST (duration: 61 ms)

=== testStepContributions started at: February 24, 2018 1:18:16 PM EST
=== testStepContributions finished at: February 24, 2018 1:18:16 PM EST (duration: 235 ms)

=== testExecuteStepGroup started at: February 24, 2018 1:18:16 PM EST
=== testExecuteStepGroup finished at: February 24, 2018 1:18:16 PM EST (duration: 75 ms)

=== testProcessModel started at: February 24, 2018 1:18:16 PM EST
=== testProcessModel finished at: February 24, 2018 1:18:34 PM EST (duration: 18268 ms)

=== testProcessLauncher started at: February 24, 2018 1:18:34 PM EST
=== testProcessLauncher finished at: February 24, 2018 1:18:36 PM EST (duration: 1710 ms)
Tests run: 20, Failures: 0, Errors: 0, Skipped: 0, Time elapsed: 28.938 sec - in org.eclipse.tcf.te.tests.suites.AllTests
testPendingOperationModelNode(org.eclipse.tcf.te.tests.model.ModelTestCase)  Time elapsed: 6.874 sec
testFileTransferItem(org.eclipse.tcf.te.tests.model.ModelTestCase)  Time elapsed: 0.026 sec
testModelNode(org.eclipse.tcf.te.tests.model.ModelTestCase)  Time elapsed: 0.046 sec
testPropertiesContainer(org.eclipse.tcf.te.tests.model.ModelTestCase)  Time elapsed: 0.004 sec
testModel(org.eclipse.tcf.te.tests.tcf.model.ModelTestCase)  Time elapsed: 0.009 sec
testElfUtils(org.eclipse.tcf.te.tests.utils.UtilityTestCase)  Time elapsed: 0.081 sec
testPrivateOrInternalClasses(org.eclipse.tcf.te.tests.concurrent.ConcurrentTestCase)  Time elapsed: 0.05 sec
testSingleThreadExecutorService(org.eclipse.tcf.te.tests.concurrent.ConcurrentTestCase)  Time elapsed: 1.109 sec
testAbstractDelegatingExecutorService(org.eclipse.tcf.te.tests.concurrent.ConcurrentTestCase)  Time elapsed: 0.01 sec
testStatusHandler(org.eclipse.tcf.te.tests.statushandler.StatusHandlerTestCase)  Time elapsed: 0.02 sec
testContributionsWithContext(org.eclipse.tcf.te.tests.statushandler.StatusHandlerTestCase)  Time elapsed: 0.025 sec
testDefaultStatusHandler(org.eclipse.tcf.te.tests.statushandler.StatusHandlerTestCase)  Time elapsed: 0.189 sec
testContributions(org.eclipse.tcf.te.tests.statushandler.StatusHandlerTestCase)  Time elapsed: 0.003 sec
testModel(org.eclipse.tcf.te.tests.tcf.model.ModelTestCase)  Time elapsed: 0.002 sec
testStepperContributions(org.eclipse.tcf.te.tests.stepper.StepperTests)  Time elapsed: 0.016 sec
testStepGroupContributions(org.eclipse.tcf.te.tests.stepper.StepperTests)  Time elapsed: 0.062 sec
testStepContributions(org.eclipse.tcf.te.tests.stepper.StepperTests)  Time elapsed: 0.235 sec
testExecuteStepGroup(org.eclipse.tcf.te.tests.stepper.StepperTests)  Time elapsed: 0.075 sec
testProcessModel(org.eclipse.tcf.te.tests.tcf.processes.model.ProcessModelTestCase)  Time elapsed: 18.269 sec
testProcessLauncher(org.eclipse.tcf.te.tests.tcf.processes.launcher.ProcessLauncherTestCase)  Time elapsed: 1.715 sec

Results :

Tests run: 20, Failures: 0, Errors: 0, Skipped: 0

[INFO] All tests passed!
[INFO] 
[INFO] --- maven-antrun-plugin:1.8:run (generate-report) @ org.eclipse.tcf.te.tests ---
Downloading from sonatype: https://oss.sonatype.org/content/repositories/public/org/jacoco/org.jacoco.ant/0.7.9/org.jacoco.ant-0.7.9.pom
Progress (1): 4.0 kB
                    
Downloaded from sonatype: https://oss.sonatype.org/content/repositories/public/org/jacoco/org.jacoco.ant/0.7.9/org.jacoco.ant-0.7.9.pom (4.0 kB at 36 kB/s)
Downloading from sonatype: https://oss.sonatype.org/content/repositories/public/org/jacoco/org.jacoco.ant/0.7.9/org.jacoco.ant-0.7.9.jar
Downloading from sonatype: https://oss.sonatype.org/content/repositories/public/org/jacoco/org.jacoco.agent/0.7.9/org.jacoco.agent-0.7.9.jar
Progress (1): 3.8/236 kB
Progress (2): 3.8/236 kB | 3.8/32 kB
Progress (2): 7.9/236 kB | 3.8/32 kB
Progress (2): 12/236 kB | 3.8/32 kB 
Progress (2): 16/236 kB | 3.8/32 kB
Progress (2): 20/236 kB | 3.8/32 kB
Progress (2): 24/236 kB | 3.8/32 kB
Progress (2): 28/236 kB | 3.8/32 kB
Progress (2): 32/236 kB | 3.8/32 kB
Progress (2): 37/236 kB | 3.8/32 kB
Progress (2): 37/236 kB | 7.9/32 kB
Progress (2): 37/236 kB | 12/32 kB 
Progress (2): 37/236 kB | 16/32 kB
Progress (2): 37/236 kB | 20/32 kB
Progress (2): 37/236 kB | 24/32 kB
Progress (2): 37/236 kB | 28/32 kB
Progress (2): 37/236 kB | 32 kB   
Progress (2): 41/236 kB | 32 kB
Progress (2): 45/236 kB | 32 kB
Progress (2): 49/236 kB | 32 kB
Progress (2): 53/236 kB | 32 kB
Progress (2): 57/236 kB | 32 kB
Progress (2): 61/236 kB | 32 kB
Progress (2): 65/236 kB | 32 kB
Progress (2): 69/236 kB | 32 kB
Progress (2): 73/236 kB | 32 kB
Progress (2): 74/236 kB | 32 kB
Progress (2): 78/236 kB | 32 kB
Progress (2): 82/236 kB | 32 kB
Progress (2): 86/236 kB | 32 kB
Progress (2): 91/236 kB | 32 kB
                               
Downloaded from sonatype: https://oss.sonatype.org/content/repositories/public/org/jacoco/org.jacoco.ant/0.7.9/org.jacoco.ant-0.7.9.jar (32 kB at 166 kB/s)
Progress (1): 95/236 kB
Progress (1): 99/236 kB
Progress (1): 103/236 kB
Progress (1): 107/236 kB
Progress (1): 111/236 kB
Progress (1): 115/236 kB
Progress (1): 119/236 kB
Progress (1): 123/236 kB
Progress (1): 127/236 kB
Progress (1): 131/236 kB
Progress (1): 136/236 kB
Progress (1): 140/236 kB
Progress (1): 144/236 kB
Progress (1): 148/236 kB
Progress (1): 152/236 kB
Progress (1): 156/236 kB
Progress (1): 160/236 kB
Progress (1): 164/236 kB
Progress (1): 168/236 kB
Progress (1): 172/236 kB
Progress (1): 177/236 kB
Progress (1): 181/236 kB
Progress (1): 185/236 kB
Progress (1): 189/236 kB
Progress (1): 193/236 kB
Progress (1): 197/236 kB
Progress (1): 201/236 kB
Progress (1): 205/236 kB
Progress (1): 209/236 kB
Progress (1): 213/236 kB
Progress (1): 218/236 kB
Progress (1): 222/236 kB
Progress (1): 226/236 kB
Progress (1): 230/236 kB
Progress (1): 234/236 kB
Progress (1): 236 kB    
                    
Downloaded from sonatype: https://oss.sonatype.org/content/repositories/public/org/jacoco/org.jacoco.agent/0.7.9/org.jacoco.agent-0.7.9.jar (236 kB at 821 kB/s)
[INFO] ------------------------------------------------------------------------
[INFO] Reactor Summary:
[INFO] 
[INFO] org.eclipse.tcf.core ............................... SUCCESS [09:24 min]
[INFO] org.eclipse.tcf .................................... SUCCESS [ 13.857 s]
[INFO] org.eclipse.tcf.debug .............................. SUCCESS [ 28.323 s]
[INFO] org.eclipse.tcf.debug.ui ........................... SUCCESS [ 39.996 s]
[INFO] org.eclipse.tcf.cdt.ui ............................. SUCCESS [ 21.845 s]
[INFO] org.eclipse.tcf.rse ................................ SUCCESS [ 15.894 s]
[INFO] org.eclipse.tcf.core.feature ....................... SUCCESS [  1.289 s]
[INFO] org.eclipse.tcf.core.sdk.feature ................... SUCCESS [  1.190 s]
[INFO] org.eclipse.tcf.feature ............................ SUCCESS [  1.252 s]
[INFO] org.eclipse.tcf.sdk.feature ........................ SUCCESS [  1.247 s]
[INFO] org.eclipse.tcf.cdt.feature ........................ SUCCESS [  1.154 s]
[INFO] org.eclipse.tcf.cdt.sdk.feature .................... SUCCESS [  2.638 s]
[INFO] org.eclipse.tcf.rse.feature ........................ SUCCESS [  1.526 s]
[INFO] org.eclipse.tcf.rse.sdk.feature .................... SUCCESS [  1.237 s]
[INFO] org.eclipse.tcf.te ................................. SUCCESS [  7.704 s]
[INFO] org.eclipse.tcf.te.runtime ......................... SUCCESS [ 16.721 s]
[INFO] org.eclipse.tcf.te.runtime.concurrent .............. SUCCESS [  9.552 s]
[INFO] org.eclipse.tcf.te.runtime.model ................... SUCCESS [  8.911 s]
[INFO] org.eclipse.tcf.te.runtime.services ................ SUCCESS [  9.149 s]
[INFO] org.eclipse.tcf.te.runtime.persistence ............. SUCCESS [ 12.131 s]
[INFO] org.eclipse.tcf.te.runtime.statushandler ........... SUCCESS [  9.180 s]
[INFO] org.eclipse.tcf.te.runtime.stepper ................. SUCCESS [ 12.586 s]
[INFO] org.eclipse.tcf.te.core ............................ SUCCESS [  9.308 s]
[INFO] org.eclipse.tcf.te.core.cdt ........................ SUCCESS [  8.115 s]
[INFO] org.eclipse.tcf.te.launch.core ..................... SUCCESS [ 12.870 s]
[INFO] org.eclipse.tcf.te.ui.swt .......................... SUCCESS [ 16.701 s]
[INFO] org.eclipse.tcf.te.ui.forms ........................ SUCCESS [ 12.840 s]
[INFO] org.eclipse.tcf.te.ui .............................. SUCCESS [ 19.168 s]
[INFO] org.eclipse.tcf.te.ui.controls ..................... SUCCESS [ 13.177 s]
[INFO] org.eclipse.tcf.te.ui.views ........................ SUCCESS [ 17.982 s]
[INFO] org.eclipse.tcf.te.launch.ui ....................... SUCCESS [ 15.279 s]
[INFO] org.eclipse.tcf.te.tcf.core ........................ SUCCESS [ 15.391 s]
[INFO] org.eclipse.tcf.te.tcf.core.model .................. SUCCESS [  7.726 s]
[INFO] org.eclipse.tcf.te.tcf.core.scripting .............. SUCCESS [ 10.271 s]
[INFO] org.eclipse.tcf.te.tcf.locator ..................... SUCCESS [ 18.877 s]
[INFO] org.eclipse.tcf.te.tcf.filesystem.core ............. SUCCESS [ 17.140 s]
[INFO] org.eclipse.tcf.te.tcf.log.core .................... SUCCESS [ 10.602 s]
[INFO] org.eclipse.tcf.te.tcf.ui .......................... SUCCESS [ 23.126 s]
[INFO] org.eclipse.tcf.te.tcf.filesystem.ui ............... SUCCESS [ 22.218 s]
[INFO] org.eclipse.tcf.te.tcf.processes.core .............. SUCCESS [ 15.376 s]
[INFO] org.eclipse.tcf.te.tcf.launch.cdt .................. SUCCESS [ 18.214 s]
[INFO] org.eclipse.tcf.te.tcf.launch.core ................. SUCCESS [ 13.593 s]
[INFO] org.eclipse.tcf.te.tcf.launch.ui ................... SUCCESS [ 15.736 s]
[INFO] org.eclipse.tcf.te.tcf.processes.ui ................ SUCCESS [ 16.554 s]
[INFO] org.eclipse.tcf.te.tcf.remote.core ................. SUCCESS [ 17.026 s]
[INFO] org.eclipse.tcf.te.tcf.remote.ui ................... SUCCESS [  9.386 s]
[INFO] org.eclipse.tcf.te.tcf.services.contexts ........... SUCCESS [  7.269 s]
[INFO] org.eclipse.tcf.te.tcf.terminals.core .............. SUCCESS [ 10.937 s]
[INFO] org.eclipse.tcf.te.tcf.terminals.ui ................ SUCCESS [  9.837 s]
[INFO] org.eclipse.tcf.te.tcf.ui.console .................. SUCCESS [ 10.812 s]
[INFO] org.eclipse.tcf.te.tcf.ui.views .................... SUCCESS [ 13.926 s]
[INFO] org.eclipse.tcf.te.ui.notifications ................ SUCCESS [ 11.988 s]
[INFO] org.eclipse.tcf.te.feature ......................... SUCCESS [  1.466 s]
[INFO] org.eclipse.tcf.te.sdk.feature ..................... SUCCESS [  1.530 s]
[INFO] org.eclipse.tcf.te.tcf.core.feature ................ SUCCESS [  1.938 s]
[INFO] org.eclipse.tcf.te.tcf.core.sdk.feature ............ SUCCESS [  1.795 s]
[INFO] org.eclipse.tcf.te.tcf.feature ..................... SUCCESS [  1.674 s]
[INFO] org.eclipse.tcf.te.tcf.sdk.feature ................. SUCCESS [  1.806 s]
[INFO] org.eclipse.tcf.te.tcf.launch.cdt.feature .......... SUCCESS [  2.500 s]
[INFO] org.eclipse.tcf.te.tcf.launch.cdt.sdk.feature ...... SUCCESS [  2.058 s]
[INFO] org.eclipse.tcf.te.tcf.remote.feature .............. SUCCESS [  1.672 s]
[INFO] org.eclipse.tcf.te.tcf.remote.sdk.feature .......... SUCCESS [  1.581 s]
[INFO] org.eclipse.tcf.repo ............................... SUCCESS [ 12.067 s]
[INFO] org.eclipse.tcf.te.tests ........................... FAILURE [01:55 min]
[INFO] org.eclipse.tcf.debug.test ......................... SKIPPED
[INFO] TCF and Target Explorer, Maven Master .............. SKIPPED
[INFO] ------------------------------------------------------------------------
[INFO] BUILD FAILURE
[INFO] ------------------------------------------------------------------------
[INFO] Total time: 41:26 min
[INFO] Finished at: 2018-02-24T13:18:50-05:00
[INFO] Final Memory: 420M/1614M
[INFO] ------------------------------------------------------------------------
Build timed out (after 360 minutes). Marking the build as aborted.
Terminating xvnc.
Build was aborted
[FINDBUGS] Skipping publisher since build result is ABORTED
[DRY] Skipping publisher since build result is ABORTED
Archiving artifacts
Recording test results
Java HotSpot(TM) 64-Bit Server VM warning: Exception java.lang.OutOfMemoryError occurred dispatching signal SIGTERM to handler- the VM may need to be forcibly terminated
Started calculate disk usage of build
Finished Calculation of disk usage of build in 0 seconds
Started calculate disk usage of workspace
Finished Calculation of disk usage of workspace in 0 seconds
Finished: ABORTED