AbortedConsole Output

Skipping 2,133 KB.. Full Log
ipse.org/content/repositories/cbi-releases/org/apache/maven/doxia/doxia-module-fml/1.0-alpha-10/doxia-module-fml-1.0-alpha-10.pom
Downloading from cbi-snapshots: https://repo.eclipse.org/content/repositories/cbi-snapshots/org/apache/maven/doxia/doxia-module-fml/1.0-alpha-10/doxia-module-fml-1.0-alpha-10.pom
Downloading from eclipse.maven.central.mirror: https://repo.eclipse.org/content/repositories/maven_central/org/apache/maven/doxia/doxia-module-fml/1.0-alpha-10/doxia-module-fml-1.0-alpha-10.pom
Progress (1): 2.5 kB
                    
Downloaded from eclipse.maven.central.mirror: https://repo.eclipse.org/content/repositories/maven_central/org/apache/maven/doxia/doxia-module-fml/1.0-alpha-10/doxia-module-fml-1.0-alpha-10.pom (2.5 kB at 94 kB/s)
Downloading from sonatype: https://oss.sonatype.org/content/repositories/public/org/apache/maven/doxia/doxia-module-xdoc/1.0-alpha-10/doxia-module-xdoc-1.0-alpha-10.pom
Downloading from cbi: https://repo.eclipse.org/content/repositories/cbi-releases/org/apache/maven/doxia/doxia-module-xdoc/1.0-alpha-10/doxia-module-xdoc-1.0-alpha-10.pom
Downloading from cbi-snapshots: https://repo.eclipse.org/content/repositories/cbi-snapshots/org/apache/maven/doxia/doxia-module-xdoc/1.0-alpha-10/doxia-module-xdoc-1.0-alpha-10.pom
Downloading from eclipse.maven.central.mirror: https://repo.eclipse.org/content/repositories/maven_central/org/apache/maven/doxia/doxia-module-xdoc/1.0-alpha-10/doxia-module-xdoc-1.0-alpha-10.pom
Progress (1): 2.2 kB
                    
Downloaded from eclipse.maven.central.mirror: https://repo.eclipse.org/content/repositories/maven_central/org/apache/maven/doxia/doxia-module-xdoc/1.0-alpha-10/doxia-module-xdoc-1.0-alpha-10.pom (2.2 kB at 79 kB/s)
Downloading from sonatype: https://oss.sonatype.org/content/repositories/public/org/apache/maven/doxia/doxia-module-xhtml/1.0-alpha-10/doxia-module-xhtml-1.0-alpha-10.pom
Downloading from cbi: https://repo.eclipse.org/content/repositories/cbi-releases/org/apache/maven/doxia/doxia-module-xhtml/1.0-alpha-10/doxia-module-xhtml-1.0-alpha-10.pom
Downloading from cbi-snapshots: https://repo.eclipse.org/content/repositories/cbi-snapshots/org/apache/maven/doxia/doxia-module-xhtml/1.0-alpha-10/doxia-module-xhtml-1.0-alpha-10.pom
Downloading from eclipse.maven.central.mirror: https://repo.eclipse.org/content/repositories/maven_central/org/apache/maven/doxia/doxia-module-xhtml/1.0-alpha-10/doxia-module-xhtml-1.0-alpha-10.pom
Progress (1): 1.6 kB
                    
Downloaded from eclipse.maven.central.mirror: https://repo.eclipse.org/content/repositories/maven_central/org/apache/maven/doxia/doxia-module-xhtml/1.0-alpha-10/doxia-module-xhtml-1.0-alpha-10.pom (1.6 kB at 65 kB/s)
Downloading from sonatype: https://oss.sonatype.org/content/repositories/public/org/codehaus/gmaven/runtime/gmaven-runtime-api/1.5/gmaven-runtime-api-1.5.jar
Downloading from sonatype: https://oss.sonatype.org/content/repositories/public/org/codehaus/gmaven/feature/gmaven-feature-api/1.5/gmaven-feature-api-1.5.jar
Downloading from sonatype: https://oss.sonatype.org/content/repositories/public/org/codehaus/gmaven/runtime/gmaven-runtime-loader/1.5/gmaven-runtime-loader-1.5.jar
Downloading from sonatype: https://oss.sonatype.org/content/repositories/public/org/codehaus/gmaven/feature/gmaven-feature-support/1.5/gmaven-feature-support-1.5.jar
Downloading from sonatype: https://oss.sonatype.org/content/repositories/public/org/codehaus/plexus/plexus-classworlds/2.4/plexus-classworlds-2.4.jar
Downloading from sonatype: https://oss.sonatype.org/content/repositories/public/org/codehaus/gmaven/runtime/gmaven-runtime-support/1.5/gmaven-runtime-support-1.5.jar
Progress (1): 4.1/13 kB
Progress (1): 7.8/13 kB
Progress (1): 12/13 kB 
Progress (1): 13 kB   
Progress (2): 13 kB | 4.1/17 kB
Progress (2): 13 kB | 7.8/17 kB
Progress (3): 13 kB | 7.8/17 kB | 4.1/25 kB
Progress (3): 13 kB | 12/17 kB | 4.1/25 kB 
Progress (4): 13 kB | 12/17 kB | 4.1/25 kB | 4.1/22 kB
Progress (4): 13 kB | 12/17 kB | 7.8/25 kB | 4.1/22 kB
Progress (4): 13 kB | 16/17 kB | 7.8/25 kB | 4.1/22 kB
Progress (4): 13 kB | 16/17 kB | 7.8/25 kB | 7.8/22 kB
Progress (4): 13 kB | 16/17 kB | 12/25 kB | 7.8/22 kB 
Progress (4): 13 kB | 17 kB | 12/25 kB | 7.8/22 kB   
Progress (4): 13 kB | 17 kB | 12/25 kB | 12/22 kB 
Progress (4): 13 kB | 17 kB | 16/25 kB | 12/22 kB
Progress (4): 13 kB | 17 kB | 16/25 kB | 16/22 kB
Progress (4): 13 kB | 17 kB | 20/25 kB | 16/22 kB
Progress (4): 13 kB | 17 kB | 20/25 kB | 20/22 kB
Progress (4): 13 kB | 17 kB | 24/25 kB | 20/22 kB
Progress (4): 13 kB | 17 kB | 24/25 kB | 22 kB   
Progress (4): 13 kB | 17 kB | 25 kB | 22 kB   
Progress (5): 13 kB | 17 kB | 25 kB | 22 kB | 4.1/80 kB
Progress (5): 13 kB | 17 kB | 25 kB | 22 kB | 7.8/80 kB
Progress (5): 13 kB | 17 kB | 25 kB | 22 kB | 12/80 kB 
Progress (5): 13 kB | 17 kB | 25 kB | 22 kB | 16/80 kB
Progress (5): 13 kB | 17 kB | 25 kB | 22 kB | 20/80 kB
Progress (5): 13 kB | 17 kB | 25 kB | 22 kB | 24/80 kB
Progress (5): 13 kB | 17 kB | 25 kB | 22 kB | 24/80 kB
                                                      
Downloaded from sonatype: https://oss.sonatype.org/content/repositories/public/org/codehaus/gmaven/runtime/gmaven-runtime-api/1.5/gmaven-runtime-api-1.5.jar (22 kB at 103 kB/s)
Downloading from sonatype: https://oss.sonatype.org/content/repositories/public/org/sonatype/gshell/gshell-io/2.4/gshell-io-2.4.jar
Downloaded from sonatype: https://oss.sonatype.org/content/repositories/public/org/codehaus/gmaven/feature/gmaven-feature-api/1.5/gmaven-feature-api-1.5.jar (17 kB at 80 kB/s)
Downloading from sonatype: https://oss.sonatype.org/content/repositories/public/com/thoughtworks/qdox/qdox/1.12/qdox-1.12.jar
Progress (3): 13 kB | 25 kB | 28/80 kB
Progress (3): 13 kB | 25 kB | 32/80 kB
Progress (3): 13 kB | 25 kB | 37/80 kB
Progress (3): 13 kB | 25 kB | 41/80 kB
Progress (3): 13 kB | 25 kB | 45/80 kB
Progress (3): 13 kB | 25 kB | 49/80 kB
Progress (3): 13 kB | 25 kB | 53/80 kB
Progress (3): 13 kB | 25 kB | 57/80 kB
                                      
Downloaded from sonatype: https://oss.sonatype.org/content/repositories/public/org/codehaus/gmaven/runtime/gmaven-runtime-loader/1.5/gmaven-runtime-loader-1.5.jar (25 kB at 110 kB/s)
Downloading from sonatype: https://oss.sonatype.org/content/repositories/public/org/apache/maven/maven-plugin-api/2.0.10/maven-plugin-api-2.0.10.jar
Progress (2): 13 kB | 61/80 kB
Progress (2): 13 kB | 65/80 kB
Progress (2): 13 kB | 69/80 kB
Progress (2): 13 kB | 73/80 kB
Progress (2): 13 kB | 77/80 kB
Progress (2): 13 kB | 80 kB   
                           
Downloaded from sonatype: https://oss.sonatype.org/content/repositories/public/org/codehaus/gmaven/feature/gmaven-feature-support/1.5/gmaven-feature-support-1.5.jar (13 kB at 53 kB/s)
Downloading from sonatype: https://oss.sonatype.org/content/repositories/public/org/apache/maven/maven-artifact-manager/2.0.2/maven-artifact-manager-2.0.2.jar
Downloading from sonatype: https://oss.sonatype.org/content/repositories/public/org/apache/maven/maven-repository-metadata/2.0.2/maven-repository-metadata-2.0.2.jar
Progress (2): 80 kB | 3.8/180 kB
Progress (2): 80 kB | 7.9/180 kB
Progress (2): 80 kB | 12/180 kB 
Progress (2): 80 kB | 16/180 kB
Progress (2): 80 kB | 20/180 kB
Progress (2): 80 kB | 24/180 kB
Progress (2): 80 kB | 28/180 kB
Progress (2): 80 kB | 32/180 kB
Progress (2): 80 kB | 37/180 kB
Progress (2): 80 kB | 37/180 kB
                               
Downloading from sonatype: https://oss.sonatype.org/content/repositories/public/org/codehaus/plexus/plexus-container-default/1.5.5/plexus-container-default-1.5.5.jar
Downloading from sonatype: https://oss.sonatype.org/content/repositories/public/org/apache/xbean/xbean-reflect/3.4/xbean-reflect-3.4.jar
Downloaded from sonatype: https://oss.sonatype.org/content/repositories/public/org/codehaus/gmaven/runtime/gmaven-runtime-support/1.5/gmaven-runtime-support-1.5.jar (80 kB at 261 kB/s)
Downloading from sonatype: https://oss.sonatype.org/content/repositories/public/log4j/log4j/1.2.12/log4j-1.2.12.jar
Progress (1): 41/180 kB
Progress (1): 45/180 kB
Progress (1): 49/180 kB
Progress (1): 53/180 kB
Progress (1): 57/180 kB
Progress (1): 61/180 kB
Progress (1): 66/180 kB
Progress (1): 70/180 kB
Progress (1): 74/180 kB
Progress (1): 78/180 kB
Progress (1): 82/180 kB
Progress (1): 86/180 kB
Progress (1): 90/180 kB
Progress (1): 94/180 kB
Progress (1): 98/180 kB
Progress (1): 102/180 kB
Progress (1): 106/180 kB
Progress (1): 111/180 kB
Progress (1): 115/180 kB
Progress (1): 119/180 kB
Progress (1): 123/180 kB
Progress (1): 127/180 kB
Progress (1): 131/180 kB
Progress (1): 135/180 kB
Progress (1): 139/180 kB
Progress (1): 143/180 kB
Progress (1): 147/180 kB
Progress (1): 152/180 kB
Progress (1): 156/180 kB
Progress (1): 160/180 kB
Progress (1): 164/180 kB
Progress (1): 168/180 kB
Progress (2): 168/180 kB | 4.1/358 kB
Progress (2): 168/180 kB | 7.8/358 kB
Progress (2): 168/180 kB | 7.9/358 kB
Progress (2): 172/180 kB | 7.9/358 kB
Progress (2): 176/180 kB | 7.9/358 kB
Progress (2): 180 kB | 7.9/358 kB    
                                 
Downloading from sonatype: https://oss.sonatype.org/content/repositories/public/commons-logging/commons-logging-api/1.1/commons-logging-api-1.1.jar
Progress (2): 180 kB | 12/358 kB
Progress (2): 180 kB | 16/358 kB
Progress (2): 180 kB | 20/358 kB
Progress (2): 180 kB | 24/358 kB
Progress (2): 180 kB | 28/358 kB
                                
Downloading from sonatype: https://oss.sonatype.org/content/repositories/public/com/google/collections/google-collections/1.0/google-collections-1.0.jar
Progress (2): 180 kB | 32/358 kB
Progress (2): 180 kB | 37/358 kB
Progress (2): 180 kB | 41/358 kB
Progress (2): 180 kB | 45/358 kB
Progress (2): 180 kB | 49/358 kB
Progress (2): 180 kB | 53/358 kB
Progress (2): 180 kB | 57/358 kB
Progress (2): 180 kB | 61/358 kB
                                
Downloading from sonatype: https://oss.sonatype.org/content/repositories/public/org/apache/maven/maven-artifact/2.0.10/maven-artifact-2.0.10.jar
Downloaded from sonatype: https://oss.sonatype.org/content/repositories/public/com/thoughtworks/qdox/qdox/1.12/qdox-1.12.jar (180 kB at 423 kB/s)
Downloading from sonatype: https://oss.sonatype.org/content/repositories/public/org/apache/maven/maven-plugin-descriptor/2.0.10/maven-plugin-descriptor-2.0.10.jar
Progress (1): 65/358 kB
Progress (1): 69/358 kB
Progress (1): 73/358 kB
Progress (1): 77/358 kB
Progress (1): 82/358 kB
Progress (1): 86/358 kB
Progress (1): 90/358 kB
Progress (1): 94/358 kB
Progress (1): 98/358 kB
Progress (1): 102/358 kB
Progress (1): 106/358 kB
Progress (1): 110/358 kB
Progress (1): 114/358 kB
Progress (1): 118/358 kB
Progress (1): 123/358 kB
Progress (1): 127/358 kB
                        
Downloading from sonatype: https://oss.sonatype.org/content/repositories/public/org/apache/maven/reporting/maven-reporting-impl/2.0.4.1/maven-reporting-impl-2.0.4.1.jar
Progress (1): 131/358 kB
Progress (1): 135/358 kB
Progress (1): 139/358 kB
Progress (1): 143/358 kB
Progress (1): 147/358 kB
Progress (1): 151/358 kB
Progress (1): 155/358 kB
Progress (1): 159/358 kB
Progress (1): 164/358 kB
Progress (1): 168/358 kB
Progress (1): 172/358 kB
Progress (1): 176/358 kB
Progress (1): 180/358 kB
Progress (1): 184/358 kB
Progress (1): 188/358 kB
Progress (1): 192/358 kB
Progress (1): 196/358 kB
Progress (1): 200/358 kB
Progress (1): 204/358 kB
Progress (1): 209/358 kB
Progress (1): 213/358 kB
Progress (1): 217/358 kB
Progress (1): 221/358 kB
Progress (1): 225/358 kB
                        
Downloading from sonatype: https://oss.sonatype.org/content/repositories/public/org/apache/maven/maven-model/2.0.10/maven-model-2.0.10.jar
Progress (1): 229/358 kB
Progress (1): 233/358 kB
Progress (1): 237/358 kB
Progress (1): 241/358 kB
Progress (1): 245/358 kB
Progress (1): 250/358 kB
Progress (1): 254/358 kB
Progress (1): 258/358 kB
Progress (1): 262/358 kB
Progress (1): 266/358 kB
Progress (1): 270/358 kB
Progress (1): 274/358 kB
Progress (1): 278/358 kB
Progress (1): 282/358 kB
Progress (1): 286/358 kB
Progress (1): 290/358 kB
Progress (1): 295/358 kB
Progress (1): 299/358 kB
Progress (1): 303/358 kB
Progress (1): 307/358 kB
Progress (1): 311/358 kB
Progress (1): 315/358 kB
Progress (1): 319/358 kB
Progress (1): 323/358 kB
                        
Downloading from sonatype: https://oss.sonatype.org/content/repositories/public/org/apache/maven/doxia/doxia-core/1.0-alpha-10/doxia-core-1.0-alpha-10.jar
Progress (1): 327/358 kB
Progress (1): 331/358 kB
Progress (1): 336/358 kB
Progress (1): 340/358 kB
Progress (1): 344/358 kB
Progress (1): 348/358 kB
Progress (1): 352/358 kB
Progress (1): 356/358 kB
Progress (1): 358 kB    
                    
Downloading from sonatype: https://oss.sonatype.org/content/repositories/public/org/apache/maven/doxia/doxia-sink-api/1.0-alpha-10/doxia-sink-api-1.0-alpha-10.jar
Downloading from sonatype: https://oss.sonatype.org/content/repositories/public/org/apache/maven/reporting/maven-reporting-api/2.0.4/maven-reporting-api-2.0.4.jar
Downloaded from sonatype: https://oss.sonatype.org/content/repositories/public/log4j/log4j/1.2.12/log4j-1.2.12.jar (358 kB at 598 kB/s)
Downloading from sonatype: https://oss.sonatype.org/content/repositories/public/org/apache/maven/doxia/doxia-site-renderer/1.0-alpha-10/doxia-site-renderer-1.0-alpha-10.jar
Downloading from sonatype: https://oss.sonatype.org/content/repositories/public/org/apache/maven/doxia/doxia-decoration-model/1.0-alpha-10/doxia-decoration-model-1.0-alpha-10.jar
Downloading from sonatype: https://oss.sonatype.org/content/repositories/public/org/apache/maven/doxia/doxia-module-apt/1.0-alpha-10/doxia-module-apt-1.0-alpha-10.jar
Downloading from sonatype: https://oss.sonatype.org/content/repositories/public/org/apache/maven/doxia/doxia-module-fml/1.0-alpha-10/doxia-module-fml-1.0-alpha-10.jar
Downloading from sonatype: https://oss.sonatype.org/content/repositories/public/org/apache/maven/doxia/doxia-module-xdoc/1.0-alpha-10/doxia-module-xdoc-1.0-alpha-10.jar
Downloading from sonatype: https://oss.sonatype.org/content/repositories/public/org/apache/maven/doxia/doxia-module-xhtml/1.0-alpha-10/doxia-module-xhtml-1.0-alpha-10.jar
Downloading from sonatype: https://oss.sonatype.org/content/repositories/public/org/slf4j/slf4j-api/1.5.10/slf4j-api-1.5.10.jar
Downloading from sonatype: https://oss.sonatype.org/content/repositories/public/org/sonatype/gossip/gossip/1.2/gossip-1.2.jar
Progress (1): 4.1/24 kB
Progress (1): 7.8/24 kB
Progress (1): 12/24 kB 
Progress (1): 16/24 kB
Progress (1): 20/24 kB
Progress (1): 24 kB   
                   
Downloaded from sonatype: https://oss.sonatype.org/content/repositories/public/org/slf4j/slf4j-api/1.5.10/slf4j-api-1.5.10.jar (24 kB at 25 kB/s)
Downloading from cbi: https://repo.eclipse.org/content/repositories/cbi-releases/org/codehaus/plexus/plexus-classworlds/2.4/plexus-classworlds-2.4.jar
Downloading from cbi: https://repo.eclipse.org/content/repositories/cbi-releases/org/sonatype/gshell/gshell-io/2.4/gshell-io-2.4.jar
Downloading from cbi: https://repo.eclipse.org/content/repositories/cbi-releases/org/apache/maven/maven-plugin-api/2.0.10/maven-plugin-api-2.0.10.jar
Downloading from cbi: https://repo.eclipse.org/content/repositories/cbi-releases/org/apache/maven/maven-artifact-manager/2.0.2/maven-artifact-manager-2.0.2.jar
Downloading from cbi: https://repo.eclipse.org/content/repositories/cbi-releases/org/apache/maven/maven-repository-metadata/2.0.2/maven-repository-metadata-2.0.2.jar
Downloading from cbi: https://repo.eclipse.org/content/repositories/cbi-releases/org/codehaus/plexus/plexus-container-default/1.5.5/plexus-container-default-1.5.5.jar
Downloading from cbi: https://repo.eclipse.org/content/repositories/cbi-releases/org/apache/xbean/xbean-reflect/3.4/xbean-reflect-3.4.jar
Downloading from cbi: https://repo.eclipse.org/content/repositories/cbi-releases/commons-logging/commons-logging-api/1.1/commons-logging-api-1.1.jar
Downloading from cbi: https://repo.eclipse.org/content/repositories/cbi-releases/com/google/collections/google-collections/1.0/google-collections-1.0.jar
Downloading from cbi: https://repo.eclipse.org/content/repositories/cbi-releases/org/apache/maven/maven-artifact/2.0.10/maven-artifact-2.0.10.jar
Downloading from cbi: https://repo.eclipse.org/content/repositories/cbi-releases/org/apache/maven/maven-plugin-descriptor/2.0.10/maven-plugin-descriptor-2.0.10.jar
Downloading from cbi: https://repo.eclipse.org/content/repositories/cbi-releases/org/apache/maven/reporting/maven-reporting-impl/2.0.4.1/maven-reporting-impl-2.0.4.1.jar
Downloading from cbi: https://repo.eclipse.org/content/repositories/cbi-releases/org/apache/maven/maven-model/2.0.10/maven-model-2.0.10.jar
Downloading from cbi: https://repo.eclipse.org/content/repositories/cbi-releases/org/apache/maven/doxia/doxia-core/1.0-alpha-10/doxia-core-1.0-alpha-10.jar
Downloading from cbi: https://repo.eclipse.org/content/repositories/cbi-releases/org/apache/maven/reporting/maven-reporting-api/2.0.4/maven-reporting-api-2.0.4.jar
Downloading from cbi: https://repo.eclipse.org/content/repositories/cbi-releases/org/apache/maven/doxia/doxia-sink-api/1.0-alpha-10/doxia-sink-api-1.0-alpha-10.jar
Downloading from cbi: https://repo.eclipse.org/content/repositories/cbi-releases/org/apache/maven/doxia/doxia-site-renderer/1.0-alpha-10/doxia-site-renderer-1.0-alpha-10.jar
Downloading from cbi: https://repo.eclipse.org/content/repositories/cbi-releases/org/apache/maven/doxia/doxia-decoration-model/1.0-alpha-10/doxia-decoration-model-1.0-alpha-10.jar
Downloading from cbi: https://repo.eclipse.org/content/repositories/cbi-releases/org/apache/maven/doxia/doxia-module-apt/1.0-alpha-10/doxia-module-apt-1.0-alpha-10.jar
Downloading from cbi: https://repo.eclipse.org/content/repositories/cbi-releases/org/apache/maven/doxia/doxia-module-fml/1.0-alpha-10/doxia-module-fml-1.0-alpha-10.jar
Downloading from cbi: https://repo.eclipse.org/content/repositories/cbi-releases/org/apache/maven/doxia/doxia-module-xdoc/1.0-alpha-10/doxia-module-xdoc-1.0-alpha-10.jar
Downloading from cbi: https://repo.eclipse.org/content/repositories/cbi-releases/org/apache/maven/doxia/doxia-module-xhtml/1.0-alpha-10/doxia-module-xhtml-1.0-alpha-10.jar
Downloading from cbi: https://repo.eclipse.org/content/repositories/cbi-releases/org/sonatype/gossip/gossip/1.2/gossip-1.2.jar
Downloading from cbi-snapshots: https://repo.eclipse.org/content/repositories/cbi-snapshots/org/codehaus/plexus/plexus-classworlds/2.4/plexus-classworlds-2.4.jar
Downloading from cbi-snapshots: https://repo.eclipse.org/content/repositories/cbi-snapshots/org/sonatype/gshell/gshell-io/2.4/gshell-io-2.4.jar
Downloading from cbi-snapshots: https://repo.eclipse.org/content/repositories/cbi-snapshots/org/apache/maven/maven-plugin-api/2.0.10/maven-plugin-api-2.0.10.jar
Downloading from cbi-snapshots: https://repo.eclipse.org/content/repositories/cbi-snapshots/org/apache/maven/maven-artifact-manager/2.0.2/maven-artifact-manager-2.0.2.jar
Downloading from cbi-snapshots: https://repo.eclipse.org/content/repositories/cbi-snapshots/org/apache/maven/maven-repository-metadata/2.0.2/maven-repository-metadata-2.0.2.jar
Downloading from cbi-snapshots: https://repo.eclipse.org/content/repositories/cbi-snapshots/org/codehaus/plexus/plexus-container-default/1.5.5/plexus-container-default-1.5.5.jar
Downloading from cbi-snapshots: https://repo.eclipse.org/content/repositories/cbi-snapshots/org/apache/xbean/xbean-reflect/3.4/xbean-reflect-3.4.jar
Downloading from cbi-snapshots: https://repo.eclipse.org/content/repositories/cbi-snapshots/commons-logging/commons-logging-api/1.1/commons-logging-api-1.1.jar
Downloading from cbi-snapshots: https://repo.eclipse.org/content/repositories/cbi-snapshots/com/google/collections/google-collections/1.0/google-collections-1.0.jar
Downloading from cbi-snapshots: https://repo.eclipse.org/content/repositories/cbi-snapshots/org/apache/maven/maven-artifact/2.0.10/maven-artifact-2.0.10.jar
Downloading from cbi-snapshots: https://repo.eclipse.org/content/repositories/cbi-snapshots/org/apache/maven/maven-plugin-descriptor/2.0.10/maven-plugin-descriptor-2.0.10.jar
Downloading from cbi-snapshots: https://repo.eclipse.org/content/repositories/cbi-snapshots/org/apache/maven/reporting/maven-reporting-impl/2.0.4.1/maven-reporting-impl-2.0.4.1.jar
Downloading from cbi-snapshots: https://repo.eclipse.org/content/repositories/cbi-snapshots/org/apache/maven/maven-model/2.0.10/maven-model-2.0.10.jar
Downloading from cbi-snapshots: https://repo.eclipse.org/content/repositories/cbi-snapshots/org/apache/maven/doxia/doxia-core/1.0-alpha-10/doxia-core-1.0-alpha-10.jar
Downloading from cbi-snapshots: https://repo.eclipse.org/content/repositories/cbi-snapshots/org/apache/maven/doxia/doxia-sink-api/1.0-alpha-10/doxia-sink-api-1.0-alpha-10.jar
Downloading from cbi-snapshots: https://repo.eclipse.org/content/repositories/cbi-snapshots/org/apache/maven/reporting/maven-reporting-api/2.0.4/maven-reporting-api-2.0.4.jar
Downloading from cbi-snapshots: https://repo.eclipse.org/content/repositories/cbi-snapshots/org/apache/maven/doxia/doxia-site-renderer/1.0-alpha-10/doxia-site-renderer-1.0-alpha-10.jar
Downloading from cbi-snapshots: https://repo.eclipse.org/content/repositories/cbi-snapshots/org/apache/maven/doxia/doxia-decoration-model/1.0-alpha-10/doxia-decoration-model-1.0-alpha-10.jar
Downloading from cbi-snapshots: https://repo.eclipse.org/content/repositories/cbi-snapshots/org/apache/maven/doxia/doxia-module-apt/1.0-alpha-10/doxia-module-apt-1.0-alpha-10.jar
Downloading from cbi-snapshots: https://repo.eclipse.org/content/repositories/cbi-snapshots/org/apache/maven/doxia/doxia-module-fml/1.0-alpha-10/doxia-module-fml-1.0-alpha-10.jar
Downloading from cbi-snapshots: https://repo.eclipse.org/content/repositories/cbi-snapshots/org/apache/maven/doxia/doxia-module-xdoc/1.0-alpha-10/doxia-module-xdoc-1.0-alpha-10.jar
Downloading from cbi-snapshots: https://repo.eclipse.org/content/repositories/cbi-snapshots/org/apache/maven/doxia/doxia-module-xhtml/1.0-alpha-10/doxia-module-xhtml-1.0-alpha-10.jar
Downloading from cbi-snapshots: https://repo.eclipse.org/content/repositories/cbi-snapshots/org/sonatype/gossip/gossip/1.2/gossip-1.2.jar
Downloading from eclipse.maven.central.mirror: https://repo.eclipse.org/content/repositories/maven_central/org/codehaus/plexus/plexus-classworlds/2.4/plexus-classworlds-2.4.jar
Downloading from eclipse.maven.central.mirror: https://repo.eclipse.org/content/repositories/maven_central/org/sonatype/gshell/gshell-io/2.4/gshell-io-2.4.jar
Downloading from eclipse.maven.central.mirror: https://repo.eclipse.org/content/repositories/maven_central/org/apache/maven/maven-plugin-api/2.0.10/maven-plugin-api-2.0.10.jar
Downloading from eclipse.maven.central.mirror: https://repo.eclipse.org/content/repositories/maven_central/org/apache/maven/maven-artifact-manager/2.0.2/maven-artifact-manager-2.0.2.jar
Downloading from eclipse.maven.central.mirror: https://repo.eclipse.org/content/repositories/maven_central/org/apache/maven/maven-repository-metadata/2.0.2/maven-repository-metadata-2.0.2.jar
Progress (1): 4.1/13 kB
Progress (1): 7.7/13 kB
Progress (1): 12/13 kB 
Progress (1): 13 kB   
Progress (2): 13 kB | 4.1/47 kB
Progress (2): 13 kB | 7.7/47 kB
Progress (2): 13 kB | 12/47 kB 
Progress (2): 13 kB | 16/47 kB
Progress (2): 13 kB | 20/47 kB
Progress (2): 13 kB | 24/47 kB
Progress (2): 13 kB | 28/47 kB
Progress (2): 13 kB | 32/47 kB
Progress (2): 13 kB | 36/47 kB
Progress (2): 13 kB | 40/47 kB
Progress (2): 13 kB | 44/47 kB
Progress (2): 13 kB | 47 kB   
                           
Downloaded from eclipse.maven.central.mirror: https://repo.eclipse.org/content/repositories/maven_central/org/apache/maven/maven-plugin-api/2.0.10/maven-plugin-api-2.0.10.jar (13 kB at 222 kB/s)
Downloading from eclipse.maven.central.mirror: https://repo.eclipse.org/content/repositories/maven_central/org/codehaus/plexus/plexus-container-default/1.5.5/plexus-container-default-1.5.5.jar
Progress (2): 47 kB | 4.1/29 kB
Progress (2): 47 kB | 7.7/29 kB
Progress (2): 47 kB | 12/29 kB 
Progress (2): 47 kB | 16/29 kB
Progress (2): 47 kB | 20/29 kB
Progress (2): 47 kB | 24/29 kB
Progress (2): 47 kB | 28/29 kB
Progress (2): 47 kB | 29 kB   
                           
Downloaded from eclipse.maven.central.mirror: https://repo.eclipse.org/content/repositories/maven_central/org/codehaus/plexus/plexus-classworlds/2.4/plexus-classworlds-2.4.jar (47 kB at 724 kB/s)
Downloading from eclipse.maven.central.mirror: https://repo.eclipse.org/content/repositories/maven_central/org/apache/xbean/xbean-reflect/3.4/xbean-reflect-3.4.jar
Progress (2): 29 kB | 4.1/217 kB
Progress (2): 29 kB | 7.7/217 kB
Progress (2): 29 kB | 12/217 kB 
Progress (2): 29 kB | 16/217 kB
Progress (2): 29 kB | 20/217 kB
Progress (2): 29 kB | 24/217 kB
Progress (2): 29 kB | 28/217 kB
Progress (2): 29 kB | 32/217 kB
Progress (2): 29 kB | 33/217 kB
Progress (3): 29 kB | 33/217 kB | 4.1/20 kB
Progress (3): 29 kB | 33/217 kB | 7.7/20 kB
Progress (3): 29 kB | 37/217 kB | 7.7/20 kB
Progress (3): 29 kB | 37/217 kB | 12/20 kB 
Progress (3): 29 kB | 41/217 kB | 12/20 kB
Progress (3): 29 kB | 41/217 kB | 16/20 kB
Progress (3): 29 kB | 41/217 kB | 20 kB   
Progress (3): 29 kB | 45/217 kB | 20 kB
Progress (3): 29 kB | 49/217 kB | 20 kB
Progress (3): 29 kB | 53/217 kB | 20 kB
Progress (3): 29 kB | 57/217 kB | 20 kB
                                       
Downloaded from eclipse.maven.central.mirror: https://repo.eclipse.org/content/repositories/maven_central/org/sonatype/gshell/gshell-io/2.4/gshell-io-2.4.jar (29 kB at 349 kB/s)
Downloading from eclipse.maven.central.mirror: https://repo.eclipse.org/content/repositories/maven_central/commons-logging/commons-logging-api/1.1/commons-logging-api-1.1.jar
Progress (2): 61/217 kB | 20 kB
Progress (2): 65/217 kB | 20 kB
Progress (2): 66/217 kB | 20 kB
Progress (2): 70/217 kB | 20 kB
Progress (2): 74/217 kB | 20 kB
Progress (2): 78/217 kB | 20 kB
Progress (2): 82/217 kB | 20 kB
Progress (2): 86/217 kB | 20 kB
Progress (2): 90/217 kB | 20 kB
Progress (2): 94/217 kB | 20 kB
Progress (2): 98/217 kB | 20 kB
Progress (2): 102/217 kB | 20 kB
Progress (2): 106/217 kB | 20 kB
Progress (2): 110/217 kB | 20 kB
Progress (2): 114/217 kB | 20 kB
Progress (2): 118/217 kB | 20 kB
Progress (2): 122/217 kB | 20 kB
Progress (2): 126/217 kB | 20 kB
Progress (2): 130/217 kB | 20 kB
Progress (2): 134/217 kB | 20 kB
Progress (2): 138/217 kB | 20 kB
Progress (2): 142/217 kB | 20 kB
Progress (2): 146/217 kB | 20 kB
Progress (2): 150/217 kB | 20 kB
Progress (2): 154/217 kB | 20 kB
Progress (2): 158/217 kB | 20 kB
Progress (2): 162/217 kB | 20 kB
Progress (3): 162/217 kB | 20 kB | 4.1/49 kB
Progress (3): 162/217 kB | 20 kB | 7.7/49 kB
Progress (3): 166/217 kB | 20 kB | 7.7/49 kB
Progress (3): 170/217 kB | 20 kB | 7.7/49 kB
Progress (3): 170/217 kB | 20 kB | 12/49 kB 
Progress (3): 170/217 kB | 20 kB | 16/49 kB
Progress (3): 170/217 kB | 20 kB | 20/49 kB
Progress (3): 174/217 kB | 20 kB | 20/49 kB
Progress (3): 174/217 kB | 20 kB | 24/49 kB
Progress (3): 178/217 kB | 20 kB | 24/49 kB
Progress (3): 178/217 kB | 20 kB | 28/49 kB
Progress (3): 178/217 kB | 20 kB | 32/49 kB
Progress (3): 182/217 kB | 20 kB | 32/49 kB
Progress (3): 186/217 kB | 20 kB | 32/49 kB
Progress (3): 186/217 kB | 20 kB | 36/49 kB
Progress (3): 186/217 kB | 20 kB | 40/49 kB
Progress (3): 190/217 kB | 20 kB | 40/49 kB
Progress (3): 190/217 kB | 20 kB | 44/49 kB
Progress (3): 194/217 kB | 20 kB | 44/49 kB
Progress (3): 194/217 kB | 20 kB | 48/49 kB
Progress (3): 194/217 kB | 20 kB | 49 kB   
Progress (3): 198/217 kB | 20 kB | 49 kB
Progress (3): 202/217 kB | 20 kB | 49 kB
Progress (3): 206/217 kB | 20 kB | 49 kB
Progress (3): 210/217 kB | 20 kB | 49 kB
Progress (4): 210/217 kB | 20 kB | 49 kB | 4.1/134 kB
Progress (4): 214/217 kB | 20 kB | 49 kB | 4.1/134 kB
Progress (4): 217 kB | 20 kB | 49 kB | 4.1/134 kB    
Progress (4): 217 kB | 20 kB | 49 kB | 7.7/134 kB
Progress (4): 217 kB | 20 kB | 49 kB | 12/134 kB 
Progress (4): 217 kB | 20 kB | 49 kB | 16/134 kB
Progress (4): 217 kB | 20 kB | 49 kB | 20/134 kB
Progress (4): 217 kB | 20 kB | 49 kB | 24/134 kB
Progress (4): 217 kB | 20 kB | 49 kB | 28/134 kB
Progress (4): 217 kB | 20 kB | 49 kB | 32/134 kB
Progress (4): 217 kB | 20 kB | 49 kB | 33/134 kB
Progress (4): 217 kB | 20 kB | 49 kB | 37/134 kB
Progress (4): 217 kB | 20 kB | 49 kB | 41/134 kB
Progress (4): 217 kB | 20 kB | 49 kB | 45/134 kB
Progress (4): 217 kB | 20 kB | 49 kB | 49/134 kB
Progress (4): 217 kB | 20 kB | 49 kB | 53/134 kB
Progress (4): 217 kB | 20 kB | 49 kB | 57/134 kB
Progress (4): 217 kB | 20 kB | 49 kB | 61/134 kB
Progress (4): 217 kB | 20 kB | 49 kB | 65/134 kB
Progress (4): 217 kB | 20 kB | 49 kB | 69/134 kB
Progress (4): 217 kB | 20 kB | 49 kB | 73/134 kB
Progress (4): 217 kB | 20 kB | 49 kB | 77/134 kB
Progress (4): 217 kB | 20 kB | 49 kB | 81/134 kB
Progress (4): 217 kB | 20 kB | 49 kB | 85/134 kB
Progress (4): 217 kB | 20 kB | 49 kB | 89/134 kB
Progress (4): 217 kB | 20 kB | 49 kB | 93/134 kB
Progress (4): 217 kB | 20 kB | 49 kB | 97/134 kB
Progress (5): 217 kB | 20 kB | 49 kB | 97/134 kB | 4.1/45 kB
Progress (5): 217 kB | 20 kB | 49 kB | 97/134 kB | 7.7/45 kB
Progress (5): 217 kB | 20 kB | 49 kB | 101/134 kB | 7.7/45 kB
Progress (5): 217 kB | 20 kB | 49 kB | 105/134 kB | 7.7/45 kB
Progress (5): 217 kB | 20 kB | 49 kB | 105/134 kB | 12/45 kB 
Progress (5): 217 kB | 20 kB | 49 kB | 105/134 kB | 16/45 kB
Progress (5): 217 kB | 20 kB | 49 kB | 109/134 kB | 16/45 kB
Progress (5): 217 kB | 20 kB | 49 kB | 109/134 kB | 20/45 kB
Progress (5): 217 kB | 20 kB | 49 kB | 113/134 kB | 20/45 kB
Progress (5): 217 kB | 20 kB | 49 kB | 113/134 kB | 24/45 kB
Progress (5): 217 kB | 20 kB | 49 kB | 113/134 kB | 28/45 kB
Progress (5): 217 kB | 20 kB | 49 kB | 117/134 kB | 28/45 kB
Progress (5): 217 kB | 20 kB | 49 kB | 117/134 kB | 32/45 kB
Progress (5): 217 kB | 20 kB | 49 kB | 121/134 kB | 32/45 kB
Progress (5): 217 kB | 20 kB | 49 kB | 121/134 kB | 33/45 kB
Progress (5): 217 kB | 20 kB | 49 kB | 121/134 kB | 37/45 kB
Progress (5): 217 kB | 20 kB | 49 kB | 121/134 kB | 41/45 kB
Progress (5): 217 kB | 20 kB | 49 kB | 125/134 kB | 41/45 kB
Progress (5): 217 kB | 20 kB | 49 kB | 129/134 kB | 41/45 kB
Progress (5): 217 kB | 20 kB | 49 kB | 129/134 kB | 45 kB   
Progress (5): 217 kB | 20 kB | 49 kB | 133/134 kB | 45 kB
Progress (5): 217 kB | 20 kB | 49 kB | 134 kB | 45 kB    
                                                     
Downloaded from eclipse.maven.central.mirror: https://repo.eclipse.org/content/repositories/maven_central/org/codehaus/plexus/plexus-container-default/1.5.5/plexus-container-default-1.5.5.jar (217 kB at 2.1 MB/s)
Downloading from eclipse.maven.central.mirror: https://repo.eclipse.org/content/repositories/maven_central/com/google/collections/google-collections/1.0/google-collections-1.0.jar
Downloaded from eclipse.maven.central.mirror: https://repo.eclipse.org/content/repositories/maven_central/org/apache/maven/maven-repository-metadata/2.0.2/maven-repository-metadata-2.0.2.jar (20 kB at 193 kB/s)
Downloading from eclipse.maven.central.mirror: https://repo.eclipse.org/content/repositories/maven_central/org/apache/maven/maven-artifact/2.0.10/maven-artifact-2.0.10.jar
Downloaded from eclipse.maven.central.mirror: https://repo.eclipse.org/content/repositories/maven_central/org/apache/maven/maven-artifact-manager/2.0.2/maven-artifact-manager-2.0.2.jar (49 kB at 482 kB/s)
Downloading from eclipse.maven.central.mirror: https://repo.eclipse.org/content/repositories/maven_central/org/apache/maven/maven-plugin-descriptor/2.0.10/maven-plugin-descriptor-2.0.10.jar
Downloaded from eclipse.maven.central.mirror: https://repo.eclipse.org/content/repositories/maven_central/commons-logging/commons-logging-api/1.1/commons-logging-api-1.1.jar (45 kB at 433 kB/s)
Downloading from eclipse.maven.central.mirror: https://repo.eclipse.org/content/repositories/maven_central/org/apache/maven/reporting/maven-reporting-impl/2.0.4.1/maven-reporting-impl-2.0.4.1.jar
Progress (2): 134 kB | 4.1/39 kB
Progress (2): 134 kB | 7.7/39 kB
Progress (2): 134 kB | 12/39 kB 
Progress (2): 134 kB | 16/39 kB
Progress (3): 134 kB | 16/39 kB | 4.1/89 kB
Progress (3): 134 kB | 20/39 kB | 4.1/89 kB
Progress (3): 134 kB | 24/39 kB | 4.1/89 kB
Progress (3): 134 kB | 24/39 kB | 7.7/89 kB
Progress (3): 134 kB | 28/39 kB | 7.7/89 kB
Progress (3): 134 kB | 32/39 kB | 7.7/89 kB
Progress (3): 134 kB | 32/39 kB | 12/89 kB 
Progress (3): 134 kB | 32/39 kB | 16/89 kB
Progress (3): 134 kB | 36/39 kB | 16/89 kB
Progress (3): 134 kB | 39 kB | 16/89 kB   
Progress (3): 134 kB | 39 kB | 20/89 kB
Progress (3): 134 kB | 39 kB | 24/89 kB
Progress (3): 134 kB | 39 kB | 28/89 kB
Progress (3): 134 kB | 39 kB | 32/89 kB
Progress (3): 134 kB | 39 kB | 33/89 kB
Progress (3): 134 kB | 39 kB | 37/89 kB
Progress (3): 134 kB | 39 kB | 41/89 kB
Progress (3): 134 kB | 39 kB | 45/89 kB
Progress (3): 134 kB | 39 kB | 49/89 kB
Progress (4): 134 kB | 39 kB | 49/89 kB | 4.1/19 kB
Progress (5): 134 kB | 39 kB | 49/89 kB | 4.1/19 kB | 4.1/640 kB
Progress (5): 134 kB | 39 kB | 49/89 kB | 7.7/19 kB | 4.1/640 kB
Progress (5): 134 kB | 39 kB | 53/89 kB | 7.7/19 kB | 4.1/640 kB
Progress (5): 134 kB | 39 kB | 53/89 kB | 7.7/19 kB | 7.7/640 kB
Progress (5): 134 kB | 39 kB | 57/89 kB | 7.7/19 kB | 7.7/640 kB
Progress (5): 134 kB | 39 kB | 57/89 kB | 12/19 kB | 7.7/640 kB 
Progress (5): 134 kB | 39 kB | 57/89 kB | 12/19 kB | 12/640 kB 
Progress (5): 134 kB | 39 kB | 57/89 kB | 16/19 kB | 12/640 kB
Progress (5): 134 kB | 39 kB | 61/89 kB | 16/19 kB | 12/640 kB
Progress (5): 134 kB | 39 kB | 61/89 kB | 16/19 kB | 16/640 kB
Progress (5): 134 kB | 39 kB | 65/89 kB | 16/19 kB | 16/640 kB
Progress (5): 134 kB | 39 kB | 65/89 kB | 19 kB | 16/640 kB   
Progress (5): 134 kB | 39 kB | 65/89 kB | 19 kB | 20/640 kB
Progress (5): 134 kB | 39 kB | 69/89 kB | 19 kB | 20/640 kB
Progress (5): 134 kB | 39 kB | 69/89 kB | 19 kB | 24/640 kB
Progress (5): 134 kB | 39 kB | 73/89 kB | 19 kB | 24/640 kB
Progress (5): 134 kB | 39 kB | 73/89 kB | 19 kB | 28/640 kB
Progress (5): 134 kB | 39 kB | 77/89 kB | 19 kB | 28/640 kB
Progress (5): 134 kB | 39 kB | 77/89 kB | 19 kB | 32/640 kB
Progress (5): 134 kB | 39 kB | 81/89 kB | 19 kB | 32/640 kB
Progress (5): 134 kB | 39 kB | 81/89 kB | 19 kB | 33/640 kB
Progress (5): 134 kB | 39 kB | 85/89 kB | 19 kB | 33/640 kB
Progress (5): 134 kB | 39 kB | 85/89 kB | 19 kB | 37/640 kB
Progress (5): 134 kB | 39 kB | 89/89 kB | 19 kB | 37/640 kB
Progress (5): 134 kB | 39 kB | 89/89 kB | 19 kB | 41/640 kB
Progress (5): 134 kB | 39 kB | 89 kB | 19 kB | 41/640 kB   
Progress (5): 134 kB | 39 kB | 89 kB | 19 kB | 45/640 kB
Progress (5): 134 kB | 39 kB | 89 kB | 19 kB | 49/640 kB
Progress (5): 134 kB | 39 kB | 89 kB | 19 kB | 53/640 kB
Progress (5): 134 kB | 39 kB | 89 kB | 19 kB | 57/640 kB
Progress (5): 134 kB | 39 kB | 89 kB | 19 kB | 61/640 kB
Progress (5): 134 kB | 39 kB | 89 kB | 19 kB | 65/640 kB
Progress (5): 134 kB | 39 kB | 89 kB | 19 kB | 66/640 kB
Progress (5): 134 kB | 39 kB | 89 kB | 19 kB | 70/640 kB
Progress (5): 134 kB | 39 kB | 89 kB | 19 kB | 74/640 kB
Progress (5): 134 kB | 39 kB | 89 kB | 19 kB | 78/640 kB
Progress (5): 134 kB | 39 kB | 89 kB | 19 kB | 82/640 kB
                                                        
Downloaded from eclipse.maven.central.mirror: https://repo.eclipse.org/content/repositories/maven_central/org/apache/maven/maven-plugin-descriptor/2.0.10/maven-plugin-descriptor-2.0.10.jar (39 kB at 322 kB/s)
Progress (4): 134 kB | 89 kB | 19 kB | 86/640 kB
                                                
Downloading from eclipse.maven.central.mirror: https://repo.eclipse.org/content/repositories/maven_central/org/apache/maven/maven-model/2.0.10/maven-model-2.0.10.jar
Progress (4): 134 kB | 89 kB | 19 kB | 90/640 kB
Progress (4): 134 kB | 89 kB | 19 kB | 94/640 kB
Progress (4): 134 kB | 89 kB | 19 kB | 98/640 kB
Progress (4): 134 kB | 89 kB | 19 kB | 98/640 kB
Progress (4): 134 kB | 89 kB | 19 kB | 102/640 kB
Progress (4): 134 kB | 89 kB | 19 kB | 106/640 kB
Progress (4): 134 kB | 89 kB | 19 kB | 110/640 kB
Progress (4): 134 kB | 89 kB | 19 kB | 114/640 kB
Progress (4): 134 kB | 89 kB | 19 kB | 118/640 kB
Progress (4): 134 kB | 89 kB | 19 kB | 122/640 kB
Progress (4): 134 kB | 89 kB | 19 kB | 126/640 kB
Progress (4): 134 kB | 89 kB | 19 kB | 130/640 kB
Progress (4): 134 kB | 89 kB | 19 kB | 134/640 kB
Progress (4): 134 kB | 89 kB | 19 kB | 138/640 kB
Progress (4): 134 kB | 89 kB | 19 kB | 142/640 kB
Progress (4): 134 kB | 89 kB | 19 kB | 146/640 kB
Progress (4): 134 kB | 89 kB | 19 kB | 150/640 kB
Progress (4): 134 kB | 89 kB | 19 kB | 154/640 kB
Progress (4): 134 kB | 89 kB | 19 kB | 158/640 kB
Progress (4): 134 kB | 89 kB | 19 kB | 162/640 kB
Progress (4): 134 kB | 89 kB | 19 kB | 166/640 kB
Progress (4): 134 kB | 89 kB | 19 kB | 170/640 kB
Progress (4): 134 kB | 89 kB | 19 kB | 174/640 kB
Progress (4): 134 kB | 89 kB | 19 kB | 178/640 kB
Progress (4): 134 kB | 89 kB | 19 kB | 182/640 kB
                                                 
Downloaded from eclipse.maven.central.mirror: https://repo.eclipse.org/content/repositories/maven_central/org/apache/maven/reporting/maven-reporting-impl/2.0.4.1/maven-reporting-impl-2.0.4.1.jar (19 kB at 147 kB/s)
Progress (3): 134 kB | 89 kB | 186/640 kB
                                         
Downloaded from eclipse.maven.central.mirror: https://repo.eclipse.org/content/repositories/maven_central/org/apache/maven/maven-artifact/2.0.10/maven-artifact-2.0.10.jar (89 kB at 703 kB/s)
Downloading from eclipse.maven.central.mirror: https://repo.eclipse.org/content/repositories/maven_central/org/apache/maven/doxia/doxia-core/1.0-alpha-10/doxia-core-1.0-alpha-10.jar
Downloading from eclipse.maven.central.mirror: https://repo.eclipse.org/content/repositories/maven_central/org/apache/maven/doxia/doxia-sink-api/1.0-alpha-10/doxia-sink-api-1.0-alpha-10.jar
Progress (2): 134 kB | 190/640 kB
Progress (2): 134 kB | 194/640 kB
Progress (2): 134 kB | 198/640 kB
Progress (2): 134 kB | 202/640 kB
Progress (2): 134 kB | 206/640 kB
Progress (2): 134 kB | 210/640 kB
Progress (2): 134 kB | 214/640 kB
Progress (2): 134 kB | 218/640 kB
Progress (2): 134 kB | 222/640 kB
Progress (2): 134 kB | 226/640 kB
Progress (2): 134 kB | 230/640 kB
Progress (2): 134 kB | 234/640 kB
Progress (2): 134 kB | 238/640 kB
Progress (2): 134 kB | 242/640 kB
Progress (2): 134 kB | 246/640 kB
Progress (2): 134 kB | 250/640 kB
Progress (2): 134 kB | 254/640 kB
Progress (2): 134 kB | 258/640 kB
Progress (2): 134 kB | 262/640 kB
Progress (2): 134 kB | 266/640 kB
Progress (2): 134 kB | 270/640 kB
Progress (2): 134 kB | 274/640 kB
Progress (2): 134 kB | 278/640 kB
Progress (2): 134 kB | 282/640 kB
Progress (2): 134 kB | 286/640 kB
Progress (2): 134 kB | 290/640 kB
Progress (2): 134 kB | 294/640 kB
Progress (2): 134 kB | 298/640 kB
Progress (2): 134 kB | 302/640 kB
Progress (2): 134 kB | 306/640 kB
Progress (2): 134 kB | 310/640 kB
Progress (2): 134 kB | 314/640 kB
Progress (2): 134 kB | 318/640 kB
Progress (2): 134 kB | 322/640 kB
Progress (2): 134 kB | 326/640 kB
Progress (2): 134 kB | 330/640 kB
Progress (2): 134 kB | 334/640 kB
Progress (2): 134 kB | 338/640 kB
Progress (2): 134 kB | 342/640 kB
Progress (2): 134 kB | 346/640 kB
Progress (2): 134 kB | 350/640 kB
Progress (2): 134 kB | 354/640 kB
Progress (2): 134 kB | 358/640 kB
Progress (2): 134 kB | 362/640 kB
Progress (2): 134 kB | 366/640 kB
Progress (2): 134 kB | 370/640 kB
Progress (2): 134 kB | 374/640 kB
Progress (2): 134 kB | 378/640 kB
Progress (2): 134 kB | 382/640 kB
Progress (2): 134 kB | 386/640 kB
Progress (2): 134 kB | 390/640 kB
Progress (2): 134 kB | 394/640 kB
Progress (2): 134 kB | 398/640 kB
Progress (2): 134 kB | 402/640 kB
Progress (2): 134 kB | 406/640 kB
Progress (2): 134 kB | 410/640 kB
Progress (2): 134 kB | 414/640 kB
Progress (2): 134 kB | 418/640 kB
Progress (2): 134 kB | 422/640 kB
Progress (2): 134 kB | 426/640 kB
Progress (2): 134 kB | 430/640 kB
Progress (2): 134 kB | 434/640 kB
Progress (3): 134 kB | 434/640 kB | 4.1/96 kB
Progress (3): 134 kB | 438/640 kB | 4.1/96 kB
Progress (3): 134 kB | 438/640 kB | 7.7/96 kB
Progress (3): 134 kB | 442/640 kB | 7.7/96 kB
Progress (3): 134 kB | 442/640 kB | 12/96 kB 
Progress (3): 134 kB | 446/640 kB | 12/96 kB
Progress (3): 134 kB | 446/640 kB | 16/96 kB
Progress (3): 134 kB | 450/640 kB | 16/96 kB
Progress (3): 134 kB | 450/640 kB | 20/96 kB
Progress (3): 134 kB | 454/640 kB | 20/96 kB
Progress (3): 134 kB | 454/640 kB | 24/96 kB
Progress (3): 134 kB | 458/640 kB | 24/96 kB
Progress (3): 134 kB | 458/640 kB | 28/96 kB
Progress (3): 134 kB | 462/640 kB | 28/96 kB
Progress (3): 134 kB | 462/640 kB | 32/96 kB
Progress (3): 134 kB | 466/640 kB | 32/96 kB
Progress (3): 134 kB | 466/640 kB | 33/96 kB
Progress (3): 134 kB | 470/640 kB | 33/96 kB
Progress (3): 134 kB | 474/640 kB | 33/96 kB
Progress (3): 134 kB | 474/640 kB | 37/96 kB
Progress (3): 134 kB | 474/640 kB | 41/96 kB
Progress (4): 134 kB | 474/640 kB | 41/96 kB | 4.1/9.9 kB
Progress (4): 134 kB | 478/640 kB | 41/96 kB | 4.1/9.9 kB
Progress (4): 134 kB | 478/640 kB | 41/96 kB | 7.7/9.9 kB
Progress (4): 134 kB | 482/640 kB | 41/96 kB | 7.7/9.9 kB
Progress (4): 134 kB | 482/640 kB | 45/96 kB | 7.7/9.9 kB
Progress (4): 134 kB | 482/640 kB | 45/96 kB | 9.9 kB    
Progress (4): 134 kB | 482/640 kB | 49/96 kB | 9.9 kB
Progress (4): 134 kB | 486/640 kB | 49/96 kB | 9.9 kB
Progress (4): 134 kB | 490/640 kB | 49/96 kB | 9.9 kB
Progress (4): 134 kB | 490/640 kB | 53/96 kB | 9.9 kB
Progress (4): 134 kB | 490/640 kB | 57/96 kB | 9.9 kB
Progress (4): 134 kB | 494/640 kB | 57/96 kB | 9.9 kB
Progress (4): 134 kB | 498/640 kB | 57/96 kB | 9.9 kB
Progress (4): 134 kB | 498/640 kB | 61/96 kB | 9.9 kB
Progress (4): 134 kB | 498/640 kB | 65/96 kB | 9.9 kB
Progress (4): 134 kB | 502/640 kB | 65/96 kB | 9.9 kB
Progress (4): 134 kB | 506/640 kB | 65/96 kB | 9.9 kB
Progress (4): 134 kB | 506/640 kB | 69/96 kB | 9.9 kB
Progress (4): 134 kB | 506/640 kB | 73/96 kB | 9.9 kB
Progress (4): 134 kB | 510/640 kB | 73/96 kB | 9.9 kB
Progress (4): 134 kB | 514/640 kB | 73/96 kB | 9.9 kB
Progress (4): 134 kB | 514/640 kB | 77/96 kB | 9.9 kB
Progress (4): 134 kB | 514/640 kB | 81/96 kB | 9.9 kB
Progress (4): 134 kB | 518/640 kB | 81/96 kB | 9.9 kB
Progress (4): 134 kB | 522/640 kB | 81/96 kB | 9.9 kB
Progress (4): 134 kB | 522/640 kB | 85/96 kB | 9.9 kB
Progress (4): 134 kB | 522/640 kB | 89/96 kB | 9.9 kB
Progress (4): 134 kB | 526/640 kB | 89/96 kB | 9.9 kB
Progress (4): 134 kB | 530/640 kB | 89/96 kB | 9.9 kB
Progress (5): 134 kB | 530/640 kB | 89/96 kB | 9.9 kB | 4.1/55 kB
                                                                 
Downloaded from eclipse.maven.central.mirror: https://repo.eclipse.org/content/repositories/maven_central/org/apache/xbean/xbean-reflect/3.4/xbean-reflect-3.4.jar (134 kB at 942 kB/s)
Progress (4): 530/640 kB | 89/96 kB | 9.9 kB | 7.7/55 kB
Progress (4): 530/640 kB | 93/96 kB | 9.9 kB | 7.7/55 kB
                                                        
Downloading from eclipse.maven.central.mirror: https://repo.eclipse.org/content/repositories/maven_central/org/apache/maven/reporting/maven-reporting-api/2.0.4/maven-reporting-api-2.0.4.jar
Progress (4): 534/640 kB | 93/96 kB | 9.9 kB | 7.7/55 kB
Progress (4): 534/640 kB | 96 kB | 9.9 kB | 7.7/55 kB   
Progress (4): 538/640 kB | 96 kB | 9.9 kB | 7.7/55 kB
Progress (4): 538/640 kB | 96 kB | 9.9 kB | 12/55 kB 
Progress (4): 538/640 kB | 96 kB | 9.9 kB | 16/55 kB
Progress (4): 542/640 kB | 96 kB | 9.9 kB | 16/55 kB
Progress (4): 546/640 kB | 96 kB | 9.9 kB | 16/55 kB
Progress (4): 546/640 kB | 96 kB | 9.9 kB | 20/55 kB
Progress (4): 546/640 kB | 96 kB | 9.9 kB | 24/55 kB
Progress (4): 550/640 kB | 96 kB | 9.9 kB | 24/55 kB
Progress (4): 554/640 kB | 96 kB | 9.9 kB | 24/55 kB
Progress (4): 554/640 kB | 96 kB | 9.9 kB | 28/55 kB
Progress (4): 554/640 kB | 96 kB | 9.9 kB | 32/55 kB
Progress (4): 558/640 kB | 96 kB | 9.9 kB | 32/55 kB
Progress (4): 562/640 kB | 96 kB | 9.9 kB | 32/55 kB
Progress (4): 562/640 kB | 96 kB | 9.9 kB | 36/55 kB
Progress (4): 562/640 kB | 96 kB | 9.9 kB | 40/55 kB
Progress (4): 566/640 kB | 96 kB | 9.9 kB | 40/55 kB
Progress (4): 570/640 kB | 96 kB | 9.9 kB | 40/55 kB
Progress (4): 570/640 kB | 96 kB | 9.9 kB | 44/55 kB
Progress (4): 570/640 kB | 96 kB | 9.9 kB | 48/55 kB
Progress (4): 574/640 kB | 96 kB | 9.9 kB | 48/55 kB
Progress (4): 578/640 kB | 96 kB | 9.9 kB | 48/55 kB
Progress (4): 578/640 kB | 96 kB | 9.9 kB | 52/55 kB
Progress (4): 578/640 kB | 96 kB | 9.9 kB | 55 kB   
Progress (4): 582/640 kB | 96 kB | 9.9 kB | 55 kB
Progress (4): 586/640 kB | 96 kB | 9.9 kB | 55 kB
Progress (4): 590/640 kB | 96 kB | 9.9 kB | 55 kB
Progress (4): 594/640 kB | 96 kB | 9.9 kB | 55 kB
Progress (4): 598/640 kB | 96 kB | 9.9 kB | 55 kB
Progress (4): 602/640 kB | 96 kB | 9.9 kB | 55 kB
Progress (4): 606/640 kB | 96 kB | 9.9 kB | 55 kB
Progress (4): 610/640 kB | 96 kB | 9.9 kB | 55 kB
Progress (4): 614/640 kB | 96 kB | 9.9 kB | 55 kB
Progress (4): 618/640 kB | 96 kB | 9.9 kB | 55 kB
Progress (4): 622/640 kB | 96 kB | 9.9 kB | 55 kB
Progress (4): 626/640 kB | 96 kB | 9.9 kB | 55 kB
Progress (4): 630/640 kB | 96 kB | 9.9 kB | 55 kB
Progress (4): 634/640 kB | 96 kB | 9.9 kB | 55 kB
Progress (4): 638/640 kB | 96 kB | 9.9 kB | 55 kB
Progress (4): 640 kB | 96 kB | 9.9 kB | 55 kB    
                                             
Downloaded from eclipse.maven.central.mirror: https://repo.eclipse.org/content/repositories/maven_central/org/apache/maven/doxia/doxia-sink-api/1.0-alpha-10/doxia-sink-api-1.0-alpha-10.jar (9.9 kB at 67 kB/s)
Downloading from eclipse.maven.central.mirror: https://repo.eclipse.org/content/repositories/maven_central/org/apache/maven/doxia/doxia-site-renderer/1.0-alpha-10/doxia-site-renderer-1.0-alpha-10.jar
Downloaded from eclipse.maven.central.mirror: https://repo.eclipse.org/content/repositories/maven_central/com/google/collections/google-collections/1.0/google-collections-1.0.jar (640 kB at 4.2 MB/s)
Downloading from eclipse.maven.central.mirror: https://repo.eclipse.org/content/repositories/maven_central/org/apache/maven/doxia/doxia-decoration-model/1.0-alpha-10/doxia-decoration-model-1.0-alpha-10.jar
Progress (3): 96 kB | 55 kB | 4.1/5.0 kB
Progress (3): 96 kB | 55 kB | 5.0 kB    
Progress (4): 96 kB | 55 kB | 5.0 kB | 4.1/46 kB
Progress (4): 96 kB | 55 kB | 5.0 kB | 7.7/46 kB
Progress (4): 96 kB | 55 kB | 5.0 kB | 12/46 kB 
Progress (4): 96 kB | 55 kB | 5.0 kB | 16/46 kB
Progress (4): 96 kB | 55 kB | 5.0 kB | 20/46 kB
Progress (4): 96 kB | 55 kB | 5.0 kB | 24/46 kB
Progress (4): 96 kB | 55 kB | 5.0 kB | 28/46 kB
Progress (4): 96 kB | 55 kB | 5.0 kB | 32/46 kB
Progress (4): 96 kB | 55 kB | 5.0 kB | 33/46 kB
Progress (4): 96 kB | 55 kB | 5.0 kB | 37/46 kB
Progress (4): 96 kB | 55 kB | 5.0 kB | 41/46 kB
Progress (4): 96 kB | 55 kB | 5.0 kB | 45/46 kB
Progress (4): 96 kB | 55 kB | 5.0 kB | 46 kB   
                                            
Downloaded from eclipse.maven.central.mirror: https://repo.eclipse.org/content/repositories/maven_central/org/apache/maven/doxia/doxia-site-renderer/1.0-alpha-10/doxia-site-renderer-1.0-alpha-10.jar (46 kB at 277 kB/s)
Downloaded from eclipse.maven.central.mirror: https://repo.eclipse.org/content/repositories/maven_central/org/apache/maven/doxia/doxia-core/1.0-alpha-10/doxia-core-1.0-alpha-10.jar (55 kB at 329 kB/s)
Downloading from eclipse.maven.central.mirror: https://repo.eclipse.org/content/repositories/maven_central/org/apache/maven/doxia/doxia-module-apt/1.0-alpha-10/doxia-module-apt-1.0-alpha-10.jar
Downloaded from eclipse.maven.central.mirror: https://repo.eclipse.org/content/repositories/maven_central/org/apache/maven/maven-model/2.0.10/maven-model-2.0.10.jar (96 kB at 579 kB/s)
Downloading from eclipse.maven.central.mirror: https://repo.eclipse.org/content/repositories/maven_central/org/apache/maven/doxia/doxia-module-fml/1.0-alpha-10/doxia-module-fml-1.0-alpha-10.jar
Downloading from eclipse.maven.central.mirror: https://repo.eclipse.org/content/repositories/maven_central/org/apache/maven/doxia/doxia-module-xdoc/1.0-alpha-10/doxia-module-xdoc-1.0-alpha-10.jar
Downloaded from eclipse.maven.central.mirror: https://repo.eclipse.org/content/repositories/maven_central/org/apache/maven/reporting/maven-reporting-api/2.0.4/maven-reporting-api-2.0.4.jar (5.0 kB at 28 kB/s)
Downloading from eclipse.maven.central.mirror: https://repo.eclipse.org/content/repositories/maven_central/org/apache/maven/doxia/doxia-module-xhtml/1.0-alpha-10/doxia-module-xhtml-1.0-alpha-10.jar
Progress (1): 4.1/50 kB
Progress (1): 7.7/50 kB
Progress (1): 12/50 kB 
Progress (1): 16/50 kB
Progress (1): 20/50 kB
Progress (1): 24/50 kB
Progress (2): 24/50 kB | 4.1/18 kB
Progress (2): 28/50 kB | 4.1/18 kB
Progress (2): 28/50 kB | 7.7/18 kB
Progress (2): 32/50 kB | 7.7/18 kB
Progress (2): 32/50 kB | 12/18 kB 
Progress (2): 36/50 kB | 12/18 kB
Progress (2): 36/50 kB | 16/18 kB
Progress (2): 40/50 kB | 16/18 kB
Progress (2): 40/50 kB | 18 kB   
Progress (2): 44/50 kB | 18 kB
Progress (2): 48/50 kB | 18 kB
Progress (3): 48/50 kB | 18 kB | 4.1/47 kB
Progress (3): 50 kB | 18 kB | 4.1/47 kB   
Progress (4): 50 kB | 18 kB | 4.1/47 kB | 4.1/21 kB
Progress (4): 50 kB | 18 kB | 7.7/47 kB | 4.1/21 kB
Progress (4): 50 kB | 18 kB | 7.7/47 kB | 7.7/21 kB
Progress (4): 50 kB | 18 kB | 12/47 kB | 7.7/21 kB 
Progress (4): 50 kB | 18 kB | 12/47 kB | 12/21 kB 
Progress (4): 50 kB | 18 kB | 16/47 kB | 12/21 kB
Progress (4): 50 kB | 18 kB | 16/47 kB | 16/21 kB
Progress (5): 50 kB | 18 kB | 16/47 kB | 16/21 kB | 4.1/27 kB
Progress (5): 50 kB | 18 kB | 16/47 kB | 20/21 kB | 4.1/27 kB
Progress (5): 50 kB | 18 kB | 16/47 kB | 20/21 kB | 7.7/27 kB
Progress (5): 50 kB | 18 kB | 16/47 kB | 21 kB | 7.7/27 kB   
Progress (5): 50 kB | 18 kB | 20/47 kB | 21 kB | 7.7/27 kB
Progress (5): 50 kB | 18 kB | 24/47 kB | 21 kB | 7.7/27 kB
Progress (5): 50 kB | 18 kB | 24/47 kB | 21 kB | 12/27 kB 
Progress (5): 50 kB | 18 kB | 24/47 kB | 21 kB | 16/27 kB
Progress (5): 50 kB | 18 kB | 28/47 kB | 21 kB | 16/27 kB
Progress (5): 50 kB | 18 kB | 28/47 kB | 21 kB | 20/27 kB
Progress (5): 50 kB | 18 kB | 32/47 kB | 21 kB | 20/27 kB
Progress (5): 50 kB | 18 kB | 32/47 kB | 21 kB | 24/27 kB
Progress (5): 50 kB | 18 kB | 32/47 kB | 21 kB | 27 kB   
Progress (5): 50 kB | 18 kB | 36/47 kB | 21 kB | 27 kB
Progress (5): 50 kB | 18 kB | 40/47 kB | 21 kB | 27 kB
Progress (5): 50 kB | 18 kB | 44/47 kB | 21 kB | 27 kB
Progress (5): 50 kB | 18 kB | 47 kB | 21 kB | 27 kB   
                                                   
Downloaded from eclipse.maven.central.mirror: https://repo.eclipse.org/content/repositories/maven_central/org/apache/maven/doxia/doxia-module-xhtml/1.0-alpha-10/doxia-module-xhtml-1.0-alpha-10.jar (21 kB at 110 kB/s)
Downloading from eclipse.maven.central.mirror: https://repo.eclipse.org/content/repositories/maven_central/org/sonatype/gossip/gossip/1.2/gossip-1.2.jar
Downloaded from eclipse.maven.central.mirror: https://repo.eclipse.org/content/repositories/maven_central/org/apache/maven/doxia/doxia-module-fml/1.0-alpha-10/doxia-module-fml-1.0-alpha-10.jar (18 kB at 77 kB/s)
Downloaded from eclipse.maven.central.mirror: https://repo.eclipse.org/content/repositories/maven_central/org/apache/maven/doxia/doxia-decoration-model/1.0-alpha-10/doxia-decoration-model-1.0-alpha-10.jar (50 kB at 208 kB/s)
Downloaded from eclipse.maven.central.mirror: https://repo.eclipse.org/content/repositories/maven_central/org/apache/maven/doxia/doxia-module-xdoc/1.0-alpha-10/doxia-module-xdoc-1.0-alpha-10.jar (27 kB at 114 kB/s)
Downloaded from eclipse.maven.central.mirror: https://repo.eclipse.org/content/repositories/maven_central/org/apache/maven/doxia/doxia-module-apt/1.0-alpha-10/doxia-module-apt-1.0-alpha-10.jar (47 kB at 194 kB/s)
Progress (1): 4.1/77 kB
Progress (1): 7.7/77 kB
Progress (1): 12/77 kB 
Progress (1): 16/77 kB
Progress (1): 20/77 kB
Progress (1): 24/77 kB
Progress (1): 28/77 kB
Progress (1): 32/77 kB
Progress (1): 33/77 kB
Progress (1): 37/77 kB
Progress (1): 41/77 kB
Progress (1): 45/77 kB
Progress (1): 49/77 kB
Progress (1): 53/77 kB
Progress (1): 57/77 kB
Progress (1): 61/77 kB
Progress (1): 65/77 kB
Progress (1): 66/77 kB
Progress (1): 70/77 kB
Progress (1): 74/77 kB
Progress (1): 77 kB   
                   
Downloaded from eclipse.maven.central.mirror: https://repo.eclipse.org/content/repositories/maven_central/org/sonatype/gossip/gossip/1.2/gossip-1.2.jar (77 kB at 303 kB/s)
Downloading from sonatype: https://oss.sonatype.org/content/repositories/public/org/codehaus/gmaven/runtime/gmaven-runtime-1.6/1.5/gmaven-runtime-1.6-1.5.pom
Progress (1): 3.1 kB
                    
Downloaded from sonatype: https://oss.sonatype.org/content/repositories/public/org/codehaus/gmaven/runtime/gmaven-runtime-1.6/1.5/gmaven-runtime-1.6-1.5.pom (3.1 kB at 28 kB/s)
Downloading from sonatype: https://oss.sonatype.org/content/repositories/public/org/sonatype/gossip/gossip/1.3/gossip-1.3.pom
Downloading from cbi: https://repo.eclipse.org/content/repositories/cbi-releases/org/sonatype/gossip/gossip/1.3/gossip-1.3.pom
Downloading from cbi-snapshots: https://repo.eclipse.org/content/repositories/cbi-snapshots/org/sonatype/gossip/gossip/1.3/gossip-1.3.pom
Downloading from eclipse.maven.central.mirror: https://repo.eclipse.org/content/repositories/maven_central/org/sonatype/gossip/gossip/1.3/gossip-1.3.pom
Progress (1): 4.1/20 kB
Progress (1): 7.7/20 kB
Progress (1): 12/20 kB 
Progress (1): 16/20 kB
Progress (1): 20 kB   
                   
Downloaded from eclipse.maven.central.mirror: https://repo.eclipse.org/content/repositories/maven_central/org/sonatype/gossip/gossip/1.3/gossip-1.3.pom (20 kB at 1.1 MB/s)
Downloading from sonatype: https://oss.sonatype.org/content/repositories/public/org/codehaus/groovy/groovy-all/1.6.9/groovy-all-1.6.9.pom
Progress (1): 3.8/25 kB
Progress (1): 7.9/25 kB
Progress (1): 12/25 kB 
Progress (1): 16/25 kB
Progress (1): 20/25 kB
Progress (1): 24/25 kB
Progress (1): 25 kB   
                   
Downloaded from sonatype: https://oss.sonatype.org/content/repositories/public/org/codehaus/groovy/groovy-all/1.6.9/groovy-all-1.6.9.pom (25 kB at 123 kB/s)
Downloading from sonatype: https://oss.sonatype.org/content/repositories/public/org/apache/ant/ant/1.7.1/ant-1.7.1.pom
Downloading from cbi: https://repo.eclipse.org/content/repositories/cbi-releases/org/apache/ant/ant/1.7.1/ant-1.7.1.pom
Downloading from cbi-snapshots: https://repo.eclipse.org/content/repositories/cbi-snapshots/org/apache/ant/ant/1.7.1/ant-1.7.1.pom
Downloading from eclipse.maven.central.mirror: https://repo.eclipse.org/content/repositories/maven_central/org/apache/ant/ant/1.7.1/ant-1.7.1.pom
Progress (1): 4.1/9.8 kB
Progress (1): 7.7/9.8 kB
Progress (1): 9.8 kB    
                    
Downloaded from eclipse.maven.central.mirror: https://repo.eclipse.org/content/repositories/maven_central/org/apache/ant/ant/1.7.1/ant-1.7.1.pom (9.8 kB at 514 kB/s)
Downloading from sonatype: https://oss.sonatype.org/content/repositories/public/org/apache/ant/ant-parent/1.7.1/ant-parent-1.7.1.pom
Downloading from cbi: https://repo.eclipse.org/content/repositories/cbi-releases/org/apache/ant/ant-parent/1.7.1/ant-parent-1.7.1.pom
Downloading from cbi-snapshots: https://repo.eclipse.org/content/repositories/cbi-snapshots/org/apache/ant/ant-parent/1.7.1/ant-parent-1.7.1.pom
Downloading from eclipse.maven.central.mirror: https://repo.eclipse.org/content/repositories/maven_central/org/apache/ant/ant-parent/1.7.1/ant-parent-1.7.1.pom
Progress (1): 4.1/4.4 kB
Progress (1): 4.4 kB    
                    
Downloaded from eclipse.maven.central.mirror: https://repo.eclipse.org/content/repositories/maven_central/org/apache/ant/ant-parent/1.7.1/ant-parent-1.7.1.pom (4.4 kB at 190 kB/s)
Downloading from sonatype: https://oss.sonatype.org/content/repositories/public/org/apache/ant/ant-launcher/1.7.1/ant-launcher-1.7.1.pom
Downloading from cbi: https://repo.eclipse.org/content/repositories/cbi-releases/org/apache/ant/ant-launcher/1.7.1/ant-launcher-1.7.1.pom
Downloading from cbi-snapshots: https://repo.eclipse.org/content/repositories/cbi-snapshots/org/apache/ant/ant-launcher/1.7.1/ant-launcher-1.7.1.pom
Downloading from eclipse.maven.central.mirror: https://repo.eclipse.org/content/repositories/maven_central/org/apache/ant/ant-launcher/1.7.1/ant-launcher-1.7.1.pom
Progress (1): 2.4 kB
                    
Downloaded from eclipse.maven.central.mirror: https://repo.eclipse.org/content/repositories/maven_central/org/apache/ant/ant-launcher/1.7.1/ant-launcher-1.7.1.pom (2.4 kB at 108 kB/s)
Downloading from sonatype: https://oss.sonatype.org/content/repositories/public/jline/jline/0.9.94/jline-0.9.94.pom
Progress (1): 4.1/6.4 kB
Progress (1): 6.4 kB    
                    
Downloaded from sonatype: https://oss.sonatype.org/content/repositories/public/jline/jline/0.9.94/jline-0.9.94.pom (6.4 kB at 35 kB/s)
Downloading from sonatype: https://oss.sonatype.org/content/repositories/public/org/apache/ant/ant/1.7.1/ant-1.7.1.jar
Downloading from sonatype: https://oss.sonatype.org/content/repositories/public/org/codehaus/gmaven/runtime/gmaven-runtime-1.6/1.5/gmaven-runtime-1.6-1.5.jar
Downloading from sonatype: https://oss.sonatype.org/content/repositories/public/org/apache/ant/ant-launcher/1.7.1/ant-launcher-1.7.1.jar
Downloading from sonatype: https://oss.sonatype.org/content/repositories/public/org/codehaus/groovy/groovy-all/1.6.9/groovy-all-1.6.9.jar
Downloading from sonatype: https://oss.sonatype.org/content/repositories/public/jline/jline/0.9.94/jline-0.9.94.jar
Progress (1): 3.8/87 kB
Progress (1): 7.9/87 kB
Progress (1): 12/87 kB 
Progress (1): 16/87 kB
Progress (1): 20/87 kB
Progress (1): 24/87 kB
Progress (1): 28/87 kB
Progress (1): 32/87 kB
Progress (1): 37/87 kB
Progress (1): 41/87 kB
Progress (1): 42/87 kB
Progress (1): 46/87 kB
Progress (1): 50/87 kB
Progress (1): 53/87 kB
Progress (1): 57/87 kB
Progress (1): 61/87 kB
Progress (1): 65/87 kB
Progress (1): 69/87 kB
                      
Progress (2): 69/87 kB | 3.8/43 kB
Progress (3): 69/87 kB | 3.8/43 kB | 0/4.6 MB
                                             
Progress (3): 73/87 kB | 3.8/43 kB | 0/4.6 MB
Progress (3): 77/87 kB | 3.8/43 kB | 0/4.6 MB
Progress (3): 82/87 kB | 3.8/43 kB | 0/4.6 MB
Progress (3): 86/87 kB | 3.8/43 kB | 0/4.6 MB
Progress (3): 87 kB | 3.8/43 kB | 0/4.6 MB   
Progress (3): 87 kB | 3.8/43 kB | 0/4.6 MB
Progress (3): 87 kB | 3.8/43 kB | 0/4.6 MB
Progress (3): 87 kB | 7.9/43 kB | 0/4.6 MB
Progress (3): 87 kB | 7.9/43 kB | 0/4.6 MB
Progress (3): 87 kB | 12/43 kB | 0/4.6 MB 
Progress (3): 87 kB | 12/43 kB | 0/4.6 MB
Progress (3): 87 kB | 16/43 kB | 0/4.6 MB
Progress (3): 87 kB | 20/43 kB | 0/4.6 MB
Progress (3): 87 kB | 20/43 kB | 0/4.6 MB
Progress (3): 87 kB | 20/43 kB | 0/4.6 MB
Progress (3): 87 kB | 20/43 kB | 0/4.6 MB
Progress (3): 87 kB | 20/43 kB | 0/4.6 MB
Progress (3): 87 kB | 24/43 kB | 0/4.6 MB
Progress (3): 87 kB | 28/43 kB | 0/4.6 MB
Progress (3): 87 kB | 32/43 kB | 0/4.6 MB
Progress (3): 87 kB | 37/43 kB | 0/4.6 MB
Progress (3): 87 kB | 41/43 kB | 0/4.6 MB
Progress (3): 87 kB | 43 kB | 0/4.6 MB   
                                      
Downloading from cbi: https://repo.eclipse.org/content/repositories/cbi-releases/org/apache/ant/ant-launcher/1.7.1/ant-launcher-1.7.1.jar
Downloading from cbi: https://repo.eclipse.org/content/repositories/cbi-releases/org/apache/ant/ant/1.7.1/ant-1.7.1.jar
Progress (3): 87 kB | 43 kB | 0/4.6 MB
Progress (3): 87 kB | 43 kB | 0/4.6 MB
Progress (3): 87 kB | 43 kB | 0/4.6 MB
Progress (3): 87 kB | 43 kB | 0/4.6 MB
Progress (3): 87 kB | 43 kB | 0.1/4.6 MB
Progress (3): 87 kB | 43 kB | 0.1/4.6 MB
Progress (3): 87 kB | 43 kB | 0.1/4.6 MB
Progress (3): 87 kB | 43 kB | 0.1/4.6 MB
                                        
Downloading from cbi-snapshots: https://repo.eclipse.org/content/repositories/cbi-snapshots/org/apache/ant/ant-launcher/1.7.1/ant-launcher-1.7.1.jar
Downloaded from sonatype: https://oss.sonatype.org/content/repositories/public/jline/jline/0.9.94/jline-0.9.94.jar (87 kB at 428 kB/s)
Downloading from cbi-snapshots: https://repo.eclipse.org/content/repositories/cbi-snapshots/org/apache/ant/ant/1.7.1/ant-1.7.1.jar
Downloaded from sonatype: https://oss.sonatype.org/content/repositories/public/org/codehaus/gmaven/runtime/gmaven-runtime-1.6/1.5/gmaven-runtime-1.6-1.5.jar (43 kB at 196 kB/s)
Progress (1): 0.1/4.6 MB
Progress (1): 0.1/4.6 MB
Progress (1): 0.1/4.6 MB
Progress (1): 0.1/4.6 MB
Progress (1): 0.1/4.6 MB
Progress (1): 0.1/4.6 MB
Progress (1): 0.1/4.6 MB
Progress (1): 0.1/4.6 MB
Progress (1): 0.1/4.6 MB
Progress (1): 0.1/4.6 MB
Progress (1): 0.1/4.6 MB
Progress (1): 0.1/4.6 MB
Progress (1): 0.1/4.6 MB
Progress (1): 0.1/4.6 MB
Progress (1): 0.1/4.6 MB
Progress (1): 0.1/4.6 MB
Progress (1): 0.1/4.6 MB
Progress (1): 0.1/4.6 MB
Progress (1): 0.1/4.6 MB
Progress (1): 0.1/4.6 MB
                        
Downloading from eclipse.maven.central.mirror: https://repo.eclipse.org/content/repositories/maven_central/org/apache/ant/ant-launcher/1.7.1/ant-launcher-1.7.1.jar
Progress (2): 0.1/4.6 MB | 4.1/12 kB
Progress (2): 0.1/4.6 MB | 7.7/12 kB
Progress (2): 0.1/4.6 MB | 12/12 kB 
Progress (2): 0.1/4.6 MB | 12 kB   
                                
Downloading from eclipse.maven.central.mirror: https://repo.eclipse.org/content/repositories/maven_central/org/apache/ant/ant/1.7.1/ant-1.7.1.jar
Progress (2): 0.2/4.6 MB | 12 kB
Progress (2): 0.2/4.6 MB | 12 kB
Progress (2): 0.2/4.6 MB | 12 kB
Progress (2): 0.2/4.6 MB | 12 kB
Progress (2): 0.2/4.6 MB | 12 kB
Progress (2): 0.2/4.6 MB | 12 kB
Progress (2): 0.2/4.6 MB | 12 kB
Progress (2): 0.2/4.6 MB | 12 kB
Progress (2): 0.2/4.6 MB | 12 kB
Progress (2): 0.2/4.6 MB | 12 kB
Progress (2): 0.2/4.6 MB | 12 kB
Progress (2): 0.2/4.6 MB | 12 kB
Progress (2): 0.2/4.6 MB | 12 kB
Progress (2): 0.2/4.6 MB | 12 kB
Progress (2): 0.2/4.6 MB | 12 kB
Progress (2): 0.2/4.6 MB | 12 kB
Progress (3): 0.2/4.6 MB | 12 kB | 0/1.3 MB
Progress (3): 0.2/4.6 MB | 12 kB | 0/1.3 MB
Progress (3): 0.2/4.6 MB | 12 kB | 0/1.3 MB
Progress (3): 0.2/4.6 MB | 12 kB | 0/1.3 MB
Progress (3): 0.2/4.6 MB | 12 kB | 0/1.3 MB
Progress (3): 0.2/4.6 MB | 12 kB | 0/1.3 MB
Progress (3): 0.2/4.6 MB | 12 kB | 0/1.3 MB
Progress (3): 0.2/4.6 MB | 12 kB | 0/1.3 MB
Progress (3): 0.2/4.6 MB | 12 kB | 0/1.3 MB
Progress (3): 0.2/4.6 MB | 12 kB | 0/1.3 MB
Progress (3): 0.2/4.6 MB | 12 kB | 0/1.3 MB
Progress (3): 0.2/4.6 MB | 12 kB | 0/1.3 MB
Progress (3): 0.2/4.6 MB | 12 kB | 0.1/1.3 MB
Progress (3): 0.2/4.6 MB | 12 kB | 0.1/1.3 MB
Progress (3): 0.2/4.6 MB | 12 kB | 0.1/1.3 MB
Progress (3): 0.2/4.6 MB | 12 kB | 0.1/1.3 MB
Progress (3): 0.2/4.6 MB | 12 kB | 0.1/1.3 MB
Progress (3): 0.2/4.6 MB | 12 kB | 0.1/1.3 MB
Progress (3): 0.2/4.6 MB | 12 kB | 0.1/1.3 MB
Progress (3): 0.2/4.6 MB | 12 kB | 0.1/1.3 MB
Progress (3): 0.2/4.6 MB | 12 kB | 0.1/1.3 MB
Progress (3): 0.2/4.6 MB | 12 kB | 0.1/1.3 MB
Progress (3): 0.2/4.6 MB | 12 kB | 0.1/1.3 MB
Progress (3): 0.2/4.6 MB | 12 kB | 0.1/1.3 MB
Progress (3): 0.2/4.6 MB | 12 kB | 0.1/1.3 MB
Progress (3): 0.2/4.6 MB | 12 kB | 0.1/1.3 MB
Progress (3): 0.2/4.6 MB | 12 kB | 0.1/1.3 MB
Progress (3): 0.2/4.6 MB | 12 kB | 0.1/1.3 MB
Progress (3): 0.2/4.6 MB | 12 kB | 0.1/1.3 MB
Progress (3): 0.2/4.6 MB | 12 kB | 0.1/1.3 MB
Progress (3): 0.2/4.6 MB | 12 kB | 0.1/1.3 MB
Progress (3): 0.2/4.6 MB | 12 kB | 0.1/1.3 MB
Progress (3): 0.2/4.6 MB | 12 kB | 0.1/1.3 MB
Progress (3): 0.2/4.6 MB | 12 kB | 0.1/1.3 MB
Progress (3): 0.2/4.6 MB | 12 kB | 0.1/1.3 MB
Progress (3): 0.2/4.6 MB | 12 kB | 0.1/1.3 MB
Progress (3): 0.2/4.6 MB | 12 kB | 0.1/1.3 MB
Progress (3): 0.2/4.6 MB | 12 kB | 0.2/1.3 MB
Progress (3): 0.2/4.6 MB | 12 kB | 0.2/1.3 MB
Progress (3): 0.2/4.6 MB | 12 kB | 0.2/1.3 MB
Progress (3): 0.2/4.6 MB | 12 kB | 0.2/1.3 MB
Progress (3): 0.2/4.6 MB | 12 kB | 0.2/1.3 MB
Progress (3): 0.2/4.6 MB | 12 kB | 0.2/1.3 MB
Progress (3): 0.2/4.6 MB | 12 kB | 0.2/1.3 MB
Progress (3): 0.2/4.6 MB | 12 kB | 0.2/1.3 MB
Progress (3): 0.2/4.6 MB | 12 kB | 0.2/1.3 MB
Progress (3): 0.2/4.6 MB | 12 kB | 0.2/1.3 MB
Progress (3): 0.2/4.6 MB | 12 kB | 0.2/1.3 MB
Progress (3): 0.2/4.6 MB | 12 kB | 0.2/1.3 MB
Progress (3): 0.2/4.6 MB | 12 kB | 0.2/1.3 MB
Progress (3): 0.2/4.6 MB | 12 kB | 0.2/1.3 MB
Progress (3): 0.2/4.6 MB | 12 kB | 0.2/1.3 MB
Progress (3): 0.2/4.6 MB | 12 kB | 0.2/1.3 MB
Progress (3): 0.2/4.6 MB | 12 kB | 0.2/1.3 MB
Progress (3): 0.2/4.6 MB | 12 kB | 0.2/1.3 MB
Progress (3): 0.2/4.6 MB | 12 kB | 0.2/1.3 MB
Progress (3): 0.2/4.6 MB | 12 kB | 0.2/1.3 MB
Progress (3): 0.2/4.6 MB | 12 kB | 0.2/1.3 MB
Progress (3): 0.2/4.6 MB | 12 kB | 0.2/1.3 MB
Progress (3): 0.2/4.6 MB | 12 kB | 0.2/1.3 MB
Progress (3): 0.2/4.6 MB | 12 kB | 0.2/1.3 MB
Progress (3): 0.2/4.6 MB | 12 kB | 0.2/1.3 MB
Progress (3): 0.2/4.6 MB | 12 kB | 0.3/1.3 MB
Progress (3): 0.2/4.6 MB | 12 kB | 0.3/1.3 MB
Progress (3): 0.2/4.6 MB | 12 kB | 0.3/1.3 MB
Progress (3): 0.2/4.6 MB | 12 kB | 0.3/1.3 MB
Progress (3): 0.2/4.6 MB | 12 kB | 0.3/1.3 MB
Progress (3): 0.2/4.6 MB | 12 kB | 0.3/1.3 MB
Progress (3): 0.2/4.6 MB | 12 kB | 0.3/1.3 MB
Progress (3): 0.2/4.6 MB | 12 kB | 0.3/1.3 MB
Progress (3): 0.2/4.6 MB | 12 kB | 0.3/1.3 MB
Progress (3): 0.2/4.6 MB | 12 kB | 0.3/1.3 MB
                                             
Downloaded from eclipse.maven.central.mirror: https://repo.eclipse.org/content/repositories/maven_central/org/apache/ant/ant-launcher/1.7.1/ant-launcher-1.7.1.jar (12 kB at 248 kB/s)
Progress (2): 0.2/4.6 MB | 0.3/1.3 MB
Progress (2): 0.2/4.6 MB | 0.3/1.3 MB
Progress (2): 0.2/4.6 MB | 0.3/1.3 MB
Progress (2): 0.2/4.6 MB | 0.3/1.3 MB
Progress (2): 0.2/4.6 MB | 0.3/1.3 MB
Progress (2): 0.2/4.6 MB | 0.3/1.3 MB
Progress (2): 0.2/4.6 MB | 0.3/1.3 MB
Progress (2): 0.2/4.6 MB | 0.3/1.3 MB
Progress (2): 0.2/4.6 MB | 0.3/1.3 MB
Progress (2): 0.2/4.6 MB | 0.3/1.3 MB
Progress (2): 0.2/4.6 MB | 0.3/1.3 MB
Progress (2): 0.2/4.6 MB | 0.3/1.3 MB
Progress (2): 0.2/4.6 MB | 0.3/1.3 MB
Progress (2): 0.2/4.6 MB | 0.3/1.3 MB
Progress (2): 0.2/4.6 MB | 0.3/1.3 MB
Progress (2): 0.2/4.6 MB | 0.4/1.3 MB
Progress (2): 0.2/4.6 MB | 0.4/1.3 MB
Progress (2): 0.2/4.6 MB | 0.4/1.3 MB
Progress (2): 0.2/4.6 MB | 0.4/1.3 MB
Progress (2): 0.2/4.6 MB | 0.4/1.3 MB
Progress (2): 0.2/4.6 MB | 0.4/1.3 MB
Progress (2): 0.2/4.6 MB | 0.4/1.3 MB
Progress (2): 0.2/4.6 MB | 0.4/1.3 MB
Progress (2): 0.2/4.6 MB | 0.4/1.3 MB
Progress (2): 0.2/4.6 MB | 0.4/1.3 MB
Progress (2): 0.2/4.6 MB | 0.4/1.3 MB
Progress (2): 0.2/4.6 MB | 0.4/1.3 MB
Progress (2): 0.2/4.6 MB | 0.4/1.3 MB
Progress (2): 0.2/4.6 MB | 0.4/1.3 MB
Progress (2): 0.2/4.6 MB | 0.4/1.3 MB
Progress (2): 0.2/4.6 MB | 0.4/1.3 MB
Progress (2): 0.2/4.6 MB | 0.4/1.3 MB
Progress (2): 0.2/4.6 MB | 0.4/1.3 MB
Progress (2): 0.2/4.6 MB | 0.4/1.3 MB
Progress (2): 0.2/4.6 MB | 0.4/1.3 MB
Progress (2): 0.2/4.6 MB | 0.4/1.3 MB
Progress (2): 0.2/4.6 MB | 0.4/1.3 MB
Progress (2): 0.2/4.6 MB | 0.4/1.3 MB
Progress (2): 0.2/4.6 MB | 0.4/1.3 MB
Progress (2): 0.2/4.6 MB | 0.4/1.3 MB
Progress (2): 0.2/4.6 MB | 0.4/1.3 MB
Progress (2): 0.2/4.6 MB | 0.4/1.3 MB
Progress (2): 0.2/4.6 MB | 0.4/1.3 MB
Progress (2): 0.2/4.6 MB | 0.4/1.3 MB
Progress (2): 0.2/4.6 MB | 0.4/1.3 MB
Progress (2): 0.3/4.6 MB | 0.4/1.3 MB
Progress (2): 0.3/4.6 MB | 0.4/1.3 MB
Progress (2): 0.3/4.6 MB | 0.4/1.3 MB
Progress (2): 0.3/4.6 MB | 0.4/1.3 MB
Progress (2): 0.3/4.6 MB | 0.4/1.3 MB
Progress (2): 0.3/4.6 MB | 0.4/1.3 MB
Progress (2): 0.3/4.6 MB | 0.4/1.3 MB
Progress (2): 0.3/4.6 MB | 0.4/1.3 MB
Progress (2): 0.3/4.6 MB | 0.4/1.3 MB
Progress (2): 0.3/4.6 MB | 0.4/1.3 MB
Progress (2): 0.3/4.6 MB | 0.4/1.3 MB
Progress (2): 0.3/4.6 MB | 0.4/1.3 MB
Progress (2): 0.3/4.6 MB | 0.4/1.3 MB
Progress (2): 0.3/4.6 MB | 0.4/1.3 MB
Progress (2): 0.3/4.6 MB | 0.4/1.3 MB
Progress (2): 0.3/4.6 MB | 0.5/1.3 MB
Progress (2): 0.3/4.6 MB | 0.5/1.3 MB
Progress (2): 0.3/4.6 MB | 0.5/1.3 MB
Progress (2): 0.3/4.6 MB | 0.5/1.3 MB
Progress (2): 0.3/4.6 MB | 0.5/1.3 MB
Progress (2): 0.3/4.6 MB | 0.5/1.3 MB
Progress (2): 0.3/4.6 MB | 0.5/1.3 MB
Progress (2): 0.3/4.6 MB | 0.5/1.3 MB
Progress (2): 0.3/4.6 MB | 0.5/1.3 MB
Progress (2): 0.3/4.6 MB | 0.5/1.3 MB
Progress (2): 0.3/4.6 MB | 0.5/1.3 MB
Progress (2): 0.3/4.6 MB | 0.5/1.3 MB
Progress (2): 0.3/4.6 MB | 0.5/1.3 MB
Progress (2): 0.3/4.6 MB | 0.5/1.3 MB
Progress (2): 0.3/4.6 MB | 0.5/1.3 MB
Progress (2): 0.3/4.6 MB | 0.5/1.3 MB
Progress (2): 0.3/4.6 MB | 0.5/1.3 MB
Progress (2): 0.3/4.6 MB | 0.5/1.3 MB
Progress (2): 0.3/4.6 MB | 0.5/1.3 MB
Progress (2): 0.3/4.6 MB | 0.5/1.3 MB
Progress (2): 0.3/4.6 MB | 0.5/1.3 MB
Progress (2): 0.4/4.6 MB | 0.5/1.3 MB
Progress (2): 0.4/4.6 MB | 0.5/1.3 MB
Progress (2): 0.4/4.6 MB | 0.5/1.3 MB
Progress (2): 0.4/4.6 MB | 0.5/1.3 MB
Progress (2): 0.4/4.6 MB | 0.5/1.3 MB
Progress (2): 0.4/4.6 MB | 0.5/1.3 MB
Progress (2): 0.4/4.6 MB | 0.5/1.3 MB
Progress (2): 0.4/4.6 MB | 0.5/1.3 MB
Progress (2): 0.4/4.6 MB | 0.5/1.3 MB
Progress (2): 0.4/4.6 MB | 0.5/1.3 MB
Progress (2): 0.4/4.6 MB | 0.5/1.3 MB
Progress (2): 0.4/4.6 MB | 0.5/1.3 MB
Progress (2): 0.4/4.6 MB | 0.5/1.3 MB
Progress (2): 0.4/4.6 MB | 0.5/1.3 MB
Progress (2): 0.4/4.6 MB | 0.5/1.3 MB
Progress (2): 0.4/4.6 MB | 0.5/1.3 MB
Progress (2): 0.4/4.6 MB | 0.5/1.3 MB
Progress (2): 0.4/4.6 MB | 0.5/1.3 MB
Progress (2): 0.4/4.6 MB | 0.5/1.3 MB
Progress (2): 0.4/4.6 MB | 0.5/1.3 MB
Progress (2): 0.4/4.6 MB | 0.6/1.3 MB
Progress (2): 0.4/4.6 MB | 0.6/1.3 MB
Progress (2): 0.4/4.6 MB | 0.6/1.3 MB
Progress (2): 0.4/4.6 MB | 0.6/1.3 MB
Progress (2): 0.4/4.6 MB | 0.6/1.3 MB
Progress (2): 0.4/4.6 MB | 0.6/1.3 MB
Progress (2): 0.4/4.6 MB | 0.6/1.3 MB
Progress (2): 0.4/4.6 MB | 0.6/1.3 MB
Progress (2): 0.4/4.6 MB | 0.6/1.3 MB
Progress (2): 0.4/4.6 MB | 0.6/1.3 MB
Progress (2): 0.4/4.6 MB | 0.6/1.3 MB
Progress (2): 0.4/4.6 MB | 0.6/1.3 MB
Progress (2): 0.4/4.6 MB | 0.6/1.3 MB
Progress (2): 0.4/4.6 MB | 0.6/1.3 MB
Progress (2): 0.4/4.6 MB | 0.6/1.3 MB
Progress (2): 0.4/4.6 MB | 0.6/1.3 MB
Progress (2): 0.4/4.6 MB | 0.6/1.3 MB
Progress (2): 0.4/4.6 MB | 0.6/1.3 MB
Progress (2): 0.4/4.6 MB | 0.6/1.3 MB
Progress (2): 0.4/4.6 MB | 0.6/1.3 MB
Progress (2): 0.4/4.6 MB | 0.6/1.3 MB
Progress (2): 0.4/4.6 MB | 0.6/1.3 MB
Progress (2): 0.4/4.6 MB | 0.6/1.3 MB
Progress (2): 0.4/4.6 MB | 0.6/1.3 MB
Progress (2): 0.4/4.6 MB | 0.6/1.3 MB
Progress (2): 0.4/4.6 MB | 0.7/1.3 MB
Progress (2): 0.4/4.6 MB | 0.7/1.3 MB
Progress (2): 0.4/4.6 MB | 0.7/1.3 MB
Progress (2): 0.4/4.6 MB | 0.7/1.3 MB
Progress (2): 0.4/4.6 MB | 0.7/1.3 MB
Progress (2): 0.4/4.6 MB | 0.7/1.3 MB
Progress (2): 0.4/4.6 MB | 0.7/1.3 MB
Progress (2): 0.4/4.6 MB | 0.7/1.3 MB
Progress (2): 0.4/4.6 MB | 0.7/1.3 MB
Progress (2): 0.4/4.6 MB | 0.7/1.3 MB
Progress (2): 0.4/4.6 MB | 0.7/1.3 MB
Progress (2): 0.4/4.6 MB | 0.7/1.3 MB
Progress (2): 0.4/4.6 MB | 0.7/1.3 MB
Progress (2): 0.4/4.6 MB | 0.7/1.3 MB
Progress (2): 0.4/4.6 MB | 0.7/1.3 MB
Progress (2): 0.4/4.6 MB | 0.7/1.3 MB
Progress (2): 0.4/4.6 MB | 0.7/1.3 MB
Progress (2): 0.4/4.6 MB | 0.7/1.3 MB
Progress (2): 0.4/4.6 MB | 0.7/1.3 MB
Progress (2): 0.4/4.6 MB | 0.7/1.3 MB
Progress (2): 0.4/4.6 MB | 0.7/1.3 MB
Progress (2): 0.4/4.6 MB | 0.7/1.3 MB
Progress (2): 0.4/4.6 MB | 0.7/1.3 MB
Progress (2): 0.4/4.6 MB | 0.7/1.3 MB
Progress (2): 0.4/4.6 MB | 0.7/1.3 MB
Progress (2): 0.4/4.6 MB | 0.8/1.3 MB
Progress (2): 0.4/4.6 MB | 0.8/1.3 MB
Progress (2): 0.4/4.6 MB | 0.8/1.3 MB
Progress (2): 0.4/4.6 MB | 0.8/1.3 MB
Progress (2): 0.4/4.6 MB | 0.8/1.3 MB
Progress (2): 0.4/4.6 MB | 0.8/1.3 MB
Progress (2): 0.4/4.6 MB | 0.8/1.3 MB
Progress (2): 0.4/4.6 MB | 0.8/1.3 MB
Progress (2): 0.4/4.6 MB | 0.8/1.3 MB
Progress (2): 0.4/4.6 MB | 0.8/1.3 MB
Progress (2): 0.4/4.6 MB | 0.8/1.3 MB
Progress (2): 0.4/4.6 MB | 0.8/1.3 MB
Progress (2): 0.4/4.6 MB | 0.8/1.3 MB
Progress (2): 0.4/4.6 MB | 0.8/1.3 MB
Progress (2): 0.4/4.6 MB | 0.8/1.3 MB
Progress (2): 0.4/4.6 MB | 0.8/1.3 MB
Progress (2): 0.4/4.6 MB | 0.8/1.3 MB
Progress (2): 0.4/4.6 MB | 0.8/1.3 MB
Progress (2): 0.4/4.6 MB | 0.8/1.3 MB
Progress (2): 0.4/4.6 MB | 0.8/1.3 MB
Progress (2): 0.4/4.6 MB | 0.8/1.3 MB
Progress (2): 0.4/4.6 MB | 0.8/1.3 MB
Progress (2): 0.4/4.6 MB | 0.8/1.3 MB
Progress (2): 0.4/4.6 MB | 0.8/1.3 MB
Progress (2): 0.4/4.6 MB | 0.8/1.3 MB
Progress (2): 0.4/4.6 MB | 0.9/1.3 MB
Progress (2): 0.4/4.6 MB | 0.9/1.3 MB
Progress (2): 0.4/4.6 MB | 0.9/1.3 MB
Progress (2): 0.4/4.6 MB | 0.9/1.3 MB
Progress (2): 0.4/4.6 MB | 0.9/1.3 MB
Progress (2): 0.4/4.6 MB | 0.9/1.3 MB
Progress (2): 0.4/4.6 MB | 0.9/1.3 MB
Progress (2): 0.4/4.6 MB | 0.9/1.3 MB
Progress (2): 0.4/4.6 MB | 0.9/1.3 MB
Progress (2): 0.4/4.6 MB | 0.9/1.3 MB
Progress (2): 0.4/4.6 MB | 0.9/1.3 MB
Progress (2): 0.4/4.6 MB | 0.9/1.3 MB
Progress (2): 0.4/4.6 MB | 0.9/1.3 MB
Progress (2): 0.4/4.6 MB | 0.9/1.3 MB
Progress (2): 0.4/4.6 MB | 0.9/1.3 MB
Progress (2): 0.4/4.6 MB | 0.9/1.3 MB
Progress (2): 0.4/4.6 MB | 0.9/1.3 MB
Progress (2): 0.4/4.6 MB | 0.9/1.3 MB
Progress (2): 0.4/4.6 MB | 0.9/1.3 MB
Progress (2): 0.4/4.6 MB | 0.9/1.3 MB
Progress (2): 0.4/4.6 MB | 0.9/1.3 MB
Progress (2): 0.4/4.6 MB | 0.9/1.3 MB
Progress (2): 0.4/4.6 MB | 0.9/1.3 MB
Progress (2): 0.4/4.6 MB | 0.9/1.3 MB
Progress (2): 0.4/4.6 MB | 0.9/1.3 MB
Progress (2): 0.4/4.6 MB | 1.0/1.3 MB
Progress (2): 0.4/4.6 MB | 1.0/1.3 MB
Progress (2): 0.4/4.6 MB | 1.0/1.3 MB
Progress (2): 0.4/4.6 MB | 1.0/1.3 MB
Progress (2): 0.4/4.6 MB | 1.0/1.3 MB
Progress (2): 0.4/4.6 MB | 1.0/1.3 MB
Progress (2): 0.4/4.6 MB | 1.0/1.3 MB
Progress (2): 0.4/4.6 MB | 1.0/1.3 MB
Progress (2): 0.4/4.6 MB | 1.0/1.3 MB
Progress (2): 0.4/4.6 MB | 1.0/1.3 MB
Progress (2): 0.4/4.6 MB | 1.0/1.3 MB
Progress (2): 0.4/4.6 MB | 1.0/1.3 MB
Progress (2): 0.4/4.6 MB | 1.0/1.3 MB
Progress (2): 0.4/4.6 MB | 1.0/1.3 MB
Progress (2): 0.4/4.6 MB | 1.0/1.3 MB
Progress (2): 0.4/4.6 MB | 1.0/1.3 MB
Progress (2): 0.4/4.6 MB | 1.0/1.3 MB
Progress (2): 0.4/4.6 MB | 1.0/1.3 MB
Progress (2): 0.4/4.6 MB | 1.0/1.3 MB
Progress (2): 0.4/4.6 MB | 1.0/1.3 MB
Progress (2): 0.4/4.6 MB | 1.0/1.3 MB
Progress (2): 0.4/4.6 MB | 1.0/1.3 MB
Progress (2): 0.4/4.6 MB | 1.0/1.3 MB
Progress (2): 0.4/4.6 MB | 1.0/1.3 MB
Progress (2): 0.4/4.6 MB | 1.0/1.3 MB
Progress (2): 0.4/4.6 MB | 1.1/1.3 MB
Progress (2): 0.4/4.6 MB | 1.1/1.3 MB
Progress (2): 0.4/4.6 MB | 1.1/1.3 MB
Progress (2): 0.4/4.6 MB | 1.1/1.3 MB
Progress (2): 0.4/4.6 MB | 1.1/1.3 MB
Progress (2): 0.4/4.6 MB | 1.1/1.3 MB
Progress (2): 0.4/4.6 MB | 1.1/1.3 MB
Progress (2): 0.4/4.6 MB | 1.1/1.3 MB
Progress (2): 0.4/4.6 MB | 1.1/1.3 MB
Progress (2): 0.4/4.6 MB | 1.1/1.3 MB
Progress (2): 0.4/4.6 MB | 1.1/1.3 MB
Progress (2): 0.4/4.6 MB | 1.1/1.3 MB
Progress (2): 0.4/4.6 MB | 1.1/1.3 MB
Progress (2): 0.4/4.6 MB | 1.1/1.3 MB
Progress (2): 0.4/4.6 MB | 1.1/1.3 MB
Progress (2): 0.4/4.6 MB | 1.1/1.3 MB
Progress (2): 0.4/4.6 MB | 1.1/1.3 MB
Progress (2): 0.4/4.6 MB | 1.1/1.3 MB
Progress (2): 0.4/4.6 MB | 1.1/1.3 MB
Progress (2): 0.4/4.6 MB | 1.1/1.3 MB
Progress (2): 0.4/4.6 MB | 1.1/1.3 MB
Progress (2): 0.4/4.6 MB | 1.1/1.3 MB
Progress (2): 0.4/4.6 MB | 1.1/1.3 MB
Progress (2): 0.4/4.6 MB | 1.1/1.3 MB
Progress (2): 0.4/4.6 MB | 1.1/1.3 MB
Progress (2): 0.4/4.6 MB | 1.2/1.3 MB
Progress (2): 0.4/4.6 MB | 1.2/1.3 MB
Progress (2): 0.4/4.6 MB | 1.2/1.3 MB
Progress (2): 0.4/4.6 MB | 1.2/1.3 MB
Progress (2): 0.4/4.6 MB | 1.2/1.3 MB
Progress (2): 0.4/4.6 MB | 1.2/1.3 MB
Progress (2): 0.4/4.6 MB | 1.2/1.3 MB
Progress (2): 0.4/4.6 MB | 1.2/1.3 MB
Progress (2): 0.4/4.6 MB | 1.2/1.3 MB
Progress (2): 0.4/4.6 MB | 1.2/1.3 MB
Progress (2): 0.4/4.6 MB | 1.2/1.3 MB
Progress (2): 0.4/4.6 MB | 1.2/1.3 MB
Progress (2): 0.4/4.6 MB | 1.2/1.3 MB
Progress (2): 0.4/4.6 MB | 1.2/1.3 MB
Progress (2): 0.4/4.6 MB | 1.2/1.3 MB
Progress (2): 0.4/4.6 MB | 1.2/1.3 MB
Progress (2): 0.4/4.6 MB | 1.2/1.3 MB
Progress (2): 0.4/4.6 MB | 1.2/1.3 MB
Progress (2): 0.4/4.6 MB | 1.2/1.3 MB
Progress (2): 0.4/4.6 MB | 1.2/1.3 MB
Progress (2): 0.4/4.6 MB | 1.2/1.3 MB
Progress (2): 0.4/4.6 MB | 1.2/1.3 MB
Progress (2): 0.4/4.6 MB | 1.2/1.3 MB
Progress (2): 0.4/4.6 MB | 1.2/1.3 MB
Progress (2): 0.4/4.6 MB | 1.2/1.3 MB
Progress (2): 0.4/4.6 MB | 1.2/1.3 MB
Progress (2): 0.4/4.6 MB | 1.2/1.3 MB
Progress (2): 0.4/4.6 MB | 1.2/1.3 MB
Progress (2): 0.4/4.6 MB | 1.2/1.3 MB
Progress (2): 0.4/4.6 MB | 1.2/1.3 MB
Progress (2): 0.4/4.6 MB | 1.2/1.3 MB
Progress (2): 0.4/4.6 MB | 1.2/1.3 MB
Progress (2): 0.4/4.6 MB | 1.2/1.3 MB
Progress (2): 0.4/4.6 MB | 1.2/1.3 MB
Progress (2): 0.4/4.6 MB | 1.2/1.3 MB
Progress (2): 0.4/4.6 MB | 1.2/1.3 MB
Progress (2): 0.4/4.6 MB | 1.2/1.3 MB
Progress (2): 0.4/4.6 MB | 1.2/1.3 MB
Progress (2): 0.4/4.6 MB | 1.2/1.3 MB
Progress (2): 0.4/4.6 MB | 1.2/1.3 MB
Progress (2): 0.4/4.6 MB | 1.2/1.3 MB
Progress (2): 0.4/4.6 MB | 1.2/1.3 MB
Progress (2): 0.4/4.6 MB | 1.2/1.3 MB
Progress (2): 0.4/4.6 MB | 1.2/1.3 MB
Progress (2): 0.5/4.6 MB | 1.2/1.3 MB
Progress (2): 0.5/4.6 MB | 1.2/1.3 MB
Progress (2): 0.5/4.6 MB | 1.2/1.3 MB
Progress (2): 0.5/4.6 MB | 1.2/1.3 MB
Progress (2): 0.5/4.6 MB | 1.2/1.3 MB
Progress (2): 0.5/4.6 MB | 1.3/1.3 MB
Progress (2): 0.5/4.6 MB | 1.3/1.3 MB
Progress (2): 0.5/4.6 MB | 1.3/1.3 MB
Progress (2): 0.5/4.6 MB | 1.3/1.3 MB
Progress (2): 0.5/4.6 MB | 1.3/1.3 MB
Progress (2): 0.5/4.6 MB | 1.3/1.3 MB
Progress (2): 0.5/4.6 MB | 1.3/1.3 MB
Progress (2): 0.5/4.6 MB | 1.3/1.3 MB
Progress (2): 0.5/4.6 MB | 1.3/1.3 MB
Progress (2): 0.5/4.6 MB | 1.3/1.3 MB
Progress (2): 0.5/4.6 MB | 1.3/1.3 MB
Progress (2): 0.5/4.6 MB | 1.3/1.3 MB
Progress (2): 0.5/4.6 MB | 1.3/1.3 MB
Progress (2): 0.5/4.6 MB | 1.3/1.3 MB
Progress (2): 0.5/4.6 MB | 1.3/1.3 MB
Progress (2): 0.5/4.6 MB | 1.3/1.3 MB
Progress (2): 0.5/4.6 MB | 1.3/1.3 MB
Progress (2): 0.5/4.6 MB | 1.3/1.3 MB
Progress (2): 0.5/4.6 MB | 1.3 MB    
                                 
Downloaded from eclipse.maven.central.mirror: https://repo.eclipse.org/content/repositories/maven_central/org/apache/ant/ant/1.7.1/ant-1.7.1.jar (1.3 MB at 16 MB/s)
Progress (1): 0.5/4.6 MB
Progress (1): 0.5/4.6 MB
Progress (1): 0.5/4.6 MB
Progress (1): 0.5/4.6 MB
Progress (1): 0.5/4.6 MB
Progress (1): 0.5/4.6 MB
Progress (1): 0.5/4.6 MB
Progress (1): 0.5/4.6 MB
Progress (1): 0.5/4.6 MB
Progress (1): 0.5/4.6 MB
Progress (1): 0.5/4.6 MB
Progress (1): 0.5/4.6 MB
Progress (1): 0.5/4.6 MB
Progress (1): 0.5/4.6 MB
Progress (1): 0.5/4.6 MB
Progress (1): 0.5/4.6 MB
Progress (1): 0.5/4.6 MB
Progress (1): 0.5/4.6 MB
Progress (1): 0.5/4.6 MB
Progress (1): 0.5/4.6 MB
Progress (1): 0.5/4.6 MB
Progress (1): 0.5/4.6 MB
Progress (1): 0.6/4.6 MB
Progress (1): 0.6/4.6 MB
Progress (1): 0.6/4.6 MB
Progress (1): 0.6/4.6 MB
Progress (1): 0.6/4.6 MB
Progress (1): 0.6/4.6 MB
Progress (1): 0.6/4.6 MB
Progress (1): 0.6/4.6 MB
Progress (1): 0.6/4.6 MB
Progress (1): 0.6/4.6 MB
Progress (1): 0.6/4.6 MB
Progress (1): 0.6/4.6 MB
Progress (1): 0.6/4.6 MB
Progress (1): 0.6/4.6 MB
Progress (1): 0.6/4.6 MB
Progress (1): 0.6/4.6 MB
Progress (1): 0.6/4.6 MB
Progress (1): 0.6/4.6 MB
Progress (1): 0.6/4.6 MB
Progress (1): 0.6/4.6 MB
Progress (1): 0.6/4.6 MB
Progress (1): 0.6/4.6 MB
Progress (1): 0.6/4.6 MB
Progress (1): 0.6/4.6 MB
Progress (1): 0.7/4.6 MB
Progress (1): 0.7/4.6 MB
Progress (1): 0.7/4.6 MB
Progress (1): 0.7/4.6 MB
Progress (1): 0.7/4.6 MB
Progress (1): 0.7/4.6 MB
Progress (1): 0.7/4.6 MB
Progress (1): 0.7/4.6 MB
Progress (1): 0.7/4.6 MB
Progress (1): 0.7/4.6 MB
Progress (1): 0.7/4.6 MB
Progress (1): 0.7/4.6 MB
Progress (1): 0.7/4.6 MB
Progress (1): 0.7/4.6 MB
Progress (1): 0.7/4.6 MB
Progress (1): 0.7/4.6 MB
Progress (1): 0.7/4.6 MB
Progress (1): 0.7/4.6 MB
Progress (1): 0.7/4.6 MB
Progress (1): 0.7/4.6 MB
Progress (1): 0.7/4.6 MB
Progress (1): 0.7/4.6 MB
Progress (1): 0.7/4.6 MB
Progress (1): 0.7/4.6 MB
Progress (1): 0.7/4.6 MB
Progress (1): 0.8/4.6 MB
Progress (1): 0.8/4.6 MB
Progress (1): 0.8/4.6 MB
Progress (1): 0.8/4.6 MB
Progress (1): 0.8/4.6 MB
Progress (1): 0.8/4.6 MB
Progress (1): 0.8/4.6 MB
Progress (1): 0.8/4.6 MB
Progress (1): 0.8/4.6 MB
Progress (1): 0.8/4.6 MB
Progress (1): 0.8/4.6 MB
Progress (1): 0.8/4.6 MB
Progress (1): 0.8/4.6 MB
Progress (1): 0.8/4.6 MB
Progress (1): 0.8/4.6 MB
Progress (1): 0.8/4.6 MB
Progress (1): 0.8/4.6 MB
Progress (1): 0.8/4.6 MB
Progress (1): 0.8/4.6 MB
Progress (1): 0.8/4.6 MB
Progress (1): 0.8/4.6 MB
Progress (1): 0.8/4.6 MB
Progress (1): 0.8/4.6 MB
Progress (1): 0.8/4.6 MB
Progress (1): 0.9/4.6 MB
Progress (1): 0.9/4.6 MB
Progress (1): 0.9/4.6 MB
Progress (1): 0.9/4.6 MB
Progress (1): 0.9/4.6 MB
Progress (1): 0.9/4.6 MB
Progress (1): 0.9/4.6 MB
Progress (1): 0.9/4.6 MB
Progress (1): 0.9/4.6 MB
Progress (1): 0.9/4.6 MB
Progress (1): 0.9/4.6 MB
Progress (1): 0.9/4.6 MB
Progress (1): 0.9/4.6 MB
Progress (1): 0.9/4.6 MB
Progress (1): 0.9/4.6 MB
Progress (1): 0.9/4.6 MB
Progress (1): 0.9/4.6 MB
Progress (1): 0.9/4.6 MB
Progress (1): 0.9/4.6 MB
Progress (1): 0.9/4.6 MB
Progress (1): 0.9/4.6 MB
Progress (1): 0.9/4.6 MB
Progress (1): 0.9/4.6 MB
Progress (1): 0.9/4.6 MB
Progress (1): 1.0/4.6 MB
Progress (1): 1.0/4.6 MB
Progress (1): 1.0/4.6 MB
Progress (1): 1.0/4.6 MB
Progress (1): 1.0/4.6 MB
Progress (1): 1.0/4.6 MB
Progress (1): 1.0/4.6 MB
Progress (1): 1.0/4.6 MB
Progress (1): 1.0/4.6 MB
Progress (1): 1.0/4.6 MB
Progress (1): 1.0/4.6 MB
Progress (1): 1.0/4.6 MB
Progress (1): 1.0/4.6 MB
Progress (1): 1.0/4.6 MB
Progress (1): 1.0/4.6 MB
Progress (1): 1.0/4.6 MB
Progress (1): 1.0/4.6 MB
Progress (1): 1.0/4.6 MB
Progress (1): 1.0/4.6 MB
Progress (1): 1.0/4.6 MB
Progress (1): 1.0/4.6 MB
Progress (1): 1.0/4.6 MB
Progress (1): 1.0/4.6 MB
Progress (1): 1.0/4.6 MB
Progress (1): 1.0/4.6 MB
Progress (1): 1.1/4.6 MB
Progress (1): 1.1/4.6 MB
Progress (1): 1.1/4.6 MB
Progress (1): 1.1/4.6 MB
Progress (1): 1.1/4.6 MB
Progress (1): 1.1/4.6 MB
Progress (1): 1.1/4.6 MB
Progress (1): 1.1/4.6 MB
Progress (1): 1.1/4.6 MB
Progress (1): 1.1/4.6 MB
Progress (1): 1.1/4.6 MB
Progress (1): 1.1/4.6 MB
Progress (1): 1.1/4.6 MB
Progress (1): 1.1/4.6 MB
Progress (1): 1.1/4.6 MB
Progress (1): 1.1/4.6 MB
Progress (1): 1.1/4.6 MB
Progress (1): 1.1/4.6 MB
Progress (1): 1.1/4.6 MB
Progress (1): 1.1/4.6 MB
Progress (1): 1.1/4.6 MB
Progress (1): 1.1/4.6 MB
Progress (1): 1.1/4.6 MB
Progress (1): 1.1/4.6 MB
Progress (1): 1.2/4.6 MB
Progress (1): 1.2/4.6 MB
Progress (1): 1.2/4.6 MB
Progress (1): 1.2/4.6 MB
Progress (1): 1.2/4.6 MB
Progress (1): 1.2/4.6 MB
Progress (1): 1.2/4.6 MB
Progress (1): 1.2/4.6 MB
Progress (1): 1.2/4.6 MB
Progress (1): 1.2/4.6 MB
Progress (1): 1.2/4.6 MB
Progress (1): 1.2/4.6 MB
Progress (1): 1.2/4.6 MB
Progress (1): 1.2/4.6 MB
Progress (1): 1.2/4.6 MB
Progress (1): 1.2/4.6 MB
Progress (1): 1.2/4.6 MB
Progress (1): 1.2/4.6 MB
Progress (1): 1.2/4.6 MB
Progress (1): 1.2/4.6 MB
Progress (1): 1.2/4.6 MB
Progress (1): 1.2/4.6 MB
Progress (1): 1.2/4.6 MB
Progress (1): 1.2/4.6 MB
Progress (1): 1.2/4.6 MB
Progress (1): 1.3/4.6 MB
Progress (1): 1.3/4.6 MB
Progress (1): 1.3/4.6 MB
Progress (1): 1.3/4.6 MB
Progress (1): 1.3/4.6 MB
Progress (1): 1.3/4.6 MB
Progress (1): 1.3/4.6 MB
Progress (1): 1.3/4.6 MB
Progress (1): 1.3/4.6 MB
Progress (1): 1.3/4.6 MB
Progress (1): 1.3/4.6 MB
Progress (1): 1.3/4.6 MB
Progress (1): 1.3/4.6 MB
Progress (1): 1.3/4.6 MB
Progress (1): 1.3/4.6 MB
Progress (1): 1.3/4.6 MB
Progress (1): 1.3/4.6 MB
Progress (1): 1.3/4.6 MB
Progress (1): 1.3/4.6 MB
Progress (1): 1.3/4.6 MB
Progress (1): 1.3/4.6 MB
Progress (1): 1.3/4.6 MB
Progress (1): 1.3/4.6 MB
Progress (1): 1.3/4.6 MB
Progress (1): 1.4/4.6 MB
Progress (1): 1.4/4.6 MB
Progress (1): 1.4/4.6 MB
Progress (1): 1.4/4.6 MB
Progress (1): 1.4/4.6 MB
Progress (1): 1.4/4.6 MB
Progress (1): 1.4/4.6 MB
Progress (1): 1.4/4.6 MB
Progress (1): 1.4/4.6 MB
Progress (1): 1.4/4.6 MB
Progress (1): 1.4/4.6 MB
Progress (1): 1.4/4.6 MB
Progress (1): 1.4/4.6 MB
Progress (1): 1.4/4.6 MB
Progress (1): 1.4/4.6 MB
Progress (1): 1.4/4.6 MB
Progress (1): 1.4/4.6 MB
Progress (1): 1.4/4.6 MB
Progress (1): 1.4/4.6 MB
Progress (1): 1.4/4.6 MB
Progress (1): 1.4/4.6 MB
Progress (1): 1.4/4.6 MB
Progress (1): 1.4/4.6 MB
Progress (1): 1.4/4.6 MB
Progress (1): 1.4/4.6 MB
Progress (1): 1.5/4.6 MB
Progress (1): 1.5/4.6 MB
Progress (1): 1.5/4.6 MB
Progress (1): 1.5/4.6 MB
Progress (1): 1.5/4.6 MB
Progress (1): 1.5/4.6 MB
Progress (1): 1.5/4.6 MB
Progress (1): 1.5/4.6 MB
Progress (1): 1.5/4.6 MB
Progress (1): 1.5/4.6 MB
Progress (1): 1.5/4.6 MB
Progress (1): 1.5/4.6 MB
Progress (1): 1.5/4.6 MB
Progress (1): 1.5/4.6 MB
Progress (1): 1.5/4.6 MB
Progress (1): 1.5/4.6 MB
Progress (1): 1.5/4.6 MB
Progress (1): 1.5/4.6 MB
Progress (1): 1.5/4.6 MB
Progress (1): 1.5/4.6 MB
Progress (1): 1.5/4.6 MB
Progress (1): 1.5/4.6 MB
Progress (1): 1.5/4.6 MB
Progress (1): 1.5/4.6 MB
Progress (1): 1.6/4.6 MB
Progress (1): 1.6/4.6 MB
Progress (1): 1.6/4.6 MB
Progress (1): 1.6/4.6 MB
Progress (1): 1.6/4.6 MB
Progress (1): 1.6/4.6 MB
Progress (1): 1.6/4.6 MB
Progress (1): 1.6/4.6 MB
Progress (1): 1.6/4.6 MB
Progress (1): 1.6/4.6 MB
Progress (1): 1.6/4.6 MB
Progress (1): 1.6/4.6 MB
Progress (1): 1.6/4.6 MB
Progress (1): 1.6/4.6 MB
Progress (1): 1.6/4.6 MB
Progress (1): 1.6/4.6 MB
Progress (1): 1.6/4.6 MB
Progress (1): 1.6/4.6 MB
Progress (1): 1.6/4.6 MB
Progress (1): 1.6/4.6 MB
Progress (1): 1.6/4.6 MB
Progress (1): 1.6/4.6 MB
Progress (1): 1.6/4.6 MB
Progress (1): 1.6/4.6 MB
Progress (1): 1.7/4.6 MB
Progress (1): 1.7/4.6 MB
Progress (1): 1.7/4.6 MB
Progress (1): 1.7/4.6 MB
Progress (1): 1.7/4.6 MB
Progress (1): 1.7/4.6 MB
Progress (1): 1.7/4.6 MB
Progress (1): 1.7/4.6 MB
Progress (1): 1.7/4.6 MB
Progress (1): 1.7/4.6 MB
Progress (1): 1.7/4.6 MB
Progress (1): 1.7/4.6 MB
Progress (1): 1.7/4.6 MB
Progress (1): 1.7/4.6 MB
Progress (1): 1.7/4.6 MB
Progress (1): 1.7/4.6 MB
Progress (1): 1.7/4.6 MB
Progress (1): 1.7/4.6 MB
Progress (1): 1.7/4.6 MB
Progress (1): 1.7/4.6 MB
Progress (1): 1.7/4.6 MB
Progress (1): 1.7/4.6 MB
Progress (1): 1.7/4.6 MB
Progress (1): 1.7/4.6 MB
Progress (1): 1.7/4.6 MB
Progress (1): 1.8/4.6 MB
Progress (1): 1.8/4.6 MB
Progress (1): 1.8/4.6 MB
Progress (1): 1.8/4.6 MB
Progress (1): 1.8/4.6 MB
Progress (1): 1.8/4.6 MB
Progress (1): 1.8/4.6 MB
Progress (1): 1.8/4.6 MB
Progress (1): 1.8/4.6 MB
Progress (1): 1.8/4.6 MB
Progress (1): 1.8/4.6 MB
Progress (1): 1.8/4.6 MB
Progress (1): 1.8/4.6 MB
Progress (1): 1.8/4.6 MB
Progress (1): 1.8/4.6 MB
Progress (1): 1.8/4.6 MB
Progress (1): 1.8/4.6 MB
Progress (1): 1.8/4.6 MB
Progress (1): 1.8/4.6 MB
Progress (1): 1.8/4.6 MB
Progress (1): 1.8/4.6 MB
Progress (1): 1.8/4.6 MB
Progress (1): 1.8/4.6 MB
Progress (1): 1.8/4.6 MB
Progress (1): 1.9/4.6 MB
Progress (1): 1.9/4.6 MB
Progress (1): 1.9/4.6 MB
Progress (1): 1.9/4.6 MB
Progress (1): 1.9/4.6 MB
Progress (1): 1.9/4.6 MB
Progress (1): 1.9/4.6 MB
Progress (1): 1.9/4.6 MB
Progress (1): 1.9/4.6 MB
Progress (1): 1.9/4.6 MB
Progress (1): 1.9/4.6 MB
Progress (1): 1.9/4.6 MB
Progress (1): 1.9/4.6 MB
Progress (1): 1.9/4.6 MB
Progress (1): 1.9/4.6 MB
Progress (1): 1.9/4.6 MB
Progress (1): 1.9/4.6 MB
Progress (1): 1.9/4.6 MB
Progress (1): 1.9/4.6 MB
Progress (1): 1.9/4.6 MB
Progress (1): 1.9/4.6 MB
Progress (1): 1.9/4.6 MB
Progress (1): 1.9/4.6 MB
Progress (1): 1.9/4.6 MB
Progress (1): 1.9/4.6 MB
Progress (1): 2.0/4.6 MB
Progress (1): 2.0/4.6 MB
Progress (1): 2.0/4.6 MB
Progress (1): 2.0/4.6 MB
Progress (1): 2.0/4.6 MB
Progress (1): 2.0/4.6 MB
Progress (1): 2.0/4.6 MB
Progress (1): 2.0/4.6 MB
Progress (1): 2.0/4.6 MB
Progress (1): 2.0/4.6 MB
Progress (1): 2.0/4.6 MB
Progress (1): 2.0/4.6 MB
Progress (1): 2.0/4.6 MB
Progress (1): 2.0/4.6 MB
Progress (1): 2.0/4.6 MB
Progress (1): 2.0/4.6 MB
Progress (1): 2.0/4.6 MB
Progress (1): 2.0/4.6 MB
Progress (1): 2.0/4.6 MB
Progress (1): 2.0/4.6 MB
Progress (1): 2.0/4.6 MB
Progress (1): 2.0/4.6 MB
Progress (1): 2.0/4.6 MB
Progress (1): 2.0/4.6 MB
Progress (1): 2.1/4.6 MB
Progress (1): 2.1/4.6 MB
Progress (1): 2.1/4.6 MB
Progress (1): 2.1/4.6 MB
Progress (1): 2.1/4.6 MB
Progress (1): 2.1/4.6 MB
Progress (1): 2.1/4.6 MB
Progress (1): 2.1/4.6 MB
Progress (1): 2.1/4.6 MB
Progress (1): 2.1/4.6 MB
Progress (1): 2.1/4.6 MB
Progress (1): 2.1/4.6 MB
Progress (1): 2.1/4.6 MB
Progress (1): 2.1/4.6 MB
Progress (1): 2.1/4.6 MB
Progress (1): 2.1/4.6 MB
Progress (1): 2.1/4.6 MB
Progress (1): 2.1/4.6 MB
Progress (1): 2.1/4.6 MB
Progress (1): 2.1/4.6 MB
Progress (1): 2.1/4.6 MB
Progress (1): 2.1/4.6 MB
Progress (1): 2.1/4.6 MB
Progress (1): 2.1/4.6 MB
Progress (1): 2.2/4.6 MB
Progress (1): 2.2/4.6 MB
Progress (1): 2.2/4.6 MB
Progress (1): 2.2/4.6 MB
Progress (1): 2.2/4.6 MB
Progress (1): 2.2/4.6 MB
Progress (1): 2.2/4.6 MB
Progress (1): 2.2/4.6 MB
Progress (1): 2.2/4.6 MB
Progress (1): 2.2/4.6 MB
Progress (1): 2.2/4.6 MB
Progress (1): 2.2/4.6 MB
Progress (1): 2.2/4.6 MB
Progress (1): 2.2/4.6 MB
Progress (1): 2.2/4.6 MB
Progress (1): 2.2/4.6 MB
Progress (1): 2.2/4.6 MB
Progress (1): 2.2/4.6 MB
Progress (1): 2.2/4.6 MB
Progress (1): 2.2/4.6 MB
Progress (1): 2.2/4.6 MB
Progress (1): 2.2/4.6 MB
Progress (1): 2.2/4.6 MB
Progress (1): 2.2/4.6 MB
Progress (1): 2.2/4.6 MB
Progress (1): 2.3/4.6 MB
Progress (1): 2.3/4.6 MB
Progress (1): 2.3/4.6 MB
Progress (1): 2.3/4.6 MB
Progress (1): 2.3/4.6 MB
Progress (1): 2.3/4.6 MB
Progress (1): 2.3/4.6 MB
Progress (1): 2.3/4.6 MB
Progress (1): 2.3/4.6 MB
Progress (1): 2.3/4.6 MB
Progress (1): 2.3/4.6 MB
Progress (1): 2.3/4.6 MB
Progress (1): 2.3/4.6 MB
Progress (1): 2.3/4.6 MB
Progress (1): 2.3/4.6 MB
Progress (1): 2.3/4.6 MB
Progress (1): 2.3/4.6 MB
Progress (1): 2.3/4.6 MB
Progress (1): 2.3/4.6 MB
Progress (1): 2.3/4.6 MB
Progress (1): 2.3/4.6 MB
Progress (1): 2.3/4.6 MB
Progress (1): 2.3/4.6 MB
Progress (1): 2.3/4.6 MB
Progress (1): 2.4/4.6 MB
Progress (1): 2.4/4.6 MB
Progress (1): 2.4/4.6 MB
Progress (1): 2.4/4.6 MB
Progress (1): 2.4/4.6 MB
Progress (1): 2.4/4.6 MB
Progress (1): 2.4/4.6 MB
Progress (1): 2.4/4.6 MB
Progress (1): 2.4/4.6 MB
Progress (1): 2.4/4.6 MB
Progress (1): 2.4/4.6 MB
Progress (1): 2.4/4.6 MB
Progress (1): 2.4/4.6 MB
Progress (1): 2.4/4.6 MB
Progress (1): 2.4/4.6 MB
Progress (1): 2.4/4.6 MB
Progress (1): 2.4/4.6 MB
Progress (1): 2.4/4.6 MB
Progress (1): 2.4/4.6 MB
Progress (1): 2.4/4.6 MB
Progress (1): 2.4/4.6 MB
Progress (1): 2.4/4.6 MB
Progress (1): 2.4/4.6 MB
Progress (1): 2.4/4.6 MB
Progress (1): 2.4/4.6 MB
Progress (1): 2.5/4.6 MB
Progress (1): 2.5/4.6 MB
Progress (1): 2.5/4.6 MB
Progress (1): 2.5/4.6 MB
Progress (1): 2.5/4.6 MB
Progress (1): 2.5/4.6 MB
Progress (1): 2.5/4.6 MB
Progress (1): 2.5/4.6 MB
Progress (1): 2.5/4.6 MB
Progress (1): 2.5/4.6 MB
Progress (1): 2.5/4.6 MB
Progress (1): 2.5/4.6 MB
Progress (1): 2.5/4.6 MB
Progress (1): 2.5/4.6 MB
Progress (1): 2.5/4.6 MB
Progress (1): 2.5/4.6 MB
Progress (1): 2.5/4.6 MB
Progress (1): 2.5/4.6 MB
Progress (1): 2.5/4.6 MB
Progress (1): 2.5/4.6 MB
Progress (1): 2.5/4.6 MB
Progress (1): 2.5/4.6 MB
Progress (1): 2.5/4.6 MB
Progress (1): 2.5/4.6 MB
Progress (1): 2.6/4.6 MB
Progress (1): 2.6/4.6 MB
Progress (1): 2.6/4.6 MB
Progress (1): 2.6/4.6 MB
Progress (1): 2.6/4.6 MB
Progress (1): 2.6/4.6 MB
Progress (1): 2.6/4.6 MB
Progress (1): 2.6/4.6 MB
Progress (1): 2.6/4.6 MB
Progress (1): 2.6/4.6 MB
Progress (1): 2.6/4.6 MB
Progress (1): 2.6/4.6 MB
Progress (1): 2.6/4.6 MB
Progress (1): 2.6/4.6 MB
Progress (1): 2.6/4.6 MB
Progress (1): 2.6/4.6 MB
Progress (1): 2.6/4.6 MB
Progress (1): 2.6/4.6 MB
Progress (1): 2.6/4.6 MB
Progress (1): 2.6/4.6 MB
Progress (1): 2.6/4.6 MB
Progress (1): 2.6/4.6 MB
Progress (1): 2.6/4.6 MB
Progress (1): 2.6/4.6 MB
Progress (1): 2.7/4.6 MB
Progress (1): 2.7/4.6 MB
Progress (1): 2.7/4.6 MB
Progress (1): 2.7/4.6 MB
Progress (1): 2.7/4.6 MB
Progress (1): 2.7/4.6 MB
Progress (1): 2.7/4.6 MB
Progress (1): 2.7/4.6 MB
Progress (1): 2.7/4.6 MB
Progress (1): 2.7/4.6 MB
Progress (1): 2.7/4.6 MB
Progress (1): 2.7/4.6 MB
Progress (1): 2.7/4.6 MB
Progress (1): 2.7/4.6 MB
Progress (1): 2.7/4.6 MB
Progress (1): 2.7/4.6 MB
Progress (1): 2.7/4.6 MB
Progress (1): 2.7/4.6 MB
Progress (1): 2.7/4.6 MB
Progress (1): 2.7/4.6 MB
Progress (1): 2.7/4.6 MB
Progress (1): 2.7/4.6 MB
Progress (1): 2.7/4.6 MB
Progress (1): 2.7/4.6 MB
Progress (1): 2.7/4.6 MB
Progress (1): 2.8/4.6 MB
Progress (1): 2.8/4.6 MB
Progress (1): 2.8/4.6 MB
Progress (1): 2.8/4.6 MB
Progress (1): 2.8/4.6 MB
Progress (1): 2.8/4.6 MB
Progress (1): 2.8/4.6 MB
Progress (1): 2.8/4.6 MB
Progress (1): 2.8/4.6 MB
Progress (1): 2.8/4.6 MB
Progress (1): 2.8/4.6 MB
Progress (1): 2.8/4.6 MB
Progress (1): 2.8/4.6 MB
Progress (1): 2.8/4.6 MB
Progress (1): 2.8/4.6 MB
Progress (1): 2.8/4.6 MB
Progress (1): 2.8/4.6 MB
Progress (1): 2.8/4.6 MB
Progress (1): 2.8/4.6 MB
Progress (1): 2.8/4.6 MB
Progress (1): 2.8/4.6 MB
Progress (1): 2.8/4.6 MB
Progress (1): 2.8/4.6 MB
Progress (1): 2.8/4.6 MB
Progress (1): 2.9/4.6 MB
Progress (1): 2.9/4.6 MB
Progress (1): 2.9/4.6 MB
Progress (1): 2.9/4.6 MB
Progress (1): 2.9/4.6 MB
Progress (1): 2.9/4.6 MB
Progress (1): 2.9/4.6 MB
Progress (1): 2.9/4.6 MB
Progress (1): 2.9/4.6 MB
Progress (1): 2.9/4.6 MB
Progress (1): 2.9/4.6 MB
Progress (1): 2.9/4.6 MB
Progress (1): 2.9/4.6 MB
Progress (1): 2.9/4.6 MB
Progress (1): 2.9/4.6 MB
Progress (1): 2.9/4.6 MB
Progress (1): 2.9/4.6 MB
Progress (1): 2.9/4.6 MB
Progress (1): 2.9/4.6 MB
Progress (1): 2.9/4.6 MB
Progress (1): 2.9/4.6 MB
Progress (1): 2.9/4.6 MB
Progress (1): 2.9/4.6 MB
Progress (1): 2.9/4.6 MB
Progress (1): 2.9/4.6 MB
Progress (1): 3.0/4.6 MB
Progress (1): 3.0/4.6 MB
Progress (1): 3.0/4.6 MB
Progress (1): 3.0/4.6 MB
Progress (1): 3.0/4.6 MB
Progress (1): 3.0/4.6 MB
Progress (1): 3.0/4.6 MB
Progress (1): 3.0/4.6 MB
Progress (1): 3.0/4.6 MB
Progress (1): 3.0/4.6 MB
Progress (1): 3.0/4.6 MB
Progress (1): 3.0/4.6 MB
Progress (1): 3.0/4.6 MB
Progress (1): 3.0/4.6 MB
Progress (1): 3.0/4.6 MB
Progress (1): 3.0/4.6 MB
Progress (1): 3.0/4.6 MB
Progress (1): 3.0/4.6 MB
Progress (1): 3.0/4.6 MB
Progress (1): 3.0/4.6 MB
Progress (1): 3.0/4.6 MB
Progress (1): 3.0/4.6 MB
Progress (1): 3.0/4.6 MB
Progress (1): 3.0/4.6 MB
Progress (1): 3.1/4.6 MB
Progress (1): 3.1/4.6 MB
Progress (1): 3.1/4.6 MB
Progress (1): 3.1/4.6 MB
Progress (1): 3.1/4.6 MB
Progress (1): 3.1/4.6 MB
Progress (1): 3.1/4.6 MB
Progress (1): 3.1/4.6 MB
Progress (1): 3.1/4.6 MB
Progress (1): 3.1/4.6 MB
Progress (1): 3.1/4.6 MB
Progress (1): 3.1/4.6 MB
Progress (1): 3.1/4.6 MB
Progress (1): 3.1/4.6 MB
Progress (1): 3.1/4.6 MB
Progress (1): 3.1/4.6 MB
Progress (1): 3.1/4.6 MB
Progress (1): 3.1/4.6 MB
Progress (1): 3.1/4.6 MB
Progress (1): 3.1/4.6 MB
Progress (1): 3.1/4.6 MB
Progress (1): 3.1/4.6 MB
Progress (1): 3.1/4.6 MB
Progress (1): 3.1/4.6 MB
Progress (1): 3.1/4.6 MB
Progress (1): 3.2/4.6 MB
Progress (1): 3.2/4.6 MB
Progress (1): 3.2/4.6 MB
Progress (1): 3.2/4.6 MB
Progress (1): 3.2/4.6 MB
Progress (1): 3.2/4.6 MB
Progress (1): 3.2/4.6 MB
Progress (1): 3.2/4.6 MB
Progress (1): 3.2/4.6 MB
Progress (1): 3.2/4.6 MB
Progress (1): 3.2/4.6 MB
Progress (1): 3.2/4.6 MB
Progress (1): 3.2/4.6 MB
Progress (1): 3.2/4.6 MB
Progress (1): 3.2/4.6 MB
Progress (1): 3.2/4.6 MB
Progress (1): 3.2/4.6 MB
Progress (1): 3.2/4.6 MB
Progress (1): 3.2/4.6 MB
Progress (1): 3.2/4.6 MB
Progress (1): 3.2/4.6 MB
Progress (1): 3.2/4.6 MB
Progress (1): 3.2/4.6 MB
Progress (1): 3.2/4.6 MB
Progress (1): 3.3/4.6 MB
Progress (1): 3.3/4.6 MB
Progress (1): 3.3/4.6 MB
Progress (1): 3.3/4.6 MB
Progress (1): 3.3/4.6 MB
Progress (1): 3.3/4.6 MB
Progress (1): 3.3/4.6 MB
Progress (1): 3.3/4.6 MB
Progress (1): 3.3/4.6 MB
Progress (1): 3.3/4.6 MB
Progress (1): 3.3/4.6 MB
Progress (1): 3.3/4.6 MB
Progress (1): 3.3/4.6 MB
Progress (1): 3.3/4.6 MB
Progress (1): 3.3/4.6 MB
Progress (1): 3.3/4.6 MB
Progress (1): 3.3/4.6 MB
Progress (1): 3.3/4.6 MB
Progress (1): 3.3/4.6 MB
Progress (1): 3.3/4.6 MB
Progress (1): 3.3/4.6 MB
Progress (1): 3.3/4.6 MB
Progress (1): 3.3/4.6 MB
Progress (1): 3.3/4.6 MB
Progress (1): 3.4/4.6 MB
Progress (1): 3.4/4.6 MB
Progress (1): 3.4/4.6 MB
Progress (1): 3.4/4.6 MB
Progress (1): 3.4/4.6 MB
Progress (1): 3.4/4.6 MB
Progress (1): 3.4/4.6 MB
Progress (1): 3.4/4.6 MB
Progress (1): 3.4/4.6 MB
Progress (1): 3.4/4.6 MB
Progress (1): 3.4/4.6 MB
Progress (1): 3.4/4.6 MB
Progress (1): 3.4/4.6 MB
Progress (1): 3.4/4.6 MB
Progress (1): 3.4/4.6 MB
Progress (1): 3.4/4.6 MB
Progress (1): 3.4/4.6 MB
Progress (1): 3.4/4.6 MB
Progress (1): 3.4/4.6 MB
Progress (1): 3.4/4.6 MB
Progress (1): 3.4/4.6 MB
Progress (1): 3.4/4.6 MB
Progress (1): 3.4/4.6 MB
Progress (1): 3.4/4.6 MB
Progress (1): 3.4/4.6 MB
Progress (1): 3.5/4.6 MB
Progress (1): 3.5/4.6 MB
Progress (1): 3.5/4.6 MB
Progress (1): 3.5/4.6 MB
Progress (1): 3.5/4.6 MB
Progress (1): 3.5/4.6 MB
Progress (1): 3.5/4.6 MB
Progress (1): 3.5/4.6 MB
Progress (1): 3.5/4.6 MB
Progress (1): 3.5/4.6 MB
Progress (1): 3.5/4.6 MB
Progress (1): 3.5/4.6 MB
Progress (1): 3.5/4.6 MB
Progress (1): 3.5/4.6 MB
Progress (1): 3.5/4.6 MB
Progress (1): 3.5/4.6 MB
Progress (1): 3.5/4.6 MB
Progress (1): 3.5/4.6 MB
Progress (1): 3.5/4.6 MB
Progress (1): 3.5/4.6 MB
Progress (1): 3.5/4.6 MB
Progress (1): 3.5/4.6 MB
Progress (1): 3.5/4.6 MB
Progress (1): 3.5/4.6 MB
Progress (1): 3.6/4.6 MB
Progress (1): 3.6/4.6 MB
Progress (1): 3.6/4.6 MB
Progress (1): 3.6/4.6 MB
Progress (1): 3.6/4.6 MB
Progress (1): 3.6/4.6 MB
Progress (1): 3.6/4.6 MB
Progress (1): 3.6/4.6 MB
Progress (1): 3.6/4.6 MB
Progress (1): 3.6/4.6 MB
Progress (1): 3.6/4.6 MB
Progress (1): 3.6/4.6 MB
Progress (1): 3.6/4.6 MB
Progress (1): 3.6/4.6 MB
Progress (1): 3.6/4.6 MB
Progress (1): 3.6/4.6 MB
Progress (1): 3.6/4.6 MB
Progress (1): 3.6/4.6 MB
Progress (1): 3.6/4.6 MB
Progress (1): 3.6/4.6 MB
Progress (1): 3.6/4.6 MB
Progress (1): 3.6/4.6 MB
Progress (1): 3.6/4.6 MB
Progress (1): 3.6/4.6 MB
Progress (1): 3.6/4.6 MB
Progress (1): 3.7/4.6 MB
Progress (1): 3.7/4.6 MB
Progress (1): 3.7/4.6 MB
Progress (1): 3.7/4.6 MB
Progress (1): 3.7/4.6 MB
Progress (1): 3.7/4.6 MB
Progress (1): 3.7/4.6 MB
Progress (1): 3.7/4.6 MB
Progress (1): 3.7/4.6 MB
Progress (1): 3.7/4.6 MB
Progress (1): 3.7/4.6 MB
Progress (1): 3.7/4.6 MB
Progress (1): 3.7/4.6 MB
Progress (1): 3.7/4.6 MB
Progress (1): 3.7/4.6 MB
Progress (1): 3.7/4.6 MB
Progress (1): 3.7/4.6 MB
Progress (1): 3.7/4.6 MB
Progress (1): 3.7/4.6 MB
Progress (1): 3.7/4.6 MB
Progress (1): 3.7/4.6 MB
Progress (1): 3.7/4.6 MB
Progress (1): 3.7/4.6 MB
Progress (1): 3.7/4.6 MB
Progress (1): 3.8/4.6 MB
Progress (1): 3.8/4.6 MB
Progress (1): 3.8/4.6 MB
Progress (1): 3.8/4.6 MB
Progress (1): 3.8/4.6 MB
Progress (1): 3.8/4.6 MB
Progress (1): 3.8/4.6 MB
Progress (1): 3.8/4.6 MB
Progress (1): 3.8/4.6 MB
Progress (1): 3.8/4.6 MB
Progress (1): 3.8/4.6 MB
Progress (1): 3.8/4.6 MB
Progress (1): 3.8/4.6 MB
Progress (1): 3.8/4.6 MB
Progress (1): 3.8/4.6 MB
Progress (1): 3.8/4.6 MB
Progress (1): 3.8/4.6 MB
Progress (1): 3.8/4.6 MB
Progress (1): 3.8/4.6 MB
Progress (1): 3.8/4.6 MB
Progress (1): 3.8/4.6 MB
Progress (1): 3.8/4.6 MB
Progress (1): 3.8/4.6 MB
Progress (1): 3.8/4.6 MB
Progress (1): 3.9/4.6 MB
Progress (1): 3.9/4.6 MB
Progress (1): 3.9/4.6 MB
Progress (1): 3.9/4.6 MB
Progress (1): 3.9/4.6 MB
Progress (1): 3.9/4.6 MB
Progress (1): 3.9/4.6 MB
Progress (1): 3.9/4.6 MB
Progress (1): 3.9/4.6 MB
Progress (1): 3.9/4.6 MB
Progress (1): 3.9/4.6 MB
Progress (1): 3.9/4.6 MB
Progress (1): 3.9/4.6 MB
Progress (1): 3.9/4.6 MB
Progress (1): 3.9/4.6 MB
Progress (1): 3.9/4.6 MB
Progress (1): 3.9/4.6 MB
Progress (1): 3.9/4.6 MB
Progress (1): 3.9/4.6 MB
Progress (1): 3.9/4.6 MB
Progress (1): 3.9/4.6 MB
Progress (1): 3.9/4.6 MB
Progress (1): 3.9/4.6 MB
Progress (1): 3.9/4.6 MB
Progress (1): 3.9/4.6 MB
Progress (1): 4.0/4.6 MB
Progress (1): 4.0/4.6 MB
Progress (1): 4.0/4.6 MB
Progress (1): 4.0/4.6 MB
Progress (1): 4.0/4.6 MB
Progress (1): 4.0/4.6 MB
Progress (1): 4.0/4.6 MB
Progress (1): 4.0/4.6 MB
Progress (1): 4.0/4.6 MB
Progress (1): 4.0/4.6 MB
Progress (1): 4.0/4.6 MB
Progress (1): 4.0/4.6 MB
Progress (1): 4.0/4.6 MB
Progress (1): 4.0/4.6 MB
Progress (1): 4.0/4.6 MB
Progress (1): 4.0/4.6 MB
Progress (1): 4.0/4.6 MB
Progress (1): 4.0/4.6 MB
Progress (1): 4.0/4.6 MB
Progress (1): 4.0/4.6 MB
Progress (1): 4.0/4.6 MB
Progress (1): 4.0/4.6 MB
Progress (1): 4.0/4.6 MB
Progress (1): 4.0/4.6 MB
Progress (1): 4.1/4.6 MB
Progress (1): 4.1/4.6 MB
Progress (1): 4.1/4.6 MB
Progress (1): 4.1/4.6 MB
Progress (1): 4.1/4.6 MB
Progress (1): 4.1/4.6 MB
Progress (1): 4.1/4.6 MB
Progress (1): 4.1/4.6 MB
Progress (1): 4.1/4.6 MB
Progress (1): 4.1/4.6 MB
Progress (1): 4.1/4.6 MB
Progress (1): 4.1/4.6 MB
Progress (1): 4.1/4.6 MB
Progress (1): 4.1/4.6 MB
Progress (1): 4.1/4.6 MB
Progress (1): 4.1/4.6 MB
Progress (1): 4.1/4.6 MB
Progress (1): 4.1/4.6 MB
Progress (1): 4.1/4.6 MB
Progress (1): 4.1/4.6 MB
Progress (1): 4.1/4.6 MB
Progress (1): 4.1/4.6 MB
Progress (1): 4.1/4.6 MB
Progress (1): 4.1/4.6 MB
Progress (1): 4.1/4.6 MB
Progress (1): 4.2/4.6 MB
Progress (1): 4.2/4.6 MB
Progress (1): 4.2/4.6 MB
Progress (1): 4.2/4.6 MB
Progress (1): 4.2/4.6 MB
Progress (1): 4.2/4.6 MB
Progress (1): 4.2/4.6 MB
Progress (1): 4.2/4.6 MB
Progress (1): 4.2/4.6 MB
Progress (1): 4.2/4.6 MB
Progress (1): 4.2/4.6 MB
Progress (1): 4.2/4.6 MB
Progress (1): 4.2/4.6 MB
Progress (1): 4.2/4.6 MB
Progress (1): 4.2/4.6 MB
Progress (1): 4.2/4.6 MB
Progress (1): 4.2/4.6 MB
Progress (1): 4.2/4.6 MB
Progress (1): 4.2/4.6 MB
Progress (1): 4.2/4.6 MB
Progress (1): 4.2/4.6 MB
Progress (1): 4.2/4.6 MB
Progress (1): 4.2/4.6 MB
Progress (1): 4.2/4.6 MB
Progress (1): 4.3/4.6 MB
Progress (1): 4.3/4.6 MB
Progress (1): 4.3/4.6 MB
Progress (1): 4.3/4.6 MB
Progress (1): 4.3/4.6 MB
Progress (1): 4.3/4.6 MB
Progress (1): 4.3/4.6 MB
Progress (1): 4.3/4.6 MB
Progress (1): 4.3/4.6 MB
Progress (1): 4.3/4.6 MB
Progress (1): 4.3/4.6 MB
Progress (1): 4.3/4.6 MB
Progress (1): 4.3/4.6 MB
Progress (1): 4.3/4.6 MB
Progress (1): 4.3/4.6 MB
Progress (1): 4.3/4.6 MB
Progress (1): 4.3/4.6 MB
Progress (1): 4.3/4.6 MB
Progress (1): 4.3/4.6 MB
Progress (1): 4.3/4.6 MB
Progress (1): 4.3/4.6 MB
Progress (1): 4.3/4.6 MB
Progress (1): 4.3/4.6 MB
Progress (1): 4.3/4.6 MB
Progress (1): 4.3/4.6 MB
Progress (1): 4.4/4.6 MB
Progress (1): 4.4/4.6 MB
Progress (1): 4.4/4.6 MB
Progress (1): 4.4/4.6 MB
Progress (1): 4.4/4.6 MB
Progress (1): 4.4/4.6 MB
Progress (1): 4.4/4.6 MB
Progress (1): 4.4/4.6 MB
Progress (1): 4.4/4.6 MB
Progress (1): 4.4/4.6 MB
Progress (1): 4.4/4.6 MB
Progress (1): 4.4/4.6 MB
Progress (1): 4.4/4.6 MB
Progress (1): 4.4/4.6 MB
Progress (1): 4.4/4.6 MB
Progress (1): 4.4/4.6 MB
Progress (1): 4.4/4.6 MB
Progress (1): 4.4/4.6 MB
Progress (1): 4.4/4.6 MB
Progress (1): 4.4/4.6 MB
Progress (1): 4.4/4.6 MB
Progress (1): 4.4/4.6 MB
Progress (1): 4.4/4.6 MB
Progress (1): 4.4/4.6 MB
Progress (1): 4.5/4.6 MB
Progress (1): 4.5/4.6 MB
Progress (1): 4.5/4.6 MB
Progress (1): 4.5/4.6 MB
Progress (1): 4.5/4.6 MB
Progress (1): 4.5/4.6 MB
Progress (1): 4.5/4.6 MB
Progress (1): 4.5/4.6 MB
Progress (1): 4.5/4.6 MB
Progress (1): 4.5/4.6 MB
Progress (1): 4.5/4.6 MB
Progress (1): 4.5/4.6 MB
Progress (1): 4.5/4.6 MB
Progress (1): 4.5/4.6 MB
Progress (1): 4.5/4.6 MB
Progress (1): 4.5/4.6 MB
Progress (1): 4.5/4.6 MB
Progress (1): 4.5/4.6 MB
Progress (1): 4.5/4.6 MB
Progress (1): 4.5/4.6 MB
Progress (1): 4.5/4.6 MB
Progress (1): 4.5/4.6 MB
Progress (1): 4.5/4.6 MB
Progress (1): 4.5/4.6 MB
Progress (1): 4.6/4.6 MB
Progress (1): 4.6/4.6 MB
Progress (1): 4.6/4.6 MB
Progress (1): 4.6/4.6 MB
Progress (1): 4.6/4.6 MB
Progress (1): 4.6/4.6 MB
Progress (1): 4.6/4.6 MB
Progress (1): 4.6/4.6 MB
Progress (1): 4.6/4.6 MB
Progress (1): 4.6/4.6 MB
Progress (1): 4.6 MB    
                    
Downloaded from sonatype: https://oss.sonatype.org/content/repositories/public/org/codehaus/groovy/groovy-all/1.6.9/groovy-all-1.6.9.jar (4.6 MB at 7.1 MB/s)
[INFO] 
[INFO] --- jacoco-maven-plugin:0.7.9:prepare-agent (default) @ org.eclipse.tcf.te.tests ---
[INFO] tycho.testArgLine set to -javaagent:/home/hudson/genie.tcf/.jenkins/jobs/tcf-1.5/workspace/.repository/org/jacoco/org.jacoco.agent/0.7.9/org.jacoco.agent-0.7.9-runtime.jar=destfile=/jobs/genie.tcf/tcf-1.5/workspace/target_explorer/plugins/org.eclipse.tcf.te.tests/target/jacoco.exec,append=true,includes=org.eclipse.tcf*,excludes=org.eclipse.tcf.debug.test*:org.eclipse.tcf.te.tests.*,dumponexit=true,output=file
[INFO] 
[INFO] --- maven-resources-plugin:2.7:resources (default-resources) @ org.eclipse.tcf.te.tests ---
[INFO] Using 'UTF-8' encoding to copy filtered resources.
[INFO] skip non existing resourceDirectory /jobs/genie.tcf/tcf-1.5/workspace/target_explorer/plugins/org.eclipse.tcf.te.tests/src/main/resources
[INFO] 
[INFO] --- tycho-compiler-plugin:0.23.1:compile (default-compile) @ org.eclipse.tcf.te.tests ---
[INFO] Compiling 68 source files to /jobs/genie.tcf/tcf-1.5/workspace/target_explorer/plugins/org.eclipse.tcf.te.tests/target/classes
[INFO] 
[INFO] --- maven-resources-plugin:2.7:testResources (default-testResources) @ org.eclipse.tcf.te.tests ---
[INFO] Using 'UTF-8' encoding to copy filtered resources.
[INFO] skip non existing resourceDirectory /jobs/genie.tcf/tcf-1.5/workspace/target_explorer/plugins/org.eclipse.tcf.te.tests/src/test/resources
[INFO] 
[INFO] --- tycho-source-plugin:0.23.1:plugin-source (plugin-source) @ org.eclipse.tcf.te.tests ---
[INFO] Building jar: /jobs/genie.tcf/tcf-1.5/workspace/target_explorer/plugins/org.eclipse.tcf.te.tests/target/org.eclipse.tcf.te.tests-1.5.0-SNAPSHOT-sources.jar
[INFO] 
[INFO] --- target-platform-configuration:0.23.1:target-platform (default-target-platform) @ org.eclipse.tcf.te.tests ---
[INFO] 
[INFO] --- tycho-packaging-plugin:0.23.1:package-plugin (default-package-plugin) @ org.eclipse.tcf.te.tests ---
[INFO] Building jar: /jobs/genie.tcf/tcf-1.5/workspace/target_explorer/plugins/org.eclipse.tcf.te.tests/target/org.eclipse.tcf.te.tests-1.5.0-SNAPSHOT.jar
[INFO] 
[INFO] --- tycho-p2-plugin:0.23.1:p2-metadata-default (default-p2-metadata-default) @ org.eclipse.tcf.te.tests ---
[INFO] 
[INFO] --- tycho-p2-plugin:0.23.1:p2-metadata (p2-metadata) @ org.eclipse.tcf.te.tests ---
[INFO] 
[INFO] --- tycho-surefire-plugin:0.23.1:test (default-test) @ org.eclipse.tcf.te.tests ---
[INFO] Publishing 2 bundles to /jobs/genie.tcf/tcf-1.5/workspace/target_explorer/plugins/org.eclipse.tcf.te.tests/target/p2temp/additionalBundles
[INFO] Command line:
	[/opt/public/common/jdk1.7.0_80/jre/bin/java, -jar, /jobs/genie.tcf/tcf-1.5/workspace/.repository/org/eclipse/tycho/tycho-bundles-external/0.23.1/eclipse/plugins/org.eclipse.equinox.launcher_1.3.100.v20150511-1540.jar, -configuration, /tmp/genie.tcf/tycho-p2-runtime3768701651556159091.tmp/configuration, -nosplash, -application, org.eclipse.equinox.p2.publisher.FeaturesAndBundlesPublisher, -artifactRepository, file:/jobs/genie.tcf/tcf-1.5/workspace/target_explorer/plugins/org.eclipse.tcf.te.tests/target/p2temp/additionalBundles/, -metadataRepository, file:/jobs/genie.tcf/tcf-1.5/workspace/target_explorer/plugins/org.eclipse.tcf.te.tests/target/p2temp/additionalBundles/, -compress, -publishArtifacts, -source, /jobs/genie.tcf/tcf-1.5/workspace/target_explorer/plugins/org.eclipse.tcf.te.tests/target/p2temp/additionalBundles]
Picked up JAVA_TOOL_OPTIONS: -Xmx2G -Djava.io.tmpdir=/tmp/genie.tcf
Generating metadata for ..
Generation completed with success [0 seconds].
[INFO] Installing IUs [org.eclipse.tcf.te.tests, org.eclipse.tycho.surefire.osgibooter, org.eclipse.tycho.surefire.junit4, org.eclipse.platform.ide, org.eclipse.sdk.feature.group, org.eclipse.cdt.platform.feature.group, org.eclipse.remote.feature.group, org.eclipse.swtbot.eclipse.feature.group] to /jobs/genie.tcf/tcf-1.5/workspace/target_explorer/plugins/org.eclipse.tcf.te.tests/target/work
Installing org.eclipse.tcf.te.tests 1.5.0.201609112106.
Installing org.eclipse.tycho.surefire.osgibooter 0.23.1.
Installing org.eclipse.tycho.surefire.junit4 0.23.1.
Installing org.eclipse.platform.ide 3.8.2.M20130131-0800.
Installing org.eclipse.sdk.feature.group 3.8.2.v20130116-114247-7Q85DVDQQ3JLtb_hNUm3_MTesRM5RqdjCSfXEI7waiJ_N.
Installing org.eclipse.cdt.platform.feature.group 8.3.0.201402142303.
Installing org.eclipse.remote.feature.group 2.0.0.201507010000.
Installing org.eclipse.swtbot.eclipse.feature.group 2.2.1.201402241301.
Operation completed in 30409 ms.
[INFO] Expected eclipse log file: /jobs/genie.tcf/tcf-1.5/workspace/target_explorer/plugins/org.eclipse.tcf.te.tests/target/work/data/.metadata/.log
[INFO] Command line:
	[/opt/public/common/jdk1.7.0_80/jre/bin/java, -Dosgi.noShutdown=false, -Dosgi.os=linux, -Dosgi.ws=gtk, -Dosgi.arch=x86_64, -javaagent:/home/hudson/genie.tcf/.jenkins/jobs/tcf-1.5/workspace/.repository/org/jacoco/org.jacoco.agent/0.7.9/org.jacoco.agent-0.7.9-runtime.jar=destfile=/jobs/genie.tcf/tcf-1.5/workspace/target_explorer/plugins/org.eclipse.tcf.te.tests/target/jacoco.exec,append=true,includes=org.eclipse.tcf*,excludes=org.eclipse.tcf.debug.test*:org.eclipse.tcf.te.tests.*,dumponexit=true,output=file, -Xint, -Xmx512m, -XX:MaxPermSize=256m, -Dosgi.clean=true, -Dosgi.debug=/jobs/genie.tcf/tcf-1.5/workspace/target_explorer/plugins/org.eclipse.tcf.te.tests/tracing/.options, -Dtcf.agent.path=/home/hudson/genie.tcf/.jenkins/jobs/tcf-1.5/workspace/.agent, -jar, /jobs/genie.tcf/tcf-1.5/workspace/target_explorer/plugins/org.eclipse.tcf.te.tests/target/work/plugins/org.eclipse.equinox.launcher_1.3.0.v20120522-1813.jar, -debug, -consolelog, -data, /jobs/genie.tcf/tcf-1.5/workspace/target_explorer/plugins/org.eclipse.tcf.te.tests/target/work/data, -install, /jobs/genie.tcf/tcf-1.5/workspace/target_explorer/plugins/org.eclipse.tcf.te.tests/target/work, -configuration, /jobs/genie.tcf/tcf-1.5/workspace/target_explorer/plugins/org.eclipse.tcf.te.tests/target/work/configuration, -application, org.eclipse.tycho.surefire.osgibooter.uitest, -testproperties, /jobs/genie.tcf/tcf-1.5/workspace/target_explorer/plugins/org.eclipse.tcf.te.tests/target/surefire.properties, -testApplication, org.eclipse.ui.ide.workbench, -product, org.eclipse.platform.ide]
Picked up JAVA_TOOL_OPTIONS: -Xmx2G -Djava.io.tmpdir=/tmp/genie.tcf
Configuration location:
    file:/jobs/genie.tcf/tcf-1.5/workspace/target_explorer/plugins/org.eclipse.tcf.te.tests/target/work/configuration/
Configuration file:
    file:/jobs/genie.tcf/tcf-1.5/workspace/target_explorer/plugins/org.eclipse.tcf.te.tests/target/work/configuration/config.ini loaded
Install location:
    file:/jobs/genie.tcf/tcf-1.5/workspace/target_explorer/plugins/org.eclipse.tcf.te.tests/target/work/
Framework located:
    file:/jobs/genie.tcf/tcf-1.5/workspace/target_explorer/plugins/org.eclipse.tcf.te.tests/target/work/plugins/org.eclipse.osgi_3.8.2.v20130124-134944.jar
Framework classpath:
    file:/jobs/genie.tcf/tcf-1.5/workspace/target_explorer/plugins/org.eclipse.tcf.te.tests/target/work/plugins/org.eclipse.osgi_3.8.2.v20130124-134944.jar
Debug options:
    file:/jobs/genie.tcf/tcf-1.5/workspace/target_explorer/plugins/org.eclipse.tcf.te.tests/tracing/.options loaded
Time to load bundles: 60
Starting application: 13314
Launching application org.eclipse.ui.ide.workbench...
Cannot send datagram packet to /172.25.255.255
java.io.IOException: Operation not permitted
	at java.net.PlainDatagramSocketImpl.send(Native Method)
	at java.net.DatagramSocket.send(DatagramSocket.java:698)
	at org.eclipse.tcf.internal.services.local.LocatorService.sendDatagramPacket(LocatorService.java:948)
	at org.eclipse.tcf.internal.services.local.LocatorService.sendPeersRequest(LocatorService.java:1031)
	at org.eclipse.tcf.internal.services.local.LocatorService.refresh_timer(LocatorService.java:693)
	at org.eclipse.tcf.internal.services.local.LocatorService.access$1(LocatorService.java:650)
	at org.eclipse.tcf.internal.services.local.LocatorService$1$1.run(LocatorService.java:230)
	at org.eclipse.tcf.protocol.Protocol$3.run(Protocol.java:242)
	at org.eclipse.tcf.EventQueue.run(EventQueue.java:95)
	at java.lang.Thread.run(Thread.java:745)
!SESSION 2018-02-24 02:35:52.270 -----------------------------------------------
eclipse.buildId=M20130131-0800
java.version=1.7.0_80
java.vendor=Oracle Corporation
BootLoader constants: OS=linux, ARCH=x86_64, WS=gtk, NL=en_US
Framework arguments:  -application org.eclipse.tycho.surefire.osgibooter.uitest -testproperties /jobs/genie.tcf/tcf-1.5/workspace/target_explorer/plugins/org.eclipse.tcf.te.tests/target/surefire.properties -testApplication org.eclipse.ui.ide.workbench -product org.eclipse.platform.ide
Command-line arguments:  -debug -consolelog -data /jobs/genie.tcf/tcf-1.5/workspace/target_explorer/plugins/org.eclipse.tcf.te.tests/target/work/data -application org.eclipse.tycho.surefire.osgibooter.uitest -testproperties /jobs/genie.tcf/tcf-1.5/workspace/target_explorer/plugins/org.eclipse.tcf.te.tests/target/surefire.properties -testApplication org.eclipse.ui.ide.workbench -product org.eclipse.platform.ide

!ENTRY org.eclipse.tcf 4 0 2018-02-24 02:36:07.753
!MESSAGE Cannot send datagram packet to /172.25.255.255
!STACK 0
java.io.IOException: Operation not permitted
	at java.net.PlainDatagramSocketImpl.send(Native Method)
	at java.net.DatagramSocket.send(DatagramSocket.java:698)
	at org.eclipse.tcf.internal.services.local.LocatorService.sendDatagramPacket(LocatorService.java:948)
	at org.eclipse.tcf.internal.services.local.LocatorService.sendPeersRequest(LocatorService.java:1031)
	at org.eclipse.tcf.internal.services.local.LocatorService.refresh_timer(LocatorService.java:693)
	at org.eclipse.tcf.internal.services.local.LocatorService.access$1(LocatorService.java:650)
	at org.eclipse.tcf.internal.services.local.LocatorService$1$1.run(LocatorService.java:230)
	at org.eclipse.tcf.protocol.Protocol$3.run(Protocol.java:242)
	at org.eclipse.tcf.EventQueue.run(EventQueue.java:95)
	at java.lang.Thread.run(Thread.java:745)
Application Started: 20623

-------------------------------------------------------
 T E S T S
-------------------------------------------------------
Running org.eclipse.tcf.te.tests.suites.AllTests

=== testPendingOperationModelNode started at: February 24, 2018 2:36:13 AM EST
=== testPendingOperationModelNode finished at: February 24, 2018 2:36:15 AM EST (duration: 1931 ms)

=== testPropertiesContainer started at: February 24, 2018 2:36:15 AM EST
=== testPropertiesContainer finished at: February 24, 2018 2:36:15 AM EST (duration: 6 ms)

=== testModelNode started at: February 24, 2018 2:36:15 AM EST
=== testModelNode finished at: February 24, 2018 2:36:15 AM EST (duration: 28 ms)

=== testFileTransferItem started at: February 24, 2018 2:36:15 AM EST
=== testFileTransferItem finished at: February 24, 2018 2:36:15 AM EST (duration: 11 ms)

=== testModel started at: February 24, 2018 2:36:15 AM EST
=== testModel finished at: February 24, 2018 2:36:15 AM EST (duration: 5 ms)

=== testElfUtils started at: February 24, 2018 2:36:15 AM EST
=== testElfUtils finished at: February 24, 2018 2:36:15 AM EST (duration: 15 ms)

=== testAbstractDelegatingExecutorService started at: February 24, 2018 2:36:15 AM EST
=== testAbstractDelegatingExecutorService finished at: February 24, 2018 2:36:15 AM EST (duration: 4 ms)

=== testPrivateOrInternalClasses started at: February 24, 2018 2:36:15 AM EST
=== testPrivateOrInternalClasses finished at: February 24, 2018 2:36:15 AM EST (duration: 25 ms)

=== testSingleThreadExecutorService started at: February 24, 2018 2:36:15 AM EST
=== testSingleThreadExecutorService finished at: February 24, 2018 2:36:16 AM EST (duration: 1107 ms)

=== testContributions started at: February 24, 2018 2:36:16 AM EST
=== testContributions finished at: February 24, 2018 2:36:16 AM EST (duration: 41 ms)

=== testDefaultStatusHandler started at: February 24, 2018 2:36:16 AM EST

!ENTRY org.eclipse.tcf.te.tests 1 0 2018-02-24 02:36:16.405
!MESSAGE Info

!ENTRY org.eclipse.tcf.te.tests 2 0 2018-02-24 02:36:16.409
!MESSAGE Warning

!ENTRY org.eclipse.tcf.te.tests 4 0 2018-02-24 02:36:16.410
!MESSAGE Error

!ENTRY org.eclipse.tcf.te.tests 0 0 2018-02-24 02:36:16.413
!MESSAGE Question

!ENTRY org.eclipse.tcf.te.tests 0 0 2018-02-24 02:36:16.414
!MESSAGE Question
!STACK 0
java.lang.Throwable
	at org.eclipse.tcf.te.tests.statushandler.StatusHandlerTestCase.testDefaultStatusHandler(StatusHandlerTestCase.java:151)
	at sun.reflect.NativeMethodAccessorImpl.invoke0(Native Method)
	at sun.reflect.NativeMethodAccessorImpl.invoke(NativeMethodAccessorImpl.java:57)
	at sun.reflect.DelegatingMethodAccessorImpl.invoke(DelegatingMethodAccessorImpl.java:43)
	at java.lang.reflect.Method.invoke(Method.java:606)
	at junit.framework.TestCase.runTest(TestCase.java:168)
	at junit.framework.TestCase.runBare(TestCase.java:134)
	at org.eclipse.tcf.te.tests.CoreTestCase.runBare(CoreTestCase.java:256)
	at junit.framework.TestResult$1.protect(TestResult.java:110)
	at junit.framework.TestResult.runProtected(TestResult.java:128)
	at junit.framework.TestResult.run(TestResult.java:113)
	at junit.framework.TestCase.run(TestCase.java:124)
	at org.eclipse.tcf.te.tests.CoreTestCase.run(CoreTestCase.java:233)
	at junit.framework.TestSuite.runTest(TestSuite.java:243)
	at junit.framework.TestSuite.run(TestSuite.java:238)
	at junit.framework.TestSuite.runTest(TestSuite.java:243)
	at junit.framework.TestSuite.run(TestSuite.java:238)
	at junit.framework.TestSuite.runTest(TestSuite.java:243)
	at junit.framework.TestSuite.run(TestSuite.java:238)
	at org.junit.internal.runners.JUnit38ClassRunner.run(JUnit38ClassRunner.java:83)
	at org.apache.maven.surefire.junit4.JUnit4Provider.execute(JUnit4Provider.java:264)
	at org.apache.maven.surefire.junit4.JUnit4Provider.executeTestSet(JUnit4Provider.java:153)
	at org.apache.maven.surefire.junit4.JUnit4Provider.invoke(JUnit4Provider.java:124)
	at sun.reflect.NativeMethodAccessorImpl.invoke0(Native Method)
	at sun.reflect.NativeMethodAccessorImpl.invoke(NativeMethodAccessorImpl.java:57)
	at sun.reflect.DelegatingMethodAccessorImpl.invoke(DelegatingMethodAccessorImpl.java:43)
	at java.lang.reflect.Method.invoke(Method.java:606)
	at org.apache.maven.surefire.util.ReflectionUtils.invokeMethodWithArray2(ReflectionUtils.java:208)
	at org.apache.maven.surefire.booter.ProviderFactory$ProviderProxy.invoke(ProviderFactory.java:156)
	at org.apache.maven.surefire.booter.ProviderFactory.invokeProvider(ProviderFactory.java:82)
	at org.eclipse.tycho.surefire.osgibooter.OsgiSurefireBooter.run(OsgiSurefireBooter.java:91)
	at org.eclipse.tycho.surefire.osgibooter.AbstractUITestApplication$1.run(AbstractUITestApplication.java:35)
	at org.eclipse.swt.widgets.RunnableLock.run(RunnableLock.java:35)
	at org.eclipse.swt.widgets.Synchronizer.runAsyncMessages(Synchronizer.java:135)
	at org.eclipse.swt.widgets.Display.runAsyncMessages(Display.java:3537)
	at org.eclipse.swt.widgets.Display.readAndDispatch(Display.java:3189)
	at org.eclipse.ui.internal.Workbench.runEventLoop(Workbench.java:2701)
	at org.eclipse.ui.internal.Workbench.runUI(Workbench.java:2665)
	at org.eclipse.ui.internal.Workbench.access$4(Workbench.java:2499)
	at org.eclipse.ui.internal.Workbench$7.run(Workbench.java:679)
	at org.eclipse.core.databinding.observable.Realm.runWithDefault(Realm.java:332)
	at org.eclipse.ui.internal.Workbench.createAndRunWorkbench(Workbench.java:668)
	at org.eclipse.ui.PlatformUI.createAndRunWorkbench(PlatformUI.java:149)
	at org.eclipse.ui.internal.ide.application.IDEApplication.start(IDEApplication.java:124)
	at org.eclipse.tycho.surefire.osgibooter.UITestApplication.runApplication(UITestApplication.java:31)
	at org.eclipse.tycho.surefire.osgibooter.AbstractUITestApplication.run(AbstractUITestApplication.java:120)
	at org.eclipse.tycho.surefire.osgibooter.UITestApplication.start(UITestApplication.java:37)
	at org.eclipse.equinox.internal.app.EclipseAppHandle.run(EclipseAppHandle.java:196)
	at org.eclipse.core.runtime.internal.adaptor.EclipseAppLauncher.runApplication(EclipseAppLauncher.java:110)
	at org.eclipse.core.runtime.internal.adaptor.EclipseAppLauncher.start(EclipseAppLauncher.java:79)
	at org.eclipse.core.runtime.adaptor.EclipseStarter.run(EclipseStarter.java:353)
	at org.eclipse.core.runtime.adaptor.EclipseStarter.run(EclipseStarter.java:180)
	at sun.reflect.NativeMethodAccessorImpl.invoke0(Native Method)
	at sun.reflect.NativeMethodAccessorImpl.invoke(NativeMethodAccessorImpl.java:57)
	at sun.reflect.DelegatingMethodAccessorImpl.invoke(DelegatingMethodAccessorImpl.java:43)
	at java.lang.reflect.Method.invoke(Method.java:606)
	at org.eclipse.equinox.launcher.Main.invokeFramework(Main.java:629)
	at org.eclipse.equinox.launcher.Main.basicRun(Main.java:584)
	at org.eclipse.equinox.launcher.Main.run(Main.java:1438)
	at org.eclipse.equinox.launcher.Main.main(Main.java:1414)

!ENTRY org.eclipse.tcf.te.tests 0 1 2018-02-24 02:36:16.418
!MESSAGE Question
!STACK 0
java.lang.Throwable
	at org.eclipse.tcf.te.tests.statushandler.StatusHandlerTestCase.testDefaultStatusHandler(StatusHandlerTestCase.java:154)
	at sun.reflect.NativeMethodAccessorImpl.invoke0(Native Method)
	at sun.reflect.NativeMethodAccessorImpl.invoke(NativeMethodAccessorImpl.java:57)
	at sun.reflect.DelegatingMethodAccessorImpl.invoke(DelegatingMethodAccessorImpl.java:43)
	at java.lang.reflect.Method.invoke(Method.java:606)
	at junit.framework.TestCase.runTest(TestCase.java:168)
	at junit.framework.TestCase.runBare(TestCase.java:134)
	at org.eclipse.tcf.te.tests.CoreTestCase.runBare(CoreTestCase.java:256)
	at junit.framework.TestResult$1.protect(TestResult.java:110)
	at junit.framework.TestResult.runProtected(TestResult.java:128)
	at junit.framework.TestResult.run(TestResult.java:113)
	at junit.framework.TestCase.run(TestCase.java:124)
	at org.eclipse.tcf.te.tests.CoreTestCase.run(CoreTestCase.java:233)
	at junit.framework.TestSuite.runTest(TestSuite.java:243)
	at junit.framework.TestSuite.run(TestSuite.java:238)
	at junit.framework.TestSuite.runTest(TestSuite.java:243)
	at junit.framework.TestSuite.run(TestSuite.java:238)
	at junit.framework.TestSuite.runTest(TestSuite.java:243)
	at junit.framework.TestSuite.run(TestSuite.java:238)
	at org.junit.internal.runners.JUnit38ClassRunner.run(JUnit38ClassRunner.java:83)
	at org.apache.maven.surefire.junit4.JUnit4Provider.execute(JUnit4Provider.java:264)
	at org.apache.maven.surefire.junit4.JUnit4Provider.executeTestSet(JUnit4Provider.java:153)
	at org.apache.maven.surefire.junit4.JUnit4Provider.invoke(JUnit4Provider.java:124)
	at sun.reflect.NativeMethodAccessorImpl.invoke0(Native Method)
	at sun.reflect.NativeMethodAccessorImpl.invoke(NativeMethodAccessorImpl.java:57)
	at sun.reflect.DelegatingMethodAccessorImpl.invoke(DelegatingMethodAccessorImpl.java:43)
	at java.lang.reflect.Method.invoke(Method.java:606)
	at org.apache.maven.surefire.util.ReflectionUtils.invokeMethodWithArray2(ReflectionUtils.java:208)
	at org.apache.maven.surefire.booter.ProviderFactory$ProviderProxy.invoke(ProviderFactory.java:156)
	at org.apache.maven.surefire.booter.ProviderFactory.invokeProvider(ProviderFactory.java:82)
	at org.eclipse.tycho.surefire.osgibooter.OsgiSurefireBooter.run(OsgiSurefireBooter.java:91)
	at org.eclipse.tycho.surefire.osgibooter.AbstractUITestApplication$1.run(AbstractUITestApplication.java:35)
	at org.eclipse.swt.widgets.RunnableLock.run(RunnableLock.java:35)
	at org.eclipse.swt.widgets.Synchronizer.runAsyncMessages(Synchronizer.java:135)
	at org.eclipse.swt.widgets.Display.runAsyncMessages(Display.java:3537)
	at org.eclipse.swt.widgets.Display.readAndDispatch(Display.java:3189)
	at org.eclipse.ui.internal.Workbench.runEventLoop(Workbench.java:2701)
	at org.eclipse.ui.internal.Workbench.runUI(Workbench.java:2665)
	at org.eclipse.ui.internal.Workbench.access$4(Workbench.java:2499)
	at org.eclipse.ui.internal.Workbench$7.run(Workbench.java:679)
	at org.eclipse.core.databinding.observable.Realm.runWithDefault(Realm.java:332)
	at org.eclipse.ui.internal.Workbench.createAndRunWorkbench(Workbench.java:668)
	at org.eclipse.ui.PlatformUI.createAndRunWorkbench(PlatformUI.java:149)
	at org.eclipse.ui.internal.ide.application.IDEApplication.start(IDEApplication.java:124)
	at org.eclipse.tycho.surefire.osgibooter.UITestApplication.runApplication(UITestApplication.java:31)
	at org.eclipse.tycho.surefire.osgibooter.AbstractUITestApplication.run(AbstractUITestApplication.java:120)
	at org.eclipse.tycho.surefire.osgibooter.UITestApplication.start(UITestApplication.java:37)
	at org.eclipse.equinox.internal.app.EclipseAppHandle.run(EclipseAppHandle.java:196)
	at org.eclipse.core.runtime.internal.adaptor.EclipseAppLauncher.runApplication(EclipseAppLauncher.java:110)
	at org.eclipse.core.runtime.internal.adaptor.EclipseAppLauncher.start(EclipseAppLauncher.java:79)
	at org.eclipse.core.runtime.adaptor.EclipseStarter.run(EclipseStarter.java:353)
	at org.eclipse.core.runtime.adaptor.EclipseStarter.run(EclipseStarter.java:180)
	at sun.reflect.NativeMethodAccessorImpl.invoke0(Native Method)
	at sun.reflect.NativeMethodAccessorImpl.invoke(NativeMethodAccessorImpl.java:57)
	at sun.reflect.DelegatingMethodAccessorImpl.invoke(DelegatingMethodAccessorImpl.java:43)
	at java.lang.reflect.Method.invoke(Method.java:606)
	at org.eclipse.equinox.launcher.Main.invokeFramework(Main.java:629)
	at org.eclipse.equinox.launcher.Main.basicRun(Main.java:584)
	at org.eclipse.equinox.launcher.Main.run(Main.java:1438)
	at org.eclipse.equinox.launcher.Main.main(Main.java:1414)

!ENTRY org.eclipse.tcf.te.tests 0 0 2018-02-24 02:36:16.423
!MESSAGE YesNoCancel

!ENTRY org.eclipse.tcf.te.tests 0 0 2018-02-24 02:36:16.424
!MESSAGE YesNoCancel
!STACK 0
java.lang.Throwable
	at org.eclipse.tcf.te.tests.statushandler.StatusHandlerTestCase.testDefaultStatusHandler(StatusHandlerTestCase.java:160)
	at sun.reflect.NativeMethodAccessorImpl.invoke0(Native Method)
	at sun.reflect.NativeMethodAccessorImpl.invoke(NativeMethodAccessorImpl.java:57)
	at sun.reflect.DelegatingMethodAccessorImpl.invoke(DelegatingMethodAccessorImpl.java:43)
	at java.lang.reflect.Method.invoke(Method.java:606)
	at junit.framework.TestCase.runTest(TestCase.java:168)
	at junit.framework.TestCase.runBare(TestCase.java:134)
	at org.eclipse.tcf.te.tests.CoreTestCase.runBare(CoreTestCase.java:256)
	at junit.framework.TestResult$1.protect(TestResult.java:110)
	at junit.framework.TestResult.runProtected(TestResult.java:128)
	at junit.framework.TestResult.run(TestResult.java:113)
	at junit.framework.TestCase.run(TestCase.java:124)
	at org.eclipse.tcf.te.tests.CoreTestCase.run(CoreTestCase.java:233)
	at junit.framework.TestSuite.runTest(TestSuite.java:243)
	at junit.framework.TestSuite.run(TestSuite.java:238)
	at junit.framework.TestSuite.runTest(TestSuite.java:243)
	at junit.framework.TestSuite.run(TestSuite.java:238)
	at junit.framework.TestSuite.runTest(TestSuite.java:243)
	at junit.framework.TestSuite.run(TestSuite.java:238)
	at org.junit.internal.runners.JUnit38ClassRunner.run(JUnit38ClassRunner.java:83)
	at org.apache.maven.surefire.junit4.JUnit4Provider.execute(JUnit4Provider.java:264)
	at org.apache.maven.surefire.junit4.JUnit4Provider.executeTestSet(JUnit4Provider.java:153)
	at org.apache.maven.surefire.junit4.JUnit4Provider.invoke(JUnit4Provider.java:124)
	at sun.reflect.NativeMethodAccessorImpl.invoke0(Native Method)
	at sun.reflect.NativeMethodAccessorImpl.invoke(NativeMethodAccessorImpl.java:57)
	at sun.reflect.DelegatingMethodAccessorImpl.invoke(DelegatingMethodAccessorImpl.java:43)
	at java.lang.reflect.Method.invoke(Method.java:606)
	at org.apache.maven.surefire.util.ReflectionUtils.invokeMethodWithArray2(ReflectionUtils.java:208)
	at org.apache.maven.surefire.booter.ProviderFactory$ProviderProxy.invoke(ProviderFactory.java:156)
	at org.apache.maven.surefire.booter.ProviderFactory.invokeProvider(ProviderFactory.java:82)
	at org.eclipse.tycho.surefire.osgibooter.OsgiSurefireBooter.run(OsgiSurefireBooter.java:91)
	at org.eclipse.tycho.surefire.osgibooter.AbstractUITestApplication$1.run(AbstractUITestApplication.java:35)
	at org.eclipse.swt.widgets.RunnableLock.run(RunnableLock.java:35)
	at org.eclipse.swt.widgets.Synchronizer.runAsyncMessages(Synchronizer.java:135)
	at org.eclipse.swt.widgets.Display.runAsyncMessages(Display.java:3537)
	at org.eclipse.swt.widgets.Display.readAndDispatch(Display.java:3189)
	at org.eclipse.ui.internal.Workbench.runEventLoop(Workbench.java:2701)
	at org.eclipse.ui.internal.Workbench.runUI(Workbench.java:2665)
	at org.eclipse.ui.internal.Workbench.access$4(Workbench.java:2499)
	at org.eclipse.ui.internal.Workbench$7.run(Workbench.java:679)
	at org.eclipse.core.databinding.observable.Realm.runWithDefault(Realm.java:332)
	at org.eclipse.ui.internal.Workbench.createAndRunWorkbench(Workbench.java:668)
	at org.eclipse.ui.PlatformUI.createAndRunWorkbench(PlatformUI.java:149)
	at org.eclipse.ui.internal.ide.application.IDEApplication.start(IDEApplication.java:124)
	at org.eclipse.tycho.surefire.osgibooter.UITestApplication.runApplication(UITestApplication.java:31)
	at org.eclipse.tycho.surefire.osgibooter.AbstractUITestApplication.run(AbstractUITestApplication.java:120)
	at org.eclipse.tycho.surefire.osgibooter.UITestApplication.start(UITestApplication.java:37)
	at org.eclipse.equinox.internal.app.EclipseAppHandle.run(EclipseAppHandle.java:196)
	at org.eclipse.core.runtime.internal.adaptor.EclipseAppLauncher.runApplication(EclipseAppLauncher.java:110)
	at org.eclipse.core.runtime.internal.adaptor.EclipseAppLauncher.start(EclipseAppLauncher.java:79)
	at org.eclipse.core.runtime.adaptor.EclipseStarter.run(EclipseStarter.java:353)
	at org.eclipse.core.runtime.adaptor.EclipseStarter.run(EclipseStarter.java:180)
	at sun.reflect.NativeMethodAccessorImpl.invoke0(Native Method)
	at sun.reflect.NativeMethodAccessorImpl.invoke(NativeMethodAccessorImpl.java:57)
	at sun.reflect.DelegatingMethodAccessorImpl.invoke(DelegatingMethodAccessorImpl.java:43)
	at java.lang.reflect.Method.invoke(Method.java:606)
	at org.eclipse.equinox.launcher.Main.invokeFramework(Main.java:629)
	at org.eclipse.equinox.launcher.Main.basicRun(Main.java:584)
	at org.eclipse.equinox.launcher.Main.run(Main.java:1438)
	at org.eclipse.equinox.launcher.Main.main(Main.java:1414)

!ENTRY org.eclipse.tcf.te.tests 0 1 2018-02-24 02:36:16.427
!MESSAGE YesNoCancel
!STACK 0
java.lang.Throwable
	at org.eclipse.tcf.te.tests.statushandler.StatusHandlerTestCase.testDefaultStatusHandler(StatusHandlerTestCase.java:163)
	at sun.reflect.NativeMethodAccessorImpl.invoke0(Native Method)
	at sun.reflect.NativeMethodAccessorImpl.invoke(NativeMethodAccessorImpl.java:57)
	at sun.reflect.DelegatingMethodAccessorImpl.invoke(DelegatingMethodAccessorImpl.java:43)
	at java.lang.reflect.Method.invoke(Method.java:606)
	at junit.framework.TestCase.runTest(TestCase.java:168)
	at junit.framework.TestCase.runBare(TestCase.java:134)
	at org.eclipse.tcf.te.tests.CoreTestCase.runBare(CoreTestCase.java:256)
	at junit.framework.TestResult$1.protect(TestResult.java:110)
	at junit.framework.TestResult.runProtected(TestResult.java:128)
	at junit.framework.TestResult.run(TestResult.java:113)
	at junit.framework.TestCase.run(TestCase.java:124)
	at org.eclipse.tcf.te.tests.CoreTestCase.run(CoreTestCase.java:233)
	at junit.framework.TestSuite.runTest(TestSuite.java:243)
	at junit.framework.TestSuite.run(TestSuite.java:238)
	at junit.framework.TestSuite.runTest(TestSuite.java:243)
	at junit.framework.TestSuite.run(TestSuite.java:238)
	at junit.framework.TestSuite.runTest(TestSuite.java:243)
	at junit.framework.TestSuite.run(TestSuite.java:238)
	at org.junit.internal.runners.JUnit38ClassRunner.run(JUnit38ClassRunner.java:83)
	at org.apache.maven.surefire.junit4.JUnit4Provider.execute(JUnit4Provider.java:264)
	at org.apache.maven.surefire.junit4.JUnit4Provider.executeTestSet(JUnit4Provider.java:153)
	at org.apache.maven.surefire.junit4.JUnit4Provider.invoke(JUnit4Provider.java:124)
	at sun.reflect.NativeMethodAccessorImpl.invoke0(Native Method)
	at sun.reflect.NativeMethodAccessorImpl.invoke(NativeMethodAccessorImpl.java:57)
	at sun.reflect.DelegatingMethodAccessorImpl.invoke(DelegatingMethodAccessorImpl.java:43)
	at java.lang.reflect.Method.invoke(Method.java:606)
	at org.apache.maven.surefire.util.ReflectionUtils.invokeMethodWithArray2(ReflectionUtils.java:208)
	at org.apache.maven.surefire.booter.ProviderFactory$ProviderProxy.invoke(ProviderFactory.java:156)
	at org.apache.maven.surefire.booter.ProviderFactory.invokeProvider(ProviderFactory.java:82)
	at org.eclipse.tycho.surefire.osgibooter.OsgiSurefireBooter.run(OsgiSurefireBooter.java:91)
	at org.eclipse.tycho.surefire.osgibooter.AbstractUITestApplication$1.run(AbstractUITestApplication.java:35)
	at org.eclipse.swt.widgets.RunnableLock.run(RunnableLock.java:35)
	at org.eclipse.swt.widgets.Synchronizer.runAsyncMessages(Synchronizer.java:135)
	at org.eclipse.swt.widgets.Display.runAsyncMessages(Display.java:3537)
	at org.eclipse.swt.widgets.Display.readAndDispatch(Display.java:3189)
	at org.eclipse.ui.internal.Workbench.runEventLoop(Workbench.java:2701)
	at org.eclipse.ui.internal.Workbench.runUI(Workbench.java:2665)
	at org.eclipse.ui.internal.Workbench.access$4(Workbench.java:2499)
	at org.eclipse.ui.internal.Workbench$7.run(Workbench.java:679)
	at org.eclipse.core.databinding.observable.Realm.runWithDefault(Realm.java:332)
	at org.eclipse.ui.internal.Workbench.createAndRunWorkbench(Workbench.java:668)
	at org.eclipse.ui.PlatformUI.createAndRunWorkbench(PlatformUI.java:149)
	at org.eclipse.ui.internal.ide.application.IDEApplication.start(IDEApplication.java:124)
	at org.eclipse.tycho.surefire.osgibooter.UITestApplication.runApplication(UITestApplication.java:31)
	at org.eclipse.tycho.surefire.osgibooter.AbstractUITestApplication.run(AbstractUITestApplication.java:120)
	at org.eclipse.tycho.surefire.osgibooter.UITestApplication.start(UITestApplication.java:37)
	at org.eclipse.equinox.internal.app.EclipseAppHandle.run(EclipseAppHandle.java:196)
	at org.eclipse.core.runtime.internal.adaptor.EclipseAppLauncher.runApplication(EclipseAppLauncher.java:110)
	at org.eclipse.core.runtime.internal.adaptor.EclipseAppLauncher.start(EclipseAppLauncher.java:79)
	at org.eclipse.core.runtime.adaptor.EclipseStarter.run(EclipseStarter.java:353)
	at org.eclipse.core.runtime.adaptor.EclipseStarter.run(EclipseStarter.java:180)
	at sun.reflect.NativeMethodAccessorImpl.invoke0(Native Method)
	at sun.reflect.NativeMethodAccessorImpl.invoke(NativeMethodAccessorImpl.java:57)
	at sun.reflect.DelegatingMethodAccessorImpl.invoke(DelegatingMethodAccessorImpl.java:43)
	at java.lang.reflect.Method.invoke(Method.java:606)
	at org.eclipse.equinox.launcher.Main.invokeFramework(Main.java:629)
	at org.eclipse.equinox.launcher.Main.basicRun(Main.java:584)
	at org.eclipse.equinox.launcher.Main.run(Main.java:1438)
	at org.eclipse.equinox.launcher.Main.main(Main.java:1414)
=== testDefaultStatusHandler finished at: February 24, 2018 2:36:16 AM EST (duration: 141 ms)

=== testStatusHandler started at: February 24, 2018 2:36:16 AM EST
=== testStatusHandler finished at: February 24, 2018 2:36:16 AM EST (duration: 3 ms)

=== testContributionsWithContext started at: February 24, 2018 2:36:16 AM EST
=== testContributionsWithContext finished at: February 24, 2018 2:36:16 AM EST (duration: 2 ms)

=== testModel started at: February 24, 2018 2:36:16 AM EST
=== testModel finished at: February 24, 2018 2:36:16 AM EST (duration: 1 ms)

=== testStepContributions started at: February 24, 2018 2:36:16 AM EST
=== testStepContributions finished at: February 24, 2018 2:36:16 AM EST (duration: 182 ms)

=== testStepGroupContributions started at: February 24, 2018 2:36:16 AM EST
=== testStepGroupContributions finished at: February 24, 2018 2:36:16 AM EST (duration: 64 ms)

=== testExecuteStepGroup started at: February 24, 2018 2:36:16 AM EST
=== testExecuteStepGroup finished at: February 24, 2018 2:36:16 AM EST (duration: 73 ms)

=== testStepperContributions started at: February 24, 2018 2:36:16 AM EST
=== testStepperContributions finished at: February 24, 2018 2:36:16 AM EST (duration: 1 ms)

=== testProcessModel started at: February 24, 2018 2:36:16 AM EST
=== testProcessModel finished at: February 24, 2018 2:36:35 AM EST (duration: 18774 ms)

=== testProcessLauncher started at: February 24, 2018 2:36:35 AM EST
=== testProcessLauncher finished at: February 24, 2018 2:36:37 AM EST (duration: 1551 ms)
Tests run: 20, Failures: 0, Errors: 0, Skipped: 0, Time elapsed: 24.08 sec - in org.eclipse.tcf.te.tests.suites.AllTests
testPendingOperationModelNode(org.eclipse.tcf.te.tests.model.ModelTestCase)  Time elapsed: 1.934 sec
testPropertiesContainer(org.eclipse.tcf.te.tests.model.ModelTestCase)  Time elapsed: 0.006 sec
testModelNode(org.eclipse.tcf.te.tests.model.ModelTestCase)  Time elapsed: 0.029 sec
testFileTransferItem(org.eclipse.tcf.te.tests.model.ModelTestCase)  Time elapsed: 0.011 sec
testModel(org.eclipse.tcf.te.tests.tcf.model.ModelTestCase)  Time elapsed: 0.005 sec
testElfUtils(org.eclipse.tcf.te.tests.utils.UtilityTestCase)  Time elapsed: 0.015 sec
testAbstractDelegatingExecutorService(org.eclipse.tcf.te.tests.concurrent.ConcurrentTestCase)  Time elapsed: 0.005 sec
testPrivateOrInternalClasses(org.eclipse.tcf.te.tests.concurrent.ConcurrentTestCase)  Time elapsed: 0.026 sec
testSingleThreadExecutorService(org.eclipse.tcf.te.tests.concurrent.ConcurrentTestCase)  Time elapsed: 1.11 sec
testContributions(org.eclipse.tcf.te.tests.statushandler.StatusHandlerTestCase)  Time elapsed: 0.041 sec
testDefaultStatusHandler(org.eclipse.tcf.te.tests.statushandler.StatusHandlerTestCase)  Time elapsed: 0.141 sec
testStatusHandler(org.eclipse.tcf.te.tests.statushandler.StatusHandlerTestCase)  Time elapsed: 0.004 sec
testContributionsWithContext(org.eclipse.tcf.te.tests.statushandler.StatusHandlerTestCase)  Time elapsed: 0.003 sec
testModel(org.eclipse.tcf.te.tests.tcf.model.ModelTestCase)  Time elapsed: 0.001 sec
testStepContributions(org.eclipse.tcf.te.tests.stepper.StepperTests)  Time elapsed: 0.182 sec
testStepGroupContributions(org.eclipse.tcf.te.tests.stepper.StepperTests)  Time elapsed: 0.064 sec
testExecuteStepGroup(org.eclipse.tcf.te.tests.stepper.StepperTests)  Time elapsed: 0.074 sec
testStepperContributions(org.eclipse.tcf.te.tests.stepper.StepperTests)  Time elapsed: 0.002 sec
testProcessModel(org.eclipse.tcf.te.tests.tcf.processes.model.ProcessModelTestCase)  Time elapsed: 18.774 sec
testProcessLauncher(org.eclipse.tcf.te.tests.tcf.processes.launcher.ProcessLauncherTestCase)  Time elapsed: 1.552 sec

Results :

Tests run: 20, Failures: 0, Errors: 0, Skipped: 0

[INFO] All tests passed!
[INFO] 
[INFO] --- maven-antrun-plugin:1.8:run (generate-report) @ org.eclipse.tcf.te.tests ---
Downloading from sonatype: https://oss.sonatype.org/content/repositories/public/org/jacoco/org.jacoco.ant/0.7.9/org.jacoco.ant-0.7.9.pom
Progress (1): 4.0 kB
                    
Downloaded from sonatype: https://oss.sonatype.org/content/repositories/public/org/jacoco/org.jacoco.ant/0.7.9/org.jacoco.ant-0.7.9.pom (4.0 kB at 31 kB/s)
Downloading from sonatype: https://oss.sonatype.org/content/repositories/public/org/jacoco/org.jacoco.ant/0.7.9/org.jacoco.ant-0.7.9.jar
Downloading from sonatype: https://oss.sonatype.org/content/repositories/public/org/jacoco/org.jacoco.agent/0.7.9/org.jacoco.agent-0.7.9.jar
Progress (1): 3.8/32 kB
Progress (1): 7.9/32 kB
Progress (1): 12/32 kB 
Progress (2): 12/32 kB | 3.8/236 kB
Progress (2): 16/32 kB | 3.8/236 kB
Progress (2): 20/32 kB | 3.8/236 kB
Progress (2): 24/32 kB | 3.8/236 kB
Progress (2): 28/32 kB | 3.8/236 kB
Progress (2): 32 kB | 3.8/236 kB   
Progress (2): 32 kB | 7.9/236 kB
Progress (2): 32 kB | 12/236 kB 
Progress (2): 32 kB | 16/236 kB
Progress (2): 32 kB | 20/236 kB
Progress (2): 32 kB | 24/236 kB
Progress (2): 32 kB | 28/236 kB
Progress (2): 32 kB | 32/236 kB
Progress (2): 32 kB | 37/236 kB
Progress (2): 32 kB | 41/236 kB
Progress (2): 32 kB | 45/236 kB
Progress (2): 32 kB | 49/236 kB
Progress (2): 32 kB | 53/236 kB
Progress (2): 32 kB | 57/236 kB
Progress (2): 32 kB | 61/236 kB
Progress (2): 32 kB | 65/236 kB
Progress (2): 32 kB | 66/236 kB
Progress (2): 32 kB | 70/236 kB
Progress (2): 32 kB | 73/236 kB
Progress (2): 32 kB | 77/236 kB
Progress (2): 32 kB | 82/236 kB
Progress (2): 32 kB | 86/236 kB
Progress (2): 32 kB | 90/236 kB
                               
Downloaded from sonatype: https://oss.sonatype.org/content/repositories/public/org/jacoco/org.jacoco.ant/0.7.9/org.jacoco.ant-0.7.9.jar (32 kB at 212 kB/s)
Progress (1): 94/236 kB
Progress (1): 98/236 kB
Progress (1): 102/236 kB
Progress (1): 106/236 kB
Progress (1): 110/236 kB
Progress (1): 114/236 kB
Progress (1): 118/236 kB
Progress (1): 123/236 kB
Progress (1): 127/236 kB
Progress (1): 131/236 kB
Progress (1): 135/236 kB
Progress (1): 139/236 kB
Progress (1): 143/236 kB
Progress (1): 147/236 kB
Progress (1): 151/236 kB
Progress (1): 155/236 kB
Progress (1): 159/236 kB
Progress (1): 164/236 kB
Progress (1): 168/236 kB
Progress (1): 172/236 kB
Progress (1): 176/236 kB
Progress (1): 180/236 kB
Progress (1): 184/236 kB
Progress (1): 188/236 kB
Progress (1): 192/236 kB
Progress (1): 196/236 kB
Progress (1): 200/236 kB
Progress (1): 204/236 kB
Progress (1): 209/236 kB
Progress (1): 213/236 kB
Progress (1): 217/236 kB
Progress (1): 221/236 kB
Progress (1): 225/236 kB
Progress (1): 229/236 kB
Progress (1): 233/236 kB
Progress (1): 236 kB    
                    
Downloaded from sonatype: https://oss.sonatype.org/content/repositories/public/org/jacoco/org.jacoco.agent/0.7.9/org.jacoco.agent-0.7.9.jar (236 kB at 943 kB/s)
[INFO] ------------------------------------------------------------------------
[INFO] Reactor Summary:
[INFO] 
[INFO] org.eclipse.tcf.core ............................... SUCCESS [27:13 min]
[INFO] org.eclipse.tcf .................................... SUCCESS [01:20 min]
[INFO] org.eclipse.tcf.debug .............................. SUCCESS [01:14 min]
[INFO] org.eclipse.tcf.debug.ui ........................... SUCCESS [02:01 min]
[INFO] org.eclipse.tcf.cdt.ui ............................. SUCCESS [01:44 min]
[INFO] org.eclipse.tcf.rse ................................ SUCCESS [01:09 min]
[INFO] org.eclipse.tcf.core.feature ....................... SUCCESS [ 17.239 s]
[INFO] org.eclipse.tcf.core.sdk.feature ................... SUCCESS [ 10.171 s]
[INFO] org.eclipse.tcf.feature ............................ SUCCESS [  2.488 s]
[INFO] org.eclipse.tcf.sdk.feature ........................ SUCCESS [ 17.727 s]
[INFO] org.eclipse.tcf.cdt.feature ........................ SUCCESS [  6.687 s]
[INFO] org.eclipse.tcf.cdt.sdk.feature .................... SUCCESS [  2.971 s]
[INFO] org.eclipse.tcf.rse.feature ........................ SUCCESS [  2.056 s]
[INFO] org.eclipse.tcf.rse.sdk.feature .................... SUCCESS [  3.336 s]
[INFO] org.eclipse.tcf.te ................................. SUCCESS [ 16.704 s]
[INFO] org.eclipse.tcf.te.runtime ......................... SUCCESS [01:34 min]
[INFO] org.eclipse.tcf.te.runtime.concurrent .............. SUCCESS [ 37.369 s]
[INFO] org.eclipse.tcf.te.runtime.model ................... SUCCESS [ 25.200 s]
[INFO] org.eclipse.tcf.te.runtime.services ................ SUCCESS [ 25.599 s]
[INFO] org.eclipse.tcf.te.runtime.persistence ............. SUCCESS [01:02 min]
[INFO] org.eclipse.tcf.te.runtime.statushandler ........... SUCCESS [ 29.247 s]
[INFO] org.eclipse.tcf.te.runtime.stepper ................. SUCCESS [ 35.658 s]
[INFO] org.eclipse.tcf.te.core ............................ SUCCESS [ 23.899 s]
[INFO] org.eclipse.tcf.te.core.cdt ........................ SUCCESS [  9.567 s]
[INFO] org.eclipse.tcf.te.launch.core ..................... SUCCESS [01:14 min]
[INFO] org.eclipse.tcf.te.ui.swt .......................... SUCCESS [ 39.735 s]
[INFO] org.eclipse.tcf.te.ui.forms ........................ SUCCESS [ 24.104 s]
[INFO] org.eclipse.tcf.te.ui .............................. SUCCESS [ 55.565 s]
[INFO] org.eclipse.tcf.te.ui.controls ..................... SUCCESS [ 15.888 s]
[INFO] org.eclipse.tcf.te.ui.views ........................ SUCCESS [ 51.478 s]
[INFO] org.eclipse.tcf.te.launch.ui ....................... SUCCESS [ 35.355 s]
[INFO] org.eclipse.tcf.te.tcf.core ........................ SUCCESS [ 27.463 s]
[INFO] org.eclipse.tcf.te.tcf.core.model .................. SUCCESS [ 32.365 s]
[INFO] org.eclipse.tcf.te.tcf.core.scripting .............. SUCCESS [ 11.979 s]
[INFO] org.eclipse.tcf.te.tcf.locator ..................... SUCCESS [ 14.358 s]
[INFO] org.eclipse.tcf.te.tcf.filesystem.core ............. SUCCESS [ 17.338 s]
[INFO] org.eclipse.tcf.te.tcf.log.core .................... SUCCESS [ 11.711 s]
[INFO] org.eclipse.tcf.te.tcf.ui .......................... SUCCESS [ 31.610 s]
[INFO] org.eclipse.tcf.te.tcf.filesystem.ui ............... SUCCESS [ 25.268 s]
[INFO] org.eclipse.tcf.te.tcf.processes.core .............. SUCCESS [ 19.718 s]
[INFO] org.eclipse.tcf.te.tcf.launch.cdt .................. SUCCESS [ 17.327 s]
[INFO] org.eclipse.tcf.te.tcf.launch.core ................. SUCCESS [ 12.965 s]
[INFO] org.eclipse.tcf.te.tcf.launch.ui ................... SUCCESS [ 15.695 s]
[INFO] org.eclipse.tcf.te.tcf.processes.ui ................ SUCCESS [ 19.909 s]
[INFO] org.eclipse.tcf.te.tcf.remote.core ................. SUCCESS [ 12.793 s]
[INFO] org.eclipse.tcf.te.tcf.remote.ui ................... SUCCESS [ 10.672 s]
[INFO] org.eclipse.tcf.te.tcf.services.contexts ........... SUCCESS [  8.345 s]
[INFO] org.eclipse.tcf.te.tcf.terminals.core .............. SUCCESS [ 11.761 s]
[INFO] org.eclipse.tcf.te.tcf.terminals.ui ................ SUCCESS [ 13.888 s]
[INFO] org.eclipse.tcf.te.tcf.ui.console .................. SUCCESS [ 11.809 s]
[INFO] org.eclipse.tcf.te.tcf.ui.views .................... SUCCESS [ 22.389 s]
[INFO] org.eclipse.tcf.te.ui.notifications ................ SUCCESS [ 13.345 s]
[INFO] org.eclipse.tcf.te.feature ......................... SUCCESS [  2.435 s]
[INFO] org.eclipse.tcf.te.sdk.feature ..................... SUCCESS [  2.403 s]
[INFO] org.eclipse.tcf.te.tcf.core.feature ................ SUCCESS [  2.487 s]
[INFO] org.eclipse.tcf.te.tcf.core.sdk.feature ............ SUCCESS [  2.891 s]
[INFO] org.eclipse.tcf.te.tcf.feature ..................... SUCCESS [  2.295 s]
[INFO] org.eclipse.tcf.te.tcf.sdk.feature ................. SUCCESS [  2.395 s]
[INFO] org.eclipse.tcf.te.tcf.launch.cdt.feature .......... SUCCESS [  1.821 s]
[INFO] org.eclipse.tcf.te.tcf.launch.cdt.sdk.feature ...... SUCCESS [  1.727 s]
[INFO] org.eclipse.tcf.te.tcf.remote.feature .............. SUCCESS [  1.959 s]
[INFO] org.eclipse.tcf.te.tcf.remote.sdk.feature .......... SUCCESS [  2.351 s]
[INFO] org.eclipse.tcf.repo ............................... SUCCESS [ 13.939 s]
[INFO] org.eclipse.tcf.te.tests ........................... FAILURE [01:50 min]
[INFO] org.eclipse.tcf.debug.test ......................... SKIPPED
[INFO] TCF and Target Explorer, Maven Master .............. SKIPPED
[INFO] ------------------------------------------------------------------------
[INFO] BUILD FAILURE
[INFO] ------------------------------------------------------------------------
[INFO] Total time: 01:34 h
[INFO] Finished at: 2018-02-24T02:36:50-05:00
[INFO] Final Memory: 422M/1721M
[INFO] ------------------------------------------------------------------------
---------------------------------------------------
constituent[0]: file:/shared/common/apache-maven-latest/conf/logging/
constituent[1]: file:/shared/common/apache-maven-latest/lib/maven-resolver-spi-1.1.0.jar
constituent[2]: file:/shared/common/apache-maven-latest/lib/org.eclipse.sisu.plexus-0.3.3.jar
constituent[3]: file:/shared/common/apache-maven-latest/lib/plexus-component-annotations-1.7.1.jar
constituent[4]: file:/shared/common/apache-maven-latest/lib/javax.inject-1.jar
constituent[5]: file:/shared/common/apache-maven-latest/lib/maven-resolver-transport-wagon-1.1.0.jar
constituent[6]: file:/shared/common/apache-maven-latest/lib/maven-shared-utils-3.1.0.jar
constituent[7]: file:/shared/common/apache-maven-latest/lib/maven-resolver-api-1.1.0.jar
constituent[8]: file:/shared/common/apache-maven-latest/lib/maven-repository-metadata-3.5.2.jar
constituent[9]: file:/shared/common/apache-maven-latest/lib/maven-embedder-3.5.2.jar
constituent[10]: file:/shared/common/apache-maven-latest/lib/maven-plugin-api-3.5.2.jar
constituent[11]: file:/shared/common/apache-maven-latest/lib/wagon-file-2.12.jar
constituent[12]: file:/shared/common/apache-maven-latest/lib/slf4j-api-1.7.25.jar
constituent[13]: file:/shared/common/apache-maven-latest/lib/jansi-1.16.jar
constituent[14]: file:/shared/common/apache-maven-latest/lib/maven-settings-builder-3.5.2.jar
constituent[15]: file:/shared/common/apache-maven-latest/lib/maven-resolver-provider-3.5.2.jar
constituent[16]: file:/shared/common/apache-maven-latest/lib/commons-cli-1.4.jar
constituent[17]: file:/shared/common/apache-maven-latest/lib/guava-20.0.jar
constituent[18]: file:/shared/common/apache-maven-latest/lib/maven-resolver-connector-basic-1.1.0.jar
constituent[19]: file:/shared/common/apache-maven-latest/lib/maven-artifact-3.5.2.jar
constituent[20]: file:/shared/common/apache-maven-latest/lib/commons-lang3-3.5.jar
constituent[21]: file:/shared/common/apache-maven-latest/lib/maven-builder-support-3.5.2.jar
constituent[22]: file:/shared/common/apache-maven-latest/lib/aopalliance-1.0.jar
constituent[23]: file:/shared/common/apache-maven-latest/lib/jsr250-api-1.0.jar
constituent[24]: file:/shared/common/apache-maven-latest/lib/plexus-cipher-1.7.jar
constituent[25]: file:/shared/common/apache-maven-latest/lib/maven-resolver-impl-1.1.0.jar
constituent[26]: file:/shared/common/apache-maven-latest/lib/guice-4.0-no_aop.jar
constituent[27]: file:/shared/common/apache-maven-latest/lib/plexus-interpolation-1.24.jar
constituent[28]: file:/shared/common/apache-maven-latest/lib/cdi-api-1.0.jar
constituent[29]: file:/shared/common/apache-maven-latest/lib/plexus-sec-dispatcher-1.4.jar
constituent[30]: file:/shared/common/apache-maven-latest/lib/wagon-http-2.12-shaded.jar
constituent[31]: file:/shared/common/apache-maven-latest/lib/maven-core-3.5.2.jar
constituent[32]: file:/shared/common/apache-maven-latest/lib/org.eclipse.sisu.inject-0.3.3.jar
constituent[33]: file:/shared/common/apache-maven-latest/lib/commons-io-2.5.jar
constituent[34]: file:/shared/common/apache-maven-latest/lib/maven-slf4j-provider-3.5.2.jar
constituent[35]: file:/shared/common/apache-maven-latest/lib/maven-model-builder-3.5.2.jar
constituent[36]: file:/shared/common/apache-maven-latest/lib/jcl-over-slf4j-1.7.25.jar
constituent[37]: file:/shared/common/apache-maven-latest/lib/wagon-provider-api-2.12.jar
constituent[38]: file:/shared/common/apache-maven-latest/lib/maven-model-3.5.2.jar
constituent[39]: file:/shared/common/apache-maven-latest/lib/maven-compat-3.5.2.jar
constituent[40]: file:/shared/common/apache-maven-latest/lib/plexus-utils-3.1.0.jar
constituent[41]: file:/shared/common/apache-maven-latest/lib/maven-settings-3.5.2.jar
constituent[42]: file:/shared/common/apache-maven-latest/lib/maven-resolver-util-1.1.0.jar
---------------------------------------------------

Exception: java.lang.OutOfMemoryError thrown from the UncaughtExceptionHandler in thread "main"
Build timed out (after 240 minutes). Marking the build as aborted.
Terminating xvnc.
Build was aborted
[FINDBUGS] Skipping publisher since build result is ABORTED
[DRY] Skipping publisher since build result is ABORTED
Archiving artifacts
Recording test results
Java HotSpot(TM) 64-Bit Server VM warning: Exception java.lang.OutOfMemoryError occurred dispatching signal SIGTERM to handler- the VM may need to be forcibly terminated
Java HotSpot(TM) 64-Bit Server VM warning: Exception java.lang.OutOfMemoryError occurred dispatching signal SIGTERM to handler- the VM may need to be forcibly terminated
Java HotSpot(TM) 64-Bit Server VM warning: Exception java.lang.OutOfMemoryError occurred dispatching signal SIGTERM to handler- the VM may need to be forcibly terminated
Started calculate disk usage of build
Finished Calculation of disk usage of build in 0 seconds
Started calculate disk usage of workspace
Finished Calculation of disk usage of workspace in 0 seconds
Finished: ABORTED