UnstableConsole Output

Skipping 2,200 KB.. Full Log
rkspace/tests/plugins/org.eclipse.tcf.debug.test/tracing/.options, -Dtcf.agent.path=/home/hudson/genie.tcf/.jenkins/jobs/tcf-1.4/workspace/.agent, -jar, /jobs/genie.tcf/tcf-1.4/workspace/tests/plugins/org.eclipse.tcf.debug.test/target/work/plugins/org.eclipse.equinox.launcher_1.3.0.v20120522-1813.jar, -debug, -consolelog, -data, /jobs/genie.tcf/tcf-1.4/workspace/tests/plugins/org.eclipse.tcf.debug.test/target/work/data, -install, /jobs/genie.tcf/tcf-1.4/workspace/tests/plugins/org.eclipse.tcf.debug.test/target/work, -configuration, /jobs/genie.tcf/tcf-1.4/workspace/tests/plugins/org.eclipse.tcf.debug.test/target/work/configuration, -application, org.eclipse.tycho.surefire.osgibooter.uitest, -testproperties, /jobs/genie.tcf/tcf-1.4/workspace/tests/plugins/org.eclipse.tcf.debug.test/target/surefire.properties, -testApplication, org.eclipse.ui.ide.workbench, -product, org.eclipse.platform.ide, -nouithread]
Picked up JAVA_TOOL_OPTIONS: -Xmx2G -Djava.io.tmpdir=/tmp/genie.tcf
Configuration location:
    file:/jobs/genie.tcf/tcf-1.4/workspace/tests/plugins/org.eclipse.tcf.debug.test/target/work/configuration/
Configuration file:
    file:/jobs/genie.tcf/tcf-1.4/workspace/tests/plugins/org.eclipse.tcf.debug.test/target/work/configuration/config.ini loaded
Install location:
    file:/jobs/genie.tcf/tcf-1.4/workspace/tests/plugins/org.eclipse.tcf.debug.test/target/work/
Framework located:
    file:/jobs/genie.tcf/tcf-1.4/workspace/tests/plugins/org.eclipse.tcf.debug.test/target/work/plugins/org.eclipse.osgi_3.8.2.v20130124-134944.jar
Framework classpath:
    file:/jobs/genie.tcf/tcf-1.4/workspace/tests/plugins/org.eclipse.tcf.debug.test/target/work/plugins/org.eclipse.osgi_3.8.2.v20130124-134944.jar
Debug options:
    file:/jobs/genie.tcf/tcf-1.4/workspace/tests/plugins/org.eclipse.tcf.debug.test/tracing/.options not found
Time to load bundles: 31
Starting application: 8190
Launching application org.eclipse.ui.ide.workbench...
Cannot send datagram packet to /172.25.255.255
java.io.IOException: Operation not permitted
	at java.net.PlainDatagramSocketImpl.send(Native Method)
	at java.net.DatagramSocket.send(DatagramSocket.java:698)
	at org.eclipse.tcf.internal.services.local.LocatorService.sendDatagramPacket(LocatorService.java:774)
	at org.eclipse.tcf.internal.services.local.LocatorService.sendPeersRequest(LocatorService.java:851)
	at org.eclipse.tcf.internal.services.local.LocatorService.refresh_timer(LocatorService.java:554)
	at org.eclipse.tcf.internal.services.local.LocatorService.access$1(LocatorService.java:512)
	at org.eclipse.tcf.internal.services.local.LocatorService$1$1.run(LocatorService.java:184)
	at org.eclipse.tcf.protocol.Protocol$3.run(Protocol.java:219)
	at org.eclipse.tcf.EventQueue.run(EventQueue.java:95)
	at java.lang.Thread.run(Thread.java:745)
!SESSION 2018-02-25 02:04:19.577 -----------------------------------------------
eclipse.buildId=M20130131-0800
java.version=1.7.0_80
java.vendor=Oracle Corporation
BootLoader constants: OS=linux, ARCH=x86_64, WS=gtk, NL=en_US
Framework arguments:  -application org.eclipse.tycho.surefire.osgibooter.uitest -testproperties /jobs/genie.tcf/tcf-1.4/workspace/tests/plugins/org.eclipse.tcf.debug.test/target/surefire.properties -testApplication org.eclipse.ui.ide.workbench -product org.eclipse.platform.ide -nouithread
Command-line arguments:  -debug -consolelog -data /jobs/genie.tcf/tcf-1.4/workspace/tests/plugins/org.eclipse.tcf.debug.test/target/work/data -application org.eclipse.tycho.surefire.osgibooter.uitest -testproperties /jobs/genie.tcf/tcf-1.4/workspace/tests/plugins/org.eclipse.tcf.debug.test/target/surefire.properties -testApplication org.eclipse.ui.ide.workbench -product org.eclipse.platform.ide -nouithread

!ENTRY org.eclipse.tcf 4 0 2018-02-25 02:04:28.986
!MESSAGE Cannot send datagram packet to /172.25.255.255
!STACK 0
java.io.IOException: Operation not permitted
	at java.net.PlainDatagramSocketImpl.send(Native Method)
	at java.net.DatagramSocket.send(DatagramSocket.java:698)
	at org.eclipse.tcf.internal.services.local.LocatorService.sendDatagramPacket(LocatorService.java:774)
	at org.eclipse.tcf.internal.services.local.LocatorService.sendPeersRequest(LocatorService.java:851)
	at org.eclipse.tcf.internal.services.local.LocatorService.refresh_timer(LocatorService.java:554)
	at org.eclipse.tcf.internal.services.local.LocatorService.access$1(LocatorService.java:512)
	at org.eclipse.tcf.internal.services.local.LocatorService$1$1.run(LocatorService.java:184)
	at org.eclipse.tcf.protocol.Protocol$3.run(Protocol.java:219)
	at org.eclipse.tcf.EventQueue.run(EventQueue.java:95)
	at java.lang.Thread.run(Thread.java:745)
Application Started: 12019

-------------------------------------------------------
 T E S T S
-------------------------------------------------------
Running org.eclipse.tcf.debug.test.TransactionTests
Tests run: 5, Failures: 0, Errors: 0, Skipped: 0, Time elapsed: 0.02 sec - in org.eclipse.tcf.debug.test.TransactionTests
testSingleTransaction(org.eclipse.tcf.debug.test.TransactionTests)  Time elapsed: 0.004 sec
testSumTransaction(org.eclipse.tcf.debug.test.TransactionTests)  Time elapsed: 0.001 sec
testSingleTransactionUnchecked(org.eclipse.tcf.debug.test.TransactionTests)  Time elapsed: 0 sec
testSumTransactionUnchecked(org.eclipse.tcf.debug.test.TransactionTests)  Time elapsed: 0 sec
testSumTransactionIterative(org.eclipse.tcf.debug.test.TransactionTests)  Time elapsed: 0.001 sec
Running org.eclipse.tcf.debug.test.RunControlCMTest

=== testStateResetOnTerminate started at: February 25, 2018 2:04:31 AM EST
=== testStateResetOnTerminate finished at: February 25, 2018 2:04:33 AM EST (duration: 1449 ms)

!ENTRY org.eclipse.tcf.te.tests 4 1 2018-02-25 02:04:33.307
!MESSAGE Test case 'testStateResetOnTerminate(org.eclipse.tcf.debug.test.RunControlCMTest)' failed. Failure: Invalid agent location: /home/hudson/genie.tcf/.jenkins/jobs/tcf-1.4/workspace/.agent/agent
!STACK 0
junit.framework.AssertionFailedError: Invalid agent location: /home/hudson/genie.tcf/.jenkins/jobs/tcf-1.4/workspace/.agent/agent
	at junit.framework.Assert.fail(Assert.java:50)
	at junit.framework.Assert.assertTrue(Assert.java:20)
	at org.eclipse.tcf.te.tests.tcf.TcfTestCase.getAgentFile(TcfTestCase.java:240)
	at org.eclipse.tcf.te.tests.tcf.TcfTestCase.launchAgent(TcfTestCase.java:95)
	at org.eclipse.tcf.te.tests.tcf.TcfTestCase.setUp(TcfTestCase.java:61)
	at org.eclipse.tcf.debug.test.AbstractCMTest.setUp(AbstractCMTest.java:150)
	at junit.framework.TestCase.runBare(TestCase.java:132)
	at org.eclipse.tcf.te.tests.CoreTestCase.runBare(CoreTestCase.java:256)
	at junit.framework.TestResult$1.protect(TestResult.java:110)
	at junit.framework.TestResult.runProtected(TestResult.java:128)
	at junit.framework.TestResult.run(TestResult.java:113)
	at junit.framework.TestCase.run(TestCase.java:124)
	at org.eclipse.tcf.te.tests.CoreTestCase.run(CoreTestCase.java:233)
	at junit.framework.TestSuite.runTest(TestSuite.java:243)
	at junit.framework.TestSuite.run(TestSuite.java:238)
	at org.junit.internal.runners.JUnit38ClassRunner.run(JUnit38ClassRunner.java:83)
	at org.apache.maven.surefire.junit4.JUnit4Provider.execute(JUnit4Provider.java:264)
	at org.apache.maven.surefire.junit4.JUnit4Provider.executeTestSet(JUnit4Provider.java:153)
	at org.apache.maven.surefire.junit4.JUnit4Provider.invoke(JUnit4Provider.java:124)
	at sun.reflect.NativeMethodAccessorImpl.invoke0(Native Method)
	at sun.reflect.NativeMethodAccessorImpl.invoke(NativeMethodAccessorImpl.java:57)
	at sun.reflect.DelegatingMethodAccessorImpl.invoke(DelegatingMethodAccessorImpl.java:43)
	at java.lang.reflect.Method.invoke(Method.java:606)
	at org.apache.maven.surefire.util.ReflectionUtils.invokeMethodWithArray2(ReflectionUtils.java:208)
	at org.apache.maven.surefire.booter.ProviderFactory$ProviderProxy.invoke(ProviderFactory.java:156)
	at org.apache.maven.surefire.booter.ProviderFactory.invokeProvider(ProviderFactory.java:82)
	at org.eclipse.tycho.surefire.osgibooter.OsgiSurefireBooter.run(OsgiSurefireBooter.java:91)
	at org.eclipse.tycho.surefire.osgibooter.AbstractUITestApplication.runTests(AbstractUITestApplication.java:44)
	at org.eclipse.ui.internal.testing.WorkbenchTestable$1.run(WorkbenchTestable.java:71)
	at java.lang.Thread.run(Thread.java:745)

=== testRunControlCMChildrenInvalidation started at: February 25, 2018 2:04:33 AM EST
=== testRunControlCMChildrenInvalidation finished at: February 25, 2018 2:04:33 AM EST (duration: 2 ms)

!ENTRY org.eclipse.tcf.te.tests 4 1 2018-02-25 02:04:33.311
!MESSAGE Test case 'testRunControlCMChildrenInvalidation(org.eclipse.tcf.debug.test.RunControlCMTest)' failed. Failure: Invalid agent location: /home/hudson/genie.tcf/.jenkins/jobs/tcf-1.4/workspace/.agent/agent
!STACK 0
junit.framework.AssertionFailedError: Invalid agent location: /home/hudson/genie.tcf/.jenkins/jobs/tcf-1.4/workspace/.agent/agent
	at junit.framework.Assert.fail(Assert.java:50)
	at junit.framework.Assert.assertTrue(Assert.java:20)
	at org.eclipse.tcf.te.tests.tcf.TcfTestCase.getAgentFile(TcfTestCase.java:240)
	at org.eclipse.tcf.te.tests.tcf.TcfTestCase.launchAgent(TcfTestCase.java:95)
	at org.eclipse.tcf.te.tests.tcf.TcfTestCase.setUp(TcfTestCase.java:61)
	at org.eclipse.tcf.debug.test.AbstractCMTest.setUp(AbstractCMTest.java:150)
	at junit.framework.TestCase.runBare(TestCase.java:132)
	at org.eclipse.tcf.te.tests.CoreTestCase.runBare(CoreTestCase.java:256)
	at junit.framework.TestResult$1.protect(TestResult.java:110)
	at junit.framework.TestResult.runProtected(TestResult.java:128)
	at junit.framework.TestResult.run(TestResult.java:113)
	at junit.framework.TestCase.run(TestCase.java:124)
	at org.eclipse.tcf.te.tests.CoreTestCase.run(CoreTestCase.java:233)
	at junit.framework.TestSuite.runTest(TestSuite.java:243)
	at junit.framework.TestSuite.run(TestSuite.java:238)
	at org.junit.internal.runners.JUnit38ClassRunner.run(JUnit38ClassRunner.java:83)
	at org.apache.maven.surefire.junit4.JUnit4Provider.execute(JUnit4Provider.java:264)
	at org.apache.maven.surefire.junit4.JUnit4Provider.executeTestSet(JUnit4Provider.java:153)
	at org.apache.maven.surefire.junit4.JUnit4Provider.invoke(JUnit4Provider.java:124)
	at sun.reflect.NativeMethodAccessorImpl.invoke0(Native Method)
	at sun.reflect.NativeMethodAccessorImpl.invoke(NativeMethodAccessorImpl.java:57)
	at sun.reflect.DelegatingMethodAccessorImpl.invoke(DelegatingMethodAccessorImpl.java:43)
	at java.lang.reflect.Method.invoke(Method.java:606)
	at org.apache.maven.surefire.util.ReflectionUtils.invokeMethodWithArray2(ReflectionUtils.java:208)
	at org.apache.maven.surefire.booter.ProviderFactory$ProviderProxy.invoke(ProviderFactory.java:156)
	at org.apache.maven.surefire.booter.ProviderFactory.invokeProvider(ProviderFactory.java:82)
	at org.eclipse.tycho.surefire.osgibooter.OsgiSurefireBooter.run(OsgiSurefireBooter.java:91)
	at org.eclipse.tycho.surefire.osgibooter.AbstractUITestApplication.runTests(AbstractUITestApplication.java:44)
	at org.eclipse.ui.internal.testing.WorkbenchTestable$1.run(WorkbenchTestable.java:71)
	at java.lang.Thread.run(Thread.java:745)

=== testChildrenResetOnAddedRemoved started at: February 25, 2018 2:04:33 AM EST
=== testChildrenResetOnAddedRemoved finished at: February 25, 2018 2:04:33 AM EST (duration: 1 ms)

!ENTRY org.eclipse.tcf.te.tests 4 1 2018-02-25 02:04:33.313
!MESSAGE Test case 'testChildrenResetOnAddedRemoved(org.eclipse.tcf.debug.test.RunControlCMTest)' failed. Failure: Invalid agent location: /home/hudson/genie.tcf/.jenkins/jobs/tcf-1.4/workspace/.agent/agent
!STACK 0
junit.framework.AssertionFailedError: Invalid agent location: /home/hudson/genie.tcf/.jenkins/jobs/tcf-1.4/workspace/.agent/agent
	at junit.framework.Assert.fail(Assert.java:50)
	at junit.framework.Assert.assertTrue(Assert.java:20)
	at org.eclipse.tcf.te.tests.tcf.TcfTestCase.getAgentFile(TcfTestCase.java:240)
	at org.eclipse.tcf.te.tests.tcf.TcfTestCase.launchAgent(TcfTestCase.java:95)
	at org.eclipse.tcf.te.tests.tcf.TcfTestCase.setUp(TcfTestCase.java:61)
	at org.eclipse.tcf.debug.test.AbstractCMTest.setUp(AbstractCMTest.java:150)
	at junit.framework.TestCase.runBare(TestCase.java:132)
	at org.eclipse.tcf.te.tests.CoreTestCase.runBare(CoreTestCase.java:256)
	at junit.framework.TestResult$1.protect(TestResult.java:110)
	at junit.framework.TestResult.runProtected(TestResult.java:128)
	at junit.framework.TestResult.run(TestResult.java:113)
	at junit.framework.TestCase.run(TestCase.java:124)
	at org.eclipse.tcf.te.tests.CoreTestCase.run(CoreTestCase.java:233)
	at junit.framework.TestSuite.runTest(TestSuite.java:243)
	at junit.framework.TestSuite.run(TestSuite.java:238)
	at org.junit.internal.runners.JUnit38ClassRunner.run(JUnit38ClassRunner.java:83)
	at org.apache.maven.surefire.junit4.JUnit4Provider.execute(JUnit4Provider.java:264)
	at org.apache.maven.surefire.junit4.JUnit4Provider.executeTestSet(JUnit4Provider.java:153)
	at org.apache.maven.surefire.junit4.JUnit4Provider.invoke(JUnit4Provider.java:124)
	at sun.reflect.NativeMethodAccessorImpl.invoke0(Native Method)
	at sun.reflect.NativeMethodAccessorImpl.invoke(NativeMethodAccessorImpl.java:57)
	at sun.reflect.DelegatingMethodAccessorImpl.invoke(DelegatingMethodAccessorImpl.java:43)
	at java.lang.reflect.Method.invoke(Method.java:606)
	at org.apache.maven.surefire.util.ReflectionUtils.invokeMethodWithArray2(ReflectionUtils.java:208)
	at org.apache.maven.surefire.booter.ProviderFactory$ProviderProxy.invoke(ProviderFactory.java:156)
	at org.apache.maven.surefire.booter.ProviderFactory.invokeProvider(ProviderFactory.java:82)
	at org.eclipse.tycho.surefire.osgibooter.OsgiSurefireBooter.run(OsgiSurefireBooter.java:91)
	at org.eclipse.tycho.surefire.osgibooter.AbstractUITestApplication.runTests(AbstractUITestApplication.java:44)
	at org.eclipse.ui.internal.testing.WorkbenchTestable$1.run(WorkbenchTestable.java:71)
	at java.lang.Thread.run(Thread.java:745)

=== testMappingCommandCaches started at: February 25, 2018 2:04:33 AM EST
=== testMappingCommandCaches finished at: February 25, 2018 2:04:33 AM EST (duration: 2 ms)

!ENTRY org.eclipse.tcf.te.tests 4 1 2018-02-25 02:04:33.315
!MESSAGE Test case 'testMappingCommandCaches(org.eclipse.tcf.debug.test.RunControlCMTest)' failed. Failure: Invalid agent location: /home/hudson/genie.tcf/.jenkins/jobs/tcf-1.4/workspace/.agent/agent
!STACK 0
junit.framework.AssertionFailedError: Invalid agent location: /home/hudson/genie.tcf/.jenkins/jobs/tcf-1.4/workspace/.agent/agent
	at junit.framework.Assert.fail(Assert.java:50)
	at junit.framework.Assert.assertTrue(Assert.java:20)
	at org.eclipse.tcf.te.tests.tcf.TcfTestCase.getAgentFile(TcfTestCase.java:240)
	at org.eclipse.tcf.te.tests.tcf.TcfTestCase.launchAgent(TcfTestCase.java:95)
	at org.eclipse.tcf.te.tests.tcf.TcfTestCase.setUp(TcfTestCase.java:61)
	at org.eclipse.tcf.debug.test.AbstractCMTest.setUp(AbstractCMTest.java:150)
	at junit.framework.TestCase.runBare(TestCase.java:132)
	at org.eclipse.tcf.te.tests.CoreTestCase.runBare(CoreTestCase.java:256)
	at junit.framework.TestResult$1.protect(TestResult.java:110)
	at junit.framework.TestResult.runProtected(TestResult.java:128)
	at junit.framework.TestResult.run(TestResult.java:113)
	at junit.framework.TestCase.run(TestCase.java:124)
	at org.eclipse.tcf.te.tests.CoreTestCase.run(CoreTestCase.java:233)
	at junit.framework.TestSuite.runTest(TestSuite.java:243)
	at junit.framework.TestSuite.run(TestSuite.java:238)
	at org.junit.internal.runners.JUnit38ClassRunner.run(JUnit38ClassRunner.java:83)
	at org.apache.maven.surefire.junit4.JUnit4Provider.execute(JUnit4Provider.java:264)
	at org.apache.maven.surefire.junit4.JUnit4Provider.executeTestSet(JUnit4Provider.java:153)
	at org.apache.maven.surefire.junit4.JUnit4Provider.invoke(JUnit4Provider.java:124)
	at sun.reflect.NativeMethodAccessorImpl.invoke0(Native Method)
	at sun.reflect.NativeMethodAccessorImpl.invoke(NativeMethodAccessorImpl.java:57)
	at sun.reflect.DelegatingMethodAccessorImpl.invoke(DelegatingMethodAccessorImpl.java:43)
	at java.lang.reflect.Method.invoke(Method.java:606)
	at org.apache.maven.surefire.util.ReflectionUtils.invokeMethodWithArray2(ReflectionUtils.java:208)
	at org.apache.maven.surefire.booter.ProviderFactory$ProviderProxy.invoke(ProviderFactory.java:156)
	at org.apache.maven.surefire.booter.ProviderFactory.invokeProvider(ProviderFactory.java:82)
	at org.eclipse.tycho.surefire.osgibooter.OsgiSurefireBooter.run(OsgiSurefireBooter.java:91)
	at org.eclipse.tycho.surefire.osgibooter.AbstractUITestApplication.runTests(AbstractUITestApplication.java:44)
	at org.eclipse.ui.internal.testing.WorkbenchTestable$1.run(WorkbenchTestable.java:71)
	at java.lang.Thread.run(Thread.java:745)

=== testStateResetOnResumeSuspend started at: February 25, 2018 2:04:33 AM EST
=== testStateResetOnResumeSuspend finished at: February 25, 2018 2:04:33 AM EST (duration: 1 ms)

!ENTRY org.eclipse.tcf.te.tests 4 1 2018-02-25 02:04:33.318
!MESSAGE Test case 'testStateResetOnResumeSuspend(org.eclipse.tcf.debug.test.RunControlCMTest)' failed. Failure: Invalid agent location: /home/hudson/genie.tcf/.jenkins/jobs/tcf-1.4/workspace/.agent/agent
!STACK 0
junit.framework.AssertionFailedError: Invalid agent location: /home/hudson/genie.tcf/.jenkins/jobs/tcf-1.4/workspace/.agent/agent
	at junit.framework.Assert.fail(Assert.java:50)
	at junit.framework.Assert.assertTrue(Assert.java:20)
	at org.eclipse.tcf.te.tests.tcf.TcfTestCase.getAgentFile(TcfTestCase.java:240)
	at org.eclipse.tcf.te.tests.tcf.TcfTestCase.launchAgent(TcfTestCase.java:95)
	at org.eclipse.tcf.te.tests.tcf.TcfTestCase.setUp(TcfTestCase.java:61)
	at org.eclipse.tcf.debug.test.AbstractCMTest.setUp(AbstractCMTest.java:150)
	at junit.framework.TestCase.runBare(TestCase.java:132)
	at org.eclipse.tcf.te.tests.CoreTestCase.runBare(CoreTestCase.java:256)
	at junit.framework.TestResult$1.protect(TestResult.java:110)
	at junit.framework.TestResult.runProtected(TestResult.java:128)
	at junit.framework.TestResult.run(TestResult.java:113)
	at junit.framework.TestCase.run(TestCase.java:124)
	at org.eclipse.tcf.te.tests.CoreTestCase.run(CoreTestCase.java:233)
	at junit.framework.TestSuite.runTest(TestSuite.java:243)
	at junit.framework.TestSuite.run(TestSuite.java:238)
	at org.junit.internal.runners.JUnit38ClassRunner.run(JUnit38ClassRunner.java:83)
	at org.apache.maven.surefire.junit4.JUnit4Provider.execute(JUnit4Provider.java:264)
	at org.apache.maven.surefire.junit4.JUnit4Provider.executeTestSet(JUnit4Provider.java:153)
	at org.apache.maven.surefire.junit4.JUnit4Provider.invoke(JUnit4Provider.java:124)
	at sun.reflect.NativeMethodAccessorImpl.invoke0(Native Method)
	at sun.reflect.NativeMethodAccessorImpl.invoke(NativeMethodAccessorImpl.java:57)
	at sun.reflect.DelegatingMethodAccessorImpl.invoke(DelegatingMethodAccessorImpl.java:43)
	at java.lang.reflect.Method.invoke(Method.java:606)
	at org.apache.maven.surefire.util.ReflectionUtils.invokeMethodWithArray2(ReflectionUtils.java:208)
	at org.apache.maven.surefire.booter.ProviderFactory$ProviderProxy.invoke(ProviderFactory.java:156)
	at org.apache.maven.surefire.booter.ProviderFactory.invokeProvider(ProviderFactory.java:82)
	at org.eclipse.tycho.surefire.osgibooter.OsgiSurefireBooter.run(OsgiSurefireBooter.java:91)
	at org.eclipse.tycho.surefire.osgibooter.AbstractUITestApplication.runTests(AbstractUITestApplication.java:44)
	at org.eclipse.ui.internal.testing.WorkbenchTestable$1.run(WorkbenchTestable.java:71)
	at java.lang.Thread.run(Thread.java:745)
Tests run: 5, Failures: 5, Errors: 0, Skipped: 0, Time elapsed: 1.525 sec <<< FAILURE! - in org.eclipse.tcf.debug.test.RunControlCMTest
testStateResetOnTerminate(org.eclipse.tcf.debug.test.RunControlCMTest)  Time elapsed: 1.451 sec  <<< FAILURE!
junit.framework.AssertionFailedError: Invalid agent location: /home/hudson/genie.tcf/.jenkins/jobs/tcf-1.4/workspace/.agent/agent
	at junit.framework.Assert.fail(Assert.java:50)
	at junit.framework.Assert.assertTrue(Assert.java:20)
	at org.eclipse.tcf.te.tests.tcf.TcfTestCase.getAgentFile(TcfTestCase.java:240)
	at org.eclipse.tcf.te.tests.tcf.TcfTestCase.launchAgent(TcfTestCase.java:95)
	at org.eclipse.tcf.te.tests.tcf.TcfTestCase.setUp(TcfTestCase.java:61)
	at org.eclipse.tcf.debug.test.AbstractCMTest.setUp(AbstractCMTest.java:150)
	at junit.framework.TestCase.runBare(TestCase.java:132)
	at org.eclipse.tcf.te.tests.CoreTestCase.runBare(CoreTestCase.java:256)
	at junit.framework.TestResult$1.protect(TestResult.java:110)
	at junit.framework.TestResult.runProtected(TestResult.java:128)
	at junit.framework.TestResult.run(TestResult.java:113)
	at junit.framework.TestCase.run(TestCase.java:124)
	at org.eclipse.tcf.te.tests.CoreTestCase.run(CoreTestCase.java:233)
	at junit.framework.TestSuite.runTest(TestSuite.java:243)
	at junit.framework.TestSuite.run(TestSuite.java:238)
	at org.junit.internal.runners.JUnit38ClassRunner.run(JUnit38ClassRunner.java:83)
	at org.apache.maven.surefire.junit4.JUnit4Provider.execute(JUnit4Provider.java:264)
	at org.apache.maven.surefire.junit4.JUnit4Provider.executeTestSet(JUnit4Provider.java:153)
	at org.apache.maven.surefire.junit4.JUnit4Provider.invoke(JUnit4Provider.java:124)
	at sun.reflect.NativeMethodAccessorImpl.invoke0(Native Method)
	at sun.reflect.NativeMethodAccessorImpl.invoke(NativeMethodAccessorImpl.java:57)
	at sun.reflect.DelegatingMethodAccessorImpl.invoke(DelegatingMethodAccessorImpl.java:43)
	at java.lang.reflect.Method.invoke(Method.java:606)
	at org.apache.maven.surefire.util.ReflectionUtils.invokeMethodWithArray2(ReflectionUtils.java:208)
	at org.apache.maven.surefire.booter.ProviderFactory$ProviderProxy.invoke(ProviderFactory.java:156)
	at org.apache.maven.surefire.booter.ProviderFactory.invokeProvider(ProviderFactory.java:82)
	at org.eclipse.tycho.surefire.osgibooter.OsgiSurefireBooter.run(OsgiSurefireBooter.java:91)
	at org.eclipse.tycho.surefire.osgibooter.AbstractUITestApplication.runTests(AbstractUITestApplication.java:44)
	at org.eclipse.ui.internal.testing.WorkbenchTestable$1.run(WorkbenchTestable.java:71)
	at java.lang.Thread.run(Thread.java:745)

testRunControlCMChildrenInvalidation(org.eclipse.tcf.debug.test.RunControlCMTest)  Time elapsed: 0.002 sec  <<< FAILURE!
junit.framework.AssertionFailedError: Invalid agent location: /home/hudson/genie.tcf/.jenkins/jobs/tcf-1.4/workspace/.agent/agent
	at junit.framework.Assert.fail(Assert.java:50)
	at junit.framework.Assert.assertTrue(Assert.java:20)
	at org.eclipse.tcf.te.tests.tcf.TcfTestCase.getAgentFile(TcfTestCase.java:240)
	at org.eclipse.tcf.te.tests.tcf.TcfTestCase.launchAgent(TcfTestCase.java:95)
	at org.eclipse.tcf.te.tests.tcf.TcfTestCase.setUp(TcfTestCase.java:61)
	at org.eclipse.tcf.debug.test.AbstractCMTest.setUp(AbstractCMTest.java:150)
	at junit.framework.TestCase.runBare(TestCase.java:132)
	at org.eclipse.tcf.te.tests.CoreTestCase.runBare(CoreTestCase.java:256)
	at junit.framework.TestResult$1.protect(TestResult.java:110)
	at junit.framework.TestResult.runProtected(TestResult.java:128)
	at junit.framework.TestResult.run(TestResult.java:113)
	at junit.framework.TestCase.run(TestCase.java:124)
	at org.eclipse.tcf.te.tests.CoreTestCase.run(CoreTestCase.java:233)
	at junit.framework.TestSuite.runTest(TestSuite.java:243)
	at junit.framework.TestSuite.run(TestSuite.java:238)
	at org.junit.internal.runners.JUnit38ClassRunner.run(JUnit38ClassRunner.java:83)
	at org.apache.maven.surefire.junit4.JUnit4Provider.execute(JUnit4Provider.java:264)
	at org.apache.maven.surefire.junit4.JUnit4Provider.executeTestSet(JUnit4Provider.java:153)
	at org.apache.maven.surefire.junit4.JUnit4Provider.invoke(JUnit4Provider.java:124)
	at sun.reflect.NativeMethodAccessorImpl.invoke0(Native Method)
	at sun.reflect.NativeMethodAccessorImpl.invoke(NativeMethodAccessorImpl.java:57)
	at sun.reflect.DelegatingMethodAccessorImpl.invoke(DelegatingMethodAccessorImpl.java:43)
	at java.lang.reflect.Method.invoke(Method.java:606)
	at org.apache.maven.surefire.util.ReflectionUtils.invokeMethodWithArray2(ReflectionUtils.java:208)
	at org.apache.maven.surefire.booter.ProviderFactory$ProviderProxy.invoke(ProviderFactory.java:156)
	at org.apache.maven.surefire.booter.ProviderFactory.invokeProvider(ProviderFactory.java:82)
	at org.eclipse.tycho.surefire.osgibooter.OsgiSurefireBooter.run(OsgiSurefireBooter.java:91)
	at org.eclipse.tycho.surefire.osgibooter.AbstractUITestApplication.runTests(AbstractUITestApplication.java:44)
	at org.eclipse.ui.internal.testing.WorkbenchTestable$1.run(WorkbenchTestable.java:71)
	at java.lang.Thread.run(Thread.java:745)

testChildrenResetOnAddedRemoved(org.eclipse.tcf.debug.test.RunControlCMTest)  Time elapsed: 0.002 sec  <<< FAILURE!
junit.framework.AssertionFailedError: Invalid agent location: /home/hudson/genie.tcf/.jenkins/jobs/tcf-1.4/workspace/.agent/agent
	at junit.framework.Assert.fail(Assert.java:50)
	at junit.framework.Assert.assertTrue(Assert.java:20)
	at org.eclipse.tcf.te.tests.tcf.TcfTestCase.getAgentFile(TcfTestCase.java:240)
	at org.eclipse.tcf.te.tests.tcf.TcfTestCase.launchAgent(TcfTestCase.java:95)
	at org.eclipse.tcf.te.tests.tcf.TcfTestCase.setUp(TcfTestCase.java:61)
	at org.eclipse.tcf.debug.test.AbstractCMTest.setUp(AbstractCMTest.java:150)
	at junit.framework.TestCase.runBare(TestCase.java:132)
	at org.eclipse.tcf.te.tests.CoreTestCase.runBare(CoreTestCase.java:256)
	at junit.framework.TestResult$1.protect(TestResult.java:110)
	at junit.framework.TestResult.runProtected(TestResult.java:128)
	at junit.framework.TestResult.run(TestResult.java:113)
	at junit.framework.TestCase.run(TestCase.java:124)
	at org.eclipse.tcf.te.tests.CoreTestCase.run(CoreTestCase.java:233)
	at junit.framework.TestSuite.runTest(TestSuite.java:243)
	at junit.framework.TestSuite.run(TestSuite.java:238)
	at org.junit.internal.runners.JUnit38ClassRunner.run(JUnit38ClassRunner.java:83)
	at org.apache.maven.surefire.junit4.JUnit4Provider.execute(JUnit4Provider.java:264)
	at org.apache.maven.surefire.junit4.JUnit4Provider.executeTestSet(JUnit4Provider.java:153)
	at org.apache.maven.surefire.junit4.JUnit4Provider.invoke(JUnit4Provider.java:124)
	at sun.reflect.NativeMethodAccessorImpl.invoke0(Native Method)
	at sun.reflect.NativeMethodAccessorImpl.invoke(NativeMethodAccessorImpl.java:57)
	at sun.reflect.DelegatingMethodAccessorImpl.invoke(DelegatingMethodAccessorImpl.java:43)
	at java.lang.reflect.Method.invoke(Method.java:606)
	at org.apache.maven.surefire.util.ReflectionUtils.invokeMethodWithArray2(ReflectionUtils.java:208)
	at org.apache.maven.surefire.booter.ProviderFactory$ProviderProxy.invoke(ProviderFactory.java:156)
	at org.apache.maven.surefire.booter.ProviderFactory.invokeProvider(ProviderFactory.java:82)
	at org.eclipse.tycho.surefire.osgibooter.OsgiSurefireBooter.run(OsgiSurefireBooter.java:91)
	at org.eclipse.tycho.surefire.osgibooter.AbstractUITestApplication.runTests(AbstractUITestApplication.java:44)
	at org.eclipse.ui.internal.testing.WorkbenchTestable$1.run(WorkbenchTestable.java:71)
	at java.lang.Thread.run(Thread.java:745)

testMappingCommandCaches(org.eclipse.tcf.debug.test.RunControlCMTest)  Time elapsed: 0.002 sec  <<< FAILURE!
junit.framework.AssertionFailedError: Invalid agent location: /home/hudson/genie.tcf/.jenkins/jobs/tcf-1.4/workspace/.agent/agent
	at junit.framework.Assert.fail(Assert.java:50)
	at junit.framework.Assert.assertTrue(Assert.java:20)
	at org.eclipse.tcf.te.tests.tcf.TcfTestCase.getAgentFile(TcfTestCase.java:240)
	at org.eclipse.tcf.te.tests.tcf.TcfTestCase.launchAgent(TcfTestCase.java:95)
	at org.eclipse.tcf.te.tests.tcf.TcfTestCase.setUp(TcfTestCase.java:61)
	at org.eclipse.tcf.debug.test.AbstractCMTest.setUp(AbstractCMTest.java:150)
	at junit.framework.TestCase.runBare(TestCase.java:132)
	at org.eclipse.tcf.te.tests.CoreTestCase.runBare(CoreTestCase.java:256)
	at junit.framework.TestResult$1.protect(TestResult.java:110)
	at junit.framework.TestResult.runProtected(TestResult.java:128)
	at junit.framework.TestResult.run(TestResult.java:113)
	at junit.framework.TestCase.run(TestCase.java:124)
	at org.eclipse.tcf.te.tests.CoreTestCase.run(CoreTestCase.java:233)
	at junit.framework.TestSuite.runTest(TestSuite.java:243)
	at junit.framework.TestSuite.run(TestSuite.java:238)
	at org.junit.internal.runners.JUnit38ClassRunner.run(JUnit38ClassRunner.java:83)
	at org.apache.maven.surefire.junit4.JUnit4Provider.execute(JUnit4Provider.java:264)
	at org.apache.maven.surefire.junit4.JUnit4Provider.executeTestSet(JUnit4Provider.java:153)
	at org.apache.maven.surefire.junit4.JUnit4Provider.invoke(JUnit4Provider.java:124)
	at sun.reflect.NativeMethodAccessorImpl.invoke0(Native Method)
	at sun.reflect.NativeMethodAccessorImpl.invoke(NativeMethodAccessorImpl.java:57)
	at sun.reflect.DelegatingMethodAccessorImpl.invoke(DelegatingMethodAccessorImpl.java:43)
	at java.lang.reflect.Method.invoke(Method.java:606)
	at org.apache.maven.surefire.util.ReflectionUtils.invokeMethodWithArray2(ReflectionUtils.java:208)
	at org.apache.maven.surefire.booter.ProviderFactory$ProviderProxy.invoke(ProviderFactory.java:156)
	at org.apache.maven.surefire.booter.ProviderFactory.invokeProvider(ProviderFactory.java:82)
	at org.eclipse.tycho.surefire.osgibooter.OsgiSurefireBooter.run(OsgiSurefireBooter.java:91)
	at org.eclipse.tycho.surefire.osgibooter.AbstractUITestApplication.runTests(AbstractUITestApplication.java:44)
	at org.eclipse.ui.internal.testing.WorkbenchTestable$1.run(WorkbenchTestable.java:71)
	at java.lang.Thread.run(Thread.java:745)

testStateResetOnResumeSuspend(org.eclipse.tcf.debug.test.RunControlCMTest)  Time elapsed: 0.001 sec  <<< FAILURE!
junit.framework.AssertionFailedError: Invalid agent location: /home/hudson/genie.tcf/.jenkins/jobs/tcf-1.4/workspace/.agent/agent
	at junit.framework.Assert.fail(Assert.java:50)
	at junit.framework.Assert.assertTrue(Assert.java:20)
	at org.eclipse.tcf.te.tests.tcf.TcfTestCase.getAgentFile(TcfTestCase.java:240)
	at org.eclipse.tcf.te.tests.tcf.TcfTestCase.launchAgent(TcfTestCase.java:95)
	at org.eclipse.tcf.te.tests.tcf.TcfTestCase.setUp(TcfTestCase.java:61)
	at org.eclipse.tcf.debug.test.AbstractCMTest.setUp(AbstractCMTest.java:150)
	at junit.framework.TestCase.runBare(TestCase.java:132)
	at org.eclipse.tcf.te.tests.CoreTestCase.runBare(CoreTestCase.java:256)
	at junit.framework.TestResult$1.protect(TestResult.java:110)
	at junit.framework.TestResult.runProtected(TestResult.java:128)
	at junit.framework.TestResult.run(TestResult.java:113)
	at junit.framework.TestCase.run(TestCase.java:124)
	at org.eclipse.tcf.te.tests.CoreTestCase.run(CoreTestCase.java:233)
	at junit.framework.TestSuite.runTest(TestSuite.java:243)
	at junit.framework.TestSuite.run(TestSuite.java:238)
	at org.junit.internal.runners.JUnit38ClassRunner.run(JUnit38ClassRunner.java:83)
	at org.apache.maven.surefire.junit4.JUnit4Provider.execute(JUnit4Provider.java:264)
	at org.apache.maven.surefire.junit4.JUnit4Provider.executeTestSet(JUnit4Provider.java:153)
	at org.apache.maven.surefire.junit4.JUnit4Provider.invoke(JUnit4Provider.java:124)
	at sun.reflect.NativeMethodAccessorImpl.invoke0(Native Method)
	at sun.reflect.NativeMethodAccessorImpl.invoke(NativeMethodAccessorImpl.java:57)
	at sun.reflect.DelegatingMethodAccessorImpl.invoke(DelegatingMethodAccessorImpl.java:43)
	at java.lang.reflect.Method.invoke(Method.java:606)
	at org.apache.maven.surefire.util.ReflectionUtils.invokeMethodWithArray2(ReflectionUtils.java:208)
	at org.apache.maven.surefire.booter.ProviderFactory$ProviderProxy.invoke(ProviderFactory.java:156)
	at org.apache.maven.surefire.booter.ProviderFactory.invokeProvider(ProviderFactory.java:82)
	at org.eclipse.tycho.surefire.osgibooter.OsgiSurefireBooter.run(OsgiSurefireBooter.java:91)
	at org.eclipse.tycho.surefire.osgibooter.AbstractUITestApplication.runTests(AbstractUITestApplication.java:44)
	at org.eclipse.ui.internal.testing.WorkbenchTestable$1.run(WorkbenchTestable.java:71)
	at java.lang.Thread.run(Thread.java:745)

Running org.eclipse.tcf.debug.test.StackTraceCMTest

=== testStackTraceCMResetOnContextChange started at: February 25, 2018 2:04:33 AM EST
=== testStackTraceCMResetOnContextChange finished at: February 25, 2018 2:04:33 AM EST (duration: 2 ms)

!ENTRY org.eclipse.tcf.te.tests 4 1 2018-02-25 02:04:33.338
!MESSAGE Test case 'testStackTraceCMResetOnContextChange(org.eclipse.tcf.debug.test.StackTraceCMTest)' failed. Failure: Invalid agent location: /home/hudson/genie.tcf/.jenkins/jobs/tcf-1.4/workspace/.agent/agent
!STACK 0
junit.framework.AssertionFailedError: Invalid agent location: /home/hudson/genie.tcf/.jenkins/jobs/tcf-1.4/workspace/.agent/agent
	at junit.framework.Assert.fail(Assert.java:50)
	at junit.framework.Assert.assertTrue(Assert.java:20)
	at org.eclipse.tcf.te.tests.tcf.TcfTestCase.getAgentFile(TcfTestCase.java:240)
	at org.eclipse.tcf.te.tests.tcf.TcfTestCase.launchAgent(TcfTestCase.java:95)
	at org.eclipse.tcf.te.tests.tcf.TcfTestCase.setUp(TcfTestCase.java:61)
	at org.eclipse.tcf.debug.test.AbstractCMTest.setUp(AbstractCMTest.java:150)
	at junit.framework.TestCase.runBare(TestCase.java:132)
	at org.eclipse.tcf.te.tests.CoreTestCase.runBare(CoreTestCase.java:256)
	at junit.framework.TestResult$1.protect(TestResult.java:110)
	at junit.framework.TestResult.runProtected(TestResult.java:128)
	at junit.framework.TestResult.run(TestResult.java:113)
	at junit.framework.TestCase.run(TestCase.java:124)
	at org.eclipse.tcf.te.tests.CoreTestCase.run(CoreTestCase.java:233)
	at junit.framework.TestSuite.runTest(TestSuite.java:243)
	at junit.framework.TestSuite.run(TestSuite.java:238)
	at org.junit.internal.runners.JUnit38ClassRunner.run(JUnit38ClassRunner.java:83)
	at org.apache.maven.surefire.junit4.JUnit4Provider.execute(JUnit4Provider.java:264)
	at org.apache.maven.surefire.junit4.JUnit4Provider.executeTestSet(JUnit4Provider.java:153)
	at org.apache.maven.surefire.junit4.JUnit4Provider.invoke(JUnit4Provider.java:124)
	at sun.reflect.NativeMethodAccessorImpl.invoke0(Native Method)
	at sun.reflect.NativeMethodAccessorImpl.invoke(NativeMethodAccessorImpl.java:57)
	at sun.reflect.DelegatingMethodAccessorImpl.invoke(DelegatingMethodAccessorImpl.java:43)
	at java.lang.reflect.Method.invoke(Method.java:606)
	at org.apache.maven.surefire.util.ReflectionUtils.invokeMethodWithArray2(ReflectionUtils.java:208)
	at org.apache.maven.surefire.booter.ProviderFactory$ProviderProxy.invoke(ProviderFactory.java:156)
	at org.apache.maven.surefire.booter.ProviderFactory.invokeProvider(ProviderFactory.java:82)
	at org.eclipse.tycho.surefire.osgibooter.OsgiSurefireBooter.run(OsgiSurefireBooter.java:91)
	at org.eclipse.tycho.surefire.osgibooter.AbstractUITestApplication.runTests(AbstractUITestApplication.java:44)
	at org.eclipse.ui.internal.testing.WorkbenchTestable$1.run(WorkbenchTestable.java:71)
	at java.lang.Thread.run(Thread.java:745)

=== testStackTraceCMResetOnMemoryChange started at: February 25, 2018 2:04:33 AM EST
=== testStackTraceCMResetOnMemoryChange finished at: February 25, 2018 2:04:33 AM EST (duration: 1 ms)

!ENTRY org.eclipse.tcf.te.tests 4 1 2018-02-25 02:04:33.341
!MESSAGE Test case 'testStackTraceCMResetOnMemoryChange(org.eclipse.tcf.debug.test.StackTraceCMTest)' failed. Failure: Invalid agent location: /home/hudson/genie.tcf/.jenkins/jobs/tcf-1.4/workspace/.agent/agent
!STACK 0
junit.framework.AssertionFailedError: Invalid agent location: /home/hudson/genie.tcf/.jenkins/jobs/tcf-1.4/workspace/.agent/agent
	at junit.framework.Assert.fail(Assert.java:50)
	at junit.framework.Assert.assertTrue(Assert.java:20)
	at org.eclipse.tcf.te.tests.tcf.TcfTestCase.getAgentFile(TcfTestCase.java:240)
	at org.eclipse.tcf.te.tests.tcf.TcfTestCase.launchAgent(TcfTestCase.java:95)
	at org.eclipse.tcf.te.tests.tcf.TcfTestCase.setUp(TcfTestCase.java:61)
	at org.eclipse.tcf.debug.test.AbstractCMTest.setUp(AbstractCMTest.java:150)
	at junit.framework.TestCase.runBare(TestCase.java:132)
	at org.eclipse.tcf.te.tests.CoreTestCase.runBare(CoreTestCase.java:256)
	at junit.framework.TestResult$1.protect(TestResult.java:110)
	at junit.framework.TestResult.runProtected(TestResult.java:128)
	at junit.framework.TestResult.run(TestResult.java:113)
	at junit.framework.TestCase.run(TestCase.java:124)
	at org.eclipse.tcf.te.tests.CoreTestCase.run(CoreTestCase.java:233)
	at junit.framework.TestSuite.runTest(TestSuite.java:243)
	at junit.framework.TestSuite.run(TestSuite.java:238)
	at org.junit.internal.runners.JUnit38ClassRunner.run(JUnit38ClassRunner.java:83)
	at org.apache.maven.surefire.junit4.JUnit4Provider.execute(JUnit4Provider.java:264)
	at org.apache.maven.surefire.junit4.JUnit4Provider.executeTestSet(JUnit4Provider.java:153)
	at org.apache.maven.surefire.junit4.JUnit4Provider.invoke(JUnit4Provider.java:124)
	at sun.reflect.NativeMethodAccessorImpl.invoke0(Native Method)
	at sun.reflect.NativeMethodAccessorImpl.invoke(NativeMethodAccessorImpl.java:57)
	at sun.reflect.DelegatingMethodAccessorImpl.invoke(DelegatingMethodAccessorImpl.java:43)
	at java.lang.reflect.Method.invoke(Method.java:606)
	at org.apache.maven.surefire.util.ReflectionUtils.invokeMethodWithArray2(ReflectionUtils.java:208)
	at org.apache.maven.surefire.booter.ProviderFactory$ProviderProxy.invoke(ProviderFactory.java:156)
	at org.apache.maven.surefire.booter.ProviderFactory.invokeProvider(ProviderFactory.java:82)
	at org.eclipse.tycho.surefire.osgibooter.OsgiSurefireBooter.run(OsgiSurefireBooter.java:91)
	at org.eclipse.tycho.surefire.osgibooter.AbstractUITestApplication.runTests(AbstractUITestApplication.java:44)
	at org.eclipse.ui.internal.testing.WorkbenchTestable$1.run(WorkbenchTestable.java:71)
	at java.lang.Thread.run(Thread.java:745)

=== testStackTraceCMResetOnMemoryMapChange started at: February 25, 2018 2:04:33 AM EST
=== testStackTraceCMResetOnMemoryMapChange finished at: February 25, 2018 2:04:33 AM EST (duration: 2 ms)

!ENTRY org.eclipse.tcf.te.tests 4 1 2018-02-25 02:04:33.344
!MESSAGE Test case 'testStackTraceCMResetOnMemoryMapChange(org.eclipse.tcf.debug.test.StackTraceCMTest)' failed. Failure: Invalid agent location: /home/hudson/genie.tcf/.jenkins/jobs/tcf-1.4/workspace/.agent/agent
!STACK 0
junit.framework.AssertionFailedError: Invalid agent location: /home/hudson/genie.tcf/.jenkins/jobs/tcf-1.4/workspace/.agent/agent
	at junit.framework.Assert.fail(Assert.java:50)
	at junit.framework.Assert.assertTrue(Assert.java:20)
	at org.eclipse.tcf.te.tests.tcf.TcfTestCase.getAgentFile(TcfTestCase.java:240)
	at org.eclipse.tcf.te.tests.tcf.TcfTestCase.launchAgent(TcfTestCase.java:95)
	at org.eclipse.tcf.te.tests.tcf.TcfTestCase.setUp(TcfTestCase.java:61)
	at org.eclipse.tcf.debug.test.AbstractCMTest.setUp(AbstractCMTest.java:150)
	at junit.framework.TestCase.runBare(TestCase.java:132)
	at org.eclipse.tcf.te.tests.CoreTestCase.runBare(CoreTestCase.java:256)
	at junit.framework.TestResult$1.protect(TestResult.java:110)
	at junit.framework.TestResult.runProtected(TestResult.java:128)
	at junit.framework.TestResult.run(TestResult.java:113)
	at junit.framework.TestCase.run(TestCase.java:124)
	at org.eclipse.tcf.te.tests.CoreTestCase.run(CoreTestCase.java:233)
	at junit.framework.TestSuite.runTest(TestSuite.java:243)
	at junit.framework.TestSuite.run(TestSuite.java:238)
	at org.junit.internal.runners.JUnit38ClassRunner.run(JUnit38ClassRunner.java:83)
	at org.apache.maven.surefire.junit4.JUnit4Provider.execute(JUnit4Provider.java:264)
	at org.apache.maven.surefire.junit4.JUnit4Provider.executeTestSet(JUnit4Provider.java:153)
	at org.apache.maven.surefire.junit4.JUnit4Provider.invoke(JUnit4Provider.java:124)
	at sun.reflect.NativeMethodAccessorImpl.invoke0(Native Method)
	at sun.reflect.NativeMethodAccessorImpl.invoke(NativeMethodAccessorImpl.java:57)
	at sun.reflect.DelegatingMethodAccessorImpl.invoke(DelegatingMethodAccessorImpl.java:43)
	at java.lang.reflect.Method.invoke(Method.java:606)
	at org.apache.maven.surefire.util.ReflectionUtils.invokeMethodWithArray2(ReflectionUtils.java:208)
	at org.apache.maven.surefire.booter.ProviderFactory$ProviderProxy.invoke(ProviderFactory.java:156)
	at org.apache.maven.surefire.booter.ProviderFactory.invokeProvider(ProviderFactory.java:82)
	at org.eclipse.tycho.surefire.osgibooter.OsgiSurefireBooter.run(OsgiSurefireBooter.java:91)
	at org.eclipse.tycho.surefire.osgibooter.AbstractUITestApplication.runTests(AbstractUITestApplication.java:44)
	at org.eclipse.ui.internal.testing.WorkbenchTestable$1.run(WorkbenchTestable.java:71)
	at java.lang.Thread.run(Thread.java:745)

=== testStackTraceCMResetOnResumeSuspend started at: February 25, 2018 2:04:33 AM EST
=== testStackTraceCMResetOnResumeSuspend finished at: February 25, 2018 2:04:33 AM EST (duration: 1 ms)

!ENTRY org.eclipse.tcf.te.tests 4 1 2018-02-25 02:04:33.347
!MESSAGE Test case 'testStackTraceCMResetOnResumeSuspend(org.eclipse.tcf.debug.test.StackTraceCMTest)' failed. Failure: Invalid agent location: /home/hudson/genie.tcf/.jenkins/jobs/tcf-1.4/workspace/.agent/agent
!STACK 0
junit.framework.AssertionFailedError: Invalid agent location: /home/hudson/genie.tcf/.jenkins/jobs/tcf-1.4/workspace/.agent/agent
	at junit.framework.Assert.fail(Assert.java:50)
	at junit.framework.Assert.assertTrue(Assert.java:20)
	at org.eclipse.tcf.te.tests.tcf.TcfTestCase.getAgentFile(TcfTestCase.java:240)
	at org.eclipse.tcf.te.tests.tcf.TcfTestCase.launchAgent(TcfTestCase.java:95)
	at org.eclipse.tcf.te.tests.tcf.TcfTestCase.setUp(TcfTestCase.java:61)
	at org.eclipse.tcf.debug.test.AbstractCMTest.setUp(AbstractCMTest.java:150)
	at junit.framework.TestCase.runBare(TestCase.java:132)
	at org.eclipse.tcf.te.tests.CoreTestCase.runBare(CoreTestCase.java:256)
	at junit.framework.TestResult$1.protect(TestResult.java:110)
	at junit.framework.TestResult.runProtected(TestResult.java:128)
	at junit.framework.TestResult.run(TestResult.java:113)
	at junit.framework.TestCase.run(TestCase.java:124)
	at org.eclipse.tcf.te.tests.CoreTestCase.run(CoreTestCase.java:233)
	at junit.framework.TestSuite.runTest(TestSuite.java:243)
	at junit.framework.TestSuite.run(TestSuite.java:238)
	at org.junit.internal.runners.JUnit38ClassRunner.run(JUnit38ClassRunner.java:83)
	at org.apache.maven.surefire.junit4.JUnit4Provider.execute(JUnit4Provider.java:264)
	at org.apache.maven.surefire.junit4.JUnit4Provider.executeTestSet(JUnit4Provider.java:153)
	at org.apache.maven.surefire.junit4.JUnit4Provider.invoke(JUnit4Provider.java:124)
	at sun.reflect.NativeMethodAccessorImpl.invoke0(Native Method)
	at sun.reflect.NativeMethodAccessorImpl.invoke(NativeMethodAccessorImpl.java:57)
	at sun.reflect.DelegatingMethodAccessorImpl.invoke(DelegatingMethodAccessorImpl.java:43)
	at java.lang.reflect.Method.invoke(Method.java:606)
	at org.apache.maven.surefire.util.ReflectionUtils.invokeMethodWithArray2(ReflectionUtils.java:208)
	at org.apache.maven.surefire.booter.ProviderFactory$ProviderProxy.invoke(ProviderFactory.java:156)
	at org.apache.maven.surefire.booter.ProviderFactory.invokeProvider(ProviderFactory.java:82)
	at org.eclipse.tycho.surefire.osgibooter.OsgiSurefireBooter.run(OsgiSurefireBooter.java:91)
	at org.eclipse.tycho.surefire.osgibooter.AbstractUITestApplication.runTests(AbstractUITestApplication.java:44)
	at org.eclipse.ui.internal.testing.WorkbenchTestable$1.run(WorkbenchTestable.java:71)
	at java.lang.Thread.run(Thread.java:745)
Tests run: 4, Failures: 4, Errors: 0, Skipped: 0, Time elapsed: 0.012 sec <<< FAILURE! - in org.eclipse.tcf.debug.test.StackTraceCMTest
testStackTraceCMResetOnContextChange(org.eclipse.tcf.debug.test.StackTraceCMTest)  Time elapsed: 0.002 sec  <<< FAILURE!
junit.framework.AssertionFailedError: Invalid agent location: /home/hudson/genie.tcf/.jenkins/jobs/tcf-1.4/workspace/.agent/agent
	at junit.framework.Assert.fail(Assert.java:50)
	at junit.framework.Assert.assertTrue(Assert.java:20)
	at org.eclipse.tcf.te.tests.tcf.TcfTestCase.getAgentFile(TcfTestCase.java:240)
	at org.eclipse.tcf.te.tests.tcf.TcfTestCase.launchAgent(TcfTestCase.java:95)
	at org.eclipse.tcf.te.tests.tcf.TcfTestCase.setUp(TcfTestCase.java:61)
	at org.eclipse.tcf.debug.test.AbstractCMTest.setUp(AbstractCMTest.java:150)
	at junit.framework.TestCase.runBare(TestCase.java:132)
	at org.eclipse.tcf.te.tests.CoreTestCase.runBare(CoreTestCase.java:256)
	at junit.framework.TestResult$1.protect(TestResult.java:110)
	at junit.framework.TestResult.runProtected(TestResult.java:128)
	at junit.framework.TestResult.run(TestResult.java:113)
	at junit.framework.TestCase.run(TestCase.java:124)
	at org.eclipse.tcf.te.tests.CoreTestCase.run(CoreTestCase.java:233)
	at junit.framework.TestSuite.runTest(TestSuite.java:243)
	at junit.framework.TestSuite.run(TestSuite.java:238)
	at org.junit.internal.runners.JUnit38ClassRunner.run(JUnit38ClassRunner.java:83)
	at org.apache.maven.surefire.junit4.JUnit4Provider.execute(JUnit4Provider.java:264)
	at org.apache.maven.surefire.junit4.JUnit4Provider.executeTestSet(JUnit4Provider.java:153)
	at org.apache.maven.surefire.junit4.JUnit4Provider.invoke(JUnit4Provider.java:124)
	at sun.reflect.NativeMethodAccessorImpl.invoke0(Native Method)
	at sun.reflect.NativeMethodAccessorImpl.invoke(NativeMethodAccessorImpl.java:57)
	at sun.reflect.DelegatingMethodAccessorImpl.invoke(DelegatingMethodAccessorImpl.java:43)
	at java.lang.reflect.Method.invoke(Method.java:606)
	at org.apache.maven.surefire.util.ReflectionUtils.invokeMethodWithArray2(ReflectionUtils.java:208)
	at org.apache.maven.surefire.booter.ProviderFactory$ProviderProxy.invoke(ProviderFactory.java:156)
	at org.apache.maven.surefire.booter.ProviderFactory.invokeProvider(ProviderFactory.java:82)
	at org.eclipse.tycho.surefire.osgibooter.OsgiSurefireBooter.run(OsgiSurefireBooter.java:91)
	at org.eclipse.tycho.surefire.osgibooter.AbstractUITestApplication.runTests(AbstractUITestApplication.java:44)
	at org.eclipse.ui.internal.testing.WorkbenchTestable$1.run(WorkbenchTestable.java:71)
	at java.lang.Thread.run(Thread.java:745)

testStackTraceCMResetOnMemoryChange(org.eclipse.tcf.debug.test.StackTraceCMTest)  Time elapsed: 0.002 sec  <<< FAILURE!
junit.framework.AssertionFailedError: Invalid agent location: /home/hudson/genie.tcf/.jenkins/jobs/tcf-1.4/workspace/.agent/agent
	at junit.framework.Assert.fail(Assert.java:50)
	at junit.framework.Assert.assertTrue(Assert.java:20)
	at org.eclipse.tcf.te.tests.tcf.TcfTestCase.getAgentFile(TcfTestCase.java:240)
	at org.eclipse.tcf.te.tests.tcf.TcfTestCase.launchAgent(TcfTestCase.java:95)
	at org.eclipse.tcf.te.tests.tcf.TcfTestCase.setUp(TcfTestCase.java:61)
	at org.eclipse.tcf.debug.test.AbstractCMTest.setUp(AbstractCMTest.java:150)
	at junit.framework.TestCase.runBare(TestCase.java:132)
	at org.eclipse.tcf.te.tests.CoreTestCase.runBare(CoreTestCase.java:256)
	at junit.framework.TestResult$1.protect(TestResult.java:110)
	at junit.framework.TestResult.runProtected(TestResult.java:128)
	at junit.framework.TestResult.run(TestResult.java:113)
	at junit.framework.TestCase.run(TestCase.java:124)
	at org.eclipse.tcf.te.tests.CoreTestCase.run(CoreTestCase.java:233)
	at junit.framework.TestSuite.runTest(TestSuite.java:243)
	at junit.framework.TestSuite.run(TestSuite.java:238)
	at org.junit.internal.runners.JUnit38ClassRunner.run(JUnit38ClassRunner.java:83)
	at org.apache.maven.surefire.junit4.JUnit4Provider.execute(JUnit4Provider.java:264)
	at org.apache.maven.surefire.junit4.JUnit4Provider.executeTestSet(JUnit4Provider.java:153)
	at org.apache.maven.surefire.junit4.JUnit4Provider.invoke(JUnit4Provider.java:124)
	at sun.reflect.NativeMethodAccessorImpl.invoke0(Native Method)
	at sun.reflect.NativeMethodAccessorImpl.invoke(NativeMethodAccessorImpl.java:57)
	at sun.reflect.DelegatingMethodAccessorImpl.invoke(DelegatingMethodAccessorImpl.java:43)
	at java.lang.reflect.Method.invoke(Method.java:606)
	at org.apache.maven.surefire.util.ReflectionUtils.invokeMethodWithArray2(ReflectionUtils.java:208)
	at org.apache.maven.surefire.booter.ProviderFactory$ProviderProxy.invoke(ProviderFactory.java:156)
	at org.apache.maven.surefire.booter.ProviderFactory.invokeProvider(ProviderFactory.java:82)
	at org.eclipse.tycho.surefire.osgibooter.OsgiSurefireBooter.run(OsgiSurefireBooter.java:91)
	at org.eclipse.tycho.surefire.osgibooter.AbstractUITestApplication.runTests(AbstractUITestApplication.java:44)
	at org.eclipse.ui.internal.testing.WorkbenchTestable$1.run(WorkbenchTestable.java:71)
	at java.lang.Thread.run(Thread.java:745)

testStackTraceCMResetOnMemoryMapChange(org.eclipse.tcf.debug.test.StackTraceCMTest)  Time elapsed: 0.002 sec  <<< FAILURE!
junit.framework.AssertionFailedError: Invalid agent location: /home/hudson/genie.tcf/.jenkins/jobs/tcf-1.4/workspace/.agent/agent
	at junit.framework.Assert.fail(Assert.java:50)
	at junit.framework.Assert.assertTrue(Assert.java:20)
	at org.eclipse.tcf.te.tests.tcf.TcfTestCase.getAgentFile(TcfTestCase.java:240)
	at org.eclipse.tcf.te.tests.tcf.TcfTestCase.launchAgent(TcfTestCase.java:95)
	at org.eclipse.tcf.te.tests.tcf.TcfTestCase.setUp(TcfTestCase.java:61)
	at org.eclipse.tcf.debug.test.AbstractCMTest.setUp(AbstractCMTest.java:150)
	at junit.framework.TestCase.runBare(TestCase.java:132)
	at org.eclipse.tcf.te.tests.CoreTestCase.runBare(CoreTestCase.java:256)
	at junit.framework.TestResult$1.protect(TestResult.java:110)
	at junit.framework.TestResult.runProtected(TestResult.java:128)
	at junit.framework.TestResult.run(TestResult.java:113)
	at junit.framework.TestCase.run(TestCase.java:124)
	at org.eclipse.tcf.te.tests.CoreTestCase.run(CoreTestCase.java:233)
	at junit.framework.TestSuite.runTest(TestSuite.java:243)
	at junit.framework.TestSuite.run(TestSuite.java:238)
	at org.junit.internal.runners.JUnit38ClassRunner.run(JUnit38ClassRunner.java:83)
	at org.apache.maven.surefire.junit4.JUnit4Provider.execute(JUnit4Provider.java:264)
	at org.apache.maven.surefire.junit4.JUnit4Provider.executeTestSet(JUnit4Provider.java:153)
	at org.apache.maven.surefire.junit4.JUnit4Provider.invoke(JUnit4Provider.java:124)
	at sun.reflect.NativeMethodAccessorImpl.invoke0(Native Method)
	at sun.reflect.NativeMethodAccessorImpl.invoke(NativeMethodAccessorImpl.java:57)
	at sun.reflect.DelegatingMethodAccessorImpl.invoke(DelegatingMethodAccessorImpl.java:43)
	at java.lang.reflect.Method.invoke(Method.java:606)
	at org.apache.maven.surefire.util.ReflectionUtils.invokeMethodWithArray2(ReflectionUtils.java:208)
	at org.apache.maven.surefire.booter.ProviderFactory$ProviderProxy.invoke(ProviderFactory.java:156)
	at org.apache.maven.surefire.booter.ProviderFactory.invokeProvider(ProviderFactory.java:82)
	at org.eclipse.tycho.surefire.osgibooter.OsgiSurefireBooter.run(OsgiSurefireBooter.java:91)
	at org.eclipse.tycho.surefire.osgibooter.AbstractUITestApplication.runTests(AbstractUITestApplication.java:44)
	at org.eclipse.ui.internal.testing.WorkbenchTestable$1.run(WorkbenchTestable.java:71)
	at java.lang.Thread.run(Thread.java:745)

testStackTraceCMResetOnResumeSuspend(org.eclipse.tcf.debug.test.StackTraceCMTest)  Time elapsed: 0.001 sec  <<< FAILURE!
junit.framework.AssertionFailedError: Invalid agent location: /home/hudson/genie.tcf/.jenkins/jobs/tcf-1.4/workspace/.agent/agent
	at junit.framework.Assert.fail(Assert.java:50)
	at junit.framework.Assert.assertTrue(Assert.java:20)
	at org.eclipse.tcf.te.tests.tcf.TcfTestCase.getAgentFile(TcfTestCase.java:240)
	at org.eclipse.tcf.te.tests.tcf.TcfTestCase.launchAgent(TcfTestCase.java:95)
	at org.eclipse.tcf.te.tests.tcf.TcfTestCase.setUp(TcfTestCase.java:61)
	at org.eclipse.tcf.debug.test.AbstractCMTest.setUp(AbstractCMTest.java:150)
	at junit.framework.TestCase.runBare(TestCase.java:132)
	at org.eclipse.tcf.te.tests.CoreTestCase.runBare(CoreTestCase.java:256)
	at junit.framework.TestResult$1.protect(TestResult.java:110)
	at junit.framework.TestResult.runProtected(TestResult.java:128)
	at junit.framework.TestResult.run(TestResult.java:113)
	at junit.framework.TestCase.run(TestCase.java:124)
	at org.eclipse.tcf.te.tests.CoreTestCase.run(CoreTestCase.java:233)
	at junit.framework.TestSuite.runTest(TestSuite.java:243)
	at junit.framework.TestSuite.run(TestSuite.java:238)
	at org.junit.internal.runners.JUnit38ClassRunner.run(JUnit38ClassRunner.java:83)
	at org.apache.maven.surefire.junit4.JUnit4Provider.execute(JUnit4Provider.java:264)
	at org.apache.maven.surefire.junit4.JUnit4Provider.executeTestSet(JUnit4Provider.java:153)
	at org.apache.maven.surefire.junit4.JUnit4Provider.invoke(JUnit4Provider.java:124)
	at sun.reflect.NativeMethodAccessorImpl.invoke0(Native Method)
	at sun.reflect.NativeMethodAccessorImpl.invoke(NativeMethodAccessorImpl.java:57)
	at sun.reflect.DelegatingMethodAccessorImpl.invoke(DelegatingMethodAccessorImpl.java:43)
	at java.lang.reflect.Method.invoke(Method.java:606)
	at org.apache.maven.surefire.util.ReflectionUtils.invokeMethodWithArray2(ReflectionUtils.java:208)
	at org.apache.maven.surefire.booter.ProviderFactory$ProviderProxy.invoke(ProviderFactory.java:156)
	at org.apache.maven.surefire.booter.ProviderFactory.invokeProvider(ProviderFactory.java:82)
	at org.eclipse.tycho.surefire.osgibooter.OsgiSurefireBooter.run(OsgiSurefireBooter.java:91)
	at org.eclipse.tycho.surefire.osgibooter.AbstractUITestApplication.runTests(AbstractUITestApplication.java:44)
	at org.eclipse.ui.internal.testing.WorkbenchTestable$1.run(WorkbenchTestable.java:71)
	at java.lang.Thread.run(Thread.java:745)

Running org.eclipse.tcf.debug.test.CacheTests
Tests run: 17, Failures: 0, Errors: 0, Skipped: 0, Time elapsed: 0.223 sec - in org.eclipse.tcf.debug.test.CacheTests
testGetWithCompletionDelay(org.eclipse.tcf.debug.test.CacheTests)  Time elapsed: 0.103 sec
testGetWithTwoClients(org.eclipse.tcf.debug.test.CacheTests)  Time elapsed: 0.002 sec
testGetWithManyClients(org.eclipse.tcf.debug.test.CacheTests)  Time elapsed: 0.001 sec
testDisableBeforeRequest(org.eclipse.tcf.debug.test.CacheTests)  Time elapsed: 0.102 sec
testDisableWhilePending(org.eclipse.tcf.debug.test.CacheTests)  Time elapsed: 0.001 sec
testDisableWhileValid(org.eclipse.tcf.debug.test.CacheTests)  Time elapsed: 0 sec
testSetWithValue(org.eclipse.tcf.debug.test.CacheTests)  Time elapsed: 0 sec
testCancelWhilePending(org.eclipse.tcf.debug.test.CacheTests)  Time elapsed: 0.001 sec
testCancelWhilePending2(org.eclipse.tcf.debug.test.CacheTests)  Time elapsed: 0.001 sec
testCancelWhilePending3(org.eclipse.tcf.debug.test.CacheTests)  Time elapsed: 0.001 sec
testCancelWhilePendingWithoutClientNotification(org.eclipse.tcf.debug.test.CacheTests)  Time elapsed: 0.001 sec
testCancelAfterCompletedRaceCondition(org.eclipse.tcf.debug.test.CacheTests)  Time elapsed: 0.002 sec
testGet(org.eclipse.tcf.debug.test.CacheTests)  Time elapsed: 0 sec
testCancelWhilePendingWithTwoClients(org.eclipse.tcf.debug.test.CacheTests)  Time elapsed: 0.001 sec
testCancelWhilePendingWithManyClients(org.eclipse.tcf.debug.test.CacheTests)  Time elapsed: 0.002 sec
testResetWhileValid(org.eclipse.tcf.debug.test.CacheTests)  Time elapsed: 0.001 sec
testSetAndReset(org.eclipse.tcf.debug.test.CacheTests)  Time elapsed: 0 sec
Running org.eclipse.tcf.debug.test.RangeCacheTests
Tests run: 11, Failures: 0, Errors: 0, Skipped: 0, Time elapsed: 3.539 sec - in org.eclipse.tcf.debug.test.RangeCacheTests
testGetOneRangeTest(org.eclipse.tcf.debug.test.RangeCacheTests)  Time elapsed: 0.102 sec
testGetMultipleRangesTest(org.eclipse.tcf.debug.test.RangeCacheTests)  Time elapsed: 0.705 sec
testGetIncompleteRangeTest(org.eclipse.tcf.debug.test.RangeCacheTests)  Time elapsed: 0.101 sec
testCancelOneRangeTest(org.eclipse.tcf.debug.test.RangeCacheTests)  Time elapsed: 0.101 sec
testCancelMultipleRangesTest(org.eclipse.tcf.debug.test.RangeCacheTests)  Time elapsed: 0.302 sec
testGetAndCancelMultipleRangesTest(org.eclipse.tcf.debug.test.RangeCacheTests)  Time elapsed: 0.303 sec
testResetOneRangeTest(org.eclipse.tcf.debug.test.RangeCacheTests)  Time elapsed: 0.202 sec
testResetMultipleRangesTest(org.eclipse.tcf.debug.test.RangeCacheTests)  Time elapsed: 1.415 sec
testResetWhileInvalidTest(org.eclipse.tcf.debug.test.RangeCacheTests)  Time elapsed: 0.101 sec
testSetRangeErrorTest(org.eclipse.tcf.debug.test.RangeCacheTests)  Time elapsed: 0.102 sec
testGetOneRangeUsingDifferentRangeInstanceTest(org.eclipse.tcf.debug.test.RangeCacheTests)  Time elapsed: 0.102 sec
Running org.eclipse.tcf.debug.test.QueryTests
Tests run: 7, Failures: 0, Errors: 0, Skipped: 0, Time elapsed: 0.012 sec - in org.eclipse.tcf.debug.test.QueryTests
testGetWithMultipleDispatches(org.eclipse.tcf.debug.test.QueryTests)  Time elapsed: 0.001 sec
testExceptionOnGet(org.eclipse.tcf.debug.test.QueryTests)  Time elapsed: 0 sec
testCancelBeforeWaiting(org.eclipse.tcf.debug.test.QueryTests)  Time elapsed: 0 sec
testCancelWhileWaiting(org.eclipse.tcf.debug.test.QueryTests)  Time elapsed: 0.001 sec
testSimpleGet(org.eclipse.tcf.debug.test.QueryTests)  Time elapsed: 0.001 sec
testGetError(org.eclipse.tcf.debug.test.QueryTests)  Time elapsed: 0.001 sec
testGetTimeout(org.eclipse.tcf.debug.test.QueryTests)  Time elapsed: 0.003 sec
Running org.eclipse.tcf.debug.test.BreakpointsViewTest

=== testScopeGrouping started at: February 25, 2018 2:04:37 AM EST
=== testScopeGrouping finished at: February 25, 2018 2:04:37 AM EST (duration: 2 ms)

!ENTRY org.eclipse.tcf.te.tests 4 1 2018-02-25 02:04:37.290
!MESSAGE Test case 'testScopeGrouping(org.eclipse.tcf.debug.test.BreakpointsViewTest)' failed. Failure: Invalid agent location: /home/hudson/genie.tcf/.jenkins/jobs/tcf-1.4/workspace/.agent/agent
!STACK 0
junit.framework.AssertionFailedError: Invalid agent location: /home/hudson/genie.tcf/.jenkins/jobs/tcf-1.4/workspace/.agent/agent
	at junit.framework.Assert.fail(Assert.java:50)
	at junit.framework.Assert.assertTrue(Assert.java:20)
	at org.eclipse.tcf.te.tests.tcf.TcfTestCase.getAgentFile(TcfTestCase.java:240)
	at org.eclipse.tcf.te.tests.tcf.TcfTestCase.launchAgent(TcfTestCase.java:95)
	at org.eclipse.tcf.te.tests.tcf.TcfTestCase.setUp(TcfTestCase.java:61)
	at org.eclipse.tcf.debug.test.AbstractCMTest.setUp(AbstractCMTest.java:150)
	at org.eclipse.tcf.debug.test.AbstractTcfUITest.setUp(AbstractTcfUITest.java:86)
	at org.eclipse.tcf.debug.test.BreakpointsViewTest.setUp(BreakpointsViewTest.java:47)
	at junit.framework.TestCase.runBare(TestCase.java:132)
	at org.eclipse.tcf.te.tests.CoreTestCase.runBare(CoreTestCase.java:256)
	at junit.framework.TestResult$1.protect(TestResult.java:110)
	at junit.framework.TestResult.runProtected(TestResult.java:128)
	at junit.framework.TestResult.run(TestResult.java:113)
	at junit.framework.TestCase.run(TestCase.java:124)
	at org.eclipse.tcf.te.tests.CoreTestCase.run(CoreTestCase.java:233)
	at junit.framework.TestSuite.runTest(TestSuite.java:243)
	at junit.framework.TestSuite.run(TestSuite.java:238)
	at org.junit.internal.runners.JUnit38ClassRunner.run(JUnit38ClassRunner.java:83)
	at org.apache.maven.surefire.junit4.JUnit4Provider.execute(JUnit4Provider.java:264)
	at org.apache.maven.surefire.junit4.JUnit4Provider.executeTestSet(JUnit4Provider.java:153)
	at org.apache.maven.surefire.junit4.JUnit4Provider.invoke(JUnit4Provider.java:124)
	at sun.reflect.NativeMethodAccessorImpl.invoke0(Native Method)
	at sun.reflect.NativeMethodAccessorImpl.invoke(NativeMethodAccessorImpl.java:57)
	at sun.reflect.DelegatingMethodAccessorImpl.invoke(DelegatingMethodAccessorImpl.java:43)
	at java.lang.reflect.Method.invoke(Method.java:606)
	at org.apache.maven.surefire.util.ReflectionUtils.invokeMethodWithArray2(ReflectionUtils.java:208)
	at org.apache.maven.surefire.booter.ProviderFactory$ProviderProxy.invoke(ProviderFactory.java:156)
	at org.apache.maven.surefire.booter.ProviderFactory.invokeProvider(ProviderFactory.java:82)
	at org.eclipse.tycho.surefire.osgibooter.OsgiSurefireBooter.run(OsgiSurefireBooter.java:91)
	at org.eclipse.tycho.surefire.osgibooter.AbstractUITestApplication.runTests(AbstractUITestApplication.java:44)
	at org.eclipse.ui.internal.testing.WorkbenchTestable$1.run(WorkbenchTestable.java:71)
	at java.lang.Thread.run(Thread.java:745)
Tests run: 1, Failures: 1, Errors: 0, Skipped: 0, Time elapsed: 0.146 sec <<< FAILURE! - in org.eclipse.tcf.debug.test.BreakpointsViewTest
testScopeGrouping(org.eclipse.tcf.debug.test.BreakpointsViewTest)  Time elapsed: 0.002 sec  <<< FAILURE!
junit.framework.AssertionFailedError: Invalid agent location: /home/hudson/genie.tcf/.jenkins/jobs/tcf-1.4/workspace/.agent/agent
	at junit.framework.Assert.fail(Assert.java:50)
	at junit.framework.Assert.assertTrue(Assert.java:20)
	at org.eclipse.tcf.te.tests.tcf.TcfTestCase.getAgentFile(TcfTestCase.java:240)
	at org.eclipse.tcf.te.tests.tcf.TcfTestCase.launchAgent(TcfTestCase.java:95)
	at org.eclipse.tcf.te.tests.tcf.TcfTestCase.setUp(TcfTestCase.java:61)
	at org.eclipse.tcf.debug.test.AbstractCMTest.setUp(AbstractCMTest.java:150)
	at org.eclipse.tcf.debug.test.AbstractTcfUITest.setUp(AbstractTcfUITest.java:86)
	at org.eclipse.tcf.debug.test.BreakpointsViewTest.setUp(BreakpointsViewTest.java:47)

Running org.eclipse.tcf.debug.test.SampleTest

=== testDebugViewContent started at: February 25, 2018 2:04:37 AM EST
=== testDebugViewContent finished at: February 25, 2018 2:04:37 AM EST (duration: 1 ms)

!ENTRY org.eclipse.tcf.te.tests 4 1 2018-02-25 02:04:37.295
!MESSAGE Test case 'testDebugViewContent(org.eclipse.tcf.debug.test.SampleTest)' failed. Failure: Invalid agent location: /home/hudson/genie.tcf/.jenkins/jobs/tcf-1.4/workspace/.agent/agent
!STACK 0
junit.framework.AssertionFailedError: Invalid agent location: /home/hudson/genie.tcf/.jenkins/jobs/tcf-1.4/workspace/.agent/agent
	at junit.framework.Assert.fail(Assert.java:50)
	at junit.framework.Assert.assertTrue(Assert.java:20)
	at org.eclipse.tcf.te.tests.tcf.TcfTestCase.getAgentFile(TcfTestCase.java:240)
	at org.eclipse.tcf.te.tests.tcf.TcfTestCase.launchAgent(TcfTestCase.java:95)
	at org.eclipse.tcf.te.tests.tcf.TcfTestCase.setUp(TcfTestCase.java:61)
	at org.eclipse.tcf.debug.test.AbstractCMTest.setUp(AbstractCMTest.java:150)
	at org.eclipse.tcf.debug.test.AbstractTcfUITest.setUp(AbstractTcfUITest.java:86)
	at junit.framework.TestCase.runBare(TestCase.java:132)
	at org.eclipse.tcf.te.tests.CoreTestCase.runBare(CoreTestCase.java:256)
	at junit.framework.TestResult$1.protect(TestResult.java:110)
	at junit.framework.TestResult.runProtected(TestResult.java:128)
	at junit.framework.TestResult.run(TestResult.java:113)
	at junit.framework.TestCase.run(TestCase.java:124)
	at org.eclipse.tcf.te.tests.CoreTestCase.run(CoreTestCase.java:233)
	at junit.framework.TestSuite.runTest(TestSuite.java:243)
	at junit.framework.TestSuite.run(TestSuite.java:238)
	at org.junit.internal.runners.JUnit38ClassRunner.run(JUnit38ClassRunner.java:83)
	at org.apache.maven.surefire.junit4.JUnit4Provider.execute(JUnit4Provider.java:264)
	at org.apache.maven.surefire.junit4.JUnit4Provider.executeTestSet(JUnit4Provider.java:153)
	at org.apache.maven.surefire.junit4.JUnit4Provider.invoke(JUnit4Provider.java:124)
	at sun.reflect.NativeMethodAccessorImpl.invoke0(Native Method)
	at sun.reflect.NativeMethodAccessorImpl.invoke(NativeMethodAccessorImpl.java:57)
	at sun.reflect.DelegatingMethodAccessorImpl.invoke(DelegatingMethodAccessorImpl.java:43)
	at java.lang.reflect.Method.invoke(Method.java:606)
	at org.apache.maven.surefire.util.ReflectionUtils.invokeMethodWithArray2(ReflectionUtils.java:208)
	at org.apache.maven.surefire.booter.ProviderFactory$ProviderProxy.invoke(ProviderFactory.java:156)
	at org.apache.maven.surefire.booter.ProviderFactory.invokeProvider(ProviderFactory.java:82)
	at org.eclipse.tycho.surefire.osgibooter.OsgiSurefireBooter.run(OsgiSurefireBooter.java:91)
	at org.eclipse.tycho.surefire.osgibooter.AbstractUITestApplication.runTests(AbstractUITestApplication.java:44)
	at org.eclipse.ui.internal.testing.WorkbenchTestable$1.run(WorkbenchTestable.java:71)
	at java.lang.Thread.run(Thread.java:745)

=== testSteppingDebugViewOnly started at: February 25, 2018 2:04:37 AM EST
=== testSteppingDebugViewOnly finished at: February 25, 2018 2:04:37 AM EST (duration: 2 ms)

!ENTRY org.eclipse.tcf.te.tests 4 1 2018-02-25 02:04:37.298
!MESSAGE Test case 'testSteppingDebugViewOnly(org.eclipse.tcf.debug.test.SampleTest)' failed. Failure: Invalid agent location: /home/hudson/genie.tcf/.jenkins/jobs/tcf-1.4/workspace/.agent/agent
!STACK 0
junit.framework.AssertionFailedError: Invalid agent location: /home/hudson/genie.tcf/.jenkins/jobs/tcf-1.4/workspace/.agent/agent
	at junit.framework.Assert.fail(Assert.java:50)
	at junit.framework.Assert.assertTrue(Assert.java:20)
	at org.eclipse.tcf.te.tests.tcf.TcfTestCase.getAgentFile(TcfTestCase.java:240)
	at org.eclipse.tcf.te.tests.tcf.TcfTestCase.launchAgent(TcfTestCase.java:95)
	at org.eclipse.tcf.te.tests.tcf.TcfTestCase.setUp(TcfTestCase.java:61)
	at org.eclipse.tcf.debug.test.AbstractCMTest.setUp(AbstractCMTest.java:150)
	at org.eclipse.tcf.debug.test.AbstractTcfUITest.setUp(AbstractTcfUITest.java:86)
	at junit.framework.TestCase.runBare(TestCase.java:132)
	at org.eclipse.tcf.te.tests.CoreTestCase.runBare(CoreTestCase.java:256)
	at junit.framework.TestResult$1.protect(TestResult.java:110)
	at junit.framework.TestResult.runProtected(TestResult.java:128)
	at junit.framework.TestResult.run(TestResult.java:113)
	at junit.framework.TestCase.run(TestCase.java:124)
	at org.eclipse.tcf.te.tests.CoreTestCase.run(CoreTestCase.java:233)
	at junit.framework.TestSuite.runTest(TestSuite.java:243)
	at junit.framework.TestSuite.run(TestSuite.java:238)
	at org.junit.internal.runners.JUnit38ClassRunner.run(JUnit38ClassRunner.java:83)
	at org.apache.maven.surefire.junit4.JUnit4Provider.execute(JUnit4Provider.java:264)
	at org.apache.maven.surefire.junit4.JUnit4Provider.executeTestSet(JUnit4Provider.java:153)
	at org.apache.maven.surefire.junit4.JUnit4Provider.invoke(JUnit4Provider.java:124)
	at sun.reflect.NativeMethodAccessorImpl.invoke0(Native Method)
	at sun.reflect.NativeMethodAccessorImpl.invoke(NativeMethodAccessorImpl.java:57)
	at sun.reflect.DelegatingMethodAccessorImpl.invoke(DelegatingMethodAccessorImpl.java:43)
	at java.lang.reflect.Method.invoke(Method.java:606)
	at org.apache.maven.surefire.util.ReflectionUtils.invokeMethodWithArray2(ReflectionUtils.java:208)
	at org.apache.maven.surefire.booter.ProviderFactory$ProviderProxy.invoke(ProviderFactory.java:156)
	at org.apache.maven.surefire.booter.ProviderFactory.invokeProvider(ProviderFactory.java:82)
	at org.eclipse.tycho.surefire.osgibooter.OsgiSurefireBooter.run(OsgiSurefireBooter.java:91)
	at org.eclipse.tycho.surefire.osgibooter.AbstractUITestApplication.runTests(AbstractUITestApplication.java:44)
	at org.eclipse.ui.internal.testing.WorkbenchTestable$1.run(WorkbenchTestable.java:71)
	at java.lang.Thread.run(Thread.java:745)

=== testSteppingWithVariablesAndRegisters started at: February 25, 2018 2:04:37 AM EST
=== testSteppingWithVariablesAndRegisters finished at: February 25, 2018 2:04:37 AM EST (duration: 1 ms)

!ENTRY org.eclipse.tcf.te.tests 4 1 2018-02-25 02:04:37.299
!MESSAGE Test case 'testSteppingWithVariablesAndRegisters(org.eclipse.tcf.debug.test.SampleTest)' failed. Failure: Invalid agent location: /home/hudson/genie.tcf/.jenkins/jobs/tcf-1.4/workspace/.agent/agent
!STACK 0
junit.framework.AssertionFailedError: Invalid agent location: /home/hudson/genie.tcf/.jenkins/jobs/tcf-1.4/workspace/.agent/agent
	at junit.framework.Assert.fail(Assert.java:50)
	at junit.framework.Assert.assertTrue(Assert.java:20)
	at org.eclipse.tcf.te.tests.tcf.TcfTestCase.getAgentFile(TcfTestCase.java:240)
	at org.eclipse.tcf.te.tests.tcf.TcfTestCase.launchAgent(TcfTestCase.java:95)
	at org.eclipse.tcf.te.tests.tcf.TcfTestCase.setUp(TcfTestCase.java:61)
	at org.eclipse.tcf.debug.test.AbstractCMTest.setUp(AbstractCMTest.java:150)
	at org.eclipse.tcf.debug.test.AbstractTcfUITest.setUp(AbstractTcfUITest.java:86)
	at junit.framework.TestCase.runBare(TestCase.java:132)
	at org.eclipse.tcf.te.tests.CoreTestCase.runBare(CoreTestCase.java:256)
	at junit.framework.TestResult$1.protect(TestResult.java:110)
	at junit.framework.TestResult.runProtected(TestResult.java:128)
	at junit.framework.TestResult.run(TestResult.java:113)
	at junit.framework.TestCase.run(TestCase.java:124)
	at org.eclipse.tcf.te.tests.CoreTestCase.run(CoreTestCase.java:233)
	at junit.framework.TestSuite.runTest(TestSuite.java:243)
	at junit.framework.TestSuite.run(TestSuite.java:238)
	at org.junit.internal.runners.JUnit38ClassRunner.run(JUnit38ClassRunner.java:83)
	at org.apache.maven.surefire.junit4.JUnit4Provider.execute(JUnit4Provider.java:264)
	at org.apache.maven.surefire.junit4.JUnit4Provider.executeTestSet(JUnit4Provider.java:153)
	at org.apache.maven.surefire.junit4.JUnit4Provider.invoke(JUnit4Provider.java:124)
	at sun.reflect.NativeMethodAccessorImpl.invoke0(Native Method)
	at sun.reflect.NativeMethodAccessorImpl.invoke(NativeMethodAccessorImpl.java:57)
	at sun.reflect.DelegatingMethodAccessorImpl.invoke(DelegatingMethodAccessorImpl.java:43)
	at java.lang.reflect.Method.invoke(Method.java:606)
	at org.apache.maven.surefire.util.ReflectionUtils.invokeMethodWithArray2(ReflectionUtils.java:208)
	at org.apache.maven.surefire.booter.ProviderFactory$ProviderProxy.invoke(ProviderFactory.java:156)
	at org.apache.maven.surefire.booter.ProviderFactory.invokeProvider(ProviderFactory.java:82)
	at org.eclipse.tycho.surefire.osgibooter.OsgiSurefireBooter.run(OsgiSurefireBooter.java:91)
	at org.eclipse.tycho.surefire.osgibooter.AbstractUITestApplication.runTests(AbstractUITestApplication.java:44)
	at org.eclipse.ui.internal.testing.WorkbenchTestable$1.run(WorkbenchTestable.java:71)
	at java.lang.Thread.run(Thread.java:745)

=== testSteppingPerformanceWithSourceDisplay started at: February 25, 2018 2:04:37 AM EST
=== testSteppingPerformanceWithSourceDisplay finished at: February 25, 2018 2:04:37 AM EST (duration: 1 ms)

!ENTRY org.eclipse.tcf.te.tests 4 1 2018-02-25 02:04:37.301
!MESSAGE Test case 'testSteppingPerformanceWithSourceDisplay(org.eclipse.tcf.debug.test.SampleTest)' failed. Failure: Invalid agent location: /home/hudson/genie.tcf/.jenkins/jobs/tcf-1.4/workspace/.agent/agent
!STACK 0
junit.framework.AssertionFailedError: Invalid agent location: /home/hudson/genie.tcf/.jenkins/jobs/tcf-1.4/workspace/.agent/agent
	at junit.framework.Assert.fail(Assert.java:50)
	at junit.framework.Assert.assertTrue(Assert.java:20)
	at org.eclipse.tcf.te.tests.tcf.TcfTestCase.getAgentFile(TcfTestCase.java:240)
	at org.eclipse.tcf.te.tests.tcf.TcfTestCase.launchAgent(TcfTestCase.java:95)
	at org.eclipse.tcf.te.tests.tcf.TcfTestCase.setUp(TcfTestCase.java:61)
	at org.eclipse.tcf.debug.test.AbstractCMTest.setUp(AbstractCMTest.java:150)
	at org.eclipse.tcf.debug.test.AbstractTcfUITest.setUp(AbstractTcfUITest.java:86)
	at junit.framework.TestCase.runBare(TestCase.java:132)
	at org.eclipse.tcf.te.tests.CoreTestCase.runBare(CoreTestCase.java:256)
	at junit.framework.TestResult$1.protect(TestResult.java:110)
	at junit.framework.TestResult.runProtected(TestResult.java:128)
	at junit.framework.TestResult.run(TestResult.java:113)
	at junit.framework.TestCase.run(TestCase.java:124)
	at org.eclipse.tcf.te.tests.CoreTestCase.run(CoreTestCase.java:233)
	at junit.framework.TestSuite.runTest(TestSuite.java:243)
	at junit.framework.TestSuite.run(TestSuite.java:238)
	at org.junit.internal.runners.JUnit38ClassRunner.run(JUnit38ClassRunner.java:83)
	at org.apache.maven.surefire.junit4.JUnit4Provider.execute(JUnit4Provider.java:264)
	at org.apache.maven.surefire.junit4.JUnit4Provider.executeTestSet(JUnit4Provider.java:153)
	at org.apache.maven.surefire.junit4.JUnit4Provider.invoke(JUnit4Provider.java:124)
	at sun.reflect.NativeMethodAccessorImpl.invoke0(Native Method)
	at sun.reflect.NativeMethodAccessorImpl.invoke(NativeMethodAccessorImpl.java:57)
	at sun.reflect.DelegatingMethodAccessorImpl.invoke(DelegatingMethodAccessorImpl.java:43)
	at java.lang.reflect.Method.invoke(Method.java:606)
	at org.apache.maven.surefire.util.ReflectionUtils.invokeMethodWithArray2(ReflectionUtils.java:208)
	at org.apache.maven.surefire.booter.ProviderFactory$ProviderProxy.invoke(ProviderFactory.java:156)
	at org.apache.maven.surefire.booter.ProviderFactory.invokeProvider(ProviderFactory.java:82)
	at org.eclipse.tycho.surefire.osgibooter.OsgiSurefireBooter.run(OsgiSurefireBooter.java:91)
	at org.eclipse.tycho.surefire.osgibooter.AbstractUITestApplication.runTests(AbstractUITestApplication.java:44)
	at org.eclipse.ui.internal.testing.WorkbenchTestable$1.run(WorkbenchTestable.java:71)
	at java.lang.Thread.run(Thread.java:745)

=== testSymbolsCMResetOnContextRemove started at: February 25, 2018 2:04:37 AM EST
=== testSymbolsCMResetOnContextRemove finished at: February 25, 2018 2:04:37 AM EST (duration: 1 ms)

!ENTRY org.eclipse.tcf.te.tests 4 1 2018-02-25 02:04:37.303
!MESSAGE Test case 'testSymbolsCMResetOnContextRemove(org.eclipse.tcf.debug.test.SampleTest)' failed. Failure: Invalid agent location: /home/hudson/genie.tcf/.jenkins/jobs/tcf-1.4/workspace/.agent/agent
!STACK 0
junit.framework.AssertionFailedError: Invalid agent location: /home/hudson/genie.tcf/.jenkins/jobs/tcf-1.4/workspace/.agent/agent
	at junit.framework.Assert.fail(Assert.java:50)
	at junit.framework.Assert.assertTrue(Assert.java:20)
	at org.eclipse.tcf.te.tests.tcf.TcfTestCase.getAgentFile(TcfTestCase.java:240)
	at org.eclipse.tcf.te.tests.tcf.TcfTestCase.launchAgent(TcfTestCase.java:95)
	at org.eclipse.tcf.te.tests.tcf.TcfTestCase.setUp(TcfTestCase.java:61)
	at org.eclipse.tcf.debug.test.AbstractCMTest.setUp(AbstractCMTest.java:150)
	at org.eclipse.tcf.debug.test.AbstractTcfUITest.setUp(AbstractTcfUITest.java:86)
	at junit.framework.TestCase.runBare(TestCase.java:132)
	at org.eclipse.tcf.te.tests.CoreTestCase.runBare(CoreTestCase.java:256)
	at junit.framework.TestResult$1.protect(TestResult.java:110)
	at junit.framework.TestResult.runProtected(TestResult.java:128)
	at junit.framework.TestResult.run(TestResult.java:113)
	at junit.framework.TestCase.run(TestCase.java:124)
	at org.eclipse.tcf.te.tests.CoreTestCase.run(CoreTestCase.java:233)
	at junit.framework.TestSuite.runTest(TestSuite.java:243)
	at junit.framework.TestSuite.run(TestSuite.java:238)
	at org.junit.internal.runners.JUnit38ClassRunner.run(JUnit38ClassRunner.java:83)
	at org.apache.maven.surefire.junit4.JUnit4Provider.execute(JUnit4Provider.java:264)
	at org.apache.maven.surefire.junit4.JUnit4Provider.executeTestSet(JUnit4Provider.java:153)
	at org.apache.maven.surefire.junit4.JUnit4Provider.invoke(JUnit4Provider.java:124)
	at sun.reflect.NativeMethodAccessorImpl.invoke0(Native Method)
	at sun.reflect.NativeMethodAccessorImpl.invoke(NativeMethodAccessorImpl.java:57)
	at sun.reflect.DelegatingMethodAccessorImpl.invoke(DelegatingMethodAccessorImpl.java:43)
	at java.lang.reflect.Method.invoke(Method.java:606)
	at org.apache.maven.surefire.util.ReflectionUtils.invokeMethodWithArray2(ReflectionUtils.java:208)
	at org.apache.maven.surefire.booter.ProviderFactory$ProviderProxy.invoke(ProviderFactory.java:156)
	at org.apache.maven.surefire.booter.ProviderFactory.invokeProvider(ProviderFactory.java:82)
	at org.eclipse.tycho.surefire.osgibooter.OsgiSurefireBooter.run(OsgiSurefireBooter.java:91)
	at org.eclipse.tycho.surefire.osgibooter.AbstractUITestApplication.runTests(AbstractUITestApplication.java:44)
	at org.eclipse.ui.internal.testing.WorkbenchTestable$1.run(WorkbenchTestable.java:71)
	at java.lang.Thread.run(Thread.java:745)

=== testSymbolsCMResetOnContextStateChange started at: February 25, 2018 2:04:37 AM EST
=== testSymbolsCMResetOnContextStateChange finished at: February 25, 2018 2:04:37 AM EST (duration: 1 ms)

!ENTRY org.eclipse.tcf.te.tests 4 1 2018-02-25 02:04:37.305
!MESSAGE Test case 'testSymbolsCMResetOnContextStateChange(org.eclipse.tcf.debug.test.SampleTest)' failed. Failure: Invalid agent location: /home/hudson/genie.tcf/.jenkins/jobs/tcf-1.4/workspace/.agent/agent
!STACK 0
junit.framework.AssertionFailedError: Invalid agent location: /home/hudson/genie.tcf/.jenkins/jobs/tcf-1.4/workspace/.agent/agent
	at junit.framework.Assert.fail(Assert.java:50)
	at junit.framework.Assert.assertTrue(Assert.java:20)
	at org.eclipse.tcf.te.tests.tcf.TcfTestCase.getAgentFile(TcfTestCase.java:240)
	at org.eclipse.tcf.te.tests.tcf.TcfTestCase.launchAgent(TcfTestCase.java:95)
	at org.eclipse.tcf.te.tests.tcf.TcfTestCase.setUp(TcfTestCase.java:61)
	at org.eclipse.tcf.debug.test.AbstractCMTest.setUp(AbstractCMTest.java:150)
	at org.eclipse.tcf.debug.test.AbstractTcfUITest.setUp(AbstractTcfUITest.java:86)
	at junit.framework.TestCase.runBare(TestCase.java:132)
	at org.eclipse.tcf.te.tests.CoreTestCase.runBare(CoreTestCase.java:256)
	at junit.framework.TestResult$1.protect(TestResult.java:110)
	at junit.framework.TestResult.runProtected(TestResult.java:128)
	at junit.framework.TestResult.run(TestResult.java:113)
	at junit.framework.TestCase.run(TestCase.java:124)
	at org.eclipse.tcf.te.tests.CoreTestCase.run(CoreTestCase.java:233)
	at junit.framework.TestSuite.runTest(TestSuite.java:243)
	at junit.framework.TestSuite.run(TestSuite.java:238)
	at org.junit.internal.runners.JUnit38ClassRunner.run(JUnit38ClassRunner.java:83)
	at org.apache.maven.surefire.junit4.JUnit4Provider.execute(JUnit4Provider.java:264)
	at org.apache.maven.surefire.junit4.JUnit4Provider.executeTestSet(JUnit4Provider.java:153)
	at org.apache.maven.surefire.junit4.JUnit4Provider.invoke(JUnit4Provider.java:124)
	at sun.reflect.NativeMethodAccessorImpl.invoke0(Native Method)
	at sun.reflect.NativeMethodAccessorImpl.invoke(NativeMethodAccessorImpl.java:57)
	at sun.reflect.DelegatingMethodAccessorImpl.invoke(DelegatingMethodAccessorImpl.java:43)
	at java.lang.reflect.Method.invoke(Method.java:606)
	at org.apache.maven.surefire.util.ReflectionUtils.invokeMethodWithArray2(ReflectionUtils.java:208)
	at org.apache.maven.surefire.booter.ProviderFactory$ProviderProxy.invoke(ProviderFactory.java:156)
	at org.apache.maven.surefire.booter.ProviderFactory.invokeProvider(ProviderFactory.java:82)
	at org.eclipse.tycho.surefire.osgibooter.OsgiSurefireBooter.run(OsgiSurefireBooter.java:91)
	at org.eclipse.tycho.surefire.osgibooter.AbstractUITestApplication.runTests(AbstractUITestApplication.java:44)
	at org.eclipse.ui.internal.testing.WorkbenchTestable$1.run(WorkbenchTestable.java:71)
	at java.lang.Thread.run(Thread.java:745)
Tests run: 6, Failures: 6, Errors: 0, Skipped: 0, Time elapsed: 0.014 sec <<< FAILURE! - in org.eclipse.tcf.debug.test.SampleTest
testDebugViewContent(org.eclipse.tcf.debug.test.SampleTest)  Time elapsed: 0.001 sec  <<< FAILURE!
junit.framework.AssertionFailedError: Invalid agent location: /home/hudson/genie.tcf/.jenkins/jobs/tcf-1.4/workspace/.agent/agent
	at junit.framework.Assert.fail(Assert.java:50)
	at junit.framework.Assert.assertTrue(Assert.java:20)
	at org.eclipse.tcf.te.tests.tcf.TcfTestCase.getAgentFile(TcfTestCase.java:240)
	at org.eclipse.tcf.te.tests.tcf.TcfTestCase.launchAgent(TcfTestCase.java:95)
	at org.eclipse.tcf.te.tests.tcf.TcfTestCase.setUp(TcfTestCase.java:61)
	at org.eclipse.tcf.debug.test.AbstractCMTest.setUp(AbstractCMTest.java:150)
	at org.eclipse.tcf.debug.test.AbstractTcfUITest.setUp(AbstractTcfUITest.java:86)
	at junit.framework.TestCase.runBare(TestCase.java:132)
	at org.eclipse.tcf.te.tests.CoreTestCase.runBare(CoreTestCase.java:256)
	at junit.framework.TestResult$1.protect(TestResult.java:110)
	at junit.framework.TestResult.runProtected(TestResult.java:128)
	at junit.framework.TestResult.run(TestResult.java:113)
	at junit.framework.TestCase.run(TestCase.java:124)
	at org.eclipse.tcf.te.tests.CoreTestCase.run(CoreTestCase.java:233)
	at junit.framework.TestSuite.runTest(TestSuite.java:243)
	at junit.framework.TestSuite.run(TestSuite.java:238)
	at org.junit.internal.runners.JUnit38ClassRunner.run(JUnit38ClassRunner.java:83)
	at org.apache.maven.surefire.junit4.JUnit4Provider.execute(JUnit4Provider.java:264)
	at org.apache.maven.surefire.junit4.JUnit4Provider.executeTestSet(JUnit4Provider.java:153)
	at org.apache.maven.surefire.junit4.JUnit4Provider.invoke(JUnit4Provider.java:124)
	at sun.reflect.NativeMethodAccessorImpl.invoke0(Native Method)
	at sun.reflect.NativeMethodAccessorImpl.invoke(NativeMethodAccessorImpl.java:57)
	at sun.reflect.DelegatingMethodAccessorImpl.invoke(DelegatingMethodAccessorImpl.java:43)
	at java.lang.reflect.Method.invoke(Method.java:606)
	at org.apache.maven.surefire.util.ReflectionUtils.invokeMethodWithArray2(ReflectionUtils.java:208)
	at org.apache.maven.surefire.booter.ProviderFactory$ProviderProxy.invoke(ProviderFactory.java:156)
	at org.apache.maven.surefire.booter.ProviderFactory.invokeProvider(ProviderFactory.java:82)
	at org.eclipse.tycho.surefire.osgibooter.OsgiSurefireBooter.run(OsgiSurefireBooter.java:91)
	at org.eclipse.tycho.surefire.osgibooter.AbstractUITestApplication.runTests(AbstractUITestApplication.java:44)
	at org.eclipse.ui.internal.testing.WorkbenchTestable$1.run(WorkbenchTestable.java:71)
	at java.lang.Thread.run(Thread.java:745)

testSteppingDebugViewOnly(org.eclipse.tcf.debug.test.SampleTest)  Time elapsed: 0.002 sec  <<< FAILURE!
junit.framework.AssertionFailedError: Invalid agent location: /home/hudson/genie.tcf/.jenkins/jobs/tcf-1.4/workspace/.agent/agent
	at junit.framework.Assert.fail(Assert.java:50)
	at junit.framework.Assert.assertTrue(Assert.java:20)
	at org.eclipse.tcf.te.tests.tcf.TcfTestCase.getAgentFile(TcfTestCase.java:240)
	at org.eclipse.tcf.te.tests.tcf.TcfTestCase.launchAgent(TcfTestCase.java:95)
	at org.eclipse.tcf.te.tests.tcf.TcfTestCase.setUp(TcfTestCase.java:61)
	at org.eclipse.tcf.debug.test.AbstractCMTest.setUp(AbstractCMTest.java:150)
	at org.eclipse.tcf.debug.test.AbstractTcfUITest.setUp(AbstractTcfUITest.java:86)
	at junit.framework.TestCase.runBare(TestCase.java:132)
	at org.eclipse.tcf.te.tests.CoreTestCase.runBare(CoreTestCase.java:256)
	at junit.framework.TestResult$1.protect(TestResult.java:110)
	at junit.framework.TestResult.runProtected(TestResult.java:128)
	at junit.framework.TestResult.run(TestResult.java:113)
	at junit.framework.TestCase.run(TestCase.java:124)
	at org.eclipse.tcf.te.tests.CoreTestCase.run(CoreTestCase.java:233)
	at junit.framework.TestSuite.runTest(TestSuite.java:243)
	at junit.framework.TestSuite.run(TestSuite.java:238)
	at org.junit.internal.runners.JUnit38ClassRunner.run(JUnit38ClassRunner.java:83)
	at org.apache.maven.surefire.junit4.JUnit4Provider.execute(JUnit4Provider.java:264)
	at org.apache.maven.surefire.junit4.JUnit4Provider.executeTestSet(JUnit4Provider.java:153)
	at org.apache.maven.surefire.junit4.JUnit4Provider.invoke(JUnit4Provider.java:124)
	at sun.reflect.NativeMethodAccessorImpl.invoke0(Native Method)
	at sun.reflect.NativeMethodAccessorImpl.invoke(NativeMethodAccessorImpl.java:57)
	at sun.reflect.DelegatingMethodAccessorImpl.invoke(DelegatingMethodAccessorImpl.java:43)
	at java.lang.reflect.Method.invoke(Method.java:606)
	at org.apache.maven.surefire.util.ReflectionUtils.invokeMethodWithArray2(ReflectionUtils.java:208)
	at org.apache.maven.surefire.booter.ProviderFactory$ProviderProxy.invoke(ProviderFactory.java:156)
	at org.apache.maven.surefire.booter.ProviderFactory.invokeProvider(ProviderFactory.java:82)
	at org.eclipse.tycho.surefire.osgibooter.OsgiSurefireBooter.run(OsgiSurefireBooter.java:91)
	at org.eclipse.tycho.surefire.osgibooter.AbstractUITestApplication.runTests(AbstractUITestApplication.java:44)
	at org.eclipse.ui.internal.testing.WorkbenchTestable$1.run(WorkbenchTestable.java:71)
	at java.lang.Thread.run(Thread.java:745)

testSteppingWithVariablesAndRegisters(org.eclipse.tcf.debug.test.SampleTest)  Time elapsed: 0.001 sec  <<< FAILURE!
junit.framework.AssertionFailedError: Invalid agent location: /home/hudson/genie.tcf/.jenkins/jobs/tcf-1.4/workspace/.agent/agent
	at junit.framework.Assert.fail(Assert.java:50)
	at junit.framework.Assert.assertTrue(Assert.java:20)
	at org.eclipse.tcf.te.tests.tcf.TcfTestCase.getAgentFile(TcfTestCase.java:240)
	at org.eclipse.tcf.te.tests.tcf.TcfTestCase.launchAgent(TcfTestCase.java:95)
	at org.eclipse.tcf.te.tests.tcf.TcfTestCase.setUp(TcfTestCase.java:61)
	at org.eclipse.tcf.debug.test.AbstractCMTest.setUp(AbstractCMTest.java:150)
	at org.eclipse.tcf.debug.test.AbstractTcfUITest.setUp(AbstractTcfUITest.java:86)
	at junit.framework.TestCase.runBare(TestCase.java:132)
	at org.eclipse.tcf.te.tests.CoreTestCase.runBare(CoreTestCase.java:256)
	at junit.framework.TestResult$1.protect(TestResult.java:110)
	at junit.framework.TestResult.runProtected(TestResult.java:128)
	at junit.framework.TestResult.run(TestResult.java:113)
	at junit.framework.TestCase.run(TestCase.java:124)
	at org.eclipse.tcf.te.tests.CoreTestCase.run(CoreTestCase.java:233)
	at junit.framework.TestSuite.runTest(TestSuite.java:243)
	at junit.framework.TestSuite.run(TestSuite.java:238)
	at org.junit.internal.runners.JUnit38ClassRunner.run(JUnit38ClassRunner.java:83)
	at org.apache.maven.surefire.junit4.JUnit4Provider.execute(JUnit4Provider.java:264)
	at org.apache.maven.surefire.junit4.JUnit4Provider.executeTestSet(JUnit4Provider.java:153)
	at org.apache.maven.surefire.junit4.JUnit4Provider.invoke(JUnit4Provider.java:124)
	at sun.reflect.NativeMethodAccessorImpl.invoke0(Native Method)
	at sun.reflect.NativeMethodAccessorImpl.invoke(NativeMethodAccessorImpl.java:57)
	at sun.reflect.DelegatingMethodAccessorImpl.invoke(DelegatingMethodAccessorImpl.java:43)
	at java.lang.reflect.Method.invoke(Method.java:606)
	at org.apache.maven.surefire.util.ReflectionUtils.invokeMethodWithArray2(ReflectionUtils.java:208)
	at org.apache.maven.surefire.booter.ProviderFactory$ProviderProxy.invoke(ProviderFactory.java:156)
	at org.apache.maven.surefire.booter.ProviderFactory.invokeProvider(ProviderFactory.java:82)
	at org.eclipse.tycho.surefire.osgibooter.OsgiSurefireBooter.run(OsgiSurefireBooter.java:91)
	at org.eclipse.tycho.surefire.osgibooter.AbstractUITestApplication.runTests(AbstractUITestApplication.java:44)
	at org.eclipse.ui.internal.testing.WorkbenchTestable$1.run(WorkbenchTestable.java:71)
	at java.lang.Thread.run(Thread.java:745)

testSteppingPerformanceWithSourceDisplay(org.eclipse.tcf.debug.test.SampleTest)  Time elapsed: 0.001 sec  <<< FAILURE!
junit.framework.AssertionFailedError: Invalid agent location: /home/hudson/genie.tcf/.jenkins/jobs/tcf-1.4/workspace/.agent/agent
	at junit.framework.Assert.fail(Assert.java:50)
	at junit.framework.Assert.assertTrue(Assert.java:20)
	at org.eclipse.tcf.te.tests.tcf.TcfTestCase.getAgentFile(TcfTestCase.java:240)
	at org.eclipse.tcf.te.tests.tcf.TcfTestCase.launchAgent(TcfTestCase.java:95)
	at org.eclipse.tcf.te.tests.tcf.TcfTestCase.setUp(TcfTestCase.java:61)
	at org.eclipse.tcf.debug.test.AbstractCMTest.setUp(AbstractCMTest.java:150)
	at org.eclipse.tcf.debug.test.AbstractTcfUITest.setUp(AbstractTcfUITest.java:86)
	at junit.framework.TestCase.runBare(TestCase.java:132)
	at org.eclipse.tcf.te.tests.CoreTestCase.runBare(CoreTestCase.java:256)
	at junit.framework.TestResult$1.protect(TestResult.java:110)
	at junit.framework.TestResult.runProtected(TestResult.java:128)
	at junit.framework.TestResult.run(TestResult.java:113)
	at junit.framework.TestCase.run(TestCase.java:124)
	at org.eclipse.tcf.te.tests.CoreTestCase.run(CoreTestCase.java:233)
	at junit.framework.TestSuite.runTest(TestSuite.java:243)
	at junit.framework.TestSuite.run(TestSuite.java:238)
	at org.junit.internal.runners.JUnit38ClassRunner.run(JUnit38ClassRunner.java:83)
	at org.apache.maven.surefire.junit4.JUnit4Provider.execute(JUnit4Provider.java:264)
	at org.apache.maven.surefire.junit4.JUnit4Provider.executeTestSet(JUnit4Provider.java:153)
	at org.apache.maven.surefire.junit4.JUnit4Provider.invoke(JUnit4Provider.java:124)
	at sun.reflect.NativeMethodAccessorImpl.invoke0(Native Method)
	at sun.reflect.NativeMethodAccessorImpl.invoke(NativeMethodAccessorImpl.java:57)
	at sun.reflect.DelegatingMethodAccessorImpl.invoke(DelegatingMethodAccessorImpl.java:43)
	at java.lang.reflect.Method.invoke(Method.java:606)
	at org.apache.maven.surefire.util.ReflectionUtils.invokeMethodWithArray2(ReflectionUtils.java:208)
	at org.apache.maven.surefire.booter.ProviderFactory$ProviderProxy.invoke(ProviderFactory.java:156)
	at org.apache.maven.surefire.booter.ProviderFactory.invokeProvider(ProviderFactory.java:82)
	at org.eclipse.tycho.surefire.osgibooter.OsgiSurefireBooter.run(OsgiSurefireBooter.java:91)
	at org.eclipse.tycho.surefire.osgibooter.AbstractUITestApplication.runTests(AbstractUITestApplication.java:44)
	at org.eclipse.ui.internal.testing.WorkbenchTestable$1.run(WorkbenchTestable.java:71)
	at java.lang.Thread.run(Thread.java:745)

testSymbolsCMResetOnContextRemove(org.eclipse.tcf.debug.test.SampleTest)  Time elapsed: 0.001 sec  <<< FAILURE!
junit.framework.AssertionFailedError: Invalid agent location: /home/hudson/genie.tcf/.jenkins/jobs/tcf-1.4/workspace/.agent/agent
	at junit.framework.Assert.fail(Assert.java:50)
	at junit.framework.Assert.assertTrue(Assert.java:20)
	at org.eclipse.tcf.te.tests.tcf.TcfTestCase.getAgentFile(TcfTestCase.java:240)
	at org.eclipse.tcf.te.tests.tcf.TcfTestCase.launchAgent(TcfTestCase.java:95)
	at org.eclipse.tcf.te.tests.tcf.TcfTestCase.setUp(TcfTestCase.java:61)
	at org.eclipse.tcf.debug.test.AbstractCMTest.setUp(AbstractCMTest.java:150)
	at org.eclipse.tcf.debug.test.AbstractTcfUITest.setUp(AbstractTcfUITest.java:86)
	at junit.framework.TestCase.runBare(TestCase.java:132)
	at org.eclipse.tcf.te.tests.CoreTestCase.runBare(CoreTestCase.java:256)
	at junit.framework.TestResult$1.protect(TestResult.java:110)
	at junit.framework.TestResult.runProtected(TestResult.java:128)
	at junit.framework.TestResult.run(TestResult.java:113)
	at junit.framework.TestCase.run(TestCase.java:124)
	at org.eclipse.tcf.te.tests.CoreTestCase.run(CoreTestCase.java:233)
	at junit.framework.TestSuite.runTest(TestSuite.java:243)
	at junit.framework.TestSuite.run(TestSuite.java:238)
	at org.junit.internal.runners.JUnit38ClassRunner.run(JUnit38ClassRunner.java:83)
	at org.apache.maven.surefire.junit4.JUnit4Provider.execute(JUnit4Provider.java:264)
	at org.apache.maven.surefire.junit4.JUnit4Provider.executeTestSet(JUnit4Provider.java:153)
	at org.apache.maven.surefire.junit4.JUnit4Provider.invoke(JUnit4Provider.java:124)
	at sun.reflect.NativeMethodAccessorImpl.invoke0(Native Method)
	at sun.reflect.NativeMethodAccessorImpl.invoke(NativeMethodAccessorImpl.java:57)
	at sun.reflect.DelegatingMethodAccessorImpl.invoke(DelegatingMethodAccessorImpl.java:43)
	at java.lang.reflect.Method.invoke(Method.java:606)
	at org.apache.maven.surefire.util.ReflectionUtils.invokeMethodWithArray2(ReflectionUtils.java:208)
	at org.apache.maven.surefire.booter.ProviderFactory$ProviderProxy.invoke(ProviderFactory.java:156)
	at org.apache.maven.surefire.booter.ProviderFactory.invokeProvider(ProviderFactory.java:82)
	at org.eclipse.tycho.surefire.osgibooter.OsgiSurefireBooter.run(OsgiSurefireBooter.java:91)
	at org.eclipse.tycho.surefire.osgibooter.AbstractUITestApplication.runTests(AbstractUITestApplication.java:44)
	at org.eclipse.ui.internal.testing.WorkbenchTestable$1.run(WorkbenchTestable.java:71)
	at java.lang.Thread.run(Thread.java:745)

testSymbolsCMResetOnContextStateChange(org.eclipse.tcf.debug.test.SampleTest)  Time elapsed: 0.001 sec  <<< FAILURE!
junit.framework.AssertionFailedError: Invalid agent location: /home/hudson/genie.tcf/.jenkins/jobs/tcf-1.4/workspace/.agent/agent
	at junit.framework.Assert.fail(Assert.java:50)
	at junit.framework.Assert.assertTrue(Assert.java:20)
	at org.eclipse.tcf.te.tests.tcf.TcfTestCase.getAgentFile(TcfTestCase.java:240)
	at org.eclipse.tcf.te.tests.tcf.TcfTestCase.launchAgent(TcfTestCase.java:95)
	at org.eclipse.tcf.te.tests.tcf.TcfTestCase.setUp(TcfTestCase.java:61)
	at org.eclipse.tcf.debug.test.AbstractCMTest.setUp(AbstractCMTest.java:150)
	at org.eclipse.tcf.debug.test.AbstractTcfUITest.setUp(AbstractTcfUITest.java:86)
	at junit.framework.TestCase.runBare(TestCase.java:132)
	at org.eclipse.tcf.te.tests.CoreTestCase.runBare(CoreTestCase.java:256)
	at junit.framework.TestResult$1.protect(TestResult.java:110)
	at junit.framework.TestResult.runProtected(TestResult.java:128)
	at junit.framework.TestResult.run(TestResult.java:113)
	at junit.framework.TestCase.run(TestCase.java:124)
	at org.eclipse.tcf.te.tests.CoreTestCase.run(CoreTestCase.java:233)
	at junit.framework.TestSuite.runTest(TestSuite.java:243)
	at junit.framework.TestSuite.run(TestSuite.java:238)
	at org.junit.internal.runners.JUnit38ClassRunner.run(JUnit38ClassRunner.java:83)
	at org.apache.maven.surefire.junit4.JUnit4Provider.execute(JUnit4Provider.java:264)
	at org.apache.maven.surefire.junit4.JUnit4Provider.executeTestSet(JUnit4Provider.java:153)
	at org.apache.maven.surefire.junit4.JUnit4Provider.invoke(JUnit4Provider.java:124)
	at sun.reflect.NativeMethodAccessorImpl.invoke0(Native Method)
	at sun.reflect.NativeMethodAccessorImpl.invoke(NativeMethodAccessorImpl.java:57)
	at sun.reflect.DelegatingMethodAccessorImpl.invoke(DelegatingMethodAccessorImpl.java:43)
	at java.lang.reflect.Method.invoke(Method.java:606)
	at org.apache.maven.surefire.util.ReflectionUtils.invokeMethodWithArray2(ReflectionUtils.java:208)
	at org.apache.maven.surefire.booter.ProviderFactory$ProviderProxy.invoke(ProviderFactory.java:156)
	at org.apache.maven.surefire.booter.ProviderFactory.invokeProvider(ProviderFactory.java:82)
	at org.eclipse.tycho.surefire.osgibooter.OsgiSurefireBooter.run(OsgiSurefireBooter.java:91)
	at org.eclipse.tycho.surefire.osgibooter.AbstractUITestApplication.runTests(AbstractUITestApplication.java:44)
	at org.eclipse.ui.internal.testing.WorkbenchTestable$1.run(WorkbenchTestable.java:71)
	at java.lang.Thread.run(Thread.java:745)

Running org.eclipse.tcf.debug.test.BreakpointDetailPaneTest

=== testContextQueryFilter started at: February 25, 2018 2:04:37 AM EST
=== testContextQueryFilter finished at: February 25, 2018 2:04:37 AM EST (duration: 1 ms)

!ENTRY org.eclipse.tcf.te.tests 4 1 2018-02-25 02:04:37.320
!MESSAGE Test case 'testContextQueryFilter(org.eclipse.tcf.debug.test.BreakpointDetailPaneTest)' failed. Failure: Invalid agent location: /home/hudson/genie.tcf/.jenkins/jobs/tcf-1.4/workspace/.agent/agent
!STACK 0
junit.framework.AssertionFailedError: Invalid agent location: /home/hudson/genie.tcf/.jenkins/jobs/tcf-1.4/workspace/.agent/agent
	at junit.framework.Assert.fail(Assert.java:50)
	at junit.framework.Assert.assertTrue(Assert.java:20)
	at org.eclipse.tcf.te.tests.tcf.TcfTestCase.getAgentFile(TcfTestCase.java:240)
	at org.eclipse.tcf.te.tests.tcf.TcfTestCase.launchAgent(TcfTestCase.java:95)
	at org.eclipse.tcf.te.tests.tcf.TcfTestCase.setUp(TcfTestCase.java:61)
	at org.eclipse.tcf.debug.test.AbstractCMTest.setUp(AbstractCMTest.java:150)
	at org.eclipse.tcf.debug.test.AbstractTcfUITest.setUp(AbstractTcfUITest.java:86)
	at org.eclipse.tcf.debug.test.BreakpointDetailPaneTest.setUp(BreakpointDetailPaneTest.java:40)
	at junit.framework.TestCase.runBare(TestCase.java:132)
	at org.eclipse.tcf.te.tests.CoreTestCase.runBare(CoreTestCase.java:256)
	at junit.framework.TestResult$1.protect(TestResult.java:110)
	at junit.framework.TestResult.runProtected(TestResult.java:128)
	at junit.framework.TestResult.run(TestResult.java:113)
	at junit.framework.TestCase.run(TestCase.java:124)
	at org.eclipse.tcf.te.tests.CoreTestCase.run(CoreTestCase.java:233)
	at junit.framework.TestSuite.runTest(TestSuite.java:243)
	at junit.framework.TestSuite.run(TestSuite.java:238)
	at org.junit.internal.runners.JUnit38ClassRunner.run(JUnit38ClassRunner.java:83)
	at org.apache.maven.surefire.junit4.JUnit4Provider.execute(JUnit4Provider.java:264)
	at org.apache.maven.surefire.junit4.JUnit4Provider.executeTestSet(JUnit4Provider.java:153)
	at org.apache.maven.surefire.junit4.JUnit4Provider.invoke(JUnit4Provider.java:124)
	at sun.reflect.NativeMethodAccessorImpl.invoke0(Native Method)
	at sun.reflect.NativeMethodAccessorImpl.invoke(NativeMethodAccessorImpl.java:57)
	at sun.reflect.DelegatingMethodAccessorImpl.invoke(DelegatingMethodAccessorImpl.java:43)
	at java.lang.reflect.Method.invoke(Method.java:606)
	at org.apache.maven.surefire.util.ReflectionUtils.invokeMethodWithArray2(ReflectionUtils.java:208)
	at org.apache.maven.surefire.booter.ProviderFactory$ProviderProxy.invoke(ProviderFactory.java:156)
	at org.apache.maven.surefire.booter.ProviderFactory.invokeProvider(ProviderFactory.java:82)
	at org.eclipse.tycho.surefire.osgibooter.OsgiSurefireBooter.run(OsgiSurefireBooter.java:91)
	at org.eclipse.tycho.surefire.osgibooter.AbstractUITestApplication.runTests(AbstractUITestApplication.java:44)
	at org.eclipse.ui.internal.testing.WorkbenchTestable$1.run(WorkbenchTestable.java:71)
	at java.lang.Thread.run(Thread.java:745)

=== testContextsFilter started at: February 25, 2018 2:04:37 AM EST
=== testContextsFilter finished at: February 25, 2018 2:04:37 AM EST (duration: 1 ms)

!ENTRY org.eclipse.tcf.te.tests 4 1 2018-02-25 02:04:37.322
!MESSAGE Test case 'testContextsFilter(org.eclipse.tcf.debug.test.BreakpointDetailPaneTest)' failed. Failure: Invalid agent location: /home/hudson/genie.tcf/.jenkins/jobs/tcf-1.4/workspace/.agent/agent
!STACK 0
junit.framework.AssertionFailedError: Invalid agent location: /home/hudson/genie.tcf/.jenkins/jobs/tcf-1.4/workspace/.agent/agent
	at junit.framework.Assert.fail(Assert.java:50)
	at junit.framework.Assert.assertTrue(Assert.java:20)
	at org.eclipse.tcf.te.tests.tcf.TcfTestCase.getAgentFile(TcfTestCase.java:240)
	at org.eclipse.tcf.te.tests.tcf.TcfTestCase.launchAgent(TcfTestCase.java:95)
	at org.eclipse.tcf.te.tests.tcf.TcfTestCase.setUp(TcfTestCase.java:61)
	at org.eclipse.tcf.debug.test.AbstractCMTest.setUp(AbstractCMTest.java:150)
	at org.eclipse.tcf.debug.test.AbstractTcfUITest.setUp(AbstractTcfUITest.java:86)
	at org.eclipse.tcf.debug.test.BreakpointDetailPaneTest.setUp(BreakpointDetailPaneTest.java:40)
	at junit.framework.TestCase.runBare(TestCase.java:132)
	at org.eclipse.tcf.te.tests.CoreTestCase.runBare(CoreTestCase.java:256)
	at junit.framework.TestResult$1.protect(TestResult.java:110)
	at junit.framework.TestResult.runProtected(TestResult.java:128)
	at junit.framework.TestResult.run(TestResult.java:113)
	at junit.framework.TestCase.run(TestCase.java:124)
	at org.eclipse.tcf.te.tests.CoreTestCase.run(CoreTestCase.java:233)
	at junit.framework.TestSuite.runTest(TestSuite.java:243)
	at junit.framework.TestSuite.run(TestSuite.java:238)
	at org.junit.internal.runners.JUnit38ClassRunner.run(JUnit38ClassRunner.java:83)
	at org.apache.maven.surefire.junit4.JUnit4Provider.execute(JUnit4Provider.java:264)
	at org.apache.maven.surefire.junit4.JUnit4Provider.executeTestSet(JUnit4Provider.java:153)
	at org.apache.maven.surefire.junit4.JUnit4Provider.invoke(JUnit4Provider.java:124)
	at sun.reflect.NativeMethodAccessorImpl.invoke0(Native Method)
	at sun.reflect.NativeMethodAccessorImpl.invoke(NativeMethodAccessorImpl.java:57)
	at sun.reflect.DelegatingMethodAccessorImpl.invoke(DelegatingMethodAccessorImpl.java:43)
	at java.lang.reflect.Method.invoke(Method.java:606)
	at org.apache.maven.surefire.util.ReflectionUtils.invokeMethodWithArray2(ReflectionUtils.java:208)
	at org.apache.maven.surefire.booter.ProviderFactory$ProviderProxy.invoke(ProviderFactory.java:156)
	at org.apache.maven.surefire.booter.ProviderFactory.invokeProvider(ProviderFactory.java:82)
	at org.eclipse.tycho.surefire.osgibooter.OsgiSurefireBooter.run(OsgiSurefireBooter.java:91)
	at org.eclipse.tycho.surefire.osgibooter.AbstractUITestApplication.runTests(AbstractUITestApplication.java:44)
	at org.eclipse.ui.internal.testing.WorkbenchTestable$1.run(WorkbenchTestable.java:71)
	at java.lang.Thread.run(Thread.java:745)
Tests run: 2, Failures: 2, Errors: 0, Skipped: 0, Time elapsed: 0.005 sec <<< FAILURE! - in org.eclipse.tcf.debug.test.BreakpointDetailPaneTest
testContextQueryFilter(org.eclipse.tcf.debug.test.BreakpointDetailPaneTest)  Time elapsed: 0.001 sec  <<< FAILURE!
junit.framework.AssertionFailedError: Invalid agent location: /home/hudson/genie.tcf/.jenkins/jobs/tcf-1.4/workspace/.agent/agent
	at junit.framework.Assert.fail(Assert.java:50)
	at junit.framework.Assert.assertTrue(Assert.java:20)
	at org.eclipse.tcf.te.tests.tcf.TcfTestCase.getAgentFile(TcfTestCase.java:240)
	at org.eclipse.tcf.te.tests.tcf.TcfTestCase.launchAgent(TcfTestCase.java:95)
	at org.eclipse.tcf.te.tests.tcf.TcfTestCase.setUp(TcfTestCase.java:61)
	at org.eclipse.tcf.debug.test.AbstractCMTest.setUp(AbstractCMTest.java:150)
	at org.eclipse.tcf.debug.test.AbstractTcfUITest.setUp(AbstractTcfUITest.java:86)
	at org.eclipse.tcf.debug.test.BreakpointDetailPaneTest.setUp(BreakpointDetailPaneTest.java:40)

testContextsFilter(org.eclipse.tcf.debug.test.BreakpointDetailPaneTest)  Time elapsed: 0.001 sec  <<< FAILURE!
junit.framework.AssertionFailedError: Invalid agent location: /home/hudson/genie.tcf/.jenkins/jobs/tcf-1.4/workspace/.agent/agent
	at junit.framework.Assert.fail(Assert.java:50)
	at junit.framework.Assert.assertTrue(Assert.java:20)
	at org.eclipse.tcf.te.tests.tcf.TcfTestCase.getAgentFile(TcfTestCase.java:240)
	at org.eclipse.tcf.te.tests.tcf.TcfTestCase.launchAgent(TcfTestCase.java:95)
	at org.eclipse.tcf.te.tests.tcf.TcfTestCase.setUp(TcfTestCase.java:61)
	at org.eclipse.tcf.debug.test.AbstractCMTest.setUp(AbstractCMTest.java:150)
	at org.eclipse.tcf.debug.test.AbstractTcfUITest.setUp(AbstractTcfUITest.java:86)
	at org.eclipse.tcf.debug.test.BreakpointDetailPaneTest.setUp(BreakpointDetailPaneTest.java:40)

Running org.eclipse.tcf.debug.test.BreakpointsTest

=== testContextAddedOnLineBrakpointCreate started at: February 25, 2018 2:04:37 AM EST
=== testContextAddedOnLineBrakpointCreate finished at: February 25, 2018 2:04:37 AM EST (duration: 1 ms)

!ENTRY org.eclipse.tcf.te.tests 4 1 2018-02-25 02:04:37.330
!MESSAGE Test case 'testContextAddedOnLineBrakpointCreate(org.eclipse.tcf.debug.test.BreakpointsTest)' failed. Failure: Invalid agent location: /home/hudson/genie.tcf/.jenkins/jobs/tcf-1.4/workspace/.agent/agent
!STACK 0
junit.framework.AssertionFailedError: Invalid agent location: /home/hudson/genie.tcf/.jenkins/jobs/tcf-1.4/workspace/.agent/agent
	at junit.framework.Assert.fail(Assert.java:50)
	at junit.framework.Assert.assertTrue(Assert.java:20)
	at org.eclipse.tcf.te.tests.tcf.TcfTestCase.getAgentFile(TcfTestCase.java:240)
	at org.eclipse.tcf.te.tests.tcf.TcfTestCase.launchAgent(TcfTestCase.java:95)
	at org.eclipse.tcf.te.tests.tcf.TcfTestCase.setUp(TcfTestCase.java:61)
	at org.eclipse.tcf.debug.test.AbstractCMTest.setUp(AbstractCMTest.java:150)
	at org.eclipse.tcf.debug.test.AbstractTcfUITest.setUp(AbstractTcfUITest.java:86)
	at org.eclipse.tcf.debug.test.BreakpointsTest.setUp(BreakpointsTest.java:51)
	at junit.framework.TestCase.runBare(TestCase.java:132)
	at org.eclipse.tcf.te.tests.CoreTestCase.runBare(CoreTestCase.java:256)
	at junit.framework.TestResult$1.protect(TestResult.java:110)
	at junit.framework.TestResult.runProtected(TestResult.java:128)
	at junit.framework.TestResult.run(TestResult.java:113)
	at junit.framework.TestCase.run(TestCase.java:124)
	at org.eclipse.tcf.te.tests.CoreTestCase.run(CoreTestCase.java:233)
	at junit.framework.TestSuite.runTest(TestSuite.java:243)
	at junit.framework.TestSuite.run(TestSuite.java:238)
	at org.junit.internal.runners.JUnit38ClassRunner.run(JUnit38ClassRunner.java:83)
	at org.apache.maven.surefire.junit4.JUnit4Provider.execute(JUnit4Provider.java:264)
	at org.apache.maven.surefire.junit4.JUnit4Provider.executeTestSet(JUnit4Provider.java:153)
	at org.apache.maven.surefire.junit4.JUnit4Provider.invoke(JUnit4Provider.java:124)
	at sun.reflect.NativeMethodAccessorImpl.invoke0(Native Method)
	at sun.reflect.NativeMethodAccessorImpl.invoke(NativeMethodAccessorImpl.java:57)
	at sun.reflect.DelegatingMethodAccessorImpl.invoke(DelegatingMethodAccessorImpl.java:43)
	at java.lang.reflect.Method.invoke(Method.java:606)
	at org.apache.maven.surefire.util.ReflectionUtils.invokeMethodWithArray2(ReflectionUtils.java:208)
	at org.apache.maven.surefire.booter.ProviderFactory$ProviderProxy.invoke(ProviderFactory.java:156)
	at org.apache.maven.surefire.booter.ProviderFactory.invokeProvider(ProviderFactory.java:82)
	at org.eclipse.tycho.surefire.osgibooter.OsgiSurefireBooter.run(OsgiSurefireBooter.java:91)
	at org.eclipse.tycho.surefire.osgibooter.AbstractUITestApplication.runTests(AbstractUITestApplication.java:44)
	at org.eclipse.ui.internal.testing.WorkbenchTestable$1.run(WorkbenchTestable.java:71)
	at java.lang.Thread.run(Thread.java:745)

=== testForeignBreakpointCreate started at: February 25, 2018 2:04:37 AM EST
=== testForeignBreakpointCreate finished at: February 25, 2018 2:04:37 AM EST (duration: 1 ms)

!ENTRY org.eclipse.tcf.te.tests 4 1 2018-02-25 02:04:37.332
!MESSAGE Test case 'testForeignBreakpointCreate(org.eclipse.tcf.debug.test.BreakpointsTest)' failed. Failure: Invalid agent location: /home/hudson/genie.tcf/.jenkins/jobs/tcf-1.4/workspace/.agent/agent
!STACK 0
junit.framework.AssertionFailedError: Invalid agent location: /home/hudson/genie.tcf/.jenkins/jobs/tcf-1.4/workspace/.agent/agent
	at junit.framework.Assert.fail(Assert.java:50)
	at junit.framework.Assert.assertTrue(Assert.java:20)
	at org.eclipse.tcf.te.tests.tcf.TcfTestCase.getAgentFile(TcfTestCase.java:240)
	at org.eclipse.tcf.te.tests.tcf.TcfTestCase.launchAgent(TcfTestCase.java:95)
	at org.eclipse.tcf.te.tests.tcf.TcfTestCase.setUp(TcfTestCase.java:61)
	at org.eclipse.tcf.debug.test.AbstractCMTest.setUp(AbstractCMTest.java:150)
	at org.eclipse.tcf.debug.test.AbstractTcfUITest.setUp(AbstractTcfUITest.java:86)
	at org.eclipse.tcf.debug.test.BreakpointsTest.setUp(BreakpointsTest.java:51)
	at junit.framework.TestCase.runBare(TestCase.java:132)
	at org.eclipse.tcf.te.tests.CoreTestCase.runBare(CoreTestCase.java:256)
	at junit.framework.TestResult$1.protect(TestResult.java:110)
	at junit.framework.TestResult.runProtected(TestResult.java:128)
	at junit.framework.TestResult.run(TestResult.java:113)
	at junit.framework.TestCase.run(TestCase.java:124)
	at org.eclipse.tcf.te.tests.CoreTestCase.run(CoreTestCase.java:233)
	at junit.framework.TestSuite.runTest(TestSuite.java:243)
	at junit.framework.TestSuite.run(TestSuite.java:238)
	at org.junit.internal.runners.JUnit38ClassRunner.run(JUnit38ClassRunner.java:83)
	at org.apache.maven.surefire.junit4.JUnit4Provider.execute(JUnit4Provider.java:264)
	at org.apache.maven.surefire.junit4.JUnit4Provider.executeTestSet(JUnit4Provider.java:153)
	at org.apache.maven.surefire.junit4.JUnit4Provider.invoke(JUnit4Provider.java:124)
	at sun.reflect.NativeMethodAccessorImpl.invoke0(Native Method)
	at sun.reflect.NativeMethodAccessorImpl.invoke(NativeMethodAccessorImpl.java:57)
	at sun.reflect.DelegatingMethodAccessorImpl.invoke(DelegatingMethodAccessorImpl.java:43)
	at java.lang.reflect.Method.invoke(Method.java:606)
	at org.apache.maven.surefire.util.ReflectionUtils.invokeMethodWithArray2(ReflectionUtils.java:208)
	at org.apache.maven.surefire.booter.ProviderFactory$ProviderProxy.invoke(ProviderFactory.java:156)
	at org.apache.maven.surefire.booter.ProviderFactory.invokeProvider(ProviderFactory.java:82)
	at org.eclipse.tycho.surefire.osgibooter.OsgiSurefireBooter.run(OsgiSurefireBooter.java:91)
	at org.eclipse.tycho.surefire.osgibooter.AbstractUITestApplication.runTests(AbstractUITestApplication.java:44)
	at org.eclipse.ui.internal.testing.WorkbenchTestable$1.run(WorkbenchTestable.java:71)
	at java.lang.Thread.run(Thread.java:745)
Tests run: 2, Failures: 2, Errors: 0, Skipped: 0, Time elapsed: 0.005 sec <<< FAILURE! - in org.eclipse.tcf.debug.test.BreakpointsTest
testContextAddedOnLineBrakpointCreate(org.eclipse.tcf.debug.test.BreakpointsTest)  Time elapsed: 0.001 sec  <<< FAILURE!
junit.framework.AssertionFailedError: Invalid agent location: /home/hudson/genie.tcf/.jenkins/jobs/tcf-1.4/workspace/.agent/agent
	at junit.framework.Assert.fail(Assert.java:50)
	at junit.framework.Assert.assertTrue(Assert.java:20)
	at org.eclipse.tcf.te.tests.tcf.TcfTestCase.getAgentFile(TcfTestCase.java:240)
	at org.eclipse.tcf.te.tests.tcf.TcfTestCase.launchAgent(TcfTestCase.java:95)
	at org.eclipse.tcf.te.tests.tcf.TcfTestCase.setUp(TcfTestCase.java:61)
	at org.eclipse.tcf.debug.test.AbstractCMTest.setUp(AbstractCMTest.java:150)
	at org.eclipse.tcf.debug.test.AbstractTcfUITest.setUp(AbstractTcfUITest.java:86)
	at org.eclipse.tcf.debug.test.BreakpointsTest.setUp(BreakpointsTest.java:51)

testForeignBreakpointCreate(org.eclipse.tcf.debug.test.BreakpointsTest)  Time elapsed: 0.001 sec  <<< FAILURE!
junit.framework.AssertionFailedError: Invalid agent location: /home/hudson/genie.tcf/.jenkins/jobs/tcf-1.4/workspace/.agent/agent
	at junit.framework.Assert.fail(Assert.java:50)
	at junit.framework.Assert.assertTrue(Assert.java:20)
	at org.eclipse.tcf.te.tests.tcf.TcfTestCase.getAgentFile(TcfTestCase.java:240)
	at org.eclipse.tcf.te.tests.tcf.TcfTestCase.launchAgent(TcfTestCase.java:95)
	at org.eclipse.tcf.te.tests.tcf.TcfTestCase.setUp(TcfTestCase.java:61)
	at org.eclipse.tcf.debug.test.AbstractCMTest.setUp(AbstractCMTest.java:150)
	at org.eclipse.tcf.debug.test.AbstractTcfUITest.setUp(AbstractTcfUITest.java:86)
	at org.eclipse.tcf.debug.test.BreakpointsTest.setUp(BreakpointsTest.java:51)


Results :

Failed tests: 
  RunControlCMTest>CoreTestCase.run:233->CoreTestCase.runBare:256->AbstractCMTest.setUp:150->TcfTestCase.setUp:61->TcfTestCase.launchAgent:95->TcfTestCase.getAgentFile:240 Invalid agent location: /home/hudson/genie.tcf/.jenkins/jobs/tcf-1.4/workspace/.agent/agent
  RunControlCMTest>CoreTestCase.run:233->CoreTestCase.runBare:256->AbstractCMTest.setUp:150->TcfTestCase.setUp:61->TcfTestCase.launchAgent:95->TcfTestCase.getAgentFile:240 Invalid agent location: /home/hudson/genie.tcf/.jenkins/jobs/tcf-1.4/workspace/.agent/agent
  RunControlCMTest>CoreTestCase.run:233->CoreTestCase.runBare:256->AbstractCMTest.setUp:150->TcfTestCase.setUp:61->TcfTestCase.launchAgent:95->TcfTestCase.getAgentFile:240 Invalid agent location: /home/hudson/genie.tcf/.jenkins/jobs/tcf-1.4/workspace/.agent/agent
  RunControlCMTest>CoreTestCase.run:233->CoreTestCase.runBare:256->AbstractCMTest.setUp:150->TcfTestCase.setUp:61->TcfTestCase.launchAgent:95->TcfTestCase.getAgentFile:240 Invalid agent location: /home/hudson/genie.tcf/.jenkins/jobs/tcf-1.4/workspace/.agent/agent
  RunControlCMTest>CoreTestCase.run:233->CoreTestCase.runBare:256->AbstractCMTest.setUp:150->TcfTestCase.setUp:61->TcfTestCase.launchAgent:95->TcfTestCase.getAgentFile:240 Invalid agent location: /home/hudson/genie.tcf/.jenkins/jobs/tcf-1.4/workspace/.agent/agent
  StackTraceCMTest>CoreTestCase.run:233->CoreTestCase.runBare:256->AbstractCMTest.setUp:150->TcfTestCase.setUp:61->TcfTestCase.launchAgent:95->TcfTestCase.getAgentFile:240 Invalid agent location: /home/hudson/genie.tcf/.jenkins/jobs/tcf-1.4/workspace/.agent/agent
  StackTraceCMTest>CoreTestCase.run:233->CoreTestCase.runBare:256->AbstractCMTest.setUp:150->TcfTestCase.setUp:61->TcfTestCase.launchAgent:95->TcfTestCase.getAgentFile:240 Invalid agent location: /home/hudson/genie.tcf/.jenkins/jobs/tcf-1.4/workspace/.agent/agent
  StackTraceCMTest>CoreTestCase.run:233->CoreTestCase.runBare:256->AbstractCMTest.setUp:150->TcfTestCase.setUp:61->TcfTestCase.launchAgent:95->TcfTestCase.getAgentFile:240 Invalid agent location: /home/hudson/genie.tcf/.jenkins/jobs/tcf-1.4/workspace/.agent/agent
  StackTraceCMTest>CoreTestCase.run:233->CoreTestCase.runBare:256->AbstractCMTest.setUp:150->TcfTestCase.setUp:61->TcfTestCase.launchAgent:95->TcfTestCase.getAgentFile:240 Invalid agent location: /home/hudson/genie.tcf/.jenkins/jobs/tcf-1.4/workspace/.agent/agent
  BreakpointsViewTest>CoreTestCase.run:233->CoreTestCase.runBare:256->setUp:47->AbstractTcfUITest.setUp:86->AbstractCMTest.setUp:150->TcfTestCase.setUp:61->TcfTestCase.launchAgent:95->TcfTestCase.getAgentFile:240 Invalid agent location: /home/hudson/genie.tcf/.jenkins/jobs/tcf-1.4/workspace/.agent/agent
  SampleTest>CoreTestCase.run:233->CoreTestCase.runBare:256->AbstractTcfUITest.setUp:86->AbstractCMTest.setUp:150->TcfTestCase.setUp:61->TcfTestCase.launchAgent:95->TcfTestCase.getAgentFile:240 Invalid agent location: /home/hudson/genie.tcf/.jenkins/jobs/tcf-1.4/workspace/.agent/agent
  SampleTest>CoreTestCase.run:233->CoreTestCase.runBare:256->AbstractTcfUITest.setUp:86->AbstractCMTest.setUp:150->TcfTestCase.setUp:61->TcfTestCase.launchAgent:95->TcfTestCase.getAgentFile:240 Invalid agent location: /home/hudson/genie.tcf/.jenkins/jobs/tcf-1.4/workspace/.agent/agent
  SampleTest>CoreTestCase.run:233->CoreTestCase.runBare:256->AbstractTcfUITest.setUp:86->AbstractCMTest.setUp:150->TcfTestCase.setUp:61->TcfTestCase.launchAgent:95->TcfTestCase.getAgentFile:240 Invalid agent location: /home/hudson/genie.tcf/.jenkins/jobs/tcf-1.4/workspace/.agent/agent
  SampleTest>CoreTestCase.run:233->CoreTestCase.runBare:256->AbstractTcfUITest.setUp:86->AbstractCMTest.setUp:150->TcfTestCase.setUp:61->TcfTestCase.launchAgent:95->TcfTestCase.getAgentFile:240 Invalid agent location: /home/hudson/genie.tcf/.jenkins/jobs/tcf-1.4/workspace/.agent/agent
  SampleTest>CoreTestCase.run:233->CoreTestCase.runBare:256->AbstractTcfUITest.setUp:86->AbstractCMTest.setUp:150->TcfTestCase.setUp:61->TcfTestCase.launchAgent:95->TcfTestCase.getAgentFile:240 Invalid agent location: /home/hudson/genie.tcf/.jenkins/jobs/tcf-1.4/workspace/.agent/agent
  SampleTest>CoreTestCase.run:233->CoreTestCase.runBare:256->AbstractTcfUITest.setUp:86->AbstractCMTest.setUp:150->TcfTestCase.setUp:61->TcfTestCase.launchAgent:95->TcfTestCase.getAgentFile:240 Invalid agent location: /home/hudson/genie.tcf/.jenkins/jobs/tcf-1.4/workspace/.agent/agent
  BreakpointDetailPaneTest>CoreTestCase.run:233->CoreTestCase.runBare:256->setUp:40->AbstractTcfUITest.setUp:86->AbstractCMTest.setUp:150->TcfTestCase.setUp:61->TcfTestCase.launchAgent:95->TcfTestCase.getAgentFile:240 Invalid agent location: /home/hudson/genie.tcf/.jenkins/jobs/tcf-1.4/workspace/.agent/agent
  BreakpointDetailPaneTest>CoreTestCase.run:233->CoreTestCase.runBare:256->setUp:40->AbstractTcfUITest.setUp:86->AbstractCMTest.setUp:150->TcfTestCase.setUp:61->TcfTestCase.launchAgent:95->TcfTestCase.getAgentFile:240 Invalid agent location: /home/hudson/genie.tcf/.jenkins/jobs/tcf-1.4/workspace/.agent/agent
  BreakpointsTest>CoreTestCase.run:233->CoreTestCase.runBare:256->setUp:51->AbstractTcfUITest.setUp:86->AbstractCMTest.setUp:150->TcfTestCase.setUp:61->TcfTestCase.launchAgent:95->TcfTestCase.getAgentFile:240 Invalid agent location: /home/hudson/genie.tcf/.jenkins/jobs/tcf-1.4/workspace/.agent/agent
  BreakpointsTest>CoreTestCase.run:233->CoreTestCase.runBare:256->setUp:51->AbstractTcfUITest.setUp:86->AbstractCMTest.setUp:150->TcfTestCase.setUp:61->TcfTestCase.launchAgent:95->TcfTestCase.getAgentFile:240 Invalid agent location: /home/hudson/genie.tcf/.jenkins/jobs/tcf-1.4/workspace/.agent/agent

Tests run: 60, Failures: 20, Errors: 0, Skipped: 0

[ERROR] There are test failures.

Please refer to /jobs/genie.tcf/tcf-1.4/workspace/tests/plugins/org.eclipse.tcf.debug.test/target/surefire-reports for the individual test results.
[INFO] 
[INFO] --- maven-antrun-plugin:1.8:run (generate-report) @ org.eclipse.tcf.debug.test ---
[INFO] Executing tasks

main:
     [echo] Coverage report
   [report] Loading execution data file /jobs/genie.tcf/tcf-1.4/workspace/tests/plugins/org.eclipse.tcf.debug.test/target/jacoco.exec
   [report] Writing bundle 'org.eclipse.tcf' with 11 classes
   [report] Classes in bundle 'org.eclipse.tcf' do no match with execution data. For report generation the same class files must be used as at runtime.
   [report] Execution data for class org/eclipse/tcf/ssl/TCFSecurityManager$2 does not match.
   [report] Execution data for class org/eclipse/tcf/Activator does not match.
   [report] Execution data for class org/eclipse/tcf/ssl/TCFSecurityManager$1 does not match.
   [report] Execution data for class org/eclipse/tcf/Activator$2$1 does not match.
   [report] Execution data for class org/eclipse/tcf/EventQueue does not match.
   [report] Execution data for class org/eclipse/tcf/Activator$1 does not match.
   [report] Execution data for class org/eclipse/tcf/Activator$2 does not match.
   [report] Execution data for class org/eclipse/tcf/Activator$3 does not match.
   [report] Execution data for class org/eclipse/tcf/ssl/TCFSecurityManager does not match.
   [report] Execution data for class org/eclipse/tcf/EventQueue$1 does not match.
   [report] Writing bundle 'org.eclipse.tcf.core' with 325 classes
   [report] Classes in bundle 'org.eclipse.tcf.core' do no match with execution data. For report generation the same class files must be used as at runtime.
   [report] Execution data for class org/eclipse/tcf/internal/services/local/LocatorService$InputPacket does not match.
   [report] Execution data for class org/eclipse/tcf/core/ChannelTCP does not match.
   [report] Execution data for class org/eclipse/tcf/internal/services/local/LocatorService$1$1 does not match.
   [report] Execution data for class org/eclipse/tcf/core/TransientPeer does not match.
   [report] Execution data for class org/eclipse/tcf/core/StreamChannel does not match.
   [report] Execution data for class org/eclipse/tcf/internal/core/ServiceManager does not match.
   [report] Execution data for class org/eclipse/tcf/protocol/Protocol does not match.
   [report] Execution data for class org/eclipse/tcf/core/AbstractPeer does not match.
   [report] Execution data for class org/eclipse/tcf/protocol/Protocol$Timer does not match.
   [report] Execution data for class org/eclipse/tcf/internal/core/ServiceManager$1 does not match.
   [report] Execution data for class org/eclipse/tcf/core/AbstractChannel does not match.
   [report] Execution data for class org/eclipse/tcf/internal/Activator does not match.
   [report] Execution data for class org/eclipse/tcf/internal/core/LocalPeer does not match.
   [report] Execution data for class org/eclipse/tcf/internal/services/local/LocatorService$5 does not match.
   [report] Execution data for class org/eclipse/tcf/internal/services/local/LocatorService$6 does not match.
   [report] Execution data for class org/eclipse/tcf/internal/services/local/LocatorService$3 does not match.
   [report] Execution data for class org/eclipse/tcf/internal/services/local/LocatorService$4 does not match.
   [report] Execution data for class org/eclipse/tcf/internal/services/local/LocatorService$1 does not match.
   [report] Execution data for class org/eclipse/tcf/internal/services/local/LocatorService$2 does not match.
   [report] Execution data for class org/eclipse/tcf/internal/services/local/LocatorService$SubNet does not match.
   [report] Execution data for class org/eclipse/tcf/protocol/Protocol$3 does not match.
   [report] Execution data for class org/eclipse/tcf/protocol/Protocol$2 does not match.
   [report] Execution data for class org/eclipse/tcf/protocol/Protocol$1 does not match.
   [report] Execution data for class org/eclipse/tcf/internal/services/local/LocatorService does not match.
   [report] Writing bundle 'org.eclipse.tcf.debug' with 355 classes
   [report] Classes in bundle 'org.eclipse.tcf.debug' do no match with execution data. For report generation the same class files must be used as at runtime.
   [report] Execution data for class org/eclipse/tcf/internal/debug/Activator$1 does not match.
   [report] Execution data for class org/eclipse/tcf/internal/debug/Activator does not match.
   [report] Execution data for class org/eclipse/tcf/internal/debug/launch/TCFUserDefPeer does not match.
   [report] Execution data for class org/eclipse/tcf/internal/debug/model/TCFLaunch does not match.
   [report] Execution data for class org/eclipse/tcf/internal/debug/model/TCFBreakpointsModel does not match.
   [report] Execution data for class org/eclipse/tcf/internal/debug/model/TCFBreakpointsModel$2 does not match.
   [report] Execution data for class org/eclipse/tcf/internal/debug/model/TCFBreakpointsModel$1 does not match.
   [report] Execution data for class org/eclipse/tcf/internal/debug/launch/TCFLocalAgent does not match.
   [report] Writing bundle 'org.eclipse.tcf.debug.ui' with 690 classes
   [report] Classes in bundle 'org.eclipse.tcf.debug.ui' do no match with execution data. For report generation the same class files must be used as at runtime.
   [report] Execution data for class org/eclipse/tcf/internal/debug/ui/Activator$1 does not match.
   [report] Execution data for class org/eclipse/tcf/internal/debug/ui/Activator$2 does not match.
   [report] Execution data for class org/eclipse/tcf/internal/debug/ui/model/TCFModelManager$2 does not match.
   [report] Execution data for class org/eclipse/tcf/internal/debug/ui/model/TCFModelManager$1 does not match.
   [report] Execution data for class org/eclipse/tcf/internal/debug/ui/model/TCFModelManager$3 does not match.
   [report] Execution data for class org/eclipse/tcf/internal/debug/ui/model/TCFMemoryBlock does not match.
   [report] Execution data for class org/eclipse/tcf/internal/debug/ui/model/TCFModelManager does not match.
   [report] Execution data for class org/eclipse/tcf/internal/debug/ui/Activator does not match.
   [report] Execution data for class org/eclipse/tcf/internal/debug/ui/model/TCFMemoryBlock$11 does not match.
   [report] Writing bundle 'org.eclipse.tcf.cdt.ui' with 214 classes
[INFO] Executed tasks
[INFO] 
[INFO] --- tycho-pack200a-plugin:0.22.0:normalize (pack200-normalize) @ org.eclipse.tcf.debug.test ---
[INFO] Pack200 normalizing jar /jobs/genie.tcf/tcf-1.4/workspace/tests/plugins/org.eclipse.tcf.debug.test/target/org.eclipse.tcf.debug.test-1.4.0.qualifier.jar
[INFO] 
[INFO] --- eclipse-jarsigner-plugin:1.1.2:sign (sign) @ org.eclipse.tcf.debug.test ---
[INFO] Searching org.eclipse.tcf.debug.test-1.4.0.qualifier.jar for inner jars...
[INFO] Signed org.eclipse.tcf:org.eclipse.tcf.debug.test:eclipse-test-plugin:1.4.0.qualifier in 1 seconds.
[INFO] Searching org.eclipse.tcf.debug.test-1.4.0.qualifier-sources.jar for inner jars...
[INFO] Signed org.eclipse.tcf:org.eclipse.tcf.debug.test:java-source:sources:1.4.0.qualifier in 0 seconds.
[INFO] 
[INFO] --- tycho-pack200b-plugin:0.22.0:pack (pack200-pack) @ org.eclipse.tcf.debug.test ---
[INFO] Pack200 packing jar /jobs/genie.tcf/tcf-1.4/workspace/tests/plugins/org.eclipse.tcf.debug.test/target/org.eclipse.tcf.debug.test-1.4.0.qualifier.jar
[INFO] 
[INFO] >>> findbugs-maven-plugin:2.5.2:check (default) > :findbugs @ org.eclipse.tcf.debug.test >>>
[INFO] 
[INFO] --- findbugs-maven-plugin:2.5.2:findbugs (findbugs) @ org.eclipse.tcf.debug.test ---
[INFO] Fork Value is true
     [java] Picked up JAVA_TOOL_OPTIONS: -Xmx2G -Djava.io.tmpdir=/tmp/genie.tcf
     [java] Warnings generated: 3
[INFO] Done FindBugs Analysis....
[INFO] 
[INFO] <<< findbugs-maven-plugin:2.5.2:check (default) < :findbugs @ org.eclipse.tcf.debug.test <<<
[INFO] 
[INFO] 
[INFO] --- findbugs-maven-plugin:2.5.2:check (default) @ org.eclipse.tcf.debug.test ---
[INFO] BugInstance size is 3
[INFO] Error size is 0
[INFO] Total bugs: 3
[INFO] Load of known null value in org.eclipse.tcf.debug.test.AbstractCMTest$15.process() ["org.eclipse.tcf.debug.test.AbstractCMTest$15"] At AbstractCMTest.java:[lines 1-618]
[INFO] JUnit assertion in org.eclipse.tcf.debug.test.CacheTests$1.run() will not be noticed by JUnit ["org.eclipse.tcf.debug.test.CacheTests$1"] At CacheTests.java:[lines 1-168]
[INFO] org.eclipse.tcf.debug.test.RangeCacheTests$RetrieveInfo defines compareTo(RangeCacheTests$RetrieveInfo) and uses Object.equals() ["org.eclipse.tcf.debug.test.RangeCacheTests$RetrieveInfo"] At RangeCacheTests.java:[lines 1-92]
[INFO] 
[INFO] --- maven-install-plugin:2.3.1:install (default-install) @ org.eclipse.tcf.debug.test ---
[INFO] Installing /jobs/genie.tcf/tcf-1.4/workspace/tests/plugins/org.eclipse.tcf.debug.test/target/org.eclipse.tcf.debug.test-1.4.0.qualifier.jar to /home/hudson/genie.tcf/.jenkins/jobs/tcf-1.4/workspace/.repository/org/eclipse/tcf/org.eclipse.tcf.debug.test/1.4.0.qualifier/org.eclipse.tcf.debug.test-1.4.0.qualifier.jar
[INFO] Installing /jobs/genie.tcf/tcf-1.4/workspace/tests/plugins/org.eclipse.tcf.debug.test/pom.xml to /home/hudson/genie.tcf/.jenkins/jobs/tcf-1.4/workspace/.repository/org/eclipse/tcf/org.eclipse.tcf.debug.test/1.4.0.qualifier/org.eclipse.tcf.debug.test-1.4.0.qualifier.pom
[INFO] Installing /jobs/genie.tcf/tcf-1.4/workspace/tests/plugins/org.eclipse.tcf.debug.test/target/org.eclipse.tcf.debug.test-1.4.0.qualifier-sources.jar to /home/hudson/genie.tcf/.jenkins/jobs/tcf-1.4/workspace/.repository/org/eclipse/tcf/org.eclipse.tcf.debug.test/1.4.0.qualifier/org.eclipse.tcf.debug.test-1.4.0.qualifier-sources.jar
[INFO] Installing /jobs/genie.tcf/tcf-1.4/workspace/tests/plugins/org.eclipse.tcf.debug.test/target/p2content.xml to /home/hudson/genie.tcf/.jenkins/jobs/tcf-1.4/workspace/.repository/org/eclipse/tcf/org.eclipse.tcf.debug.test/1.4.0.qualifier/org.eclipse.tcf.debug.test-1.4.0.qualifier-p2metadata.xml
[INFO] Installing /jobs/genie.tcf/tcf-1.4/workspace/tests/plugins/org.eclipse.tcf.debug.test/target/p2artifacts.xml to /home/hudson/genie.tcf/.jenkins/jobs/tcf-1.4/workspace/.repository/org/eclipse/tcf/org.eclipse.tcf.debug.test/1.4.0.qualifier/org.eclipse.tcf.debug.test-1.4.0.qualifier-p2artifacts.xml
[INFO] Installing /jobs/genie.tcf/tcf-1.4/workspace/tests/plugins/org.eclipse.tcf.debug.test/target/org.eclipse.tcf.debug.test-1.4.0.qualifier.jar.pack.gz to /home/hudson/genie.tcf/.jenkins/jobs/tcf-1.4/workspace/.repository/org/eclipse/tcf/org.eclipse.tcf.debug.test/1.4.0.qualifier/org.eclipse.tcf.debug.test-1.4.0.qualifier-pack200.jar.pack.gz
[INFO] 
[INFO] --- tycho-p2-plugin:0.22.0:update-local-index (default-update-local-index) @ org.eclipse.tcf.debug.test ---
[INFO] 
[INFO] ------------------------------------------------------------------------
[INFO] Building TCF and Target Explorer, Maven Master 1.4.0-SNAPSHOT
[INFO] ------------------------------------------------------------------------
Downloading from sonatype: https://oss.sonatype.org/content/repositories/public/org/apache/maven/plugins/maven-install-plugin/2.4/maven-install-plugin-2.4.pom
Downloading from cbi: https://repo.eclipse.org/content/repositories/cbi-releases/org/apache/maven/plugins/maven-install-plugin/2.4/maven-install-plugin-2.4.pom
Downloading from cbi-snapshots: https://repo.eclipse.org/content/repositories/cbi-snapshots/org/apache/maven/plugins/maven-install-plugin/2.4/maven-install-plugin-2.4.pom
Downloading from eclipse.maven.central.mirror: https://repo.eclipse.org/content/repositories/maven_central/org/apache/maven/plugins/maven-install-plugin/2.4/maven-install-plugin-2.4.pom
Progress (1): 4.1/6.4 kB
Progress (1): 6.4 kB    
                    
Downloaded from eclipse.maven.central.mirror: https://repo.eclipse.org/content/repositories/maven_central/org/apache/maven/plugins/maven-install-plugin/2.4/maven-install-plugin-2.4.pom (6.4 kB at 277 kB/s)
Downloading from sonatype: https://oss.sonatype.org/content/repositories/public/org/apache/maven/plugins/maven-plugins/23/maven-plugins-23.pom
Downloading from cbi: https://repo.eclipse.org/content/repositories/cbi-releases/org/apache/maven/plugins/maven-plugins/23/maven-plugins-23.pom
Downloading from cbi-snapshots: https://repo.eclipse.org/content/repositories/cbi-snapshots/org/apache/maven/plugins/maven-plugins/23/maven-plugins-23.pom
Downloading from eclipse.maven.central.mirror: https://repo.eclipse.org/content/repositories/maven_central/org/apache/maven/plugins/maven-plugins/23/maven-plugins-23.pom
Progress (1): 4.1/9.2 kB
Progress (1): 7.7/9.2 kB
Progress (1): 9.2 kB    
                    
Downloaded from eclipse.maven.central.mirror: https://repo.eclipse.org/content/repositories/maven_central/org/apache/maven/plugins/maven-plugins/23/maven-plugins-23.pom (9.2 kB at 484 kB/s)
Downloading from sonatype: https://oss.sonatype.org/content/repositories/public/org/apache/maven/plugins/maven-install-plugin/2.4/maven-install-plugin-2.4.jar
Downloading from cbi: https://repo.eclipse.org/content/repositories/cbi-releases/org/apache/maven/plugins/maven-install-plugin/2.4/maven-install-plugin-2.4.jar
Downloading from cbi-snapshots: https://repo.eclipse.org/content/repositories/cbi-snapshots/org/apache/maven/plugins/maven-install-plugin/2.4/maven-install-plugin-2.4.jar
Downloading from eclipse.maven.central.mirror: https://repo.eclipse.org/content/repositories/maven_central/org/apache/maven/plugins/maven-install-plugin/2.4/maven-install-plugin-2.4.jar
Progress (1): 4.1/27 kB
Progress (1): 7.7/27 kB
Progress (1): 12/27 kB 
Progress (1): 16/27 kB
Progress (1): 20/27 kB
Progress (1): 24/27 kB
Progress (1): 27 kB   
                   
Downloaded from eclipse.maven.central.mirror: https://repo.eclipse.org/content/repositories/maven_central/org/apache/maven/plugins/maven-install-plugin/2.4/maven-install-plugin-2.4.jar (27 kB at 1.1 MB/s)
[INFO] 
[INFO] --- maven-clean-plugin:2.5:clean (default-clean) @ tcf-parent ---
[INFO] 
[INFO] --- jacoco-maven-plugin:0.7.4.201502262128:prepare-agent (default) @ tcf-parent ---
[INFO] argLine set to -javaagent:/home/hudson/genie.tcf/.jenkins/jobs/tcf-1.4/workspace/.repository/org/jacoco/org.jacoco.agent/0.7.4.201502262128/org.jacoco.agent-0.7.4.201502262128-runtime.jar=destfile=/jobs/genie.tcf/tcf-1.4/workspace/target/jacoco.exec,includes=org.eclipse.tcf*,excludes=org.eclipse.tcf.debug.test*:org.eclipse.tcf.te.tests.*,dumponexit=true,output=file
[INFO] 
[INFO] --- tycho-source-plugin:0.22.0:plugin-source (plugin-source) @ tcf-parent ---
[INFO] 
[INFO] --- tycho-p2-plugin:0.22.0:p2-metadata (p2-metadata) @ tcf-parent ---
[INFO] 
[INFO] --- tycho-pack200a-plugin:0.22.0:normalize (pack200-normalize) @ tcf-parent ---
[INFO] 
[INFO] --- eclipse-jarsigner-plugin:1.1.2:sign (sign) @ tcf-parent ---
[INFO] 
[INFO] --- tycho-pack200b-plugin:0.22.0:pack (pack200-pack) @ tcf-parent ---
[INFO] 
[INFO] >>> findbugs-maven-plugin:2.5.2:check (default) > :findbugs @ tcf-parent >>>
[INFO] 
[INFO] --- findbugs-maven-plugin:2.5.2:findbugs (findbugs) @ tcf-parent ---
[INFO] 
[INFO] <<< findbugs-maven-plugin:2.5.2:check (default) < :findbugs @ tcf-parent <<<
[INFO] 
[INFO] 
[INFO] --- findbugs-maven-plugin:2.5.2:check (default) @ tcf-parent ---
[INFO] 
[INFO] --- maven-install-plugin:2.4:install (default-install) @ tcf-parent ---
Downloading from sonatype: https://oss.sonatype.org/content/repositories/public/org/codehaus/plexus/plexus-utils/3.0.5/plexus-utils-3.0.5.pom
Downloading from cbi: https://repo.eclipse.org/content/repositories/cbi-releases/org/codehaus/plexus/plexus-utils/3.0.5/plexus-utils-3.0.5.pom
Downloading from cbi-snapshots: https://repo.eclipse.org/content/repositories/cbi-snapshots/org/codehaus/plexus/plexus-utils/3.0.5/plexus-utils-3.0.5.pom
Downloading from eclipse.maven.central.mirror: https://repo.eclipse.org/content/repositories/maven_central/org/codehaus/plexus/plexus-utils/3.0.5/plexus-utils-3.0.5.pom
Progress (1): 2.5 kB
                    
Downloaded from eclipse.maven.central.mirror: https://repo.eclipse.org/content/repositories/maven_central/org/codehaus/plexus/plexus-utils/3.0.5/plexus-utils-3.0.5.pom (2.5 kB at 132 kB/s)
Downloading from sonatype: https://oss.sonatype.org/content/repositories/public/org/codehaus/plexus/plexus-utils/3.0.5/plexus-utils-3.0.5.jar
Downloading from cbi: https://repo.eclipse.org/content/repositories/cbi-releases/org/codehaus/plexus/plexus-utils/3.0.5/plexus-utils-3.0.5.jar
Downloading from cbi-snapshots: https://repo.eclipse.org/content/repositories/cbi-snapshots/org/codehaus/plexus/plexus-utils/3.0.5/plexus-utils-3.0.5.jar
Downloading from eclipse.maven.central.mirror: https://repo.eclipse.org/content/repositories/maven_central/org/codehaus/plexus/plexus-utils/3.0.5/plexus-utils-3.0.5.jar
Progress (1): 4.1/230 kB
Progress (1): 7.7/230 kB
Progress (1): 12/230 kB 
Progress (1): 16/230 kB
Progress (1): 20/230 kB
Progress (1): 24/230 kB
Progress (1): 28/230 kB
Progress (1): 32/230 kB
Progress (1): 36/230 kB
Progress (1): 40/230 kB
Progress (1): 44/230 kB
Progress (1): 48/230 kB
Progress (1): 52/230 kB
Progress (1): 56/230 kB
Progress (1): 60/230 kB
Progress (1): 64/230 kB
Progress (1): 68/230 kB
Progress (1): 72/230 kB
Progress (1): 76/230 kB
Progress (1): 80/230 kB
Progress (1): 84/230 kB
Progress (1): 88/230 kB
Progress (1): 92/230 kB
Progress (1): 96/230 kB
Progress (1): 100/230 kB
Progress (1): 104/230 kB
Progress (1): 108/230 kB
Progress (1): 112/230 kB
Progress (1): 116/230 kB
Progress (1): 120/230 kB
Progress (1): 124/230 kB
Progress (1): 128/230 kB
Progress (1): 132/230 kB
Progress (1): 136/230 kB
Progress (1): 140/230 kB
Progress (1): 144/230 kB
Progress (1): 148/230 kB
Progress (1): 152/230 kB
Progress (1): 156/230 kB
Progress (1): 160/230 kB
Progress (1): 164/230 kB
Progress (1): 168/230 kB
Progress (1): 172/230 kB
Progress (1): 176/230 kB
Progress (1): 180/230 kB
Progress (1): 184/230 kB
Progress (1): 188/230 kB
Progress (1): 192/230 kB
Progress (1): 196/230 kB
Progress (1): 200/230 kB
Progress (1): 204/230 kB
Progress (1): 208/230 kB
Progress (1): 212/230 kB
Progress (1): 216/230 kB
Progress (1): 220/230 kB
Progress (1): 224/230 kB
Progress (1): 228/230 kB
Progress (1): 230 kB    
                    
Downloaded from eclipse.maven.central.mirror: https://repo.eclipse.org/content/repositories/maven_central/org/codehaus/plexus/plexus-utils/3.0.5/plexus-utils-3.0.5.jar (230 kB at 4.3 MB/s)
[INFO] Installing /jobs/genie.tcf/tcf-1.4/workspace/pom.xml to /home/hudson/genie.tcf/.jenkins/jobs/tcf-1.4/workspace/.repository/org/eclipse/tcf/tcf-parent/1.4.0-SNAPSHOT/tcf-parent-1.4.0-SNAPSHOT.pom
[INFO] ------------------------------------------------------------------------
[INFO] Reactor Summary:
[INFO] 
[INFO] org.eclipse.tcf.core ............................... SUCCESS [02:23 min]
[INFO] org.eclipse.tcf .................................... SUCCESS [ 12.106 s]
[INFO] org.eclipse.tcf.debug .............................. SUCCESS [ 20.989 s]
[INFO] org.eclipse.tcf.debug.ui ........................... SUCCESS [ 38.681 s]
[INFO] org.eclipse.tcf.cdt.ui ............................. SUCCESS [ 21.165 s]
[INFO] org.eclipse.tcf.rse ................................ SUCCESS [ 13.679 s]
[INFO] org.eclipse.tcf.core.feature ....................... SUCCESS [  1.345 s]
[INFO] org.eclipse.tcf.core.sdk.feature ................... SUCCESS [  1.660 s]
[INFO] org.eclipse.tcf.feature ............................ SUCCESS [  1.202 s]
[INFO] org.eclipse.tcf.sdk.feature ........................ SUCCESS [  1.386 s]
[INFO] org.eclipse.tcf.cdt.feature ........................ SUCCESS [  1.344 s]
[INFO] org.eclipse.tcf.cdt.sdk.feature .................... SUCCESS [  1.243 s]
[INFO] org.eclipse.tcf.rse.feature ........................ SUCCESS [  1.162 s]
[INFO] org.eclipse.tcf.rse.sdk.feature .................... SUCCESS [  1.260 s]
[INFO] org.eclipse.tcf.te ................................. SUCCESS [  6.414 s]
[INFO] org.eclipse.tcf.te.runtime ......................... SUCCESS [ 12.191 s]
[INFO] org.eclipse.tcf.te.runtime.concurrent .............. SUCCESS [  8.994 s]
[INFO] org.eclipse.tcf.te.runtime.model ................... SUCCESS [  9.792 s]
[INFO] org.eclipse.tcf.te.runtime.services ................ SUCCESS [  9.830 s]
[INFO] org.eclipse.tcf.te.runtime.persistence ............. SUCCESS [ 10.603 s]
[INFO] org.eclipse.tcf.te.runtime.statushandler ........... SUCCESS [  8.286 s]
[INFO] org.eclipse.tcf.te.runtime.stepper ................. SUCCESS [ 11.840 s]
[INFO] org.eclipse.tcf.te.core ............................ SUCCESS [  9.252 s]
[INFO] org.eclipse.tcf.te.core.cdt ........................ SUCCESS [  7.971 s]
[INFO] org.eclipse.tcf.te.launch.core ..................... SUCCESS [ 11.714 s]
[INFO] org.eclipse.tcf.te.ui.swt .......................... SUCCESS [ 13.566 s]
[INFO] org.eclipse.tcf.te.ui.forms ........................ SUCCESS [ 10.142 s]
[INFO] org.eclipse.tcf.te.ui .............................. SUCCESS [ 17.540 s]
[INFO] org.eclipse.tcf.te.ui.controls ..................... SUCCESS [ 11.953 s]
[INFO] org.eclipse.tcf.te.ui.views ........................ SUCCESS [ 16.169 s]
[INFO] org.eclipse.tcf.te.launch.ui ....................... SUCCESS [ 16.280 s]
[INFO] org.eclipse.tcf.te.tcf.core ........................ SUCCESS [ 12.149 s]
[INFO] org.eclipse.tcf.te.tcf.core.model .................. SUCCESS [  7.307 s]
[INFO] org.eclipse.tcf.te.tcf.core.scripting .............. SUCCESS [ 10.403 s]
[INFO] org.eclipse.tcf.te.tcf.locator ..................... SUCCESS [ 12.225 s]
[INFO] org.eclipse.tcf.te.tcf.filesystem.core ............. SUCCESS [ 15.309 s]
[INFO] org.eclipse.tcf.te.tcf.log.core .................... SUCCESS [ 11.728 s]
[INFO] org.eclipse.tcf.te.tcf.ui .......................... SUCCESS [ 21.094 s]
[INFO] org.eclipse.tcf.te.tcf.filesystem.ui ............... SUCCESS [ 17.666 s]
[INFO] org.eclipse.tcf.te.tcf.processes.core .............. SUCCESS [ 13.971 s]
[INFO] org.eclipse.tcf.te.tcf.launch.cdt .................. SUCCESS [ 14.316 s]
[INFO] org.eclipse.tcf.te.tcf.launch.core ................. SUCCESS [ 11.208 s]
[INFO] org.eclipse.tcf.te.tcf.launch.ui ................... SUCCESS [ 15.570 s]
[INFO] org.eclipse.tcf.te.tcf.processes.ui ................ SUCCESS [ 14.596 s]
[INFO] org.eclipse.tcf.te.tcf.remote.core ................. SUCCESS [ 11.830 s]
[INFO] org.eclipse.tcf.te.tcf.remote.ui ................... SUCCESS [  8.605 s]
[INFO] org.eclipse.tcf.te.tcf.services.contexts ........... SUCCESS [ 14.099 s]
[INFO] org.eclipse.tcf.te.tcf.terminals.core .............. SUCCESS [ 14.314 s]
[INFO] org.eclipse.tcf.te.tcf.terminals.ui ................ SUCCESS [ 24.777 s]
[INFO] org.eclipse.tcf.te.tcf.ui.console .................. SUCCESS [ 11.934 s]
[INFO] org.eclipse.tcf.te.tcf.ui.views .................... SUCCESS [ 12.101 s]
[INFO] org.eclipse.tcf.te.ui.notifications ................ SUCCESS [ 12.809 s]
[INFO] org.eclipse.tcf.te.feature ......................... SUCCESS [  1.400 s]
[INFO] org.eclipse.tcf.te.sdk.feature ..................... SUCCESS [  1.676 s]
[INFO] org.eclipse.tcf.te.tcf.core.feature ................ SUCCESS [  2.075 s]
[INFO] org.eclipse.tcf.te.tcf.core.sdk.feature ............ SUCCESS [  2.244 s]
[INFO] org.eclipse.tcf.te.tcf.feature ..................... SUCCESS [  1.961 s]
[INFO] org.eclipse.tcf.te.tcf.sdk.feature ................. SUCCESS [  2.130 s]
[INFO] org.eclipse.tcf.te.tcf.launch.cdt.feature .......... SUCCESS [  2.464 s]
[INFO] org.eclipse.tcf.te.tcf.launch.cdt.sdk.feature ...... SUCCESS [  2.347 s]
[INFO] org.eclipse.tcf.te.tcf.remote.feature .............. SUCCESS [  2.765 s]
[INFO] org.eclipse.tcf.te.tcf.remote.sdk.feature .......... SUCCESS [  2.306 s]
[INFO] org.eclipse.tcf.repo ............................... SUCCESS [ 14.662 s]
[INFO] org.eclipse.tcf.te.tests ........................... SUCCESS [01:27 min]
[INFO] org.eclipse.tcf.debug.test ......................... SUCCESS [01:36 min]
[INFO] TCF and Target Explorer, Maven Master .............. SUCCESS [  8.815 s]
[INFO] ------------------------------------------------------------------------
[INFO] BUILD SUCCESS
[INFO] ------------------------------------------------------------------------
[INFO] Total time: 21:22 min
[INFO] Finished at: 2018-02-25T02:05:17-05:00
[INFO] Final Memory: 452M/1814M
[INFO] ------------------------------------------------------------------------
Terminating xvnc.
[FINDBUGS] Collecting findbugs analysis files...
[FINDBUGS] Searching for all files in /home/hudson/genie.tcf/.jenkins/jobs/tcf-1.4/workspace that match the pattern **/findbugsXml.xml
[FINDBUGS] Parsing 46 files in /home/hudson/genie.tcf/.jenkins/jobs/tcf-1.4/workspace
[FINDBUGS] Successfully parsed file /home/hudson/genie.tcf/.jenkins/jobs/tcf-1.4/workspace/plugins/org.eclipse.tcf.cdt.ui/target/findbugsXml.xml with 8 unique warnings and 0 duplicates.
[FINDBUGS] Successfully parsed file /home/hudson/genie.tcf/.jenkins/jobs/tcf-1.4/workspace/plugins/org.eclipse.tcf.core/target/findbugsXml.xml with 8 unique warnings and 0 duplicates.
[FINDBUGS] Successfully parsed file /home/hudson/genie.tcf/.jenkins/jobs/tcf-1.4/workspace/plugins/org.eclipse.tcf.debug.ui/target/findbugsXml.xml with 18 unique warnings and 0 duplicates.
[FINDBUGS] Successfully parsed file /home/hudson/genie.tcf/.jenkins/jobs/tcf-1.4/workspace/plugins/org.eclipse.tcf.debug/target/findbugsXml.xml with 20 unique warnings and 0 duplicates.
[FINDBUGS] Successfully parsed file /home/hudson/genie.tcf/.jenkins/jobs/tcf-1.4/workspace/plugins/org.eclipse.tcf.rse/target/findbugsXml.xml with 24 unique warnings and 0 duplicates.
[FINDBUGS] Successfully parsed file /home/hudson/genie.tcf/.jenkins/jobs/tcf-1.4/workspace/plugins/org.eclipse.tcf/target/findbugsXml.xml with 24 unique warnings and 0 duplicates.
[FINDBUGS] Successfully parsed file /home/hudson/genie.tcf/.jenkins/jobs/tcf-1.4/workspace/target_explorer/plugins/org.eclipse.tcf.te.core.cdt/target/findbugsXml.xml with 24 unique warnings and 0 duplicates.
[FINDBUGS] Successfully parsed file /home/hudson/genie.tcf/.jenkins/jobs/tcf-1.4/workspace/target_explorer/plugins/org.eclipse.tcf.te.core/target/findbugsXml.xml with 24 unique warnings and 0 duplicates.
[FINDBUGS] Successfully parsed file /home/hudson/genie.tcf/.jenkins/jobs/tcf-1.4/workspace/target_explorer/plugins/org.eclipse.tcf.te.launch.core/target/findbugsXml.xml with 24 unique warnings and 0 duplicates.
[FINDBUGS] Successfully parsed file /home/hudson/genie.tcf/.jenkins/jobs/tcf-1.4/workspace/target_explorer/plugins/org.eclipse.tcf.te.launch.ui/target/findbugsXml.xml with 24 unique warnings and 0 duplicates.
[FINDBUGS] Successfully parsed file /home/hudson/genie.tcf/.jenkins/jobs/tcf-1.4/workspace/target_explorer/plugins/org.eclipse.tcf.te.runtime.concurrent/target/findbugsXml.xml with 24 unique warnings and 0 duplicates.
[FINDBUGS] Successfully parsed file /home/hudson/genie.tcf/.jenkins/jobs/tcf-1.4/workspace/target_explorer/plugins/org.eclipse.tcf.te.runtime.model/target/findbugsXml.xml with 24 unique warnings and 0 duplicates.
[FINDBUGS] Successfully parsed file /home/hudson/genie.tcf/.jenkins/jobs/tcf-1.4/workspace/target_explorer/plugins/org.eclipse.tcf.te.runtime.persistence/target/findbugsXml.xml with 24 unique warnings and 0 duplicates.
[FINDBUGS] Successfully parsed file /home/hudson/genie.tcf/.jenkins/jobs/tcf-1.4/workspace/target_explorer/plugins/org.eclipse.tcf.te.runtime.services/target/findbugsXml.xml with 24 unique warnings and 0 duplicates.
[FINDBUGS] Successfully parsed file /home/hudson/genie.tcf/.jenkins/jobs/tcf-1.4/workspace/target_explorer/plugins/org.eclipse.tcf.te.runtime.statushandler/target/findbugsXml.xml with 24 unique warnings and 0 duplicates.
[FINDBUGS] Successfully parsed file /home/hudson/genie.tcf/.jenkins/jobs/tcf-1.4/workspace/target_explorer/plugins/org.eclipse.tcf.te.runtime.stepper/target/findbugsXml.xml with 24 unique warnings and 0 duplicates.
[FINDBUGS] Successfully parsed file /home/hudson/genie.tcf/.jenkins/jobs/tcf-1.4/workspace/target_explorer/plugins/org.eclipse.tcf.te.runtime/target/findbugsXml.xml with 24 unique warnings and 0 duplicates.
[FINDBUGS] Successfully parsed file /home/hudson/genie.tcf/.jenkins/jobs/tcf-1.4/workspace/target_explorer/plugins/org.eclipse.tcf.te.tcf.core.model/target/findbugsXml.xml with 24 unique warnings and 0 duplicates.
[FINDBUGS] Successfully parsed file /home/hudson/genie.tcf/.jenkins/jobs/tcf-1.4/workspace/target_explorer/plugins/org.eclipse.tcf.te.tcf.core.scripting/target/findbugsXml.xml with 24 unique warnings and 0 duplicates.
[FINDBUGS] Successfully parsed file /home/hudson/genie.tcf/.jenkins/jobs/tcf-1.4/workspace/target_explorer/plugins/org.eclipse.tcf.te.tcf.core/target/findbugsXml.xml with 24 unique warnings and 0 duplicates.
[FINDBUGS] Successfully parsed file /home/hudson/genie.tcf/.jenkins/jobs/tcf-1.4/workspace/target_explorer/plugins/org.eclipse.tcf.te.tcf.filesystem.core/target/findbugsXml.xml with 25 unique warnings and 0 duplicates.
[FINDBUGS] Successfully parsed file /home/hudson/genie.tcf/.jenkins/jobs/tcf-1.4/workspace/target_explorer/plugins/org.eclipse.tcf.te.tcf.filesystem.ui/target/findbugsXml.xml with 27 unique warnings and 0 duplicates.
[FINDBUGS] Successfully parsed file /home/hudson/genie.tcf/.jenkins/jobs/tcf-1.4/workspace/target_explorer/plugins/org.eclipse.tcf.te.tcf.launch.cdt/target/findbugsXml.xml with 31 unique warnings and 0 duplicates.
[FINDBUGS] Successfully parsed file /home/hudson/genie.tcf/.jenkins/jobs/tcf-1.4/workspace/target_explorer/plugins/org.eclipse.tcf.te.tcf.launch.core/target/findbugsXml.xml with 31 unique warnings and 0 duplicates.
[FINDBUGS] Successfully parsed file /home/hudson/genie.tcf/.jenkins/jobs/tcf-1.4/workspace/target_explorer/plugins/org.eclipse.tcf.te.tcf.launch.ui/target/findbugsXml.xml with 31 unique warnings and 0 duplicates.
[FINDBUGS] Successfully parsed file /home/hudson/genie.tcf/.jenkins/jobs/tcf-1.4/workspace/target_explorer/plugins/org.eclipse.tcf.te.tcf.locator/target/findbugsXml.xml with 31 unique warnings and 0 duplicates.
[FINDBUGS] Successfully parsed file /home/hudson/genie.tcf/.jenkins/jobs/tcf-1.4/workspace/target_explorer/plugins/org.eclipse.tcf.te.tcf.log.core/target/findbugsXml.xml with 31 unique warnings and 0 duplicates.
[FINDBUGS] Successfully parsed file /home/hudson/genie.tcf/.jenkins/jobs/tcf-1.4/workspace/target_explorer/plugins/org.eclipse.tcf.te.tcf.processes.core/target/findbugsXml.xml with 31 unique warnings and 0 duplicates.
[FINDBUGS] Successfully parsed file /home/hudson/genie.tcf/.jenkins/jobs/tcf-1.4/workspace/target_explorer/plugins/org.eclipse.tcf.te.tcf.processes.ui/target/findbugsXml.xml with 31 unique warnings and 0 duplicates.
[FINDBUGS] Successfully parsed file /home/hudson/genie.tcf/.jenkins/jobs/tcf-1.4/workspace/target_explorer/plugins/org.eclipse.tcf.te.tcf.remote.core/target/findbugsXml.xml with 31 unique warnings and 0 duplicates.
[FINDBUGS] Successfully parsed file /home/hudson/genie.tcf/.jenkins/jobs/tcf-1.4/workspace/target_explorer/plugins/org.eclipse.tcf.te.tcf.remote.ui/target/findbugsXml.xml with 31 unique warnings and 0 duplicates.
[FINDBUGS] Successfully parsed file /home/hudson/genie.tcf/.jenkins/jobs/tcf-1.4/workspace/target_explorer/plugins/org.eclipse.tcf.te.tcf.services.contexts/target/findbugsXml.xml with 31 unique warnings and 0 duplicates.
[FINDBUGS] Successfully parsed file /home/hudson/genie.tcf/.jenkins/jobs/tcf-1.4/workspace/target_explorer/plugins/org.eclipse.tcf.te.tcf.terminals.core/target/findbugsXml.xml with 31 unique warnings and 0 duplicates.
[FINDBUGS] Successfully parsed file /home/hudson/genie.tcf/.jenkins/jobs/tcf-1.4/workspace/target_explorer/plugins/org.eclipse.tcf.te.tcf.terminals.ui/target/findbugsXml.xml with 31 unique warnings and 0 duplicates.
[FINDBUGS] Successfully parsed file /home/hudson/genie.tcf/.jenkins/jobs/tcf-1.4/workspace/target_explorer/plugins/org.eclipse.tcf.te.tcf.ui.console/target/findbugsXml.xml with 31 unique warnings and 0 duplicates.
[FINDBUGS] Successfully parsed file /home/hudson/genie.tcf/.jenkins/jobs/tcf-1.4/workspace/target_explorer/plugins/org.eclipse.tcf.te.tcf.ui.views/target/findbugsXml.xml with 31 unique warnings and 0 duplicates.
[FINDBUGS] Successfully parsed file /home/hudson/genie.tcf/.jenkins/jobs/tcf-1.4/workspace/target_explorer/plugins/org.eclipse.tcf.te.tcf.ui/target/findbugsXml.xml with 31 unique warnings and 0 duplicates.
[FINDBUGS] Successfully parsed file /home/hudson/genie.tcf/.jenkins/jobs/tcf-1.4/workspace/target_explorer/plugins/org.eclipse.tcf.te.tests/target/findbugsXml.xml with 31 unique warnings and 0 duplicates.
[FINDBUGS] Successfully parsed file /home/hudson/genie.tcf/.jenkins/jobs/tcf-1.4/workspace/target_explorer/plugins/org.eclipse.tcf.te.ui.controls/target/findbugsXml.xml with 31 unique warnings and 0 duplicates.
[FINDBUGS] Successfully parsed file /home/hudson/genie.tcf/.jenkins/jobs/tcf-1.4/workspace/target_explorer/plugins/org.eclipse.tcf.te.ui.forms/target/findbugsXml.xml with 31 unique warnings and 0 duplicates.
[FINDBUGS] Successfully parsed file /home/hudson/genie.tcf/.jenkins/jobs/tcf-1.4/workspace/target_explorer/plugins/org.eclipse.tcf.te.ui.notifications/target/findbugsXml.xml with 31 unique warnings and 0 duplicates.
[FINDBUGS] Successfully parsed file /home/hudson/genie.tcf/.jenkins/jobs/tcf-1.4/workspace/target_explorer/plugins/org.eclipse.tcf.te.ui.swt/target/findbugsXml.xml with 31 unique warnings and 0 duplicates.
[FINDBUGS] Successfully parsed file /home/hudson/genie.tcf/.jenkins/jobs/tcf-1.4/workspace/target_explorer/plugins/org.eclipse.tcf.te.ui.views/target/findbugsXml.xml with 31 unique warnings and 0 duplicates.
[FINDBUGS] Successfully parsed file /home/hudson/genie.tcf/.jenkins/jobs/tcf-1.4/workspace/target_explorer/plugins/org.eclipse.tcf.te.ui/target/findbugsXml.xml with 31 unique warnings and 0 duplicates.
[FINDBUGS] Successfully parsed file /home/hudson/genie.tcf/.jenkins/jobs/tcf-1.4/workspace/target_explorer/plugins/org.eclipse.tcf.te/target/findbugsXml.xml with 31 unique warnings and 0 duplicates.
[FINDBUGS] Successfully parsed file /home/hudson/genie.tcf/.jenkins/jobs/tcf-1.4/workspace/tests/plugins/org.eclipse.tcf.debug.test/target/findbugsXml.xml with 34 unique warnings and 0 duplicates.
<Git Blamer> Using GitBlamer to create author and commit information for all warnings.
<Git Blamer> GIT_COMMIT=a4ab4daad2137e57e05a014cff73ada669a5b15c, workspace=/home/hudson/genie.tcf/.jenkins/jobs/tcf-1.4/workspace
 > /usr/local/bin/git rev-parse a4ab4daad2137e57e05a014cff73ada669a5b15c^{commit} # timeout=10
[FINDBUGS] Computing warning deltas based on reference build #12
Sending e-mails to: mober.at+eclipse@gmail.com eugene.tarassov@xilinx.com uwe.st@kaos-group.de
Recording test results
Build step 'Publish JUnit test result report' changed build result to UNSTABLE
Archiving artifacts
Started calculate disk usage of build
Finished Calculation of disk usage of build in 0 seconds
Started calculate disk usage of workspace
Finished Calculation of disk usage of workspace in 0 seconds
Finished: UNSTABLE