UnstableConsole Output

Skipping 2,208 KB.. Full Log
e /jobs/genie.tcf/tcf-1.4/workspace/tests/plugins/org.eclipse.tcf.debug.test/plugin.properties not found
[WARNING] Bundle-Vendor header not found in /jobs/genie.tcf/tcf-1.4/workspace/tests/plugins/org.eclipse.tcf.debug.test/META-INF/MANIFEST.MF, fallback to 'unknown' for source bundle
[INFO] Building jar: /jobs/genie.tcf/tcf-1.4/workspace/tests/plugins/org.eclipse.tcf.debug.test/target/org.eclipse.tcf.debug.test-1.4.0.qualifier-sources.jar
[INFO] 
[INFO] --- target-platform-configuration:0.22.0:target-platform (default-target-platform) @ org.eclipse.tcf.debug.test ---
[INFO] 
[INFO] --- tycho-packaging-plugin:0.22.0:package-plugin (default-package-plugin) @ org.eclipse.tcf.debug.test ---
[WARNING] /jobs/genie.tcf/tcf-1.4/workspace/tests/plugins/org.eclipse.tcf.debug.test/build.properties: bin.includes value(s) [data/] do not match any files.
[INFO] Building jar: /jobs/genie.tcf/tcf-1.4/workspace/tests/plugins/org.eclipse.tcf.debug.test/target/org.eclipse.tcf.debug.test-1.4.0.qualifier.jar
[INFO] 
[INFO] --- tycho-p2-plugin:0.22.0:p2-metadata-default (default-p2-metadata-default) @ org.eclipse.tcf.debug.test ---
[INFO] 
[INFO] --- tycho-p2-plugin:0.22.0:p2-metadata (p2-metadata) @ org.eclipse.tcf.debug.test ---
[INFO] 
[INFO] --- tycho-surefire-plugin:0.22.0:test (default-test) @ org.eclipse.tcf.debug.test ---
[INFO] Publishing 2 bundles to /jobs/genie.tcf/tcf-1.4/workspace/tests/plugins/org.eclipse.tcf.debug.test/target/p2temp/additionalBundles
[INFO] Command line:
	[/opt/public/common/jdk1.7.0_80/jre/bin/java, -jar, /jobs/genie.tcf/tcf-1.4/workspace/.repository/org/eclipse/tycho/tycho-bundles-external/0.22.0/eclipse/plugins/org.eclipse.equinox.launcher_1.3.0.v20140415-2008.jar, -configuration, /tmp/genie.tcf/tycho-p2-runtime5657614610038974561.tmp/configuration, -nosplash, -application, org.eclipse.equinox.p2.publisher.FeaturesAndBundlesPublisher, -artifactRepository, file:/jobs/genie.tcf/tcf-1.4/workspace/target_explorer/plugins/org.eclipse.tcf.te.tests/target/p2temp/additionalBundles/, -metadataRepository, file:/jobs/genie.tcf/tcf-1.4/workspace/target_explorer/plugins/org.eclipse.tcf.te.tests/target/p2temp/additionalBundles/, -compress, -publishArtifacts, -source, /jobs/genie.tcf/tcf-1.4/workspace/target_explorer/plugins/org.eclipse.tcf.te.tests/target/p2temp/additionalBundles, -artifactRepository, file:/jobs/genie.tcf/tcf-1.4/workspace/tests/plugins/org.eclipse.tcf.debug.test/target/p2temp/additionalBundles/, -metadataRepository, file:/jobs/genie.tcf/tcf-1.4/workspace/tests/plugins/org.eclipse.tcf.debug.test/target/p2temp/additionalBundles/, -compress, -publishArtifacts, -source, /jobs/genie.tcf/tcf-1.4/workspace/tests/plugins/org.eclipse.tcf.debug.test/target/p2temp/additionalBundles]
Picked up JAVA_TOOL_OPTIONS: -Xmx2G -Djava.io.tmpdir=/tmp/genie.tcf
Generating metadata for ..
Generation completed with success [1 seconds].
[INFO] Installing IUs [org.eclipse.tcf.debug.test, org.eclipse.tycho.surefire.osgibooter, org.eclipse.tycho.surefire.junit4, org.eclipse.platform.ide, org.eclipse.sdk.feature.group, org.eclipse.cdt.platform.feature.group, org.eclipse.remote.feature.group, org.eclipse.swtbot.eclipse.feature.group] to /jobs/genie.tcf/tcf-1.4/workspace/tests/plugins/org.eclipse.tcf.debug.test/target/work
Installing org.eclipse.tcf.debug.test 1.4.0.201508201659.
Installing org.eclipse.tycho.surefire.osgibooter 0.22.0.
Installing org.eclipse.tycho.surefire.junit4 0.22.0.
Installing org.eclipse.platform.ide 3.8.2.M20130131-0800.
Installing org.eclipse.sdk.feature.group 3.8.2.v20130116-114247-7Q85DVDQQ3JLtb_hNUm3_MTesRM5RqdjCSfXEI7waiJ_N.
Installing org.eclipse.cdt.platform.feature.group 8.3.0.201402142303.
Installing org.eclipse.remote.feature.group 2.0.0.201507010000.
Installing org.eclipse.swtbot.eclipse.feature.group 2.2.0.201401081015.
Operation completed in 744410 ms.
[INFO] Expected eclipse log file: /jobs/genie.tcf/tcf-1.4/workspace/tests/plugins/org.eclipse.tcf.debug.test/target/work/data/.metadata/.log
[INFO] Command line:
	[/opt/public/common/jdk1.7.0_80/jre/bin/java, -Dosgi.noShutdown=false, -Dosgi.os=linux, -Dosgi.ws=gtk, -Dosgi.arch=x86_64, -javaagent:/home/hudson/genie.tcf/.jenkins/jobs/tcf-1.4/workspace/.repository/org/jacoco/org.jacoco.agent/0.7.4.201502262128/org.jacoco.agent-0.7.4.201502262128-runtime.jar=destfile=/jobs/genie.tcf/tcf-1.4/workspace/tests/plugins/org.eclipse.tcf.debug.test/target/jacoco.exec,append=true,includes=org.eclipse.tcf*,excludes=org.eclipse.tcf.debug.test*:org.eclipse.tcf.te.tests.*,dumponexit=true,output=file, -Xmx512m, -XX:MaxPermSize=256m, -Dosgi.clean=true, -Dosgi.debug=/jobs/genie.tcf/tcf-1.4/workspace/tests/plugins/org.eclipse.tcf.debug.test/tracing/.options, -Dtcf.agent.path=/home/hudson/genie.tcf/.jenkins/jobs/tcf-1.4/workspace/.agent, -jar, /jobs/genie.tcf/tcf-1.4/workspace/tests/plugins/org.eclipse.tcf.debug.test/target/work/plugins/org.eclipse.equinox.launcher_1.3.0.v20120522-1813.jar, -debug, -consolelog, -data, /jobs/genie.tcf/tcf-1.4/workspace/tests/plugins/org.eclipse.tcf.debug.test/target/work/data, -install, /jobs/genie.tcf/tcf-1.4/workspace/tests/plugins/org.eclipse.tcf.debug.test/target/work, -configuration, /jobs/genie.tcf/tcf-1.4/workspace/tests/plugins/org.eclipse.tcf.debug.test/target/work/configuration, -application, org.eclipse.tycho.surefire.osgibooter.uitest, -testproperties, /jobs/genie.tcf/tcf-1.4/workspace/tests/plugins/org.eclipse.tcf.debug.test/target/surefire.properties, -testApplication, org.eclipse.ui.ide.workbench, -product, org.eclipse.platform.ide, -nouithread]
Picked up JAVA_TOOL_OPTIONS: -Xmx2G -Djava.io.tmpdir=/tmp/genie.tcf
Configuration location:
    file:/jobs/genie.tcf/tcf-1.4/workspace/tests/plugins/org.eclipse.tcf.debug.test/target/work/configuration/
Configuration file:
    file:/jobs/genie.tcf/tcf-1.4/workspace/tests/plugins/org.eclipse.tcf.debug.test/target/work/configuration/config.ini loaded
Install location:
    file:/jobs/genie.tcf/tcf-1.4/workspace/tests/plugins/org.eclipse.tcf.debug.test/target/work/
Framework located:
    file:/jobs/genie.tcf/tcf-1.4/workspace/tests/plugins/org.eclipse.tcf.debug.test/target/work/plugins/org.eclipse.osgi_3.8.2.v20130124-134944.jar
Framework classpath:
    file:/jobs/genie.tcf/tcf-1.4/workspace/tests/plugins/org.eclipse.tcf.debug.test/target/work/plugins/org.eclipse.osgi_3.8.2.v20130124-134944.jar
Debug options:
    file:/jobs/genie.tcf/tcf-1.4/workspace/tests/plugins/org.eclipse.tcf.debug.test/tracing/.options not found
Time to load bundles: 27
Starting application: 22083
Launching application org.eclipse.ui.ide.workbench...
Cannot send datagram packet to /172.25.255.255
java.io.IOException: Operation not permitted
	at java.net.PlainDatagramSocketImpl.send(Native Method)
	at java.net.DatagramSocket.send(DatagramSocket.java:698)
	at org.eclipse.tcf.internal.services.local.LocatorService.sendDatagramPacket(LocatorService.java:774)
	at org.eclipse.tcf.internal.services.local.LocatorService.sendPeersRequest(LocatorService.java:851)
	at org.eclipse.tcf.internal.services.local.LocatorService.refresh_timer(LocatorService.java:554)
	at org.eclipse.tcf.internal.services.local.LocatorService.access$1(LocatorService.java:512)
	at org.eclipse.tcf.internal.services.local.LocatorService$1$1.run(LocatorService.java:184)
	at org.eclipse.tcf.protocol.Protocol$3.run(Protocol.java:219)
	at org.eclipse.tcf.EventQueue.run(EventQueue.java:95)
	at java.lang.Thread.run(Thread.java:745)
!SESSION 2018-02-06 12:48:26.850 -----------------------------------------------
eclipse.buildId=M20130131-0800
java.version=1.7.0_80
java.vendor=Oracle Corporation
BootLoader constants: OS=linux, ARCH=x86_64, WS=gtk, NL=en_US
Framework arguments:  -application org.eclipse.tycho.surefire.osgibooter.uitest -testproperties /jobs/genie.tcf/tcf-1.4/workspace/tests/plugins/org.eclipse.tcf.debug.test/target/surefire.properties -testApplication org.eclipse.ui.ide.workbench -product org.eclipse.platform.ide -nouithread
Command-line arguments:  -debug -consolelog -data /jobs/genie.tcf/tcf-1.4/workspace/tests/plugins/org.eclipse.tcf.debug.test/target/work/data -application org.eclipse.tycho.surefire.osgibooter.uitest -testproperties /jobs/genie.tcf/tcf-1.4/workspace/tests/plugins/org.eclipse.tcf.debug.test/target/surefire.properties -testApplication org.eclipse.ui.ide.workbench -product org.eclipse.platform.ide -nouithread

!ENTRY org.eclipse.tcf 4 0 2018-02-06 12:49:00.337
!MESSAGE Cannot send datagram packet to /172.25.255.255
!STACK 0
java.io.IOException: Operation not permitted
	at java.net.PlainDatagramSocketImpl.send(Native Method)
	at java.net.DatagramSocket.send(DatagramSocket.java:698)
	at org.eclipse.tcf.internal.services.local.LocatorService.sendDatagramPacket(LocatorService.java:774)
	at org.eclipse.tcf.internal.services.local.LocatorService.sendPeersRequest(LocatorService.java:851)
	at org.eclipse.tcf.internal.services.local.LocatorService.refresh_timer(LocatorService.java:554)
	at org.eclipse.tcf.internal.services.local.LocatorService.access$1(LocatorService.java:512)
	at org.eclipse.tcf.internal.services.local.LocatorService$1$1.run(LocatorService.java:184)
	at org.eclipse.tcf.protocol.Protocol$3.run(Protocol.java:219)
	at org.eclipse.tcf.EventQueue.run(EventQueue.java:95)
	at java.lang.Thread.run(Thread.java:745)
Application Started: 98250

-------------------------------------------------------
 T E S T S
-------------------------------------------------------
Running org.eclipse.tcf.debug.test.TransactionTests
Tests run: 5, Failures: 0, Errors: 0, Skipped: 0, Time elapsed: 0.146 sec - in org.eclipse.tcf.debug.test.TransactionTests
testSumTransaction(org.eclipse.tcf.debug.test.TransactionTests)  Time elapsed: 0.04 sec
testSingleTransactionUnchecked(org.eclipse.tcf.debug.test.TransactionTests)  Time elapsed: 0.002 sec
testSumTransactionUnchecked(org.eclipse.tcf.debug.test.TransactionTests)  Time elapsed: 0.001 sec
testSumTransactionIterative(org.eclipse.tcf.debug.test.TransactionTests)  Time elapsed: 0.001 sec
testSingleTransaction(org.eclipse.tcf.debug.test.TransactionTests)  Time elapsed: 0.001 sec
Running org.eclipse.tcf.debug.test.RunControlCMTest

=== testStateResetOnResumeSuspend started at: February 6, 2018 12:50:07 PM EST
=== testStateResetOnResumeSuspend finished at: February 6, 2018 12:50:28 PM EST (duration: 20859 ms)

!ENTRY org.eclipse.tcf.te.tests 4 1 2018-02-06 12:50:28.660
!MESSAGE Test case 'testStateResetOnResumeSuspend(org.eclipse.tcf.debug.test.RunControlCMTest)' failed. Failure: Agent process died with exit code 127
!STACK 0
junit.framework.AssertionFailedError: Agent process died with exit code 127
	at junit.framework.Assert.fail(Assert.java:50)
	at junit.framework.Assert.assertTrue(Assert.java:20)
	at junit.framework.Assert.assertNotNull(Assert.java:218)
	at org.eclipse.tcf.te.tests.tcf.TcfTestCase.launchAgent(TcfTestCase.java:140)
	at org.eclipse.tcf.te.tests.tcf.TcfTestCase.setUp(TcfTestCase.java:61)
	at org.eclipse.tcf.debug.test.AbstractCMTest.setUp(AbstractCMTest.java:150)
	at junit.framework.TestCase.runBare(TestCase.java:132)
	at org.eclipse.tcf.te.tests.CoreTestCase.runBare(CoreTestCase.java:256)
	at junit.framework.TestResult$1.protect(TestResult.java:110)
	at junit.framework.TestResult.runProtected(TestResult.java:128)
	at junit.framework.TestResult.run(TestResult.java:113)
	at junit.framework.TestCase.run(TestCase.java:124)
	at org.eclipse.tcf.te.tests.CoreTestCase.run(CoreTestCase.java:233)
	at junit.framework.TestSuite.runTest(TestSuite.java:243)
	at junit.framework.TestSuite.run(TestSuite.java:238)
	at org.junit.internal.runners.JUnit38ClassRunner.run(JUnit38ClassRunner.java:83)
	at org.apache.maven.surefire.junit4.JUnit4Provider.execute(JUnit4Provider.java:264)
	at org.apache.maven.surefire.junit4.JUnit4Provider.executeTestSet(JUnit4Provider.java:153)
	at org.apache.maven.surefire.junit4.JUnit4Provider.invoke(JUnit4Provider.java:124)
	at sun.reflect.NativeMethodAccessorImpl.invoke0(Native Method)
	at sun.reflect.NativeMethodAccessorImpl.invoke(NativeMethodAccessorImpl.java:57)
	at sun.reflect.DelegatingMethodAccessorImpl.invoke(DelegatingMethodAccessorImpl.java:43)
	at java.lang.reflect.Method.invoke(Method.java:606)
	at org.apache.maven.surefire.util.ReflectionUtils.invokeMethodWithArray2(ReflectionUtils.java:208)
	at org.apache.maven.surefire.booter.ProviderFactory$ProviderProxy.invoke(ProviderFactory.java:156)
	at org.apache.maven.surefire.booter.ProviderFactory.invokeProvider(ProviderFactory.java:82)
	at org.eclipse.tycho.surefire.osgibooter.OsgiSurefireBooter.run(OsgiSurefireBooter.java:91)
	at org.eclipse.tycho.surefire.osgibooter.AbstractUITestApplication.runTests(AbstractUITestApplication.java:44)
	at org.eclipse.ui.internal.testing.WorkbenchTestable$1.run(WorkbenchTestable.java:71)
	at java.lang.Thread.run(Thread.java:745)

=== testStateResetOnTerminate started at: February 6, 2018 12:50:28 PM EST
=== testStateResetOnTerminate finished at: February 6, 2018 12:50:28 PM EST (duration: 3 ms)

!ENTRY org.eclipse.tcf.te.tests 4 1 2018-02-06 12:50:28.667
!MESSAGE Test case 'testStateResetOnTerminate(org.eclipse.tcf.debug.test.RunControlCMTest)' failed. Failure: Agent process died with exit code 127
!STACK 0
junit.framework.AssertionFailedError: Agent process died with exit code 127
	at junit.framework.Assert.fail(Assert.java:50)
	at junit.framework.Assert.assertTrue(Assert.java:20)
	at junit.framework.Assert.assertNotNull(Assert.java:218)
	at org.eclipse.tcf.te.tests.tcf.TcfTestCase.launchAgent(TcfTestCase.java:140)
	at org.eclipse.tcf.te.tests.tcf.TcfTestCase.setUp(TcfTestCase.java:61)
	at org.eclipse.tcf.debug.test.AbstractCMTest.setUp(AbstractCMTest.java:150)
	at junit.framework.TestCase.runBare(TestCase.java:132)
	at org.eclipse.tcf.te.tests.CoreTestCase.runBare(CoreTestCase.java:256)
	at junit.framework.TestResult$1.protect(TestResult.java:110)
	at junit.framework.TestResult.runProtected(TestResult.java:128)
	at junit.framework.TestResult.run(TestResult.java:113)
	at junit.framework.TestCase.run(TestCase.java:124)
	at org.eclipse.tcf.te.tests.CoreTestCase.run(CoreTestCase.java:233)
	at junit.framework.TestSuite.runTest(TestSuite.java:243)
	at junit.framework.TestSuite.run(TestSuite.java:238)
	at org.junit.internal.runners.JUnit38ClassRunner.run(JUnit38ClassRunner.java:83)
	at org.apache.maven.surefire.junit4.JUnit4Provider.execute(JUnit4Provider.java:264)
	at org.apache.maven.surefire.junit4.JUnit4Provider.executeTestSet(JUnit4Provider.java:153)
	at org.apache.maven.surefire.junit4.JUnit4Provider.invoke(JUnit4Provider.java:124)
	at sun.reflect.NativeMethodAccessorImpl.invoke0(Native Method)
	at sun.reflect.NativeMethodAccessorImpl.invoke(NativeMethodAccessorImpl.java:57)
	at sun.reflect.DelegatingMethodAccessorImpl.invoke(DelegatingMethodAccessorImpl.java:43)
	at java.lang.reflect.Method.invoke(Method.java:606)
	at org.apache.maven.surefire.util.ReflectionUtils.invokeMethodWithArray2(ReflectionUtils.java:208)
	at org.apache.maven.surefire.booter.ProviderFactory$ProviderProxy.invoke(ProviderFactory.java:156)
	at org.apache.maven.surefire.booter.ProviderFactory.invokeProvider(ProviderFactory.java:82)
	at org.eclipse.tycho.surefire.osgibooter.OsgiSurefireBooter.run(OsgiSurefireBooter.java:91)
	at org.eclipse.tycho.surefire.osgibooter.AbstractUITestApplication.runTests(AbstractUITestApplication.java:44)
	at org.eclipse.ui.internal.testing.WorkbenchTestable$1.run(WorkbenchTestable.java:71)
	at java.lang.Thread.run(Thread.java:745)

=== testRunControlCMChildrenInvalidation started at: February 6, 2018 12:50:28 PM EST
=== testRunControlCMChildrenInvalidation finished at: February 6, 2018 12:50:28 PM EST (duration: 2 ms)

!ENTRY org.eclipse.tcf.te.tests 4 1 2018-02-06 12:50:28.671
!MESSAGE Test case 'testRunControlCMChildrenInvalidation(org.eclipse.tcf.debug.test.RunControlCMTest)' failed. Failure: Agent process died with exit code 127
!STACK 0
junit.framework.AssertionFailedError: Agent process died with exit code 127
	at junit.framework.Assert.fail(Assert.java:50)
	at junit.framework.Assert.assertTrue(Assert.java:20)
	at junit.framework.Assert.assertNotNull(Assert.java:218)
	at org.eclipse.tcf.te.tests.tcf.TcfTestCase.launchAgent(TcfTestCase.java:140)
	at org.eclipse.tcf.te.tests.tcf.TcfTestCase.setUp(TcfTestCase.java:61)
	at org.eclipse.tcf.debug.test.AbstractCMTest.setUp(AbstractCMTest.java:150)
	at junit.framework.TestCase.runBare(TestCase.java:132)
	at org.eclipse.tcf.te.tests.CoreTestCase.runBare(CoreTestCase.java:256)
	at junit.framework.TestResult$1.protect(TestResult.java:110)
	at junit.framework.TestResult.runProtected(TestResult.java:128)
	at junit.framework.TestResult.run(TestResult.java:113)
	at junit.framework.TestCase.run(TestCase.java:124)
	at org.eclipse.tcf.te.tests.CoreTestCase.run(CoreTestCase.java:233)
	at junit.framework.TestSuite.runTest(TestSuite.java:243)
	at junit.framework.TestSuite.run(TestSuite.java:238)
	at org.junit.internal.runners.JUnit38ClassRunner.run(JUnit38ClassRunner.java:83)
	at org.apache.maven.surefire.junit4.JUnit4Provider.execute(JUnit4Provider.java:264)
	at org.apache.maven.surefire.junit4.JUnit4Provider.executeTestSet(JUnit4Provider.java:153)
	at org.apache.maven.surefire.junit4.JUnit4Provider.invoke(JUnit4Provider.java:124)
	at sun.reflect.NativeMethodAccessorImpl.invoke0(Native Method)
	at sun.reflect.NativeMethodAccessorImpl.invoke(NativeMethodAccessorImpl.java:57)
	at sun.reflect.DelegatingMethodAccessorImpl.invoke(DelegatingMethodAccessorImpl.java:43)
	at java.lang.reflect.Method.invoke(Method.java:606)
	at org.apache.maven.surefire.util.ReflectionUtils.invokeMethodWithArray2(ReflectionUtils.java:208)
	at org.apache.maven.surefire.booter.ProviderFactory$ProviderProxy.invoke(ProviderFactory.java:156)
	at org.apache.maven.surefire.booter.ProviderFactory.invokeProvider(ProviderFactory.java:82)
	at org.eclipse.tycho.surefire.osgibooter.OsgiSurefireBooter.run(OsgiSurefireBooter.java:91)
	at org.eclipse.tycho.surefire.osgibooter.AbstractUITestApplication.runTests(AbstractUITestApplication.java:44)
	at org.eclipse.ui.internal.testing.WorkbenchTestable$1.run(WorkbenchTestable.java:71)
	at java.lang.Thread.run(Thread.java:745)

=== testChildrenResetOnAddedRemoved started at: February 6, 2018 12:50:28 PM EST
=== testChildrenResetOnAddedRemoved finished at: February 6, 2018 12:50:28 PM EST (duration: 2 ms)

!ENTRY org.eclipse.tcf.te.tests 4 1 2018-02-06 12:50:28.675
!MESSAGE Test case 'testChildrenResetOnAddedRemoved(org.eclipse.tcf.debug.test.RunControlCMTest)' failed. Failure: Agent process died with exit code 127
!STACK 0
junit.framework.AssertionFailedError: Agent process died with exit code 127
	at junit.framework.Assert.fail(Assert.java:50)
	at junit.framework.Assert.assertTrue(Assert.java:20)
	at junit.framework.Assert.assertNotNull(Assert.java:218)
	at org.eclipse.tcf.te.tests.tcf.TcfTestCase.launchAgent(TcfTestCase.java:140)
	at org.eclipse.tcf.te.tests.tcf.TcfTestCase.setUp(TcfTestCase.java:61)
	at org.eclipse.tcf.debug.test.AbstractCMTest.setUp(AbstractCMTest.java:150)
	at junit.framework.TestCase.runBare(TestCase.java:132)
	at org.eclipse.tcf.te.tests.CoreTestCase.runBare(CoreTestCase.java:256)
	at junit.framework.TestResult$1.protect(TestResult.java:110)
	at junit.framework.TestResult.runProtected(TestResult.java:128)
	at junit.framework.TestResult.run(TestResult.java:113)
	at junit.framework.TestCase.run(TestCase.java:124)
	at org.eclipse.tcf.te.tests.CoreTestCase.run(CoreTestCase.java:233)
	at junit.framework.TestSuite.runTest(TestSuite.java:243)
	at junit.framework.TestSuite.run(TestSuite.java:238)
	at org.junit.internal.runners.JUnit38ClassRunner.run(JUnit38ClassRunner.java:83)
	at org.apache.maven.surefire.junit4.JUnit4Provider.execute(JUnit4Provider.java:264)
	at org.apache.maven.surefire.junit4.JUnit4Provider.executeTestSet(JUnit4Provider.java:153)
	at org.apache.maven.surefire.junit4.JUnit4Provider.invoke(JUnit4Provider.java:124)
	at sun.reflect.NativeMethodAccessorImpl.invoke0(Native Method)
	at sun.reflect.NativeMethodAccessorImpl.invoke(NativeMethodAccessorImpl.java:57)
	at sun.reflect.DelegatingMethodAccessorImpl.invoke(DelegatingMethodAccessorImpl.java:43)
	at java.lang.reflect.Method.invoke(Method.java:606)
	at org.apache.maven.surefire.util.ReflectionUtils.invokeMethodWithArray2(ReflectionUtils.java:208)
	at org.apache.maven.surefire.booter.ProviderFactory$ProviderProxy.invoke(ProviderFactory.java:156)
	at org.apache.maven.surefire.booter.ProviderFactory.invokeProvider(ProviderFactory.java:82)
	at org.eclipse.tycho.surefire.osgibooter.OsgiSurefireBooter.run(OsgiSurefireBooter.java:91)
	at org.eclipse.tycho.surefire.osgibooter.AbstractUITestApplication.runTests(AbstractUITestApplication.java:44)
	at org.eclipse.ui.internal.testing.WorkbenchTestable$1.run(WorkbenchTestable.java:71)
	at java.lang.Thread.run(Thread.java:745)

=== testMappingCommandCaches started at: February 6, 2018 12:50:28 PM EST
=== testMappingCommandCaches finished at: February 6, 2018 12:50:28 PM EST (duration: 2 ms)

!ENTRY org.eclipse.tcf.te.tests 4 1 2018-02-06 12:50:28.679
!MESSAGE Test case 'testMappingCommandCaches(org.eclipse.tcf.debug.test.RunControlCMTest)' failed. Failure: Agent process died with exit code 127
!STACK 0
junit.framework.AssertionFailedError: Agent process died with exit code 127
	at junit.framework.Assert.fail(Assert.java:50)
	at junit.framework.Assert.assertTrue(Assert.java:20)
	at junit.framework.Assert.assertNotNull(Assert.java:218)
	at org.eclipse.tcf.te.tests.tcf.TcfTestCase.launchAgent(TcfTestCase.java:140)
	at org.eclipse.tcf.te.tests.tcf.TcfTestCase.setUp(TcfTestCase.java:61)
	at org.eclipse.tcf.debug.test.AbstractCMTest.setUp(AbstractCMTest.java:150)
	at junit.framework.TestCase.runBare(TestCase.java:132)
	at org.eclipse.tcf.te.tests.CoreTestCase.runBare(CoreTestCase.java:256)
	at junit.framework.TestResult$1.protect(TestResult.java:110)
	at junit.framework.TestResult.runProtected(TestResult.java:128)
	at junit.framework.TestResult.run(TestResult.java:113)
	at junit.framework.TestCase.run(TestCase.java:124)
	at org.eclipse.tcf.te.tests.CoreTestCase.run(CoreTestCase.java:233)
	at junit.framework.TestSuite.runTest(TestSuite.java:243)
	at junit.framework.TestSuite.run(TestSuite.java:238)
	at org.junit.internal.runners.JUnit38ClassRunner.run(JUnit38ClassRunner.java:83)
	at org.apache.maven.surefire.junit4.JUnit4Provider.execute(JUnit4Provider.java:264)
	at org.apache.maven.surefire.junit4.JUnit4Provider.executeTestSet(JUnit4Provider.java:153)
	at org.apache.maven.surefire.junit4.JUnit4Provider.invoke(JUnit4Provider.java:124)
	at sun.reflect.NativeMethodAccessorImpl.invoke0(Native Method)
	at sun.reflect.NativeMethodAccessorImpl.invoke(NativeMethodAccessorImpl.java:57)
	at sun.reflect.DelegatingMethodAccessorImpl.invoke(DelegatingMethodAccessorImpl.java:43)
	at java.lang.reflect.Method.invoke(Method.java:606)
	at org.apache.maven.surefire.util.ReflectionUtils.invokeMethodWithArray2(ReflectionUtils.java:208)
	at org.apache.maven.surefire.booter.ProviderFactory$ProviderProxy.invoke(ProviderFactory.java:156)
	at org.apache.maven.surefire.booter.ProviderFactory.invokeProvider(ProviderFactory.java:82)
	at org.eclipse.tycho.surefire.osgibooter.OsgiSurefireBooter.run(OsgiSurefireBooter.java:91)
	at org.eclipse.tycho.surefire.osgibooter.AbstractUITestApplication.runTests(AbstractUITestApplication.java:44)
	at org.eclipse.ui.internal.testing.WorkbenchTestable$1.run(WorkbenchTestable.java:71)
	at java.lang.Thread.run(Thread.java:745)
Tests run: 5, Failures: 5, Errors: 0, Skipped: 0, Time elapsed: 22.45 sec <<< FAILURE! - in org.eclipse.tcf.debug.test.RunControlCMTest
testStateResetOnResumeSuspend(org.eclipse.tcf.debug.test.RunControlCMTest)  Time elapsed: 20.863 sec  <<< FAILURE!
junit.framework.AssertionFailedError: Agent process died with exit code 127
	at junit.framework.Assert.fail(Assert.java:50)
	at junit.framework.Assert.assertTrue(Assert.java:20)
	at junit.framework.Assert.assertNotNull(Assert.java:218)
	at org.eclipse.tcf.te.tests.tcf.TcfTestCase.launchAgent(TcfTestCase.java:140)
	at org.eclipse.tcf.te.tests.tcf.TcfTestCase.setUp(TcfTestCase.java:61)
	at org.eclipse.tcf.debug.test.AbstractCMTest.setUp(AbstractCMTest.java:150)
	at junit.framework.TestCase.runBare(TestCase.java:132)
	at org.eclipse.tcf.te.tests.CoreTestCase.runBare(CoreTestCase.java:256)
	at junit.framework.TestResult$1.protect(TestResult.java:110)
	at junit.framework.TestResult.runProtected(TestResult.java:128)
	at junit.framework.TestResult.run(TestResult.java:113)
	at junit.framework.TestCase.run(TestCase.java:124)
	at org.eclipse.tcf.te.tests.CoreTestCase.run(CoreTestCase.java:233)
	at junit.framework.TestSuite.runTest(TestSuite.java:243)
	at junit.framework.TestSuite.run(TestSuite.java:238)
	at org.junit.internal.runners.JUnit38ClassRunner.run(JUnit38ClassRunner.java:83)
	at org.apache.maven.surefire.junit4.JUnit4Provider.execute(JUnit4Provider.java:264)
	at org.apache.maven.surefire.junit4.JUnit4Provider.executeTestSet(JUnit4Provider.java:153)
	at org.apache.maven.surefire.junit4.JUnit4Provider.invoke(JUnit4Provider.java:124)
	at sun.reflect.NativeMethodAccessorImpl.invoke0(Native Method)
	at sun.reflect.NativeMethodAccessorImpl.invoke(NativeMethodAccessorImpl.java:57)
	at sun.reflect.DelegatingMethodAccessorImpl.invoke(DelegatingMethodAccessorImpl.java:43)
	at java.lang.reflect.Method.invoke(Method.java:606)
	at org.apache.maven.surefire.util.ReflectionUtils.invokeMethodWithArray2(ReflectionUtils.java:208)
	at org.apache.maven.surefire.booter.ProviderFactory$ProviderProxy.invoke(ProviderFactory.java:156)
	at org.apache.maven.surefire.booter.ProviderFactory.invokeProvider(ProviderFactory.java:82)
	at org.eclipse.tycho.surefire.osgibooter.OsgiSurefireBooter.run(OsgiSurefireBooter.java:91)
	at org.eclipse.tycho.surefire.osgibooter.AbstractUITestApplication.runTests(AbstractUITestApplication.java:44)
	at org.eclipse.ui.internal.testing.WorkbenchTestable$1.run(WorkbenchTestable.java:71)
	at java.lang.Thread.run(Thread.java:745)

testStateResetOnTerminate(org.eclipse.tcf.debug.test.RunControlCMTest)  Time elapsed: 0.004 sec  <<< FAILURE!
junit.framework.AssertionFailedError: Agent process died with exit code 127
	at junit.framework.Assert.fail(Assert.java:50)
	at junit.framework.Assert.assertTrue(Assert.java:20)
	at junit.framework.Assert.assertNotNull(Assert.java:218)
	at org.eclipse.tcf.te.tests.tcf.TcfTestCase.launchAgent(TcfTestCase.java:140)
	at org.eclipse.tcf.te.tests.tcf.TcfTestCase.setUp(TcfTestCase.java:61)
	at org.eclipse.tcf.debug.test.AbstractCMTest.setUp(AbstractCMTest.java:150)
	at junit.framework.TestCase.runBare(TestCase.java:132)
	at org.eclipse.tcf.te.tests.CoreTestCase.runBare(CoreTestCase.java:256)
	at junit.framework.TestResult$1.protect(TestResult.java:110)
	at junit.framework.TestResult.runProtected(TestResult.java:128)
	at junit.framework.TestResult.run(TestResult.java:113)
	at junit.framework.TestCase.run(TestCase.java:124)
	at org.eclipse.tcf.te.tests.CoreTestCase.run(CoreTestCase.java:233)
	at junit.framework.TestSuite.runTest(TestSuite.java:243)
	at junit.framework.TestSuite.run(TestSuite.java:238)
	at org.junit.internal.runners.JUnit38ClassRunner.run(JUnit38ClassRunner.java:83)
	at org.apache.maven.surefire.junit4.JUnit4Provider.execute(JUnit4Provider.java:264)
	at org.apache.maven.surefire.junit4.JUnit4Provider.executeTestSet(JUnit4Provider.java:153)
	at org.apache.maven.surefire.junit4.JUnit4Provider.invoke(JUnit4Provider.java:124)
	at sun.reflect.NativeMethodAccessorImpl.invoke0(Native Method)
	at sun.reflect.NativeMethodAccessorImpl.invoke(NativeMethodAccessorImpl.java:57)
	at sun.reflect.DelegatingMethodAccessorImpl.invoke(DelegatingMethodAccessorImpl.java:43)
	at java.lang.reflect.Method.invoke(Method.java:606)
	at org.apache.maven.surefire.util.ReflectionUtils.invokeMethodWithArray2(ReflectionUtils.java:208)
	at org.apache.maven.surefire.booter.ProviderFactory$ProviderProxy.invoke(ProviderFactory.java:156)
	at org.apache.maven.surefire.booter.ProviderFactory.invokeProvider(ProviderFactory.java:82)
	at org.eclipse.tycho.surefire.osgibooter.OsgiSurefireBooter.run(OsgiSurefireBooter.java:91)
	at org.eclipse.tycho.surefire.osgibooter.AbstractUITestApplication.runTests(AbstractUITestApplication.java:44)
	at org.eclipse.ui.internal.testing.WorkbenchTestable$1.run(WorkbenchTestable.java:71)
	at java.lang.Thread.run(Thread.java:745)

testRunControlCMChildrenInvalidation(org.eclipse.tcf.debug.test.RunControlCMTest)  Time elapsed: 0.002 sec  <<< FAILURE!
junit.framework.AssertionFailedError: Agent process died with exit code 127
	at junit.framework.Assert.fail(Assert.java:50)
	at junit.framework.Assert.assertTrue(Assert.java:20)
	at junit.framework.Assert.assertNotNull(Assert.java:218)
	at org.eclipse.tcf.te.tests.tcf.TcfTestCase.launchAgent(TcfTestCase.java:140)
	at org.eclipse.tcf.te.tests.tcf.TcfTestCase.setUp(TcfTestCase.java:61)
	at org.eclipse.tcf.debug.test.AbstractCMTest.setUp(AbstractCMTest.java:150)
	at junit.framework.TestCase.runBare(TestCase.java:132)
	at org.eclipse.tcf.te.tests.CoreTestCase.runBare(CoreTestCase.java:256)
	at junit.framework.TestResult$1.protect(TestResult.java:110)
	at junit.framework.TestResult.runProtected(TestResult.java:128)
	at junit.framework.TestResult.run(TestResult.java:113)
	at junit.framework.TestCase.run(TestCase.java:124)
	at org.eclipse.tcf.te.tests.CoreTestCase.run(CoreTestCase.java:233)
	at junit.framework.TestSuite.runTest(TestSuite.java:243)
	at junit.framework.TestSuite.run(TestSuite.java:238)
	at org.junit.internal.runners.JUnit38ClassRunner.run(JUnit38ClassRunner.java:83)
	at org.apache.maven.surefire.junit4.JUnit4Provider.execute(JUnit4Provider.java:264)
	at org.apache.maven.surefire.junit4.JUnit4Provider.executeTestSet(JUnit4Provider.java:153)
	at org.apache.maven.surefire.junit4.JUnit4Provider.invoke(JUnit4Provider.java:124)
	at sun.reflect.NativeMethodAccessorImpl.invoke0(Native Method)
	at sun.reflect.NativeMethodAccessorImpl.invoke(NativeMethodAccessorImpl.java:57)
	at sun.reflect.DelegatingMethodAccessorImpl.invoke(DelegatingMethodAccessorImpl.java:43)
	at java.lang.reflect.Method.invoke(Method.java:606)
	at org.apache.maven.surefire.util.ReflectionUtils.invokeMethodWithArray2(ReflectionUtils.java:208)
	at org.apache.maven.surefire.booter.ProviderFactory$ProviderProxy.invoke(ProviderFactory.java:156)
	at org.apache.maven.surefire.booter.ProviderFactory.invokeProvider(ProviderFactory.java:82)
	at org.eclipse.tycho.surefire.osgibooter.OsgiSurefireBooter.run(OsgiSurefireBooter.java:91)
	at org.eclipse.tycho.surefire.osgibooter.AbstractUITestApplication.runTests(AbstractUITestApplication.java:44)
	at org.eclipse.ui.internal.testing.WorkbenchTestable$1.run(WorkbenchTestable.java:71)
	at java.lang.Thread.run(Thread.java:745)

testChildrenResetOnAddedRemoved(org.eclipse.tcf.debug.test.RunControlCMTest)  Time elapsed: 0.002 sec  <<< FAILURE!
junit.framework.AssertionFailedError: Agent process died with exit code 127
	at junit.framework.Assert.fail(Assert.java:50)
	at junit.framework.Assert.assertTrue(Assert.java:20)
	at junit.framework.Assert.assertNotNull(Assert.java:218)
	at org.eclipse.tcf.te.tests.tcf.TcfTestCase.launchAgent(TcfTestCase.java:140)
	at org.eclipse.tcf.te.tests.tcf.TcfTestCase.setUp(TcfTestCase.java:61)
	at org.eclipse.tcf.debug.test.AbstractCMTest.setUp(AbstractCMTest.java:150)
	at junit.framework.TestCase.runBare(TestCase.java:132)
	at org.eclipse.tcf.te.tests.CoreTestCase.runBare(CoreTestCase.java:256)
	at junit.framework.TestResult$1.protect(TestResult.java:110)
	at junit.framework.TestResult.runProtected(TestResult.java:128)
	at junit.framework.TestResult.run(TestResult.java:113)
	at junit.framework.TestCase.run(TestCase.java:124)
	at org.eclipse.tcf.te.tests.CoreTestCase.run(CoreTestCase.java:233)
	at junit.framework.TestSuite.runTest(TestSuite.java:243)
	at junit.framework.TestSuite.run(TestSuite.java:238)
	at org.junit.internal.runners.JUnit38ClassRunner.run(JUnit38ClassRunner.java:83)
	at org.apache.maven.surefire.junit4.JUnit4Provider.execute(JUnit4Provider.java:264)
	at org.apache.maven.surefire.junit4.JUnit4Provider.executeTestSet(JUnit4Provider.java:153)
	at org.apache.maven.surefire.junit4.JUnit4Provider.invoke(JUnit4Provider.java:124)
	at sun.reflect.NativeMethodAccessorImpl.invoke0(Native Method)
	at sun.reflect.NativeMethodAccessorImpl.invoke(NativeMethodAccessorImpl.java:57)
	at sun.reflect.DelegatingMethodAccessorImpl.invoke(DelegatingMethodAccessorImpl.java:43)
	at java.lang.reflect.Method.invoke(Method.java:606)
	at org.apache.maven.surefire.util.ReflectionUtils.invokeMethodWithArray2(ReflectionUtils.java:208)
	at org.apache.maven.surefire.booter.ProviderFactory$ProviderProxy.invoke(ProviderFactory.java:156)
	at org.apache.maven.surefire.booter.ProviderFactory.invokeProvider(ProviderFactory.java:82)
	at org.eclipse.tycho.surefire.osgibooter.OsgiSurefireBooter.run(OsgiSurefireBooter.java:91)
	at org.eclipse.tycho.surefire.osgibooter.AbstractUITestApplication.runTests(AbstractUITestApplication.java:44)
	at org.eclipse.ui.internal.testing.WorkbenchTestable$1.run(WorkbenchTestable.java:71)
	at java.lang.Thread.run(Thread.java:745)

testMappingCommandCaches(org.eclipse.tcf.debug.test.RunControlCMTest)  Time elapsed: 0.003 sec  <<< FAILURE!
junit.framework.AssertionFailedError: Agent process died with exit code 127
	at junit.framework.Assert.fail(Assert.java:50)
	at junit.framework.Assert.assertTrue(Assert.java:20)
	at junit.framework.Assert.assertNotNull(Assert.java:218)
	at org.eclipse.tcf.te.tests.tcf.TcfTestCase.launchAgent(TcfTestCase.java:140)
	at org.eclipse.tcf.te.tests.tcf.TcfTestCase.setUp(TcfTestCase.java:61)
	at org.eclipse.tcf.debug.test.AbstractCMTest.setUp(AbstractCMTest.java:150)
	at junit.framework.TestCase.runBare(TestCase.java:132)
	at org.eclipse.tcf.te.tests.CoreTestCase.runBare(CoreTestCase.java:256)
	at junit.framework.TestResult$1.protect(TestResult.java:110)
	at junit.framework.TestResult.runProtected(TestResult.java:128)
	at junit.framework.TestResult.run(TestResult.java:113)
	at junit.framework.TestCase.run(TestCase.java:124)
	at org.eclipse.tcf.te.tests.CoreTestCase.run(CoreTestCase.java:233)
	at junit.framework.TestSuite.runTest(TestSuite.java:243)
	at junit.framework.TestSuite.run(TestSuite.java:238)
	at org.junit.internal.runners.JUnit38ClassRunner.run(JUnit38ClassRunner.java:83)
	at org.apache.maven.surefire.junit4.JUnit4Provider.execute(JUnit4Provider.java:264)
	at org.apache.maven.surefire.junit4.JUnit4Provider.executeTestSet(JUnit4Provider.java:153)
	at org.apache.maven.surefire.junit4.JUnit4Provider.invoke(JUnit4Provider.java:124)
	at sun.reflect.NativeMethodAccessorImpl.invoke0(Native Method)
	at sun.reflect.NativeMethodAccessorImpl.invoke(NativeMethodAccessorImpl.java:57)
	at sun.reflect.DelegatingMethodAccessorImpl.invoke(DelegatingMethodAccessorImpl.java:43)
	at java.lang.reflect.Method.invoke(Method.java:606)
	at org.apache.maven.surefire.util.ReflectionUtils.invokeMethodWithArray2(ReflectionUtils.java:208)
	at org.apache.maven.surefire.booter.ProviderFactory$ProviderProxy.invoke(ProviderFactory.java:156)
	at org.apache.maven.surefire.booter.ProviderFactory.invokeProvider(ProviderFactory.java:82)
	at org.eclipse.tycho.surefire.osgibooter.OsgiSurefireBooter.run(OsgiSurefireBooter.java:91)
	at org.eclipse.tycho.surefire.osgibooter.AbstractUITestApplication.runTests(AbstractUITestApplication.java:44)
	at org.eclipse.ui.internal.testing.WorkbenchTestable$1.run(WorkbenchTestable.java:71)
	at java.lang.Thread.run(Thread.java:745)

Running org.eclipse.tcf.debug.test.StackTraceCMTest

=== testStackTraceCMResetOnResumeSuspend started at: February 6, 2018 12:50:28 PM EST
=== testStackTraceCMResetOnResumeSuspend finished at: February 6, 2018 12:50:28 PM EST (duration: 3 ms)

!ENTRY org.eclipse.tcf.te.tests 4 1 2018-02-06 12:50:28.715
!MESSAGE Test case 'testStackTraceCMResetOnResumeSuspend(org.eclipse.tcf.debug.test.StackTraceCMTest)' failed. Failure: Agent process died with exit code 127
!STACK 0
junit.framework.AssertionFailedError: Agent process died with exit code 127
	at junit.framework.Assert.fail(Assert.java:50)
	at junit.framework.Assert.assertTrue(Assert.java:20)
	at junit.framework.Assert.assertNotNull(Assert.java:218)
	at org.eclipse.tcf.te.tests.tcf.TcfTestCase.launchAgent(TcfTestCase.java:140)
	at org.eclipse.tcf.te.tests.tcf.TcfTestCase.setUp(TcfTestCase.java:61)
	at org.eclipse.tcf.debug.test.AbstractCMTest.setUp(AbstractCMTest.java:150)
	at junit.framework.TestCase.runBare(TestCase.java:132)
	at org.eclipse.tcf.te.tests.CoreTestCase.runBare(CoreTestCase.java:256)
	at junit.framework.TestResult$1.protect(TestResult.java:110)
	at junit.framework.TestResult.runProtected(TestResult.java:128)
	at junit.framework.TestResult.run(TestResult.java:113)
	at junit.framework.TestCase.run(TestCase.java:124)
	at org.eclipse.tcf.te.tests.CoreTestCase.run(CoreTestCase.java:233)
	at junit.framework.TestSuite.runTest(TestSuite.java:243)
	at junit.framework.TestSuite.run(TestSuite.java:238)
	at org.junit.internal.runners.JUnit38ClassRunner.run(JUnit38ClassRunner.java:83)
	at org.apache.maven.surefire.junit4.JUnit4Provider.execute(JUnit4Provider.java:264)
	at org.apache.maven.surefire.junit4.JUnit4Provider.executeTestSet(JUnit4Provider.java:153)
	at org.apache.maven.surefire.junit4.JUnit4Provider.invoke(JUnit4Provider.java:124)
	at sun.reflect.NativeMethodAccessorImpl.invoke0(Native Method)
	at sun.reflect.NativeMethodAccessorImpl.invoke(NativeMethodAccessorImpl.java:57)
	at sun.reflect.DelegatingMethodAccessorImpl.invoke(DelegatingMethodAccessorImpl.java:43)
	at java.lang.reflect.Method.invoke(Method.java:606)
	at org.apache.maven.surefire.util.ReflectionUtils.invokeMethodWithArray2(ReflectionUtils.java:208)
	at org.apache.maven.surefire.booter.ProviderFactory$ProviderProxy.invoke(ProviderFactory.java:156)
	at org.apache.maven.surefire.booter.ProviderFactory.invokeProvider(ProviderFactory.java:82)
	at org.eclipse.tycho.surefire.osgibooter.OsgiSurefireBooter.run(OsgiSurefireBooter.java:91)
	at org.eclipse.tycho.surefire.osgibooter.AbstractUITestApplication.runTests(AbstractUITestApplication.java:44)
	at org.eclipse.ui.internal.testing.WorkbenchTestable$1.run(WorkbenchTestable.java:71)
	at java.lang.Thread.run(Thread.java:745)

=== testStackTraceCMResetOnContextChange started at: February 6, 2018 12:50:28 PM EST
=== testStackTraceCMResetOnContextChange finished at: February 6, 2018 12:50:30 PM EST (duration: 2006 ms)

!ENTRY org.eclipse.tcf.te.tests 4 1 2018-02-06 12:50:30.725
!MESSAGE Test case 'testStackTraceCMResetOnContextChange(org.eclipse.tcf.debug.test.StackTraceCMTest)' failed. Failure: Failed to read output from agent.
!STACK 0
junit.framework.AssertionFailedError: Failed to read output from agent.
	at junit.framework.Assert.fail(Assert.java:50)
	at junit.framework.Assert.assertTrue(Assert.java:20)
	at junit.framework.Assert.assertNotNull(Assert.java:218)
	at org.eclipse.tcf.te.tests.tcf.TcfTestCase.launchAgent(TcfTestCase.java:157)
	at org.eclipse.tcf.te.tests.tcf.TcfTestCase.setUp(TcfTestCase.java:61)
	at org.eclipse.tcf.debug.test.AbstractCMTest.setUp(AbstractCMTest.java:150)
	at junit.framework.TestCase.runBare(TestCase.java:132)
	at org.eclipse.tcf.te.tests.CoreTestCase.runBare(CoreTestCase.java:256)
	at junit.framework.TestResult$1.protect(TestResult.java:110)
	at junit.framework.TestResult.runProtected(TestResult.java:128)
	at junit.framework.TestResult.run(TestResult.java:113)
	at junit.framework.TestCase.run(TestCase.java:124)
	at org.eclipse.tcf.te.tests.CoreTestCase.run(CoreTestCase.java:233)
	at junit.framework.TestSuite.runTest(TestSuite.java:243)
	at junit.framework.TestSuite.run(TestSuite.java:238)
	at org.junit.internal.runners.JUnit38ClassRunner.run(JUnit38ClassRunner.java:83)
	at org.apache.maven.surefire.junit4.JUnit4Provider.execute(JUnit4Provider.java:264)
	at org.apache.maven.surefire.junit4.JUnit4Provider.executeTestSet(JUnit4Provider.java:153)
	at org.apache.maven.surefire.junit4.JUnit4Provider.invoke(JUnit4Provider.java:124)
	at sun.reflect.NativeMethodAccessorImpl.invoke0(Native Method)
	at sun.reflect.NativeMethodAccessorImpl.invoke(NativeMethodAccessorImpl.java:57)
	at sun.reflect.DelegatingMethodAccessorImpl.invoke(DelegatingMethodAccessorImpl.java:43)
	at java.lang.reflect.Method.invoke(Method.java:606)
	at org.apache.maven.surefire.util.ReflectionUtils.invokeMethodWithArray2(ReflectionUtils.java:208)
	at org.apache.maven.surefire.booter.ProviderFactory$ProviderProxy.invoke(ProviderFactory.java:156)
	at org.apache.maven.surefire.booter.ProviderFactory.invokeProvider(ProviderFactory.java:82)
	at org.eclipse.tycho.surefire.osgibooter.OsgiSurefireBooter.run(OsgiSurefireBooter.java:91)
	at org.eclipse.tycho.surefire.osgibooter.AbstractUITestApplication.runTests(AbstractUITestApplication.java:44)
	at org.eclipse.ui.internal.testing.WorkbenchTestable$1.run(WorkbenchTestable.java:71)
	at java.lang.Thread.run(Thread.java:745)

=== testStackTraceCMResetOnMemoryChange started at: February 6, 2018 12:50:30 PM EST
=== testStackTraceCMResetOnMemoryChange finished at: February 6, 2018 12:50:32 PM EST (duration: 2012 ms)

!ENTRY org.eclipse.tcf.te.tests 4 1 2018-02-06 12:50:32.740
!MESSAGE Test case 'testStackTraceCMResetOnMemoryChange(org.eclipse.tcf.debug.test.StackTraceCMTest)' failed. Failure: Failed to read output from agent.
!STACK 0
junit.framework.AssertionFailedError: Failed to read output from agent.
	at junit.framework.Assert.fail(Assert.java:50)
	at junit.framework.Assert.assertTrue(Assert.java:20)
	at junit.framework.Assert.assertNotNull(Assert.java:218)
	at org.eclipse.tcf.te.tests.tcf.TcfTestCase.launchAgent(TcfTestCase.java:157)
	at org.eclipse.tcf.te.tests.tcf.TcfTestCase.setUp(TcfTestCase.java:61)
	at org.eclipse.tcf.debug.test.AbstractCMTest.setUp(AbstractCMTest.java:150)
	at junit.framework.TestCase.runBare(TestCase.java:132)
	at org.eclipse.tcf.te.tests.CoreTestCase.runBare(CoreTestCase.java:256)
	at junit.framework.TestResult$1.protect(TestResult.java:110)
	at junit.framework.TestResult.runProtected(TestResult.java:128)
	at junit.framework.TestResult.run(TestResult.java:113)
	at junit.framework.TestCase.run(TestCase.java:124)
	at org.eclipse.tcf.te.tests.CoreTestCase.run(CoreTestCase.java:233)
	at junit.framework.TestSuite.runTest(TestSuite.java:243)
	at junit.framework.TestSuite.run(TestSuite.java:238)
	at org.junit.internal.runners.JUnit38ClassRunner.run(JUnit38ClassRunner.java:83)
	at org.apache.maven.surefire.junit4.JUnit4Provider.execute(JUnit4Provider.java:264)
	at org.apache.maven.surefire.junit4.JUnit4Provider.executeTestSet(JUnit4Provider.java:153)
	at org.apache.maven.surefire.junit4.JUnit4Provider.invoke(JUnit4Provider.java:124)
	at sun.reflect.NativeMethodAccessorImpl.invoke0(Native Method)
	at sun.reflect.NativeMethodAccessorImpl.invoke(NativeMethodAccessorImpl.java:57)
	at sun.reflect.DelegatingMethodAccessorImpl.invoke(DelegatingMethodAccessorImpl.java:43)
	at java.lang.reflect.Method.invoke(Method.java:606)
	at org.apache.maven.surefire.util.ReflectionUtils.invokeMethodWithArray2(ReflectionUtils.java:208)
	at org.apache.maven.surefire.booter.ProviderFactory$ProviderProxy.invoke(ProviderFactory.java:156)
	at org.apache.maven.surefire.booter.ProviderFactory.invokeProvider(ProviderFactory.java:82)
	at org.eclipse.tycho.surefire.osgibooter.OsgiSurefireBooter.run(OsgiSurefireBooter.java:91)
	at org.eclipse.tycho.surefire.osgibooter.AbstractUITestApplication.runTests(AbstractUITestApplication.java:44)
	at org.eclipse.ui.internal.testing.WorkbenchTestable$1.run(WorkbenchTestable.java:71)
	at java.lang.Thread.run(Thread.java:745)

=== testStackTraceCMResetOnMemoryMapChange started at: February 6, 2018 12:50:32 PM EST
=== testStackTraceCMResetOnMemoryMapChange finished at: February 6, 2018 12:50:34 PM EST (duration: 2008 ms)

!ENTRY org.eclipse.tcf.te.tests 4 1 2018-02-06 12:50:34.750
!MESSAGE Test case 'testStackTraceCMResetOnMemoryMapChange(org.eclipse.tcf.debug.test.StackTraceCMTest)' failed. Failure: Failed to read output from agent.
!STACK 0
junit.framework.AssertionFailedError: Failed to read output from agent.
	at junit.framework.Assert.fail(Assert.java:50)
	at junit.framework.Assert.assertTrue(Assert.java:20)
	at junit.framework.Assert.assertNotNull(Assert.java:218)
	at org.eclipse.tcf.te.tests.tcf.TcfTestCase.launchAgent(TcfTestCase.java:157)
	at org.eclipse.tcf.te.tests.tcf.TcfTestCase.setUp(TcfTestCase.java:61)
	at org.eclipse.tcf.debug.test.AbstractCMTest.setUp(AbstractCMTest.java:150)
	at junit.framework.TestCase.runBare(TestCase.java:132)
	at org.eclipse.tcf.te.tests.CoreTestCase.runBare(CoreTestCase.java:256)
	at junit.framework.TestResult$1.protect(TestResult.java:110)
	at junit.framework.TestResult.runProtected(TestResult.java:128)
	at junit.framework.TestResult.run(TestResult.java:113)
	at junit.framework.TestCase.run(TestCase.java:124)
	at org.eclipse.tcf.te.tests.CoreTestCase.run(CoreTestCase.java:233)
	at junit.framework.TestSuite.runTest(TestSuite.java:243)
	at junit.framework.TestSuite.run(TestSuite.java:238)
	at org.junit.internal.runners.JUnit38ClassRunner.run(JUnit38ClassRunner.java:83)
	at org.apache.maven.surefire.junit4.JUnit4Provider.execute(JUnit4Provider.java:264)
	at org.apache.maven.surefire.junit4.JUnit4Provider.executeTestSet(JUnit4Provider.java:153)
	at org.apache.maven.surefire.junit4.JUnit4Provider.invoke(JUnit4Provider.java:124)
	at sun.reflect.NativeMethodAccessorImpl.invoke0(Native Method)
	at sun.reflect.NativeMethodAccessorImpl.invoke(NativeMethodAccessorImpl.java:57)
	at sun.reflect.DelegatingMethodAccessorImpl.invoke(DelegatingMethodAccessorImpl.java:43)
	at java.lang.reflect.Method.invoke(Method.java:606)
	at org.apache.maven.surefire.util.ReflectionUtils.invokeMethodWithArray2(ReflectionUtils.java:208)
	at org.apache.maven.surefire.booter.ProviderFactory$ProviderProxy.invoke(ProviderFactory.java:156)
	at org.apache.maven.surefire.booter.ProviderFactory.invokeProvider(ProviderFactory.java:82)
	at org.eclipse.tycho.surefire.osgibooter.OsgiSurefireBooter.run(OsgiSurefireBooter.java:91)
	at org.eclipse.tycho.surefire.osgibooter.AbstractUITestApplication.runTests(AbstractUITestApplication.java:44)
	at org.eclipse.ui.internal.testing.WorkbenchTestable$1.run(WorkbenchTestable.java:71)
	at java.lang.Thread.run(Thread.java:745)
Tests run: 4, Failures: 4, Errors: 0, Skipped: 0, Time elapsed: 6.043 sec <<< FAILURE! - in org.eclipse.tcf.debug.test.StackTraceCMTest
testStackTraceCMResetOnResumeSuspend(org.eclipse.tcf.debug.test.StackTraceCMTest)  Time elapsed: 0.004 sec  <<< FAILURE!
junit.framework.AssertionFailedError: Agent process died with exit code 127
	at junit.framework.Assert.fail(Assert.java:50)
	at junit.framework.Assert.assertTrue(Assert.java:20)
	at junit.framework.Assert.assertNotNull(Assert.java:218)
	at org.eclipse.tcf.te.tests.tcf.TcfTestCase.launchAgent(TcfTestCase.java:140)
	at org.eclipse.tcf.te.tests.tcf.TcfTestCase.setUp(TcfTestCase.java:61)
	at org.eclipse.tcf.debug.test.AbstractCMTest.setUp(AbstractCMTest.java:150)
	at junit.framework.TestCase.runBare(TestCase.java:132)
	at org.eclipse.tcf.te.tests.CoreTestCase.runBare(CoreTestCase.java:256)
	at junit.framework.TestResult$1.protect(TestResult.java:110)
	at junit.framework.TestResult.runProtected(TestResult.java:128)
	at junit.framework.TestResult.run(TestResult.java:113)
	at junit.framework.TestCase.run(TestCase.java:124)
	at org.eclipse.tcf.te.tests.CoreTestCase.run(CoreTestCase.java:233)
	at junit.framework.TestSuite.runTest(TestSuite.java:243)
	at junit.framework.TestSuite.run(TestSuite.java:238)
	at org.junit.internal.runners.JUnit38ClassRunner.run(JUnit38ClassRunner.java:83)
	at org.apache.maven.surefire.junit4.JUnit4Provider.execute(JUnit4Provider.java:264)
	at org.apache.maven.surefire.junit4.JUnit4Provider.executeTestSet(JUnit4Provider.java:153)
	at org.apache.maven.surefire.junit4.JUnit4Provider.invoke(JUnit4Provider.java:124)
	at sun.reflect.NativeMethodAccessorImpl.invoke0(Native Method)
	at sun.reflect.NativeMethodAccessorImpl.invoke(NativeMethodAccessorImpl.java:57)
	at sun.reflect.DelegatingMethodAccessorImpl.invoke(DelegatingMethodAccessorImpl.java:43)
	at java.lang.reflect.Method.invoke(Method.java:606)
	at org.apache.maven.surefire.util.ReflectionUtils.invokeMethodWithArray2(ReflectionUtils.java:208)
	at org.apache.maven.surefire.booter.ProviderFactory$ProviderProxy.invoke(ProviderFactory.java:156)
	at org.apache.maven.surefire.booter.ProviderFactory.invokeProvider(ProviderFactory.java:82)
	at org.eclipse.tycho.surefire.osgibooter.OsgiSurefireBooter.run(OsgiSurefireBooter.java:91)
	at org.eclipse.tycho.surefire.osgibooter.AbstractUITestApplication.runTests(AbstractUITestApplication.java:44)
	at org.eclipse.ui.internal.testing.WorkbenchTestable$1.run(WorkbenchTestable.java:71)
	at java.lang.Thread.run(Thread.java:745)

testStackTraceCMResetOnContextChange(org.eclipse.tcf.debug.test.StackTraceCMTest)  Time elapsed: 2.007 sec  <<< FAILURE!
junit.framework.AssertionFailedError: Failed to read output from agent.
	at junit.framework.Assert.fail(Assert.java:50)
	at junit.framework.Assert.assertTrue(Assert.java:20)
	at junit.framework.Assert.assertNotNull(Assert.java:218)
	at org.eclipse.tcf.te.tests.tcf.TcfTestCase.launchAgent(TcfTestCase.java:157)
	at org.eclipse.tcf.te.tests.tcf.TcfTestCase.setUp(TcfTestCase.java:61)
	at org.eclipse.tcf.debug.test.AbstractCMTest.setUp(AbstractCMTest.java:150)
	at junit.framework.TestCase.runBare(TestCase.java:132)
	at org.eclipse.tcf.te.tests.CoreTestCase.runBare(CoreTestCase.java:256)
	at junit.framework.TestResult$1.protect(TestResult.java:110)
	at junit.framework.TestResult.runProtected(TestResult.java:128)
	at junit.framework.TestResult.run(TestResult.java:113)
	at junit.framework.TestCase.run(TestCase.java:124)
	at org.eclipse.tcf.te.tests.CoreTestCase.run(CoreTestCase.java:233)
	at junit.framework.TestSuite.runTest(TestSuite.java:243)
	at junit.framework.TestSuite.run(TestSuite.java:238)
	at org.junit.internal.runners.JUnit38ClassRunner.run(JUnit38ClassRunner.java:83)
	at org.apache.maven.surefire.junit4.JUnit4Provider.execute(JUnit4Provider.java:264)
	at org.apache.maven.surefire.junit4.JUnit4Provider.executeTestSet(JUnit4Provider.java:153)
	at org.apache.maven.surefire.junit4.JUnit4Provider.invoke(JUnit4Provider.java:124)
	at sun.reflect.NativeMethodAccessorImpl.invoke0(Native Method)
	at sun.reflect.NativeMethodAccessorImpl.invoke(NativeMethodAccessorImpl.java:57)
	at sun.reflect.DelegatingMethodAccessorImpl.invoke(DelegatingMethodAccessorImpl.java:43)
	at java.lang.reflect.Method.invoke(Method.java:606)
	at org.apache.maven.surefire.util.ReflectionUtils.invokeMethodWithArray2(ReflectionUtils.java:208)
	at org.apache.maven.surefire.booter.ProviderFactory$ProviderProxy.invoke(ProviderFactory.java:156)
	at org.apache.maven.surefire.booter.ProviderFactory.invokeProvider(ProviderFactory.java:82)
	at org.eclipse.tycho.surefire.osgibooter.OsgiSurefireBooter.run(OsgiSurefireBooter.java:91)
	at org.eclipse.tycho.surefire.osgibooter.AbstractUITestApplication.runTests(AbstractUITestApplication.java:44)
	at org.eclipse.ui.internal.testing.WorkbenchTestable$1.run(WorkbenchTestable.java:71)
	at java.lang.Thread.run(Thread.java:745)

testStackTraceCMResetOnMemoryChange(org.eclipse.tcf.debug.test.StackTraceCMTest)  Time elapsed: 2.012 sec  <<< FAILURE!
junit.framework.AssertionFailedError: Failed to read output from agent.
	at junit.framework.Assert.fail(Assert.java:50)
	at junit.framework.Assert.assertTrue(Assert.java:20)
	at junit.framework.Assert.assertNotNull(Assert.java:218)
	at org.eclipse.tcf.te.tests.tcf.TcfTestCase.launchAgent(TcfTestCase.java:157)
	at org.eclipse.tcf.te.tests.tcf.TcfTestCase.setUp(TcfTestCase.java:61)
	at org.eclipse.tcf.debug.test.AbstractCMTest.setUp(AbstractCMTest.java:150)
	at junit.framework.TestCase.runBare(TestCase.java:132)
	at org.eclipse.tcf.te.tests.CoreTestCase.runBare(CoreTestCase.java:256)
	at junit.framework.TestResult$1.protect(TestResult.java:110)
	at junit.framework.TestResult.runProtected(TestResult.java:128)
	at junit.framework.TestResult.run(TestResult.java:113)
	at junit.framework.TestCase.run(TestCase.java:124)
	at org.eclipse.tcf.te.tests.CoreTestCase.run(CoreTestCase.java:233)
	at junit.framework.TestSuite.runTest(TestSuite.java:243)
	at junit.framework.TestSuite.run(TestSuite.java:238)
	at org.junit.internal.runners.JUnit38ClassRunner.run(JUnit38ClassRunner.java:83)
	at org.apache.maven.surefire.junit4.JUnit4Provider.execute(JUnit4Provider.java:264)
	at org.apache.maven.surefire.junit4.JUnit4Provider.executeTestSet(JUnit4Provider.java:153)
	at org.apache.maven.surefire.junit4.JUnit4Provider.invoke(JUnit4Provider.java:124)
	at sun.reflect.NativeMethodAccessorImpl.invoke0(Native Method)
	at sun.reflect.NativeMethodAccessorImpl.invoke(NativeMethodAccessorImpl.java:57)
	at sun.reflect.DelegatingMethodAccessorImpl.invoke(DelegatingMethodAccessorImpl.java:43)
	at java.lang.reflect.Method.invoke(Method.java:606)
	at org.apache.maven.surefire.util.ReflectionUtils.invokeMethodWithArray2(ReflectionUtils.java:208)
	at org.apache.maven.surefire.booter.ProviderFactory$ProviderProxy.invoke(ProviderFactory.java:156)
	at org.apache.maven.surefire.booter.ProviderFactory.invokeProvider(ProviderFactory.java:82)
	at org.eclipse.tycho.surefire.osgibooter.OsgiSurefireBooter.run(OsgiSurefireBooter.java:91)
	at org.eclipse.tycho.surefire.osgibooter.AbstractUITestApplication.runTests(AbstractUITestApplication.java:44)
	at org.eclipse.ui.internal.testing.WorkbenchTestable$1.run(WorkbenchTestable.java:71)
	at java.lang.Thread.run(Thread.java:745)

testStackTraceCMResetOnMemoryMapChange(org.eclipse.tcf.debug.test.StackTraceCMTest)  Time elapsed: 2.009 sec  <<< FAILURE!
junit.framework.AssertionFailedError: Failed to read output from agent.
	at junit.framework.Assert.fail(Assert.java:50)
	at junit.framework.Assert.assertTrue(Assert.java:20)
	at junit.framework.Assert.assertNotNull(Assert.java:218)
	at org.eclipse.tcf.te.tests.tcf.TcfTestCase.launchAgent(TcfTestCase.java:157)
	at org.eclipse.tcf.te.tests.tcf.TcfTestCase.setUp(TcfTestCase.java:61)
	at org.eclipse.tcf.debug.test.AbstractCMTest.setUp(AbstractCMTest.java:150)
	at junit.framework.TestCase.runBare(TestCase.java:132)
	at org.eclipse.tcf.te.tests.CoreTestCase.runBare(CoreTestCase.java:256)
	at junit.framework.TestResult$1.protect(TestResult.java:110)
	at junit.framework.TestResult.runProtected(TestResult.java:128)
	at junit.framework.TestResult.run(TestResult.java:113)
	at junit.framework.TestCase.run(TestCase.java:124)
	at org.eclipse.tcf.te.tests.CoreTestCase.run(CoreTestCase.java:233)
	at junit.framework.TestSuite.runTest(TestSuite.java:243)
	at junit.framework.TestSuite.run(TestSuite.java:238)
	at org.junit.internal.runners.JUnit38ClassRunner.run(JUnit38ClassRunner.java:83)
	at org.apache.maven.surefire.junit4.JUnit4Provider.execute(JUnit4Provider.java:264)
	at org.apache.maven.surefire.junit4.JUnit4Provider.executeTestSet(JUnit4Provider.java:153)
	at org.apache.maven.surefire.junit4.JUnit4Provider.invoke(JUnit4Provider.java:124)
	at sun.reflect.NativeMethodAccessorImpl.invoke0(Native Method)
	at sun.reflect.NativeMethodAccessorImpl.invoke(NativeMethodAccessorImpl.java:57)
	at sun.reflect.DelegatingMethodAccessorImpl.invoke(DelegatingMethodAccessorImpl.java:43)
	at java.lang.reflect.Method.invoke(Method.java:606)
	at org.apache.maven.surefire.util.ReflectionUtils.invokeMethodWithArray2(ReflectionUtils.java:208)
	at org.apache.maven.surefire.booter.ProviderFactory$ProviderProxy.invoke(ProviderFactory.java:156)
	at org.apache.maven.surefire.booter.ProviderFactory.invokeProvider(ProviderFactory.java:82)
	at org.eclipse.tycho.surefire.osgibooter.OsgiSurefireBooter.run(OsgiSurefireBooter.java:91)
	at org.eclipse.tycho.surefire.osgibooter.AbstractUITestApplication.runTests(AbstractUITestApplication.java:44)
	at org.eclipse.ui.internal.testing.WorkbenchTestable$1.run(WorkbenchTestable.java:71)
	at java.lang.Thread.run(Thread.java:745)

Running org.eclipse.tcf.debug.test.CacheTests
Tests run: 17, Failures: 0, Errors: 0, Skipped: 0, Time elapsed: 0.65 sec - in org.eclipse.tcf.debug.test.CacheTests
testCancelWhilePendingWithTwoClients(org.eclipse.tcf.debug.test.CacheTests)  Time elapsed: 0.035 sec
testCancelWhilePendingWithManyClients(org.eclipse.tcf.debug.test.CacheTests)  Time elapsed: 0.023 sec
testResetWhileValid(org.eclipse.tcf.debug.test.CacheTests)  Time elapsed: 0.005 sec
testSetAndReset(org.eclipse.tcf.debug.test.CacheTests)  Time elapsed: 0.004 sec
testGetWithCompletionDelay(org.eclipse.tcf.debug.test.CacheTests)  Time elapsed: 0.107 sec
testGetWithTwoClients(org.eclipse.tcf.debug.test.CacheTests)  Time elapsed: 0.033 sec
testGetWithManyClients(org.eclipse.tcf.debug.test.CacheTests)  Time elapsed: 0.051 sec
testDisableBeforeRequest(org.eclipse.tcf.debug.test.CacheTests)  Time elapsed: 0.131 sec
testDisableWhilePending(org.eclipse.tcf.debug.test.CacheTests)  Time elapsed: 0.032 sec
testDisableWhileValid(org.eclipse.tcf.debug.test.CacheTests)  Time elapsed: 0.016 sec
testSetWithValue(org.eclipse.tcf.debug.test.CacheTests)  Time elapsed: 0.008 sec
testCancelWhilePending(org.eclipse.tcf.debug.test.CacheTests)  Time elapsed: 0.007 sec
testCancelWhilePending2(org.eclipse.tcf.debug.test.CacheTests)  Time elapsed: 0.01 sec
testCancelWhilePending3(org.eclipse.tcf.debug.test.CacheTests)  Time elapsed: 0.008 sec
testCancelWhilePendingWithoutClientNotification(org.eclipse.tcf.debug.test.CacheTests)  Time elapsed: 0.012 sec
testCancelAfterCompletedRaceCondition(org.eclipse.tcf.debug.test.CacheTests)  Time elapsed: 0.079 sec
testGet(org.eclipse.tcf.debug.test.CacheTests)  Time elapsed: 0.006 sec
Running org.eclipse.tcf.debug.test.RangeCacheTests
Tests run: 11, Failures: 0, Errors: 0, Skipped: 0, Time elapsed: 4.814 sec - in org.eclipse.tcf.debug.test.RangeCacheTests
testGetOneRangeUsingDifferentRangeInstanceTest(org.eclipse.tcf.debug.test.RangeCacheTests)  Time elapsed: 0.152 sec
testGetOneRangeTest(org.eclipse.tcf.debug.test.RangeCacheTests)  Time elapsed: 0.101 sec
testGetMultipleRangesTest(org.eclipse.tcf.debug.test.RangeCacheTests)  Time elapsed: 0.707 sec
testGetIncompleteRangeTest(org.eclipse.tcf.debug.test.RangeCacheTests)  Time elapsed: 0.101 sec
testCancelOneRangeTest(org.eclipse.tcf.debug.test.RangeCacheTests)  Time elapsed: 0.102 sec
testCancelMultipleRangesTest(org.eclipse.tcf.debug.test.RangeCacheTests)  Time elapsed: 0.304 sec
testGetAndCancelMultipleRangesTest(org.eclipse.tcf.debug.test.RangeCacheTests)  Time elapsed: 0.305 sec
testResetOneRangeTest(org.eclipse.tcf.debug.test.RangeCacheTests)  Time elapsed: 0.212 sec
testResetMultipleRangesTest(org.eclipse.tcf.debug.test.RangeCacheTests)  Time elapsed: 1.441 sec
testResetWhileInvalidTest(org.eclipse.tcf.debug.test.RangeCacheTests)  Time elapsed: 0.123 sec
testSetRangeErrorTest(org.eclipse.tcf.debug.test.RangeCacheTests)  Time elapsed: 1.215 sec
Running org.eclipse.tcf.debug.test.QueryTests
Tests run: 7, Failures: 0, Errors: 0, Skipped: 0, Time elapsed: 0.156 sec - in org.eclipse.tcf.debug.test.QueryTests
testSimpleGet(org.eclipse.tcf.debug.test.QueryTests)  Time elapsed: 0.001 sec
testGetError(org.eclipse.tcf.debug.test.QueryTests)  Time elapsed: 0.001 sec
testGetWithMultipleDispatches(org.eclipse.tcf.debug.test.QueryTests)  Time elapsed: 0.082 sec
testExceptionOnGet(org.eclipse.tcf.debug.test.QueryTests)  Time elapsed: 0 sec
testCancelBeforeWaiting(org.eclipse.tcf.debug.test.QueryTests)  Time elapsed: 0 sec
testCancelWhileWaiting(org.eclipse.tcf.debug.test.QueryTests)  Time elapsed: 0.012 sec
testGetTimeout(org.eclipse.tcf.debug.test.QueryTests)  Time elapsed: 0.002 sec
Running org.eclipse.tcf.debug.test.BreakpointsViewTest

=== testScopeGrouping started at: February 6, 2018 12:50:40 PM EST
=== testScopeGrouping finished at: February 6, 2018 12:50:40 PM EST (duration: 7 ms)

!ENTRY org.eclipse.tcf.te.tests 4 1 2018-02-06 12:50:40.669
!MESSAGE Test case 'testScopeGrouping(org.eclipse.tcf.debug.test.BreakpointsViewTest)' failed. Failure: Agent process died with exit code 127
!STACK 0
junit.framework.AssertionFailedError: Agent process died with exit code 127
	at junit.framework.Assert.fail(Assert.java:50)
	at junit.framework.Assert.assertTrue(Assert.java:20)
	at junit.framework.Assert.assertNotNull(Assert.java:218)
	at org.eclipse.tcf.te.tests.tcf.TcfTestCase.launchAgent(TcfTestCase.java:140)
	at org.eclipse.tcf.te.tests.tcf.TcfTestCase.setUp(TcfTestCase.java:61)
	at org.eclipse.tcf.debug.test.AbstractCMTest.setUp(AbstractCMTest.java:150)
	at org.eclipse.tcf.debug.test.AbstractTcfUITest.setUp(AbstractTcfUITest.java:86)
	at org.eclipse.tcf.debug.test.BreakpointsViewTest.setUp(BreakpointsViewTest.java:47)
	at junit.framework.TestCase.runBare(TestCase.java:132)
	at org.eclipse.tcf.te.tests.CoreTestCase.runBare(CoreTestCase.java:256)
	at junit.framework.TestResult$1.protect(TestResult.java:110)
	at junit.framework.TestResult.runProtected(TestResult.java:128)
	at junit.framework.TestResult.run(TestResult.java:113)
	at junit.framework.TestCase.run(TestCase.java:124)
	at org.eclipse.tcf.te.tests.CoreTestCase.run(CoreTestCase.java:233)
	at junit.framework.TestSuite.runTest(TestSuite.java:243)
	at junit.framework.TestSuite.run(TestSuite.java:238)
	at org.junit.internal.runners.JUnit38ClassRunner.run(JUnit38ClassRunner.java:83)
	at org.apache.maven.surefire.junit4.JUnit4Provider.execute(JUnit4Provider.java:264)
	at org.apache.maven.surefire.junit4.JUnit4Provider.executeTestSet(JUnit4Provider.java:153)
	at org.apache.maven.surefire.junit4.JUnit4Provider.invoke(JUnit4Provider.java:124)
	at sun.reflect.NativeMethodAccessorImpl.invoke0(Native Method)
	at sun.reflect.NativeMethodAccessorImpl.invoke(NativeMethodAccessorImpl.java:57)
	at sun.reflect.DelegatingMethodAccessorImpl.invoke(DelegatingMethodAccessorImpl.java:43)
	at java.lang.reflect.Method.invoke(Method.java:606)
	at org.apache.maven.surefire.util.ReflectionUtils.invokeMethodWithArray2(ReflectionUtils.java:208)
	at org.apache.maven.surefire.booter.ProviderFactory$ProviderProxy.invoke(ProviderFactory.java:156)
	at org.apache.maven.surefire.booter.ProviderFactory.invokeProvider(ProviderFactory.java:82)
	at org.eclipse.tycho.surefire.osgibooter.OsgiSurefireBooter.run(OsgiSurefireBooter.java:91)
	at org.eclipse.tycho.surefire.osgibooter.AbstractUITestApplication.runTests(AbstractUITestApplication.java:44)
	at org.eclipse.ui.internal.testing.WorkbenchTestable$1.run(WorkbenchTestable.java:71)
	at java.lang.Thread.run(Thread.java:745)
Tests run: 1, Failures: 1, Errors: 0, Skipped: 0, Time elapsed: 0.263 sec <<< FAILURE! - in org.eclipse.tcf.debug.test.BreakpointsViewTest
testScopeGrouping(org.eclipse.tcf.debug.test.BreakpointsViewTest)  Time elapsed: 0.008 sec  <<< FAILURE!
junit.framework.AssertionFailedError: Agent process died with exit code 127
	at junit.framework.Assert.fail(Assert.java:50)
	at junit.framework.Assert.assertTrue(Assert.java:20)
	at junit.framework.Assert.assertNotNull(Assert.java:218)
	at org.eclipse.tcf.te.tests.tcf.TcfTestCase.launchAgent(TcfTestCase.java:140)
	at org.eclipse.tcf.te.tests.tcf.TcfTestCase.setUp(TcfTestCase.java:61)
	at org.eclipse.tcf.debug.test.AbstractCMTest.setUp(AbstractCMTest.java:150)
	at org.eclipse.tcf.debug.test.AbstractTcfUITest.setUp(AbstractTcfUITest.java:86)
	at org.eclipse.tcf.debug.test.BreakpointsViewTest.setUp(BreakpointsViewTest.java:47)

Running org.eclipse.tcf.debug.test.SampleTest

=== testSteppingDebugViewOnly started at: February 6, 2018 12:50:40 PM EST
=== testSteppingDebugViewOnly finished at: February 6, 2018 12:50:40 PM EST (duration: 3 ms)

!ENTRY org.eclipse.tcf.te.tests 4 1 2018-02-06 12:50:40.684
!MESSAGE Test case 'testSteppingDebugViewOnly(org.eclipse.tcf.debug.test.SampleTest)' failed. Failure: Agent process died with exit code 127
!STACK 0
junit.framework.AssertionFailedError: Agent process died with exit code 127
	at junit.framework.Assert.fail(Assert.java:50)
	at junit.framework.Assert.assertTrue(Assert.java:20)
	at junit.framework.Assert.assertNotNull(Assert.java:218)
	at org.eclipse.tcf.te.tests.tcf.TcfTestCase.launchAgent(TcfTestCase.java:140)
	at org.eclipse.tcf.te.tests.tcf.TcfTestCase.setUp(TcfTestCase.java:61)
	at org.eclipse.tcf.debug.test.AbstractCMTest.setUp(AbstractCMTest.java:150)
	at org.eclipse.tcf.debug.test.AbstractTcfUITest.setUp(AbstractTcfUITest.java:86)
	at junit.framework.TestCase.runBare(TestCase.java:132)
	at org.eclipse.tcf.te.tests.CoreTestCase.runBare(CoreTestCase.java:256)
	at junit.framework.TestResult$1.protect(TestResult.java:110)
	at junit.framework.TestResult.runProtected(TestResult.java:128)
	at junit.framework.TestResult.run(TestResult.java:113)
	at junit.framework.TestCase.run(TestCase.java:124)
	at org.eclipse.tcf.te.tests.CoreTestCase.run(CoreTestCase.java:233)
	at junit.framework.TestSuite.runTest(TestSuite.java:243)
	at junit.framework.TestSuite.run(TestSuite.java:238)
	at org.junit.internal.runners.JUnit38ClassRunner.run(JUnit38ClassRunner.java:83)
	at org.apache.maven.surefire.junit4.JUnit4Provider.execute(JUnit4Provider.java:264)
	at org.apache.maven.surefire.junit4.JUnit4Provider.executeTestSet(JUnit4Provider.java:153)
	at org.apache.maven.surefire.junit4.JUnit4Provider.invoke(JUnit4Provider.java:124)
	at sun.reflect.NativeMethodAccessorImpl.invoke0(Native Method)
	at sun.reflect.NativeMethodAccessorImpl.invoke(NativeMethodAccessorImpl.java:57)
	at sun.reflect.DelegatingMethodAccessorImpl.invoke(DelegatingMethodAccessorImpl.java:43)
	at java.lang.reflect.Method.invoke(Method.java:606)
	at org.apache.maven.surefire.util.ReflectionUtils.invokeMethodWithArray2(ReflectionUtils.java:208)
	at org.apache.maven.surefire.booter.ProviderFactory$ProviderProxy.invoke(ProviderFactory.java:156)
	at org.apache.maven.surefire.booter.ProviderFactory.invokeProvider(ProviderFactory.java:82)
	at org.eclipse.tycho.surefire.osgibooter.OsgiSurefireBooter.run(OsgiSurefireBooter.java:91)
	at org.eclipse.tycho.surefire.osgibooter.AbstractUITestApplication.runTests(AbstractUITestApplication.java:44)
	at org.eclipse.ui.internal.testing.WorkbenchTestable$1.run(WorkbenchTestable.java:71)
	at java.lang.Thread.run(Thread.java:745)

=== testSteppingWithVariablesAndRegisters started at: February 6, 2018 12:50:40 PM EST
=== testSteppingWithVariablesAndRegisters finished at: February 6, 2018 12:50:42 PM EST (duration: 2007 ms)

!ENTRY org.eclipse.tcf.te.tests 4 1 2018-02-06 12:50:42.694
!MESSAGE Test case 'testSteppingWithVariablesAndRegisters(org.eclipse.tcf.debug.test.SampleTest)' failed. Failure: Failed to read output from agent.
!STACK 0
junit.framework.AssertionFailedError: Failed to read output from agent.
	at junit.framework.Assert.fail(Assert.java:50)
	at junit.framework.Assert.assertTrue(Assert.java:20)
	at junit.framework.Assert.assertNotNull(Assert.java:218)
	at org.eclipse.tcf.te.tests.tcf.TcfTestCase.launchAgent(TcfTestCase.java:157)
	at org.eclipse.tcf.te.tests.tcf.TcfTestCase.setUp(TcfTestCase.java:61)
	at org.eclipse.tcf.debug.test.AbstractCMTest.setUp(AbstractCMTest.java:150)
	at org.eclipse.tcf.debug.test.AbstractTcfUITest.setUp(AbstractTcfUITest.java:86)
	at junit.framework.TestCase.runBare(TestCase.java:132)
	at org.eclipse.tcf.te.tests.CoreTestCase.runBare(CoreTestCase.java:256)
	at junit.framework.TestResult$1.protect(TestResult.java:110)
	at junit.framework.TestResult.runProtected(TestResult.java:128)
	at junit.framework.TestResult.run(TestResult.java:113)
	at junit.framework.TestCase.run(TestCase.java:124)
	at org.eclipse.tcf.te.tests.CoreTestCase.run(CoreTestCase.java:233)
	at junit.framework.TestSuite.runTest(TestSuite.java:243)
	at junit.framework.TestSuite.run(TestSuite.java:238)
	at org.junit.internal.runners.JUnit38ClassRunner.run(JUnit38ClassRunner.java:83)
	at org.apache.maven.surefire.junit4.JUnit4Provider.execute(JUnit4Provider.java:264)
	at org.apache.maven.surefire.junit4.JUnit4Provider.executeTestSet(JUnit4Provider.java:153)
	at org.apache.maven.surefire.junit4.JUnit4Provider.invoke(JUnit4Provider.java:124)
	at sun.reflect.NativeMethodAccessorImpl.invoke0(Native Method)
	at sun.reflect.NativeMethodAccessorImpl.invoke(NativeMethodAccessorImpl.java:57)
	at sun.reflect.DelegatingMethodAccessorImpl.invoke(DelegatingMethodAccessorImpl.java:43)
	at java.lang.reflect.Method.invoke(Method.java:606)
	at org.apache.maven.surefire.util.ReflectionUtils.invokeMethodWithArray2(ReflectionUtils.java:208)
	at org.apache.maven.surefire.booter.ProviderFactory$ProviderProxy.invoke(ProviderFactory.java:156)
	at org.apache.maven.surefire.booter.ProviderFactory.invokeProvider(ProviderFactory.java:82)
	at org.eclipse.tycho.surefire.osgibooter.OsgiSurefireBooter.run(OsgiSurefireBooter.java:91)
	at org.eclipse.tycho.surefire.osgibooter.AbstractUITestApplication.runTests(AbstractUITestApplication.java:44)
	at org.eclipse.ui.internal.testing.WorkbenchTestable$1.run(WorkbenchTestable.java:71)
	at java.lang.Thread.run(Thread.java:745)

=== testSteppingPerformanceWithSourceDisplay started at: February 6, 2018 12:50:42 PM EST
=== testSteppingPerformanceWithSourceDisplay finished at: February 6, 2018 12:50:44 PM EST (duration: 2009 ms)

!ENTRY org.eclipse.tcf.te.tests 4 1 2018-02-06 12:50:44.705
!MESSAGE Test case 'testSteppingPerformanceWithSourceDisplay(org.eclipse.tcf.debug.test.SampleTest)' failed. Failure: Failed to read output from agent.
!STACK 0
junit.framework.AssertionFailedError: Failed to read output from agent.
	at junit.framework.Assert.fail(Assert.java:50)
	at junit.framework.Assert.assertTrue(Assert.java:20)
	at junit.framework.Assert.assertNotNull(Assert.java:218)
	at org.eclipse.tcf.te.tests.tcf.TcfTestCase.launchAgent(TcfTestCase.java:157)
	at org.eclipse.tcf.te.tests.tcf.TcfTestCase.setUp(TcfTestCase.java:61)
	at org.eclipse.tcf.debug.test.AbstractCMTest.setUp(AbstractCMTest.java:150)
	at org.eclipse.tcf.debug.test.AbstractTcfUITest.setUp(AbstractTcfUITest.java:86)
	at junit.framework.TestCase.runBare(TestCase.java:132)
	at org.eclipse.tcf.te.tests.CoreTestCase.runBare(CoreTestCase.java:256)
	at junit.framework.TestResult$1.protect(TestResult.java:110)
	at junit.framework.TestResult.runProtected(TestResult.java:128)
	at junit.framework.TestResult.run(TestResult.java:113)
	at junit.framework.TestCase.run(TestCase.java:124)
	at org.eclipse.tcf.te.tests.CoreTestCase.run(CoreTestCase.java:233)
	at junit.framework.TestSuite.runTest(TestSuite.java:243)
	at junit.framework.TestSuite.run(TestSuite.java:238)
	at org.junit.internal.runners.JUnit38ClassRunner.run(JUnit38ClassRunner.java:83)
	at org.apache.maven.surefire.junit4.JUnit4Provider.execute(JUnit4Provider.java:264)
	at org.apache.maven.surefire.junit4.JUnit4Provider.executeTestSet(JUnit4Provider.java:153)
	at org.apache.maven.surefire.junit4.JUnit4Provider.invoke(JUnit4Provider.java:124)
	at sun.reflect.NativeMethodAccessorImpl.invoke0(Native Method)
	at sun.reflect.NativeMethodAccessorImpl.invoke(NativeMethodAccessorImpl.java:57)
	at sun.reflect.DelegatingMethodAccessorImpl.invoke(DelegatingMethodAccessorImpl.java:43)
	at java.lang.reflect.Method.invoke(Method.java:606)
	at org.apache.maven.surefire.util.ReflectionUtils.invokeMethodWithArray2(ReflectionUtils.java:208)
	at org.apache.maven.surefire.booter.ProviderFactory$ProviderProxy.invoke(ProviderFactory.java:156)
	at org.apache.maven.surefire.booter.ProviderFactory.invokeProvider(ProviderFactory.java:82)
	at org.eclipse.tycho.surefire.osgibooter.OsgiSurefireBooter.run(OsgiSurefireBooter.java:91)
	at org.eclipse.tycho.surefire.osgibooter.AbstractUITestApplication.runTests(AbstractUITestApplication.java:44)
	at org.eclipse.ui.internal.testing.WorkbenchTestable$1.run(WorkbenchTestable.java:71)
	at java.lang.Thread.run(Thread.java:745)

=== testSymbolsCMResetOnContextRemove started at: February 6, 2018 12:50:44 PM EST
=== testSymbolsCMResetOnContextRemove finished at: February 6, 2018 12:50:44 PM EST (duration: 7 ms)

!ENTRY org.eclipse.tcf.te.tests 4 1 2018-02-06 12:50:44.714
!MESSAGE Test case 'testSymbolsCMResetOnContextRemove(org.eclipse.tcf.debug.test.SampleTest)' failed. Failure: Agent process died with exit code 127
!STACK 0
junit.framework.AssertionFailedError: Agent process died with exit code 127
	at junit.framework.Assert.fail(Assert.java:50)
	at junit.framework.Assert.assertTrue(Assert.java:20)
	at junit.framework.Assert.assertNotNull(Assert.java:218)
	at org.eclipse.tcf.te.tests.tcf.TcfTestCase.launchAgent(TcfTestCase.java:140)
	at org.eclipse.tcf.te.tests.tcf.TcfTestCase.setUp(TcfTestCase.java:61)
	at org.eclipse.tcf.debug.test.AbstractCMTest.setUp(AbstractCMTest.java:150)
	at org.eclipse.tcf.debug.test.AbstractTcfUITest.setUp(AbstractTcfUITest.java:86)
	at junit.framework.TestCase.runBare(TestCase.java:132)
	at org.eclipse.tcf.te.tests.CoreTestCase.runBare(CoreTestCase.java:256)
	at junit.framework.TestResult$1.protect(TestResult.java:110)
	at junit.framework.TestResult.runProtected(TestResult.java:128)
	at junit.framework.TestResult.run(TestResult.java:113)
	at junit.framework.TestCase.run(TestCase.java:124)
	at org.eclipse.tcf.te.tests.CoreTestCase.run(CoreTestCase.java:233)
	at junit.framework.TestSuite.runTest(TestSuite.java:243)
	at junit.framework.TestSuite.run(TestSuite.java:238)
	at org.junit.internal.runners.JUnit38ClassRunner.run(JUnit38ClassRunner.java:83)
	at org.apache.maven.surefire.junit4.JUnit4Provider.execute(JUnit4Provider.java:264)
	at org.apache.maven.surefire.junit4.JUnit4Provider.executeTestSet(JUnit4Provider.java:153)
	at org.apache.maven.surefire.junit4.JUnit4Provider.invoke(JUnit4Provider.java:124)
	at sun.reflect.NativeMethodAccessorImpl.invoke0(Native Method)
	at sun.reflect.NativeMethodAccessorImpl.invoke(NativeMethodAccessorImpl.java:57)
	at sun.reflect.DelegatingMethodAccessorImpl.invoke(DelegatingMethodAccessorImpl.java:43)
	at java.lang.reflect.Method.invoke(Method.java:606)
	at org.apache.maven.surefire.util.ReflectionUtils.invokeMethodWithArray2(ReflectionUtils.java:208)
	at org.apache.maven.surefire.booter.ProviderFactory$ProviderProxy.invoke(ProviderFactory.java:156)
	at org.apache.maven.surefire.booter.ProviderFactory.invokeProvider(ProviderFactory.java:82)
	at org.eclipse.tycho.surefire.osgibooter.OsgiSurefireBooter.run(OsgiSurefireBooter.java:91)
	at org.eclipse.tycho.surefire.osgibooter.AbstractUITestApplication.runTests(AbstractUITestApplication.java:44)
	at org.eclipse.ui.internal.testing.WorkbenchTestable$1.run(WorkbenchTestable.java:71)
	at java.lang.Thread.run(Thread.java:745)

=== testSymbolsCMResetOnContextStateChange started at: February 6, 2018 12:50:44 PM EST
=== testSymbolsCMResetOnContextStateChange finished at: February 6, 2018 12:50:44 PM EST (duration: 3 ms)

!ENTRY org.eclipse.tcf.te.tests 4 1 2018-02-06 12:50:44.720
!MESSAGE Test case 'testSymbolsCMResetOnContextStateChange(org.eclipse.tcf.debug.test.SampleTest)' failed. Failure: Agent process died with exit code 127
!STACK 0
junit.framework.AssertionFailedError: Agent process died with exit code 127
	at junit.framework.Assert.fail(Assert.java:50)
	at junit.framework.Assert.assertTrue(Assert.java:20)
	at junit.framework.Assert.assertNotNull(Assert.java:218)
	at org.eclipse.tcf.te.tests.tcf.TcfTestCase.launchAgent(TcfTestCase.java:140)
	at org.eclipse.tcf.te.tests.tcf.TcfTestCase.setUp(TcfTestCase.java:61)
	at org.eclipse.tcf.debug.test.AbstractCMTest.setUp(AbstractCMTest.java:150)
	at org.eclipse.tcf.debug.test.AbstractTcfUITest.setUp(AbstractTcfUITest.java:86)
	at junit.framework.TestCase.runBare(TestCase.java:132)
	at org.eclipse.tcf.te.tests.CoreTestCase.runBare(CoreTestCase.java:256)
	at junit.framework.TestResult$1.protect(TestResult.java:110)
	at junit.framework.TestResult.runProtected(TestResult.java:128)
	at junit.framework.TestResult.run(TestResult.java:113)
	at junit.framework.TestCase.run(TestCase.java:124)
	at org.eclipse.tcf.te.tests.CoreTestCase.run(CoreTestCase.java:233)
	at junit.framework.TestSuite.runTest(TestSuite.java:243)
	at junit.framework.TestSuite.run(TestSuite.java:238)
	at org.junit.internal.runners.JUnit38ClassRunner.run(JUnit38ClassRunner.java:83)
	at org.apache.maven.surefire.junit4.JUnit4Provider.execute(JUnit4Provider.java:264)
	at org.apache.maven.surefire.junit4.JUnit4Provider.executeTestSet(JUnit4Provider.java:153)
	at org.apache.maven.surefire.junit4.JUnit4Provider.invoke(JUnit4Provider.java:124)
	at sun.reflect.NativeMethodAccessorImpl.invoke0(Native Method)
	at sun.reflect.NativeMethodAccessorImpl.invoke(NativeMethodAccessorImpl.java:57)
	at sun.reflect.DelegatingMethodAccessorImpl.invoke(DelegatingMethodAccessorImpl.java:43)
	at java.lang.reflect.Method.invoke(Method.java:606)
	at org.apache.maven.surefire.util.ReflectionUtils.invokeMethodWithArray2(ReflectionUtils.java:208)
	at org.apache.maven.surefire.booter.ProviderFactory$ProviderProxy.invoke(ProviderFactory.java:156)
	at org.apache.maven.surefire.booter.ProviderFactory.invokeProvider(ProviderFactory.java:82)
	at org.eclipse.tycho.surefire.osgibooter.OsgiSurefireBooter.run(OsgiSurefireBooter.java:91)
	at org.eclipse.tycho.surefire.osgibooter.AbstractUITestApplication.runTests(AbstractUITestApplication.java:44)
	at org.eclipse.ui.internal.testing.WorkbenchTestable$1.run(WorkbenchTestable.java:71)
	at java.lang.Thread.run(Thread.java:745)

=== testDebugViewContent started at: February 6, 2018 12:50:44 PM EST
=== testDebugViewContent finished at: February 6, 2018 12:50:44 PM EST (duration: 5 ms)

!ENTRY org.eclipse.tcf.te.tests 4 1 2018-02-06 12:50:44.726
!MESSAGE Test case 'testDebugViewContent(org.eclipse.tcf.debug.test.SampleTest)' failed. Failure: Agent process died with exit code 127
!STACK 0
junit.framework.AssertionFailedError: Agent process died with exit code 127
	at junit.framework.Assert.fail(Assert.java:50)
	at junit.framework.Assert.assertTrue(Assert.java:20)
	at junit.framework.Assert.assertNotNull(Assert.java:218)
	at org.eclipse.tcf.te.tests.tcf.TcfTestCase.launchAgent(TcfTestCase.java:140)
	at org.eclipse.tcf.te.tests.tcf.TcfTestCase.setUp(TcfTestCase.java:61)
	at org.eclipse.tcf.debug.test.AbstractCMTest.setUp(AbstractCMTest.java:150)
	at org.eclipse.tcf.debug.test.AbstractTcfUITest.setUp(AbstractTcfUITest.java:86)
	at junit.framework.TestCase.runBare(TestCase.java:132)
	at org.eclipse.tcf.te.tests.CoreTestCase.runBare(CoreTestCase.java:256)
	at junit.framework.TestResult$1.protect(TestResult.java:110)
	at junit.framework.TestResult.runProtected(TestResult.java:128)
	at junit.framework.TestResult.run(TestResult.java:113)
	at junit.framework.TestCase.run(TestCase.java:124)
	at org.eclipse.tcf.te.tests.CoreTestCase.run(CoreTestCase.java:233)
	at junit.framework.TestSuite.runTest(TestSuite.java:243)
	at junit.framework.TestSuite.run(TestSuite.java:238)
	at org.junit.internal.runners.JUnit38ClassRunner.run(JUnit38ClassRunner.java:83)
	at org.apache.maven.surefire.junit4.JUnit4Provider.execute(JUnit4Provider.java:264)
	at org.apache.maven.surefire.junit4.JUnit4Provider.executeTestSet(JUnit4Provider.java:153)
	at org.apache.maven.surefire.junit4.JUnit4Provider.invoke(JUnit4Provider.java:124)
	at sun.reflect.NativeMethodAccessorImpl.invoke0(Native Method)
	at sun.reflect.NativeMethodAccessorImpl.invoke(NativeMethodAccessorImpl.java:57)
	at sun.reflect.DelegatingMethodAccessorImpl.invoke(DelegatingMethodAccessorImpl.java:43)
	at java.lang.reflect.Method.invoke(Method.java:606)
	at org.apache.maven.surefire.util.ReflectionUtils.invokeMethodWithArray2(ReflectionUtils.java:208)
	at org.apache.maven.surefire.booter.ProviderFactory$ProviderProxy.invoke(ProviderFactory.java:156)
	at org.apache.maven.surefire.booter.ProviderFactory.invokeProvider(ProviderFactory.java:82)
	at org.eclipse.tycho.surefire.osgibooter.OsgiSurefireBooter.run(OsgiSurefireBooter.java:91)
	at org.eclipse.tycho.surefire.osgibooter.AbstractUITestApplication.runTests(AbstractUITestApplication.java:44)
	at org.eclipse.ui.internal.testing.WorkbenchTestable$1.run(WorkbenchTestable.java:71)
	at java.lang.Thread.run(Thread.java:745)
Tests run: 6, Failures: 6, Errors: 0, Skipped: 0, Time elapsed: 4.051 sec <<< FAILURE! - in org.eclipse.tcf.debug.test.SampleTest
testSteppingDebugViewOnly(org.eclipse.tcf.debug.test.SampleTest)  Time elapsed: 0.004 sec  <<< FAILURE!
junit.framework.AssertionFailedError: Agent process died with exit code 127
	at junit.framework.Assert.fail(Assert.java:50)
	at junit.framework.Assert.assertTrue(Assert.java:20)
	at junit.framework.Assert.assertNotNull(Assert.java:218)
	at org.eclipse.tcf.te.tests.tcf.TcfTestCase.launchAgent(TcfTestCase.java:140)
	at org.eclipse.tcf.te.tests.tcf.TcfTestCase.setUp(TcfTestCase.java:61)
	at org.eclipse.tcf.debug.test.AbstractCMTest.setUp(AbstractCMTest.java:150)
	at org.eclipse.tcf.debug.test.AbstractTcfUITest.setUp(AbstractTcfUITest.java:86)
	at junit.framework.TestCase.runBare(TestCase.java:132)
	at org.eclipse.tcf.te.tests.CoreTestCase.runBare(CoreTestCase.java:256)
	at junit.framework.TestResult$1.protect(TestResult.java:110)
	at junit.framework.TestResult.runProtected(TestResult.java:128)
	at junit.framework.TestResult.run(TestResult.java:113)
	at junit.framework.TestCase.run(TestCase.java:124)
	at org.eclipse.tcf.te.tests.CoreTestCase.run(CoreTestCase.java:233)
	at junit.framework.TestSuite.runTest(TestSuite.java:243)
	at junit.framework.TestSuite.run(TestSuite.java:238)
	at org.junit.internal.runners.JUnit38ClassRunner.run(JUnit38ClassRunner.java:83)
	at org.apache.maven.surefire.junit4.JUnit4Provider.execute(JUnit4Provider.java:264)
	at org.apache.maven.surefire.junit4.JUnit4Provider.executeTestSet(JUnit4Provider.java:153)
	at org.apache.maven.surefire.junit4.JUnit4Provider.invoke(JUnit4Provider.java:124)
	at sun.reflect.NativeMethodAccessorImpl.invoke0(Native Method)
	at sun.reflect.NativeMethodAccessorImpl.invoke(NativeMethodAccessorImpl.java:57)
	at sun.reflect.DelegatingMethodAccessorImpl.invoke(DelegatingMethodAccessorImpl.java:43)
	at java.lang.reflect.Method.invoke(Method.java:606)
	at org.apache.maven.surefire.util.ReflectionUtils.invokeMethodWithArray2(ReflectionUtils.java:208)
	at org.apache.maven.surefire.booter.ProviderFactory$ProviderProxy.invoke(ProviderFactory.java:156)
	at org.apache.maven.surefire.booter.ProviderFactory.invokeProvider(ProviderFactory.java:82)
	at org.eclipse.tycho.surefire.osgibooter.OsgiSurefireBooter.run(OsgiSurefireBooter.java:91)
	at org.eclipse.tycho.surefire.osgibooter.AbstractUITestApplication.runTests(AbstractUITestApplication.java:44)
	at org.eclipse.ui.internal.testing.WorkbenchTestable$1.run(WorkbenchTestable.java:71)
	at java.lang.Thread.run(Thread.java:745)

testSteppingWithVariablesAndRegisters(org.eclipse.tcf.debug.test.SampleTest)  Time elapsed: 2.008 sec  <<< FAILURE!
junit.framework.AssertionFailedError: Failed to read output from agent.
	at junit.framework.Assert.fail(Assert.java:50)
	at junit.framework.Assert.assertTrue(Assert.java:20)
	at junit.framework.Assert.assertNotNull(Assert.java:218)
	at org.eclipse.tcf.te.tests.tcf.TcfTestCase.launchAgent(TcfTestCase.java:157)
	at org.eclipse.tcf.te.tests.tcf.TcfTestCase.setUp(TcfTestCase.java:61)
	at org.eclipse.tcf.debug.test.AbstractCMTest.setUp(AbstractCMTest.java:150)
	at org.eclipse.tcf.debug.test.AbstractTcfUITest.setUp(AbstractTcfUITest.java:86)
	at junit.framework.TestCase.runBare(TestCase.java:132)
	at org.eclipse.tcf.te.tests.CoreTestCase.runBare(CoreTestCase.java:256)
	at junit.framework.TestResult$1.protect(TestResult.java:110)
	at junit.framework.TestResult.runProtected(TestResult.java:128)
	at junit.framework.TestResult.run(TestResult.java:113)
	at junit.framework.TestCase.run(TestCase.java:124)
	at org.eclipse.tcf.te.tests.CoreTestCase.run(CoreTestCase.java:233)
	at junit.framework.TestSuite.runTest(TestSuite.java:243)
	at junit.framework.TestSuite.run(TestSuite.java:238)
	at org.junit.internal.runners.JUnit38ClassRunner.run(JUnit38ClassRunner.java:83)
	at org.apache.maven.surefire.junit4.JUnit4Provider.execute(JUnit4Provider.java:264)
	at org.apache.maven.surefire.junit4.JUnit4Provider.executeTestSet(JUnit4Provider.java:153)
	at org.apache.maven.surefire.junit4.JUnit4Provider.invoke(JUnit4Provider.java:124)
	at sun.reflect.NativeMethodAccessorImpl.invoke0(Native Method)
	at sun.reflect.NativeMethodAccessorImpl.invoke(NativeMethodAccessorImpl.java:57)
	at sun.reflect.DelegatingMethodAccessorImpl.invoke(DelegatingMethodAccessorImpl.java:43)
	at java.lang.reflect.Method.invoke(Method.java:606)
	at org.apache.maven.surefire.util.ReflectionUtils.invokeMethodWithArray2(ReflectionUtils.java:208)
	at org.apache.maven.surefire.booter.ProviderFactory$ProviderProxy.invoke(ProviderFactory.java:156)
	at org.apache.maven.surefire.booter.ProviderFactory.invokeProvider(ProviderFactory.java:82)
	at org.eclipse.tycho.surefire.osgibooter.OsgiSurefireBooter.run(OsgiSurefireBooter.java:91)
	at org.eclipse.tycho.surefire.osgibooter.AbstractUITestApplication.runTests(AbstractUITestApplication.java:44)
	at org.eclipse.ui.internal.testing.WorkbenchTestable$1.run(WorkbenchTestable.java:71)
	at java.lang.Thread.run(Thread.java:745)

testSteppingPerformanceWithSourceDisplay(org.eclipse.tcf.debug.test.SampleTest)  Time elapsed: 2.009 sec  <<< FAILURE!
junit.framework.AssertionFailedError: Failed to read output from agent.
	at junit.framework.Assert.fail(Assert.java:50)
	at junit.framework.Assert.assertTrue(Assert.java:20)
	at junit.framework.Assert.assertNotNull(Assert.java:218)
	at org.eclipse.tcf.te.tests.tcf.TcfTestCase.launchAgent(TcfTestCase.java:157)
	at org.eclipse.tcf.te.tests.tcf.TcfTestCase.setUp(TcfTestCase.java:61)
	at org.eclipse.tcf.debug.test.AbstractCMTest.setUp(AbstractCMTest.java:150)
	at org.eclipse.tcf.debug.test.AbstractTcfUITest.setUp(AbstractTcfUITest.java:86)
	at junit.framework.TestCase.runBare(TestCase.java:132)
	at org.eclipse.tcf.te.tests.CoreTestCase.runBare(CoreTestCase.java:256)
	at junit.framework.TestResult$1.protect(TestResult.java:110)
	at junit.framework.TestResult.runProtected(TestResult.java:128)
	at junit.framework.TestResult.run(TestResult.java:113)
	at junit.framework.TestCase.run(TestCase.java:124)
	at org.eclipse.tcf.te.tests.CoreTestCase.run(CoreTestCase.java:233)
	at junit.framework.TestSuite.runTest(TestSuite.java:243)
	at junit.framework.TestSuite.run(TestSuite.java:238)
	at org.junit.internal.runners.JUnit38ClassRunner.run(JUnit38ClassRunner.java:83)
	at org.apache.maven.surefire.junit4.JUnit4Provider.execute(JUnit4Provider.java:264)
	at org.apache.maven.surefire.junit4.JUnit4Provider.executeTestSet(JUnit4Provider.java:153)
	at org.apache.maven.surefire.junit4.JUnit4Provider.invoke(JUnit4Provider.java:124)
	at sun.reflect.NativeMethodAccessorImpl.invoke0(Native Method)
	at sun.reflect.NativeMethodAccessorImpl.invoke(NativeMethodAccessorImpl.java:57)
	at sun.reflect.DelegatingMethodAccessorImpl.invoke(DelegatingMethodAccessorImpl.java:43)
	at java.lang.reflect.Method.invoke(Method.java:606)
	at org.apache.maven.surefire.util.ReflectionUtils.invokeMethodWithArray2(ReflectionUtils.java:208)
	at org.apache.maven.surefire.booter.ProviderFactory$ProviderProxy.invoke(ProviderFactory.java:156)
	at org.apache.maven.surefire.booter.ProviderFactory.invokeProvider(ProviderFactory.java:82)
	at org.eclipse.tycho.surefire.osgibooter.OsgiSurefireBooter.run(OsgiSurefireBooter.java:91)
	at org.eclipse.tycho.surefire.osgibooter.AbstractUITestApplication.runTests(AbstractUITestApplication.java:44)
	at org.eclipse.ui.internal.testing.WorkbenchTestable$1.run(WorkbenchTestable.java:71)
	at java.lang.Thread.run(Thread.java:745)

testSymbolsCMResetOnContextRemove(org.eclipse.tcf.debug.test.SampleTest)  Time elapsed: 0.007 sec  <<< FAILURE!
junit.framework.AssertionFailedError: Agent process died with exit code 127
	at junit.framework.Assert.fail(Assert.java:50)
	at junit.framework.Assert.assertTrue(Assert.java:20)
	at junit.framework.Assert.assertNotNull(Assert.java:218)
	at org.eclipse.tcf.te.tests.tcf.TcfTestCase.launchAgent(TcfTestCase.java:140)
	at org.eclipse.tcf.te.tests.tcf.TcfTestCase.setUp(TcfTestCase.java:61)
	at org.eclipse.tcf.debug.test.AbstractCMTest.setUp(AbstractCMTest.java:150)
	at org.eclipse.tcf.debug.test.AbstractTcfUITest.setUp(AbstractTcfUITest.java:86)
	at junit.framework.TestCase.runBare(TestCase.java:132)
	at org.eclipse.tcf.te.tests.CoreTestCase.runBare(CoreTestCase.java:256)
	at junit.framework.TestResult$1.protect(TestResult.java:110)
	at junit.framework.TestResult.runProtected(TestResult.java:128)
	at junit.framework.TestResult.run(TestResult.java:113)
	at junit.framework.TestCase.run(TestCase.java:124)
	at org.eclipse.tcf.te.tests.CoreTestCase.run(CoreTestCase.java:233)
	at junit.framework.TestSuite.runTest(TestSuite.java:243)
	at junit.framework.TestSuite.run(TestSuite.java:238)
	at org.junit.internal.runners.JUnit38ClassRunner.run(JUnit38ClassRunner.java:83)
	at org.apache.maven.surefire.junit4.JUnit4Provider.execute(JUnit4Provider.java:264)
	at org.apache.maven.surefire.junit4.JUnit4Provider.executeTestSet(JUnit4Provider.java:153)
	at org.apache.maven.surefire.junit4.JUnit4Provider.invoke(JUnit4Provider.java:124)
	at sun.reflect.NativeMethodAccessorImpl.invoke0(Native Method)
	at sun.reflect.NativeMethodAccessorImpl.invoke(NativeMethodAccessorImpl.java:57)
	at sun.reflect.DelegatingMethodAccessorImpl.invoke(DelegatingMethodAccessorImpl.java:43)
	at java.lang.reflect.Method.invoke(Method.java:606)
	at org.apache.maven.surefire.util.ReflectionUtils.invokeMethodWithArray2(ReflectionUtils.java:208)
	at org.apache.maven.surefire.booter.ProviderFactory$ProviderProxy.invoke(ProviderFactory.java:156)
	at org.apache.maven.surefire.booter.ProviderFactory.invokeProvider(ProviderFactory.java:82)
	at org.eclipse.tycho.surefire.osgibooter.OsgiSurefireBooter.run(OsgiSurefireBooter.java:91)
	at org.eclipse.tycho.surefire.osgibooter.AbstractUITestApplication.runTests(AbstractUITestApplication.java:44)
	at org.eclipse.ui.internal.testing.WorkbenchTestable$1.run(WorkbenchTestable.java:71)
	at java.lang.Thread.run(Thread.java:745)

testSymbolsCMResetOnContextStateChange(org.eclipse.tcf.debug.test.SampleTest)  Time elapsed: 0.004 sec  <<< FAILURE!
junit.framework.AssertionFailedError: Agent process died with exit code 127
	at junit.framework.Assert.fail(Assert.java:50)
	at junit.framework.Assert.assertTrue(Assert.java:20)
	at junit.framework.Assert.assertNotNull(Assert.java:218)
	at org.eclipse.tcf.te.tests.tcf.TcfTestCase.launchAgent(TcfTestCase.java:140)
	at org.eclipse.tcf.te.tests.tcf.TcfTestCase.setUp(TcfTestCase.java:61)
	at org.eclipse.tcf.debug.test.AbstractCMTest.setUp(AbstractCMTest.java:150)
	at org.eclipse.tcf.debug.test.AbstractTcfUITest.setUp(AbstractTcfUITest.java:86)
	at junit.framework.TestCase.runBare(TestCase.java:132)
	at org.eclipse.tcf.te.tests.CoreTestCase.runBare(CoreTestCase.java:256)
	at junit.framework.TestResult$1.protect(TestResult.java:110)
	at junit.framework.TestResult.runProtected(TestResult.java:128)
	at junit.framework.TestResult.run(TestResult.java:113)
	at junit.framework.TestCase.run(TestCase.java:124)
	at org.eclipse.tcf.te.tests.CoreTestCase.run(CoreTestCase.java:233)
	at junit.framework.TestSuite.runTest(TestSuite.java:243)
	at junit.framework.TestSuite.run(TestSuite.java:238)
	at org.junit.internal.runners.JUnit38ClassRunner.run(JUnit38ClassRunner.java:83)
	at org.apache.maven.surefire.junit4.JUnit4Provider.execute(JUnit4Provider.java:264)
	at org.apache.maven.surefire.junit4.JUnit4Provider.executeTestSet(JUnit4Provider.java:153)
	at org.apache.maven.surefire.junit4.JUnit4Provider.invoke(JUnit4Provider.java:124)
	at sun.reflect.NativeMethodAccessorImpl.invoke0(Native Method)
	at sun.reflect.NativeMethodAccessorImpl.invoke(NativeMethodAccessorImpl.java:57)
	at sun.reflect.DelegatingMethodAccessorImpl.invoke(DelegatingMethodAccessorImpl.java:43)
	at java.lang.reflect.Method.invoke(Method.java:606)
	at org.apache.maven.surefire.util.ReflectionUtils.invokeMethodWithArray2(ReflectionUtils.java:208)
	at org.apache.maven.surefire.booter.ProviderFactory$ProviderProxy.invoke(ProviderFactory.java:156)
	at org.apache.maven.surefire.booter.ProviderFactory.invokeProvider(ProviderFactory.java:82)
	at org.eclipse.tycho.surefire.osgibooter.OsgiSurefireBooter.run(OsgiSurefireBooter.java:91)
	at org.eclipse.tycho.surefire.osgibooter.AbstractUITestApplication.runTests(AbstractUITestApplication.java:44)
	at org.eclipse.ui.internal.testing.WorkbenchTestable$1.run(WorkbenchTestable.java:71)
	at java.lang.Thread.run(Thread.java:745)

testDebugViewContent(org.eclipse.tcf.debug.test.SampleTest)  Time elapsed: 0.005 sec  <<< FAILURE!
junit.framework.AssertionFailedError: Agent process died with exit code 127
	at junit.framework.Assert.fail(Assert.java:50)
	at junit.framework.Assert.assertTrue(Assert.java:20)
	at junit.framework.Assert.assertNotNull(Assert.java:218)
	at org.eclipse.tcf.te.tests.tcf.TcfTestCase.launchAgent(TcfTestCase.java:140)
	at org.eclipse.tcf.te.tests.tcf.TcfTestCase.setUp(TcfTestCase.java:61)
	at org.eclipse.tcf.debug.test.AbstractCMTest.setUp(AbstractCMTest.java:150)
	at org.eclipse.tcf.debug.test.AbstractTcfUITest.setUp(AbstractTcfUITest.java:86)
	at junit.framework.TestCase.runBare(TestCase.java:132)
	at org.eclipse.tcf.te.tests.CoreTestCase.runBare(CoreTestCase.java:256)
	at junit.framework.TestResult$1.protect(TestResult.java:110)
	at junit.framework.TestResult.runProtected(TestResult.java:128)
	at junit.framework.TestResult.run(TestResult.java:113)
	at junit.framework.TestCase.run(TestCase.java:124)
	at org.eclipse.tcf.te.tests.CoreTestCase.run(CoreTestCase.java:233)
	at junit.framework.TestSuite.runTest(TestSuite.java:243)
	at junit.framework.TestSuite.run(TestSuite.java:238)
	at org.junit.internal.runners.JUnit38ClassRunner.run(JUnit38ClassRunner.java:83)
	at org.apache.maven.surefire.junit4.JUnit4Provider.execute(JUnit4Provider.java:264)
	at org.apache.maven.surefire.junit4.JUnit4Provider.executeTestSet(JUnit4Provider.java:153)
	at org.apache.maven.surefire.junit4.JUnit4Provider.invoke(JUnit4Provider.java:124)
	at sun.reflect.NativeMethodAccessorImpl.invoke0(Native Method)
	at sun.reflect.NativeMethodAccessorImpl.invoke(NativeMethodAccessorImpl.java:57)
	at sun.reflect.DelegatingMethodAccessorImpl.invoke(DelegatingMethodAccessorImpl.java:43)
	at java.lang.reflect.Method.invoke(Method.java:606)
	at org.apache.maven.surefire.util.ReflectionUtils.invokeMethodWithArray2(ReflectionUtils.java:208)
	at org.apache.maven.surefire.booter.ProviderFactory$ProviderProxy.invoke(ProviderFactory.java:156)
	at org.apache.maven.surefire.booter.ProviderFactory.invokeProvider(ProviderFactory.java:82)
	at org.eclipse.tycho.surefire.osgibooter.OsgiSurefireBooter.run(OsgiSurefireBooter.java:91)
	at org.eclipse.tycho.surefire.osgibooter.AbstractUITestApplication.runTests(AbstractUITestApplication.java:44)
	at org.eclipse.ui.internal.testing.WorkbenchTestable$1.run(WorkbenchTestable.java:71)
	at java.lang.Thread.run(Thread.java:745)

Running org.eclipse.tcf.debug.test.BreakpointDetailPaneTest

=== testContextQueryFilter started at: February 6, 2018 12:50:44 PM EST
=== testContextQueryFilter finished at: February 6, 2018 12:50:46 PM EST (duration: 2009 ms)

!ENTRY org.eclipse.tcf.te.tests 4 1 2018-02-06 12:50:46.768
!MESSAGE Test case 'testContextQueryFilter(org.eclipse.tcf.debug.test.BreakpointDetailPaneTest)' failed. Failure: Failed to read output from agent.
!STACK 0
junit.framework.AssertionFailedError: Failed to read output from agent.
	at junit.framework.Assert.fail(Assert.java:50)
	at junit.framework.Assert.assertTrue(Assert.java:20)
	at junit.framework.Assert.assertNotNull(Assert.java:218)
	at org.eclipse.tcf.te.tests.tcf.TcfTestCase.launchAgent(TcfTestCase.java:157)
	at org.eclipse.tcf.te.tests.tcf.TcfTestCase.setUp(TcfTestCase.java:61)
	at org.eclipse.tcf.debug.test.AbstractCMTest.setUp(AbstractCMTest.java:150)
	at org.eclipse.tcf.debug.test.AbstractTcfUITest.setUp(AbstractTcfUITest.java:86)
	at org.eclipse.tcf.debug.test.BreakpointDetailPaneTest.setUp(BreakpointDetailPaneTest.java:40)
	at junit.framework.TestCase.runBare(TestCase.java:132)
	at org.eclipse.tcf.te.tests.CoreTestCase.runBare(CoreTestCase.java:256)
	at junit.framework.TestResult$1.protect(TestResult.java:110)
	at junit.framework.TestResult.runProtected(TestResult.java:128)
	at junit.framework.TestResult.run(TestResult.java:113)
	at junit.framework.TestCase.run(TestCase.java:124)
	at org.eclipse.tcf.te.tests.CoreTestCase.run(CoreTestCase.java:233)
	at junit.framework.TestSuite.runTest(TestSuite.java:243)
	at junit.framework.TestSuite.run(TestSuite.java:238)
	at org.junit.internal.runners.JUnit38ClassRunner.run(JUnit38ClassRunner.java:83)
	at org.apache.maven.surefire.junit4.JUnit4Provider.execute(JUnit4Provider.java:264)
	at org.apache.maven.surefire.junit4.JUnit4Provider.executeTestSet(JUnit4Provider.java:153)
	at org.apache.maven.surefire.junit4.JUnit4Provider.invoke(JUnit4Provider.java:124)
	at sun.reflect.NativeMethodAccessorImpl.invoke0(Native Method)
	at sun.reflect.NativeMethodAccessorImpl.invoke(NativeMethodAccessorImpl.java:57)
	at sun.reflect.DelegatingMethodAccessorImpl.invoke(DelegatingMethodAccessorImpl.java:43)
	at java.lang.reflect.Method.invoke(Method.java:606)
	at org.apache.maven.surefire.util.ReflectionUtils.invokeMethodWithArray2(ReflectionUtils.java:208)
	at org.apache.maven.surefire.booter.ProviderFactory$ProviderProxy.invoke(ProviderFactory.java:156)
	at org.apache.maven.surefire.booter.ProviderFactory.invokeProvider(ProviderFactory.java:82)
	at org.eclipse.tycho.surefire.osgibooter.OsgiSurefireBooter.run(OsgiSurefireBooter.java:91)
	at org.eclipse.tycho.surefire.osgibooter.AbstractUITestApplication.runTests(AbstractUITestApplication.java:44)
	at org.eclipse.ui.internal.testing.WorkbenchTestable$1.run(WorkbenchTestable.java:71)
	at java.lang.Thread.run(Thread.java:745)

=== testContextsFilter started at: February 6, 2018 12:50:46 PM EST
=== testContextsFilter finished at: February 6, 2018 12:50:46 PM EST (duration: 11 ms)

!ENTRY org.eclipse.tcf.te.tests 4 1 2018-02-06 12:50:46.782
!MESSAGE Test case 'testContextsFilter(org.eclipse.tcf.debug.test.BreakpointDetailPaneTest)' failed. Failure: Agent process died with exit code 127
!STACK 0
junit.framework.AssertionFailedError: Agent process died with exit code 127
	at junit.framework.Assert.fail(Assert.java:50)
	at junit.framework.Assert.assertTrue(Assert.java:20)
	at junit.framework.Assert.assertNotNull(Assert.java:218)
	at org.eclipse.tcf.te.tests.tcf.TcfTestCase.launchAgent(TcfTestCase.java:140)
	at org.eclipse.tcf.te.tests.tcf.TcfTestCase.setUp(TcfTestCase.java:61)
	at org.eclipse.tcf.debug.test.AbstractCMTest.setUp(AbstractCMTest.java:150)
	at org.eclipse.tcf.debug.test.AbstractTcfUITest.setUp(AbstractTcfUITest.java:86)
	at org.eclipse.tcf.debug.test.BreakpointDetailPaneTest.setUp(BreakpointDetailPaneTest.java:40)
	at junit.framework.TestCase.runBare(TestCase.java:132)
	at org.eclipse.tcf.te.tests.CoreTestCase.runBare(CoreTestCase.java:256)
	at junit.framework.TestResult$1.protect(TestResult.java:110)
	at junit.framework.TestResult.runProtected(TestResult.java:128)
	at junit.framework.TestResult.run(TestResult.java:113)
	at junit.framework.TestCase.run(TestCase.java:124)
	at org.eclipse.tcf.te.tests.CoreTestCase.run(CoreTestCase.java:233)
	at junit.framework.TestSuite.runTest(TestSuite.java:243)
	at junit.framework.TestSuite.run(TestSuite.java:238)
	at org.junit.internal.runners.JUnit38ClassRunner.run(JUnit38ClassRunner.java:83)
	at org.apache.maven.surefire.junit4.JUnit4Provider.execute(JUnit4Provider.java:264)
	at org.apache.maven.surefire.junit4.JUnit4Provider.executeTestSet(JUnit4Provider.java:153)
	at org.apache.maven.surefire.junit4.JUnit4Provider.invoke(JUnit4Provider.java:124)
	at sun.reflect.NativeMethodAccessorImpl.invoke0(Native Method)
	at sun.reflect.NativeMethodAccessorImpl.invoke(NativeMethodAccessorImpl.java:57)
	at sun.reflect.DelegatingMethodAccessorImpl.invoke(DelegatingMethodAccessorImpl.java:43)
	at java.lang.reflect.Method.invoke(Method.java:606)
	at org.apache.maven.surefire.util.ReflectionUtils.invokeMethodWithArray2(ReflectionUtils.java:208)
	at org.apache.maven.surefire.booter.ProviderFactory$ProviderProxy.invoke(ProviderFactory.java:156)
	at org.apache.maven.surefire.booter.ProviderFactory.invokeProvider(ProviderFactory.java:82)
	at org.eclipse.tycho.surefire.osgibooter.OsgiSurefireBooter.run(OsgiSurefireBooter.java:91)
	at org.eclipse.tycho.surefire.osgibooter.AbstractUITestApplication.runTests(AbstractUITestApplication.java:44)
	at org.eclipse.ui.internal.testing.WorkbenchTestable$1.run(WorkbenchTestable.java:71)
	at java.lang.Thread.run(Thread.java:745)
Tests run: 2, Failures: 2, Errors: 0, Skipped: 0, Time elapsed: 2.03 sec <<< FAILURE! - in org.eclipse.tcf.debug.test.BreakpointDetailPaneTest
testContextQueryFilter(org.eclipse.tcf.debug.test.BreakpointDetailPaneTest)  Time elapsed: 2.01 sec  <<< FAILURE!
junit.framework.AssertionFailedError: Failed to read output from agent.
	at junit.framework.Assert.fail(Assert.java:50)
	at junit.framework.Assert.assertTrue(Assert.java:20)
	at junit.framework.Assert.assertNotNull(Assert.java:218)
	at org.eclipse.tcf.te.tests.tcf.TcfTestCase.launchAgent(TcfTestCase.java:157)
	at org.eclipse.tcf.te.tests.tcf.TcfTestCase.setUp(TcfTestCase.java:61)
	at org.eclipse.tcf.debug.test.AbstractCMTest.setUp(AbstractCMTest.java:150)
	at org.eclipse.tcf.debug.test.AbstractTcfUITest.setUp(AbstractTcfUITest.java:86)
	at org.eclipse.tcf.debug.test.BreakpointDetailPaneTest.setUp(BreakpointDetailPaneTest.java:40)

testContextsFilter(org.eclipse.tcf.debug.test.BreakpointDetailPaneTest)  Time elapsed: 0.012 sec  <<< FAILURE!
junit.framework.AssertionFailedError: Agent process died with exit code 127
	at junit.framework.Assert.fail(Assert.java:50)
	at junit.framework.Assert.assertTrue(Assert.java:20)
	at junit.framework.Assert.assertNotNull(Assert.java:218)
	at org.eclipse.tcf.te.tests.tcf.TcfTestCase.launchAgent(TcfTestCase.java:140)
	at org.eclipse.tcf.te.tests.tcf.TcfTestCase.setUp(TcfTestCase.java:61)
	at org.eclipse.tcf.debug.test.AbstractCMTest.setUp(AbstractCMTest.java:150)
	at org.eclipse.tcf.debug.test.AbstractTcfUITest.setUp(AbstractTcfUITest.java:86)
	at org.eclipse.tcf.debug.test.BreakpointDetailPaneTest.setUp(BreakpointDetailPaneTest.java:40)

Running org.eclipse.tcf.debug.test.BreakpointsTest

=== testContextAddedOnLineBrakpointCreate started at: February 6, 2018 12:50:48 PM EST
=== testContextAddedOnLineBrakpointCreate finished at: February 6, 2018 12:50:48 PM EST (duration: 4 ms)

!ENTRY org.eclipse.tcf.te.tests 4 1 2018-02-06 12:50:48.430
!MESSAGE Test case 'testContextAddedOnLineBrakpointCreate(org.eclipse.tcf.debug.test.BreakpointsTest)' failed. Failure: Agent process died with exit code 127
!STACK 0
junit.framework.AssertionFailedError: Agent process died with exit code 127
	at junit.framework.Assert.fail(Assert.java:50)
	at junit.framework.Assert.assertTrue(Assert.java:20)
	at junit.framework.Assert.assertNotNull(Assert.java:218)
	at org.eclipse.tcf.te.tests.tcf.TcfTestCase.launchAgent(TcfTestCase.java:140)
	at org.eclipse.tcf.te.tests.tcf.TcfTestCase.setUp(TcfTestCase.java:61)
	at org.eclipse.tcf.debug.test.AbstractCMTest.setUp(AbstractCMTest.java:150)
	at org.eclipse.tcf.debug.test.AbstractTcfUITest.setUp(AbstractTcfUITest.java:86)
	at org.eclipse.tcf.debug.test.BreakpointsTest.setUp(BreakpointsTest.java:51)
	at junit.framework.TestCase.runBare(TestCase.java:132)
	at org.eclipse.tcf.te.tests.CoreTestCase.runBare(CoreTestCase.java:256)
	at junit.framework.TestResult$1.protect(TestResult.java:110)
	at junit.framework.TestResult.runProtected(TestResult.java:128)
	at junit.framework.TestResult.run(TestResult.java:113)
	at junit.framework.TestCase.run(TestCase.java:124)
	at org.eclipse.tcf.te.tests.CoreTestCase.run(CoreTestCase.java:233)
	at junit.framework.TestSuite.runTest(TestSuite.java:243)
	at junit.framework.TestSuite.run(TestSuite.java:238)
	at org.junit.internal.runners.JUnit38ClassRunner.run(JUnit38ClassRunner.java:83)
	at org.apache.maven.surefire.junit4.JUnit4Provider.execute(JUnit4Provider.java:264)
	at org.apache.maven.surefire.junit4.JUnit4Provider.executeTestSet(JUnit4Provider.java:153)
	at org.apache.maven.surefire.junit4.JUnit4Provider.invoke(JUnit4Provider.java:124)
	at sun.reflect.NativeMethodAccessorImpl.invoke0(Native Method)
	at sun.reflect.NativeMethodAccessorImpl.invoke(NativeMethodAccessorImpl.java:57)
	at sun.reflect.DelegatingMethodAccessorImpl.invoke(DelegatingMethodAccessorImpl.java:43)
	at java.lang.reflect.Method.invoke(Method.java:606)
	at org.apache.maven.surefire.util.ReflectionUtils.invokeMethodWithArray2(ReflectionUtils.java:208)
	at org.apache.maven.surefire.booter.ProviderFactory$ProviderProxy.invoke(ProviderFactory.java:156)
	at org.apache.maven.surefire.booter.ProviderFactory.invokeProvider(ProviderFactory.java:82)
	at org.eclipse.tycho.surefire.osgibooter.OsgiSurefireBooter.run(OsgiSurefireBooter.java:91)
	at org.eclipse.tycho.surefire.osgibooter.AbstractUITestApplication.runTests(AbstractUITestApplication.java:44)
	at org.eclipse.ui.internal.testing.WorkbenchTestable$1.run(WorkbenchTestable.java:71)
	at java.lang.Thread.run(Thread.java:745)

=== testForeignBreakpointCreate started at: February 6, 2018 12:50:48 PM EST
=== testForeignBreakpointCreate finished at: February 6, 2018 12:50:50 PM EST (duration: 2005 ms)

!ENTRY org.eclipse.tcf.te.tests 4 1 2018-02-06 12:50:50.438
!MESSAGE Test case 'testForeignBreakpointCreate(org.eclipse.tcf.debug.test.BreakpointsTest)' failed. Failure: Failed to read output from agent.
!STACK 0
junit.framework.AssertionFailedError: Failed to read output from agent.
	at junit.framework.Assert.fail(Assert.java:50)
	at junit.framework.Assert.assertTrue(Assert.java:20)
	at junit.framework.Assert.assertNotNull(Assert.java:218)
	at org.eclipse.tcf.te.tests.tcf.TcfTestCase.launchAgent(TcfTestCase.java:157)
	at org.eclipse.tcf.te.tests.tcf.TcfTestCase.setUp(TcfTestCase.java:61)
	at org.eclipse.tcf.debug.test.AbstractCMTest.setUp(AbstractCMTest.java:150)
	at org.eclipse.tcf.debug.test.AbstractTcfUITest.setUp(AbstractTcfUITest.java:86)
	at org.eclipse.tcf.debug.test.BreakpointsTest.setUp(BreakpointsTest.java:51)
	at junit.framework.TestCase.runBare(TestCase.java:132)
	at org.eclipse.tcf.te.tests.CoreTestCase.runBare(CoreTestCase.java:256)
	at junit.framework.TestResult$1.protect(TestResult.java:110)
	at junit.framework.TestResult.runProtected(TestResult.java:128)
	at junit.framework.TestResult.run(TestResult.java:113)
	at junit.framework.TestCase.run(TestCase.java:124)
	at org.eclipse.tcf.te.tests.CoreTestCase.run(CoreTestCase.java:233)
	at junit.framework.TestSuite.runTest(TestSuite.java:243)
	at junit.framework.TestSuite.run(TestSuite.java:238)
	at org.junit.internal.runners.JUnit38ClassRunner.run(JUnit38ClassRunner.java:83)
	at org.apache.maven.surefire.junit4.JUnit4Provider.execute(JUnit4Provider.java:264)
	at org.apache.maven.surefire.junit4.JUnit4Provider.executeTestSet(JUnit4Provider.java:153)
	at org.apache.maven.surefire.junit4.JUnit4Provider.invoke(JUnit4Provider.java:124)
	at sun.reflect.NativeMethodAccessorImpl.invoke0(Native Method)
	at sun.reflect.NativeMethodAccessorImpl.invoke(NativeMethodAccessorImpl.java:57)
	at sun.reflect.DelegatingMethodAccessorImpl.invoke(DelegatingMethodAccessorImpl.java:43)
	at java.lang.reflect.Method.invoke(Method.java:606)
	at org.apache.maven.surefire.util.ReflectionUtils.invokeMethodWithArray2(ReflectionUtils.java:208)
	at org.apache.maven.surefire.booter.ProviderFactory$ProviderProxy.invoke(ProviderFactory.java:156)
	at org.apache.maven.surefire.booter.ProviderFactory.invokeProvider(ProviderFactory.java:82)
	at org.eclipse.tycho.surefire.osgibooter.OsgiSurefireBooter.run(OsgiSurefireBooter.java:91)
	at org.eclipse.tycho.surefire.osgibooter.AbstractUITestApplication.runTests(AbstractUITestApplication.java:44)
	at org.eclipse.ui.internal.testing.WorkbenchTestable$1.run(WorkbenchTestable.java:71)
	at java.lang.Thread.run(Thread.java:745)
Tests run: 2, Failures: 2, Errors: 0, Skipped: 0, Time elapsed: 2.098 sec <<< FAILURE! - in org.eclipse.tcf.debug.test.BreakpointsTest
testContextAddedOnLineBrakpointCreate(org.eclipse.tcf.debug.test.BreakpointsTest)  Time elapsed: 0.005 sec  <<< FAILURE!
junit.framework.AssertionFailedError: Agent process died with exit code 127
	at junit.framework.Assert.fail(Assert.java:50)
	at junit.framework.Assert.assertTrue(Assert.java:20)
	at junit.framework.Assert.assertNotNull(Assert.java:218)
	at org.eclipse.tcf.te.tests.tcf.TcfTestCase.launchAgent(TcfTestCase.java:140)
	at org.eclipse.tcf.te.tests.tcf.TcfTestCase.setUp(TcfTestCase.java:61)
	at org.eclipse.tcf.debug.test.AbstractCMTest.setUp(AbstractCMTest.java:150)
	at org.eclipse.tcf.debug.test.AbstractTcfUITest.setUp(AbstractTcfUITest.java:86)
	at org.eclipse.tcf.debug.test.BreakpointsTest.setUp(BreakpointsTest.java:51)

testForeignBreakpointCreate(org.eclipse.tcf.debug.test.BreakpointsTest)  Time elapsed: 2.006 sec  <<< FAILURE!
junit.framework.AssertionFailedError: Failed to read output from agent.
	at junit.framework.Assert.fail(Assert.java:50)
	at junit.framework.Assert.assertTrue(Assert.java:20)
	at junit.framework.Assert.assertNotNull(Assert.java:218)
	at org.eclipse.tcf.te.tests.tcf.TcfTestCase.launchAgent(TcfTestCase.java:157)
	at org.eclipse.tcf.te.tests.tcf.TcfTestCase.setUp(TcfTestCase.java:61)
	at org.eclipse.tcf.debug.test.AbstractCMTest.setUp(AbstractCMTest.java:150)
	at org.eclipse.tcf.debug.test.AbstractTcfUITest.setUp(AbstractTcfUITest.java:86)
	at org.eclipse.tcf.debug.test.BreakpointsTest.setUp(BreakpointsTest.java:51)


Results :

Failed tests: 
  RunControlCMTest>CoreTestCase.run:233->CoreTestCase.runBare:256->AbstractCMTest.setUp:150->TcfTestCase.setUp:61->TcfTestCase.launchAgent:140 Agent process died with exit code 127
  RunControlCMTest>CoreTestCase.run:233->CoreTestCase.runBare:256->AbstractCMTest.setUp:150->TcfTestCase.setUp:61->TcfTestCase.launchAgent:140 Agent process died with exit code 127
  RunControlCMTest>CoreTestCase.run:233->CoreTestCase.runBare:256->AbstractCMTest.setUp:150->TcfTestCase.setUp:61->TcfTestCase.launchAgent:140 Agent process died with exit code 127
  RunControlCMTest>CoreTestCase.run:233->CoreTestCase.runBare:256->AbstractCMTest.setUp:150->TcfTestCase.setUp:61->TcfTestCase.launchAgent:140 Agent process died with exit code 127
  RunControlCMTest>CoreTestCase.run:233->CoreTestCase.runBare:256->AbstractCMTest.setUp:150->TcfTestCase.setUp:61->TcfTestCase.launchAgent:140 Agent process died with exit code 127
  StackTraceCMTest>CoreTestCase.run:233->CoreTestCase.runBare:256->AbstractCMTest.setUp:150->TcfTestCase.setUp:61->TcfTestCase.launchAgent:140 Agent process died with exit code 127
  StackTraceCMTest>CoreTestCase.run:233->CoreTestCase.runBare:256->AbstractCMTest.setUp:150->TcfTestCase.setUp:61->TcfTestCase.launchAgent:157 Failed to read output from agent.
  StackTraceCMTest>CoreTestCase.run:233->CoreTestCase.runBare:256->AbstractCMTest.setUp:150->TcfTestCase.setUp:61->TcfTestCase.launchAgent:157 Failed to read output from agent.
  StackTraceCMTest>CoreTestCase.run:233->CoreTestCase.runBare:256->AbstractCMTest.setUp:150->TcfTestCase.setUp:61->TcfTestCase.launchAgent:157 Failed to read output from agent.
  BreakpointsViewTest>CoreTestCase.run:233->CoreTestCase.runBare:256->setUp:47->AbstractTcfUITest.setUp:86->AbstractCMTest.setUp:150->TcfTestCase.setUp:61->TcfTestCase.launchAgent:140 Agent process died with exit code 127
  SampleTest>CoreTestCase.run:233->CoreTestCase.runBare:256->AbstractTcfUITest.setUp:86->AbstractCMTest.setUp:150->TcfTestCase.setUp:61->TcfTestCase.launchAgent:140 Agent process died with exit code 127
  SampleTest>CoreTestCase.run:233->CoreTestCase.runBare:256->AbstractTcfUITest.setUp:86->AbstractCMTest.setUp:150->TcfTestCase.setUp:61->TcfTestCase.launchAgent:157 Failed to read output from agent.
  SampleTest>CoreTestCase.run:233->CoreTestCase.runBare:256->AbstractTcfUITest.setUp:86->AbstractCMTest.setUp:150->TcfTestCase.setUp:61->TcfTestCase.launchAgent:157 Failed to read output from agent.
  SampleTest>CoreTestCase.run:233->CoreTestCase.runBare:256->AbstractTcfUITest.setUp:86->AbstractCMTest.setUp:150->TcfTestCase.setUp:61->TcfTestCase.launchAgent:140 Agent process died with exit code 127
  SampleTest>CoreTestCase.run:233->CoreTestCase.runBare:256->AbstractTcfUITest.setUp:86->AbstractCMTest.setUp:150->TcfTestCase.setUp:61->TcfTestCase.launchAgent:140 Agent process died with exit code 127
  SampleTest>CoreTestCase.run:233->CoreTestCase.runBare:256->AbstractTcfUITest.setUp:86->AbstractCMTest.setUp:150->TcfTestCase.setUp:61->TcfTestCase.launchAgent:140 Agent process died with exit code 127
  BreakpointDetailPaneTest>CoreTestCase.run:233->CoreTestCase.runBare:256->setUp:40->AbstractTcfUITest.setUp:86->AbstractCMTest.setUp:150->TcfTestCase.setUp:61->TcfTestCase.launchAgent:157 Failed to read output from agent.
  BreakpointDetailPaneTest>CoreTestCase.run:233->CoreTestCase.runBare:256->setUp:40->AbstractTcfUITest.setUp:86->AbstractCMTest.setUp:150->TcfTestCase.setUp:61->TcfTestCase.launchAgent:140 Agent process died with exit code 127
  BreakpointsTest>CoreTestCase.run:233->CoreTestCase.runBare:256->setUp:51->AbstractTcfUITest.setUp:86->AbstractCMTest.setUp:150->TcfTestCase.setUp:61->TcfTestCase.launchAgent:140 Agent process died with exit code 127
  BreakpointsTest>CoreTestCase.run:233->CoreTestCase.runBare:256->setUp:51->AbstractTcfUITest.setUp:86->AbstractCMTest.setUp:150->TcfTestCase.setUp:61->TcfTestCase.launchAgent:157 Failed to read output from agent.

Tests run: 60, Failures: 20, Errors: 0, Skipped: 0

[ERROR] There are test failures.

Please refer to /jobs/genie.tcf/tcf-1.4/workspace/tests/plugins/org.eclipse.tcf.debug.test/target/surefire-reports for the individual test results.
[INFO] 
[INFO] --- maven-antrun-plugin:1.8:run (generate-report) @ org.eclipse.tcf.debug.test ---
[INFO] Executing tasks

main:
     [echo] Coverage report
   [report] Loading execution data file /jobs/genie.tcf/tcf-1.4/workspace/tests/plugins/org.eclipse.tcf.debug.test/target/jacoco.exec
   [report] Writing bundle 'org.eclipse.tcf' with 11 classes
   [report] Classes in bundle 'org.eclipse.tcf' do no match with execution data. For report generation the same class files must be used as at runtime.
   [report] Execution data for class org/eclipse/tcf/ssl/TCFSecurityManager$2 does not match.
   [report] Execution data for class org/eclipse/tcf/Activator does not match.
   [report] Execution data for class org/eclipse/tcf/ssl/TCFSecurityManager$1 does not match.
   [report] Execution data for class org/eclipse/tcf/Activator$2$1 does not match.
   [report] Execution data for class org/eclipse/tcf/EventQueue does not match.
   [report] Execution data for class org/eclipse/tcf/Activator$1 does not match.
   [report] Execution data for class org/eclipse/tcf/Activator$2 does not match.
   [report] Execution data for class org/eclipse/tcf/Activator$3 does not match.
   [report] Execution data for class org/eclipse/tcf/ssl/TCFSecurityManager does not match.
   [report] Execution data for class org/eclipse/tcf/EventQueue$1 does not match.
   [report] Writing bundle 'org.eclipse.tcf.core' with 325 classes
   [report] Classes in bundle 'org.eclipse.tcf.core' do no match with execution data. For report generation the same class files must be used as at runtime.
   [report] Execution data for class org/eclipse/tcf/internal/services/local/LocatorService$InputPacket does not match.
   [report] Execution data for class org/eclipse/tcf/core/ChannelTCP does not match.
   [report] Execution data for class org/eclipse/tcf/internal/services/local/LocatorService$1$1 does not match.
   [report] Execution data for class org/eclipse/tcf/core/TransientPeer does not match.
   [report] Execution data for class org/eclipse/tcf/core/StreamChannel does not match.
   [report] Execution data for class org/eclipse/tcf/internal/core/ServiceManager does not match.
   [report] Execution data for class org/eclipse/tcf/protocol/Protocol does not match.
   [report] Execution data for class org/eclipse/tcf/core/AbstractPeer does not match.
   [report] Execution data for class org/eclipse/tcf/protocol/Protocol$Timer does not match.
   [report] Execution data for class org/eclipse/tcf/internal/core/ServiceManager$1 does not match.
   [report] Execution data for class org/eclipse/tcf/core/AbstractChannel does not match.
   [report] Execution data for class org/eclipse/tcf/internal/Activator does not match.
   [report] Execution data for class org/eclipse/tcf/internal/core/LocalPeer does not match.
   [report] Execution data for class org/eclipse/tcf/internal/services/local/LocatorService$5 does not match.
   [report] Execution data for class org/eclipse/tcf/internal/services/local/LocatorService$6 does not match.
   [report] Execution data for class org/eclipse/tcf/internal/services/local/LocatorService$3 does not match.
   [report] Execution data for class org/eclipse/tcf/internal/services/local/LocatorService$4 does not match.
   [report] Execution data for class org/eclipse/tcf/internal/services/local/LocatorService$1 does not match.
   [report] Execution data for class org/eclipse/tcf/internal/services/local/LocatorService$2 does not match.
   [report] Execution data for class org/eclipse/tcf/internal/services/local/LocatorService$SubNet does not match.
   [report] Execution data for class org/eclipse/tcf/protocol/Protocol$3 does not match.
   [report] Execution data for class org/eclipse/tcf/protocol/Protocol$2 does not match.
   [report] Execution data for class org/eclipse/tcf/protocol/Protocol$1 does not match.
   [report] Execution data for class org/eclipse/tcf/internal/services/local/LocatorService does not match.
   [report] Writing bundle 'org.eclipse.tcf.debug' with 355 classes
   [report] Classes in bundle 'org.eclipse.tcf.debug' do no match with execution data. For report generation the same class files must be used as at runtime.
   [report] Execution data for class org/eclipse/tcf/internal/debug/Activator$1 does not match.
   [report] Execution data for class org/eclipse/tcf/internal/debug/Activator does not match.
   [report] Execution data for class org/eclipse/tcf/internal/debug/launch/TCFUserDefPeer does not match.
   [report] Execution data for class org/eclipse/tcf/internal/debug/model/TCFLaunch does not match.
   [report] Execution data for class org/eclipse/tcf/internal/debug/model/TCFBreakpointsModel does not match.
   [report] Execution data for class org/eclipse/tcf/internal/debug/model/TCFBreakpointsModel$2 does not match.
   [report] Execution data for class org/eclipse/tcf/internal/debug/model/TCFBreakpointsModel$1 does not match.
   [report] Execution data for class org/eclipse/tcf/internal/debug/launch/TCFLocalAgent does not match.
   [report] Writing bundle 'org.eclipse.tcf.debug.ui' with 690 classes
   [report] Classes in bundle 'org.eclipse.tcf.debug.ui' do no match with execution data. For report generation the same class files must be used as at runtime.
   [report] Execution data for class org/eclipse/tcf/internal/debug/ui/Activator$1 does not match.
   [report] Execution data for class org/eclipse/tcf/internal/debug/ui/Activator$2 does not match.
   [report] Execution data for class org/eclipse/tcf/internal/debug/ui/model/TCFModelManager$2 does not match.
   [report] Execution data for class org/eclipse/tcf/internal/debug/ui/model/TCFModelManager$1 does not match.
   [report] Execution data for class org/eclipse/tcf/internal/debug/ui/model/TCFModelManager$3 does not match.
   [report] Execution data for class org/eclipse/tcf/internal/debug/ui/model/TCFMemoryBlock does not match.
   [report] Execution data for class org/eclipse/tcf/internal/debug/ui/model/TCFModelManager does not match.
   [report] Execution data for class org/eclipse/tcf/internal/debug/ui/Activator does not match.
   [report] Execution data for class org/eclipse/tcf/internal/debug/ui/model/TCFMemoryBlock$11 does not match.
   [report] Writing bundle 'org.eclipse.tcf.cdt.ui' with 214 classes
[INFO] Executed tasks
[INFO] 
[INFO] --- tycho-pack200a-plugin:0.22.0:normalize (pack200-normalize) @ org.eclipse.tcf.debug.test ---
[INFO] Pack200 normalizing jar /jobs/genie.tcf/tcf-1.4/workspace/tests/plugins/org.eclipse.tcf.debug.test/target/org.eclipse.tcf.debug.test-1.4.0.qualifier.jar
[INFO] 
[INFO] --- eclipse-jarsigner-plugin:1.1.2:sign (sign) @ org.eclipse.tcf.debug.test ---
[INFO] Searching org.eclipse.tcf.debug.test-1.4.0.qualifier.jar for inner jars...
[INFO] Signed org.eclipse.tcf:org.eclipse.tcf.debug.test:eclipse-test-plugin:1.4.0.qualifier in 1 seconds.
[INFO] Searching org.eclipse.tcf.debug.test-1.4.0.qualifier-sources.jar for inner jars...
[INFO] Signed org.eclipse.tcf:org.eclipse.tcf.debug.test:java-source:sources:1.4.0.qualifier in 0 seconds.
[INFO] 
[INFO] --- tycho-pack200b-plugin:0.22.0:pack (pack200-pack) @ org.eclipse.tcf.debug.test ---
[INFO] Pack200 packing jar /jobs/genie.tcf/tcf-1.4/workspace/tests/plugins/org.eclipse.tcf.debug.test/target/org.eclipse.tcf.debug.test-1.4.0.qualifier.jar
[INFO] 
[INFO] >>> findbugs-maven-plugin:2.5.2:check (default) > :findbugs @ org.eclipse.tcf.debug.test >>>
[INFO] 
[INFO] --- findbugs-maven-plugin:2.5.2:findbugs (findbugs) @ org.eclipse.tcf.debug.test ---
[INFO] Fork Value is true
     [java] Picked up JAVA_TOOL_OPTIONS: -Xmx2G -Djava.io.tmpdir=/tmp/genie.tcf
     [java] Warnings generated: 3
[INFO] Done FindBugs Analysis....
[INFO] 
[INFO] <<< findbugs-maven-plugin:2.5.2:check (default) < :findbugs @ org.eclipse.tcf.debug.test <<<
[INFO] 
[INFO] 
[INFO] --- findbugs-maven-plugin:2.5.2:check (default) @ org.eclipse.tcf.debug.test ---
[INFO] BugInstance size is 3
[INFO] Error size is 0
[INFO] Total bugs: 3
[INFO] Load of known null value in org.eclipse.tcf.debug.test.AbstractCMTest$15.process() ["org.eclipse.tcf.debug.test.AbstractCMTest$15"] At AbstractCMTest.java:[lines 1-618]
[INFO] JUnit assertion in org.eclipse.tcf.debug.test.CacheTests$1.run() will not be noticed by JUnit ["org.eclipse.tcf.debug.test.CacheTests$1"] At CacheTests.java:[lines 1-168]
[INFO] org.eclipse.tcf.debug.test.RangeCacheTests$RetrieveInfo defines compareTo(RangeCacheTests$RetrieveInfo) and uses Object.equals() ["org.eclipse.tcf.debug.test.RangeCacheTests$RetrieveInfo"] At RangeCacheTests.java:[lines 1-92]
[INFO] 
[INFO] --- maven-install-plugin:2.3.1:install (default-install) @ org.eclipse.tcf.debug.test ---
[INFO] Installing /jobs/genie.tcf/tcf-1.4/workspace/tests/plugins/org.eclipse.tcf.debug.test/target/org.eclipse.tcf.debug.test-1.4.0.qualifier.jar to /home/hudson/genie.tcf/.jenkins/jobs/tcf-1.4/workspace/.repository/org/eclipse/tcf/org.eclipse.tcf.debug.test/1.4.0.qualifier/org.eclipse.tcf.debug.test-1.4.0.qualifier.jar
[INFO] Installing /jobs/genie.tcf/tcf-1.4/workspace/tests/plugins/org.eclipse.tcf.debug.test/pom.xml to /home/hudson/genie.tcf/.jenkins/jobs/tcf-1.4/workspace/.repository/org/eclipse/tcf/org.eclipse.tcf.debug.test/1.4.0.qualifier/org.eclipse.tcf.debug.test-1.4.0.qualifier.pom
[INFO] Installing /jobs/genie.tcf/tcf-1.4/workspace/tests/plugins/org.eclipse.tcf.debug.test/target/org.eclipse.tcf.debug.test-1.4.0.qualifier-sources.jar to /home/hudson/genie.tcf/.jenkins/jobs/tcf-1.4/workspace/.repository/org/eclipse/tcf/org.eclipse.tcf.debug.test/1.4.0.qualifier/org.eclipse.tcf.debug.test-1.4.0.qualifier-sources.jar
[INFO] Installing /jobs/genie.tcf/tcf-1.4/workspace/tests/plugins/org.eclipse.tcf.debug.test/target/p2content.xml to /home/hudson/genie.tcf/.jenkins/jobs/tcf-1.4/workspace/.repository/org/eclipse/tcf/org.eclipse.tcf.debug.test/1.4.0.qualifier/org.eclipse.tcf.debug.test-1.4.0.qualifier-p2metadata.xml
[INFO] Installing /jobs/genie.tcf/tcf-1.4/workspace/tests/plugins/org.eclipse.tcf.debug.test/target/p2artifacts.xml to /home/hudson/genie.tcf/.jenkins/jobs/tcf-1.4/workspace/.repository/org/eclipse/tcf/org.eclipse.tcf.debug.test/1.4.0.qualifier/org.eclipse.tcf.debug.test-1.4.0.qualifier-p2artifacts.xml
[INFO] Installing /jobs/genie.tcf/tcf-1.4/workspace/tests/plugins/org.eclipse.tcf.debug.test/target/org.eclipse.tcf.debug.test-1.4.0.qualifier.jar.pack.gz to /home/hudson/genie.tcf/.jenkins/jobs/tcf-1.4/workspace/.repository/org/eclipse/tcf/org.eclipse.tcf.debug.test/1.4.0.qualifier/org.eclipse.tcf.debug.test-1.4.0.qualifier-pack200.jar.pack.gz
[INFO] 
[INFO] --- tycho-p2-plugin:0.22.0:update-local-index (default-update-local-index) @ org.eclipse.tcf.debug.test ---
[INFO] 
[INFO] ------------------------------------------------------------------------
[INFO] Building TCF and Target Explorer, Maven Master 1.4.0-SNAPSHOT
[INFO] ------------------------------------------------------------------------
Downloading from sonatype: https://oss.sonatype.org/content/repositories/public/org/apache/maven/plugins/maven-install-plugin/2.4/maven-install-plugin-2.4.pom
Downloading from cbi: https://repo.eclipse.org/content/repositories/cbi-releases/org/apache/maven/plugins/maven-install-plugin/2.4/maven-install-plugin-2.4.pom
Downloading from cbi-snapshots: https://repo.eclipse.org/content/repositories/cbi-snapshots/org/apache/maven/plugins/maven-install-plugin/2.4/maven-install-plugin-2.4.pom
Downloading from eclipse.maven.central.mirror: https://repo.eclipse.org/content/repositories/maven_central/org/apache/maven/plugins/maven-install-plugin/2.4/maven-install-plugin-2.4.pom
Progress (1): 4.1/6.4 kB
Progress (1): 6.4 kB    
                    
Downloaded from eclipse.maven.central.mirror: https://repo.eclipse.org/content/repositories/maven_central/org/apache/maven/plugins/maven-install-plugin/2.4/maven-install-plugin-2.4.pom (6.4 kB at 399 kB/s)
Downloading from sonatype: https://oss.sonatype.org/content/repositories/public/org/apache/maven/plugins/maven-plugins/23/maven-plugins-23.pom
Downloading from cbi: https://repo.eclipse.org/content/repositories/cbi-releases/org/apache/maven/plugins/maven-plugins/23/maven-plugins-23.pom
Downloading from cbi-snapshots: https://repo.eclipse.org/content/repositories/cbi-snapshots/org/apache/maven/plugins/maven-plugins/23/maven-plugins-23.pom
Downloading from eclipse.maven.central.mirror: https://repo.eclipse.org/content/repositories/maven_central/org/apache/maven/plugins/maven-plugins/23/maven-plugins-23.pom
Progress (1): 4.1/9.2 kB
Progress (1): 7.7/9.2 kB
Progress (1): 9.2 kB    
                    
Downloaded from eclipse.maven.central.mirror: https://repo.eclipse.org/content/repositories/maven_central/org/apache/maven/plugins/maven-plugins/23/maven-plugins-23.pom (9.2 kB at 438 kB/s)
Downloading from sonatype: https://oss.sonatype.org/content/repositories/public/org/apache/maven/plugins/maven-install-plugin/2.4/maven-install-plugin-2.4.jar
Downloading from cbi: https://repo.eclipse.org/content/repositories/cbi-releases/org/apache/maven/plugins/maven-install-plugin/2.4/maven-install-plugin-2.4.jar
Downloading from cbi-snapshots: https://repo.eclipse.org/content/repositories/cbi-snapshots/org/apache/maven/plugins/maven-install-plugin/2.4/maven-install-plugin-2.4.jar
Downloading from eclipse.maven.central.mirror: https://repo.eclipse.org/content/repositories/maven_central/org/apache/maven/plugins/maven-install-plugin/2.4/maven-install-plugin-2.4.jar
Progress (1): 4.1/27 kB
Progress (1): 7.7/27 kB
Progress (1): 12/27 kB 
Progress (1): 16/27 kB
Progress (1): 20/27 kB
Progress (1): 24/27 kB
Progress (1): 27 kB   
                   
Downloaded from eclipse.maven.central.mirror: https://repo.eclipse.org/content/repositories/maven_central/org/apache/maven/plugins/maven-install-plugin/2.4/maven-install-plugin-2.4.jar (27 kB at 1.1 MB/s)
[INFO] 
[INFO] --- maven-clean-plugin:2.5:clean (default-clean) @ tcf-parent ---
[INFO] 
[INFO] --- jacoco-maven-plugin:0.7.4.201502262128:prepare-agent (default) @ tcf-parent ---
[INFO] argLine set to -javaagent:/home/hudson/genie.tcf/.jenkins/jobs/tcf-1.4/workspace/.repository/org/jacoco/org.jacoco.agent/0.7.4.201502262128/org.jacoco.agent-0.7.4.201502262128-runtime.jar=destfile=/jobs/genie.tcf/tcf-1.4/workspace/target/jacoco.exec,includes=org.eclipse.tcf*,excludes=org.eclipse.tcf.debug.test*:org.eclipse.tcf.te.tests.*,dumponexit=true,output=file
[INFO] 
[INFO] --- tycho-source-plugin:0.22.0:plugin-source (plugin-source) @ tcf-parent ---
[INFO] 
[INFO] --- tycho-p2-plugin:0.22.0:p2-metadata (p2-metadata) @ tcf-parent ---
[INFO] 
[INFO] --- tycho-pack200a-plugin:0.22.0:normalize (pack200-normalize) @ tcf-parent ---
[INFO] 
[INFO] --- eclipse-jarsigner-plugin:1.1.2:sign (sign) @ tcf-parent ---
[INFO] 
[INFO] --- tycho-pack200b-plugin:0.22.0:pack (pack200-pack) @ tcf-parent ---
[INFO] 
[INFO] >>> findbugs-maven-plugin:2.5.2:check (default) > :findbugs @ tcf-parent >>>
[INFO] 
[INFO] --- findbugs-maven-plugin:2.5.2:findbugs (findbugs) @ tcf-parent ---
[INFO] 
[INFO] <<< findbugs-maven-plugin:2.5.2:check (default) < :findbugs @ tcf-parent <<<
[INFO] 
[INFO] 
[INFO] --- findbugs-maven-plugin:2.5.2:check (default) @ tcf-parent ---
[INFO] 
[INFO] --- maven-install-plugin:2.4:install (default-install) @ tcf-parent ---
Downloading from sonatype: https://oss.sonatype.org/content/repositories/public/org/codehaus/plexus/plexus-utils/3.0.5/plexus-utils-3.0.5.pom
Downloading from cbi: https://repo.eclipse.org/content/repositories/cbi-releases/org/codehaus/plexus/plexus-utils/3.0.5/plexus-utils-3.0.5.pom
Downloading from cbi-snapshots: https://repo.eclipse.org/content/repositories/cbi-snapshots/org/codehaus/plexus/plexus-utils/3.0.5/plexus-utils-3.0.5.pom
Downloading from eclipse.maven.central.mirror: https://repo.eclipse.org/content/repositories/maven_central/org/codehaus/plexus/plexus-utils/3.0.5/plexus-utils-3.0.5.pom
Progress (1): 2.5 kB
                    
Downloaded from eclipse.maven.central.mirror: https://repo.eclipse.org/content/repositories/maven_central/org/codehaus/plexus/plexus-utils/3.0.5/plexus-utils-3.0.5.pom (2.5 kB at 81 kB/s)
Downloading from sonatype: https://oss.sonatype.org/content/repositories/public/org/codehaus/plexus/plexus-utils/3.0.5/plexus-utils-3.0.5.jar
Downloading from cbi: https://repo.eclipse.org/content/repositories/cbi-releases/org/codehaus/plexus/plexus-utils/3.0.5/plexus-utils-3.0.5.jar
Downloading from cbi-snapshots: https://repo.eclipse.org/content/repositories/cbi-snapshots/org/codehaus/plexus/plexus-utils/3.0.5/plexus-utils-3.0.5.jar
Downloading from eclipse.maven.central.mirror: https://repo.eclipse.org/content/repositories/maven_central/org/codehaus/plexus/plexus-utils/3.0.5/plexus-utils-3.0.5.jar
Progress (1): 4.1/230 kB
Progress (1): 7.7/230 kB
Progress (1): 12/230 kB 
Progress (1): 16/230 kB
Progress (1): 20/230 kB
Progress (1): 24/230 kB
Progress (1): 28/230 kB
Progress (1): 32/230 kB
Progress (1): 36/230 kB
Progress (1): 40/230 kB
Progress (1): 44/230 kB
Progress (1): 48/230 kB
Progress (1): 52/230 kB
Progress (1): 56/230 kB
Progress (1): 60/230 kB
Progress (1): 64/230 kB
Progress (1): 66/230 kB
Progress (1): 70/230 kB
Progress (1): 74/230 kB
Progress (1): 78/230 kB
Progress (1): 82/230 kB
Progress (1): 86/230 kB
Progress (1): 90/230 kB
Progress (1): 94/230 kB
Progress (1): 98/230 kB
Progress (1): 98/230 kB
Progress (1): 102/230 kB
Progress (1): 106/230 kB
Progress (1): 110/230 kB
Progress (1): 114/230 kB
Progress (1): 118/230 kB
Progress (1): 122/230 kB
Progress (1): 126/230 kB
Progress (1): 130/230 kB
Progress (1): 131/230 kB
Progress (1): 135/230 kB
Progress (1): 139/230 kB
Progress (1): 143/230 kB
Progress (1): 147/230 kB
Progress (1): 151/230 kB
Progress (1): 155/230 kB
Progress (1): 159/230 kB
Progress (1): 163/230 kB
Progress (1): 164/230 kB
Progress (1): 168/230 kB
Progress (1): 172/230 kB
Progress (1): 176/230 kB
Progress (1): 180/230 kB
Progress (1): 184/230 kB
Progress (1): 188/230 kB
Progress (1): 192/230 kB
Progress (1): 196/230 kB
Progress (1): 197/230 kB
Progress (1): 201/230 kB
Progress (1): 205/230 kB
Progress (1): 209/230 kB
Progress (1): 213/230 kB
Progress (1): 217/230 kB
Progress (1): 221/230 kB
Progress (1): 225/230 kB
Progress (1): 229/230 kB
Progress (1): 230 kB    
                    
Downloaded from eclipse.maven.central.mirror: https://repo.eclipse.org/content/repositories/maven_central/org/codehaus/plexus/plexus-utils/3.0.5/plexus-utils-3.0.5.jar (230 kB at 2.5 MB/s)
[INFO] Installing /jobs/genie.tcf/tcf-1.4/workspace/pom.xml to /home/hudson/genie.tcf/.jenkins/jobs/tcf-1.4/workspace/.repository/org/eclipse/tcf/tcf-parent/1.4.0-SNAPSHOT/tcf-parent-1.4.0-SNAPSHOT.pom
[INFO] ------------------------------------------------------------------------
[INFO] Reactor Summary:
[INFO] 
[INFO] org.eclipse.tcf.core ............................... SUCCESS [33:38 min]
[INFO] org.eclipse.tcf .................................... SUCCESS [01:11 min]
[INFO] org.eclipse.tcf.debug .............................. SUCCESS [02:22 min]
[INFO] org.eclipse.tcf.debug.ui ........................... SUCCESS [03:06 min]
[INFO] org.eclipse.tcf.cdt.ui ............................. SUCCESS [02:26 min]
[INFO] org.eclipse.tcf.rse ................................ SUCCESS [01:07 min]
[INFO] org.eclipse.tcf.core.feature ....................... SUCCESS [  4.692 s]
[INFO] org.eclipse.tcf.core.sdk.feature ................... SUCCESS [ 29.225 s]
[INFO] org.eclipse.tcf.feature ............................ SUCCESS [  4.679 s]
[INFO] org.eclipse.tcf.sdk.feature ........................ SUCCESS [ 23.450 s]
[INFO] org.eclipse.tcf.cdt.feature ........................ SUCCESS [ 34.636 s]
[INFO] org.eclipse.tcf.cdt.sdk.feature .................... SUCCESS [  3.259 s]
[INFO] org.eclipse.tcf.rse.feature ........................ SUCCESS [ 18.312 s]
[INFO] org.eclipse.tcf.rse.sdk.feature .................... SUCCESS [  2.998 s]
[INFO] org.eclipse.tcf.te ................................. SUCCESS [ 28.024 s]
[INFO] org.eclipse.tcf.te.runtime ......................... SUCCESS [ 44.984 s]
[INFO] org.eclipse.tcf.te.runtime.concurrent .............. SUCCESS [ 35.962 s]
[INFO] org.eclipse.tcf.te.runtime.model ................... SUCCESS [ 20.384 s]
[INFO] org.eclipse.tcf.te.runtime.services ................ SUCCESS [ 45.368 s]
[INFO] org.eclipse.tcf.te.runtime.persistence ............. SUCCESS [ 23.538 s]
[INFO] org.eclipse.tcf.te.runtime.statushandler ........... SUCCESS [ 55.786 s]
[INFO] org.eclipse.tcf.te.runtime.stepper ................. SUCCESS [01:18 min]
[INFO] org.eclipse.tcf.te.core ............................ SUCCESS [01:47 min]
[INFO] org.eclipse.tcf.te.core.cdt ........................ SUCCESS [02:26 min]
[INFO] org.eclipse.tcf.te.launch.core ..................... SUCCESS [02:06 min]
[INFO] org.eclipse.tcf.te.ui.swt .......................... SUCCESS [01:14 min]
[INFO] org.eclipse.tcf.te.ui.forms ........................ SUCCESS [01:46 min]
[INFO] org.eclipse.tcf.te.ui .............................. SUCCESS [03:44 min]
[INFO] org.eclipse.tcf.te.ui.controls ..................... SUCCESS [01:41 min]
[INFO] org.eclipse.tcf.te.ui.views ........................ SUCCESS [02:36 min]
[INFO] org.eclipse.tcf.te.launch.ui ....................... SUCCESS [01:56 min]
[INFO] org.eclipse.tcf.te.tcf.core ........................ SUCCESS [02:04 min]
[INFO] org.eclipse.tcf.te.tcf.core.model .................. SUCCESS [ 40.179 s]
[INFO] org.eclipse.tcf.te.tcf.core.scripting .............. SUCCESS [ 19.290 s]
[INFO] org.eclipse.tcf.te.tcf.locator ..................... SUCCESS [ 51.041 s]
[INFO] org.eclipse.tcf.te.tcf.filesystem.core ............. SUCCESS [ 55.024 s]
[INFO] org.eclipse.tcf.te.tcf.log.core .................... SUCCESS [ 29.371 s]
[INFO] org.eclipse.tcf.te.tcf.ui .......................... SUCCESS [01:58 min]
[INFO] org.eclipse.tcf.te.tcf.filesystem.ui ............... SUCCESS [ 43.455 s]
[INFO] org.eclipse.tcf.te.tcf.processes.core .............. SUCCESS [ 27.079 s]
[INFO] org.eclipse.tcf.te.tcf.launch.cdt .................. SUCCESS [ 33.862 s]
[INFO] org.eclipse.tcf.te.tcf.launch.core ................. SUCCESS [01:12 min]
[INFO] org.eclipse.tcf.te.tcf.launch.ui ................... SUCCESS [01:51 min]
[INFO] org.eclipse.tcf.te.tcf.processes.ui ................ SUCCESS [01:12 min]
[INFO] org.eclipse.tcf.te.tcf.remote.core ................. SUCCESS [ 39.548 s]
[INFO] org.eclipse.tcf.te.tcf.remote.ui ................... SUCCESS [ 35.528 s]
[INFO] org.eclipse.tcf.te.tcf.services.contexts ........... SUCCESS [ 33.388 s]
[INFO] org.eclipse.tcf.te.tcf.terminals.core .............. SUCCESS [ 56.923 s]
[INFO] org.eclipse.tcf.te.tcf.terminals.ui ................ SUCCESS [ 51.760 s]
[INFO] org.eclipse.tcf.te.tcf.ui.console .................. SUCCESS [ 22.839 s]
[INFO] org.eclipse.tcf.te.tcf.ui.views .................... SUCCESS [ 26.143 s]
[INFO] org.eclipse.tcf.te.ui.notifications ................ SUCCESS [ 29.981 s]
[INFO] org.eclipse.tcf.te.feature ......................... SUCCESS [  4.919 s]
[INFO] org.eclipse.tcf.te.sdk.feature ..................... SUCCESS [ 15.662 s]
[INFO] org.eclipse.tcf.te.tcf.core.feature ................ SUCCESS [  8.597 s]
[INFO] org.eclipse.tcf.te.tcf.core.sdk.feature ............ SUCCESS [ 17.723 s]
[INFO] org.eclipse.tcf.te.tcf.feature ..................... SUCCESS [ 19.969 s]
[INFO] org.eclipse.tcf.te.tcf.sdk.feature ................. SUCCESS [ 22.753 s]
[INFO] org.eclipse.tcf.te.tcf.launch.cdt.feature .......... SUCCESS [ 14.899 s]
[INFO] org.eclipse.tcf.te.tcf.launch.cdt.sdk.feature ...... SUCCESS [  6.520 s]
[INFO] org.eclipse.tcf.te.tcf.remote.feature .............. SUCCESS [ 10.571 s]
[INFO] org.eclipse.tcf.te.tcf.remote.sdk.feature .......... SUCCESS [ 12.564 s]
[INFO] org.eclipse.tcf.repo ............................... SUCCESS [02:33 min]
[INFO] org.eclipse.tcf.te.tests ........................... SUCCESS [36:01 min]
[INFO] org.eclipse.tcf.debug.test ......................... SUCCESS [18:09 min]
[INFO] TCF and Target Explorer, Maven Master .............. SUCCESS [  2.585 s]
[INFO] ------------------------------------------------------------------------
[INFO] BUILD SUCCESS
[INFO] ------------------------------------------------------------------------
[INFO] Total time: 03:00 h
[INFO] Finished at: 2018-02-06T12:52:51-05:00
[INFO] Final Memory: 442M/1609M
[INFO] ------------------------------------------------------------------------
Terminating xvnc.
[FINDBUGS] Collecting findbugs analysis files...
[FINDBUGS] Searching for all files in /home/hudson/genie.tcf/.jenkins/jobs/tcf-1.4/workspace that match the pattern **/findbugsXml.xml
[FINDBUGS] Parsing 46 files in /home/hudson/genie.tcf/.jenkins/jobs/tcf-1.4/workspace
[FINDBUGS] Successfully parsed file /home/hudson/genie.tcf/.jenkins/jobs/tcf-1.4/workspace/plugins/org.eclipse.tcf.cdt.ui/target/findbugsXml.xml with 8 unique warnings and 0 duplicates.
[FINDBUGS] Successfully parsed file /home/hudson/genie.tcf/.jenkins/jobs/tcf-1.4/workspace/plugins/org.eclipse.tcf.core/target/findbugsXml.xml with 8 unique warnings and 0 duplicates.
[FINDBUGS] Successfully parsed file /home/hudson/genie.tcf/.jenkins/jobs/tcf-1.4/workspace/plugins/org.eclipse.tcf.debug.ui/target/findbugsXml.xml with 18 unique warnings and 0 duplicates.
[FINDBUGS] Successfully parsed file /home/hudson/genie.tcf/.jenkins/jobs/tcf-1.4/workspace/plugins/org.eclipse.tcf.debug/target/findbugsXml.xml with 20 unique warnings and 0 duplicates.
[FINDBUGS] Successfully parsed file /home/hudson/genie.tcf/.jenkins/jobs/tcf-1.4/workspace/plugins/org.eclipse.tcf.rse/target/findbugsXml.xml with 24 unique warnings and 0 duplicates.
[FINDBUGS] Successfully parsed file /home/hudson/genie.tcf/.jenkins/jobs/tcf-1.4/workspace/plugins/org.eclipse.tcf/target/findbugsXml.xml with 24 unique warnings and 0 duplicates.
[FINDBUGS] Successfully parsed file /home/hudson/genie.tcf/.jenkins/jobs/tcf-1.4/workspace/target_explorer/plugins/org.eclipse.tcf.te.core.cdt/target/findbugsXml.xml with 24 unique warnings and 0 duplicates.
[FINDBUGS] Successfully parsed file /home/hudson/genie.tcf/.jenkins/jobs/tcf-1.4/workspace/target_explorer/plugins/org.eclipse.tcf.te.core/target/findbugsXml.xml with 24 unique warnings and 0 duplicates.
[FINDBUGS] Successfully parsed file /home/hudson/genie.tcf/.jenkins/jobs/tcf-1.4/workspace/target_explorer/plugins/org.eclipse.tcf.te.launch.core/target/findbugsXml.xml with 24 unique warnings and 0 duplicates.
[FINDBUGS] Successfully parsed file /home/hudson/genie.tcf/.jenkins/jobs/tcf-1.4/workspace/target_explorer/plugins/org.eclipse.tcf.te.launch.ui/target/findbugsXml.xml with 24 unique warnings and 0 duplicates.
[FINDBUGS] Successfully parsed file /home/hudson/genie.tcf/.jenkins/jobs/tcf-1.4/workspace/target_explorer/plugins/org.eclipse.tcf.te.runtime.concurrent/target/findbugsXml.xml with 24 unique warnings and 0 duplicates.
[FINDBUGS] Successfully parsed file /home/hudson/genie.tcf/.jenkins/jobs/tcf-1.4/workspace/target_explorer/plugins/org.eclipse.tcf.te.runtime.model/target/findbugsXml.xml with 24 unique warnings and 0 duplicates.
[FINDBUGS] Successfully parsed file /home/hudson/genie.tcf/.jenkins/jobs/tcf-1.4/workspace/target_explorer/plugins/org.eclipse.tcf.te.runtime.persistence/target/findbugsXml.xml with 24 unique warnings and 0 duplicates.
[FINDBUGS] Successfully parsed file /home/hudson/genie.tcf/.jenkins/jobs/tcf-1.4/workspace/target_explorer/plugins/org.eclipse.tcf.te.runtime.services/target/findbugsXml.xml with 24 unique warnings and 0 duplicates.
[FINDBUGS] Successfully parsed file /home/hudson/genie.tcf/.jenkins/jobs/tcf-1.4/workspace/target_explorer/plugins/org.eclipse.tcf.te.runtime.statushandler/target/findbugsXml.xml with 24 unique warnings and 0 duplicates.
[FINDBUGS] Successfully parsed file /home/hudson/genie.tcf/.jenkins/jobs/tcf-1.4/workspace/target_explorer/plugins/org.eclipse.tcf.te.runtime.stepper/target/findbugsXml.xml with 24 unique warnings and 0 duplicates.
[FINDBUGS] Successfully parsed file /home/hudson/genie.tcf/.jenkins/jobs/tcf-1.4/workspace/target_explorer/plugins/org.eclipse.tcf.te.runtime/target/findbugsXml.xml with 24 unique warnings and 0 duplicates.
[FINDBUGS] Successfully parsed file /home/hudson/genie.tcf/.jenkins/jobs/tcf-1.4/workspace/target_explorer/plugins/org.eclipse.tcf.te.tcf.core.model/target/findbugsXml.xml with 24 unique warnings and 0 duplicates.
[FINDBUGS] Successfully parsed file /home/hudson/genie.tcf/.jenkins/jobs/tcf-1.4/workspace/target_explorer/plugins/org.eclipse.tcf.te.tcf.core.scripting/target/findbugsXml.xml with 24 unique warnings and 0 duplicates.
[FINDBUGS] Successfully parsed file /home/hudson/genie.tcf/.jenkins/jobs/tcf-1.4/workspace/target_explorer/plugins/org.eclipse.tcf.te.tcf.core/target/findbugsXml.xml with 24 unique warnings and 0 duplicates.
[FINDBUGS] Successfully parsed file /home/hudson/genie.tcf/.jenkins/jobs/tcf-1.4/workspace/target_explorer/plugins/org.eclipse.tcf.te.tcf.filesystem.core/target/findbugsXml.xml with 25 unique warnings and 0 duplicates.
[FINDBUGS] Successfully parsed file /home/hudson/genie.tcf/.jenkins/jobs/tcf-1.4/workspace/target_explorer/plugins/org.eclipse.tcf.te.tcf.filesystem.ui/target/findbugsXml.xml with 27 unique warnings and 0 duplicates.
[FINDBUGS] Successfully parsed file /home/hudson/genie.tcf/.jenkins/jobs/tcf-1.4/workspace/target_explorer/plugins/org.eclipse.tcf.te.tcf.launch.cdt/target/findbugsXml.xml with 31 unique warnings and 0 duplicates.
[FINDBUGS] Successfully parsed file /home/hudson/genie.tcf/.jenkins/jobs/tcf-1.4/workspace/target_explorer/plugins/org.eclipse.tcf.te.tcf.launch.core/target/findbugsXml.xml with 31 unique warnings and 0 duplicates.
[FINDBUGS] Successfully parsed file /home/hudson/genie.tcf/.jenkins/jobs/tcf-1.4/workspace/target_explorer/plugins/org.eclipse.tcf.te.tcf.launch.ui/target/findbugsXml.xml with 31 unique warnings and 0 duplicates.
[FINDBUGS] Successfully parsed file /home/hudson/genie.tcf/.jenkins/jobs/tcf-1.4/workspace/target_explorer/plugins/org.eclipse.tcf.te.tcf.locator/target/findbugsXml.xml with 31 unique warnings and 0 duplicates.
[FINDBUGS] Successfully parsed file /home/hudson/genie.tcf/.jenkins/jobs/tcf-1.4/workspace/target_explorer/plugins/org.eclipse.tcf.te.tcf.log.core/target/findbugsXml.xml with 31 unique warnings and 0 duplicates.
[FINDBUGS] Successfully parsed file /home/hudson/genie.tcf/.jenkins/jobs/tcf-1.4/workspace/target_explorer/plugins/org.eclipse.tcf.te.tcf.processes.core/target/findbugsXml.xml with 31 unique warnings and 0 duplicates.
[FINDBUGS] Successfully parsed file /home/hudson/genie.tcf/.jenkins/jobs/tcf-1.4/workspace/target_explorer/plugins/org.eclipse.tcf.te.tcf.processes.ui/target/findbugsXml.xml with 31 unique warnings and 0 duplicates.
[FINDBUGS] Successfully parsed file /home/hudson/genie.tcf/.jenkins/jobs/tcf-1.4/workspace/target_explorer/plugins/org.eclipse.tcf.te.tcf.remote.core/target/findbugsXml.xml with 31 unique warnings and 0 duplicates.
[FINDBUGS] Successfully parsed file /home/hudson/genie.tcf/.jenkins/jobs/tcf-1.4/workspace/target_explorer/plugins/org.eclipse.tcf.te.tcf.remote.ui/target/findbugsXml.xml with 31 unique warnings and 0 duplicates.
[FINDBUGS] Successfully parsed file /home/hudson/genie.tcf/.jenkins/jobs/tcf-1.4/workspace/target_explorer/plugins/org.eclipse.tcf.te.tcf.services.contexts/target/findbugsXml.xml with 31 unique warnings and 0 duplicates.
[FINDBUGS] Successfully parsed file /home/hudson/genie.tcf/.jenkins/jobs/tcf-1.4/workspace/target_explorer/plugins/org.eclipse.tcf.te.tcf.terminals.core/target/findbugsXml.xml with 31 unique warnings and 0 duplicates.
[FINDBUGS] Successfully parsed file /home/hudson/genie.tcf/.jenkins/jobs/tcf-1.4/workspace/target_explorer/plugins/org.eclipse.tcf.te.tcf.terminals.ui/target/findbugsXml.xml with 31 unique warnings and 0 duplicates.
[FINDBUGS] Successfully parsed file /home/hudson/genie.tcf/.jenkins/jobs/tcf-1.4/workspace/target_explorer/plugins/org.eclipse.tcf.te.tcf.ui.console/target/findbugsXml.xml with 31 unique warnings and 0 duplicates.
[FINDBUGS] Successfully parsed file /home/hudson/genie.tcf/.jenkins/jobs/tcf-1.4/workspace/target_explorer/plugins/org.eclipse.tcf.te.tcf.ui.views/target/findbugsXml.xml with 31 unique warnings and 0 duplicates.
[FINDBUGS] Successfully parsed file /home/hudson/genie.tcf/.jenkins/jobs/tcf-1.4/workspace/target_explorer/plugins/org.eclipse.tcf.te.tcf.ui/target/findbugsXml.xml with 31 unique warnings and 0 duplicates.
[FINDBUGS] Successfully parsed file /home/hudson/genie.tcf/.jenkins/jobs/tcf-1.4/workspace/target_explorer/plugins/org.eclipse.tcf.te.tests/target/findbugsXml.xml with 31 unique warnings and 0 duplicates.
[FINDBUGS] Successfully parsed file /home/hudson/genie.tcf/.jenkins/jobs/tcf-1.4/workspace/target_explorer/plugins/org.eclipse.tcf.te.ui.controls/target/findbugsXml.xml with 31 unique warnings and 0 duplicates.
[FINDBUGS] Successfully parsed file /home/hudson/genie.tcf/.jenkins/jobs/tcf-1.4/workspace/target_explorer/plugins/org.eclipse.tcf.te.ui.forms/target/findbugsXml.xml with 31 unique warnings and 0 duplicates.
[FINDBUGS] Successfully parsed file /home/hudson/genie.tcf/.jenkins/jobs/tcf-1.4/workspace/target_explorer/plugins/org.eclipse.tcf.te.ui.notifications/target/findbugsXml.xml with 31 unique warnings and 0 duplicates.
[FINDBUGS] Successfully parsed file /home/hudson/genie.tcf/.jenkins/jobs/tcf-1.4/workspace/target_explorer/plugins/org.eclipse.tcf.te.ui.swt/target/findbugsXml.xml with 31 unique warnings and 0 duplicates.
[FINDBUGS] Successfully parsed file /home/hudson/genie.tcf/.jenkins/jobs/tcf-1.4/workspace/target_explorer/plugins/org.eclipse.tcf.te.ui.views/target/findbugsXml.xml with 31 unique warnings and 0 duplicates.
[FINDBUGS] Successfully parsed file /home/hudson/genie.tcf/.jenkins/jobs/tcf-1.4/workspace/target_explorer/plugins/org.eclipse.tcf.te.ui/target/findbugsXml.xml with 31 unique warnings and 0 duplicates.
[FINDBUGS] Successfully parsed file /home/hudson/genie.tcf/.jenkins/jobs/tcf-1.4/workspace/target_explorer/plugins/org.eclipse.tcf.te/target/findbugsXml.xml with 31 unique warnings and 0 duplicates.
[FINDBUGS] Successfully parsed file /home/hudson/genie.tcf/.jenkins/jobs/tcf-1.4/workspace/tests/plugins/org.eclipse.tcf.debug.test/target/findbugsXml.xml with 34 unique warnings and 0 duplicates.
<Git Blamer> Using GitBlamer to create author and commit information for all warnings.
<Git Blamer> GIT_COMMIT=a4ab4daad2137e57e05a014cff73ada669a5b15c, workspace=/home/hudson/genie.tcf/.jenkins/jobs/tcf-1.4/workspace
 > /usr/local/bin/git rev-parse a4ab4daad2137e57e05a014cff73ada669a5b15c^{commit} # timeout=10
[FINDBUGS] Computing warning deltas based on reference build #11
Recording test results
Build step 'Publish JUnit test result report' changed build result to UNSTABLE
Archiving artifacts
Started calculate disk usage of build
Finished Calculation of disk usage of build in 0 seconds
Started calculate disk usage of workspace
Finished Calculation of disk usage of workspace in 0 seconds
Finished: UNSTABLE