FailedConsole Output

Skipping 1,726 KB.. Full Log
BjCCFBQCV27OjYAAAAA==[INFO] --- tycho-p2-plugin:1.2.0:update-local-index (default-update-local-index) @ org.eclipse.smarthome.core.id ---
[INFO] 
[INFO] ---< org.eclipse.smarthome.core:org.eclipse.smarthome.core.id.test >----
[INFO] Building Eclipse SmartHome ID Tests 0.11.0-SNAPSHOT             [46/249]
[INFO] ------------------------[ eclipse-test-plugin ]-------------------------
[INFO] 
[INFO] --- maven-clean-plugin:2.5:clean (default-clean) @ org.eclipse.smarthome.core.id.test ---
[INFO] 
[INFO] --- tycho-packaging-plugin:1.2.0:build-qualifier (default-build-qualifier) @ org.eclipse.smarthome.core.id.test ---
[INFO] The project's OSGi version is 0.11.0.201901311108
[INFO] 
[INFO] --- tycho-packaging-plugin:1.2.0:validate-id (default-validate-id) @ org.eclipse.smarthome.core.id.test ---
[INFO] 
[INFO] --- tycho-packaging-plugin:1.2.0:validate-version (default-validate-version) @ org.eclipse.smarthome.core.id.test ---
[INFO] 
[INFO] --- directory-maven-plugin:0.2:highest-basedir (directories) @ org.eclipse.smarthome.core.id.test ---
[INFO] Highest basedir set to: /jobs/genie.smarthome/SmartHomeDistribution-Nightly/workspace
[INFO] 
[INFO] --- jacoco-maven-plugin:0.7.4.201502262128:prepare-agent (default-prepare-agent) @ org.eclipse.smarthome.core.id.test ---
[INFO] tycho.testArgLine set to -javaagent:/home/hudson/genie.smarthome/.jenkins/jobs/SmartHomeDistribution-Nightly/workspace/.repository/org/jacoco/org.jacoco.agent/0.7.4.201502262128/org.jacoco.agent-0.7.4.201502262128-runtime.jar=destfile=/jobs/genie.smarthome/SmartHomeDistribution-Nightly/workspace/target/coverage.jacoco,append=true,excludes=**/*Test.*
[INFO] 
[INFO] --- maven-resources-plugin:3.1.0:resources (default-resources) @ org.eclipse.smarthome.core.id.test ---
[INFO] Using 'UTF-8' encoding to copy filtered resources.
[INFO] skip non existing resourceDirectory /jobs/genie.smarthome/SmartHomeDistribution-Nightly/workspace/bundles/core/org.eclipse.smarthome.core.id.test/src/main/resources
[INFO] 
[INFO] --- tycho-compiler-plugin:1.2.0:compile (default-compile) @ org.eclipse.smarthome.core.id.test ---
[INFO] Compiling 1 source file to /jobs/genie.smarthome/SmartHomeDistribution-Nightly/workspace/bundles/core/org.eclipse.smarthome.core.id.test/target/classes
[INFO] 
[INFO] --- maven-scr-plugin:1.24.0:scr (generate-scr-scrdescriptor) @ org.eclipse.smarthome.core.id.test ---
[WARNING] Source tree does not exist. Ignoring /jobs/genie.smarthome/SmartHomeDistribution-Nightly/workspace/bundles/core/org.eclipse.smarthome.core.id.test/src/main/java
[WARNING] Source tree does not exist. Ignoring /jobs/genie.smarthome/SmartHomeDistribution-Nightly/workspace/bundles/core/org.eclipse.smarthome.core.id.test/src/main/java
[WARNING] Source tree does not exist. Ignoring /jobs/genie.smarthome/SmartHomeDistribution-Nightly/workspace/bundles/core/org.eclipse.smarthome.core.id.test/src/main/java
[INFO] 
[INFO] --- maven-resources-plugin:3.1.0:testResources (default-testResources) @ org.eclipse.smarthome.core.id.test ---
[INFO] Using 'UTF-8' encoding to copy filtered resources.
[INFO] skip non existing resourceDirectory /jobs/genie.smarthome/SmartHomeDistribution-Nightly/workspace/bundles/core/org.eclipse.smarthome.core.id.test/src/test/resources
[INFO] 
[INFO] --- maven-resources-plugin:3.1.0:copy-resources (default) @ org.eclipse.smarthome.core.id.test ---
[INFO] Using 'UTF-8' encoding to copy filtered resources.
[INFO] skip non existing resourceDirectory /jobs/genie.smarthome/SmartHomeDistribution-Nightly/workspace/bundles/core/org.eclipse.smarthome.core.id.test/target/classes/OSGI-INF
[INFO] 
[INFO] --- tycho-source-plugin:1.2.0:plugin-source (plugin-source) @ org.eclipse.smarthome.core.id.test ---
[INFO] Building jar: /jobs/genie.smarthome/SmartHomeDistribution-Nightly/workspace/bundles/core/org.eclipse.smarthome.core.id.test/target/org.eclipse.smarthome.core.id.test-0.11.0-SNAPSHOT-sources.jar
[INFO] 
[INFO] --- target-platform-configuration:1.2.0:target-platform (default-target-platform) @ org.eclipse.smarthome.core.id.test ---
[INFO] 
[INFO] --- tycho-packaging-plugin:1.2.0:package-plugin (default-package-plugin) @ org.eclipse.smarthome.core.id.test ---
[INFO] Building jar: /jobs/genie.smarthome/SmartHomeDistribution-Nightly/workspace/bundles/core/org.eclipse.smarthome.core.id.test/target/org.eclipse.smarthome.core.id.test-0.11.0-SNAPSHOT.jar
[INFO] 
[INFO] --- tycho-p2-plugin:1.2.0:p2-metadata-default (default-p2-metadata-default) @ org.eclipse.smarthome.core.id.test ---
[INFO] 
[INFO] --- jacoco-maven-plugin:0.7.4.201502262128:prepare-agent-integration (default-prepare-agent-integration) @ org.eclipse.smarthome.core.id.test ---
[INFO] tycho.testArgLine set to -javaagent:/home/hudson/genie.smarthome/.jenkins/jobs/SmartHomeDistribution-Nightly/workspace/.repository/org/jacoco/org.jacoco.agent/0.7.4.201502262128/org.jacoco.agent-0.7.4.201502262128-runtime.jar=destfile=/jobs/genie.smarthome/SmartHomeDistribution-Nightly/workspace/target/coverage.jacoco,append=true,excludes=**/*Test.*
[INFO] 
[INFO] --- tycho-surefire-plugin:1.2.0:test (default-test) @ org.eclipse.smarthome.core.id.test ---
[INFO] Expected eclipse log file: /jobs/genie.smarthome/SmartHomeDistribution-Nightly/workspace/bundles/core/org.eclipse.smarthome.core.id.test/target/work/data/.metadata/.log
[INFO] Command line:
	[/opt/public/common/java/oracle/jdk1.8.0_192_x64/jre/bin/java, -Dosgi.noShutdown=false, -Dosgi.os=linux, -Dosgi.ws=gtk, -Dosgi.arch=x86_64, -javaagent:/home/hudson/genie.smarthome/.jenkins/jobs/SmartHomeDistribution-Nightly/workspace/.repository/org/jacoco/org.jacoco.agent/0.7.4.201502262128/org.jacoco.agent-0.7.4.201502262128-runtime.jar=destfile=/jobs/genie.smarthome/SmartHomeDistribution-Nightly/workspace/target/coverage.jacoco,append=true,excludes=**/*Test.*, -Dosgi.clean=true, -jar, /jobs/genie.smarthome/SmartHomeDistribution-Nightly/workspace/.repository/p2/osgi/bundle/org.eclipse.equinox.launcher/1.4.0.v20161219-1356/org.eclipse.equinox.launcher-1.4.0.v20161219-1356.jar, -data, /jobs/genie.smarthome/SmartHomeDistribution-Nightly/workspace/bundles/core/org.eclipse.smarthome.core.id.test/target/work/data, -install, /jobs/genie.smarthome/SmartHomeDistribution-Nightly/workspace/bundles/core/org.eclipse.smarthome.core.id.test/target/work, -configuration, /jobs/genie.smarthome/SmartHomeDistribution-Nightly/workspace/bundles/core/org.eclipse.smarthome.core.id.test/target/work/configuration, -application, org.eclipse.tycho.surefire.osgibooter.headlesstest, -testproperties, /jobs/genie.smarthome/SmartHomeDistribution-Nightly/workspace/bundles/core/org.eclipse.smarthome.core.id.test/target/surefire.properties]
Picked up JAVA_TOOL_OPTIONS: -Xmx2G -Djava.io.tmpdir=/tmp/genie.smarthome
Running org.eclipse.smarthome.core.id.UUIDTest
SLF4J: Failed to load class "org.slf4j.impl.StaticLoggerBinder".
SLF4J: Defaulting to no-operation (NOP) logger implementation
SLF4J: See http://www.slf4j.org/codes.html#StaticLoggerBinder for further details.
Tests run: 3, Failures: 0, Errors: 0, Skipped: 0, Time elapsed: 0.159 sec - in org.eclipse.smarthome.core.id.UUIDTest
readFromPersistedFile(org.eclipse.smarthome.core.id.UUIDTest)  Time elapsed: 0.045 sec
ignoreEmptyFile(org.eclipse.smarthome.core.id.UUIDTest)  Time elapsed: 0.002 sec
sameUUID(org.eclipse.smarthome.core.id.UUIDTest)  Time elapsed: 0 sec

Results :

Tests run: 3, Failures: 0, Errors: 0, Skipped: 0

[INFO] All tests passed!
[INFO] 
[INFO] --- sat-plugin:0.5.0:checkstyle (sat-all) @ org.eclipse.smarthome.core.id.test ---
[INFO] Adding dependency to checkstyle:0.5.0
[INFO] Adding dependency to checkstyle:8.1
[ERROR] Unable to parse schema 
org.xml.sax.SAXParseException: src-resolve: Cannot resolve the name 'config-description:idRestrictionPattern' to a(n) 'type definition' component.
    at org.apache.xerces.util.ErrorHandlerWrapper.createSAXParseException (Unknown Source)
    at org.apache.xerces.util.ErrorHandlerWrapper.error (Unknown Source)
    at org.apache.xerces.impl.XMLErrorReporter.reportError (Unknown Source)
    at org.apache.xerces.impl.XMLErrorReporter.reportError (Unknown Source)
    at org.apache.xerces.impl.xs.traversers.XSDHandler.reportSchemaError (Unknown Source)
    at org.apache.xerces.impl.xs.traversers.XSDHandler.getGlobalDecl (Unknown Source)
    at org.apache.xerces.impl.xs.traversers.XSDAttributeTraverser.traverseNamedAttr (Unknown Source)
    at org.apache.xerces.impl.xs.traversers.XSDAttributeTraverser.traverseLocal (Unknown Source)
    at org.apache.xerces.impl.xs.traversers.XSDAbstractTraverser.traverseAttrsAndAttrGrps (Unknown Source)
    at org.apache.xerces.impl.xs.traversers.XSDComplexTypeTraverser.processComplexContent (Unknown Source)
    at org.apache.xerces.impl.xs.traversers.XSDComplexTypeTraverser.traverseComplexTypeDecl (Unknown Source)
    at org.apache.xerces.impl.xs.traversers.XSDComplexTypeTraverser.traverseLocal (Unknown Source)
    at org.apache.xerces.impl.xs.traversers.XSDElementTraverser.traverseNamedElement (Unknown Source)
    at org.apache.xerces.impl.xs.traversers.XSDElementTraverser.traverseGlobal (Unknown Source)
    at org.apache.xerces.impl.xs.traversers.XSDHandler.traverseSchemas (Unknown Source)
    at org.apache.xerces.impl.xs.traversers.XSDHandler.parseSchema (Unknown Source)
    at org.apache.xerces.impl.xs.XMLSchemaLoader.loadSchema (Unknown Source)
    at org.apache.xerces.impl.xs.XMLSchemaLoader.loadGrammar (Unknown Source)
    at org.apache.xerces.impl.xs.XMLSchemaLoader.loadGrammar (Unknown Source)
    at org.apache.xerces.jaxp.validation.XMLSchemaFactory.newSchema (Unknown Source)
    at javax.xml.validation.SchemaFactory.newSchema (SchemaFactory.java:638)
    at org.openhab.tools.analysis.checkstyle.EshInfXmlValidationCheck$1.transform (EshInfXmlValidationCheck.java:110)
    at org.openhab.tools.analysis.checkstyle.EshInfXmlValidationCheck$1.transform (EshInfXmlValidationCheck.java:103)
    at org.openhab.tools.analysis.utils.CachingHttpClient.get (CachingHttpClient.java:71)
    at org.openhab.tools.analysis.checkstyle.EshInfXmlValidationCheck.getXSD (EshInfXmlValidationCheck.java:229)
    at org.openhab.tools.analysis.checkstyle.EshInfXmlValidationCheck.beginProcessing (EshInfXmlValidationCheck.java:120)
    at com.puppycrawl.tools.checkstyle.Checker.process (Checker.java:210)
    at org.apache.maven.plugin.checkstyle.exec.DefaultCheckstyleExecutor.executeCheckstyle (DefaultCheckstyleExecutor.java:252)
    at org.apache.maven.plugin.checkstyle.AbstractCheckstyleReport.executeReport (AbstractCheckstyleReport.java:473)
    at org.apache.maven.plugin.checkstyle.CheckstyleReport.executeReport (CheckstyleReport.java:154)
    at org.apache.maven.reporting.AbstractMavenReport.generate (AbstractMavenReport.java:255)
    at org.apache.maven.reporting.AbstractMavenReport.execute (AbstractMavenReport.java:143)
    at org.apache.maven.plugin.DefaultBuildPluginManager.executeMojo (DefaultBuildPluginManager.java:137)
    at org.twdata.maven.mojoexecutor.MojoExecutor.executeMojo (MojoExecutor.java:94)
    at org.openhab.tools.analysis.tools.AbstractChecker.executeCheck (AbstractChecker.java:106)
    at org.openhab.tools.analysis.tools.CheckstyleChecker.execute (CheckstyleChecker.java:123)
    at org.apache.maven.plugin.DefaultBuildPluginManager.executeMojo (DefaultBuildPluginManager.java:137)
    at org.apache.maven.lifecycle.internal.MojoExecutor.execute (MojoExecutor.java:208)
    at org.apache.maven.lifecycle.internal.MojoExecutor.execute (MojoExecutor.java:154)
    at org.apache.maven.lifecycle.internal.MojoExecutor.execute (MojoExecutor.java:146)
    at org.apache.maven.lifecycle.internal.LifecycleModuleBuilder.buildProject (LifecycleModuleBuilder.java:117)
    at org.apache.maven.lifecycle.internal.LifecycleModuleBuilder.buildProject (LifecycleModuleBuilder.java:81)
    at org.apache.maven.lifecycle.internal.builder.singlethreaded.SingleThreadedBuilder.build (SingleThreadedBuilder.java:56)
    at org.apache.maven.lifecycle.internal.LifecycleStarter.execute (LifecycleStarter.java:128)
    at org.apache.maven.DefaultMaven.doExecute (DefaultMaven.java:305)
    at org.apache.maven.DefaultMaven.doExecute (DefaultMaven.java:192)
    at org.apache.maven.DefaultMaven.execute (DefaultMaven.java:105)
    at org.apache.maven.cli.MavenCli.execute (MavenCli.java:954)
    at org.apache.maven.cli.MavenCli.doMain (MavenCli.java:288)
    at org.apache.maven.cli.MavenCli.main (MavenCli.java:192)
    at sun.reflect.NativeMethodAccessorImpl.invoke0 (Native Method)
    at sun.reflect.NativeMethodAccessorImpl.invoke (NativeMethodAccessorImpl.java:62)
    at sun.reflect.DelegatingMethodAccessorImpl.invoke (DelegatingMethodAccessorImpl.java:43)
    at java.lang.reflect.Method.invoke (Method.java:498)
    at org.codehaus.plexus.classworlds.launcher.Launcher.launchEnhanced (Launcher.java:289)
    at org.codehaus.plexus.classworlds.launcher.Launcher.launch (Launcher.java:229)
    at org.codehaus.plexus.classworlds.launcher.Launcher.mainWithExitCode (Launcher.java:415)
    at org.codehaus.plexus.classworlds.launcher.Launcher.main (Launcher.java:356)
[WARNING] KarafFeatureCheck will be skipped. Could not find file features/openhab-addons/src/main/feature/feature.xml
[INFO] 
[INFO] --- sat-plugin:0.5.0:pmd (sat-all) @ org.eclipse.smarthome.core.id.test ---
[INFO] Adding dependency to pmd:0.5.0
[INFO] Adding dependency to pmd-core:5.8.1
[INFO] Adding dependency to pmd-java:5.8.1
[INFO] Adding dependency to pmd-javascript:5.8.1
[INFO] Adding dependency to pmd-jsp:5.8.1
[INFO] 
[INFO] --- sat-plugin:0.5.0:spotbugs (sat-all) @ org.eclipse.smarthome.core.id.test ---
[INFO] Adding dependency to findbugs:0.5.0
[INFO] Adding dependency to bug-pattern:1.2.4
[INFO] Adding dependency to spotbugs:3.1.2
[INFO] Fork Value is false
     [java] JVM args ignored when same JVM is used.
[INFO] Done SpotBugs Analysis....
[INFO] 
[INFO] --- sat-plugin:0.5.0:report (sat-all) @ org.eclipse.smarthome.core.id.test ---
[INFO] Individual report appended to summary report.
[WARNING] Code Analysis Tool has found: 
 0 error(s)! 
 1 warning(s) 
 0 info(s)
[WARNING] /jobs/genie.smarthome/SmartHomeDistribution-Nightly/workspace/bundles/core/org.eclipse.smarthome.core.id.test/pom.xml:[20]
Avoid overriding a configuration inherited by the parent pom.
[INFO] Detailed report can be found at: file:////jobs/genie.smarthome/SmartHomeDistribution-Nightly/workspace/bundles/core/org.eclipse.smarthome.core.id.test/target/code-analysis/report.html
[INFO] 
[INFO] --- maven-install-plugin:2.5.2:install (default-install) @ org.eclipse.smarthome.core.id.test ---
[INFO] Installing /jobs/genie.smarthome/SmartHomeDistribution-Nightly/workspace/bundles/core/org.eclipse.smarthome.core.id.test/target/org.eclipse.smarthome.core.id.test-0.11.0-SNAPSHOT.jar to /home/hudson/genie.smarthome/.jenkins/jobs/SmartHomeDistribution-Nightly/workspace/.repository/org/eclipse/smarthome/core/org.eclipse.smarthome.core.id.test/0.11.0-SNAPSHOT/org.eclipse.smarthome.core.id.test-0.11.0-SNAPSHOT.jar
[INFO] Installing /jobs/genie.smarthome/SmartHomeDistribution-Nightly/workspace/bundles/core/org.eclipse.smarthome.core.id.test/pom.xml to /home/hudson/genie.smarthome/.jenkins/jobs/SmartHomeDistribution-Nightly/workspace/.repository/org/eclipse/smarthome/core/org.eclipse.smarthome.core.id.test/0.11.0-SNAPSHOT/org.eclipse.smarthome.core.id.test-0.11.0-SNAPSHOT.pom
[INFO] Installing /jobs/genie.smarthome/SmartHomeDistribution-Nightly/workspace/bundles/core/org.eclipse.smarthome.core.id.test/target/org.eclipse.smarthome.core.id.test-0.11.0-SNAPSHOT-sources.jar to /home/hudson/genie.smarthome/.jenkins/jobs/SmartHomeDistribution-Nightly/workspace/.repository/org/eclipse/smarthome/core/org.eclipse.smarthome.core.id.test/0.11.0-SNAPSHOT/org.eclipse.smarthome.core.id.test-0.11.0-SNAPSHOT-sources.jar
[INFO] Installing /jobs/genie.smarthome/SmartHomeDistribution-Nightly/workspace/bundles/core/org.eclipse.smarthome.core.id.test/target/p2content.xml to /home/hudson/genie.smarthome/.jenkins/jobs/SmartHomeDistribution-Nightly/workspace/.repository/org/eclipse/smarthome/core/org.eclipse.smarthome.core.id.test/0.11.0-SNAPSHOT/org.eclipse.smarthome.core.id.test-0.11.0-SNAPSHOT-p2metadata.xml
[INFO] Installing /jobs/genie.smarthome/SmartHomeDistribution-Nightly/workspace/bundles/core/org.eclipse.smarthome.core.id.test/target/p2artifacts.xml to /home/hudson/genie.smarthome/.jenkins/jobs/SmartHomeDistribution-Nightly/workspace/.repository/org/eclipse/smarthome/core/org.eclipse.smarthome.core.id.test/0.11.0-SNAPSHOT/org.eclipse.smarthome.core.id.test-0.11.0-SNAPSHOT-p2artifacts.xml
[INFO] 
[INFO] --- tycho-p2-plugin:1.2.0:update-local-index (default-update-local-index) @ org.eclipse.smarthome.core.id.test ---
[INFO] 
[INFO] -----< org.eclipse.smarthome.core:org.eclipse.smarthome.core.test >-----
[INFO] Building Eclipse SmartHome Core Tests 0.11.0-SNAPSHOT           [47/249]
[INFO] ------------------------[ eclipse-test-plugin ]-------------------------
[INFO] 
[INFO] --- maven-clean-plugin:2.5:clean (default-clean) @ org.eclipse.smarthome.core.test ---
[INFO] 
[INFO] --- tycho-packaging-plugin:1.2.0:build-qualifier (default-build-qualifier) @ org.eclipse.smarthome.core.test ---
[INFO] The project's OSGi version is 0.11.0.201901311108
[INFO] 
[INFO] --- tycho-packaging-plugin:1.2.0:validate-id (default-validate-id) @ org.eclipse.smarthome.core.test ---
[INFO] 
[INFO] --- tycho-packaging-plugin:1.2.0:validate-version (default-validate-version) @ org.eclipse.smarthome.core.test ---
[INFO] 
[INFO] --- directory-maven-plugin:0.2:highest-basedir (directories) @ org.eclipse.smarthome.core.test ---
[INFO] Highest basedir set to: /jobs/genie.smarthome/SmartHomeDistribution-Nightly/workspace
[INFO] 
[INFO] --- jacoco-maven-plugin:0.7.4.201502262128:prepare-agent (default-prepare-agent) @ org.eclipse.smarthome.core.test ---
[INFO] tycho.testArgLine set to -javaagent:/home/hudson/genie.smarthome/.jenkins/jobs/SmartHomeDistribution-Nightly/workspace/.repository/org/jacoco/org.jacoco.agent/0.7.4.201502262128/org.jacoco.agent-0.7.4.201502262128-runtime.jar=destfile=/jobs/genie.smarthome/SmartHomeDistribution-Nightly/workspace/target/coverage.jacoco,append=true,excludes=**/*Test.*
[INFO] 
[INFO] --- maven-resources-plugin:3.1.0:resources (default-resources) @ org.eclipse.smarthome.core.test ---
[INFO] Using 'UTF-8' encoding to copy filtered resources.
[INFO] skip non existing resourceDirectory /jobs/genie.smarthome/SmartHomeDistribution-Nightly/workspace/bundles/core/org.eclipse.smarthome.core.test/src/main/resources
[INFO] 
[INFO] --- tycho-compiler-plugin:1.2.0:compile (default-compile) @ org.eclipse.smarthome.core.test ---
[INFO] Compiling 72 source files to /jobs/genie.smarthome/SmartHomeDistribution-Nightly/workspace/bundles/core/org.eclipse.smarthome.core.test/target/classes
[WARNING] /jobs/genie.smarthome/SmartHomeDistribution-Nightly/workspace/bundles/core/org.eclipse.smarthome.core.test/src/test/java/org/eclipse/smarthome/core/library/items/DimmerItemTest.java:[41] 
	final String str = state.toString();
	                   ^^^^^
Potential null pointer access: The variable state may be null at this location
[WARNING] /jobs/genie.smarthome/SmartHomeDistribution-Nightly/workspace/bundles/core/org.eclipse.smarthome.core.test/src/test/java/org/eclipse/smarthome/core/internal/i18n/I18nProviderImplTest.java:[95] 
	assertThat(location.toString(), is(LOCATION_ZERO));
	           ^^^^^^^^
Potential null pointer access: The variable location may be null at this location
[WARNING] /jobs/genie.smarthome/SmartHomeDistribution-Nightly/workspace/bundles/core/org.eclipse.smarthome.core.test/src/test/java/org/eclipse/smarthome/core/internal/i18n/I18nProviderImplTest.java:[125] 
	assertThat(location.toString(), is(LOCATION_DARMSTADT));
	           ^^^^^^^^
Potential null pointer access: The variable location may be null at this location
[WARNING] /jobs/genie.smarthome/SmartHomeDistribution-Nightly/workspace/bundles/core/org.eclipse.smarthome.core.test/src/test/java/org/eclipse/smarthome/core/internal/i18n/I18nProviderImplTest.java:[136] 
	assertThat(location.toString(), is(LOCATION_ZERO));
	           ^^^^^^^^
Potential null pointer access: The variable location may be null at this location
[WARNING] /jobs/genie.smarthome/SmartHomeDistribution-Nightly/workspace/bundles/core/org.eclipse.smarthome.core.test/src/test/java/org/eclipse/smarthome/core/internal/i18n/I18nProviderImplTest.java:[162] 
	assertThat(location.toString(), is(LOCATION_HAMBURG));
	           ^^^^^^^^
Potential null pointer access: The variable location may be null at this location
[WARNING] /jobs/genie.smarthome/SmartHomeDistribution-Nightly/workspace/bundles/core/org.eclipse.smarthome.core.test/src/test/java/org/eclipse/smarthome/core/items/GenericItemTest.java:[89] 
	assertEquals(PercentType.class, item.getStateAs(PercentType.class).getClass());
	                                ^^^^^^^^^^^^^^^^^^^^^^^^^^^^^^^^^^
Potential null pointer access: The method getStateAs(Class) may return null
[WARNING] /jobs/genie.smarthome/SmartHomeDistribution-Nightly/workspace/bundles/core/org.eclipse.smarthome.core.test/src/test/java/org/eclipse/smarthome/core/items/GenericItemTest.java:[96] 
	assertEquals(OnOffType.class, item.getStateAs(OnOffType.class).getClass());
	                              ^^^^^^^^^^^^^^^^^^^^^^^^^^^^^^^^
Potential null pointer access: The method getStateAs(Class) may return null
[WARNING] /jobs/genie.smarthome/SmartHomeDistribution-Nightly/workspace/bundles/core/org.eclipse.smarthome.core.test/src/test/java/org/eclipse/smarthome/core/items/GenericItemTest.java:[103] 
	assertEquals(StringType.class, item.getStateAs(StringType.class).getClass());
	                               ^^^^^^^^^^^^^^^^^^^^^^^^^^^^^^^^^
Potential null pointer access: The method getStateAs(Class) may return null
[WARNING] /jobs/genie.smarthome/SmartHomeDistribution-Nightly/workspace/bundles/core/org.eclipse.smarthome.core.test/src/test/java/org/eclipse/smarthome/core/library/types/PercentTypeTest.java:[77] 
	((QuantityType<?>) PercentType.HUNDRED.as(QuantityType.class)).toUnit(SmartHomeUnits.ONE));
	                   ^^^^^^^^^^^^^^^^^^^^^^^^^^^^^^^^^^^^^^^^^^
Potential null pointer access: The method as(Class) may return null
[WARNING] /jobs/genie.smarthome/SmartHomeDistribution-Nightly/workspace/bundles/core/org.eclipse.smarthome.core.test/src/test/java/org/eclipse/smarthome/core/items/ManagedItemProviderOSGiTest.java:[215] 
	Storage<PersistedItem> storage = storageService.getStorage(Item.class.getName());
	                                 ^^^^^^^^^^^^^^
Potential null pointer access: The variable storageService may be null at this location
[WARNING] /jobs/genie.smarthome/SmartHomeDistribution-Nightly/workspace/bundles/core/org.eclipse.smarthome.core.test/src/test/java/org/eclipse/smarthome/core/internal/i18n/TranslationProviderOSGiTest.java:[64] 
	((I18nProviderImpl) localeProvider).modified(localeCfg);
	                    ^^^^^^^^^^^^^^
Potential null pointer access: The variable localeProvider may be null at this location
[WARNING] /jobs/genie.smarthome/SmartHomeDistribution-Nightly/workspace/bundles/core/org.eclipse.smarthome.core.test/src/test/java/org/eclipse/smarthome/core/types/SmartHomeUnitsTest.java:[244] 
	assertEquals("0.05 %", ppm.toUnit(Units.PERCENT).toString());
	                       ^^^^^^^^^^^^^^^^^^^^^^^^^
Potential null pointer access: The method toUnit(Unit) may return null
[WARNING] /jobs/genie.smarthome/SmartHomeDistribution-Nightly/workspace/bundles/core/org.eclipse.smarthome.core.test/src/test/java/org/eclipse/smarthome/core/types/SmartHomeUnitsTest.java:[250] 
	assertEquals("20.0 dB", ratio.toUnit("dB").toString());
	                        ^^^^^^^^^^^^^^^^^^
Potential null pointer access: The method toUnit(String) may return null
[WARNING] /jobs/genie.smarthome/SmartHomeDistribution-Nightly/workspace/bundles/core/org.eclipse.smarthome.core.test/src/test/java/org/eclipse/smarthome/core/types/SmartHomeUnitsTest.java:[258] 
	assertThat(mmolpsq.doubleValue(), is(closeTo(0.4462d, DEFAULT_ERROR)));
	           ^^^^^^^
Potential null pointer access: The variable mmolpsq may be null at this location
[WARNING] /jobs/genie.smarthome/SmartHomeDistribution-Nightly/workspace/bundles/core/org.eclipse.smarthome.core.test/src/test/java/org/eclipse/smarthome/core/types/SmartHomeUnitsTest.java:[259] 
	assertThat(mmolpsq.toUnit(SmartHomeUnits.DOBSON_UNIT).doubleValue(), is(closeTo(1, DEFAULT_ERROR)));
	           ^^^^^^^^^^^^^^^^^^^^^^^^^^^^^^^^^^^^^^^^^^
Potential null pointer access: The method toUnit(Unit) may return null
[WARNING] /jobs/genie.smarthome/SmartHomeDistribution-Nightly/workspace/bundles/core/org.eclipse.smarthome.core.test/src/test/java/org/eclipse/smarthome/core/cache/ExpiringCacheAsyncTest.java:[71] 
	assertEquals(10.0, t.getLastKnownValue(), 0.0);
	                   ^^^^^^^^^^^^^^^^^^^^^
Potential null pointer access: This expression of type Double may be null but requires auto-unboxing
[WARNING] /jobs/genie.smarthome/SmartHomeDistribution-Nightly/workspace/bundles/core/org.eclipse.smarthome.core.test/src/test/java/org/eclipse/smarthome/core/internal/items/ItemUpdaterOSGiTest.java:[84] 
	waitForAssert(() -> assertEquals(OnOffType.ON, switchItem.getState()));
	                                               ^^^^^^^^^^
Potential null pointer access: The variable switchItem may be null at this location
[WARNING] /jobs/genie.smarthome/SmartHomeDistribution-Nightly/workspace/bundles/core/org.eclipse.smarthome.core.test/src/test/java/org/eclipse/smarthome/core/internal/items/ItemUpdaterOSGiTest.java:[92] 
	waitForAssert(() -> assertEquals(OnOffType.ON, switchItem.getState()));
	                                               ^^^^^^^^^^
Potential null pointer access: The variable switchItem may be null at this location
18 problems (18 warnings)
[INFO] 
[INFO] --- maven-scr-plugin:1.24.0:scr (generate-scr-scrdescriptor) @ org.eclipse.smarthome.core.test ---
[WARNING] Source tree does not exist. Ignoring /jobs/genie.smarthome/SmartHomeDistribution-Nightly/workspace/bundles/core/org.eclipse.smarthome.core.test/src/main/java
[WARNING] Source tree does not exist. Ignoring /jobs/genie.smarthome/SmartHomeDistribution-Nightly/workspace/bundles/core/org.eclipse.smarthome.core.test/src/main/java
[WARNING] Source tree does not exist. Ignoring /jobs/genie.smarthome/SmartHomeDistribution-Nightly/workspace/bundles/core/org.eclipse.smarthome.core.test/src/main/java
[INFO] 
[INFO] --- maven-resources-plugin:3.1.0:testResources (default-testResources) @ org.eclipse.smarthome.core.test ---
[INFO] Using 'UTF-8' encoding to copy filtered resources.
[INFO] skip non existing resourceDirectory /jobs/genie.smarthome/SmartHomeDistribution-Nightly/workspace/bundles/core/org.eclipse.smarthome.core.test/src/test/resources
[INFO] 
[INFO] --- maven-resources-plugin:3.1.0:copy-resources (default) @ org.eclipse.smarthome.core.test ---
[INFO] Using 'UTF-8' encoding to copy filtered resources.
[INFO] skip non existing resourceDirectory /jobs/genie.smarthome/SmartHomeDistribution-Nightly/workspace/bundles/core/org.eclipse.smarthome.core.test/target/classes/OSGI-INF
[INFO] 
[INFO] --- tycho-source-plugin:1.2.0:plugin-source (plugin-source) @ org.eclipse.smarthome.core.test ---
[INFO] Building jar: /jobs/genie.smarthome/SmartHomeDistribution-Nightly/workspace/bundles/core/org.eclipse.smarthome.core.test/target/org.eclipse.smarthome.core.test-0.11.0-SNAPSHOT-sources.jar
[INFO] 
[INFO] --- target-platform-configuration:1.2.0:target-platform (default-target-platform) @ org.eclipse.smarthome.core.test ---
[INFO] 
[INFO] --- tycho-packaging-plugin:1.2.0:package-plugin (default-package-plugin) @ org.eclipse.smarthome.core.test ---
[INFO] Building jar: /jobs/genie.smarthome/SmartHomeDistribution-Nightly/workspace/bundles/core/org.eclipse.smarthome.core.test/target/org.eclipse.smarthome.core.test-0.11.0-SNAPSHOT.jar
[INFO] 
[INFO] --- tycho-p2-plugin:1.2.0:p2-metadata-default (default-p2-metadata-default) @ org.eclipse.smarthome.core.test ---
[INFO] 
[INFO] --- jacoco-maven-plugin:0.7.4.201502262128:prepare-agent-integration (default-prepare-agent-integration) @ org.eclipse.smarthome.core.test ---
[INFO] tycho.testArgLine set to -javaagent:/home/hudson/genie.smarthome/.jenkins/jobs/SmartHomeDistribution-Nightly/workspace/.repository/org/jacoco/org.jacoco.agent/0.7.4.201502262128/org.jacoco.agent-0.7.4.201502262128-runtime.jar=destfile=/jobs/genie.smarthome/SmartHomeDistribution-Nightly/workspace/target/coverage.jacoco,append=true,excludes=**/*Test.*
[INFO] 
[INFO] --- tycho-surefire-plugin:1.2.0:test (default-test) @ org.eclipse.smarthome.core.test ---
[INFO] Expected eclipse log file: /jobs/genie.smarthome/SmartHomeDistribution-Nightly/workspace/bundles/core/org.eclipse.smarthome.core.test/target/work/data/.metadata/.log
[INFO] Command line:
	[/opt/public/common/java/oracle/jdk1.8.0_192_x64/jre/bin/java, -Dosgi.noShutdown=false, -Dosgi.os=linux, -Dosgi.ws=gtk, -Dosgi.arch=x86_64, -javaagent:/home/hudson/genie.smarthome/.jenkins/jobs/SmartHomeDistribution-Nightly/workspace/.repository/org/jacoco/org.jacoco.agent/0.7.4.201502262128/org.jacoco.agent-0.7.4.201502262128-runtime.jar=destfile=/jobs/genie.smarthome/SmartHomeDistribution-Nightly/workspace/target/coverage.jacoco,append=true,excludes=**/*Test.*, -Dosgi.clean=true, -jar, /jobs/genie.smarthome/SmartHomeDistribution-Nightly/workspace/.repository/p2/osgi/bundle/org.eclipse.equinox.launcher/1.4.0.v20161219-1356/org.eclipse.equinox.launcher-1.4.0.v20161219-1356.jar, -data, /jobs/genie.smarthome/SmartHomeDistribution-Nightly/workspace/bundles/core/org.eclipse.smarthome.core.test/target/work/data, -install, /jobs/genie.smarthome/SmartHomeDistribution-Nightly/workspace/bundles/core/org.eclipse.smarthome.core.test/target/work, -configuration, /jobs/genie.smarthome/SmartHomeDistribution-Nightly/workspace/bundles/core/org.eclipse.smarthome.core.test/target/work/configuration, -application, org.eclipse.tycho.surefire.osgibooter.headlesstest, -testproperties, /jobs/genie.smarthome/SmartHomeDistribution-Nightly/workspace/bundles/core/org.eclipse.smarthome.core.test/target/surefire.properties]
Picked up JAVA_TOOL_OPTIONS: -Xmx2G -Djava.io.tmpdir=/tmp/genie.smarthome
SLF4J: Failed to load class "org.slf4j.impl.StaticLoggerBinder".
SLF4J: Defaulting to no-operation (NOP) logger implementation
SLF4J: See http://www.slf4j.org/codes.html#StaticLoggerBinder for further details.
Running org.eclipse.smarthome.core.cache.ExpiringCacheTest
Tests run: 5, Failures: 0, Errors: 0, Skipped: 0, Time elapsed: 2.174 sec - in org.eclipse.smarthome.core.cache.ExpiringCacheTest
testPutValue(org.eclipse.smarthome.core.cache.ExpiringCacheTest)  Time elapsed: 0.003 sec
testExpired(org.eclipse.smarthome.core.cache.ExpiringCacheTest)  Time elapsed: 2.1 sec
testGetValue(org.eclipse.smarthome.core.cache.ExpiringCacheTest)  Time elapsed: 0 sec
testRefresh(org.eclipse.smarthome.core.cache.ExpiringCacheTest)  Time elapsed: 0.001 sec
testInvalidate(org.eclipse.smarthome.core.cache.ExpiringCacheTest)  Time elapsed: 0 sec
Running org.eclipse.smarthome.core.cache.ExpiringCacheMapTest
Tests run: 13, Failures: 0, Errors: 0, Skipped: 0, Time elapsed: 2.116 sec - in org.eclipse.smarthome.core.cache.ExpiringCacheMapTest
testPutValue(org.eclipse.smarthome.core.cache.ExpiringCacheMapTest)  Time elapsed: 0.001 sec
testExpired(org.eclipse.smarthome.core.cache.ExpiringCacheMapTest)  Time elapsed: 2.101 sec
testPut(org.eclipse.smarthome.core.cache.ExpiringCacheMapTest)  Time elapsed: 0 sec
testClear(org.eclipse.smarthome.core.cache.ExpiringCacheMapTest)  Time elapsed: 0.001 sec
testKeys(org.eclipse.smarthome.core.cache.ExpiringCacheMapTest)  Time elapsed: 0 sec
testContainsKey(org.eclipse.smarthome.core.cache.ExpiringCacheMapTest)  Time elapsed: 0 sec
testPutValueIllegalArgumentException1(org.eclipse.smarthome.core.cache.ExpiringCacheMapTest)  Time elapsed: 0 sec
testPutIllegalArgumentException3(org.eclipse.smarthome.core.cache.ExpiringCacheMapTest)  Time elapsed: 0 sec
testRefresh(org.eclipse.smarthome.core.cache.ExpiringCacheMapTest)  Time elapsed: 0 sec
testPutIfAbsentAndGet(org.eclipse.smarthome.core.cache.ExpiringCacheMapTest)  Time elapsed: 0 sec
testRemove(org.eclipse.smarthome.core.cache.ExpiringCacheMapTest)  Time elapsed: 0 sec
testInvalidate(org.eclipse.smarthome.core.cache.ExpiringCacheMapTest)  Time elapsed: 0.001 sec
testValues(org.eclipse.smarthome.core.cache.ExpiringCacheMapTest)  Time elapsed: 0 sec
Running org.eclipse.smarthome.core.cache.ExpiringCacheAsyncTest
Tests run: 3, Failures: 0, Errors: 0, Skipped: 0, Time elapsed: 1.049 sec - in org.eclipse.smarthome.core.cache.ExpiringCacheAsyncTest
testConstructorWrongCacheTime(org.eclipse.smarthome.core.cache.ExpiringCacheAsyncTest)  Time elapsed: 0.003 sec
testFetchValue(org.eclipse.smarthome.core.cache.ExpiringCacheAsyncTest)  Time elapsed: 1.042 sec
testMutipleGetsWhileRefetching(org.eclipse.smarthome.core.cache.ExpiringCacheAsyncTest)  Time elapsed: 0.003 sec
Running org.eclipse.smarthome.core.internal.scheduler.PeriodicSchedulerImplTest
Tests run: 1, Failures: 0, Errors: 0, Skipped: 0, Time elapsed: 2.517 sec - in org.eclipse.smarthome.core.internal.scheduler.PeriodicSchedulerImplTest
testSchedule(org.eclipse.smarthome.core.internal.scheduler.PeriodicSchedulerImplTest)  Time elapsed: 2.51 sec
Running org.eclipse.smarthome.core.internal.scheduler.CronSchedulerImplTest
Tests run: 3, Failures: 0, Errors: 0, Skipped: 0, Time elapsed: 4.029 sec - in org.eclipse.smarthome.core.internal.scheduler.CronSchedulerImplTest
testCronReboot(org.eclipse.smarthome.core.internal.scheduler.CronSchedulerImplTest)  Time elapsed: 0.019 sec
testCronScheduling(org.eclipse.smarthome.core.internal.scheduler.CronSchedulerImplTest)  Time elapsed: 3.003 sec
testAddRemoveScheduler(org.eclipse.smarthome.core.internal.scheduler.CronSchedulerImplTest)  Time elapsed: 1.003 sec
Running org.eclipse.smarthome.core.internal.scheduler.CronAdjusterTest
Tests run: 40, Failures: 0, Errors: 0, Skipped: 0, Time elapsed: 0.143 sec - in org.eclipse.smarthome.core.internal.scheduler.CronAdjusterTest
testCronExpression[CronAdjusterTest pattern: @reboot](org.eclipse.smarthome.core.internal.scheduler.CronAdjusterTest)  Time elapsed: 0.025 sec
testCronExpression[CronAdjusterTest pattern: @hourly](org.eclipse.smarthome.core.internal.scheduler.CronAdjusterTest)  Time elapsed: 0.003 sec
testCronExpression[CronAdjusterTest pattern: @daily](org.eclipse.smarthome.core.internal.scheduler.CronAdjusterTest)  Time elapsed: 0.002 sec
testCronExpression[CronAdjusterTest pattern: @weekly](org.eclipse.smarthome.core.internal.scheduler.CronAdjusterTest)  Time elapsed: 0.005 sec
testCronExpression[CronAdjusterTest pattern: @monthly](org.eclipse.smarthome.core.internal.scheduler.CronAdjusterTest)  Time elapsed: 0.003 sec
testCronExpression[CronAdjusterTest pattern: @annually](org.eclipse.smarthome.core.internal.scheduler.CronAdjusterTest)  Time elapsed: 0.006 sec
testCronExpression[CronAdjusterTest pattern: @yearly](org.eclipse.smarthome.core.internal.scheduler.CronAdjusterTest)  Time elapsed: 0.002 sec
testCronExpression[CronAdjusterTest pattern: 0 15 10 LW * ?](org.eclipse.smarthome.core.internal.scheduler.CronAdjusterTest)  Time elapsed: 0.005 sec
testCronExpression[CronAdjusterTest pattern: 0 15 10 WL * ?](org.eclipse.smarthome.core.internal.scheduler.CronAdjusterTest)  Time elapsed: 0.003 sec
testCronExpression[CronAdjusterTest pattern: 0 15 10 3W * ?](org.eclipse.smarthome.core.internal.scheduler.CronAdjusterTest)  Time elapsed: 0.003 sec
testCronExpression[CronAdjusterTest pattern: 0 15 10 1/10 * ?](org.eclipse.smarthome.core.internal.scheduler.CronAdjusterTest)  Time elapsed: 0.002 sec
testCronExpression[CronAdjusterTest pattern: 0 15 10 ? * FRI#2](org.eclipse.smarthome.core.internal.scheduler.CronAdjusterTest)  Time elapsed: 0.003 sec
testCronExpression[CronAdjusterTest pattern: 0 15 10 ? * 5L](org.eclipse.smarthome.core.internal.scheduler.CronAdjusterTest)  Time elapsed: 0.005 sec
testCronExpression[CronAdjusterTest pattern: 0 15 10 L * ?](org.eclipse.smarthome.core.internal.scheduler.CronAdjusterTest)  Time elapsed: 0.002 sec
testCronExpression[CronAdjusterTest pattern: 0 15 10 15 * ?](org.eclipse.smarthome.core.internal.scheduler.CronAdjusterTest)  Time elapsed: 0.001 sec
testCronExpression[CronAdjusterTest pattern: 0 15 10 ? * MON-WED](org.eclipse.smarthome.core.internal.scheduler.CronAdjusterTest)  Time elapsed: 0.002 sec
testCronExpression[CronAdjusterTest pattern: 0 10,44 14 ? 1 WED](org.eclipse.smarthome.core.internal.scheduler.CronAdjusterTest)  Time elapsed: 0.003 sec
testCronExpression[CronAdjusterTest pattern: 0 0-2 14 * * ?](org.eclipse.smarthome.core.internal.scheduler.CronAdjusterTest)  Time elapsed: 0.001 sec
testCronExpression[CronAdjusterTest pattern: 0 0/15 14,18 * * ?](org.eclipse.smarthome.core.internal.scheduler.CronAdjusterTest)  Time elapsed: 0.007 sec
testCronExpression[CronAdjusterTest pattern: 0 0 12 * * ?](org.eclipse.smarthome.core.internal.scheduler.CronAdjusterTest)  Time elapsed: 0.001 sec
testCronExpression[CronAdjusterTest pattern: 0 15 10 ? * *](org.eclipse.smarthome.core.internal.scheduler.CronAdjusterTest)  Time elapsed: 0.001 sec
testCronExpression[CronAdjusterTest pattern: 0 15 10 * * ?](org.eclipse.smarthome.core.internal.scheduler.CronAdjusterTest)  Time elapsed: 0.001 sec
testCronExpression[CronAdjusterTest pattern: 0 15 10 * * ? *](org.eclipse.smarthome.core.internal.scheduler.CronAdjusterTest)  Time elapsed: 0 sec
testCronExpression[CronAdjusterTest pattern: 0 15 10 * * ? 2015](org.eclipse.smarthome.core.internal.scheduler.CronAdjusterTest)  Time elapsed: 0 sec
testCronExpression[CronAdjusterTest pattern: 0 * 14 * * ?](org.eclipse.smarthome.core.internal.scheduler.CronAdjusterTest)  Time elapsed: 0 sec
testCronExpression[CronAdjusterTest pattern: 0 0/5 14 * * ?](org.eclipse.smarthome.core.internal.scheduler.CronAdjusterTest)  Time elapsed: 0.001 sec
testCronExpression[CronAdjusterTest pattern: 0 0/30 14,18 * * ?](org.eclipse.smarthome.core.internal.scheduler.CronAdjusterTest)  Time elapsed: 0.001 sec
testCronExpression[CronAdjusterTest pattern: 0 0-2 14 * * ?](org.eclipse.smarthome.core.internal.scheduler.CronAdjusterTest)  Time elapsed: 0.001 sec
testCronExpression[CronAdjusterTest pattern: 0 0 0 ? * SAT](org.eclipse.smarthome.core.internal.scheduler.CronAdjusterTest)  Time elapsed: 0.001 sec
testCronExpression[CronAdjusterTest pattern: 10-14/2 * * * * *](org.eclipse.smarthome.core.internal.scheduler.CronAdjusterTest)  Time elapsed: 0.001 sec
testCronExpression[CronAdjusterTest pattern: 1/15,3/15 * * * * *](org.eclipse.smarthome.core.internal.scheduler.CronAdjusterTest)  Time elapsed: 0.001 sec
testCronExpression[CronAdjusterTest pattern: 0 0 0 1 FEB,APR,JUN ?](org.eclipse.smarthome.core.internal.scheduler.CronAdjusterTest)  Time elapsed: 0.002 sec
testCronExpression[CronAdjusterTest pattern: 0 0 0 1 FEB ?](org.eclipse.smarthome.core.internal.scheduler.CronAdjusterTest)  Time elapsed: 0.001 sec
testCronExpression[CronAdjusterTest pattern: 0 0 0 * FEB ?](org.eclipse.smarthome.core.internal.scheduler.CronAdjusterTest)  Time elapsed: 0.001 sec
testCronExpression[CronAdjusterTest pattern: 15 2 * * * * 2001](org.eclipse.smarthome.core.internal.scheduler.CronAdjusterTest)  Time elapsed: 0.001 sec
testCronExpression[CronAdjusterTest pattern: */5 * * * * *](org.eclipse.smarthome.core.internal.scheduler.CronAdjusterTest)  Time elapsed: 0.001 sec
testCronExpression[CronAdjusterTest pattern: 3/5 * * * * *](org.eclipse.smarthome.core.internal.scheduler.CronAdjusterTest)  Time elapsed: 0.001 sec
testCronExpression[CronAdjusterTest pattern: 3-13/5 * * * * *](org.eclipse.smarthome.core.internal.scheduler.CronAdjusterTest)  Time elapsed: 0 sec
testCronExpression[CronAdjusterTest pattern: 0 0 0 1 1 *](org.eclipse.smarthome.core.internal.scheduler.CronAdjusterTest)  Time elapsed: 0.001 sec
testCronExpression[CronAdjusterTest pattern: 0 0 0 1 1 * 2020-2022](org.eclipse.smarthome.core.internal.scheduler.CronAdjusterTest)  Time elapsed: 0.002 sec
Running org.eclipse.smarthome.core.internal.scheduler.DelegatedSchedulerTest
Tests run: 2, Failures: 0, Errors: 0, Skipped: 0, Time elapsed: 0.605 sec - in org.eclipse.smarthome.core.internal.scheduler.DelegatedSchedulerTest
testAddRemoveAndDeactivate(org.eclipse.smarthome.core.internal.scheduler.DelegatedSchedulerTest)  Time elapsed: 0.597 sec
testAddAndDeactivate(org.eclipse.smarthome.core.internal.scheduler.DelegatedSchedulerTest)  Time elapsed: 0.003 sec
Running org.eclipse.smarthome.core.internal.scheduler.CronAdjusterMiscTest
Tests run: 13, Failures: 0, Errors: 0, Skipped: 0, Time elapsed: 0.006 sec - in org.eclipse.smarthome.core.internal.scheduler.CronAdjusterMiscTest
testWeekNumber(org.eclipse.smarthome.core.internal.scheduler.CronAdjusterMiscTest)  Time elapsed: 0 sec
testAboveMax(org.eclipse.smarthome.core.internal.scheduler.CronAdjusterMiscTest)  Time elapsed: 0 sec
testBelowMin(org.eclipse.smarthome.core.internal.scheduler.CronAdjusterMiscTest)  Time elapsed: 0 sec
testBeforeSlash(org.eclipse.smarthome.core.internal.scheduler.CronAdjusterMiscTest)  Time elapsed: 0 sec
testToShort(org.eclipse.smarthome.core.internal.scheduler.CronAdjusterMiscTest)  Time elapsed: 0 sec
testRangeLeftSideError(org.eclipse.smarthome.core.internal.scheduler.CronAdjusterMiscTest)  Time elapsed: 0 sec
testMonthName(org.eclipse.smarthome.core.internal.scheduler.CronAdjusterMiscTest)  Time elapsed: 0 sec
testDayInWeek(org.eclipse.smarthome.core.internal.scheduler.CronAdjusterMiscTest)  Time elapsed: 0 sec
testRangeRightSideError(org.eclipse.smarthome.core.internal.scheduler.CronAdjusterMiscTest)  Time elapsed: 0 sec
testAfterSlash(org.eclipse.smarthome.core.internal.scheduler.CronAdjusterMiscTest)  Time elapsed: 0.001 sec
testRangeWeekDay(org.eclipse.smarthome.core.internal.scheduler.CronAdjusterMiscTest)  Time elapsed: 0 sec
testReboot(org.eclipse.smarthome.core.internal.scheduler.CronAdjusterMiscTest)  Time elapsed: 0.001 sec
testToLong(org.eclipse.smarthome.core.internal.scheduler.CronAdjusterMiscTest)  Time elapsed: 0 sec
Running org.eclipse.smarthome.core.internal.scheduler.SchedulerImplTest
Tests run: 14, Failures: 0, Errors: 1, Skipped: 0, Time elapsed: 4.148 sec <<< FAILURE! - in org.eclipse.smarthome.core.internal.scheduler.SchedulerImplTest
testScheduleCancel(org.eclipse.smarthome.core.internal.scheduler.SchedulerImplTest)  Time elapsed: 0.454 sec
testAfterResolved(org.eclipse.smarthome.core.internal.scheduler.SchedulerImplTest)  Time elapsed: 0.201 sec
testAfterResolvedWithException(org.eclipse.smarthome.core.internal.scheduler.SchedulerImplTest)  Time elapsed: 0.571 sec  <<< ERROR!
org.junit.runners.model.TestTimedOutException: test timed out after 300 milliseconds

testDelay(org.eclipse.smarthome.core.internal.scheduler.SchedulerImplTest)  Time elapsed: 0.502 sec
testAfterTimeoutException(org.eclipse.smarthome.core.internal.scheduler.SchedulerImplTest)  Time elapsed: 0.204 sec
testCompareTo(org.eclipse.smarthome.core.internal.scheduler.SchedulerImplTest)  Time elapsed: 0.5 sec
testAfterCancelled(org.eclipse.smarthome.core.internal.scheduler.SchedulerImplTest)  Time elapsed: 0.301 sec
testSchedule(org.eclipse.smarthome.core.internal.scheduler.SchedulerImplTest)  Time elapsed: 0.602 sec
testBeforeCancelled(org.eclipse.smarthome.core.internal.scheduler.SchedulerImplTest)  Time elapsed: 0.001 sec
testBeforeResolved(org.eclipse.smarthome.core.internal.scheduler.SchedulerImplTest)  Time elapsed: 0 sec
testScheduleException(org.eclipse.smarthome.core.internal.scheduler.SchedulerImplTest)  Time elapsed: 0.402 sec
testBeforeTimeoutException(org.eclipse.smarthome.core.internal.scheduler.SchedulerImplTest)  Time elapsed: 0.201 sec
testNegative(org.eclipse.smarthome.core.internal.scheduler.SchedulerImplTest)  Time elapsed: 0.201 sec
testBeforeResolvedWithException(org.eclipse.smarthome.core.internal.scheduler.SchedulerImplTest)  Time elapsed: 0.002 sec
Running org.eclipse.smarthome.core.internal.i18n.I18nProviderImplTest
Tests run: 6, Failures: 0, Errors: 0, Skipped: 0, Time elapsed: 0.223 sec - in org.eclipse.smarthome.core.internal.i18n.I18nProviderImplTest
assertThatInvalidTimeZoneFallsbackToDefaultTimeZone(org.eclipse.smarthome.core.internal.i18n.I18nProviderImplTest)  Time elapsed: 0.201 sec
assertThatDefaultLocaleWillBeUsed(org.eclipse.smarthome.core.internal.i18n.I18nProviderImplTest)  Time elapsed: 0.001 sec
assertThatConfigurationChangeWorks(org.eclipse.smarthome.core.internal.i18n.I18nProviderImplTest)  Time elapsed: 0.015 sec
assertThatConfigurationWasSet(org.eclipse.smarthome.core.internal.i18n.I18nProviderImplTest)  Time elapsed: 0.001 sec
assertThatActivateSetsLocaleAndLocation(org.eclipse.smarthome.core.internal.i18n.I18nProviderImplTest)  Time elapsed: 0.002 sec
assertThatDefaultLocaleWillBeUsedAndLocationIsSet(org.eclipse.smarthome.core.internal.i18n.I18nProviderImplTest)  Time elapsed: 0.001 sec
Running org.eclipse.smarthome.core.internal.i18n.TranslationProviderOSGiTest
Tests run: 4, Failures: 0, Errors: 0, Skipped: 0, Time elapsed: 0.031 sec - in org.eclipse.smarthome.core.internal.i18n.TranslationProviderOSGiTest
assertThatGetTextWithoutBundleIsWorkingProperly(org.eclipse.smarthome.core.internal.i18n.TranslationProviderOSGiTest)  Time elapsed: 0.004 sec
assertThatGetTextViaBundleIsWorkingProperly(org.eclipse.smarthome.core.internal.i18n.TranslationProviderOSGiTest)  Time elapsed: 0.021 sec
assertThatGetTextWithArgumentsViaBundleIsWorkingProperly(org.eclipse.smarthome.core.internal.i18n.TranslationProviderOSGiTest)  Time elapsed: 0.003 sec
assertThatGetTextWithArgumentsDelegatesProperlyToGetTextWithoutArguments(org.eclipse.smarthome.core.internal.i18n.TranslationProviderOSGiTest)  Time elapsed: 0.001 sec
Running org.eclipse.smarthome.core.internal.items.ItemStateConverterImplTest
Tests run: 7, Failures: 0, Errors: 0, Skipped: 0, Time elapsed: 0.283 sec - in org.eclipse.smarthome.core.internal.items.ItemStateConverterImplTest
numberItemWithoutDimensionShouldConvertToDecimalType(org.eclipse.smarthome.core.internal.items.ItemStateConverterImplTest)  Time elapsed: 0.03 sec
numberItemShouldNotConvertUnitsWhereMeasurmentSystemEquals(org.eclipse.smarthome.core.internal.items.ItemStateConverterImplTest)  Time elapsed: 0.208 sec
testNoConversion(org.eclipse.smarthome.core.internal.items.ItemStateConverterImplTest)  Time elapsed: 0 sec
testStateConversion(org.eclipse.smarthome.core.internal.items.ItemStateConverterImplTest)  Time elapsed: 0.001 sec
numberItemWitDimensionShouldConvertToItemStateDescriptionUnit(org.eclipse.smarthome.core.internal.items.ItemStateConverterImplTest)  Time elapsed: 0.04 sec
testNullState(org.eclipse.smarthome.core.internal.items.ItemStateConverterImplTest)  Time elapsed: 0 sec
numberItemWitDimensionShouldConvertToLocaleBasedUnit(org.eclipse.smarthome.core.internal.items.ItemStateConverterImplTest)  Time elapsed: 0.002 sec
Running org.eclipse.smarthome.core.internal.items.ItemBuilderTest
Tests run: 9, Failures: 0, Errors: 0, Skipped: 0, Time elapsed: 0.133 sec - in org.eclipse.smarthome.core.internal.items.ItemBuilderTest
testBaseItemOnNonGroupItem(org.eclipse.smarthome.core.internal.items.ItemBuilderTest)  Time elapsed: 0.094 sec
testClone(org.eclipse.smarthome.core.internal.items.ItemBuilderTest)  Time elapsed: 0.007 sec
testFull(org.eclipse.smarthome.core.internal.items.ItemBuilderTest)  Time elapsed: 0.002 sec
testFullGroupItem(org.eclipse.smarthome.core.internal.items.ItemBuilderTest)  Time elapsed: 0.021 sec
testNoFactory(org.eclipse.smarthome.core.internal.items.ItemBuilderTest)  Time elapsed: 0.001 sec
testMinimal(org.eclipse.smarthome.core.internal.items.ItemBuilderTest)  Time elapsed: 0.002 sec
testFunctionOnNonGroupItem(org.eclipse.smarthome.core.internal.items.ItemBuilderTest)  Time elapsed: 0.001 sec
testMinimalGroupItem(org.eclipse.smarthome.core.internal.items.ItemBuilderTest)  Time elapsed: 0 sec
testCloneGroupItem(org.eclipse.smarthome.core.internal.items.ItemBuilderTest)  Time elapsed: 0.001 sec
Running org.eclipse.smarthome.core.internal.items.ItemTagTest
Tests run: 7, Failures: 0, Errors: 0, Skipped: 0, Time elapsed: 0.006 sec - in org.eclipse.smarthome.core.internal.items.ItemTagTest
assertTagsAreAddedAndRemovedCorrectly(org.eclipse.smarthome.core.internal.items.ItemTagTest)  Time elapsed: 0.003 sec
testThatAddTagsFromListIsWorkingCaseInsensitive(org.eclipse.smarthome.core.internal.items.ItemTagTest)  Time elapsed: 0 sec
testThatRemoveNonExistingTagDoesNotThrowNPE(org.eclipse.smarthome.core.internal.items.ItemTagTest)  Time elapsed: 0 sec
testThatAddTagsIsWorkingCaseInsensitive(org.eclipse.smarthome.core.internal.items.ItemTagTest)  Time elapsed: 0 sec
testThatItemsToBeRemovedAreFoundCaseInsensitive(org.eclipse.smarthome.core.internal.items.ItemTagTest)  Time elapsed: 0 sec
testThatGetTagsReturnsTagsAsTheyHaveBeenStored(org.eclipse.smarthome.core.internal.items.ItemTagTest)  Time elapsed: 0 sec
testThatTagsAreHandledCaseInsensitive(org.eclipse.smarthome.core.internal.items.ItemTagTest)  Time elapsed: 0 sec
Running org.eclipse.smarthome.core.internal.items.MetadataRegistryImplTest
Tests run: 3, Failures: 0, Errors: 0, Skipped: 0, Time elapsed: 0.064 sec - in org.eclipse.smarthome.core.internal.items.MetadataRegistryImplTest
testGet(org.eclipse.smarthome.core.internal.items.MetadataRegistryImplTest)  Time elapsed: 0.057 sec
testRemoveItemMetadata(org.eclipse.smarthome.core.internal.items.MetadataRegistryImplTest)  Time elapsed: 0.004 sec
testGet_empty(org.eclipse.smarthome.core.internal.items.MetadataRegistryImplTest)  Time elapsed: 0.001 sec
Running org.eclipse.smarthome.core.internal.items.ItemUpdaterOSGiTest
Tests run: 2, Failures: 0, Errors: 0, Skipped: 0, Time elapsed: 0.25 sec - in org.eclipse.smarthome.core.internal.items.ItemUpdaterOSGiTest
testItemUpdaterSendsStateChangedEvent(org.eclipse.smarthome.core.internal.items.ItemUpdaterOSGiTest)  Time elapsed: 0.242 sec
testItemUpdaterSetsItemState(org.eclipse.smarthome.core.internal.items.ItemUpdaterOSGiTest)  Time elapsed: 0.007 sec
Running org.eclipse.smarthome.core.internal.common.SafeCallerImplTest
Tests run: 25, Failures: 0, Errors: 0, Skipped: 0, Time elapsed: 7.525 sec - in org.eclipse.smarthome.core.internal.common.SafeCallerImplTest
testSimpleCall(org.eclipse.smarthome.core.internal.common.SafeCallerImplTest)  Time elapsed: 0.043 sec
testAsyncExceptionHandler(org.eclipse.smarthome.core.internal.common.SafeCallerImplTest)  Time elapsed: 0.077 sec
testAsyncRunsSubsequentAndDoesNotTimeout_sameIdentifier(org.eclipse.smarthome.core.internal.common.SafeCallerImplTest)  Time elapsed: 0.512 sec
testAsyncDoesNotTimeout_defaultIdentifiers(org.eclipse.smarthome.core.internal.common.SafeCallerImplTest)  Time elapsed: 0.006 sec
testAsyncSequential_sameIdentifier(org.eclipse.smarthome.core.internal.common.SafeCallerImplTest)  Time elapsed: 1.025 sec
testExceptionHandler(org.eclipse.smarthome.core.internal.common.SafeCallerImplTest)  Time elapsed: 0.004 sec
testSecondCallGetsAccepted_differentIdentifier(org.eclipse.smarthome.core.internal.common.SafeCallerImplTest)  Time elapsed: 0.406 sec
testAsyncTimeoutHandler(org.eclipse.smarthome.core.internal.common.SafeCallerImplTest)  Time elapsed: 0.209 sec
testLambdas(org.eclipse.smarthome.core.internal.common.SafeCallerImplTest)  Time elapsed: 0.009 sec
testAsyncExceedingThreadPool_differentIdentifier(org.eclipse.smarthome.core.internal.common.SafeCallerImplTest)  Time elapsed: 0.524 sec
testMultiThread_async(org.eclipse.smarthome.core.internal.common.SafeCallerImplTest)  Time elapsed: 0.208 sec
testAsyncDoesNotTimeout_differentIdentifiers(org.eclipse.smarthome.core.internal.common.SafeCallerImplTest)  Time elapsed: 0.004 sec
testAsyncExecutionOrder(org.eclipse.smarthome.core.internal.common.SafeCallerImplTest)  Time elapsed: 1.264 sec
testInterfaceDetection(org.eclipse.smarthome.core.internal.common.SafeCallerImplTest)  Time elapsed: 0.001 sec
testDuplicateInterface(org.eclipse.smarthome.core.internal.common.SafeCallerImplTest)  Time elapsed: 0.001 sec
testAsyncReturnsImmediately(org.eclipse.smarthome.core.internal.common.SafeCallerImplTest)  Time elapsed: 0.055 sec
testCall_wrapped(org.eclipse.smarthome.core.internal.common.SafeCallerImplTest)  Time elapsed: 0.204 sec
testSingleThread_sync_secondCallWhileInTimeout(org.eclipse.smarthome.core.internal.common.SafeCallerImplTest)  Time elapsed: 0.513 sec
testTimeoutHandler(org.eclipse.smarthome.core.internal.common.SafeCallerImplTest)  Time elapsed: 0.204 sec
testSecondCallGetsRefused_sameIdentifier(org.eclipse.smarthome.core.internal.common.SafeCallerImplTest)  Time elapsed: 0.204 sec
testMultiThread_sync(org.eclipse.smarthome.core.internal.common.SafeCallerImplTest)  Time elapsed: 0.306 sec
testSingleThread_sync_parallel(org.eclipse.smarthome.core.internal.common.SafeCallerImplTest)  Time elapsed: 0.513 sec
testTimeoutConfiguration(org.eclipse.smarthome.core.internal.common.SafeCallerImplTest)  Time elapsed: 0.503 sec
testSingleThread_async(org.eclipse.smarthome.core.internal.common.SafeCallerImplTest)  Time elapsed: 0.513 sec
testTimeoutReturnsEarly(org.eclipse.smarthome.core.internal.common.SafeCallerImplTest)  Time elapsed: 0.204 sec
Running org.eclipse.smarthome.core.internal.types.StateDescriptionFragmentImplTest
Tests run: 2, Failures: 0, Errors: 0, Skipped: 0, Time elapsed: 0.003 sec - in org.eclipse.smarthome.core.internal.types.StateDescriptionFragmentImplTest
toStateDescription(org.eclipse.smarthome.core.internal.types.StateDescriptionFragmentImplTest)  Time elapsed: 0.001 sec
mergeFragment(org.eclipse.smarthome.core.internal.types.StateDescriptionFragmentImplTest)  Time elapsed: 0 sec
Running org.eclipse.smarthome.core.internal.service.ReadyServiceImplTest
Tests run: 5, Failures: 0, Errors: 0, Skipped: 0, Time elapsed: 0.032 sec - in org.eclipse.smarthome.core.internal.service.ReadyServiceImplTest
testTrackersAreInformedOnChange(org.eclipse.smarthome.core.internal.service.ReadyServiceImplTest)  Time elapsed: 0.028 sec
testTrackersAreInformedOnlyOnMatch(org.eclipse.smarthome.core.internal.service.ReadyServiceImplTest)  Time elapsed: 0.001 sec
testDifferentReadyMarkerInstances(org.eclipse.smarthome.core.internal.service.ReadyServiceImplTest)  Time elapsed: 0 sec
testUnregisterTracker(org.eclipse.smarthome.core.internal.service.ReadyServiceImplTest)  Time elapsed: 0.001 sec
testTrackersAreInformedInitially(org.eclipse.smarthome.core.internal.service.ReadyServiceImplTest)  Time elapsed: 0.001 sec
Running org.eclipse.smarthome.core.internal.events.OSGiEventManagerOSGiTest
Tests run: 10, Failures: 0, Errors: 0, Skipped: 0, Time elapsed: 1.811 sec - in org.eclipse.smarthome.core.internal.events.OSGiEventManagerOSGiTest
testValidationPayload(org.eclipse.smarthome.core.internal.events.OSGiEventManagerOSGiTest)  Time elapsed: 0.072 sec
testValidationType(org.eclipse.smarthome.core.internal.events.OSGiEventManagerOSGiTest)  Time elapsed: 0.006 sec
testValidationEvent(org.eclipse.smarthome.core.internal.events.OSGiEventManagerOSGiTest)  Time elapsed: 0.01 sec
testValidationTopic(org.eclipse.smarthome.core.internal.events.OSGiEventManagerOSGiTest)  Time elapsed: 0.006 sec
testDispatchA(org.eclipse.smarthome.core.internal.events.OSGiEventManagerOSGiTest)  Time elapsed: 0.112 sec
testDispatchB(org.eclipse.smarthome.core.internal.events.OSGiEventManagerOSGiTest)  Time elapsed: 0.109 sec
testDispatchC(org.eclipse.smarthome.core.internal.events.OSGiEventManagerOSGiTest)  Time elapsed: 0.111 sec
testSubscriberUnregistration1(org.eclipse.smarthome.core.internal.events.OSGiEventManagerOSGiTest)  Time elapsed: 1.163 sec
testSubscriberUnregistration1_2(org.eclipse.smarthome.core.internal.events.OSGiEventManagerOSGiTest)  Time elapsed: 0.109 sec
testFactoryUnregistration(org.eclipse.smarthome.core.internal.events.OSGiEventManagerOSGiTest)  Time elapsed: 0.11 sec
Running org.eclipse.smarthome.core.library.types.ArithmeticGroupFunctionTest
Tests run: 13, Failures: 0, Errors: 0, Skipped: 0, Time elapsed: 0.015 sec - in org.eclipse.smarthome.core.library.types.ArithmeticGroupFunctionTest
testNAndFunction_negative(org.eclipse.smarthome.core.library.types.ArithmeticGroupFunctionTest)  Time elapsed: 0.004 sec
testOrFunction_differntTypes(org.eclipse.smarthome.core.library.types.ArithmeticGroupFunctionTest)  Time elapsed: 0.002 sec
testCountFunction(org.eclipse.smarthome.core.library.types.ArithmeticGroupFunctionTest)  Time elapsed: 0.002 sec
testNOrFunction(org.eclipse.smarthome.core.library.types.ArithmeticGroupFunctionTest)  Time elapsed: 0.001 sec
testNAndFunction(org.eclipse.smarthome.core.library.types.ArithmeticGroupFunctionTest)  Time elapsed: 0 sec
testAndFunction_negative(org.eclipse.smarthome.core.library.types.ArithmeticGroupFunctionTest)  Time elapsed: 0 sec
testSumFunction(org.eclipse.smarthome.core.library.types.ArithmeticGroupFunctionTest)  Time elapsed: 0.001 sec
testAndFunction_justsOneItem(org.eclipse.smarthome.core.library.types.ArithmeticGroupFunctionTest)  Time elapsed: 0 sec
testOrFunction(org.eclipse.smarthome.core.library.types.ArithmeticGroupFunctionTest)  Time elapsed: 0 sec
testOrFunction_justsOneItem(org.eclipse.smarthome.core.library.types.ArithmeticGroupFunctionTest)  Time elapsed: 0 sec
testNOrFunction_negative(org.eclipse.smarthome.core.library.types.ArithmeticGroupFunctionTest)  Time elapsed: 0.001 sec
testOrFunction_negative(org.eclipse.smarthome.core.library.types.ArithmeticGroupFunctionTest)  Time elapsed: 0 sec
testAndFunction(org.eclipse.smarthome.core.library.types.ArithmeticGroupFunctionTest)  Time elapsed: 0 sec
Running org.eclipse.smarthome.core.library.types.DateTimeTypeTest
Tests run: 102, Failures: 0, Errors: 0, Skipped: 0, Time elapsed: 0.168 sec - in org.eclipse.smarthome.core.library.types.DateTimeTypeTest
serializationTest[0](org.eclipse.smarthome.core.library.types.DateTimeTypeTest)  Time elapsed: 0.008 sec
createZonedDate[0](org.eclipse.smarthome.core.library.types.DateTimeTypeTest)  Time elapsed: 0.001 sec
equalityTest[0](org.eclipse.smarthome.core.library.types.DateTimeTypeTest)  Time elapsed: 0.003 sec
equalityTestZoned[0](org.eclipse.smarthome.core.library.types.DateTimeTypeTest)  Time elapsed: 0.001 sec
serializationTestZoned[0](org.eclipse.smarthome.core.library.types.DateTimeTypeTest)  Time elapsed: 0.001 sec
createDate[0](org.eclipse.smarthome.core.library.types.DateTimeTypeTest)  Time elapsed: 0.005 sec
serializationTest[1](org.eclipse.smarthome.core.library.types.DateTimeTypeTest)  Time elapsed: 0.001 sec
createZonedDate[1](org.eclipse.smarthome.core.library.types.DateTimeTypeTest)  Time elapsed: 0.001 sec
equalityTest[1](org.eclipse.smarthome.core.library.types.DateTimeTypeTest)  Time elapsed: 0.001 sec
equalityTestZoned[1](org.eclipse.smarthome.core.library.types.DateTimeTypeTest)  Time elapsed: 0.001 sec
serializationTestZoned[1](org.eclipse.smarthome.core.library.types.DateTimeTypeTest)  Time elapsed: 0.001 sec
createDate[1](org.eclipse.smarthome.core.library.types.DateTimeTypeTest)  Time elapsed: 0 sec
serializationTest[2](org.eclipse.smarthome.core.library.types.DateTimeTypeTest)  Time elapsed: 0 sec
createZonedDate[2](org.eclipse.smarthome.core.library.types.DateTimeTypeTest)  Time elapsed: 0.001 sec
equalityTest[2](org.eclipse.smarthome.core.library.types.DateTimeTypeTest)  Time elapsed: 0.001 sec
equalityTestZoned[2](org.eclipse.smarthome.core.library.types.DateTimeTypeTest)  Time elapsed: 0.001 sec
serializationTestZoned[2](org.eclipse.smarthome.core.library.types.DateTimeTypeTest)  Time elapsed: 0.001 sec
createDate[2](org.eclipse.smarthome.core.library.types.DateTimeTypeTest)  Time elapsed: 0.001 sec
serializationTest[3](org.eclipse.smarthome.core.library.types.DateTimeTypeTest)  Time elapsed: 0 sec
createZonedDate[3](org.eclipse.smarthome.core.library.types.DateTimeTypeTest)  Time elapsed: 0.002 sec
equalityTest[3](org.eclipse.smarthome.core.library.types.DateTimeTypeTest)  Time elapsed: 0.001 sec
equalityTestZoned[3](org.eclipse.smarthome.core.library.types.DateTimeTypeTest)  Time elapsed: 0.001 sec
serializationTestZoned[3](org.eclipse.smarthome.core.library.types.DateTimeTypeTest)  Time elapsed: 0.001 sec
createDate[3](org.eclipse.smarthome.core.library.types.DateTimeTypeTest)  Time elapsed: 0 sec
serializationTest[4](org.eclipse.smarthome.core.library.types.DateTimeTypeTest)  Time elapsed: 0.001 sec
createZonedDate[4](org.eclipse.smarthome.core.library.types.DateTimeTypeTest)  Time elapsed: 0.001 sec
equalityTest[4](org.eclipse.smarthome.core.library.types.DateTimeTypeTest)  Time elapsed: 0.001 sec
equalityTestZoned[4](org.eclipse.smarthome.core.library.types.DateTimeTypeTest)  Time elapsed: 0.001 sec
serializationTestZoned[4](org.eclipse.smarthome.core.library.types.DateTimeTypeTest)  Time elapsed: 0.001 sec
createDate[4](org.eclipse.smarthome.core.library.types.DateTimeTypeTest)  Time elapsed: 0 sec
serializationTest[5](org.eclipse.smarthome.core.library.types.DateTimeTypeTest)  Time elapsed: 0.001 sec
createZonedDate[5](org.eclipse.smarthome.core.library.types.DateTimeTypeTest)  Time elapsed: 0.024 sec
equalityTest[5](org.eclipse.smarthome.core.library.types.DateTimeTypeTest)  Time elapsed: 0.001 sec
equalityTestZoned[5](org.eclipse.smarthome.core.library.types.DateTimeTypeTest)  Time elapsed: 0 sec
serializationTestZoned[5](org.eclipse.smarthome.core.library.types.DateTimeTypeTest)  Time elapsed: 0 sec
createDate[5](org.eclipse.smarthome.core.library.types.DateTimeTypeTest)  Time elapsed: 0.008 sec
serializationTest[6](org.eclipse.smarthome.core.library.types.DateTimeTypeTest)  Time elapsed: 0 sec
createZonedDate[6](org.eclipse.smarthome.core.library.types.DateTimeTypeTest)  Time elapsed: 0.001 sec
equalityTest[6](org.eclipse.smarthome.core.library.types.DateTimeTypeTest)  Time elapsed: 0.001 sec
equalityTestZoned[6](org.eclipse.smarthome.core.library.types.DateTimeTypeTest)  Time elapsed: 0.012 sec
serializationTestZoned[6](org.eclipse.smarthome.core.library.types.DateTimeTypeTest)  Time elapsed: 0 sec
createDate[6](org.eclipse.smarthome.core.library.types.DateTimeTypeTest)  Time elapsed: 0.001 sec
serializationTest[7](org.eclipse.smarthome.core.library.types.DateTimeTypeTest)  Time elapsed: 0 sec
createZonedDate[7](org.eclipse.smarthome.core.library.types.DateTimeTypeTest)  Time elapsed: 0.001 sec
equalityTest[7](org.eclipse.smarthome.core.library.types.DateTimeTypeTest)  Time elapsed: 0.003 sec
equalityTestZoned[7](org.eclipse.smarthome.core.library.types.DateTimeTypeTest)  Time elapsed: 0.001 sec
serializationTestZoned[7](org.eclipse.smarthome.core.library.types.DateTimeTypeTest)  Time elapsed: 0 sec
createDate[7](org.eclipse.smarthome.core.library.types.DateTimeTypeTest)  Time elapsed: 0.004 sec
serializationTest[8](org.eclipse.smarthome.core.library.types.DateTimeTypeTest)  Time elapsed: 0.002 sec
createZonedDate[8](org.eclipse.smarthome.core.library.types.DateTimeTypeTest)  Time elapsed: 0 sec
equalityTest[8](org.eclipse.smarthome.core.library.types.DateTimeTypeTest)  Time elapsed: 0.001 sec
equalityTestZoned[8](org.eclipse.smarthome.core.library.types.DateTimeTypeTest)  Time elapsed: 0 sec
serializationTestZoned[8](org.eclipse.smarthome.core.library.types.DateTimeTypeTest)  Time elapsed: 0 sec
createDate[8](org.eclipse.smarthome.core.library.types.DateTimeTypeTest)  Time elapsed: 0 sec
serializationTest[9](org.eclipse.smarthome.core.library.types.DateTimeTypeTest)  Time elapsed: 0 sec
createZonedDate[9](org.eclipse.smarthome.core.library.types.DateTimeTypeTest)  Time elapsed: 0.001 sec
equalityTest[9](org.eclipse.smarthome.core.library.types.DateTimeTypeTest)  Time elapsed: 0.001 sec
equalityTestZoned[9](org.eclipse.smarthome.core.library.types.DateTimeTypeTest)  Time elapsed: 0.001 sec
serializationTestZoned[9](org.eclipse.smarthome.core.library.types.DateTimeTypeTest)  Time elapsed: 0 sec
createDate[9](org.eclipse.smarthome.core.library.types.DateTimeTypeTest)  Time elapsed: 0.001 sec
serializationTest[10](org.eclipse.smarthome.core.library.types.DateTimeTypeTest)  Time elapsed: 0 sec
createZonedDate[10](org.eclipse.smarthome.core.library.types.DateTimeTypeTest)  Time elapsed: 0.001 sec
equalityTest[10](org.eclipse.smarthome.core.library.types.DateTimeTypeTest)  Time elapsed: 0 sec
equalityTestZoned[10](org.eclipse.smarthome.core.library.types.DateTimeTypeTest)  Time elapsed: 0.001 sec
serializationTestZoned[10](org.eclipse.smarthome.core.library.types.DateTimeTypeTest)  Time elapsed: 0.002 sec
createDate[10](org.eclipse.smarthome.core.library.types.DateTimeTypeTest)  Time elapsed: 0.001 sec
serializationTest[11](org.eclipse.smarthome.core.library.types.DateTimeTypeTest)  Time elapsed: 0.001 sec
createZonedDate[11](org.eclipse.smarthome.core.library.types.DateTimeTypeTest)  Time elapsed: 0 sec
equalityTest[11](org.eclipse.smarthome.core.library.types.DateTimeTypeTest)  Time elapsed: 0.001 sec
equalityTestZoned[11](org.eclipse.smarthome.core.library.types.DateTimeTypeTest)  Time elapsed: 0.001 sec
serializationTestZoned[11](org.eclipse.smarthome.core.library.types.DateTimeTypeTest)  Time elapsed: 0 sec
createDate[11](org.eclipse.smarthome.core.library.types.DateTimeTypeTest)  Time elapsed: 0.001 sec
serializationTest[12](org.eclipse.smarthome.core.library.types.DateTimeTypeTest)  Time elapsed: 0 sec
createZonedDate[12](org.eclipse.smarthome.core.library.types.DateTimeTypeTest)  Time elapsed: 0.001 sec
equalityTest[12](org.eclipse.smarthome.core.library.types.DateTimeTypeTest)  Time elapsed: 0.001 sec
equalityTestZoned[12](org.eclipse.smarthome.core.library.types.DateTimeTypeTest)  Time elapsed: 0 sec
serializationTestZoned[12](org.eclipse.smarthome.core.library.types.DateTimeTypeTest)  Time elapsed: 0 sec
createDate[12](org.eclipse.smarthome.core.library.types.DateTimeTypeTest)  Time elapsed: 0 sec
serializationTest[13](org.eclipse.smarthome.core.library.types.DateTimeTypeTest)  Time elapsed: 0.001 sec
createZonedDate[13](org.eclipse.smarthome.core.library.types.DateTimeTypeTest)  Time elapsed: 0.001 sec
equalityTest[13](org.eclipse.smarthome.core.library.types.DateTimeTypeTest)  Time elapsed: 0 sec
equalityTestZoned[13](org.eclipse.smarthome.core.library.types.DateTimeTypeTest)  Time elapsed: 0 sec
serializationTestZoned[13](org.eclipse.smarthome.core.library.types.DateTimeTypeTest)  Time elapsed: 0 sec
createDate[13](org.eclipse.smarthome.core.library.types.DateTimeTypeTest)  Time elapsed: 0 sec
serializationTest[14](org.eclipse.smarthome.core.library.types.DateTimeTypeTest)  Time elapsed: 0.001 sec
createZonedDate[14](org.eclipse.smarthome.core.library.types.DateTimeTypeTest)  Time elapsed: 0.004 sec
equalityTest[14](org.eclipse.smarthome.core.library.types.DateTimeTypeTest)  Time elapsed: 0 sec
equalityTestZoned[14](org.eclipse.smarthome.core.library.types.DateTimeTypeTest)  Time elapsed: 0.001 sec
serializationTestZoned[14](org.eclipse.smarthome.core.library.types.DateTimeTypeTest)  Time elapsed: 0 sec
createDate[14](org.eclipse.smarthome.core.library.types.DateTimeTypeTest)  Time elapsed: 0.004 sec
serializationTest[15](org.eclipse.smarthome.core.library.types.DateTimeTypeTest)  Time elapsed: 0.001 sec
createZonedDate[15](org.eclipse.smarthome.core.library.types.DateTimeTypeTest)  Time elapsed: 0.004 sec
equalityTest[15](org.eclipse.smarthome.core.library.types.DateTimeTypeTest)  Time elapsed: 0.001 sec
equalityTestZoned[15](org.eclipse.smarthome.core.library.types.DateTimeTypeTest)  Time elapsed: 0.001 sec
serializationTestZoned[15](org.eclipse.smarthome.core.library.types.DateTimeTypeTest)  Time elapsed: 0 sec
createDate[15](org.eclipse.smarthome.core.library.types.DateTimeTypeTest)  Time elapsed: 0.007 sec
serializationTest[16](org.eclipse.smarthome.core.library.types.DateTimeTypeTest)  Time elapsed: 0.001 sec
createZonedDate[16](org.eclipse.smarthome.core.library.types.DateTimeTypeTest)  Time elapsed: 0 sec
equalityTest[16](org.eclipse.smarthome.core.library.types.DateTimeTypeTest)  Time elapsed: 0.001 sec
equalityTestZoned[16](org.eclipse.smarthome.core.library.types.DateTimeTypeTest)  Time elapsed: 0.001 sec
serializationTestZoned[16](org.eclipse.smarthome.core.library.types.DateTimeTypeTest)  Time elapsed: 0 sec
createDate[16](org.eclipse.smarthome.core.library.types.DateTimeTypeTest)  Time elapsed: 0.001 sec
Running org.eclipse.smarthome.core.library.types.StringTypeTest
Tests run: 1, Failures: 0, Errors: 0, Skipped: 0, Time elapsed: 0.002 sec - in org.eclipse.smarthome.core.library.types.StringTypeTest
testEquals(org.eclipse.smarthome.core.library.types.StringTypeTest)  Time elapsed: 0 sec
Running org.eclipse.smarthome.core.library.types.UpDownTypeTest
Tests run: 3, Failures: 0, Errors: 0, Skipped: 0, Time elapsed: 0.001 sec - in org.eclipse.smarthome.core.library.types.UpDownTypeTest
testConversionToPointType(org.eclipse.smarthome.core.library.types.UpDownTypeTest)  Time elapsed: 0 sec
testConversionToPercentType(org.eclipse.smarthome.core.library.types.UpDownTypeTest)  Time elapsed: 0 sec
testConversionToDecimalType(org.eclipse.smarthome.core.library.types.UpDownTypeTest)  Time elapsed: 0 sec
Running org.eclipse.smarthome.core.library.types.QuantityTypeArithmeticGroupFunctionTest
Tests run: 13, Failures: 0, Errors: 0, Skipped: 0, Time elapsed: 0.048 sec - in org.eclipse.smarthome.core.library.types.QuantityTypeArithmeticGroupFunctionTest
testSumFunctionQuantityTypeWithGroups(org.eclipse.smarthome.core.library.types.QuantityTypeArithmeticGroupFunctionTest)  Time elapsed: 0.007 sec
testAvgFunctionQuantityTypeIncompatibleUnits(org.eclipse.smarthome.core.library.types.QuantityTypeArithmeticGroupFunctionTest)  Time elapsed: 0.003 sec
testMaxFunctionQuantityTypeIncompatibleUnits(org.eclipse.smarthome.core.library.types.QuantityTypeArithmeticGroupFunctionTest)  Time elapsed: 0.002 sec
testMinFunctionQuantityTypeDifferentUnits(org.eclipse.smarthome.core.library.types.QuantityTypeArithmeticGroupFunctionTest)  Time elapsed: 0.009 sec
testSumFunctionQuantityType(org.eclipse.smarthome.core.library.types.QuantityTypeArithmeticGroupFunctionTest)  Time elapsed: 0.004 sec
testMinFunctionQuantityType(org.eclipse.smarthome.core.library.types.QuantityTypeArithmeticGroupFunctionTest)  Time elapsed: 0.002 sec
testAvgFunctionQuantityType(org.eclipse.smarthome.core.library.types.QuantityTypeArithmeticGroupFunctionTest)  Time elapsed: 0.004 sec
testAvgFunctionQuantityTypeDifferentUnits(org.eclipse.smarthome.core.library.types.QuantityTypeArithmeticGroupFunctionTest)  Time elapsed: 0.004 sec
testMaxFunctionQuantityType(org.eclipse.smarthome.core.library.types.QuantityTypeArithmeticGroupFunctionTest)  Time elapsed: 0.002 sec
testMaxFunctionQuantityTypeDifferentUnits(org.eclipse.smarthome.core.library.types.QuantityTypeArithmeticGroupFunctionTest)  Time elapsed: 0.003 sec
testMinFunctionQuantityTypeIncompatibleUnits(org.eclipse.smarthome.core.library.types.QuantityTypeArithmeticGroupFunctionTest)  Time elapsed: 0.002 sec
testSumFunctionQuantityTypeIncompatibleUnits(org.eclipse.smarthome.core.library.types.QuantityTypeArithmeticGroupFunctionTest)  Time elapsed: 0.001 sec
testSumFunctionQuantityTypeDifferentUnits(org.eclipse.smarthome.core.library.types.QuantityTypeArithmeticGroupFunctionTest)  Time elapsed: 0.003 sec
Running org.eclipse.smarthome.core.library.types.StringListTypeTest
Tests run: 7, Failures: 0, Errors: 0, Skipped: 0, Time elapsed: 0.006 sec - in org.eclipse.smarthome.core.library.types.StringListTypeTest
testToFullString(org.eclipse.smarthome.core.library.types.StringListTypeTest)  Time elapsed: 0.003 sec
testSerializedEquals_withEscapedEntries(org.eclipse.smarthome.core.library.types.StringListTypeTest)  Time elapsed: 0.001 sec
testError(org.eclipse.smarthome.core.library.types.StringListTypeTest)  Time elapsed: 0 sec
testValueOf_withEscapedEntries(org.eclipse.smarthome.core.library.types.StringListTypeTest)  Time elapsed: 0 sec
testWithEmptyConstituents(org.eclipse.smarthome.core.library.types.StringListTypeTest)  Time elapsed: 0.001 sec
testSerializedEquals_simple(org.eclipse.smarthome.core.library.types.StringListTypeTest)  Time elapsed: 0 sec
testValueOf_simple(org.eclipse.smarthome.core.library.types.StringListTypeTest)  Time elapsed: 0 sec
Running org.eclipse.smarthome.core.library.types.PercentTypeTest
Tests run: 11, Failures: 0, Errors: 0, Skipped: 0, Time elapsed: 0.015 sec - in org.eclipse.smarthome.core.library.types.PercentTypeTest
testConversionToOnOffType(org.eclipse.smarthome.core.library.types.PercentTypeTest)  Time elapsed: 0.001 sec
testConversionToOpenCloseType(org.eclipse.smarthome.core.library.types.PercentTypeTest)  Time elapsed: 0 sec
MoreThan100(org.eclipse.smarthome.core.library.types.PercentTypeTest)  Time elapsed: 0 sec
testConversionToQuantityType(org.eclipse.smarthome.core.library.types.PercentTypeTest)  Time elapsed: 0.01 sec
testConversionToHSBType(org.eclipse.smarthome.core.library.types.PercentTypeTest)  Time elapsed: 0.002 sec
DoubleValue(org.eclipse.smarthome.core.library.types.PercentTypeTest)  Time elapsed: 0 sec
IntValue(org.eclipse.smarthome.core.library.types.PercentTypeTest)  Time elapsed: 0 sec
testConversionToUpDownType(org.eclipse.smarthome.core.library.types.PercentTypeTest)  Time elapsed: 0 sec
testEquals(org.eclipse.smarthome.core.library.types.PercentTypeTest)  Time elapsed: 0 sec
testConversionToDecimalType(org.eclipse.smarthome.core.library.types.PercentTypeTest)  Time elapsed: 0.001 sec
negativeNumber(org.eclipse.smarthome.core.library.types.PercentTypeTest)  Time elapsed: 0 sec
Running org.eclipse.smarthome.core.library.types.PointTypeTest
Tests run: 11, Failures: 0, Errors: 0, Skipped: 0, Time elapsed: 0.005 sec - in org.eclipse.smarthome.core.library.types.PointTypeTest
testConstructorBadlyFormated2(org.eclipse.smarthome.core.library.types.PointTypeTest)  Time elapsed: 0 sec
testConstructorBadlyFormated3(org.eclipse.smarthome.core.library.types.PointTypeTest)  Time elapsed: 0 sec
testConstructorEmpty(org.eclipse.smarthome.core.library.types.PointTypeTest)  Time elapsed: 0 sec
testConstructorTrim1(org.eclipse.smarthome.core.library.types.PointTypeTest)  Time elapsed: 0.001 sec
testConstructorTrim2(org.eclipse.smarthome.core.library.types.PointTypeTest)  Time elapsed: 0 sec
testConstructorTrim3(org.eclipse.smarthome.core.library.types.PointTypeTest)  Time elapsed: 0 sec
testConstructorTrim4(org.eclipse.smarthome.core.library.types.PointTypeTest)  Time elapsed: 0 sec
testConstructorTrim5(org.eclipse.smarthome.core.library.types.PointTypeTest)  Time elapsed: 0 sec
testConstructorTrim6(org.eclipse.smarthome.core.library.types.PointTypeTest)  Time elapsed: 0.001 sec
testConstructorBadlyFormated(org.eclipse.smarthome.core.library.types.PointTypeTest)  Time elapsed: 0 sec
testDistance(org.eclipse.smarthome.core.library.types.PointTypeTest)  Time elapsed: 0.001 sec
Running org.eclipse.smarthome.core.library.types.HSBTypeTest
Tests run: 19, Failures: 0, Errors: 0, Skipped: 0, Time elapsed: 0.009 sec - in org.eclipse.smarthome.core.library.types.HSBTypeTest
testCreateFromXY(org.eclipse.smarthome.core.library.types.HSBTypeTest)  Time elapsed: 0 sec
testConversionToOnOffType(org.eclipse.smarthome.core.library.types.HSBTypeTest)  Time elapsed: 0 sec
testConstructorWithString1(org.eclipse.smarthome.core.library.types.HSBTypeTest)  Time elapsed: 0.001 sec
testConstructorWithString2(org.eclipse.smarthome.core.library.types.HSBTypeTest)  Time elapsed: 0 sec
testConstructorWithString3(org.eclipse.smarthome.core.library.types.HSBTypeTest)  Time elapsed: 0 sec
testConstructorWithString4(org.eclipse.smarthome.core.library.types.HSBTypeTest)  Time elapsed: 0 sec
testConstructorWithString5(org.eclipse.smarthome.core.library.types.HSBTypeTest)  Time elapsed: 0 sec
testConstructorWithString6(org.eclipse.smarthome.core.library.types.HSBTypeTest)  Time elapsed: 0 sec
testConstructorWithIllegalHueValue2(org.eclipse.smarthome.core.library.types.HSBTypeTest)  Time elapsed: 0.001 sec
testConstructorWithIllegalHueValue(org.eclipse.smarthome.core.library.types.HSBTypeTest)  Time elapsed: 0 sec
testRgbToHsbConversion(org.eclipse.smarthome.core.library.types.HSBTypeTest)  Time elapsed: 0 sec
testHsbToRgbConversion(org.eclipse.smarthome.core.library.types.HSBTypeTest)  Time elapsed: 0.003 sec
testConversionToPointType(org.eclipse.smarthome.core.library.types.HSBTypeTest)  Time elapsed: 0.001 sec
testConversionToXY(org.eclipse.smarthome.core.library.types.HSBTypeTest)  Time elapsed: 0 sec
testConversionToPercentType(org.eclipse.smarthome.core.library.types.HSBTypeTest)  Time elapsed: 0 sec
testConstructorWithIllegalSaturationValue(org.eclipse.smarthome.core.library.types.HSBTypeTest)  Time elapsed: 0 sec
testEquals(org.eclipse.smarthome.core.library.types.HSBTypeTest)  Time elapsed: 0 sec
testConversionToDecimalType(org.eclipse.smarthome.core.library.types.HSBTypeTest)  Time elapsed: 0 sec
testConstructorWithIllegalBrightnessValue(org.eclipse.smarthome.core.library.types.HSBTypeTest)  Time elapsed: 0 sec
Running org.eclipse.smarthome.core.library.types.OnOffTypeTest
Tests run: 4, Failures: 0, Errors: 0, Skipped: 0, Time elapsed: 0.002 sec - in org.eclipse.smarthome.core.library.types.OnOffTypeTest
testConversionToPointType(org.eclipse.smarthome.core.library.types.OnOffTypeTest)  Time elapsed: 0 sec
testConversionToPercentType(org.eclipse.smarthome.core.library.types.OnOffTypeTest)  Time elapsed: 0 sec
testConversionToHSBType(org.eclipse.smarthome.core.library.types.OnOffTypeTest)  Time elapsed: 0 sec
testConversionToDecimalType(org.eclipse.smarthome.core.library.types.OnOffTypeTest)  Time elapsed: 0 sec
Running org.eclipse.smarthome.core.library.types.OpenClosedTypeTest
Tests run: 3, Failures: 0, Errors: 0, Skipped: 0, Time elapsed: 0.001 sec - in org.eclipse.smarthome.core.library.types.OpenClosedTypeTest
testConversionToPointType(org.eclipse.smarthome.core.library.types.OpenClosedTypeTest)  Time elapsed: 0 sec
testConversionToPercentType(org.eclipse.smarthome.core.library.types.OpenClosedTypeTest)  Time elapsed: 0 sec
testConversionToDecimalType(org.eclipse.smarthome.core.library.types.OpenClosedTypeTest)  Time elapsed: 0 sec
Running org.eclipse.smarthome.core.library.types.DateTimeGroupFunctionTest
Tests run: 2, Failures: 0, Errors: 0, Skipped: 0, Time elapsed: 0.006 sec - in org.eclipse.smarthome.core.library.types.DateTimeGroupFunctionTest
testLatestFunction(org.eclipse.smarthome.core.library.types.DateTimeGroupFunctionTest)  Time elapsed: 0.003 sec
testEarliestFunction(org.eclipse.smarthome.core.library.types.DateTimeGroupFunctionTest)  Time elapsed: 0.002 sec
Running org.eclipse.smarthome.core.library.types.DecimalTypeTest
Tests run: 9, Failures: 0, Errors: 0, Skipped: 0, Time elapsed: 0.004 sec - in org.eclipse.smarthome.core.library.types.DecimalTypeTest
testConversionToOnOffType(org.eclipse.smarthome.core.library.types.DecimalTypeTest)  Time elapsed: 0 sec
testConversionToOpenCloseType(org.eclipse.smarthome.core.library.types.DecimalTypeTest)  Time elapsed: 0 sec
testConversionToPointType(org.eclipse.smarthome.core.library.types.DecimalTypeTest)  Time elapsed: 0 sec
testConversionToPercentType(org.eclipse.smarthome.core.library.types.DecimalTypeTest)  Time elapsed: 0.001 sec
testConversionToHSBType(org.eclipse.smarthome.core.library.types.DecimalTypeTest)  Time elapsed: 0 sec
testIntFormat(org.eclipse.smarthome.core.library.types.DecimalTypeTest)  Time elapsed: 0.001 sec
testConversionToUpDownType(org.eclipse.smarthome.core.library.types.DecimalTypeTest)  Time elapsed: 0 sec
testEquals(org.eclipse.smarthome.core.library.types.DecimalTypeTest)  Time elapsed: 0 sec
testFloatFormat(org.eclipse.smarthome.core.library.types.DecimalTypeTest)  Time elapsed: 0.001 sec
Running org.eclipse.smarthome.core.library.types.QuantityTypeTest
Tests run: 26, Failures: 0, Errors: 0, Skipped: 0, Time elapsed: 0.027 sec - in org.eclipse.smarthome.core.library.types.QuantityTypeTest
testDivide_Zero(org.eclipse.smarthome.core.library.types.QuantityTypeTest)  Time elapsed: 0 sec
testConversionToOnOffType(org.eclipse.smarthome.core.library.types.QuantityTypeTest)  Time elapsed: 0.001 sec
testConversionToOpenCloseType(org.eclipse.smarthome.core.library.types.QuantityTypeTest)  Time elapsed: 0 sec
testDivide_Number(org.eclipse.smarthome.core.library.types.QuantityTypeTest)  Time elapsed: 0.001 sec
testSubtract(org.eclipse.smarthome.core.library.types.QuantityTypeTest)  Time elapsed: 0 sec
testUnits(org.eclipse.smarthome.core.library.types.QuantityTypeTest)  Time elapsed: 0.001 sec
testKnownInvalidConstructors(org.eclipse.smarthome.core.library.types.QuantityTypeTest)  Time elapsed: 0.001 sec
testConversionToPercentType(org.eclipse.smarthome.core.library.types.QuantityTypeTest)  Time elapsed: 0 sec
testConversionToHSBType(org.eclipse.smarthome.core.library.types.QuantityTypeTest)  Time elapsed: 0 sec
testReflectiveInstantiation(org.eclipse.smarthome.core.library.types.QuantityTypeTest)  Time elapsed: 0.001 sec
testPressureUnits(org.eclipse.smarthome.core.library.types.QuantityTypeTest)  Time elapsed: 0.001 sec
testConvertionOnSameUnit(org.eclipse.smarthome.core.library.types.QuantityTypeTest)  Time elapsed: 0 sec
testDensity(org.eclipse.smarthome.core.library.types.QuantityTypeTest)  Time elapsed: 0.002 sec
testIntensity(org.eclipse.smarthome.core.library.types.QuantityTypeTest)  Time elapsed: 0.003 sec
testConversionToUpDownType(org.eclipse.smarthome.core.library.types.QuantityTypeTest)  Time elapsed: 0 sec
testDivide_QuantityType(org.eclipse.smarthome.core.library.types.QuantityTypeTest)  Time elapsed: 0.001 sec
testConverters(org.eclipse.smarthome.core.library.types.QuantityTypeTest)  Time elapsed: 0.001 sec
toFullStringShouldParseToEqualState(org.eclipse.smarthome.core.library.types.QuantityTypeTest)  Time elapsed: 0.001 sec
testMultiply_Number(org.eclipse.smarthome.core.library.types.QuantityTypeTest)  Time elapsed: 0 sec
testMultiply_QuantityType(org.eclipse.smarthome.core.library.types.QuantityTypeTest)  Time elapsed: 0.001 sec
testNegate(org.eclipse.smarthome.core.library.types.QuantityTypeTest)  Time elapsed: 0 sec
testDimensionless(org.eclipse.smarthome.core.library.types.QuantityTypeTest)  Time elapsed: 0.001 sec
testValidConstructors(org.eclipse.smarthome.core.library.types.QuantityTypeTest)  Time elapsed: 0.001 sec
testEnergyUnits(org.eclipse.smarthome.core.library.types.QuantityTypeTest)  Time elapsed: 0.002 sec
testConvertionFromDimensionless(org.eclipse.smarthome.core.library.types.QuantityTypeTest)  Time elapsed: 0.001 sec
testExponentials(org.eclipse.smarthome.core.library.types.QuantityTypeTest)  Time elapsed: 0.001 sec
Running org.eclipse.smarthome.core.library.items.SwitchItemTest
Tests run: 5, Failures: 0, Errors: 0, Skipped: 0, Time elapsed: 0.008 sec - in org.eclipse.smarthome.core.library.items.SwitchItemTest
testAcceptedStates(org.eclipse.smarthome.core.library.items.SwitchItemTest)  Time elapsed: 0.006 sec
getAsDecimalFromSwitch(org.eclipse.smarthome.core.library.items.SwitchItemTest)  Time elapsed: 0.001 sec
testUndefType(org.eclipse.smarthome.core.library.items.SwitchItemTest)  Time elapsed: 0 sec
getAsPercentFromSwitch(org.eclipse.smarthome.core.library.items.SwitchItemTest)  Time elapsed: 0 sec
getAsHSBFromSwitch(org.eclipse.smarthome.core.library.items.SwitchItemTest)  Time elapsed: 0 sec
Running org.eclipse.smarthome.core.library.items.DimmerItemTest
Tests run: 6, Failures: 0, Errors: 0, Skipped: 0, Time elapsed: 0.003 sec - in org.eclipse.smarthome.core.library.items.DimmerItemTest
testAcceptedStates(org.eclipse.smarthome.core.library.items.DimmerItemTest)  Time elapsed: 0.002 sec
getAsPercentFromHSB(org.eclipse.smarthome.core.library.items.DimmerItemTest)  Time elapsed: 0 sec
getAsPercentFromOff(org.eclipse.smarthome.core.library.items.DimmerItemTest)  Time elapsed: 0 sec
getAsPercentFromPercent(org.eclipse.smarthome.core.library.items.DimmerItemTest)  Time elapsed: 0 sec
testUndefType(org.eclipse.smarthome.core.library.items.DimmerItemTest)  Time elapsed: 0 sec
getAsPercentFromOn(org.eclipse.smarthome.core.library.items.DimmerItemTest)  Time elapsed: 0 sec
Running org.eclipse.smarthome.core.library.items.LocationItemTest
Tests run: 3, Failures: 0, Errors: 0, Skipped: 0, Time elapsed: 0.003 sec - in org.eclipse.smarthome.core.library.items.LocationItemTest
testAcceptedStates(org.eclipse.smarthome.core.library.items.LocationItemTest)  Time elapsed: 0.001 sec
testUndefType(org.eclipse.smarthome.core.library.items.LocationItemTest)  Time elapsed: 0 sec
testDistance(org.eclipse.smarthome.core.library.items.LocationItemTest)  Time elapsed: 0 sec
Running org.eclipse.smarthome.core.library.items.ColorItemTest
Tests run: 6, Failures: 0, Errors: 0, Skipped: 0, Time elapsed: 0.004 sec - in org.eclipse.smarthome.core.library.items.ColorItemTest
testAcceptedStates(org.eclipse.smarthome.core.library.items.ColorItemTest)  Time elapsed: 0.001 sec
testSetStateWithPercentType(org.eclipse.smarthome.core.library.items.ColorItemTest)  Time elapsed: 0 sec
testUndefType(org.eclipse.smarthome.core.library.items.ColorItemTest)  Time elapsed: 0 sec
testUpdateStateWithPercentType(org.eclipse.smarthome.core.library.items.ColorItemTest)  Time elapsed: 0 sec
testSetStateWithOnOffType(org.eclipse.smarthome.core.library.items.ColorItemTest)  Time elapsed: 0 sec
testSetStateWithHSBType(org.eclipse.smarthome.core.library.items.ColorItemTest)  Time elapsed: 0.001 sec
Running org.eclipse.smarthome.core.library.items.RollershutterItemTest
Tests run: 6, Failures: 0, Errors: 0, Skipped: 0, Time elapsed: 0.004 sec - in org.eclipse.smarthome.core.library.items.RollershutterItemTest
testAcceptedStates(org.eclipse.smarthome.core.library.items.RollershutterItemTest)  Time elapsed: 0.003 sec
setState_stateDown_returnPercent100(org.eclipse.smarthome.core.library.items.RollershutterItemTest)  Time elapsed: 0 sec
setState_stateHSB50_returnPercent50(org.eclipse.smarthome.core.library.items.RollershutterItemTest)  Time elapsed: 0 sec
setState_statePercent50_returnPercent50(org.eclipse.smarthome.core.library.items.RollershutterItemTest)  Time elapsed: 0.001 sec
setState_stateUndef(org.eclipse.smarthome.core.library.items.RollershutterItemTest)  Time elapsed: 0 sec
setState_stateUp_returnPercent0(org.eclipse.smarthome.core.library.items.RollershutterItemTest)  Time elapsed: 0 sec
Running org.eclipse.smarthome.core.library.items.NumberItemTest
Tests run: 10, Failures: 0, Errors: 0, Skipped: 0, Time elapsed: 0.041 sec - in org.eclipse.smarthome.core.library.items.NumberItemTest
testAcceptedStates(org.eclipse.smarthome.core.library.items.NumberItemTest)  Time elapsed: 0.028 sec
testStripUnitPlaceholderFromPlainNumberItem(org.eclipse.smarthome.core.library.items.NumberItemTest)  Time elapsed: 0.001 sec
setHSBType(org.eclipse.smarthome.core.library.items.NumberItemTest)  Time elapsed: 0.001 sec
testLeaveUnitPlaceholderOnDimensionNumberItem(org.eclipse.smarthome.core.library.items.NumberItemTest)  Time elapsed: 0 sec
setPercentType(org.eclipse.smarthome.core.library.items.NumberItemTest)  Time elapsed: 0 sec
testSetQuantityTypeUnconverted(org.eclipse.smarthome.core.library.items.NumberItemTest)  Time elapsed: 0.001 sec
testUndefType(org.eclipse.smarthome.core.library.items.NumberItemTest)  Time elapsed: 0.004 sec
testSetQuantityTypeConverted(org.eclipse.smarthome.core.library.items.NumberItemTest)  Time elapsed: 0.001 sec
setDecimalType(org.eclipse.smarthome.core.library.items.NumberItemTest)  Time elapsed: 0.001 sec
testSetQuantityTypeAccepted(org.eclipse.smarthome.core.library.items.NumberItemTest)  Time elapsed: 0.002 sec
Running org.eclipse.smarthome.core.library.items.PlayerItemTest
Tests run: 4, Failures: 0, Errors: 0, Skipped: 0, Time elapsed: 0.004 sec - in org.eclipse.smarthome.core.library.items.PlayerItemTest
testAcceptedStates(org.eclipse.smarthome.core.library.items.PlayerItemTest)  Time elapsed: 0.002 sec
setRewindFastforward(org.eclipse.smarthome.core.library.items.PlayerItemTest)  Time elapsed: 0 sec
testUndefType(org.eclipse.smarthome.core.library.items.PlayerItemTest)  Time elapsed: 0.001 sec
setPlayPause(org.eclipse.smarthome.core.library.items.PlayerItemTest)  Time elapsed: 0 sec
Running org.eclipse.smarthome.core.library.items.ContactItemTest
Tests run: 3, Failures: 0, Errors: 0, Skipped: 0, Time elapsed: 0.002 sec - in org.eclipse.smarthome.core.library.items.ContactItemTest
testAcceptedStates(org.eclipse.smarthome.core.library.items.ContactItemTest)  Time elapsed: 0.001 sec
testUndefType(org.eclipse.smarthome.core.library.items.ContactItemTest)  Time elapsed: 0 sec
testOpenCloseType(org.eclipse.smarthome.core.library.items.ContactItemTest)  Time elapsed: 0 sec
Running org.eclipse.smarthome.core.library.items.ImageItemTest
Tests run: 3, Failures: 0, Errors: 0, Skipped: 0, Time elapsed: 0.001 sec - in org.eclipse.smarthome.core.library.items.ImageItemTest
testAcceptedStates(org.eclipse.smarthome.core.library.items.ImageItemTest)  Time elapsed: 0.001 sec
testUndefType(org.eclipse.smarthome.core.library.items.ImageItemTest)  Time elapsed: 0 sec
testRawType(org.eclipse.smarthome.core.library.items.ImageItemTest)  Time elapsed: 0 sec
Running org.eclipse.smarthome.core.library.items.DateTimeItemTest
Tests run: 3, Failures: 0, Errors: 0, Skipped: 0, Time elapsed: 0.002 sec - in org.eclipse.smarthome.core.library.items.DateTimeItemTest
testAcceptedStates(org.eclipse.smarthome.core.library.items.DateTimeItemTest)  Time elapsed: 0.001 sec
testUndefType(org.eclipse.smarthome.core.library.items.DateTimeItemTest)  Time elapsed: 0 sec
testDateTimeType(org.eclipse.smarthome.core.library.items.DateTimeItemTest)  Time elapsed: 0 sec
Running org.eclipse.smarthome.core.library.items.StringItemTest
Tests run: 4, Failures: 0, Errors: 0, Skipped: 0, Time elapsed: 0.003 sec - in org.eclipse.smarthome.core.library.items.StringItemTest
testAcceptedStates(org.eclipse.smarthome.core.library.items.StringItemTest)  Time elapsed: 0.002 sec
setStringType(org.eclipse.smarthome.core.library.items.StringItemTest)  Time elapsed: 0 sec
setDateTimeTypeType(org.eclipse.smarthome.core.library.items.StringItemTest)  Time elapsed: 0 sec
testUndefType(org.eclipse.smarthome.core.library.items.StringItemTest)  Time elapsed: 0 sec
Running org.eclipse.smarthome.core.library.items.CallItemTest
Tests run: 3, Failures: 0, Errors: 0, Skipped: 0, Time elapsed: 0.003 sec - in org.eclipse.smarthome.core.library.items.CallItemTest
testAcceptedStates(org.eclipse.smarthome.core.library.items.CallItemTest)  Time elapsed: 0.001 sec
testSetStringListType(org.eclipse.smarthome.core.library.items.CallItemTest)  Time elapsed: 0.001 sec
testSetUndefType(org.eclipse.smarthome.core.library.items.CallItemTest)  Time elapsed: 0 sec
Running org.eclipse.smarthome.core.library.CoreItemFactoryTest
Tests run: 3, Failures: 0, Errors: 0, Skipped: 0, Time elapsed: 0.002 sec - in org.eclipse.smarthome.core.library.CoreItemFactoryTest
createNumberItemWithDimension(org.eclipse.smarthome.core.library.CoreItemFactoryTest)  Time elapsed: 0 sec
shouldReturnNullForUnsupportedItemTypeName(org.eclipse.smarthome.core.library.CoreItemFactoryTest)  Time elapsed: 0 sec
shouldCreateItems(org.eclipse.smarthome.core.library.CoreItemFactoryTest)  Time elapsed: 0 sec
Running org.eclipse.smarthome.core.types.VolumetricFlowRateTest
Tests run: 10, Failures: 0, Errors: 0, Skipped: 0, Time elapsed: 0.004 sec - in org.eclipse.smarthome.core.types.VolumetricFlowRateTest
testSymbolLookup[0](org.eclipse.smarthome.core.types.VolumetricFlowRateTest)  Time elapsed: 0 sec
testValueConversionToM3s[0](org.eclipse.smarthome.core.types.VolumetricFlowRateTest)  Time elapsed: 0.001 sec
testSymbolLookup[1](org.eclipse.smarthome.core.types.VolumetricFlowRateTest)  Time elapsed: 0 sec
testValueConversionToM3s[1](org.eclipse.smarthome.core.types.VolumetricFlowRateTest)  Time elapsed: 0 sec
testSymbolLookup[2](org.eclipse.smarthome.core.types.VolumetricFlowRateTest)  Time elapsed: 0 sec
testValueConversionToM3s[2](org.eclipse.smarthome.core.types.VolumetricFlowRateTest)  Time elapsed: 0 sec
testSymbolLookup[3](org.eclipse.smarthome.core.types.VolumetricFlowRateTest)  Time elapsed: 0 sec
testValueConversionToM3s[3](org.eclipse.smarthome.core.types.VolumetricFlowRateTest)  Time elapsed: 0 sec
testSymbolLookup[4](org.eclipse.smarthome.core.types.VolumetricFlowRateTest)  Time elapsed: 0 sec
testValueConversionToM3s[4](org.eclipse.smarthome.core.types.VolumetricFlowRateTest)  Time elapsed: 0 sec
Running org.eclipse.smarthome.core.types.util.UnitUtilsTest
Tests run: 7, Failures: 0, Errors: 0, Skipped: 0, Time elapsed: 0.018 sec - in org.eclipse.smarthome.core.types.util.UnitUtilsTest
testParsePureUnit(org.eclipse.smarthome.core.types.util.UnitUtilsTest)  Time elapsed: 0.001 sec
forBaseUnitsOfSameSystem_ShouldBeFalse(org.eclipse.smarthome.core.types.util.UnitUtilsTest)  Time elapsed: 0 sec
forDerivedUnitsOfDifferentSystems_shouldBeTrue(org.eclipse.smarthome.core.types.util.UnitUtilsTest)  Time elapsed: 0 sec
shouldParseUnitFromPattern(org.eclipse.smarthome.core.types.util.UnitUtilsTest)  Time elapsed: 0 sec
whenValidDimensionIsGiven_shouldCreateQuantityClass(org.eclipse.smarthome.core.types.util.UnitUtilsTest)  Time elapsed: 0.001 sec
testGetDimensionName(org.eclipse.smarthome.core.types.util.UnitUtilsTest)  Time elapsed: 0.015 sec
forBaseUnitsOfDifferentSystems_shouldBeTrue(org.eclipse.smarthome.core.types.util.UnitUtilsTest)  Time elapsed: 0 sec
Running org.eclipse.smarthome.core.types.StateDescriptionFragmentBuilderTest
Tests run: 8, Failures: 0, Errors: 0, Skipped: 0, Time elapsed: 0.002 sec - in org.eclipse.smarthome.core.types.StateDescriptionFragmentBuilderTest
builderWithIOptions(org.eclipse.smarthome.core.types.StateDescriptionFragmentBuilderTest)  Time elapsed: 0 sec
builderWithReadOnly(org.eclipse.smarthome.core.types.StateDescriptionFragmentBuilderTest)  Time elapsed: 0 sec
builderWithPattern(org.eclipse.smarthome.core.types.StateDescriptionFragmentBuilderTest)  Time elapsed: 0.001 sec
subsequentBuildsCreateIndependentFragments(org.eclipse.smarthome.core.types.StateDescriptionFragmentBuilderTest)  Time elapsed: 0 sec
builderWithStep(org.eclipse.smarthome.core.types.StateDescriptionFragmentBuilderTest)  Time elapsed: 0 sec
builderWithMaximum(org.eclipse.smarthome.core.types.StateDescriptionFragmentBuilderTest)  Time elapsed: 0 sec
builderWithMinimum(org.eclipse.smarthome.core.types.StateDescriptionFragmentBuilderTest)  Time elapsed: 0 sec
builderWithStateDescription(org.eclipse.smarthome.core.types.StateDescriptionFragmentBuilderTest)  Time elapsed: 0 sec
Running org.eclipse.smarthome.core.types.SmartHomeUnitsTest
Tests run: 34, Failures: 0, Errors: 0, Skipped: 0, Time elapsed: 0.015 sec - in org.eclipse.smarthome.core.types.SmartHomeUnitsTest
test_fahrenheit_UnitSymbol(org.eclipse.smarthome.core.types.SmartHomeUnitsTest)  Time elapsed: 0 sec
testPpm(org.eclipse.smarthome.core.types.SmartHomeUnitsTest)  Time elapsed: 0.001 sec
testBar2Pascal(org.eclipse.smarthome.core.types.SmartHomeUnitsTest)  Time elapsed: 0 sec
testCm2In(org.eclipse.smarthome.core.types.SmartHomeUnitsTest)  Time elapsed: 0.004 sec
testPascal2mmHgConversion(org.eclipse.smarthome.core.types.SmartHomeUnitsTest)  Time elapsed: 0 sec
testM2Ft(org.eclipse.smarthome.core.types.SmartHomeUnitsTest)  Time elapsed: 0 sec
testM2Ml(org.eclipse.smarthome.core.types.SmartHomeUnitsTest)  Time elapsed: 0 sec
testM2Yd(org.eclipse.smarthome.core.types.SmartHomeUnitsTest)  Time elapsed: 0 sec
testMicrowattPerSquareCentimetre2KilogramPerSquareCentiMetre(org.eclipse.smarthome.core.types.SmartHomeUnitsTest)  Time elapsed: 0 sec
testKmh2Mih(org.eclipse.smarthome.core.types.SmartHomeUnitsTest)  Time elapsed: 0.001 sec
testDb(org.eclipse.smarthome.core.types.SmartHomeUnitsTest)  Time elapsed: 0 sec
testKmh2Knot(org.eclipse.smarthome.core.types.SmartHomeUnitsTest)  Time elapsed: 0 sec
testKelvin2Fahrenheit(org.eclipse.smarthome.core.types.SmartHomeUnitsTest)  Time elapsed: 0 sec
testHectoPascal2Pascal(org.eclipse.smarthome.core.types.SmartHomeUnitsTest)  Time elapsed: 0 sec
testinHg2PascalConversion(org.eclipse.smarthome.core.types.SmartHomeUnitsTest)  Time elapsed: 0 sec
testMicrogramPerCubicMeter2KilogramPerCubicMeter(org.eclipse.smarthome.core.types.SmartHomeUnitsTest)  Time elapsed: 0.001 sec
testMicrowattPerSquareCentimetreFromString(org.eclipse.smarthome.core.types.SmartHomeUnitsTest)  Time elapsed: 0 sec
testMicrowattPerSquareCentimetreUnitSymbol(org.eclipse.smarthome.core.types.SmartHomeUnitsTest)  Time elapsed: 0 sec
test_inHg_UnitSymbol(org.eclipse.smarthome.core.types.SmartHomeUnitsTest)  Time elapsed: 0 sec
test_hPa_UnitSymbol(org.eclipse.smarthome.core.types.SmartHomeUnitsTest)  Time elapsed: 0 sec
testDobsonUnits(org.eclipse.smarthome.core.types.SmartHomeUnitsTest)  Time elapsed: 0.001 sec
testKnot2Kmh(org.eclipse.smarthome.core.types.SmartHomeUnitsTest)  Time elapsed: 0 sec
testPascal2inHgConversion(org.eclipse.smarthome.core.types.SmartHomeUnitsTest)  Time elapsed: 0 sec
test_inch_UnitSymbol(org.eclipse.smarthome.core.types.SmartHomeUnitsTest)  Time elapsed: 0 sec
testFahrenheit2Kelvin(org.eclipse.smarthome.core.types.SmartHomeUnitsTest)  Time elapsed: 0.001 sec
testKelvin2Fahrenheit2(org.eclipse.smarthome.core.types.SmartHomeUnitsTest)  Time elapsed: 0 sec
testMicrogramPerCubicMeterFromString(org.eclipse.smarthome.core.types.SmartHomeUnitsTest)  Time elapsed: 0.001 sec
testmmHg2PascalConversion(org.eclipse.smarthome.core.types.SmartHomeUnitsTest)  Time elapsed: 0 sec
testMicrogramPerCubicMeterUnitSymbol(org.eclipse.smarthome.core.types.SmartHomeUnitsTest)  Time elapsed: 0 sec
test_one_UnitSymbol(org.eclipse.smarthome.core.types.SmartHomeUnitsTest)  Time elapsed: 0 sec
testCelsiusSpecialChar(org.eclipse.smarthome.core.types.SmartHomeUnitsTest)  Time elapsed: 0.001 sec
test_knot_UnitSymbol(org.eclipse.smarthome.core.types.SmartHomeUnitsTest)  Time elapsed: 0 sec
test_mile_UnitSymbol(org.eclipse.smarthome.core.types.SmartHomeUnitsTest)  Time elapsed: 0 sec
test_mmHg_UnitSymbol(org.eclipse.smarthome.core.types.SmartHomeUnitsTest)  Time elapsed: 0 sec
Running org.eclipse.smarthome.core.items.GenericItemTest
Tests run: 9, Failures: 0, Errors: 0, Skipped: 0, Time elapsed: 0.053 sec - in org.eclipse.smarthome.core.items.GenericItemTest
testAddGroupNamesWithNull(org.eclipse.smarthome.core.items.GenericItemTest)  Time elapsed: 0.001 sec
testGetStateAsWithSameType(org.eclipse.smarthome.core.items.GenericItemTest)  Time elapsed: 0 sec
testRemoveGroupNameWithNull(org.eclipse.smarthome.core.items.GenericItemTest)  Time elapsed: 0 sec
testGetStateAsWithNonConvertible(org.eclipse.smarthome.core.items.GenericItemTest)  Time elapsed: 0 sec
testGetStateAsWithDifferentType(org.eclipse.smarthome.core.items.GenericItemTest)  Time elapsed: 0 sec
testAddGroupNameWithNull(org.eclipse.smarthome.core.items.GenericItemTest)  Time elapsed: 0 sec
testGetStateAsWithNull(org.eclipse.smarthome.core.items.GenericItemTest)  Time elapsed: 0 sec
testItemPostsEventsCorrectly(org.eclipse.smarthome.core.items.GenericItemTest)  Time elapsed: 0.019 sec
testDispose(org.eclipse.smarthome.core.items.GenericItemTest)  Time elapsed: 0.031 sec
Running org.eclipse.smarthome.core.items.events.AbstractItemEventSubscriberOSGiTest
Tests run: 2, Failures: 0, Errors: 0, Skipped: 0, Time elapsed: 0.155 sec - in org.eclipse.smarthome.core.items.events.AbstractItemEventSubscriberOSGiTest
testReceive(org.eclipse.smarthome.core.items.events.AbstractItemEventSubscriberOSGiTest)  Time elapsed: 0.046 sec
testReceiveUnsupportedEvent(org.eclipse.smarthome.core.items.events.AbstractItemEventSubscriberOSGiTest)  Time elapsed: 0.106 sec
Running org.eclipse.smarthome.core.items.GroupItemTest
Tests run: 23, Failures: 0, Errors: 0, Skipped: 1, Time elapsed: 2.223 sec - in org.eclipse.smarthome.core.items.GroupItemTest
assertThatGroupItemChangesRespectGroupFunctionOR(org.eclipse.smarthome.core.items.GroupItemTest)  Time elapsed: 0.009 sec
testGetAllMembersWithCircleDependency(org.eclipse.smarthome.core.items.GroupItemTest)  Time elapsed: 0.004 sec
assertThatGroupItemWithoutFunctionCanHaveAconvertibleState(org.eclipse.smarthome.core.items.GroupItemTest)  Time elapsed: 0.006 sec
assertAcceptedCommandTypesOnGroupItemsReturnsSubsetOfCommandTypesSupportedByAllMembers(org.eclipse.smarthome.core.items.GroupItemTest)  Time elapsed: 0.007 sec
testGetMembersFilteringGroups(org.eclipse.smarthome.core.items.GroupItemTest)  Time elapsed: 0.005 sec
assertThatGroupItemwithDimmeritemAcceptsGetsPercentTypeStateIfMembersHavePercentTypeStates(org.eclipse.smarthome.core.items.GroupItemTest)  Time elapsed: 0.107 sec
testGetAllMembers(org.eclipse.smarthome.core.items.GroupItemTest)  Time elapsed: 0.003 sec
testGetMembersFilteringGroupsTransient(org.eclipse.smarthome.core.items.GroupItemTest)  Time elapsed: 0.003 sec
testDisposeUnregistersAsListenerFromMembers(org.eclipse.smarthome.core.items.GroupItemTest)  Time elapsed: 0.006 sec
assertThatGroupItemChangesRespectGroupFunctionAND(org.eclipse.smarthome.core.items.GroupItemTest)  Time elapsed: 0.006 sec
assertThatGroupItemChangesDoNotAffectTheGroupStatusIfnoFunctionOrBaseItemAreDefined(org.eclipse.smarthome.core.items.GroupItemTest)  Time elapsed: 1.005 sec
assertThatGroupItemChangesRespectGroupFunctionORwithUNDEF(org.eclipse.smarthome.core.items.GroupItemTest)  Time elapsed: 1.005 sec
assertThatGroupItemWithDimmeritemBaseItemConversionWorks(org.eclipse.smarthome.core.items.GroupItemTest)  Time elapsed: 0.003 sec
assertThatGroupItemWithColoritemBaseItemConversionWorks(org.eclipse.smarthome.core.items.GroupItemTest)  Time elapsed: 0.008 sec
assertCyclicGroupItemsCalculateState(org.eclipse.smarthome.core.items.GroupItemTest)  Time elapsed: 0.004 sec
assertThatGroupItemPostsEventsForChangesCorrectly(org.eclipse.smarthome.core.items.GroupItemTest)  Time elapsed: 0.005 sec
assertThatNumberGroupItemWithDimensionCalculatesCorrectState(org.eclipse.smarthome.core.items.GroupItemTest)  Time elapsed: 0.006 sec
assertThatGroupItemWithRollershutterBaseItemConversionWorks(org.eclipse.smarthome.core.items.GroupItemTest)  Time elapsed: 0.004 sec
assertThatNumberGroupItemWithDifferentDimensionsCalculatesCorrectState(org.eclipse.smarthome.core.items.GroupItemTest)  Time elapsed: 0.007 sec
testGetStateAs_shouldEqualStateUpdate(org.eclipse.smarthome.core.items.GroupItemTest)  Time elapsed: 0.005 sec
testGetAllMembersWithFilter(org.eclipse.smarthome.core.items.GroupItemTest)  Time elapsed: 0.005 sec
testItemUpdateWithItemRegistry(org.eclipse.smarthome.core.items.GroupItemTest) skipped
assertCyclicGroupItemsCalculateStateWithSubGroupFunction(org.eclipse.smarthome.core.items.GroupItemTest)  Time elapsed: 0.003 sec
Running org.eclipse.smarthome.core.items.ItemRegistryImplTest
Tests run: 19, Failures: 0, Errors: 0, Skipped: 0, Time elapsed: 0.218 sec - in org.eclipse.smarthome.core.items.ItemRegistryImplTest
testItemUpdatedEvent(org.eclipse.smarthome.core.items.ItemRegistryImplTest)  Time elapsed: 0.012 sec
testItemRemovedEvent(org.eclipse.smarthome.core.items.ItemRegistryImplTest)  Time elapsed: 0.004 sec
assertItemIsBeingDisposedOnRemove(org.eclipse.smarthome.core.items.ItemRegistryImplTest)  Time elapsed: 0.142 sec
assertGetItemsOfTypeReturnsItemFromRegisteredItemProvider(org.eclipse.smarthome.core.items.ItemRegistryImplTest)  Time elapsed: 0.002 sec
assertGetItemsByTagWithTwoTagsReturnsItemFromRegisteredItemProvider(org.eclipse.smarthome.core.items.ItemRegistryImplTest)  Time elapsed: 0.002 sec
assertGetItemsByTagCanFilterByClassAndTag(org.eclipse.smarthome.core.items.ItemRegistryImplTest)  Time elapsed: 0.002 sec
assertOldItemIsBeingDisposedOnUpdate(org.eclipse.smarthome.core.items.ItemRegistryImplTest)  Time elapsed: 0.003 sec
assertGetItemsByTagAndTypeReturnsItemFromRegistereItemProvider(org.eclipse.smarthome.core.items.ItemRegistryImplTest)  Time elapsed: 0.002 sec
assertGetItemsByTagInUppercaseReturnsItemFromRegisteredItemProvider(org.eclipse.smarthome.core.items.ItemRegistryImplTest)  Time elapsed: 0.002 sec
testItemAddedEvent(org.eclipse.smarthome.core.items.ItemRegistryImplTest)  Time elapsed: 0.002 sec
testGroupUpdateWithModificationOfLiveInstance(org.eclipse.smarthome.core.items.ItemRegistryImplTest)  Time elapsed: 0.006 sec
assertThatAChangedItemStillHasAnEventPublisher(org.eclipse.smarthome.core.items.ItemRegistryImplTest)  Time elapsed: 0.003 sec
assertGetItemsByTagReturnsNoItemFromRegisteredItemProvider(org.eclipse.smarthome.core.items.ItemRegistryImplTest)  Time elapsed: 0.001 sec
assertItemRegistrySetsAndRemovesMembersOfGroupItems(org.eclipse.smarthome.core.items.ItemRegistryImplTest)  Time elapsed: 0.004 sec
assertGetItemsReturnsItemFromRegisteredItemProvider(org.eclipse.smarthome.core.items.ItemRegistryImplTest)  Time elapsed: 0.001 sec
assertGetItemsByTagCanFilterByClassAndTagWithGenericItem(org.eclipse.smarthome.core.items.ItemRegistryImplTest)  Time elapsed: 0.001 sec
assertGetItemsByTagReturnsItemFromRegisteredItemProvider(org.eclipse.smarthome.core.items.ItemRegistryImplTest)  Time elapsed: 0.002 sec
assertItemRegistryIsThreadSafe(org.eclipse.smarthome.core.items.ItemRegistryImplTest)  Time elapsed: 0.003 sec
assertItemRegistryChangeListenersAreInformedAboutItemChanges(org.eclipse.smarthome.core.items.ItemRegistryImplTest)  Time elapsed: 0.02 sec
Running org.eclipse.smarthome.core.items.ManagedItemProviderOSGiTest
Tests run: 10, Failures: 0, Errors: 0, Skipped: 0, Time elapsed: 0.037 sec - in org.eclipse.smarthome.core.items.ManagedItemProviderOSGiTest
assertItemsAreThereOnceTheFactoryGetsAdded(org.eclipse.smarthome.core.items.ManagedItemProviderOSGiTest)  Time elapsed: 0.007 sec
updatingExistingItemReturnsOldValue(org.eclipse.smarthome.core.items.ManagedItemProviderOSGiTest)  Time elapsed: 0.004 sec
assertTagsAreStoredAndRetrievedAsWell(org.eclipse.smarthome.core.items.ManagedItemProviderOSGiTest)  Time elapsed: 0.003 sec
assertRemoveRecursivelyWorks(org.eclipse.smarthome.core.items.ManagedItemProviderOSGiTest)  Time elapsed: 0.004 sec
assertItemsAreAddedAsGroupMembersOnDeferredCreation(org.eclipse.smarthome.core.items.ManagedItemProviderOSGiTest)  Time elapsed: 0.003 sec
assertGetItemsReturnsItemFromRegisteredManagedItemProvider(org.eclipse.smarthome.core.items.ManagedItemProviderOSGiTest)  Time elapsed: 0.003 sec
assertTwoItemsWithSameNameCanNotBeAdded(org.eclipse.smarthome.core.items.ManagedItemProviderOSGiTest)  Time elapsed: 0.002 sec
assertFunctionsAreStoredAndRetrievedAsWell(org.eclipse.smarthome.core.items.ManagedItemProviderOSGiTest)  Time elapsed: 0.003 sec
assertGroupFunctionsAreStoredAndRetrievedAsWell(org.eclipse.smarthome.core.items.ManagedItemProviderOSGiTest)  Time elapsed: 0.005 sec
assertRemovalReturnsOldValue(org.eclipse.smarthome.core.items.ManagedItemProviderOSGiTest)  Time elapsed: 0.002 sec
Running org.eclipse.smarthome.core.items.dto.ItemDTOMapperTest
Tests run: 1, Failures: 0, Errors: 0, Skipped: 0, Time elapsed: 0.002 sec - in org.eclipse.smarthome.core.items.dto.ItemDTOMapperTest
testMapFunctionWithNumberItemAndCountFunction(org.eclipse.smarthome.core.items.dto.ItemDTOMapperTest)  Time elapsed: 0.002 sec
Running org.eclipse.smarthome.core.items.MetadataKeyTest
Tests run: 2, Failures: 0, Errors: 0, Skipped: 0, Time elapsed: 0.001 sec - in org.eclipse.smarthome.core.items.MetadataKeyTest
testGetNamespace(org.eclipse.smarthome.core.items.MetadataKeyTest)  Time elapsed: 0 sec
testGetItemName(org.eclipse.smarthome.core.items.MetadataKeyTest)  Time elapsed: 0 sec
Running org.eclipse.smarthome.core.common.ThreadFactoryBuilderTest
Tests run: 12, Failures: 0, Errors: 0, Skipped: 0, Time elapsed: 0.007 sec - in org.eclipse.smarthome.core.common.ThreadFactoryBuilderTest
testWithPriority(org.eclipse.smarthome.core.common.ThreadFactoryBuilderTest)  Time elapsed: 0.001 sec
testWithNamePrefixAndWithName(org.eclipse.smarthome.core.common.ThreadFactoryBuilderTest)  Time elapsed: 0.001 sec
testWithDefaultNamePrefix(org.eclipse.smarthome.core.common.ThreadFactoryBuilderTest)  Time elapsed: 0 sec
testWithPriorityValidationTooHigh(org.eclipse.smarthome.core.common.ThreadFactoryBuilderTest)  Time elapsed: 0 sec
testWithoutNamePrefixWithName(org.eclipse.smarthome.core.common.ThreadFactoryBuilderTest)  Time elapsed: 0 sec
testWithDaemonThreads(org.eclipse.smarthome.core.common.ThreadFactoryBuilderTest)  Time elapsed: 0 sec
testWithWrappedThreadFactory(org.eclipse.smarthome.core.common.ThreadFactoryBuilderTest)  Time elapsed: 0.001 sec
testWithNamePrefixWithoutName(org.eclipse.smarthome.core.common.ThreadFactoryBuilderTest)  Time elapsed: 0.001 sec
testWithUncaughtExceptionHandler(org.eclipse.smarthome.core.common.ThreadFactoryBuilderTest)  Time elapsed: 0.001 sec
testWithoutNamePrefixWithoutName(org.eclipse.smarthome.core.common.ThreadFactoryBuilderTest)  Time elapsed: 0 sec
testWithPriorityValidationTooLow(org.eclipse.smarthome.core.common.ThreadFactoryBuilderTest)  Time elapsed: 0 sec
testDefaults(org.eclipse.smarthome.core.common.ThreadFactoryBuilderTest)  Time elapsed: 0 sec
Running org.eclipse.smarthome.core.common.ThreadPoolManagerTest
Tests run: 6, Failures: 0, Errors: 0, Skipped: 0, Time elapsed: 0.001 sec - in org.eclipse.smarthome.core.common.ThreadPoolManagerTest
testGetConfiguredCachedPool(org.eclipse.smarthome.core.common.ThreadPoolManagerTest)  Time elapsed: 0 sec
testGetScheduledPool(org.eclipse.smarthome.core.common.ThreadPoolManagerTest)  Time elapsed: 0.001 sec
testReconfiguringScheduledPool(org.eclipse.smarthome.core.common.ThreadPoolManagerTest)  Time elapsed: 0 sec
testGetConfiguredScheduledPool(org.eclipse.smarthome.core.common.ThreadPoolManagerTest)  Time elapsed: 0 sec
testReconfiguringCachedPool(org.eclipse.smarthome.core.common.ThreadPoolManagerTest)  Time elapsed: 0 sec
testGetCachedPool(org.eclipse.smarthome.core.common.ThreadPoolManagerTest)  Time elapsed: 0 sec
Running org.eclipse.smarthome.core.common.QueueingThreadPoolExecutorTest
Tests run: 8, Failures: 0, Errors: 0, Skipped: 0, Time elapsed: 0.002 sec - in org.eclipse.smarthome.core.common.QueueingThreadPoolExecutorTest
testSetInvalidRejectionHandler(org.eclipse.smarthome.core.common.QueueingThreadPoolExecutorTest)  Time elapsed: 0 sec
testPoolWithBlankPoolName(org.eclipse.smarthome.core.common.QueueingThreadPoolExecutorTest)  Time elapsed: 0 sec
testCreateInstanceInvalidArgsPoolSizeMinus1(org.eclipse.smarthome.core.common.QueueingThreadPoolExecutorTest)  Time elapsed: 0 sec
testCreateInstanceInvalidArgsPoolSize0(org.eclipse.smarthome.core.common.QueueingThreadPoolExecutorTest)  Time elapsed: 0 sec
testQueuingTPEPoolSize2(org.eclipse.smarthome.core.common.QueueingThreadPoolExecutorTest)  Time elapsed: 0.001 sec
testCreateInstance(org.eclipse.smarthome.core.common.QueueingThreadPoolExecutorTest)  Time elapsed: 0 sec
testPoolWithEmptyPoolName(org.eclipse.smarthome.core.common.QueueingThreadPoolExecutorTest)  Time elapsed: 0 sec
testCreateInstanceInvalidArgsPoolNameNull(org.eclipse.smarthome.core.common.QueueingThreadPoolExecutorTest)  Time elapsed: 0 sec
Running org.eclipse.smarthome.core.common.osgi.ResourceBundleClassLoaderTest
Tests run: 1, Failures: 0, Errors: 0, Skipped: 0, Time elapsed: 0.009 sec - in org.eclipse.smarthome.core.common.osgi.ResourceBundleClassLoaderTest
testName(org.eclipse.smarthome.core.common.osgi.ResourceBundleClassLoaderTest)  Time elapsed: 0.009 sec
Running org.eclipse.smarthome.core.util.HexUtilsTest
Tests run: 6, Failures: 0, Errors: 0, Skipped: 0, Time elapsed: 0.007 sec - in org.eclipse.smarthome.core.util.HexUtilsTest
test_hexToBytes_noParams(org.eclipse.smarthome.core.util.HexUtilsTest)  Time elapsed: 0.004 sec
test_hexToBytes_withMultiCharDelimiter(org.eclipse.smarthome.core.util.HexUtilsTest)  Time elapsed: 0 sec
test_bytesToHex_noParams(org.eclipse.smarthome.core.util.HexUtilsTest)  Time elapsed: 0.001 sec
test_bytesToHex_withMultiCharDelimiter(org.eclipse.smarthome.core.util.HexUtilsTest)  Time elapsed: 0 sec
test_bytesToHex_withDelimiter(org.eclipse.smarthome.core.util.HexUtilsTest)  Time elapsed: 0.001 sec
test_hexToBytes_withDelimiter(org.eclipse.smarthome.core.util.HexUtilsTest)  Time elapsed: 0 sec
Running org.eclipse.smarthome.core.events.ItemEventFactoryTest
Tests run: 11, Failures: 0, Errors: 0, Skipped: 0, Time elapsed: 0.007 sec - in org.eclipse.smarthome.core.events.ItemEventFactoryTest
testCreateEvent_ItemAddedEvent(org.eclipse.smarthome.core.events.ItemEventFactoryTest)  Time elapsed: 0 sec
testCreateEvent_ItemCommandEvent_RefreshType(org.eclipse.smarthome.core.events.ItemEventFactoryTest)  Time elapsed: 0.001 sec
testCreateEvent_ItemStateEvent_OnOffType(org.eclipse.smarthome.core.events.ItemEventFactoryTest)  Time elapsed: 0 sec
testCreateAddedEvent(org.eclipse.smarthome.core.events.ItemEventFactoryTest)  Time elapsed: 0 sec
testCreateEvent_ItemStateEvent_UnDefType(org.eclipse.smarthome.core.events.ItemEventFactoryTest)  Time elapsed: 0 sec
testCreateEvent_GroupItemStateChangedEvent(org.eclipse.smarthome.core.events.ItemEventFactoryTest)  Time elapsed: 0.001 sec
testCreateEvent_ItemStatePredictedEvent_OnOffType(org.eclipse.smarthome.core.events.ItemEventFactoryTest)  Time elapsed: 0.002 sec
testCreateEvent_ItemCommandEvent_OnOffType(org.eclipse.smarthome.core.events.ItemEventFactoryTest)  Time elapsed: 0 sec
testCreateGroupStateChangedEvent_RawType(org.eclipse.smarthome.core.events.ItemEventFactoryTest)  Time elapsed: 0 sec
testCreateStateEvent_OnOffType(org.eclipse.smarthome.core.events.ItemEventFactoryTest)  Time elapsed: 0 sec
testCreateCommandEvent_OnOffType(org.eclipse.smarthome.core.events.ItemEventFactoryTest)  Time elapsed: 0 sec
Running org.eclipse.smarthome.core.events.AbstractEventFactoryTest
Tests run: 2, Failures: 0, Errors: 0, Skipped: 0, Time elapsed: 0.001 sec - in org.eclipse.smarthome.core.events.AbstractEventFactoryTest
testArgumentValidation(org.eclipse.smarthome.core.events.AbstractEventFactoryTest)  Time elapsed: 0 sec
testExceptionForNotSupportedEventTypes(org.eclipse.smarthome.core.events.AbstractEventFactoryTest)  Time elapsed: 0 sec
Running org.eclipse.smarthome.core.net.HttpServiceUtilTest
Tests run: 5, Failures: 0, Errors: 0, Skipped: 0, Time elapsed: 0.017 sec - in org.eclipse.smarthome.core.net.HttpServiceUtilTest
shouldReturnHttpServicePortFromSystemProperty(org.eclipse.smarthome.core.net.HttpServiceUtilTest)  Time elapsed: 0.01 sec
shouldReturnHttpServicePortSecureFromSystemProperty(org.eclipse.smarthome.core.net.HttpServiceUtilTest)  Time elapsed: 0.001 sec
shouldReturnHttpServicePortFromServiceReference(org.eclipse.smarthome.core.net.HttpServiceUtilTest)  Time elapsed: 0.002 sec
shouldReturnHttpServicePortSecureFromServiceReference(org.eclipse.smarthome.core.net.HttpServiceUtilTest)  Time elapsed: 0.001 sec
shouldReturnUndefinedForException(org.eclipse.smarthome.core.net.HttpServiceUtilTest)  Time elapsed: 0.002 sec
Running org.eclipse.smarthome.core.net.NetUtilTest
Tests run: 2, Failures: 0, Errors: 0, Skipped: 0, Time elapsed: 0.009 sec - in org.eclipse.smarthome.core.net.NetUtilTest
testNetwork(org.eclipse.smarthome.core.net.NetUtilTest)  Time elapsed: 0.007 sec
testBroadcastAddress(org.eclipse.smarthome.core.net.NetUtilTest)  Time elapsed: 0.001 sec
Running org.eclipse.smarthome.core.service.StateDescriptionServiceImplTest
Tests run: 8, Failures: 0, Errors: 0, Skipped: 0, Time elapsed: 0.043 sec - in org.eclipse.smarthome.core.service.StateDescriptionServiceImplTest
testFragmentProviderOrder(org.eclipse.smarthome.core.service.StateDescriptionServiceImplTest)  Time elapsed: 0.02 sec
legacy_testServiceWithOneStateDescriptionProvider(org.eclipse.smarthome.core.service.StateDescriptionServiceImplTest)  Time elapsed: 0.017 sec
testLegacyProviderMergedBeforeFragmentProvider(org.eclipse.smarthome.core.service.StateDescriptionServiceImplTest)  Time elapsed: 0.001 sec
legacy_testMinValueMaxValueStepAndPatternTwoDescriptionProviders(org.eclipse.smarthome.core.service.StateDescriptionServiceImplTest)  Time elapsed: 0.001 sec
legacy_testOptionsWhenTwoDescriptionProvidersHigherRankingProvidesOptions(org.eclipse.smarthome.core.service.StateDescriptionServiceImplTest)  Time elapsed: 0 sec
legacy_testIsReadOnlyWhenTwoDescriptionProvidersHigherRankingIsReadOnly(org.eclipse.smarthome.core.service.StateDescriptionServiceImplTest)  Time elapsed: 0 sec
legacy_testIsReadOnlyWhenTwoDescriptionProvidersHigherRankingIsNotReadOnly(org.eclipse.smarthome.core.service.StateDescriptionServiceImplTest)  Time elapsed: 0.001 sec
legacy_testOptionsWhenTwoDescriptionProvidersHigherRankingDoesntProvideOptions(org.eclipse.smarthome.core.service.StateDescriptionServiceImplTest)  Time elapsed: 0.001 sec
Running org.eclipse.smarthome.core.service.AbstractWatchServiceTest
Tests run: 6, Failures: 0, Errors: 0, Skipped: 0, Time elapsed: 23.023 sec - in org.eclipse.smarthome.core.service.AbstractWatchServiceTest
test_inSubSub(org.eclipse.smarthome.core.service.AbstractWatchServiceTest)  Time elapsed: 4.69 sec
test_excludeSubdirs(org.eclipse.smarthome.core.service.AbstractWatchServiceTest)  Time elapsed: 3.002 sec
test_identicalNames(org.eclipse.smarthome.core.service.AbstractWatchServiceTest)  Time elapsed: 3.052 sec
test_inRoot(org.eclipse.smarthome.core.service.AbstractWatchServiceTest)  Time elapsed: 4.607 sec
test_includeSubdirs(org.eclipse.smarthome.core.service.AbstractWatchServiceTest)  Time elapsed: 3.052 sec
test_inSub(org.eclipse.smarthome.core.service.AbstractWatchServiceTest)  Time elapsed: 4.616 sec
Running org.eclipse.smarthome.core.auth.client.oauth2.AccessTokenResponseTest
Tests run: 4, Failures: 0, Errors: 0, Skipped: 0, Time elapsed: 0.006 sec - in org.eclipse.smarthome.core.auth.client.oauth2.AccessTokenResponseTest
testTokenExpired(org.eclipse.smarthome.core.auth.client.oauth2.AccessTokenResponseTest)  Time elapsed: 0.004 sec
testTokenNotExpiredEvenWithBuffer(org.eclipse.smarthome.core.auth.client.oauth2.AccessTokenResponseTest)  Time elapsed: 0 sec
testTokenExpiredDueToBuffer(org.eclipse.smarthome.core.auth.client.oauth2.AccessTokenResponseTest)  Time elapsed: 0.001 sec
testTokenNotExpired(org.eclipse.smarthome.core.auth.client.oauth2.AccessTokenResponseTest)  Time elapsed: 0 sec

Results :

Tests in error: 
  SchedulerImplTest.testAfterResolvedWithException » TestTimedOut test timed out...

Tests run: 653, Failures: 0, Errors: 1, Skipped: 1

[INFO] ------------------------------------------------------------------------
[INFO] Reactor Summary:
[INFO] 
[INFO] Eclipse SmartHome 0.11.0-SNAPSHOT .................. SUCCESS [01:09 min]
[INFO] Eclipse SmartHome Bundles .......................... SUCCESS [ 18.693 s]
[INFO] Eclipse SmartHome Test Components .................. SUCCESS [  0.029 s]
[INFO] Eclipse SmartHome Core Components .................. SUCCESS [  0.022 s]
[INFO] Eclipse SmartHome Core ............................. SUCCESS [04:17 min]
[INFO] Eclipse SmartHome Configurations ................... SUCCESS [  0.051 s]
[INFO] Eclipse SmartHome Configuration Core ............... SUCCESS [ 21.240 s]
[INFO] Eclipse SmartHome Configuration XML ................ SUCCESS [ 11.882 s]
[INFO] Eclipse SmartHome Test ............................. SUCCESS [ 23.097 s]
[INFO] Eclipse SmartHome Automation ....................... SUCCESS [  0.036 s]
[INFO] Eclipse SmartHome Automation API ................... SUCCESS [  9.437 s]
[INFO] Eclipse SmartHome I/O Components ................... SUCCESS [  0.035 s]
[INFO] Eclipse SmartHome Console .......................... SUCCESS [  6.110 s]
[INFO] Eclipse SmartHome Thing ............................ SUCCESS [ 23.774 s]
[INFO] Eclipse SmartHome Configuration Discovery .......... SUCCESS [ 13.855 s]
[INFO] Eclipse SmartHome Network I/O ...................... SUCCESS [ 20.367 s]
[INFO] Eclipse SmartHome Magic Bundle ..................... SUCCESS [  9.819 s]
[INFO] Eclipse SmartHome Magic Bundle Tests ............... SUCCESS [ 13.951 s]
[INFO] Eclipse SmartHome Auth Components .................. SUCCESS [  0.028 s]
[INFO] Eclipse SmartHome JAAS Authentication .............. SUCCESS [  8.414 s]
[INFO] Eclipse SmartHome OAuth2Client ..................... SUCCESS [  8.969 s]
[INFO] Eclipse SmartHome OAuth2Client Tests ............... SUCCESS [ 17.778 s]
[INFO] Eclipse SmartHome Configuration Dispatcher ......... SUCCESS [ 10.345 s]
[INFO] Eclipse SmartHome Configuration Dispatcher Tests ... SUCCESS [ 31.383 s]
[INFO] Eclipse SmartHome Configuration Core Tests ......... SUCCESS [ 25.511 s]
[INFO] Eclipse SmartHome mDNS Service ..................... SUCCESS [ 18.982 s]
[INFO] Eclipse SmartHome Configuration mDNS Discovery ..... SUCCESS [  4.697 s]
[INFO] Eclipse SmartHome Core Thing XML ................... SUCCESS [  8.149 s]
[INFO] Eclipse SmartHome Configuration mDNS Discovery Tests SUCCESS [ 14.824 s]
[INFO] Eclipse SmartHome Configuration Discovery Tests .... SUCCESS [ 35.525 s]
[INFO] Eclipse SmartHome Configuration UPnP Discovery ..... SUCCESS [  5.763 s]
[INFO] Eclipse SmartHome Configuration USB-Serial Discovery SUCCESS [  6.198 s]
[INFO] Eclipse SmartHome Configuration Discovery UsbSerial Tests SUCCESS [ 28.210 s]
[INFO] Eclipse SmartHome Configuration USB-Serial Discovery for Linux using sysfs scanning SUCCESS [ 10.346 s]
[INFO] Eclipse SmartHome Serial Transport ................. SUCCESS [  6.070 s]
[INFO] Eclipse SmartHome Configuration Serial ............. SUCCESS [  8.387 s]
[INFO] Eclipse SmartHome Config XML Tests ................. SUCCESS [ 26.506 s]
[INFO] Eclipse SmartHome Configuration USB-Serial Discovery for Linux using sysfs scanning Tests SUCCESS [ 20.340 s]
[INFO] Eclipse SmartHome HTTP Interface ................... SUCCESS [ 11.671 s]
[INFO] Eclipse SmartHome Core Audio ....................... SUCCESS [ 11.078 s]
[INFO] Eclipse SmartHome Core Binding XML ................. SUCCESS [  6.784 s]
[INFO] Eclipse SmartHome Audio Test ....................... SUCCESS [ 15.748 s]
[INFO] Eclipse SmartHome Sample Extension Service ......... SUCCESS [  5.315 s]
[INFO] Eclipse SmartHome REST Interface ................... SUCCESS [  9.341 s]
[INFO] Eclipse SmartHome Core ID .......................... SUCCESS [  5.813 s]
[INFO] Eclipse SmartHome ID Tests ......................... SUCCESS [ 15.053 s]
[INFO] Eclipse SmartHome Core Tests ....................... FAILURE [01:06 min]
[INFO] Eclipse SmartHome Thing Tests ...................... SKIPPED
[INFO] Eclipse SmartHome Core Persistence ................. SKIPPED
[INFO] Eclipse SmartHome Core Scheduler Service ........... SKIPPED
[INFO] Eclipse SmartHome Core Semantics ................... SKIPPED
[INFO] Eclipse SmartHome Core Transformation Service ...... SKIPPED
[INFO] Eclipse SmartHome Core Transform Test .............. SKIPPED
[INFO] Eclipse SmartHome Core Binding XML Tests ........... SKIPPED
[INFO] Eclipse SmartHome Core Thing XML Tests ............. SKIPPED
[INFO] Eclipse SmartHome Core Voice ....................... SKIPPED
[INFO] Eclipse SmartHome Core Voice Test .................. SKIPPED
[INFO] Eclipse SmartHome Automation Commands .............. SKIPPED
[INFO] Eclipse SmartHome Automation Core .................. SKIPPED
[INFO] Eclipse SmartHome Automation Parser GSON ........... SKIPPED
[INFO] Eclipse SmartHome Automation Core Modules .......... SKIPPED
[INFO] Eclipse SmartHome Automation Providers ............. SKIPPED
[INFO] Eclipse SmartHome Automation Provider File ......... SKIPPED
[INFO] Eclipse SmartHome Automation Core Tests ............ SKIPPED
[INFO] Eclipse SmartHome Automation Sample JSON ........... SKIPPED
[INFO] Eclipse SmartHome Automation Core Module Tests ..... SKIPPED
[INFO] Eclipse SmartHome Automation Script Modules ........ SKIPPED
[INFO] Eclipse SmartHome Automation Media Modules ......... SKIPPED
[INFO] Eclipse SmartHome Automation Timer Modules ......... SKIPPED
[INFO] Eclipse SmartHome Automation Module Timer Tests .... SKIPPED
[INFO] Eclipse SmartHome Automation Script Default Scope .. SKIPPED
[INFO] Eclipse SmartHome Automation Script Module Defaultscope Tests SKIPPED
[INFO] Eclipse SmartHome Automation Script RuleSupport .... SKIPPED
[INFO] Eclipse SmartHome Automation Script Module Tests ... SKIPPED
[INFO] Eclipse SmartHome Automation Event Tests ........... SKIPPED
[INFO] Eclipse SmartHome Automation Integration Tests ..... SKIPPED
[INFO] Eclipse SmartHome Automation Sample Extension Java . SKIPPED
[INFO] Eclipse SmartHome Automation REST API .............. SKIPPED
[INFO] Eclipse SmartHome Automation Sample REST API ....... SKIPPED
[INFO] Eclipse SmartHome Automation Java Demo ............. SKIPPED
[INFO] Eclipse SmartHome Automation Json Demo ............. SKIPPED
[INFO] Eclipse SmartHome Automation Module Type Demo ...... SKIPPED
[INFO] Eclipse SmartHome Automation Thing Support ......... SKIPPED
[INFO] Eclipse SmartHome Console for OSGi framework Eclipse Equinox SKIPPED
[INFO] Eclipse SmartHome Console for OSGi Console RFC 147 . SKIPPED
[INFO] Eclipse SmartHome Console for OSGi runtime Karaf ... SKIPPED
[INFO] Eclipse SmartHome Monitor .......................... SKIPPED
[INFO] Eclipse SmartHome Network I/O Tests ................ SKIPPED
[INFO] Eclipse SmartHome HTTP Interface Authentication .... SKIPPED
[INFO] Eclipse SmartHome HTTP Interface Basic Authentication SKIPPED
[INFO] Eclipse SmartHome Network I/O HTTP Tests ........... SKIPPED
[INFO] Eclipse SmartHome IO REST Tests .................... SKIPPED
[INFO] Eclipse SmartHome Authentication Support for the REST Interface SKIPPED
[INFO] Eclipse SmartHome Core REST Interface .............. SKIPPED
[INFO] Eclipse SmartHome IO REST Core Tests ............... SKIPPED
[INFO] Eclipse SmartHome REST mDNS Announcer .............. SKIPPED
[INFO] Eclipse SmartHome REST JAX-RS Optimizations ........ SKIPPED
[INFO] Eclipse SmartHome SSE Interface .................... SKIPPED
[INFO] Eclipse SmartHome IO SSE Tests ..................... SKIPPED
[INFO] Eclipse SmartHome Models ........................... SKIPPED
[INFO] Eclipse SmartHome Model Core ....................... SKIPPED
[INFO] Eclipse SmartHome Model Lazy Generation ............ SKIPPED
[INFO] Eclipse SmartHome Model Sitemap .................... SKIPPED
[INFO] Eclipse SmartHome Model Items ...................... SKIPPED
[INFO] Eclipse SmartHome UIs .............................. SKIPPED
[INFO] Eclipse SmartHome UI ............................... SKIPPED
[INFO] Eclipse SmartHome Sitemap REST Interface ........... SKIPPED
[INFO] Eclipse SmartHome Sitemap REST Interface Tests ..... SKIPPED
[INFO] Eclipse SmartHome Core REST UI Logging Module ...... SKIPPED
[INFO] Eclipse SmartHome Voice REST Interface ............. SKIPPED
[INFO] Eclipse SmartHome DBus Transport ................... SKIPPED
[INFO] Eclipse SmartHome MQTT Transport ................... SKIPPED
[INFO] Eclipse SmartHome Mqtt Transport I/O Tests ......... SKIPPED
[INFO] Eclipse SmartHome Serial Transport for Java Communications API SKIPPED
[INFO] Eclipse SmartHome Serial Transport for RXTX ........ SKIPPED
[INFO] Eclipse SmartHome Serial Transport for RFC2217 ..... SKIPPED
[INFO] Eclipse SmartHome UPnP Transport ................... SKIPPED
[INFO] Eclipse SmartHome IO UPnP Tests .................... SKIPPED
[INFO] Eclipse SmartHome Model Core Tests ................. SKIPPED
[INFO] Eclipse SmartHome Model Item IDE ................... SKIPPED
[INFO] Eclipse SmartHome Model Items Runtime .............. SKIPPED
[INFO] Eclipse SmartHome Model Items Tests ................ SKIPPED
[INFO] Eclipse SmartHome Model Persistence ................ SKIPPED
[INFO] Eclipse SmartHome Model Persistence IDE ............ SKIPPED
[INFO] Eclipse SmartHome Model Script ..................... SKIPPED
[INFO] Eclipse SmartHome Model Rules ...................... SKIPPED
[INFO] Eclipse SmartHome Model Rule IDE ................... SKIPPED
[INFO] Eclipse SmartHome Model Script IDE ................. SKIPPED
[INFO] Eclipse SmartHome Model Sitemap IDE ................ SKIPPED
[INFO] Eclipse SmartHome Model Thing ...................... SKIPPED
[INFO] Eclipse SmartHome Model Thing IDE .................. SKIPPED
[INFO] Eclipse SmartHome Language Server .................. SKIPPED
[INFO] Eclipse SmartHome Language Server Tests ............ SKIPPED
[INFO] Eclipse SmartHome Model Persistence Runtime ........ SKIPPED
[INFO] Eclipse SmartHome Model Persistence Tests .......... SKIPPED
[INFO] Eclipse SmartHome Model Rules Runtime .............. SKIPPED
[INFO] Eclipse SmartHome Model Script Runtime ............. SKIPPED
[INFO] Eclipse SmartHome Model Rules Tests ................ SKIPPED
[INFO] Eclipse SmartHome Model Script Tests ............... SKIPPED
[INFO] Eclipse SmartHome Model Sitemap Runtime ............ SKIPPED
[INFO] Eclipse SmartHome Model Thing Runtime .............. SKIPPED
[INFO] Eclipse SmartHome Model Thing Tests ................ SKIPPED
[INFO] Eclipse SmartHome UI Tests ......................... SKIPPED
[INFO] Eclipse SmartHome UI Icon Support .................. SKIPPED
[INFO] Eclipse SmartHome UI Icon Tests .................... SKIPPED
[INFO] Eclipse SmartHome Storages ......................... SKIPPED
[INFO] Eclipse SmartHome JSON Storage ..................... SKIPPED
[INFO] Eclipse SmartHome Storage JSON Tests ............... SKIPPED
[INFO] Eclipse SmartHome MapDB Storage .................... SKIPPED
[INFO] Eclipse SmartHome Storage MapDB Tests .............. SKIPPED
[INFO] Eclipse SmartHome Extensions ....................... SKIPPED
[INFO] Eclipse SmartHome Bindings ......................... SKIPPED
[INFO] Eclipse SmartHome Astro Binding .................... SKIPPED
[INFO] Eclipse SmartHome Astro Binding Tests .............. SKIPPED
[INFO] Eclipse SmartHome Bluetooth Binding ................ SKIPPED
[INFO] Eclipse SmartHome BlueGiga Bluetooth Adapter ....... SKIPPED
[INFO] Eclipse SmartHome Bluetooth BlueGiga Tests ......... SKIPPED
[INFO] Eclipse SmartHome BlueZ Bluetooth Adapter .......... SKIPPED
[INFO] Eclipse SmartHome Blukii Binding ................... SKIPPED
[INFO] Eclipse SmartHome Bluetooth Binding Tests .......... SKIPPED
[INFO] Eclipse SmartHome Bose SoundTouch Binding .......... SKIPPED
[INFO] Eclipse SmartHome DigitalSTROM Binding ............. SKIPPED
[INFO] Eclipse SmartHome DMX Binding ...................... SKIPPED
[INFO] Eclipse SmartHome DMX Binding Tests ................ SKIPPED
[INFO] Eclipse SmartHome Homematic Binding ................ SKIPPED
[INFO] Eclipse SmartHome Homematic Binding Tests .......... SKIPPED
[INFO] Eclipse SmartHome hue Binding ...................... SKIPPED
[INFO] Eclipse SmartHome hue Binding Tests ................ SKIPPED
[INFO] Eclipse SmartHome FSInternetRadio Binding .......... SKIPPED
[INFO] Eclipse SmartHome FSInternetRadio Binding Test ..... SKIPPED
[INFO] Eclipse SmartHome LIFX Binding ..................... SKIPPED
[INFO] Eclipse SmartHome LIRC Binding ..................... SKIPPED
[INFO] Eclipse SmartHome meteoblue Binding ................ SKIPPED
[INFO] Eclipse SmartHome MQTT Binding ..................... SKIPPED
[INFO] Eclipse SmartHome MQTT Binding Tests ............... SKIPPED
[INFO] Eclipse SmartHome MQTT Thing Binding ............... SKIPPED
[INFO] Eclipse SmartHome I/O Services ..................... SKIPPED
[INFO] Eclipse SmartHome Embedded MQTT Broker ............. SKIPPED
[INFO] Eclipse SmartHome MQTT Thing Binding Tests ......... SKIPPED
[INFO] Eclipse SmartHome NTP Binding ...................... SKIPPED
[INFO] Eclipse SmartHome NTP Binding Tests ................ SKIPPED
[INFO] Eclipse SmartHome OneWire Binding .................. SKIPPED
[INFO] Eclipse SmartHome OneWire Binding Tests ............ SKIPPED
[INFO] Eclipse SmartHome OpenWeatherMap Binding ........... SKIPPED
[INFO] Eclipse SmartHome SerialButton Binding ............. SKIPPED
[INFO] Eclipse SmartHome Sonos Binding .................... SKIPPED
[INFO] Eclipse SmartHome SonyAudio Binding ................ SKIPPED
[INFO] Eclipse SmartHome TRÅDFRI Binding .................. SKIPPED
[INFO] Eclipse SmartHome TRÅDFRI Binding Tests ............ SKIPPED
[INFO] Eclipse SmartHome WeatherUnderground Binding ....... SKIPPED
[INFO] Eclipse SmartHome WeMo Binding ..................... SKIPPED
[INFO] Eclipse SmartHome Wemo Binding Tests ............... SKIPPED
[INFO] Eclipse SmartHome Extension Service Extensions ..... SKIPPED
[INFO] Eclipse SmartHome IoT Marketplace Extension Service  SKIPPED
[INFO] Eclipse SmartHome IoT Marketplace Extension Automation Support SKIPPED
[INFO] Eclipse SmartHome IoT Marketplace Extension Service Test SKIPPED
[INFO] Eclipse SmartHome JavaSound I/O .................... SKIPPED
[INFO] Eclipse SmartHome Embedded MQTT Broker Tests ....... SKIPPED
[INFO] Eclipse SmartHome Web Audio Support ................ SKIPPED
[INFO] Eclipse SmartHome Persistence ...................... SKIPPED
[INFO] Eclipse SmartHome MapDB Persistence ................ SKIPPED
[INFO] Eclipse SmartHome MapDB Persistence Tests .......... SKIPPED
[INFO] Eclipse SmartHome Transformation Services .......... SKIPPED
[INFO] Eclipse SmartHome Exec Transformation Service ...... SKIPPED
[INFO] Eclipse SmartHome Javascript Transformation Service  SKIPPED
[INFO] Eclipse SmartHome Map Transformation Service ....... SKIPPED
[INFO] Eclipse SmartHome Map Transformation Service Tests . SKIPPED
[INFO] Eclipse SmartHome Scale Transformation Service ..... SKIPPED
[INFO] Eclipse SmartHome Scale Transformation Service Tests SKIPPED
[INFO] Eclipse SmartHome RegEx Transformation Service ..... SKIPPED
[INFO] Eclipse SmartHome RegEx Transformation Service Tests SKIPPED
[INFO] Eclipse SmartHome XPath Transformation Service ..... SKIPPED
[INFO] Eclipse SmartHome XPath Transformation Service Tests SKIPPED
[INFO] Eclipse SmartHome JSonPath Transformation Service .. SKIPPED
[INFO] Eclipse SmartHome JSonPath Transformation Service Tests SKIPPED
[INFO] Eclipse SmartHome Xslt Transformation Service ...... SKIPPED
[INFO] Eclipse SmartHome Xslt Transformation Service Tests  SKIPPED
[INFO] Eclipse SmartHome UI Extensions .................... SKIPPED
[INFO] Eclipse SmartHome Icon Sets ........................ SKIPPED
[INFO] Eclipse SmartHome Classic Icon Set ................. SKIPPED
[INFO] Eclipse SmartHome Basic UI ......................... SKIPPED
[INFO] Eclipse SmartHome Classic UI ....................... SKIPPED
[INFO] Eclipse SmartHome Paper UI ......................... SKIPPED
[INFO] Eclipse SmartHome Voice Services ................... SKIPPED
[INFO] Eclipse SmartHome macOS Text-to-Speech ............. SKIPPED
[INFO] Eclipse SmartHome macOS Text-to-Speech Tests ....... SKIPPED
[INFO] Eclipse SmartHome Features ......................... SKIPPED
[INFO] Eclipse SmartHome Runtime Core Feature ............. SKIPPED
[INFO] Eclipse SmartHome Runtime Model Feature ............ SKIPPED
[INFO] Eclipse SmartHome Runtime UI Feature ............... SKIPPED
[INFO] Eclipse SmartHome Runtime REST Feature ............. SKIPPED
[INFO] Eclipse SmartHome Runtime Automation Feature ....... SKIPPED
[INFO] Eclipse SmartHome Runtime Equinox Console Feature .. SKIPPED
[INFO] Eclipse SmartHome Runtime RfC147 Console Feature ... SKIPPED
[INFO] Eclipse SmartHome Runtime Binding Feature .......... SKIPPED
[INFO] Eclipse SmartHome Test Dependencies ................ SKIPPED
[INFO] Eclipse SmartHome Karaf Features ................... SKIPPED
[INFO] Eclipse SmartHome Target Platform Feature .......... SKIPPED
[INFO] Eclipse SmartHome Core Feature ..................... SKIPPED
[INFO] Eclipse SmartHome Extensions Feature ............... SKIPPED
[INFO] Eclipse SmartHome Karaf Feature Verification ....... SKIPPED
[INFO] Eclipse SmartHome Products ......................... SKIPPED
[INFO] Eclipse SmartHome p2 Repository .................... SKIPPED
[INFO] Eclipse SmartHome Tools ............................ SKIPPED
[INFO] Eclipse SmartHome Archetypes ....................... SKIPPED
[INFO] Eclipse SmartHome Binding Archetype ................ SKIPPED
[INFO] Eclipse SmartHome Binding Archetype Testsuite ...... SKIPPED
[INFO] Eclipse SmartHome Target Platform .................. SKIPPED
[INFO] Eclipse SmartHome Distribution 0.11.0-SNAPSHOT ..... SKIPPED
[INFO] ------------------------------------------------------------------------
[INFO] BUILD FAILURE
[INFO] ------------------------------------------------------------------------
[INFO] Total time: 22:16 min
[INFO] Finished at: 2019-01-31T06:30:42-05:00
[INFO] ------------------------------------------------------------------------
[ERROR] Failed to execute goal org.eclipse.tycho:tycho-surefire-plugin:1.2.0:test (default-test) on project org.eclipse.smarthome.core.test: There are test failures.
[ERROR] 
[ERROR] Please refer to /jobs/genie.smarthome/SmartHomeDistribution-Nightly/workspace/bundles/core/org.eclipse.smarthome.core.test/target/surefire-reports for the individual test results.
[ERROR] -> [Help 1]
[ERROR] 
[ERROR] To see the full stack trace of the errors, re-run Maven with the -e switch.
[ERROR] Re-run Maven using the -X switch to enable full debug logging.
[ERROR] 
[ERROR] For more information about the errors and possible solutions, please read the following articles:
[ERROR] [Help 1] http://cwiki.apache.org/confluence/display/MAVEN/MojoFailureException
[ERROR] 
[ERROR] After correcting the problems, you can resume the build with the command
[ERROR]   mvn <goals> -rf :org.eclipse.smarthome.core.test
Build step 'Invoke top-level Maven targets' marked build as failure
[htmlpublisher] Archiving HTML reports...
[htmlpublisher] Archiving at PROJECT level /home/hudson/genie.smarthome/.jenkins/jobs/SmartHomeDistribution-Nightly/workspace/target to /home/hudson/genie.smarthome/.jenkins/jobs/SmartHomeDistribution-Nightly/htmlreports/Static_20Code_20Analysis_20Report
Not sending mail to unregistered user kai@openhab.org
Sending e-mails to: kai@openhab.org maggu2810@gmail.com henning.treu@telekom.de
Recording test results
Archiving artifacts
Started calculate disk usage of build
Finished Calculation of disk usage of build in 0 seconds
Started calculate disk usage of workspace
Finished Calculation of disk usage of workspace in 0 seconds
Finished: FAILURE