FailedConsole Output

Skipping 6,379 KB.. Full Log
[INFO] Empty report will not be appended to the summary report.
[INFO] 
[INFO] --- maven-install-plugin:2.5.2:install (default-install) @ org.eclipse.smarthome.binding.fsinternetradio.test ---
[INFO] Installing /jobs/genie.smarthome/SmartHomeDistribution-Nightly-PR/workspace/extensions/binding/org.eclipse.smarthome.binding.fsinternetradio.test/target/org.eclipse.smarthome.binding.fsinternetradio.test-0.11.0-SNAPSHOT.jar to /home/hudson/genie.smarthome/.jenkins/jobs/SmartHomeDistribution-Nightly-PR/workspace/.repository/org/eclipse/smarthome/binding/org.eclipse.smarthome.binding.fsinternetradio.test/0.11.0-SNAPSHOT/org.eclipse.smarthome.binding.fsinternetradio.test-0.11.0-SNAPSHOT.jar
[INFO] Installing /jobs/genie.smarthome/SmartHomeDistribution-Nightly-PR/workspace/extensions/binding/org.eclipse.smarthome.binding.fsinternetradio.test/pom.xml to /home/hudson/genie.smarthome/.jenkins/jobs/SmartHomeDistribution-Nightly-PR/workspace/.repository/org/eclipse/smarthome/binding/org.eclipse.smarthome.binding.fsinternetradio.test/0.11.0-SNAPSHOT/org.eclipse.smarthome.binding.fsinternetradio.test-0.11.0-SNAPSHOT.pom
[INFO] Installing /jobs/genie.smarthome/SmartHomeDistribution-Nightly-PR/workspace/extensions/binding/org.eclipse.smarthome.binding.fsinternetradio.test/target/org.eclipse.smarthome.binding.fsinternetradio.test-0.11.0-SNAPSHOT-sources.jar to /home/hudson/genie.smarthome/.jenkins/jobs/SmartHomeDistribution-Nightly-PR/workspace/.repository/org/eclipse/smarthome/binding/org.eclipse.smarthome.binding.fsinternetradio.test/0.11.0-SNAPSHOT/org.eclipse.smarthome.binding.fsinternetradio.test-0.11.0-SNAPSHOT-sources.jar
[INFO] Installing /jobs/genie.smarthome/SmartHomeDistribution-Nightly-PR/workspace/extensions/binding/org.eclipse.smarthome.binding.fsinternetradio.test/target/p2content.xml to /home/hudson/genie.smarthome/.jenkins/jobs/SmartHomeDistribution-Nightly-PR/workspace/.repository/org/eclipse/smarthome/binding/org.eclipse.smarthome.binding.fsinternetradio.test/0.11.0-SNAPSHOT/org.eclipse.smarthome.binding.fsinternetradio.test-0.11.0-SNAPSHOT-p2metadata.xml
[INFO] Installing /jobs/genie.smarthome/SmartHomeDistribution-Nightly-PR/workspace/extensions/binding/org.eclipse.smarthome.binding.fsinternetradio.test/target/p2artifacts.xml to /home/hudson/genie.smarthome/.jenkins/jobs/SmartHomeDistribution-Nightly-PR/workspace/.repository/org/eclipse/smarthome/binding/org.eclipse.smarthome.binding.fsinternetradio.test/0.11.0-SNAPSHOT/org.eclipse.smarthome.binding.fsinternetradio.test-0.11.0-SNAPSHOT-p2artifacts.xml
[INFO] 
[INFO] --- tycho-p2-plugin:1.2.0:update-local-index (default-update-local-index) @ org.eclipse.smarthome.binding.fsinternetradio.test ---
[INFO] 
[INFO] --< org.eclipse.smarthome.binding:org.eclipse.smarthome.binding.lifx >--
[INFO] Building Eclipse SmartHome LIFX Binding 0.11.0-SNAPSHOT        [171/249]
[INFO] ---------------------------[ eclipse-plugin ]---------------------------
[INFO] 
[INFO] --- maven-clean-plugin:2.5:clean (default-clean) @ org.eclipse.smarthome.binding.lifx ---
[INFO] Deleting /jobs/genie.smarthome/SmartHomeDistribution-Nightly-PR/workspace/extensions/binding/org.eclipse.smarthome.binding.lifx/OSGI-INF (includes = [**], excludes = [.gitignore])
[INFO] 
[INFO] --- tycho-packaging-plugin:1.2.0:build-qualifier (default-build-qualifier) @ org.eclipse.smarthome.binding.lifx ---
[INFO] The project's OSGi version is 0.11.0.201901311108
[INFO] 
[INFO] --- tycho-packaging-plugin:1.2.0:validate-id (default-validate-id) @ org.eclipse.smarthome.binding.lifx ---
[INFO] 
[INFO] --- tycho-packaging-plugin:1.2.0:validate-version (default-validate-version) @ org.eclipse.smarthome.binding.lifx ---
[INFO] 
[INFO] --- directory-maven-plugin:0.2:highest-basedir (directories) @ org.eclipse.smarthome.binding.lifx ---
[INFO] Highest basedir set to: /jobs/genie.smarthome/SmartHomeDistribution-Nightly-PR/workspace
[INFO] 
[INFO] --- jacoco-maven-plugin:0.7.4.201502262128:prepare-agent (default-prepare-agent) @ org.eclipse.smarthome.binding.lifx ---
[INFO] argLine set to -javaagent:/home/hudson/genie.smarthome/.jenkins/jobs/SmartHomeDistribution-Nightly-PR/workspace/.repository/org/jacoco/org.jacoco.agent/0.7.4.201502262128/org.jacoco.agent-0.7.4.201502262128-runtime.jar=destfile=/jobs/genie.smarthome/SmartHomeDistribution-Nightly-PR/workspace/target/coverage.jacoco,append=true,excludes=**/*Test.*
[INFO] 
[INFO] --- maven-resources-plugin:3.1.0:resources (default-resources) @ org.eclipse.smarthome.binding.lifx ---
[INFO] Using 'UTF-8' encoding to copy filtered resources.
[INFO] skip non existing resourceDirectory /jobs/genie.smarthome/SmartHomeDistribution-Nightly-PR/workspace/extensions/binding/org.eclipse.smarthome.binding.lifx/src/main/resources
[INFO] 
[INFO] --- tycho-compiler-plugin:1.2.0:compile (default-compile) @ org.eclipse.smarthome.binding.lifx ---
[INFO] Compiling 93 source files to /jobs/genie.smarthome/SmartHomeDistribution-Nightly-PR/workspace/extensions/binding/org.eclipse.smarthome.binding.lifx/target/classes
[WARNING] /jobs/genie.smarthome/SmartHomeDistribution-Nightly-PR/workspace/extensions/binding/org.eclipse.smarthome.binding.lifx/src/main/java/org/eclipse/smarthome/binding/lifx/internal/LifxLightCommunicationHandler.java:[204] 
	} else if (macAddress != null && macAddress.equals(discoveredAddress)) {
	                                 ^^^^^^^^^^
Potential null pointer access: this expression has a '@Nullable' type
[WARNING] /jobs/genie.smarthome/SmartHomeDistribution-Nightly-PR/workspace/extensions/binding/org.eclipse.smarthome.binding.lifx/src/main/java/org/eclipse/smarthome/binding/lifx/handler/LifxLightHandler.java:[588] 
	getLightStateForCommand().setBrightness(newBrightness);
	                                        ^^^^^^^^^^^^^
Null type mismatch: required '@NonNull PercentType' but the provided value is inferred as @Nullable
2 problems (2 warnings)
[INFO] 
[INFO] --- maven-scr-plugin:1.24.0:scr (generate-scr-scrdescriptor) @ org.eclipse.smarthome.binding.lifx ---
[INFO] Writing 1 Service Component Descriptors to /jobs/genie.smarthome/SmartHomeDistribution-Nightly-PR/workspace/extensions/binding/org.eclipse.smarthome.binding.lifx/target/classes/OSGI-INF/org.eclipse.smarthome.binding.lifx.internal.LifxChannelFactoryImpl.xml
[INFO] Writing 1 Service Component Descriptors to /jobs/genie.smarthome/SmartHomeDistribution-Nightly-PR/workspace/extensions/binding/org.eclipse.smarthome.binding.lifx/target/classes/OSGI-INF/org.eclipse.smarthome.binding.lifx.internal.LifxHandlerFactory.xml
[INFO] Writing 1 Service Component Descriptors to /jobs/genie.smarthome/SmartHomeDistribution-Nightly-PR/workspace/extensions/binding/org.eclipse.smarthome.binding.lifx/target/classes/OSGI-INF/org.eclipse.smarthome.binding.lifx.internal.LifxLightDiscovery.xml
[INFO] 
[INFO] --- maven-resources-plugin:3.1.0:testResources (default-testResources) @ org.eclipse.smarthome.binding.lifx ---
[INFO] Using 'UTF-8' encoding to copy filtered resources.
[INFO] skip non existing resourceDirectory /jobs/genie.smarthome/SmartHomeDistribution-Nightly-PR/workspace/extensions/binding/org.eclipse.smarthome.binding.lifx/src/test/resources
[INFO] 
[INFO] --- maven-resources-plugin:3.1.0:copy-resources (default) @ org.eclipse.smarthome.binding.lifx ---
[INFO] Using 'UTF-8' encoding to copy filtered resources.
[INFO] Copying 3 resources
[INFO] 
[INFO] --- tycho-source-plugin:1.2.0:plugin-source (plugin-source) @ org.eclipse.smarthome.binding.lifx ---
[INFO] Building jar: /jobs/genie.smarthome/SmartHomeDistribution-Nightly-PR/workspace/extensions/binding/org.eclipse.smarthome.binding.lifx/target/org.eclipse.smarthome.binding.lifx-0.11.0-SNAPSHOT-sources.jar
[INFO] 
[INFO] --- target-platform-configuration:1.2.0:target-platform (default-target-platform) @ org.eclipse.smarthome.binding.lifx ---
[INFO] 
[INFO] --- tycho-packaging-plugin:1.2.0:package-plugin (default-package-plugin) @ org.eclipse.smarthome.binding.lifx ---
[INFO] Building jar: /jobs/genie.smarthome/SmartHomeDistribution-Nightly-PR/workspace/extensions/binding/org.eclipse.smarthome.binding.lifx/target/org.eclipse.smarthome.binding.lifx-0.11.0-SNAPSHOT.jar
[INFO] 
[INFO] --- tycho-p2-plugin:1.2.0:p2-metadata-default (default-p2-metadata-default) @ org.eclipse.smarthome.binding.lifx ---
[INFO] 
[INFO] --- jacoco-maven-plugin:0.7.4.201502262128:prepare-agent-integration (default-prepare-agent-integration) @ org.eclipse.smarthome.binding.lifx ---
[INFO] argLine set to -javaagent:/home/hudson/genie.smarthome/.jenkins/jobs/SmartHomeDistribution-Nightly-PR/workspace/.repository/org/jacoco/org.jacoco.agent/0.7.4.201502262128/org.jacoco.agent-0.7.4.201502262128-runtime.jar=destfile=/jobs/genie.smarthome/SmartHomeDistribution-Nightly-PR/workspace/target/coverage.jacoco,append=true,excludes=**/*Test.*
[INFO] 
[INFO] --- sat-plugin:0.5.0:checkstyle (sat-all) @ org.eclipse.smarthome.binding.lifx ---
[INFO] Adding dependency to checkstyle:0.5.0
[INFO] Adding dependency to checkstyle:8.1
[ERROR] Unable to parse schema 
org.xml.sax.SAXParseException: src-resolve: Cannot resolve the name 'config-description:idRestrictionPattern' to a(n) 'type definition' component.
    at org.apache.xerces.util.ErrorHandlerWrapper.createSAXParseException (Unknown Source)
    at org.apache.xerces.util.ErrorHandlerWrapper.error (Unknown Source)
    at org.apache.xerces.impl.XMLErrorReporter.reportError (Unknown Source)
    at org.apache.xerces.impl.XMLErrorReporter.reportError (Unknown Source)
    at org.apache.xerces.impl.xs.traversers.XSDHandler.reportSchemaError (Unknown Source)
    at org.apache.xerces.impl.xs.traversers.XSDHandler.getGlobalDecl (Unknown Source)
    at org.apache.xerces.impl.xs.traversers.XSDAttributeTraverser.traverseNamedAttr (Unknown Source)
    at org.apache.xerces.impl.xs.traversers.XSDAttributeTraverser.traverseLocal (Unknown Source)
    at org.apache.xerces.impl.xs.traversers.XSDAbstractTraverser.traverseAttrsAndAttrGrps (Unknown Source)
    at org.apache.xerces.impl.xs.traversers.XSDComplexTypeTraverser.processComplexContent (Unknown Source)
    at org.apache.xerces.impl.xs.traversers.XSDComplexTypeTraverser.traverseComplexTypeDecl (Unknown Source)
    at org.apache.xerces.impl.xs.traversers.XSDComplexTypeTraverser.traverseLocal (Unknown Source)
    at org.apache.xerces.impl.xs.traversers.XSDElementTraverser.traverseNamedElement (Unknown Source)
    at org.apache.xerces.impl.xs.traversers.XSDElementTraverser.traverseGlobal (Unknown Source)
    at org.apache.xerces.impl.xs.traversers.XSDHandler.traverseSchemas (Unknown Source)
    at org.apache.xerces.impl.xs.traversers.XSDHandler.parseSchema (Unknown Source)
    at org.apache.xerces.impl.xs.XMLSchemaLoader.loadSchema (Unknown Source)
    at org.apache.xerces.impl.xs.XMLSchemaLoader.loadGrammar (Unknown Source)
    at org.apache.xerces.impl.xs.XMLSchemaLoader.loadGrammar (Unknown Source)
    at org.apache.xerces.jaxp.validation.XMLSchemaFactory.newSchema (Unknown Source)
    at javax.xml.validation.SchemaFactory.newSchema (SchemaFactory.java:638)
    at org.openhab.tools.analysis.checkstyle.EshInfXmlValidationCheck$1.transform (EshInfXmlValidationCheck.java:110)
    at org.openhab.tools.analysis.checkstyle.EshInfXmlValidationCheck$1.transform (EshInfXmlValidationCheck.java:103)
    at org.openhab.tools.analysis.utils.CachingHttpClient.get (CachingHttpClient.java:71)
    at org.openhab.tools.analysis.checkstyle.EshInfXmlValidationCheck.getXSD (EshInfXmlValidationCheck.java:229)
    at org.openhab.tools.analysis.checkstyle.EshInfXmlValidationCheck.beginProcessing (EshInfXmlValidationCheck.java:120)
    at com.puppycrawl.tools.checkstyle.Checker.process (Checker.java:210)
    at org.apache.maven.plugin.checkstyle.exec.DefaultCheckstyleExecutor.executeCheckstyle (DefaultCheckstyleExecutor.java:252)
    at org.apache.maven.plugin.checkstyle.AbstractCheckstyleReport.executeReport (AbstractCheckstyleReport.java:473)
    at org.apache.maven.plugin.checkstyle.CheckstyleReport.executeReport (CheckstyleReport.java:154)
    at org.apache.maven.reporting.AbstractMavenReport.generate (AbstractMavenReport.java:255)
    at org.apache.maven.reporting.AbstractMavenReport.execute (AbstractMavenReport.java:143)
    at org.apache.maven.plugin.DefaultBuildPluginManager.executeMojo (DefaultBuildPluginManager.java:137)
    at org.twdata.maven.mojoexecutor.MojoExecutor.executeMojo (MojoExecutor.java:94)
    at org.openhab.tools.analysis.tools.AbstractChecker.executeCheck (AbstractChecker.java:106)
    at org.openhab.tools.analysis.tools.CheckstyleChecker.execute (CheckstyleChecker.java:123)
    at org.apache.maven.plugin.DefaultBuildPluginManager.executeMojo (DefaultBuildPluginManager.java:137)
    at org.apache.maven.lifecycle.internal.MojoExecutor.execute (MojoExecutor.java:208)
    at org.apache.maven.lifecycle.internal.MojoExecutor.execute (MojoExecutor.java:154)
    at org.apache.maven.lifecycle.internal.MojoExecutor.execute (MojoExecutor.java:146)
    at org.apache.maven.lifecycle.internal.LifecycleModuleBuilder.buildProject (LifecycleModuleBuilder.java:117)
    at org.apache.maven.lifecycle.internal.LifecycleModuleBuilder.buildProject (LifecycleModuleBuilder.java:81)
    at org.apache.maven.lifecycle.internal.builder.singlethreaded.SingleThreadedBuilder.build (SingleThreadedBuilder.java:56)
    at org.apache.maven.lifecycle.internal.LifecycleStarter.execute (LifecycleStarter.java:128)
    at org.apache.maven.DefaultMaven.doExecute (DefaultMaven.java:305)
    at org.apache.maven.DefaultMaven.doExecute (DefaultMaven.java:192)
    at org.apache.maven.DefaultMaven.execute (DefaultMaven.java:105)
    at org.apache.maven.cli.MavenCli.execute (MavenCli.java:954)
    at org.apache.maven.cli.MavenCli.doMain (MavenCli.java:288)
    at org.apache.maven.cli.MavenCli.main (MavenCli.java:192)
    at sun.reflect.NativeMethodAccessorImpl.invoke0 (Native Method)
    at sun.reflect.NativeMethodAccessorImpl.invoke (NativeMethodAccessorImpl.java:62)
    at sun.reflect.DelegatingMethodAccessorImpl.invoke (DelegatingMethodAccessorImpl.java:43)
    at java.lang.reflect.Method.invoke (Method.java:498)
    at org.codehaus.plexus.classworlds.launcher.Launcher.launchEnhanced (Launcher.java:289)
    at org.codehaus.plexus.classworlds.launcher.Launcher.launch (Launcher.java:229)
    at org.codehaus.plexus.classworlds.launcher.Launcher.mainWithExitCode (Launcher.java:415)
    at org.codehaus.plexus.classworlds.launcher.Launcher.main (Launcher.java:356)
[WARNING] XML validation will be skipped as the schema file download failed.
[WARNING] XML validation will be skipped as the schema file download failed.
[WARNING] XML validation will be skipped as the schema file download failed.
[WARNING] XML validation will be skipped as the schema file download failed.
[WARNING] XML validation will be skipped as the schema file download failed.
[WARNING] XML validation will be skipped as the schema file download failed.
[WARNING] KarafFeatureCheck will be skipped. Could not find file features/openhab-addons/src/main/feature/feature.xml
[INFO] 
[INFO] --- sat-plugin:0.5.0:pmd (sat-all) @ org.eclipse.smarthome.binding.lifx ---
[INFO] Adding dependency to pmd:0.5.0
[INFO] Adding dependency to pmd-core:5.8.1
[INFO] Adding dependency to pmd-java:5.8.1
[INFO] Adding dependency to pmd-javascript:5.8.1
[INFO] Adding dependency to pmd-jsp:5.8.1
[INFO] 
[INFO] --- sat-plugin:0.5.0:spotbugs (sat-all) @ org.eclipse.smarthome.binding.lifx ---
[INFO] Adding dependency to findbugs:0.5.0
[INFO] Adding dependency to bug-pattern:1.2.4
[INFO] Adding dependency to spotbugs:3.1.2
[INFO] Fork Value is false
     [java] JVM args ignored when same JVM is used.
[INFO] Done SpotBugs Analysis....
[INFO] 
[INFO] --- sat-plugin:0.5.0:report (sat-all) @ org.eclipse.smarthome.binding.lifx ---
[INFO] Individual report appended to summary report.
[WARNING] Code Analysis Tool has found: 
 0 error(s)! 
 42 warning(s) 
 0 info(s)
[WARNING] org.eclipse.smarthome.binding.lifx.internal.LifxChannelFactory.java:[22]
First javadoc author should have "Initial contribution" contribution description.
[WARNING] org.eclipse.smarthome.binding.lifx.internal.LifxChannelFactoryImpl.java:[37]
First javadoc author should have "Initial contribution" contribution description.
[WARNING] org.eclipse.smarthome.binding.lifx.internal.LifxLightCommunicationHandler.java:[49]
First javadoc author should have "Initial contribution" contribution description.
[WARNING] org.eclipse.smarthome.binding.lifx.internal.LifxLightContext.java:[25]
First javadoc author should have "Initial contribution" contribution description.
[WARNING] org.eclipse.smarthome.binding.lifx.internal.LifxLightCurrentStateUpdater.java:[48]
First javadoc author should have "Initial contribution" contribution description.
[WARNING] org.eclipse.smarthome.binding.lifx.internal.LifxLightOnlineStateUpdater.java:[34]
First javadoc author should have "Initial contribution" contribution description.
[WARNING] org.eclipse.smarthome.binding.lifx.internal.LifxLightPropertiesUpdater.java:[49]
First javadoc author should have "Initial contribution" contribution description.
[WARNING] org.eclipse.smarthome.binding.lifx.internal.LifxLightState.java:[36]
First javadoc author should have "Initial contribution" contribution description.
[WARNING] org.eclipse.smarthome.binding.lifx.internal.LifxLightStateChanger.java:[58]
First javadoc author should have "Initial contribution" contribution description.
[WARNING] org.eclipse.smarthome.binding.lifx.internal.LifxSelectorContext.java:[28]
First javadoc author should have "Initial contribution" contribution description.
[WARNING] org.eclipse.smarthome.binding.lifx.internal.LifxSequenceNumberSupplier.java:[23]
First javadoc author should have "Initial contribution" contribution description.
[WARNING] org.eclipse.smarthome.binding.lifx.internal.fields.ByteField.java:[20]
First javadoc author should have "Initial contribution" contribution description.
[WARNING] org.eclipse.smarthome.binding.lifx.internal.fields.Field.java:[25]
First javadoc author should have "Initial contribution" contribution description.
[WARNING] org.eclipse.smarthome.binding.lifx.internal.fields.FloatField.java:[20]
First javadoc author should have "Initial contribution" contribution description.
[WARNING] org.eclipse.smarthome.binding.lifx.internal.fields.HSBK.java:[24]
First javadoc author should have "Initial contribution" contribution description.
[WARNING] org.eclipse.smarthome.binding.lifx.internal.fields.HSBKField.java:[20]
First javadoc author should have "Initial contribution" contribution description.
[WARNING] org.eclipse.smarthome.binding.lifx.internal.fields.LittleField.java:[22]
First javadoc author should have "Initial contribution" contribution description.
[WARNING] org.eclipse.smarthome.binding.lifx.internal.fields.MACAddress.java:[30]
First javadoc author should have "Initial contribution" contribution description.
[WARNING] org.eclipse.smarthome.binding.lifx.internal.fields.MACAddress.java:[31]
Javadoc author should not have empty contribution description.
[WARNING] org.eclipse.smarthome.binding.lifx.internal.fields.MACAddressField.java:[20]
First javadoc author should have "Initial contribution" contribution description.
[WARNING] org.eclipse.smarthome.binding.lifx.internal.fields.MACAddressField.java:[21]
Javadoc author should not have empty contribution description.
[WARNING] org.eclipse.smarthome.binding.lifx.internal.fields.StringField.java:[22]
First javadoc author should have "Initial contribution" contribution description.
[WARNING] org.eclipse.smarthome.binding.lifx.internal.fields.UInt16Field.java:[20]
First javadoc author should have "Initial contribution" contribution description.
[WARNING] org.eclipse.smarthome.binding.lifx.internal.fields.UInt32Field.java:[20]
First javadoc author should have "Initial contribution" contribution description.
[WARNING] org.eclipse.smarthome.binding.lifx.internal.fields.UInt64Field.java:[24]
First javadoc author should have "Initial contribution" contribution description.
[WARNING] org.eclipse.smarthome.binding.lifx.internal.fields.UInt8Field.java:[20]
First javadoc author should have "Initial contribution" contribution description.
[WARNING] org.eclipse.smarthome.binding.lifx.internal.fields.Version.java:[18]
First javadoc author should have "Initial contribution" contribution description.
[WARNING] org.eclipse.smarthome.binding.lifx.internal.fields.VersionField.java:[20]
First javadoc author should have "Initial contribution" contribution description.
[WARNING] org.eclipse.smarthome.binding.lifx.internal.listener.LifxPropertiesUpdateListener.java:[24]
First javadoc author should have "Initial contribution" contribution description.
[WARNING] org.eclipse.smarthome.binding.lifx.internal.protocol.ApplicationRequest.java:[16]
First javadoc author should have "Initial contribution" contribution description.
[WARNING] org.eclipse.smarthome.binding.lifx.internal.protocol.GetColorZonesRequest.java:[23]
First javadoc author should have "Initial contribution" contribution description.
[WARNING] org.eclipse.smarthome.binding.lifx.internal.protocol.GetLightInfraredRequest.java:[18]
First javadoc author should have "Initial contribution" contribution description.
[WARNING] org.eclipse.smarthome.binding.lifx.internal.protocol.Product.java:[31]
First javadoc author should have "Initial contribution" contribution description.
[WARNING] org.eclipse.smarthome.binding.lifx.internal.protocol.SetColorZonesRequest.java:[26]
First javadoc author should have "Initial contribution" contribution description.
[WARNING] org.eclipse.smarthome.binding.lifx.internal.protocol.SetLightInfraredRequest.java:[21]
First javadoc author should have "Initial contribution" contribution description.
[WARNING] org.eclipse.smarthome.binding.lifx.internal.protocol.SignalStrength.java:[18]
First javadoc author should have "Initial contribution" contribution description.
[WARNING] org.eclipse.smarthome.binding.lifx.internal.protocol.StateLightInfraredResponse.java:[21]
First javadoc author should have "Initial contribution" contribution description.
[WARNING] org.eclipse.smarthome.binding.lifx.internal.protocol.StateMultiZoneResponse.java:[23]
First javadoc author should have "Initial contribution" contribution description.
[WARNING] org.eclipse.smarthome.binding.lifx.internal.protocol.StateZoneResponse.java:[23]
First javadoc author should have "Initial contribution" contribution description.
[WARNING] org.eclipse.smarthome.binding.lifx.internal.util.LifxMessageUtil.java:[29]
First javadoc author should have "Initial contribution" contribution description.
[WARNING] org.eclipse.smarthome.binding.lifx.internal.util.LifxNetworkUtil.java:[37]
First javadoc author should have "Initial contribution" contribution description.
[WARNING] org.eclipse.smarthome.binding.lifx.internal.util.LifxSelectorUtil.java:[45]
First javadoc author should have "Initial contribution" contribution description.
[INFO] Detailed report can be found at: file:////jobs/genie.smarthome/SmartHomeDistribution-Nightly-PR/workspace/extensions/binding/org.eclipse.smarthome.binding.lifx/target/code-analysis/report.html
[INFO] 
[INFO] --- maven-install-plugin:2.5.2:install (default-install) @ org.eclipse.smarthome.binding.lifx ---
[INFO] Installing /jobs/genie.smarthome/SmartHomeDistribution-Nightly-PR/workspace/extensions/binding/org.eclipse.smarthome.binding.lifx/target/org.eclipse.smarthome.binding.lifx-0.11.0-SNAPSHOT.jar to /home/hudson/genie.smarthome/.jenkins/jobs/SmartHomeDistribution-Nightly-PR/workspace/.repository/org/eclipse/smarthome/binding/org.eclipse.smarthome.binding.lifx/0.11.0-SNAPSHOT/org.eclipse.smarthome.binding.lifx-0.11.0-SNAPSHOT.jar
[INFO] Installing /jobs/genie.smarthome/SmartHomeDistribution-Nightly-PR/workspace/extensions/binding/org.eclipse.smarthome.binding.lifx/pom.xml to /home/hudson/genie.smarthome/.jenkins/jobs/SmartHomeDistribution-Nightly-PR/workspace/.repository/org/eclipse/smarthome/binding/org.eclipse.smarthome.binding.lifx/0.11.0-SNAPSHOT/org.eclipse.smarthome.binding.lifx-0.11.0-SNAPSHOT.pom
[INFO] Installing /jobs/genie.smarthome/SmartHomeDistribution-Nightly-PR/workspace/extensions/binding/org.eclipse.smarthome.binding.lifx/target/org.eclipse.smarthome.binding.lifx-0.11.0-SNAPSHOT-sources.jar to /home/hudson/genie.smarthome/.jenkins/jobs/SmartHomeDistribution-Nightly-PR/workspace/.repository/org/eclipse/smarthome/binding/org.eclipse.smarthome.binding.lifx/0.11.0-SNAPSHOT/org.eclipse.smarthome.binding.lifx-0.11.0-SNAPSHOT-sources.jar
[INFO] Installing /jobs/genie.smarthome/SmartHomeDistribution-Nightly-PR/workspace/extensions/binding/org.eclipse.smarthome.binding.lifx/target/p2content.xml to /home/hudson/genie.smarthome/.jenkins/jobs/SmartHomeDistribution-Nightly-PR/workspace/.repository/org/eclipse/smarthome/binding/org.eclipse.smarthome.binding.lifx/0.11.0-SNAPSHOT/org.eclipse.smarthome.binding.lifx-0.11.0-SNAPSHOT-p2metadata.xml
[INFO] Installing /jobs/genie.smarthome/SmartHomeDistribution-Nightly-PR/workspace/extensions/binding/org.eclipse.smarthome.binding.lifx/target/p2artifacts.xml to /home/hudson/genie.smarthome/.jenkins/jobs/SmartHomeDistribution-Nightly-PR/workspace/.repository/org/eclipse/smarthome/binding/org.eclipse.smarthome.binding.lifx/0.11.0-SNAPSHOT/org.eclipse.smarthome.binding.lifx-0.11.0-SNAPSHOT-p2artifacts.xml
[INFO] 
[INFO] --- tycho-p2-plugin:1.2.0:update-local-index (default-update-local-index) @ org.eclipse.smarthome.binding.lifx ---
[INFO] 
[INFO] --< org.eclipse.smarthome.binding:org.eclipse.smarthome.binding.lirc >--
[INFO] Building Eclipse SmartHome LIRC Binding 0.11.0-SNAPSHOT        [172/249]
[INFO] ---------------------------[ eclipse-plugin ]---------------------------
[INFO] 
[INFO] --- maven-clean-plugin:2.5:clean (default-clean) @ org.eclipse.smarthome.binding.lirc ---
[INFO] Deleting /jobs/genie.smarthome/SmartHomeDistribution-Nightly-PR/workspace/extensions/binding/org.eclipse.smarthome.binding.lirc/OSGI-INF (includes = [**], excludes = [.gitignore])
[INFO] 
[INFO] --- tycho-packaging-plugin:1.2.0:build-qualifier (default-build-qualifier) @ org.eclipse.smarthome.binding.lirc ---
[INFO] The project's OSGi version is 0.11.0.201901311108
[INFO] 
[INFO] --- tycho-packaging-plugin:1.2.0:validate-id (default-validate-id) @ org.eclipse.smarthome.binding.lirc ---
[INFO] 
[INFO] --- tycho-packaging-plugin:1.2.0:validate-version (default-validate-version) @ org.eclipse.smarthome.binding.lirc ---
[INFO] 
[INFO] --- directory-maven-plugin:0.2:highest-basedir (directories) @ org.eclipse.smarthome.binding.lirc ---
[INFO] Highest basedir set to: /jobs/genie.smarthome/SmartHomeDistribution-Nightly-PR/workspace
[INFO] 
[INFO] --- jacoco-maven-plugin:0.7.4.201502262128:prepare-agent (default-prepare-agent) @ org.eclipse.smarthome.binding.lirc ---
[INFO] argLine set to -javaagent:/home/hudson/genie.smarthome/.jenkins/jobs/SmartHomeDistribution-Nightly-PR/workspace/.repository/org/jacoco/org.jacoco.agent/0.7.4.201502262128/org.jacoco.agent-0.7.4.201502262128-runtime.jar=destfile=/jobs/genie.smarthome/SmartHomeDistribution-Nightly-PR/workspace/target/coverage.jacoco,append=true,excludes=**/*Test.*
[INFO] 
[INFO] --- maven-resources-plugin:3.1.0:resources (default-resources) @ org.eclipse.smarthome.binding.lirc ---
[INFO] Using 'UTF-8' encoding to copy filtered resources.
[INFO] skip non existing resourceDirectory /jobs/genie.smarthome/SmartHomeDistribution-Nightly-PR/workspace/extensions/binding/org.eclipse.smarthome.binding.lirc/src/main/resources
[INFO] 
[INFO] --- tycho-compiler-plugin:1.2.0:compile (default-compile) @ org.eclipse.smarthome.binding.lirc ---
[INFO] Compiling 14 source files to /jobs/genie.smarthome/SmartHomeDistribution-Nightly-PR/workspace/extensions/binding/org.eclipse.smarthome.binding.lirc/target/classes
[WARNING] /jobs/genie.smarthome/SmartHomeDistribution-Nightly-PR/workspace/extensions/binding/org.eclipse.smarthome.binding.lirc/src/main/java/org/eclipse/smarthome/binding/lirc/internal/discovery/LIRCRemoteDiscoveryService.java:[81] 
	if (thingUID != null) {
	    ^^^^^^^^
Redundant null check: The variable thingUID cannot be null at this location
[WARNING] /jobs/genie.smarthome/SmartHomeDistribution-Nightly-PR/workspace/extensions/binding/org.eclipse.smarthome.binding.lirc/src/main/java/org/eclipse/smarthome/binding/lirc/handler/LIRCRemoteHandler.java:[77] 
	bridgeHandler = (LIRCBridgeHandler) getBridge().getHandler();
	                                    ^^^^^^^^^^^
Potential null pointer access: The method getBridge() may return null
[WARNING] /jobs/genie.smarthome/SmartHomeDistribution-Nightly-PR/workspace/extensions/binding/org.eclipse.smarthome.binding.lirc/src/main/java/org/eclipse/smarthome/binding/lirc/handler/LIRCRemoteHandler.java:[79] 
	if (getBridge().getStatus() == ThingStatus.ONLINE) {
	    ^^^^^^^^^^^
Potential null pointer access: The method getBridge() may return null
3 problems (3 warnings)
[INFO] 
[INFO] --- maven-scr-plugin:1.24.0:scr (generate-scr-scrdescriptor) @ org.eclipse.smarthome.binding.lirc ---
[INFO] Writing 1 Service Component Descriptors to /jobs/genie.smarthome/SmartHomeDistribution-Nightly-PR/workspace/extensions/binding/org.eclipse.smarthome.binding.lirc/target/classes/OSGI-INF/org.eclipse.smarthome.binding.lirc.internal.LIRCHandlerFactory.xml
[INFO] 
[INFO] --- maven-resources-plugin:3.1.0:testResources (default-testResources) @ org.eclipse.smarthome.binding.lirc ---
[INFO] Using 'UTF-8' encoding to copy filtered resources.
[INFO] skip non existing resourceDirectory /jobs/genie.smarthome/SmartHomeDistribution-Nightly-PR/workspace/extensions/binding/org.eclipse.smarthome.binding.lirc/src/test/resources
[INFO] 
[INFO] --- maven-resources-plugin:3.1.0:copy-resources (default) @ org.eclipse.smarthome.binding.lirc ---
[INFO] Using 'UTF-8' encoding to copy filtered resources.
[INFO] Copying 1 resource
[INFO] 
[INFO] --- tycho-source-plugin:1.2.0:plugin-source (plugin-source) @ org.eclipse.smarthome.binding.lirc ---
[INFO] Building jar: /jobs/genie.smarthome/SmartHomeDistribution-Nightly-PR/workspace/extensions/binding/org.eclipse.smarthome.binding.lirc/target/org.eclipse.smarthome.binding.lirc-0.11.0-SNAPSHOT-sources.jar
[INFO] 
[INFO] --- target-platform-configuration:1.2.0:target-platform (default-target-platform) @ org.eclipse.smarthome.binding.lirc ---
[INFO] 
[INFO] --- tycho-packaging-plugin:1.2.0:package-plugin (default-package-plugin) @ org.eclipse.smarthome.binding.lirc ---
[INFO] Building jar: /jobs/genie.smarthome/SmartHomeDistribution-Nightly-PR/workspace/extensions/binding/org.eclipse.smarthome.binding.lirc/target/org.eclipse.smarthome.binding.lirc-0.11.0-SNAPSHOT.jar
[INFO] 
[INFO] --- tycho-p2-plugin:1.2.0:p2-metadata-default (default-p2-metadata-default) @ org.eclipse.smarthome.binding.lirc ---
[INFO] 
[INFO] --- jacoco-maven-plugin:0.7.4.201502262128:prepare-agent-integration (default-prepare-agent-integration) @ org.eclipse.smarthome.binding.lirc ---
[INFO] argLine set to -javaagent:/home/hudson/genie.smarthome/.jenkins/jobs/SmartHomeDistribution-Nightly-PR/workspace/.repository/org/jacoco/org.jacoco.agent/0.7.4.201502262128/org.jacoco.agent-0.7.4.201502262128-runtime.jar=destfile=/jobs/genie.smarthome/SmartHomeDistribution-Nightly-PR/workspace/target/coverage.jacoco,append=true,excludes=**/*Test.*
[INFO] 
[INFO] --- sat-plugin:0.5.0:checkstyle (sat-all) @ org.eclipse.smarthome.binding.lirc ---
[INFO] Adding dependency to checkstyle:0.5.0
[INFO] Adding dependency to checkstyle:8.1
[ERROR] Unable to parse schema 
org.xml.sax.SAXParseException: src-resolve: Cannot resolve the name 'config-description:idRestrictionPattern' to a(n) 'type definition' component.
    at org.apache.xerces.util.ErrorHandlerWrapper.createSAXParseException (Unknown Source)
    at org.apache.xerces.util.ErrorHandlerWrapper.error (Unknown Source)
    at org.apache.xerces.impl.XMLErrorReporter.reportError (Unknown Source)
    at org.apache.xerces.impl.XMLErrorReporter.reportError (Unknown Source)
    at org.apache.xerces.impl.xs.traversers.XSDHandler.reportSchemaError (Unknown Source)
    at org.apache.xerces.impl.xs.traversers.XSDHandler.getGlobalDecl (Unknown Source)
    at org.apache.xerces.impl.xs.traversers.XSDAttributeTraverser.traverseNamedAttr (Unknown Source)
    at org.apache.xerces.impl.xs.traversers.XSDAttributeTraverser.traverseLocal (Unknown Source)
    at org.apache.xerces.impl.xs.traversers.XSDAbstractTraverser.traverseAttrsAndAttrGrps (Unknown Source)
    at org.apache.xerces.impl.xs.traversers.XSDComplexTypeTraverser.processComplexContent (Unknown Source)
    at org.apache.xerces.impl.xs.traversers.XSDComplexTypeTraverser.traverseComplexTypeDecl (Unknown Source)
    at org.apache.xerces.impl.xs.traversers.XSDComplexTypeTraverser.traverseLocal (Unknown Source)
    at org.apache.xerces.impl.xs.traversers.XSDElementTraverser.traverseNamedElement (Unknown Source)
    at org.apache.xerces.impl.xs.traversers.XSDElementTraverser.traverseGlobal (Unknown Source)
    at org.apache.xerces.impl.xs.traversers.XSDHandler.traverseSchemas (Unknown Source)
    at org.apache.xerces.impl.xs.traversers.XSDHandler.parseSchema (Unknown Source)
    at org.apache.xerces.impl.xs.XMLSchemaLoader.loadSchema (Unknown Source)
    at org.apache.xerces.impl.xs.XMLSchemaLoader.loadGrammar (Unknown Source)
    at org.apache.xerces.impl.xs.XMLSchemaLoader.loadGrammar (Unknown Source)
    at org.apache.xerces.jaxp.validation.XMLSchemaFactory.newSchema (Unknown Source)
    at javax.xml.validation.SchemaFactory.newSchema (SchemaFactory.java:638)
    at org.openhab.tools.analysis.checkstyle.EshInfXmlValidationCheck$1.transform (EshInfXmlValidationCheck.java:110)
    at org.openhab.tools.analysis.checkstyle.EshInfXmlValidationCheck$1.transform (EshInfXmlValidationCheck.java:103)
    at org.openhab.tools.analysis.utils.CachingHttpClient.get (CachingHttpClient.java:71)
    at org.openhab.tools.analysis.checkstyle.EshInfXmlValidationCheck.getXSD (EshInfXmlValidationCheck.java:229)
    at org.openhab.tools.analysis.checkstyle.EshInfXmlValidationCheck.beginProcessing (EshInfXmlValidationCheck.java:120)
    at com.puppycrawl.tools.checkstyle.Checker.process (Checker.java:210)
    at org.apache.maven.plugin.checkstyle.exec.DefaultCheckstyleExecutor.executeCheckstyle (DefaultCheckstyleExecutor.java:252)
    at org.apache.maven.plugin.checkstyle.AbstractCheckstyleReport.executeReport (AbstractCheckstyleReport.java:473)
    at org.apache.maven.plugin.checkstyle.CheckstyleReport.executeReport (CheckstyleReport.java:154)
    at org.apache.maven.reporting.AbstractMavenReport.generate (AbstractMavenReport.java:255)
    at org.apache.maven.reporting.AbstractMavenReport.execute (AbstractMavenReport.java:143)
    at org.apache.maven.plugin.DefaultBuildPluginManager.executeMojo (DefaultBuildPluginManager.java:137)
    at org.twdata.maven.mojoexecutor.MojoExecutor.executeMojo (MojoExecutor.java:94)
    at org.openhab.tools.analysis.tools.AbstractChecker.executeCheck (AbstractChecker.java:106)
    at org.openhab.tools.analysis.tools.CheckstyleChecker.execute (CheckstyleChecker.java:123)
    at org.apache.maven.plugin.DefaultBuildPluginManager.executeMojo (DefaultBuildPluginManager.java:137)
    at org.apache.maven.lifecycle.internal.MojoExecutor.execute (MojoExecutor.java:208)
    at org.apache.maven.lifecycle.internal.MojoExecutor.execute (MojoExecutor.java:154)
    at org.apache.maven.lifecycle.internal.MojoExecutor.execute (MojoExecutor.java:146)
    at org.apache.maven.lifecycle.internal.LifecycleModuleBuilder.buildProject (LifecycleModuleBuilder.java:117)
    at org.apache.maven.lifecycle.internal.LifecycleModuleBuilder.buildProject (LifecycleModuleBuilder.java:81)
    at org.apache.maven.lifecycle.internal.builder.singlethreaded.SingleThreadedBuilder.build (SingleThreadedBuilder.java:56)
    at org.apache.maven.lifecycle.internal.LifecycleStarter.execute (LifecycleStarter.java:128)
    at org.apache.maven.DefaultMaven.doExecute (DefaultMaven.java:305)
    at org.apache.maven.DefaultMaven.doExecute (DefaultMaven.java:192)
    at org.apache.maven.DefaultMaven.execute (DefaultMaven.java:105)
    at org.apache.maven.cli.MavenCli.execute (MavenCli.java:954)
    at org.apache.maven.cli.MavenCli.doMain (MavenCli.java:288)
    at org.apache.maven.cli.MavenCli.main (MavenCli.java:192)
    at sun.reflect.NativeMethodAccessorImpl.invoke0 (Native Method)
    at sun.reflect.NativeMethodAccessorImpl.invoke (NativeMethodAccessorImpl.java:62)
    at sun.reflect.DelegatingMethodAccessorImpl.invoke (DelegatingMethodAccessorImpl.java:43)
    at java.lang.reflect.Method.invoke (Method.java:498)
    at org.codehaus.plexus.classworlds.launcher.Launcher.launchEnhanced (Launcher.java:289)
    at org.codehaus.plexus.classworlds.launcher.Launcher.launch (Launcher.java:229)
    at org.codehaus.plexus.classworlds.launcher.Launcher.mainWithExitCode (Launcher.java:415)
    at org.codehaus.plexus.classworlds.launcher.Launcher.main (Launcher.java:356)
[WARNING] XML validation will be skipped as the schema file download failed.
[WARNING] XML validation will be skipped as the schema file download failed.
[WARNING] XML validation will be skipped as the schema file download failed.
[WARNING] KarafFeatureCheck will be skipped. Could not find file features/openhab-addons/src/main/feature/feature.xml
[INFO] 
[INFO] --- sat-plugin:0.5.0:pmd (sat-all) @ org.eclipse.smarthome.binding.lirc ---
[INFO] Adding dependency to pmd:0.5.0
[INFO] Adding dependency to pmd-core:5.8.1
[INFO] Adding dependency to pmd-java:5.8.1
[INFO] Adding dependency to pmd-javascript:5.8.1
[INFO] Adding dependency to pmd-jsp:5.8.1
[INFO] 
[INFO] --- sat-plugin:0.5.0:spotbugs (sat-all) @ org.eclipse.smarthome.binding.lirc ---
[INFO] Adding dependency to findbugs:0.5.0
[INFO] Adding dependency to bug-pattern:1.2.4
[INFO] Adding dependency to spotbugs:3.1.2
[INFO] Fork Value is false
     [java] JVM args ignored when same JVM is used.
[INFO] Done SpotBugs Analysis....
[INFO] 
[INFO] --- sat-plugin:0.5.0:report (sat-all) @ org.eclipse.smarthome.binding.lirc ---
[INFO] Individual report appended to summary report.
[WARNING] Code Analysis Tool has found: 
 0 error(s)! 
 6 warning(s) 
 0 info(s)
[WARNING] org.eclipse.smarthome.binding.lirc.internal.LIRCMessageListener.java:[22]
First javadoc author should have "Initial contribution" contribution description.
[WARNING] org.eclipse.smarthome.binding.lirc.internal.LIRCResponseException.java:[18]
First javadoc author should have "Initial contribution" contribution description.
[WARNING] org.eclipse.smarthome.binding.lirc.internal.connector.LIRCConnector.java:[34]
First javadoc author should have "Initial contribution" contribution description.
[WARNING] org.eclipse.smarthome.binding.lirc.internal.connector.LIRCEventListener.java:[21]
First javadoc author should have "Initial contribution" contribution description.
[WARNING] org.eclipse.smarthome.binding.lirc.internal.connector.LIRCStreamReader.java:[35]
First javadoc author should have "Initial contribution" contribution description.
[WARNING] /jobs/genie.smarthome/SmartHomeDistribution-Nightly-PR/workspace/extensions/binding/org.eclipse.smarthome.binding.lirc/ESH-INF/thing/bridge.xml:[0]
Unused bridge reference with id - bridge
[INFO] Detailed report can be found at: file:////jobs/genie.smarthome/SmartHomeDistribution-Nightly-PR/workspace/extensions/binding/org.eclipse.smarthome.binding.lirc/target/code-analysis/report.html
[INFO] 
[INFO] --- maven-install-plugin:2.5.2:install (default-install) @ org.eclipse.smarthome.binding.lirc ---
[INFO] Installing /jobs/genie.smarthome/SmartHomeDistribution-Nightly-PR/workspace/extensions/binding/org.eclipse.smarthome.binding.lirc/target/org.eclipse.smarthome.binding.lirc-0.11.0-SNAPSHOT.jar to /home/hudson/genie.smarthome/.jenkins/jobs/SmartHomeDistribution-Nightly-PR/workspace/.repository/org/eclipse/smarthome/binding/org.eclipse.smarthome.binding.lirc/0.11.0-SNAPSHOT/org.eclipse.smarthome.binding.lirc-0.11.0-SNAPSHOT.jar
[INFO] Installing /jobs/genie.smarthome/SmartHomeDistribution-Nightly-PR/workspace/extensions/binding/org.eclipse.smarthome.binding.lirc/pom.xml to /home/hudson/genie.smarthome/.jenkins/jobs/SmartHomeDistribution-Nightly-PR/workspace/.repository/org/eclipse/smarthome/binding/org.eclipse.smarthome.binding.lirc/0.11.0-SNAPSHOT/org.eclipse.smarthome.binding.lirc-0.11.0-SNAPSHOT.pom
[INFO] Installing /jobs/genie.smarthome/SmartHomeDistribution-Nightly-PR/workspace/extensions/binding/org.eclipse.smarthome.binding.lirc/target/org.eclipse.smarthome.binding.lirc-0.11.0-SNAPSHOT-sources.jar to /home/hudson/genie.smarthome/.jenkins/jobs/SmartHomeDistribution-Nightly-PR/workspace/.repository/org/eclipse/smarthome/binding/org.eclipse.smarthome.binding.lirc/0.11.0-SNAPSHOT/org.eclipse.smarthome.binding.lirc-0.11.0-SNAPSHOT-sources.jar
[INFO] Installing /jobs/genie.smarthome/SmartHomeDistribution-Nightly-PR/workspace/extensions/binding/org.eclipse.smarthome.binding.lirc/target/p2content.xml to /home/hudson/genie.smarthome/.jenkins/jobs/SmartHomeDistribution-Nightly-PR/workspace/.repository/org/eclipse/smarthome/binding/org.eclipse.smarthome.binding.lirc/0.11.0-SNAPSHOT/org.eclipse.smarthome.binding.lirc-0.11.0-SNAPSHOT-p2metadata.xml
[INFO] Installing /jobs/genie.smarthome/SmartHomeDistribution-Nightly-PR/workspace/extensions/binding/org.eclipse.smarthome.binding.lirc/target/p2artifacts.xml to /home/hudson/genie.smarthome/.jenkins/jobs/SmartHomeDistribution-Nightly-PR/workspace/.repository/org/eclipse/smarthome/binding/org.eclipse.smarthome.binding.lirc/0.11.0-SNAPSHOT/org.eclipse.smarthome.binding.lirc-0.11.0-SNAPSHOT-p2artifacts.xml
[INFO] 
[INFO] --- tycho-p2-plugin:1.2.0:update-local-index (default-update-local-index) @ org.eclipse.smarthome.binding.lirc ---
[INFO] 
[INFO] --< org.eclipse.smarthome.binding:org.eclipse.smarthome.binding.meteoblue >--
[INFO] Building Eclipse SmartHome meteoblue Binding 0.11.0-SNAPSHOT   [173/249]
[INFO] ---------------------------[ eclipse-plugin ]---------------------------
[INFO] 
[INFO] --- maven-clean-plugin:2.5:clean (default-clean) @ org.eclipse.smarthome.binding.meteoblue ---
[INFO] Deleting /jobs/genie.smarthome/SmartHomeDistribution-Nightly-PR/workspace/extensions/binding/org.eclipse.smarthome.binding.meteoblue/OSGI-INF (includes = [**], excludes = [.gitignore])
[INFO] 
[INFO] --- tycho-packaging-plugin:1.2.0:build-qualifier (default-build-qualifier) @ org.eclipse.smarthome.binding.meteoblue ---
[INFO] The project's OSGi version is 0.11.0.201901311108
[INFO] 
[INFO] --- tycho-packaging-plugin:1.2.0:validate-id (default-validate-id) @ org.eclipse.smarthome.binding.meteoblue ---
[INFO] 
[INFO] --- tycho-packaging-plugin:1.2.0:validate-version (default-validate-version) @ org.eclipse.smarthome.binding.meteoblue ---
[INFO] 
[INFO] --- directory-maven-plugin:0.2:highest-basedir (directories) @ org.eclipse.smarthome.binding.meteoblue ---
[INFO] Highest basedir set to: /jobs/genie.smarthome/SmartHomeDistribution-Nightly-PR/workspace
[INFO] 
[INFO] --- jacoco-maven-plugin:0.7.4.201502262128:prepare-agent (default-prepare-agent) @ org.eclipse.smarthome.binding.meteoblue ---
[INFO] argLine set to -javaagent:/home/hudson/genie.smarthome/.jenkins/jobs/SmartHomeDistribution-Nightly-PR/workspace/.repository/org/jacoco/org.jacoco.agent/0.7.4.201502262128/org.jacoco.agent-0.7.4.201502262128-runtime.jar=destfile=/jobs/genie.smarthome/SmartHomeDistribution-Nightly-PR/workspace/target/coverage.jacoco,append=true,excludes=**/*Test.*
[INFO] 
[INFO] --- maven-resources-plugin:3.1.0:resources (default-resources) @ org.eclipse.smarthome.binding.meteoblue ---
[INFO] Using 'UTF-8' encoding to copy filtered resources.
[INFO] skip non existing resourceDirectory /jobs/genie.smarthome/SmartHomeDistribution-Nightly-PR/workspace/extensions/binding/org.eclipse.smarthome.binding.meteoblue/src/main/resources
[INFO] 
[INFO] --- tycho-compiler-plugin:1.2.0:compile (default-compile) @ org.eclipse.smarthome.binding.meteoblue ---
[INFO] Compiling 11 source files to /jobs/genie.smarthome/SmartHomeDistribution-Nightly-PR/workspace/extensions/binding/org.eclipse.smarthome.binding.meteoblue/target/classes
[INFO] 
[INFO] --- maven-scr-plugin:1.24.0:scr (generate-scr-scrdescriptor) @ org.eclipse.smarthome.binding.meteoblue ---
[INFO] Writing 1 Service Component Descriptors to /jobs/genie.smarthome/SmartHomeDistribution-Nightly-PR/workspace/extensions/binding/org.eclipse.smarthome.binding.meteoblue/target/classes/OSGI-INF/org.eclipse.smarthome.binding.meteoblue.internal.MeteoBlueHandlerFactory.xml
[INFO] 
[INFO] --- maven-resources-plugin:3.1.0:testResources (default-testResources) @ org.eclipse.smarthome.binding.meteoblue ---
[INFO] Using 'UTF-8' encoding to copy filtered resources.
[INFO] skip non existing resourceDirectory /jobs/genie.smarthome/SmartHomeDistribution-Nightly-PR/workspace/extensions/binding/org.eclipse.smarthome.binding.meteoblue/src/test/resources
[INFO] 
[INFO] --- maven-resources-plugin:3.1.0:copy-resources (default) @ org.eclipse.smarthome.binding.meteoblue ---
[INFO] Using 'UTF-8' encoding to copy filtered resources.
[INFO] Copying 1 resource
[INFO] 
[INFO] --- tycho-source-plugin:1.2.0:plugin-source (plugin-source) @ org.eclipse.smarthome.binding.meteoblue ---
[INFO] Building jar: /jobs/genie.smarthome/SmartHomeDistribution-Nightly-PR/workspace/extensions/binding/org.eclipse.smarthome.binding.meteoblue/target/org.eclipse.smarthome.binding.meteoblue-0.11.0-SNAPSHOT-sources.jar
[INFO] 
[INFO] --- target-platform-configuration:1.2.0:target-platform (default-target-platform) @ org.eclipse.smarthome.binding.meteoblue ---
[INFO] 
[INFO] --- tycho-packaging-plugin:1.2.0:package-plugin (default-package-plugin) @ org.eclipse.smarthome.binding.meteoblue ---
[INFO] Building jar: /jobs/genie.smarthome/SmartHomeDistribution-Nightly-PR/workspace/extensions/binding/org.eclipse.smarthome.binding.meteoblue/target/org.eclipse.smarthome.binding.meteoblue-0.11.0-SNAPSHOT.jar
[INFO] 
[INFO] --- tycho-p2-plugin:1.2.0:p2-metadata-default (default-p2-metadata-default) @ org.eclipse.smarthome.binding.meteoblue ---
[INFO] 
[INFO] --- jacoco-maven-plugin:0.7.4.201502262128:prepare-agent-integration (default-prepare-agent-integration) @ org.eclipse.smarthome.binding.meteoblue ---
[INFO] argLine set to -javaagent:/home/hudson/genie.smarthome/.jenkins/jobs/SmartHomeDistribution-Nightly-PR/workspace/.repository/org/jacoco/org.jacoco.agent/0.7.4.201502262128/org.jacoco.agent-0.7.4.201502262128-runtime.jar=destfile=/jobs/genie.smarthome/SmartHomeDistribution-Nightly-PR/workspace/target/coverage.jacoco,append=true,excludes=**/*Test.*
[INFO] 
[INFO] --- sat-plugin:0.5.0:checkstyle (sat-all) @ org.eclipse.smarthome.binding.meteoblue ---
[INFO] Adding dependency to checkstyle:0.5.0
[INFO] Adding dependency to checkstyle:8.1
[ERROR] Unable to parse schema 
org.xml.sax.SAXParseException: src-resolve: Cannot resolve the name 'config-description:idRestrictionPattern' to a(n) 'type definition' component.
    at org.apache.xerces.util.ErrorHandlerWrapper.createSAXParseException (Unknown Source)
    at org.apache.xerces.util.ErrorHandlerWrapper.error (Unknown Source)
    at org.apache.xerces.impl.XMLErrorReporter.reportError (Unknown Source)
    at org.apache.xerces.impl.XMLErrorReporter.reportError (Unknown Source)
    at org.apache.xerces.impl.xs.traversers.XSDHandler.reportSchemaError (Unknown Source)
    at org.apache.xerces.impl.xs.traversers.XSDHandler.getGlobalDecl (Unknown Source)
    at org.apache.xerces.impl.xs.traversers.XSDAttributeTraverser.traverseNamedAttr (Unknown Source)
    at org.apache.xerces.impl.xs.traversers.XSDAttributeTraverser.traverseLocal (Unknown Source)
    at org.apache.xerces.impl.xs.traversers.XSDAbstractTraverser.traverseAttrsAndAttrGrps (Unknown Source)
    at org.apache.xerces.impl.xs.traversers.XSDComplexTypeTraverser.processComplexContent (Unknown Source)
    at org.apache.xerces.impl.xs.traversers.XSDComplexTypeTraverser.traverseComplexTypeDecl (Unknown Source)
    at org.apache.xerces.impl.xs.traversers.XSDComplexTypeTraverser.traverseLocal (Unknown Source)
    at org.apache.xerces.impl.xs.traversers.XSDElementTraverser.traverseNamedElement (Unknown Source)
    at org.apache.xerces.impl.xs.traversers.XSDElementTraverser.traverseGlobal (Unknown Source)
    at org.apache.xerces.impl.xs.traversers.XSDHandler.traverseSchemas (Unknown Source)
    at org.apache.xerces.impl.xs.traversers.XSDHandler.parseSchema (Unknown Source)
    at org.apache.xerces.impl.xs.XMLSchemaLoader.loadSchema (Unknown Source)
    at org.apache.xerces.impl.xs.XMLSchemaLoader.loadGrammar (Unknown Source)
    at org.apache.xerces.impl.xs.XMLSchemaLoader.loadGrammar (Unknown Source)
    at org.apache.xerces.jaxp.validation.XMLSchemaFactory.newSchema (Unknown Source)
    at javax.xml.validation.SchemaFactory.newSchema (SchemaFactory.java:638)
    at org.openhab.tools.analysis.checkstyle.EshInfXmlValidationCheck$1.transform (EshInfXmlValidationCheck.java:110)
    at org.openhab.tools.analysis.checkstyle.EshInfXmlValidationCheck$1.transform (EshInfXmlValidationCheck.java:103)
    at org.openhab.tools.analysis.utils.CachingHttpClient.get (CachingHttpClient.java:71)
    at org.openhab.tools.analysis.checkstyle.EshInfXmlValidationCheck.getXSD (EshInfXmlValidationCheck.java:229)
    at org.openhab.tools.analysis.checkstyle.EshInfXmlValidationCheck.beginProcessing (EshInfXmlValidationCheck.java:120)
    at com.puppycrawl.tools.checkstyle.Checker.process (Checker.java:210)
    at org.apache.maven.plugin.checkstyle.exec.DefaultCheckstyleExecutor.executeCheckstyle (DefaultCheckstyleExecutor.java:252)
    at org.apache.maven.plugin.checkstyle.AbstractCheckstyleReport.executeReport (AbstractCheckstyleReport.java:473)
    at org.apache.maven.plugin.checkstyle.CheckstyleReport.executeReport (CheckstyleReport.java:154)
    at org.apache.maven.reporting.AbstractMavenReport.generate (AbstractMavenReport.java:255)
    at org.apache.maven.reporting.AbstractMavenReport.execute (AbstractMavenReport.java:143)
    at org.apache.maven.plugin.DefaultBuildPluginManager.executeMojo (DefaultBuildPluginManager.java:137)
    at org.twdata.maven.mojoexecutor.MojoExecutor.executeMojo (MojoExecutor.java:94)
    at org.openhab.tools.analysis.tools.AbstractChecker.executeCheck (AbstractChecker.java:106)
    at org.openhab.tools.analysis.tools.CheckstyleChecker.execute (CheckstyleChecker.java:123)
    at org.apache.maven.plugin.DefaultBuildPluginManager.executeMojo (DefaultBuildPluginManager.java:137)
    at org.apache.maven.lifecycle.internal.MojoExecutor.execute (MojoExecutor.java:208)
    at org.apache.maven.lifecycle.internal.MojoExecutor.execute (MojoExecutor.java:154)
    at org.apache.maven.lifecycle.internal.MojoExecutor.execute (MojoExecutor.java:146)
    at org.apache.maven.lifecycle.internal.LifecycleModuleBuilder.buildProject (LifecycleModuleBuilder.java:117)
    at org.apache.maven.lifecycle.internal.LifecycleModuleBuilder.buildProject (LifecycleModuleBuilder.java:81)
    at org.apache.maven.lifecycle.internal.builder.singlethreaded.SingleThreadedBuilder.build (SingleThreadedBuilder.java:56)
    at org.apache.maven.lifecycle.internal.LifecycleStarter.execute (LifecycleStarter.java:128)
    at org.apache.maven.DefaultMaven.doExecute (DefaultMaven.java:305)
    at org.apache.maven.DefaultMaven.doExecute (DefaultMaven.java:192)
    at org.apache.maven.DefaultMaven.execute (DefaultMaven.java:105)
    at org.apache.maven.cli.MavenCli.execute (MavenCli.java:954)
    at org.apache.maven.cli.MavenCli.doMain (MavenCli.java:288)
    at org.apache.maven.cli.MavenCli.main (MavenCli.java:192)
    at sun.reflect.NativeMethodAccessorImpl.invoke0 (Native Method)
    at sun.reflect.NativeMethodAccessorImpl.invoke (NativeMethodAccessorImpl.java:62)
    at sun.reflect.DelegatingMethodAccessorImpl.invoke (DelegatingMethodAccessorImpl.java:43)
    at java.lang.reflect.Method.invoke (Method.java:498)
    at org.codehaus.plexus.classworlds.launcher.Launcher.launchEnhanced (Launcher.java:289)
    at org.codehaus.plexus.classworlds.launcher.Launcher.launch (Launcher.java:229)
    at org.codehaus.plexus.classworlds.launcher.Launcher.mainWithExitCode (Launcher.java:415)
    at org.codehaus.plexus.classworlds.launcher.Launcher.main (Launcher.java:356)
[WARNING] XML validation will be skipped as the schema file download failed.
[WARNING] XML validation will be skipped as the schema file download failed.
[WARNING] XML validation will be skipped as the schema file download failed.
[WARNING] KarafFeatureCheck will be skipped. Could not find file features/openhab-addons/src/main/feature/feature.xml
[INFO] 
[INFO] --- sat-plugin:0.5.0:pmd (sat-all) @ org.eclipse.smarthome.binding.meteoblue ---
[INFO] Adding dependency to pmd:0.5.0
[INFO] Adding dependency to pmd-core:5.8.1
[INFO] Adding dependency to pmd-java:5.8.1
[INFO] Adding dependency to pmd-javascript:5.8.1
[INFO] Adding dependency to pmd-jsp:5.8.1
[INFO] 
[INFO] --- sat-plugin:0.5.0:spotbugs (sat-all) @ org.eclipse.smarthome.binding.meteoblue ---
[INFO] Adding dependency to findbugs:0.5.0
[INFO] Adding dependency to bug-pattern:1.2.4
[INFO] Adding dependency to spotbugs:3.1.2
[INFO] Fork Value is false
     [java] JVM args ignored when same JVM is used.
[INFO] Done SpotBugs Analysis....
[INFO] 
[INFO] --- sat-plugin:0.5.0:report (sat-all) @ org.eclipse.smarthome.binding.meteoblue ---
[INFO] Individual report appended to summary report.
[INFO] Detailed report can be found at: file:////jobs/genie.smarthome/SmartHomeDistribution-Nightly-PR/workspace/extensions/binding/org.eclipse.smarthome.binding.meteoblue/target/code-analysis/report.html
[INFO] 
[INFO] --- maven-install-plugin:2.5.2:install (default-install) @ org.eclipse.smarthome.binding.meteoblue ---
[INFO] Installing /jobs/genie.smarthome/SmartHomeDistribution-Nightly-PR/workspace/extensions/binding/org.eclipse.smarthome.binding.meteoblue/target/org.eclipse.smarthome.binding.meteoblue-0.11.0-SNAPSHOT.jar to /home/hudson/genie.smarthome/.jenkins/jobs/SmartHomeDistribution-Nightly-PR/workspace/.repository/org/eclipse/smarthome/binding/org.eclipse.smarthome.binding.meteoblue/0.11.0-SNAPSHOT/org.eclipse.smarthome.binding.meteoblue-0.11.0-SNAPSHOT.jar
[INFO] Installing /jobs/genie.smarthome/SmartHomeDistribution-Nightly-PR/workspace/extensions/binding/org.eclipse.smarthome.binding.meteoblue/pom.xml to /home/hudson/genie.smarthome/.jenkins/jobs/SmartHomeDistribution-Nightly-PR/workspace/.repository/org/eclipse/smarthome/binding/org.eclipse.smarthome.binding.meteoblue/0.11.0-SNAPSHOT/org.eclipse.smarthome.binding.meteoblue-0.11.0-SNAPSHOT.pom
[INFO] Installing /jobs/genie.smarthome/SmartHomeDistribution-Nightly-PR/workspace/extensions/binding/org.eclipse.smarthome.binding.meteoblue/target/org.eclipse.smarthome.binding.meteoblue-0.11.0-SNAPSHOT-sources.jar to /home/hudson/genie.smarthome/.jenkins/jobs/SmartHomeDistribution-Nightly-PR/workspace/.repository/org/eclipse/smarthome/binding/org.eclipse.smarthome.binding.meteoblue/0.11.0-SNAPSHOT/org.eclipse.smarthome.binding.meteoblue-0.11.0-SNAPSHOT-sources.jar
[INFO] Installing /jobs/genie.smarthome/SmartHomeDistribution-Nightly-PR/workspace/extensions/binding/org.eclipse.smarthome.binding.meteoblue/target/p2content.xml to /home/hudson/genie.smarthome/.jenkins/jobs/SmartHomeDistribution-Nightly-PR/workspace/.repository/org/eclipse/smarthome/binding/org.eclipse.smarthome.binding.meteoblue/0.11.0-SNAPSHOT/org.eclipse.smarthome.binding.meteoblue-0.11.0-SNAPSHOT-p2metadata.xml
[INFO] Installing /jobs/genie.smarthome/SmartHomeDistribution-Nightly-PR/workspace/extensions/binding/org.eclipse.smarthome.binding.meteoblue/target/p2artifacts.xml to /home/hudson/genie.smarthome/.jenkins/jobs/SmartHomeDistribution-Nightly-PR/workspace/.repository/org/eclipse/smarthome/binding/org.eclipse.smarthome.binding.meteoblue/0.11.0-SNAPSHOT/org.eclipse.smarthome.binding.meteoblue-0.11.0-SNAPSHOT-p2artifacts.xml
[INFO] 
[INFO] --- tycho-p2-plugin:1.2.0:update-local-index (default-update-local-index) @ org.eclipse.smarthome.binding.meteoblue ---
[INFO] 
[INFO] --< org.eclipse.smarthome.binding:org.eclipse.smarthome.binding.mqtt >--
[INFO] Building Eclipse SmartHome MQTT Binding 0.11.0-SNAPSHOT        [174/249]
[INFO] ---------------------------[ eclipse-plugin ]---------------------------
[INFO] 
[INFO] --- maven-clean-plugin:2.5:clean (default-clean) @ org.eclipse.smarthome.binding.mqtt ---
[INFO] Deleting /jobs/genie.smarthome/SmartHomeDistribution-Nightly-PR/workspace/extensions/binding/org.eclipse.smarthome.binding.mqtt/OSGI-INF (includes = [**], excludes = [.gitignore])
[INFO] 
[INFO] --- tycho-packaging-plugin:1.2.0:build-qualifier (default-build-qualifier) @ org.eclipse.smarthome.binding.mqtt ---
[INFO] The project's OSGi version is 0.11.0.201901311108
[INFO] 
[INFO] --- tycho-packaging-plugin:1.2.0:validate-id (default-validate-id) @ org.eclipse.smarthome.binding.mqtt ---
[INFO] 
[INFO] --- tycho-packaging-plugin:1.2.0:validate-version (default-validate-version) @ org.eclipse.smarthome.binding.mqtt ---
[INFO] 
[INFO] --- directory-maven-plugin:0.2:highest-basedir (directories) @ org.eclipse.smarthome.binding.mqtt ---
[INFO] Highest basedir set to: /jobs/genie.smarthome/SmartHomeDistribution-Nightly-PR/workspace
[INFO] 
[INFO] --- jacoco-maven-plugin:0.7.4.201502262128:prepare-agent (default-prepare-agent) @ org.eclipse.smarthome.binding.mqtt ---
[INFO] argLine set to -javaagent:/home/hudson/genie.smarthome/.jenkins/jobs/SmartHomeDistribution-Nightly-PR/workspace/.repository/org/jacoco/org.jacoco.agent/0.7.4.201502262128/org.jacoco.agent-0.7.4.201502262128-runtime.jar=destfile=/jobs/genie.smarthome/SmartHomeDistribution-Nightly-PR/workspace/target/coverage.jacoco,append=true,excludes=**/*Test.*
[INFO] 
[INFO] --- maven-resources-plugin:3.1.0:resources (default-resources) @ org.eclipse.smarthome.binding.mqtt ---
[INFO] Using 'UTF-8' encoding to copy filtered resources.
[INFO] skip non existing resourceDirectory /jobs/genie.smarthome/SmartHomeDistribution-Nightly-PR/workspace/extensions/binding/org.eclipse.smarthome.binding.mqtt/src/main/resources
[INFO] 
[INFO] --- tycho-compiler-plugin:1.2.0:compile (default-compile) @ org.eclipse.smarthome.binding.mqtt ---
[INFO] Compiling 21 source files to /jobs/genie.smarthome/SmartHomeDistribution-Nightly-PR/workspace/extensions/binding/org.eclipse.smarthome.binding.mqtt/target/classes
[WARNING] /jobs/genie.smarthome/SmartHomeDistribution-Nightly-PR/workspace/extensions/binding/org.eclipse.smarthome.binding.mqtt/src/main/java/org/eclipse/smarthome/binding/mqtt/handler/BrokerHandler.java:[205] 
	connection.setReconnectStrategy(new PeriodicReconnectStrategy(config.reconnectTime, 10000));
	                                                              ^^^^^^^^^^^^^^^^^^^^
Potential null pointer access: This expression of type Integer may be null but requires auto-unboxing
1 problem (1 warning)
[INFO] 
[INFO] --- maven-scr-plugin:1.24.0:scr (generate-scr-scrdescriptor) @ org.eclipse.smarthome.binding.mqtt ---
[INFO] Writing 1 Service Component Descriptors to /jobs/genie.smarthome/SmartHomeDistribution-Nightly-PR/workspace/extensions/binding/org.eclipse.smarthome.binding.mqtt/target/classes/OSGI-INF/org.eclipse.smarthome.binding.mqtt.internal.MqttBrokerHandlerFactory.xml
[INFO] Writing 1 Service Component Descriptors to /jobs/genie.smarthome/SmartHomeDistribution-Nightly-PR/workspace/extensions/binding/org.eclipse.smarthome.binding.mqtt/target/classes/OSGI-INF/org.eclipse.smarthome.binding.mqtt.internal.discovery.MqttServiceDiscoveryService.xml
[INFO] 
[INFO] --- maven-resources-plugin:3.1.0:testResources (default-testResources) @ org.eclipse.smarthome.binding.mqtt ---
[INFO] Using 'UTF-8' encoding to copy filtered resources.
[INFO] skip non existing resourceDirectory /jobs/genie.smarthome/SmartHomeDistribution-Nightly-PR/workspace/extensions/binding/org.eclipse.smarthome.binding.mqtt/src/test/resources
[INFO] 
[INFO] --- maven-resources-plugin:3.1.0:copy-resources (default) @ org.eclipse.smarthome.binding.mqtt ---
[INFO] Using 'UTF-8' encoding to copy filtered resources.
[INFO] Copying 2 resources
[INFO] 
[INFO] --- tycho-source-plugin:1.2.0:plugin-source (plugin-source) @ org.eclipse.smarthome.binding.mqtt ---
[INFO] Building jar: /jobs/genie.smarthome/SmartHomeDistribution-Nightly-PR/workspace/extensions/binding/org.eclipse.smarthome.binding.mqtt/target/org.eclipse.smarthome.binding.mqtt-0.11.0-SNAPSHOT-sources.jar
[INFO] 
[INFO] --- target-platform-configuration:1.2.0:target-platform (default-target-platform) @ org.eclipse.smarthome.binding.mqtt ---
[INFO] 
[INFO] --- tycho-packaging-plugin:1.2.0:package-plugin (default-package-plugin) @ org.eclipse.smarthome.binding.mqtt ---
[INFO] Building jar: /jobs/genie.smarthome/SmartHomeDistribution-Nightly-PR/workspace/extensions/binding/org.eclipse.smarthome.binding.mqtt/target/org.eclipse.smarthome.binding.mqtt-0.11.0-SNAPSHOT.jar
[INFO] 
[INFO] --- tycho-p2-plugin:1.2.0:p2-metadata-default (default-p2-metadata-default) @ org.eclipse.smarthome.binding.mqtt ---
[INFO] 
[INFO] --- jacoco-maven-plugin:0.7.4.201502262128:prepare-agent-integration (default-prepare-agent-integration) @ org.eclipse.smarthome.binding.mqtt ---
[INFO] argLine set to -javaagent:/home/hudson/genie.smarthome/.jenkins/jobs/SmartHomeDistribution-Nightly-PR/workspace/.repository/org/jacoco/org.jacoco.agent/0.7.4.201502262128/org.jacoco.agent-0.7.4.201502262128-runtime.jar=destfile=/jobs/genie.smarthome/SmartHomeDistribution-Nightly-PR/workspace/target/coverage.jacoco,append=true,excludes=**/*Test.*
[INFO] 
[INFO] --- sat-plugin:0.5.0:checkstyle (sat-all) @ org.eclipse.smarthome.binding.mqtt ---
[INFO] Adding dependency to checkstyle:0.5.0
[INFO] Adding dependency to checkstyle:8.1
[ERROR] Unable to get about.html file from https://raw.githubusercontent.com/openhab/openhab2-addons/master/src/etc/about.html : Unable to get https://raw.githubusercontent.com/openhab/openhab2-addons/master/src/etc/about.html
java.io.IOException: Unable to get https://raw.githubusercontent.com/openhab/openhab2-addons/master/src/etc/about.html
    at org.openhab.tools.analysis.utils.CachingHttpClient.get (CachingHttpClient.java:69)
    at org.openhab.tools.analysis.checkstyle.AboutHtmlCheck.beginProcessing (AboutHtmlCheck.java:72)
    at com.puppycrawl.tools.checkstyle.Checker.process (Checker.java:210)
    at org.apache.maven.plugin.checkstyle.exec.DefaultCheckstyleExecutor.executeCheckstyle (DefaultCheckstyleExecutor.java:252)
    at org.apache.maven.plugin.checkstyle.AbstractCheckstyleReport.executeReport (AbstractCheckstyleReport.java:473)
    at org.apache.maven.plugin.checkstyle.CheckstyleReport.executeReport (CheckstyleReport.java:154)
    at org.apache.maven.reporting.AbstractMavenReport.generate (AbstractMavenReport.java:255)
    at org.apache.maven.reporting.AbstractMavenReport.execute (AbstractMavenReport.java:143)
    at org.apache.maven.plugin.DefaultBuildPluginManager.executeMojo (DefaultBuildPluginManager.java:137)
    at org.twdata.maven.mojoexecutor.MojoExecutor.executeMojo (MojoExecutor.java:94)
    at org.openhab.tools.analysis.tools.AbstractChecker.executeCheck (AbstractChecker.java:106)
    at org.openhab.tools.analysis.tools.CheckstyleChecker.execute (CheckstyleChecker.java:123)
    at org.apache.maven.plugin.DefaultBuildPluginManager.executeMojo (DefaultBuildPluginManager.java:137)
    at org.apache.maven.lifecycle.internal.MojoExecutor.execute (MojoExecutor.java:208)
    at org.apache.maven.lifecycle.internal.MojoExecutor.execute (MojoExecutor.java:154)
    at org.apache.maven.lifecycle.internal.MojoExecutor.execute (MojoExecutor.java:146)
    at org.apache.maven.lifecycle.internal.LifecycleModuleBuilder.buildProject (LifecycleModuleBuilder.java:117)
    at org.apache.maven.lifecycle.internal.LifecycleModuleBuilder.buildProject (LifecycleModuleBuilder.java:81)
    at org.apache.maven.lifecycle.internal.builder.singlethreaded.SingleThreadedBuilder.build (SingleThreadedBuilder.java:56)
    at org.apache.maven.lifecycle.internal.LifecycleStarter.execute (LifecycleStarter.java:128)
    at org.apache.maven.DefaultMaven.doExecute (DefaultMaven.java:305)
    at org.apache.maven.DefaultMaven.doExecute (DefaultMaven.java:192)
    at org.apache.maven.DefaultMaven.execute (DefaultMaven.java:105)
    at org.apache.maven.cli.MavenCli.execute (MavenCli.java:954)
    at org.apache.maven.cli.MavenCli.doMain (MavenCli.java:288)
    at org.apache.maven.cli.MavenCli.main (MavenCli.java:192)
    at sun.reflect.NativeMethodAccessorImpl.invoke0 (Native Method)
    at sun.reflect.NativeMethodAccessorImpl.invoke (NativeMethodAccessorImpl.java:62)
    at sun.reflect.DelegatingMethodAccessorImpl.invoke (DelegatingMethodAccessorImpl.java:43)
    at java.lang.reflect.Method.invoke (Method.java:498)
    at org.codehaus.plexus.classworlds.launcher.Launcher.launchEnhanced (Launcher.java:289)
    at org.codehaus.plexus.classworlds.launcher.Launcher.launch (Launcher.java:229)
    at org.codehaus.plexus.classworlds.launcher.Launcher.mainWithExitCode (Launcher.java:415)
    at org.codehaus.plexus.classworlds.launcher.Launcher.main (Launcher.java:356)
Caused by: java.io.FileNotFoundException: https://raw.githubusercontent.com/openhab/openhab2-addons/master/src/etc/about.html
    at sun.net.www.protocol.http.HttpURLConnection.getInputStream0 (HttpURLConnection.java:1890)
    at sun.net.www.protocol.http.HttpURLConnection.getInputStream (HttpURLConnection.java:1492)
    at sun.net.www.protocol.https.HttpsURLConnectionImpl.getInputStream (HttpsURLConnectionImpl.java:263)
    at org.openhab.tools.analysis.utils.CachingHttpClient.getContent (CachingHttpClient.java:76)
    at org.openhab.tools.analysis.utils.CachingHttpClient.lambda$get$0 (CachingHttpClient.java:66)
    at com.google.common.cache.LocalCache$LocalManualCache$1.load (LocalCache.java:5058)
    at com.google.common.cache.LocalCache$LoadingValueReference.loadFuture (LocalCache.java:3708)
    at com.google.common.cache.LocalCache$Segment.loadSync (LocalCache.java:2416)
    at com.google.common.cache.LocalCache$Segment.lockedGetOrLoad (LocalCache.java:2299)
    at com.google.common.cache.LocalCache$Segment.get (LocalCache.java:2212)
    at com.google.common.cache.LocalCache.get (LocalCache.java:4147)
    at com.google.common.cache.LocalCache$LocalManualCache.get (LocalCache.java:5053)
    at org.openhab.tools.analysis.utils.CachingHttpClient.get (CachingHttpClient.java:66)
    at org.openhab.tools.analysis.checkstyle.AboutHtmlCheck.beginProcessing (AboutHtmlCheck.java:72)
    at com.puppycrawl.tools.checkstyle.Checker.process (Checker.java:210)
    at org.apache.maven.plugin.checkstyle.exec.DefaultCheckstyleExecutor.executeCheckstyle (DefaultCheckstyleExecutor.java:252)
    at org.apache.maven.plugin.checkstyle.AbstractCheckstyleReport.executeReport (AbstractCheckstyleReport.java:473)
    at org.apache.maven.plugin.checkstyle.CheckstyleReport.executeReport (CheckstyleReport.java:154)
    at org.apache.maven.reporting.AbstractMavenReport.generate (AbstractMavenReport.java:255)
    at org.apache.maven.reporting.AbstractMavenReport.execute (AbstractMavenReport.java:143)
    at org.apache.maven.plugin.DefaultBuildPluginManager.executeMojo (DefaultBuildPluginManager.java:137)
    at org.twdata.maven.mojoexecutor.MojoExecutor.executeMojo (MojoExecutor.java:94)
    at org.openhab.tools.analysis.tools.AbstractChecker.executeCheck (AbstractChecker.java:106)
    at org.openhab.tools.analysis.tools.CheckstyleChecker.execute (CheckstyleChecker.java:123)
    at org.apache.maven.plugin.DefaultBuildPluginManager.executeMojo (DefaultBuildPluginManager.java:137)
    at org.apache.maven.lifecycle.internal.MojoExecutor.execute (MojoExecutor.java:208)
    at org.apache.maven.lifecycle.internal.MojoExecutor.execute (MojoExecutor.java:154)
    at org.apache.maven.lifecycle.internal.MojoExecutor.execute (MojoExecutor.java:146)
    at org.apache.maven.lifecycle.internal.LifecycleModuleBuilder.buildProject (LifecycleModuleBuilder.java:117)
    at org.apache.maven.lifecycle.internal.LifecycleModuleBuilder.buildProject (LifecycleModuleBuilder.java:81)
    at org.apache.maven.lifecycle.internal.builder.singlethreaded.SingleThreadedBuilder.build (SingleThreadedBuilder.java:56)
    at org.apache.maven.lifecycle.internal.LifecycleStarter.execute (LifecycleStarter.java:128)
    at org.apache.maven.DefaultMaven.doExecute (DefaultMaven.java:305)
    at org.apache.maven.DefaultMaven.doExecute (DefaultMaven.java:192)
    at org.apache.maven.DefaultMaven.execute (DefaultMaven.java:105)
    at org.apache.maven.cli.MavenCli.execute (MavenCli.java:954)
    at org.apache.maven.cli.MavenCli.doMain (MavenCli.java:288)
    at org.apache.maven.cli.MavenCli.main (MavenCli.java:192)
    at sun.reflect.NativeMethodAccessorImpl.invoke0 (Native Method)
    at sun.reflect.NativeMethodAccessorImpl.invoke (NativeMethodAccessorImpl.java:62)
    at sun.reflect.DelegatingMethodAccessorImpl.invoke (DelegatingMethodAccessorImpl.java:43)
    at java.lang.reflect.Method.invoke (Method.java:498)
    at org.codehaus.plexus.classworlds.launcher.Launcher.launchEnhanced (Launcher.java:289)
    at org.codehaus.plexus.classworlds.launcher.Launcher.launch (Launcher.java:229)
    at org.codehaus.plexus.classworlds.launcher.Launcher.mainWithExitCode (Launcher.java:415)
    at org.codehaus.plexus.classworlds.launcher.Launcher.main (Launcher.java:356)
[ERROR] Unable to parse schema 
org.xml.sax.SAXParseException: src-resolve: Cannot resolve the name 'config-description:idRestrictionPattern' to a(n) 'type definition' component.
    at org.apache.xerces.util.ErrorHandlerWrapper.createSAXParseException (Unknown Source)
    at org.apache.xerces.util.ErrorHandlerWrapper.error (Unknown Source)
    at org.apache.xerces.impl.XMLErrorReporter.reportError (Unknown Source)
    at org.apache.xerces.impl.XMLErrorReporter.reportError (Unknown Source)
    at org.apache.xerces.impl.xs.traversers.XSDHandler.reportSchemaError (Unknown Source)
    at org.apache.xerces.impl.xs.traversers.XSDHandler.getGlobalDecl (Unknown Source)
    at org.apache.xerces.impl.xs.traversers.XSDAttributeTraverser.traverseNamedAttr (Unknown Source)
    at org.apache.xerces.impl.xs.traversers.XSDAttributeTraverser.traverseLocal (Unknown Source)
    at org.apache.xerces.impl.xs.traversers.XSDAbstractTraverser.traverseAttrsAndAttrGrps (Unknown Source)
    at org.apache.xerces.impl.xs.traversers.XSDComplexTypeTraverser.processComplexContent (Unknown Source)
    at org.apache.xerces.impl.xs.traversers.XSDComplexTypeTraverser.traverseComplexTypeDecl (Unknown Source)
    at org.apache.xerces.impl.xs.traversers.XSDComplexTypeTraverser.traverseLocal (Unknown Source)
    at org.apache.xerces.impl.xs.traversers.XSDElementTraverser.traverseNamedElement (Unknown Source)
    at org.apache.xerces.impl.xs.traversers.XSDElementTraverser.traverseGlobal (Unknown Source)
    at org.apache.xerces.impl.xs.traversers.XSDHandler.traverseSchemas (Unknown Source)
    at org.apache.xerces.impl.xs.traversers.XSDHandler.parseSchema (Unknown Source)
    at org.apache.xerces.impl.xs.XMLSchemaLoader.loadSchema (Unknown Source)
    at org.apache.xerces.impl.xs.XMLSchemaLoader.loadGrammar (Unknown Source)
    at org.apache.xerces.impl.xs.XMLSchemaLoader.loadGrammar (Unknown Source)
    at org.apache.xerces.jaxp.validation.XMLSchemaFactory.newSchema (Unknown Source)
    at javax.xml.validation.SchemaFactory.newSchema (SchemaFactory.java:638)
    at org.openhab.tools.analysis.checkstyle.EshInfXmlValidationCheck$1.transform (EshInfXmlValidationCheck.java:110)
    at org.openhab.tools.analysis.checkstyle.EshInfXmlValidationCheck$1.transform (EshInfXmlValidationCheck.java:103)
    at org.openhab.tools.analysis.utils.CachingHttpClient.get (CachingHttpClient.java:71)
    at org.openhab.tools.analysis.checkstyle.EshInfXmlValidationCheck.getXSD (EshInfXmlValidationCheck.java:229)
    at org.openhab.tools.analysis.checkstyle.EshInfXmlValidationCheck.beginProcessing (EshInfXmlValidationCheck.java:120)
    at com.puppycrawl.tools.checkstyle.Checker.process (Checker.java:210)
    at org.apache.maven.plugin.checkstyle.exec.DefaultCheckstyleExecutor.executeCheckstyle (DefaultCheckstyleExecutor.java:252)
    at org.apache.maven.plugin.checkstyle.AbstractCheckstyleReport.executeReport (AbstractCheckstyleReport.java:473)
    at org.apache.maven.plugin.checkstyle.CheckstyleReport.executeReport (CheckstyleReport.java:154)
    at org.apache.maven.reporting.AbstractMavenReport.generate (AbstractMavenReport.java:255)
    at org.apache.maven.reporting.AbstractMavenReport.execute (AbstractMavenReport.java:143)
    at org.apache.maven.plugin.DefaultBuildPluginManager.executeMojo (DefaultBuildPluginManager.java:137)
    at org.twdata.maven.mojoexecutor.MojoExecutor.executeMojo (MojoExecutor.java:94)
    at org.openhab.tools.analysis.tools.AbstractChecker.executeCheck (AbstractChecker.java:106)
    at org.openhab.tools.analysis.tools.CheckstyleChecker.execute (CheckstyleChecker.java:123)
    at org.apache.maven.plugin.DefaultBuildPluginManager.executeMojo (DefaultBuildPluginManager.java:137)
    at org.apache.maven.lifecycle.internal.MojoExecutor.execute (MojoExecutor.java:208)
    at org.apache.maven.lifecycle.internal.MojoExecutor.execute (MojoExecutor.java:154)
    at org.apache.maven.lifecycle.internal.MojoExecutor.execute (MojoExecutor.java:146)
    at org.apache.maven.lifecycle.internal.LifecycleModuleBuilder.buildProject (LifecycleModuleBuilder.java:117)
    at org.apache.maven.lifecycle.internal.LifecycleModuleBuilder.buildProject (LifecycleModuleBuilder.java:81)
    at org.apache.maven.lifecycle.internal.builder.singlethreaded.SingleThreadedBuilder.build (SingleThreadedBuilder.java:56)
    at org.apache.maven.lifecycle.internal.LifecycleStarter.execute (LifecycleStarter.java:128)
    at org.apache.maven.DefaultMaven.doExecute (DefaultMaven.java:305)
    at org.apache.maven.DefaultMaven.doExecute (DefaultMaven.java:192)
    at org.apache.maven.DefaultMaven.execute (DefaultMaven.java:105)
    at org.apache.maven.cli.MavenCli.execute (MavenCli.java:954)
    at org.apache.maven.cli.MavenCli.doMain (MavenCli.java:288)
    at org.apache.maven.cli.MavenCli.main (MavenCli.java:192)
    at sun.reflect.NativeMethodAccessorImpl.invoke0 (Native Method)
    at sun.reflect.NativeMethodAccessorImpl.invoke (NativeMethodAccessorImpl.java:62)
    at sun.reflect.DelegatingMethodAccessorImpl.invoke (DelegatingMethodAccessorImpl.java:43)
    at java.lang.reflect.Method.invoke (Method.java:498)
    at org.codehaus.plexus.classworlds.launcher.Launcher.launchEnhanced (Launcher.java:289)
    at org.codehaus.plexus.classworlds.launcher.Launcher.launch (Launcher.java:229)
    at org.codehaus.plexus.classworlds.launcher.Launcher.mainWithExitCode (Launcher.java:415)
    at org.codehaus.plexus.classworlds.launcher.Launcher.main (Launcher.java:356)
[WARNING] XML validation will be skipped as the schema file download failed.
[WARNING] XML validation will be skipped as the schema file download failed.
[WARNING] KarafFeatureCheck will be skipped. Could not find file features/openhab-addons/src/main/feature/feature.xml
[INFO] 
[INFO] --- sat-plugin:0.5.0:pmd (sat-all) @ org.eclipse.smarthome.binding.mqtt ---
[INFO] Adding dependency to pmd:0.5.0
[INFO] Adding dependency to pmd-core:5.8.1
[INFO] Adding dependency to pmd-java:5.8.1
[INFO] Adding dependency to pmd-javascript:5.8.1
[INFO] Adding dependency to pmd-jsp:5.8.1
[INFO] 
[INFO] --- sat-plugin:0.5.0:spotbugs (sat-all) @ org.eclipse.smarthome.binding.mqtt ---
[INFO] Adding dependency to findbugs:0.5.0
[INFO] Adding dependency to bug-pattern:1.2.4
[INFO] Adding dependency to spotbugs:3.1.2
[INFO] Fork Value is false
     [java] JVM args ignored when same JVM is used.
[INFO] Done SpotBugs Analysis....
[INFO] 
[INFO] --- sat-plugin:0.5.0:report (sat-all) @ org.eclipse.smarthome.binding.mqtt ---
[INFO] Individual report appended to summary report.
[WARNING] Code Analysis Tool has found: 
 0 error(s)! 
 5 warning(s) 
 7 info(s)
[WARNING] /jobs/genie.smarthome/SmartHomeDistribution-Nightly-PR/workspace/extensions/binding/org.eclipse.smarthome.binding.mqtt/ESH-INF/thing/thing-types.xml:[169]
There were whitespace characters used for indentation. Please use tab characters instead
[WARNING] /jobs/genie.smarthome/SmartHomeDistribution-Nightly-PR/workspace/extensions/binding/org.eclipse.smarthome.binding.mqtt/META-INF/MANIFEST.MF:[36]
The exported package `org.eclipse.smarthome.binding.mqtt.action` is not imported
[WARNING] /jobs/genie.smarthome/SmartHomeDistribution-Nightly-PR/workspace/extensions/binding/org.eclipse.smarthome.binding.mqtt/META-INF/MANIFEST.MF:[36]
The exported package `org.eclipse.smarthome.binding.mqtt.discovery` is not imported
[WARNING] /jobs/genie.smarthome/SmartHomeDistribution-Nightly-PR/workspace/extensions/binding/org.eclipse.smarthome.binding.mqtt/ESH-INF/thing/thing-types.xml:[0]
Unused bridge reference with id - broker
[WARNING] /jobs/genie.smarthome/SmartHomeDistribution-Nightly-PR/workspace/extensions/binding/org.eclipse.smarthome.binding.mqtt/ESH-INF/thing/thing-types.xml:[0]
Unused bridge reference with id - systemBroker
[INFO] Detailed report can be found at: file:////jobs/genie.smarthome/SmartHomeDistribution-Nightly-PR/workspace/extensions/binding/org.eclipse.smarthome.binding.mqtt/target/code-analysis/report.html
[INFO] 
[INFO] --- maven-install-plugin:2.5.2:install (default-install) @ org.eclipse.smarthome.binding.mqtt ---
[INFO] Installing /jobs/genie.smarthome/SmartHomeDistribution-Nightly-PR/workspace/extensions/binding/org.eclipse.smarthome.binding.mqtt/target/org.eclipse.smarthome.binding.mqtt-0.11.0-SNAPSHOT.jar to /home/hudson/genie.smarthome/.jenkins/jobs/SmartHomeDistribution-Nightly-PR/workspace/.repository/org/eclipse/smarthome/binding/org.eclipse.smarthome.binding.mqtt/0.11.0-SNAPSHOT/org.eclipse.smarthome.binding.mqtt-0.11.0-SNAPSHOT.jar
[INFO] Installing /jobs/genie.smarthome/SmartHomeDistribution-Nightly-PR/workspace/extensions/binding/org.eclipse.smarthome.binding.mqtt/pom.xml to /home/hudson/genie.smarthome/.jenkins/jobs/SmartHomeDistribution-Nightly-PR/workspace/.repository/org/eclipse/smarthome/binding/org.eclipse.smarthome.binding.mqtt/0.11.0-SNAPSHOT/org.eclipse.smarthome.binding.mqtt-0.11.0-SNAPSHOT.pom
[INFO] Installing /jobs/genie.smarthome/SmartHomeDistribution-Nightly-PR/workspace/extensions/binding/org.eclipse.smarthome.binding.mqtt/target/org.eclipse.smarthome.binding.mqtt-0.11.0-SNAPSHOT-sources.jar to /home/hudson/genie.smarthome/.jenkins/jobs/SmartHomeDistribution-Nightly-PR/workspace/.repository/org/eclipse/smarthome/binding/org.eclipse.smarthome.binding.mqtt/0.11.0-SNAPSHOT/org.eclipse.smarthome.binding.mqtt-0.11.0-SNAPSHOT-sources.jar
[INFO] Installing /jobs/genie.smarthome/SmartHomeDistribution-Nightly-PR/workspace/extensions/binding/org.eclipse.smarthome.binding.mqtt/target/p2content.xml to /home/hudson/genie.smarthome/.jenkins/jobs/SmartHomeDistribution-Nightly-PR/workspace/.repository/org/eclipse/smarthome/binding/org.eclipse.smarthome.binding.mqtt/0.11.0-SNAPSHOT/org.eclipse.smarthome.binding.mqtt-0.11.0-SNAPSHOT-p2metadata.xml
[INFO] Installing /jobs/genie.smarthome/SmartHomeDistribution-Nightly-PR/workspace/extensions/binding/org.eclipse.smarthome.binding.mqtt/target/p2artifacts.xml to /home/hudson/genie.smarthome/.jenkins/jobs/SmartHomeDistribution-Nightly-PR/workspace/.repository/org/eclipse/smarthome/binding/org.eclipse.smarthome.binding.mqtt/0.11.0-SNAPSHOT/org.eclipse.smarthome.binding.mqtt-0.11.0-SNAPSHOT-p2artifacts.xml
[INFO] 
[INFO] --- tycho-p2-plugin:1.2.0:update-local-index (default-update-local-index) @ org.eclipse.smarthome.binding.mqtt ---
[INFO] 
[INFO] --< org.eclipse.smarthome.binding:org.eclipse.smarthome.binding.mqtt.test >--
[INFO] Building Eclipse SmartHome MQTT Binding Tests 0.11.0-SNAPSHOT  [175/249]
[INFO] ------------------------[ eclipse-test-plugin ]-------------------------
[INFO] 
[INFO] --- maven-clean-plugin:2.5:clean (default-clean) @ org.eclipse.smarthome.binding.mqtt.test ---
[INFO] 
[INFO] --- tycho-packaging-plugin:1.2.0:build-qualifier (default-build-qualifier) @ org.eclipse.smarthome.binding.mqtt.test ---
[INFO] The project's OSGi version is 0.11.0.201901311108
[INFO] 
[INFO] --- tycho-packaging-plugin:1.2.0:validate-id (default-validate-id) @ org.eclipse.smarthome.binding.mqtt.test ---
[INFO] 
[INFO] --- tycho-packaging-plugin:1.2.0:validate-version (default-validate-version) @ org.eclipse.smarthome.binding.mqtt.test ---
[INFO] 
[INFO] --- directory-maven-plugin:0.2:highest-basedir (directories) @ org.eclipse.smarthome.binding.mqtt.test ---
[INFO] Highest basedir set to: /jobs/genie.smarthome/SmartHomeDistribution-Nightly-PR/workspace
[INFO] 
[INFO] --- jacoco-maven-plugin:0.7.4.201502262128:prepare-agent (default-prepare-agent) @ org.eclipse.smarthome.binding.mqtt.test ---
[INFO] tycho.testArgLine set to -javaagent:/home/hudson/genie.smarthome/.jenkins/jobs/SmartHomeDistribution-Nightly-PR/workspace/.repository/org/jacoco/org.jacoco.agent/0.7.4.201502262128/org.jacoco.agent-0.7.4.201502262128-runtime.jar=destfile=/jobs/genie.smarthome/SmartHomeDistribution-Nightly-PR/workspace/target/coverage.jacoco,append=true,excludes=**/*Test.*
[INFO] 
[INFO] --- maven-resources-plugin:3.1.0:resources (default-resources) @ org.eclipse.smarthome.binding.mqtt.test ---
[INFO] Using 'UTF-8' encoding to copy filtered resources.
[INFO] skip non existing resourceDirectory /jobs/genie.smarthome/SmartHomeDistribution-Nightly-PR/workspace/extensions/binding/org.eclipse.smarthome.binding.mqtt.test/src/main/resources
[INFO] 
[INFO] --- tycho-compiler-plugin:1.2.0:compile (default-compile) @ org.eclipse.smarthome.binding.mqtt.test ---
[INFO] Compiling 9 source files to /jobs/genie.smarthome/SmartHomeDistribution-Nightly-PR/workspace/extensions/binding/org.eclipse.smarthome.binding.mqtt.test/target/classes
[INFO] 
[INFO] --- maven-scr-plugin:1.24.0:scr (generate-scr-scrdescriptor) @ org.eclipse.smarthome.binding.mqtt.test ---
[WARNING] Source tree does not exist. Ignoring /jobs/genie.smarthome/SmartHomeDistribution-Nightly-PR/workspace/extensions/binding/org.eclipse.smarthome.binding.mqtt.test/src/main/java
[WARNING] Source tree does not exist. Ignoring /jobs/genie.smarthome/SmartHomeDistribution-Nightly-PR/workspace/extensions/binding/org.eclipse.smarthome.binding.mqtt.test/src/main/java
[WARNING] Source tree does not exist. Ignoring /jobs/genie.smarthome/SmartHomeDistribution-Nightly-PR/workspace/extensions/binding/org.eclipse.smarthome.binding.mqtt.test/src/main/java
[INFO] 
[INFO] --- maven-resources-plugin:3.1.0:testResources (default-testResources) @ org.eclipse.smarthome.binding.mqtt.test ---
[INFO] Using 'UTF-8' encoding to copy filtered resources.
[INFO] Copying 2 resources
[INFO] 
[INFO] --- maven-resources-plugin:3.1.0:copy-resources (default) @ org.eclipse.smarthome.binding.mqtt.test ---
[INFO] Using 'UTF-8' encoding to copy filtered resources.
[INFO] skip non existing resourceDirectory /jobs/genie.smarthome/SmartHomeDistribution-Nightly-PR/workspace/extensions/binding/org.eclipse.smarthome.binding.mqtt.test/target/classes/OSGI-INF
[INFO] 
[INFO] --- tycho-source-plugin:1.2.0:plugin-source (plugin-source) @ org.eclipse.smarthome.binding.mqtt.test ---
[INFO] Building jar: /jobs/genie.smarthome/SmartHomeDistribution-Nightly-PR/workspace/extensions/binding/org.eclipse.smarthome.binding.mqtt.test/target/org.eclipse.smarthome.binding.mqtt.test-0.11.0-SNAPSHOT-sources.jar
[INFO] 
[INFO] --- target-platform-configuration:1.2.0:target-platform (default-target-platform) @ org.eclipse.smarthome.binding.mqtt.test ---
[INFO] 
[INFO] --- tycho-packaging-plugin:1.2.0:package-plugin (default-package-plugin) @ org.eclipse.smarthome.binding.mqtt.test ---
[INFO] Building jar: /jobs/genie.smarthome/SmartHomeDistribution-Nightly-PR/workspace/extensions/binding/org.eclipse.smarthome.binding.mqtt.test/target/org.eclipse.smarthome.binding.mqtt.test-0.11.0-SNAPSHOT.jar
[INFO] 
[INFO] --- tycho-p2-plugin:1.2.0:p2-metadata-default (default-p2-metadata-default) @ org.eclipse.smarthome.binding.mqtt.test ---
[INFO] 
[INFO] --- jacoco-maven-plugin:0.7.4.201502262128:prepare-agent-integration (default-prepare-agent-integration) @ org.eclipse.smarthome.binding.mqtt.test ---
[INFO] tycho.testArgLine set to -javaagent:/home/hudson/genie.smarthome/.jenkins/jobs/SmartHomeDistribution-Nightly-PR/workspace/.repository/org/jacoco/org.jacoco.agent/0.7.4.201502262128/org.jacoco.agent-0.7.4.201502262128-runtime.jar=destfile=/jobs/genie.smarthome/SmartHomeDistribution-Nightly-PR/workspace/target/coverage.jacoco,append=true,excludes=**/*Test.*
[INFO] 
[INFO] --- tycho-surefire-plugin:1.2.0:test (default-test) @ org.eclipse.smarthome.binding.mqtt.test ---
[INFO] Expected eclipse log file: /jobs/genie.smarthome/SmartHomeDistribution-Nightly-PR/workspace/extensions/binding/org.eclipse.smarthome.binding.mqtt.test/target/work/data/.metadata/.log
[INFO] Command line:
	[/opt/public/common/java/oracle/jdk1.8.0_192_x64/jre/bin/java, -Dosgi.noShutdown=false, -Dosgi.os=linux, -Dosgi.ws=gtk, -Dosgi.arch=x86_64, -javaagent:/home/hudson/genie.smarthome/.jenkins/jobs/SmartHomeDistribution-Nightly-PR/workspace/.repository/org/jacoco/org.jacoco.agent/0.7.4.201502262128/org.jacoco.agent-0.7.4.201502262128-runtime.jar=destfile=/jobs/genie.smarthome/SmartHomeDistribution-Nightly-PR/workspace/target/coverage.jacoco,append=true,excludes=**/*Test.*, -Dosgi.clean=true, -jar, /jobs/genie.smarthome/SmartHomeDistribution-Nightly-PR/workspace/.repository/p2/osgi/bundle/org.eclipse.equinox.launcher/1.4.0.v20161219-1356/org.eclipse.equinox.launcher-1.4.0.v20161219-1356.jar, -data, /jobs/genie.smarthome/SmartHomeDistribution-Nightly-PR/workspace/extensions/binding/org.eclipse.smarthome.binding.mqtt.test/target/work/data, -install, /jobs/genie.smarthome/SmartHomeDistribution-Nightly-PR/workspace/extensions/binding/org.eclipse.smarthome.binding.mqtt.test/target/work, -configuration, /jobs/genie.smarthome/SmartHomeDistribution-Nightly-PR/workspace/extensions/binding/org.eclipse.smarthome.binding.mqtt.test/target/work/configuration, -application, org.eclipse.tycho.surefire.osgibooter.headlesstest, -testproperties, /jobs/genie.smarthome/SmartHomeDistribution-Nightly-PR/workspace/extensions/binding/org.eclipse.smarthome.binding.mqtt.test/target/surefire.properties]
Picked up JAVA_TOOL_OPTIONS: -Xmx2G -Djava.io.tmpdir=/tmp/genie.smarthome
Running org.eclipse.smarthome.binding.mqtt.handler.BrokerHandlerTest
07:08:45.931 [main] DEBUG o.e.s.core.common.ThreadPoolManager - Created scheduled thread pool 'thingHandler' of size 5
07:08:46.626 [main] INFO  o.e.s.i.t.mqtt.MqttBrokerConnection - Starting MQTT broker connection to '10.10.0.10' with clientid BrokerHandlerTest and file store '/jobs/genie.smarthome/SmartHomeDistribution-Nightly-PR/workspace/extensions/binding/org.eclipse.smarthome.binding.mqtt.test/userdata/mqtt/10.10.0.10'
07:08:46.662 [main] INFO  o.e.s.i.t.mqtt.MqttBrokerConnection - Starting MQTT broker connection to '10.10.0.10' with clientid BrokerHandlerTest and file store 'userdata/mqtt/10.10.0.10'
Tests run: 3, Failures: 1, Errors: 0, Skipped: 0, Time elapsed: 2.432 sec <<< FAILURE! - in org.eclipse.smarthome.binding.mqtt.handler.BrokerHandlerTest
handlerInitWithoutUrl(org.eclipse.smarthome.binding.mqtt.handler.BrokerHandlerTest)  Time elapsed: 1.857 sec
createBrokerConnection(org.eclipse.smarthome.binding.mqtt.handler.BrokerHandlerTest)  Time elapsed: 0.43 sec
handlerInit(org.eclipse.smarthome.binding.mqtt.handler.BrokerHandlerTest)  Time elapsed: 0.056 sec  <<< FAILURE!
org.mockito.exceptions.verification.TooManyActualInvocations: 

brokerHandlerEx.connectionStateChanged(
    <any>,
    <any>
);
Wanted 3 times:
-> at org.eclipse.smarthome.binding.mqtt.handler.BrokerHandlerTest.initializeHandlerWaitForTimeout(BrokerHandlerTest.java:141)
But was 4 times. Undesired invocation:
-> at org.eclipse.smarthome.io.transport.mqtt.MqttBrokerConnection$ConnectionCallback.lambda$4(MqttBrokerConnection.java:154)

	at org.eclipse.smarthome.binding.mqtt.handler.BrokerHandlerTest.initializeHandlerWaitForTimeout(BrokerHandlerTest.java:141)
	at org.eclipse.smarthome.binding.mqtt.handler.BrokerHandlerTest.handlerInit(BrokerHandlerTest.java:107)

Running org.eclipse.smarthome.binding.mqtt.handler.AbstractBrokerHandlerTest
07:08:46.782 [main] INFO  o.e.s.i.t.mqtt.MqttBrokerConnection - Starting MQTT broker connection to '10.10.0.10' with clientid BrokerHandlerTest and file store 'userdata/mqtt/10.10.0.10'
07:08:46.795 [main] INFO  o.e.s.i.t.mqtt.MqttBrokerConnection - Starting MQTT broker connection to '10.10.0.10' with clientid BrokerHandlerTest and file store 'userdata/mqtt/10.10.0.10'
Tests run: 3, Failures: 0, Errors: 0, Skipped: 0, Time elapsed: 0.207 sec - in org.eclipse.smarthome.binding.mqtt.handler.AbstractBrokerHandlerTest
brokerRemovedBroker(org.eclipse.smarthome.binding.mqtt.handler.AbstractBrokerHandlerTest)  Time elapsed: 0.015 sec
brokerAdded(org.eclipse.smarthome.binding.mqtt.handler.AbstractBrokerHandlerTest)  Time elapsed: 0.014 sec
brokerAddedWrongID(org.eclipse.smarthome.binding.mqtt.handler.AbstractBrokerHandlerTest)  Time elapsed: 0.174 sec
Running org.eclipse.smarthome.binding.mqtt.internal.discovery.ServiceDiscoveryServiceTest
07:08:47.028 [main] DEBUG o.e.s.core.common.ThreadPoolManager - Created scheduled thread pool 'discovery' of size 5
Tests run: 1, Failures: 0, Errors: 0, Skipped: 0, Time elapsed: 0.062 sec - in org.eclipse.smarthome.binding.mqtt.internal.discovery.ServiceDiscoveryServiceTest
testDiscovery(org.eclipse.smarthome.binding.mqtt.internal.discovery.ServiceDiscoveryServiceTest)  Time elapsed: 0.06 sec
Running org.eclipse.smarthome.binding.mqtt.internal.MQTTTopicDiscoveryServiceTest
07:08:47.072 [main] INFO  o.e.s.i.t.mqtt.MqttBrokerConnection - Starting MQTT broker connection to '10.10.0.10' with clientid BrokerHandlerTest and file store 'userdata/mqtt/10.10.0.10'
07:08:47.097 [main] INFO  o.e.s.i.t.mqtt.MqttBrokerConnection - Starting MQTT broker connection to '10.10.0.10' with clientid BrokerHandlerTest and file store 'userdata/mqtt/10.10.0.10'
07:08:47.106 [main] INFO  o.e.s.i.t.mqtt.MqttBrokerConnection - Starting MQTT broker connection to '10.10.0.10' with clientid BrokerHandlerTest and file store 'userdata/mqtt/10.10.0.10'
07:08:47.117 [main] INFO  o.e.s.i.t.mqtt.MqttBrokerConnection - Starting MQTT broker connection to '10.10.0.10' with clientid BrokerHandlerTest and file store 'userdata/mqtt/10.10.0.10'
Tests run: 4, Failures: 0, Errors: 0, Skipped: 0, Time elapsed: 0.077 sec - in org.eclipse.smarthome.binding.mqtt.internal.MQTTTopicDiscoveryServiceTest
topicVanished(org.eclipse.smarthome.binding.mqtt.internal.MQTTTopicDiscoveryServiceTest)  Time elapsed: 0.042 sec
firstSubscribeThenHandler(org.eclipse.smarthome.binding.mqtt.internal.MQTTTopicDiscoveryServiceTest)  Time elapsed: 0.011 sec
firstHandlerThanSubscribe(org.eclipse.smarthome.binding.mqtt.internal.MQTTTopicDiscoveryServiceTest)  Time elapsed: 0.009 sec
handlerInitializeAfterSubscribe(org.eclipse.smarthome.binding.mqtt.internal.MQTTTopicDiscoveryServiceTest)  Time elapsed: 0.01 sec
Running org.eclipse.smarthome.binding.mqtt.internal.ssl.PinningSSLContextProviderTest
Tests run: 5, Failures: 0, Errors: 0, Skipped: 0, Time elapsed: 0.109 sec - in org.eclipse.smarthome.binding.mqtt.internal.ssl.PinningSSLContextProviderTest
learningMode(org.eclipse.smarthome.binding.mqtt.internal.ssl.PinningSSLContextProviderTest)  Time elapsed: 0.073 sec
getDigestDataFor(org.eclipse.smarthome.binding.mqtt.internal.ssl.PinningSSLContextProviderTest)  Time elapsed: 0.009 sec
checkMode(org.eclipse.smarthome.binding.mqtt.internal.ssl.PinningSSLContextProviderTest)  Time elapsed: 0.001 sec
pubKeyPinCallsX509CertificateGetPublicKey(org.eclipse.smarthome.binding.mqtt.internal.ssl.PinningSSLContextProviderTest)  Time elapsed: 0.023 sec
certPinCallsX509CertificateGetEncoded(org.eclipse.smarthome.binding.mqtt.internal.ssl.PinningSSLContextProviderTest)  Time elapsed: 0 sec

Results :

Failed tests: 
  BrokerHandlerTest.handlerInit:107->initializeHandlerWaitForTimeout:141 
brokerHandlerEx.connectionStateChanged(
    <any>,
    <any>
);
Wanted 3 times:
-> at org.eclipse.smarthome.binding.mqtt.handler.BrokerHandlerTest.initializeHandlerWaitForTimeout(BrokerHandlerTest.java:141)
But was 4 times. Undesired invocation:
-> at org.eclipse.smarthome.io.transport.mqtt.MqttBrokerConnection$ConnectionCallback.lambda$4(MqttBrokerConnection.java:154)


Tests run: 16, Failures: 1, Errors: 0, Skipped: 0

[INFO] ------------------------------------------------------------------------
[INFO] Reactor Summary:
[INFO] 
[INFO] Eclipse SmartHome 0.11.0-SNAPSHOT .................. SUCCESS [01:07 min]
[INFO] Eclipse SmartHome Bundles .......................... SUCCESS [ 19.673 s]
[INFO] Eclipse SmartHome Test Components .................. SUCCESS [  0.028 s]
[INFO] Eclipse SmartHome Core Components .................. SUCCESS [  0.023 s]
[INFO] Eclipse SmartHome Core ............................. SUCCESS [04:18 min]
[INFO] Eclipse SmartHome Configurations ................... SUCCESS [  0.060 s]
[INFO] Eclipse SmartHome Configuration Core ............... SUCCESS [ 21.253 s]
[INFO] Eclipse SmartHome Configuration XML ................ SUCCESS [ 11.805 s]
[INFO] Eclipse SmartHome Test ............................. SUCCESS [ 23.355 s]
[INFO] Eclipse SmartHome Automation ....................... SUCCESS [  0.040 s]
[INFO] Eclipse SmartHome Automation API ................... SUCCESS [ 10.249 s]
[INFO] Eclipse SmartHome I/O Components ................... SUCCESS [  0.041 s]
[INFO] Eclipse SmartHome Console .......................... SUCCESS [  6.254 s]
[INFO] Eclipse SmartHome Thing ............................ SUCCESS [ 22.262 s]
[INFO] Eclipse SmartHome Configuration Discovery .......... SUCCESS [ 14.479 s]
[INFO] Eclipse SmartHome Network I/O ...................... SUCCESS [ 20.370 s]
[INFO] Eclipse SmartHome Magic Bundle ..................... SUCCESS [  9.856 s]
[INFO] Eclipse SmartHome Magic Bundle Tests ............... SUCCESS [ 13.977 s]
[INFO] Eclipse SmartHome Auth Components .................. SUCCESS [  0.033 s]
[INFO] Eclipse SmartHome JAAS Authentication .............. SUCCESS [  8.842 s]
[INFO] Eclipse SmartHome OAuth2Client ..................... SUCCESS [ 11.956 s]
[INFO] Eclipse SmartHome OAuth2Client Tests ............... SUCCESS [ 15.029 s]
[INFO] Eclipse SmartHome Configuration Dispatcher ......... SUCCESS [  7.151 s]
[INFO] Eclipse SmartHome Configuration Dispatcher Tests ... SUCCESS [ 38.277 s]
[INFO] Eclipse SmartHome Configuration Core Tests ......... SUCCESS [ 22.998 s]
[INFO] Eclipse SmartHome mDNS Service ..................... SUCCESS [ 17.580 s]
[INFO] Eclipse SmartHome Configuration mDNS Discovery ..... SUCCESS [  5.198 s]
[INFO] Eclipse SmartHome Core Thing XML ................... SUCCESS [  9.035 s]
[INFO] Eclipse SmartHome Configuration mDNS Discovery Tests SUCCESS [ 16.522 s]
[INFO] Eclipse SmartHome Configuration Discovery Tests .... SUCCESS [ 39.387 s]
[INFO] Eclipse SmartHome Configuration UPnP Discovery ..... SUCCESS [  7.321 s]
[INFO] Eclipse SmartHome Configuration USB-Serial Discovery SUCCESS [ 13.507 s]
[INFO] Eclipse SmartHome Configuration Discovery UsbSerial Tests SUCCESS [ 22.525 s]
[INFO] Eclipse SmartHome Configuration USB-Serial Discovery for Linux using sysfs scanning SUCCESS [  6.750 s]
[INFO] Eclipse SmartHome Serial Transport ................. SUCCESS [  9.121 s]
[INFO] Eclipse SmartHome Configuration Serial ............. SUCCESS [  5.922 s]
[INFO] Eclipse SmartHome Config XML Tests ................. SUCCESS [ 23.797 s]
[INFO] Eclipse SmartHome Configuration USB-Serial Discovery for Linux using sysfs scanning Tests SUCCESS [ 19.943 s]
[INFO] Eclipse SmartHome HTTP Interface ................... SUCCESS [  9.423 s]
[INFO] Eclipse SmartHome Core Audio ....................... SUCCESS [ 11.019 s]
[INFO] Eclipse SmartHome Core Binding XML ................. SUCCESS [  7.999 s]
[INFO] Eclipse SmartHome Audio Test ....................... SUCCESS [ 12.942 s]
[INFO] Eclipse SmartHome Sample Extension Service ......... SUCCESS [  5.366 s]
[INFO] Eclipse SmartHome REST Interface ................... SUCCESS [  6.366 s]
[INFO] Eclipse SmartHome Core ID .......................... SUCCESS [  4.877 s]
[INFO] Eclipse SmartHome ID Tests ......................... SUCCESS [ 18.155 s]
[INFO] Eclipse SmartHome Core Tests ....................... SUCCESS [01:14 min]
[INFO] Eclipse SmartHome Thing Tests ...................... SUCCESS [02:00 min]
[INFO] Eclipse SmartHome Core Persistence ................. SUCCESS [  8.440 s]
[INFO] Eclipse SmartHome Core Scheduler Service ........... SUCCESS [  7.352 s]
[INFO] Eclipse SmartHome Core Semantics ................... SUCCESS [ 10.132 s]
[INFO] Eclipse SmartHome Core Transformation Service ...... SUCCESS [  7.225 s]
[INFO] Eclipse SmartHome Core Transform Test .............. SUCCESS [ 12.769 s]
[INFO] Eclipse SmartHome Core Binding XML Tests ........... SUCCESS [ 17.814 s]
[INFO] Eclipse SmartHome Core Thing XML Tests ............. SUCCESS [ 22.507 s]
[INFO] Eclipse SmartHome Core Voice ....................... SUCCESS [ 16.450 s]
[INFO] Eclipse SmartHome Core Voice Test .................. SUCCESS [ 16.152 s]
[INFO] Eclipse SmartHome Automation Commands .............. SUCCESS [  9.969 s]
[INFO] Eclipse SmartHome Automation Core .................. SUCCESS [ 22.658 s]
[INFO] Eclipse SmartHome Automation Parser GSON ........... SUCCESS [ 48.002 s]
[INFO] Eclipse SmartHome Automation Core Modules .......... SUCCESS [ 45.562 s]
[INFO] Eclipse SmartHome Automation Providers ............. SUCCESS [ 10.924 s]
[INFO] Eclipse SmartHome Automation Provider File ......... SUCCESS [ 11.058 s]
[INFO] Eclipse SmartHome Automation Core Tests ............ SUCCESS [ 37.962 s]
[INFO] Eclipse SmartHome Automation Sample JSON ........... SUCCESS [ 14.862 s]
[INFO] Eclipse SmartHome Automation Core Module Tests ..... SUCCESS [ 36.798 s]
[INFO] Eclipse SmartHome Automation Script Modules ........ SUCCESS [  5.920 s]
[INFO] Eclipse SmartHome Automation Media Modules ......... SUCCESS [  5.487 s]
[INFO] Eclipse SmartHome Automation Timer Modules ......... SUCCESS [  5.030 s]
[INFO] Eclipse SmartHome Automation Module Timer Tests .... SUCCESS [ 21.557 s]
[INFO] Eclipse SmartHome Automation Script Default Scope .. SUCCESS [  5.282 s]
[INFO] Eclipse SmartHome Automation Script Module Defaultscope Tests SUCCESS [ 10.868 s]
[INFO] Eclipse SmartHome Automation Script RuleSupport .... SUCCESS [  7.639 s]
[INFO] Eclipse SmartHome Automation Script Module Tests ... SUCCESS [ 11.979 s]
[INFO] Eclipse SmartHome Automation Event Tests ........... SUCCESS [ 24.732 s]
[INFO] Eclipse SmartHome Automation Integration Tests ..... SUCCESS [ 22.716 s]
[INFO] Eclipse SmartHome Automation Sample Extension Java . SUCCESS [  6.693 s]
[INFO] Eclipse SmartHome Automation REST API .............. SUCCESS [  5.926 s]
[INFO] Eclipse SmartHome Automation Sample REST API ....... SUCCESS [  4.114 s]
[INFO] Eclipse SmartHome Automation Java Demo ............. SUCCESS [  3.947 s]
[INFO] Eclipse SmartHome Automation Json Demo ............. SUCCESS [  0.446 s]
[INFO] Eclipse SmartHome Automation Module Type Demo ...... SUCCESS [  5.247 s]
[INFO] Eclipse SmartHome Automation Thing Support ......... SUCCESS [  4.680 s]
[INFO] Eclipse SmartHome Console for OSGi framework Eclipse Equinox SUCCESS [  7.951 s]
[INFO] Eclipse SmartHome Console for OSGi Console RFC 147 . SUCCESS [  6.052 s]
[INFO] Eclipse SmartHome Console for OSGi runtime Karaf ... SUCCESS [  5.329 s]
[INFO] Eclipse SmartHome Monitor .......................... SUCCESS [  4.151 s]
[INFO] Eclipse SmartHome Network I/O Tests ................ SUCCESS [ 14.788 s]
[INFO] Eclipse SmartHome HTTP Interface Authentication .... SUCCESS [  4.946 s]
[INFO] Eclipse SmartHome HTTP Interface Basic Authentication SUCCESS [  3.846 s]
[INFO] Eclipse SmartHome Network I/O HTTP Tests ........... SUCCESS [ 11.139 s]
[INFO] Eclipse SmartHome IO REST Tests .................... SUCCESS [ 14.298 s]
[INFO] Eclipse SmartHome Authentication Support for the REST Interface SUCCESS [  4.080 s]
[INFO] Eclipse SmartHome Core REST Interface .............. SUCCESS [ 13.328 s]
[INFO] Eclipse SmartHome IO REST Core Tests ............... SUCCESS [ 20.132 s]
[INFO] Eclipse SmartHome REST mDNS Announcer .............. SUCCESS [  4.842 s]
[INFO] Eclipse SmartHome REST JAX-RS Optimizations ........ SUCCESS [  4.302 s]
[INFO] Eclipse SmartHome SSE Interface .................... SUCCESS [ 10.728 s]
[INFO] Eclipse SmartHome IO SSE Tests ..................... SUCCESS [ 10.541 s]
[INFO] Eclipse SmartHome Models ........................... SUCCESS [ 49.916 s]
[INFO] Eclipse SmartHome Model Core ....................... SUCCESS [ 11.260 s]
[INFO] Eclipse SmartHome Model Lazy Generation ............ SUCCESS [  5.804 s]
[INFO] Eclipse SmartHome Model Sitemap .................... SUCCESS [ 54.112 s]
[INFO] Eclipse SmartHome Model Items ...................... SUCCESS [ 23.919 s]
[INFO] Eclipse SmartHome UIs .............................. SUCCESS [  0.021 s]
[INFO] Eclipse SmartHome UI ............................... SUCCESS [ 11.059 s]
[INFO] Eclipse SmartHome Sitemap REST Interface ........... SUCCESS [ 14.434 s]
[INFO] Eclipse SmartHome Sitemap REST Interface Tests ..... SUCCESS [ 14.777 s]
[INFO] Eclipse SmartHome Core REST UI Logging Module ...... SUCCESS [  4.494 s]
[INFO] Eclipse SmartHome Voice REST Interface ............. SUCCESS [  4.348 s]
[INFO] Eclipse SmartHome DBus Transport ................... SUCCESS [  0.591 s]
[INFO] Eclipse SmartHome MQTT Transport ................... SUCCESS [ 10.793 s]
[INFO] Eclipse SmartHome Mqtt Transport I/O Tests ......... SUCCESS [ 13.120 s]
[INFO] Eclipse SmartHome Serial Transport for Java Communications API SUCCESS [  5.907 s]
[INFO] Eclipse SmartHome Serial Transport for RXTX ........ SUCCESS [  4.969 s]
[INFO] Eclipse SmartHome Serial Transport for RFC2217 ..... SUCCESS [  4.514 s]
[INFO] Eclipse SmartHome UPnP Transport ................... SUCCESS [  6.960 s]
[INFO] Eclipse SmartHome IO UPnP Tests .................... SUCCESS [ 13.293 s]
[INFO] Eclipse SmartHome Model Core Tests ................. SUCCESS [ 28.839 s]
[INFO] Eclipse SmartHome Model Item IDE ................... SUCCESS [01:06 min]
[INFO] Eclipse SmartHome Model Items Runtime .............. SUCCESS [  4.462 s]
[INFO] Eclipse SmartHome Model Items Tests ................ SUCCESS [02:22 min]
[INFO] Eclipse SmartHome Model Persistence ................ SUCCESS [01:09 min]
[INFO] Eclipse SmartHome Model Persistence IDE ............ SUCCESS [ 11.703 s]
[INFO] Eclipse SmartHome Model Script ..................... SUCCESS [ 37.563 s]
[INFO] Eclipse SmartHome Model Rules ...................... SUCCESS [ 50.343 s]
[INFO] Eclipse SmartHome Model Rule IDE ................... SUCCESS [ 14.711 s]
[INFO] Eclipse SmartHome Model Script IDE ................. SUCCESS [ 18.694 s]
[INFO] Eclipse SmartHome Model Sitemap IDE ................ SUCCESS [ 17.850 s]
[INFO] Eclipse SmartHome Model Thing ...................... SUCCESS [ 28.621 s]
[INFO] Eclipse SmartHome Model Thing IDE .................. SUCCESS [01:53 min]
[INFO] Eclipse SmartHome Language Server .................. SUCCESS [ 15.781 s]
[INFO] Eclipse SmartHome Language Server Tests ............ SUCCESS [ 12.259 s]
[INFO] Eclipse SmartHome Model Persistence Runtime ........ SUCCESS [  4.873 s]
[INFO] Eclipse SmartHome Model Persistence Tests .......... SUCCESS [ 13.019 s]
[INFO] Eclipse SmartHome Model Rules Runtime .............. SUCCESS [  9.065 s]
[INFO] Eclipse SmartHome Model Script Runtime ............. SUCCESS [  5.859 s]
[INFO] Eclipse SmartHome Model Rules Tests ................ SUCCESS [ 31.152 s]
[INFO] Eclipse SmartHome Model Script Tests ............... SUCCESS [ 56.337 s]
[INFO] Eclipse SmartHome Model Sitemap Runtime ............ SUCCESS [  4.992 s]
[INFO] Eclipse SmartHome Model Thing Runtime .............. SUCCESS [  4.411 s]
[INFO] Eclipse SmartHome Model Thing Tests ................ SUCCESS [ 29.795 s]
[INFO] Eclipse SmartHome UI Tests ......................... SUCCESS [ 13.930 s]
[INFO] Eclipse SmartHome UI Icon Support .................. SUCCESS [ 10.470 s]
[INFO] Eclipse SmartHome UI Icon Tests .................... SUCCESS [ 17.656 s]
[INFO] Eclipse SmartHome Storages ......................... SUCCESS [  0.021 s]
[INFO] Eclipse SmartHome JSON Storage ..................... SUCCESS [  6.411 s]
[INFO] Eclipse SmartHome Storage JSON Tests ............... SUCCESS [ 18.881 s]
[INFO] Eclipse SmartHome MapDB Storage .................... SUCCESS [ 11.483 s]
[INFO] Eclipse SmartHome Storage MapDB Tests .............. SUCCESS [ 33.145 s]
[INFO] Eclipse SmartHome Extensions ....................... SUCCESS [  0.025 s]
[INFO] Eclipse SmartHome Bindings ......................... SUCCESS [  0.024 s]
[INFO] Eclipse SmartHome Astro Binding .................... SUCCESS [ 17.426 s]
[INFO] Eclipse SmartHome Astro Binding Tests .............. SUCCESS [ 14.261 s]
[INFO] Eclipse SmartHome Bluetooth Binding ................ SUCCESS [ 10.462 s]
[INFO] Eclipse SmartHome BlueGiga Bluetooth Adapter ....... SUCCESS [ 22.966 s]
[INFO] Eclipse SmartHome Bluetooth BlueGiga Tests ......... SUCCESS [ 12.799 s]
[INFO] Eclipse SmartHome BlueZ Bluetooth Adapter .......... SUCCESS [  6.061 s]
[INFO] Eclipse SmartHome Blukii Binding ................... SUCCESS [ 11.058 s]
[INFO] Eclipse SmartHome Bluetooth Binding Tests .......... SUCCESS [ 19.154 s]
[INFO] Eclipse SmartHome Bose SoundTouch Binding .......... SUCCESS [ 20.658 s]
[INFO] Eclipse SmartHome DigitalSTROM Binding ............. SUCCESS [ 26.652 s]
[INFO] Eclipse SmartHome DMX Binding ...................... SUCCESS [ 10.221 s]
[INFO] Eclipse SmartHome DMX Binding Tests ................ SUCCESS [ 15.851 s]
[INFO] Eclipse SmartHome Homematic Binding ................ SUCCESS [ 18.279 s]
[INFO] Eclipse SmartHome Homematic Binding Tests .......... SUCCESS [ 22.538 s]
[INFO] Eclipse SmartHome hue Binding ...................... SUCCESS [ 13.451 s]
[INFO] Eclipse SmartHome hue Binding Tests ................ SUCCESS [ 31.122 s]
[INFO] Eclipse SmartHome FSInternetRadio Binding .......... SUCCESS [  7.766 s]
[INFO] Eclipse SmartHome FSInternetRadio Binding Test ..... SUCCESS [ 17.196 s]
[INFO] Eclipse SmartHome LIFX Binding ..................... SUCCESS [ 17.453 s]
[INFO] Eclipse SmartHome LIRC Binding ..................... SUCCESS [  7.975 s]
[INFO] Eclipse SmartHome meteoblue Binding ................ SUCCESS [ 10.044 s]
[INFO] Eclipse SmartHome MQTT Binding ..................... SUCCESS [  9.227 s]
[INFO] Eclipse SmartHome MQTT Binding Tests ............... FAILURE [ 10.449 s]
[INFO] Eclipse SmartHome MQTT Thing Binding ............... SKIPPED
[INFO] Eclipse SmartHome I/O Services ..................... SKIPPED
[INFO] Eclipse SmartHome Embedded MQTT Broker ............. SKIPPED
[INFO] Eclipse SmartHome MQTT Thing Binding Tests ......... SKIPPED
[INFO] Eclipse SmartHome NTP Binding ...................... SKIPPED
[INFO] Eclipse SmartHome NTP Binding Tests ................ SKIPPED
[INFO] Eclipse SmartHome OneWire Binding .................. SKIPPED
[INFO] Eclipse SmartHome OneWire Binding Tests ............ SKIPPED
[INFO] Eclipse SmartHome OpenWeatherMap Binding ........... SKIPPED
[INFO] Eclipse SmartHome SerialButton Binding ............. SKIPPED
[INFO] Eclipse SmartHome Sonos Binding .................... SKIPPED
[INFO] Eclipse SmartHome SonyAudio Binding ................ SKIPPED
[INFO] Eclipse SmartHome TRÅDFRI Binding .................. SKIPPED
[INFO] Eclipse SmartHome TRÅDFRI Binding Tests ............ SKIPPED
[INFO] Eclipse SmartHome WeatherUnderground Binding ....... SKIPPED
[INFO] Eclipse SmartHome WeMo Binding ..................... SKIPPED
[INFO] Eclipse SmartHome Wemo Binding Tests ............... SKIPPED
[INFO] Eclipse SmartHome Extension Service Extensions ..... SKIPPED
[INFO] Eclipse SmartHome IoT Marketplace Extension Service  SKIPPED
[INFO] Eclipse SmartHome IoT Marketplace Extension Automation Support SKIPPED
[INFO] Eclipse SmartHome IoT Marketplace Extension Service Test SKIPPED
[INFO] Eclipse SmartHome JavaSound I/O .................... SKIPPED
[INFO] Eclipse SmartHome Embedded MQTT Broker Tests ....... SKIPPED
[INFO] Eclipse SmartHome Web Audio Support ................ SKIPPED
[INFO] Eclipse SmartHome Persistence ...................... SKIPPED
[INFO] Eclipse SmartHome MapDB Persistence ................ SKIPPED
[INFO] Eclipse SmartHome MapDB Persistence Tests .......... SKIPPED
[INFO] Eclipse SmartHome Transformation Services .......... SKIPPED
[INFO] Eclipse SmartHome Exec Transformation Service ...... SKIPPED
[INFO] Eclipse SmartHome Javascript Transformation Service  SKIPPED
[INFO] Eclipse SmartHome Map Transformation Service ....... SKIPPED
[INFO] Eclipse SmartHome Map Transformation Service Tests . SKIPPED
[INFO] Eclipse SmartHome Scale Transformation Service ..... SKIPPED
[INFO] Eclipse SmartHome Scale Transformation Service Tests SKIPPED
[INFO] Eclipse SmartHome RegEx Transformation Service ..... SKIPPED
[INFO] Eclipse SmartHome RegEx Transformation Service Tests SKIPPED
[INFO] Eclipse SmartHome XPath Transformation Service ..... SKIPPED
[INFO] Eclipse SmartHome XPath Transformation Service Tests SKIPPED
[INFO] Eclipse SmartHome JSonPath Transformation Service .. SKIPPED
[INFO] Eclipse SmartHome JSonPath Transformation Service Tests SKIPPED
[INFO] Eclipse SmartHome Xslt Transformation Service ...... SKIPPED
[INFO] Eclipse SmartHome Xslt Transformation Service Tests  SKIPPED
[INFO] Eclipse SmartHome UI Extensions .................... SKIPPED
[INFO] Eclipse SmartHome Icon Sets ........................ SKIPPED
[INFO] Eclipse SmartHome Classic Icon Set ................. SKIPPED
[INFO] Eclipse SmartHome Basic UI ......................... SKIPPED
[INFO] Eclipse SmartHome Classic UI ....................... SKIPPED
[INFO] Eclipse SmartHome Paper UI ......................... SKIPPED
[INFO] Eclipse SmartHome Voice Services ................... SKIPPED
[INFO] Eclipse SmartHome macOS Text-to-Speech ............. SKIPPED
[INFO] Eclipse SmartHome macOS Text-to-Speech Tests ....... SKIPPED
[INFO] Eclipse SmartHome Features ......................... SKIPPED
[INFO] Eclipse SmartHome Runtime Core Feature ............. SKIPPED
[INFO] Eclipse SmartHome Runtime Model Feature ............ SKIPPED
[INFO] Eclipse SmartHome Runtime UI Feature ............... SKIPPED
[INFO] Eclipse SmartHome Runtime REST Feature ............. SKIPPED
[INFO] Eclipse SmartHome Runtime Automation Feature ....... SKIPPED
[INFO] Eclipse SmartHome Runtime Equinox Console Feature .. SKIPPED
[INFO] Eclipse SmartHome Runtime RfC147 Console Feature ... SKIPPED
[INFO] Eclipse SmartHome Runtime Binding Feature .......... SKIPPED
[INFO] Eclipse SmartHome Test Dependencies ................ SKIPPED
[INFO] Eclipse SmartHome Karaf Features ................... SKIPPED
[INFO] Eclipse SmartHome Target Platform Feature .......... SKIPPED
[INFO] Eclipse SmartHome Core Feature ..................... SKIPPED
[INFO] Eclipse SmartHome Extensions Feature ............... SKIPPED
[INFO] Eclipse SmartHome Karaf Feature Verification ....... SKIPPED
[INFO] Eclipse SmartHome Products ......................... SKIPPED
[INFO] Eclipse SmartHome p2 Repository .................... SKIPPED
[INFO] Eclipse SmartHome Tools ............................ SKIPPED
[INFO] Eclipse SmartHome Archetypes ....................... SKIPPED
[INFO] Eclipse SmartHome Binding Archetype ................ SKIPPED
[INFO] Eclipse SmartHome Binding Archetype Testsuite ...... SKIPPED
[INFO] Eclipse SmartHome Target Platform .................. SKIPPED
[INFO] Eclipse SmartHome Distribution 0.11.0-SNAPSHOT ..... SKIPPED
[INFO] ------------------------------------------------------------------------
[INFO] BUILD FAILURE
[INFO] ------------------------------------------------------------------------
[INFO] Total time: 01:00 h
[INFO] Finished at: 2019-01-31T07:08:50-05:00
[INFO] ------------------------------------------------------------------------
[ERROR] Failed to execute goal org.eclipse.tycho:tycho-surefire-plugin:1.2.0:test (default-test) on project org.eclipse.smarthome.binding.mqtt.test: There are test failures.
[ERROR] 
[ERROR] Please refer to /jobs/genie.smarthome/SmartHomeDistribution-Nightly-PR/workspace/extensions/binding/org.eclipse.smarthome.binding.mqtt.test/target/surefire-reports for the individual test results.
[ERROR] -> [Help 1]
[ERROR] 
[ERROR] To see the full stack trace of the errors, re-run Maven with the -e switch.
[ERROR] Re-run Maven using the -X switch to enable full debug logging.
[ERROR] 
[ERROR] For more information about the errors and possible solutions, please read the following articles:
[ERROR] [Help 1] http://cwiki.apache.org/confluence/display/MAVEN/MojoFailureException
[ERROR] 
[ERROR] After correcting the problems, you can resume the build with the command
[ERROR]   mvn <goals> -rf :org.eclipse.smarthome.binding.mqtt.test
Build step 'Invoke top-level Maven targets' marked build as failure
Not sending mail to unregistered user kai@openhab.org
Sending e-mails to: kai@openhab.org maggu2810@gmail.com henning.treu@telekom.de
Recording test results
Started calculate disk usage of build
Finished Calculation of disk usage of build in 0 seconds
Started calculate disk usage of workspace
Finished Calculation of disk usage of workspace in  1 second
Finished: FAILURE