FailedConsole Output

Skipping 3,552 KB.. Full Log
c/hipp/homes/genie.smarthome/.m2/repository/org/eclipse/smarthome/binding/org.eclipse.smarthome.binding.hue/0.9.0.b2/org.eclipse.smarthome.binding.hue-0.9.0.b2.pom
[INFO] Installing /jobs/genie.smarthome/BuildRelease/workspace/extensions/binding/org.eclipse.smarthome.binding.hue/target/org.eclipse.smarthome.binding.hue-0.9.0.b2-sources.jar to /opt/public/hipp/homes/genie.smarthome/.m2/repository/org/eclipse/smarthome/binding/org.eclipse.smarthome.binding.hue/0.9.0.b2/org.eclipse.smarthome.binding.hue-0.9.0.b2-sources.jar
[INFO] Installing /jobs/genie.smarthome/BuildRelease/workspace/extensions/binding/org.eclipse.smarthome.binding.hue/target/p2content.xml to /opt/public/hipp/homes/genie.smarthome/.m2/repository/org/eclipse/smarthome/binding/org.eclipse.smarthome.binding.hue/0.9.0.b2/org.eclipse.smarthome.binding.hue-0.9.0.b2-p2metadata.xml
[INFO] Installing /jobs/genie.smarthome/BuildRelease/workspace/extensions/binding/org.eclipse.smarthome.binding.hue/target/p2artifacts.xml to /opt/public/hipp/homes/genie.smarthome/.m2/repository/org/eclipse/smarthome/binding/org.eclipse.smarthome.binding.hue/0.9.0.b2/org.eclipse.smarthome.binding.hue-0.9.0.b2-p2artifacts.xml
[INFO] 
[INFO] --- tycho-p2-plugin:0.23.1:update-local-index (default-update-local-index) @ org.eclipse.smarthome.binding.hue ---
[INFO]                                                                         
[INFO] ------------------------------------------------------------------------
[INFO] Building Eclipse SmartHome hue Binding Tests 0.9.0.b2
[INFO] ------------------------------------------------------------------------
[INFO] 
[INFO] --- maven-clean-plugin:2.5:clean (default-clean) @ org.eclipse.smarthome.binding.hue.test ---
[INFO] Deleting /jobs/genie.smarthome/BuildRelease/workspace/extensions/binding/org.eclipse.smarthome.binding.hue.test/target
[INFO] 
[INFO] --- tycho-packaging-plugin:0.23.1:build-qualifier (default-build-qualifier) @ org.eclipse.smarthome.binding.hue.test ---
[INFO] The project's OSGi version is 0.9.0.b2
[INFO] 
[INFO] --- tycho-packaging-plugin:0.23.1:validate-id (default-validate-id) @ org.eclipse.smarthome.binding.hue.test ---
[INFO] 
[INFO] --- tycho-packaging-plugin:0.23.1:validate-version (default-validate-version) @ org.eclipse.smarthome.binding.hue.test ---
[INFO] 
[INFO] --- jacoco-maven-plugin:0.7.4.201502262128:prepare-agent (default-prepare-agent) @ org.eclipse.smarthome.binding.hue.test ---
[INFO] tycho.testArgLine set to -javaagent:/opt/public/hipp/homes/genie.smarthome/.m2/repository/org/jacoco/org.jacoco.agent/0.7.4.201502262128/org.jacoco.agent-0.7.4.201502262128-runtime.jar=destfile=/jobs/genie.smarthome/BuildRelease/workspace/target/coverage.jacoco,append=true,excludes=**/*Test.*
[INFO] 
[INFO] --- build-helper-maven-plugin:1.8:add-source (add-source) @ org.eclipse.smarthome.binding.hue.test ---
[INFO] Source directory: /jobs/genie.smarthome/BuildRelease/workspace/extensions/binding/org.eclipse.smarthome.binding.hue.test/src/main/groovy added.
[INFO] 
[INFO] --- maven-resources-plugin:2.4.3:resources (default-resources) @ org.eclipse.smarthome.binding.hue.test ---
[INFO] Using 'UTF-8' encoding to copy filtered resources.
[INFO] skip non existing resourceDirectory /jobs/genie.smarthome/BuildRelease/workspace/extensions/binding/org.eclipse.smarthome.binding.hue.test/src/main/resources
[INFO] 
[INFO] --- tycho-compiler-plugin:0.23.1:compile (default-compile) @ org.eclipse.smarthome.binding.hue.test ---
[INFO] Compiling 1 source file to /jobs/genie.smarthome/BuildRelease/workspace/extensions/binding/org.eclipse.smarthome.binding.hue.test/target/classes
[INFO] 
[INFO] --- maven-compiler-plugin:3.1:compile (default) @ org.eclipse.smarthome.binding.hue.test ---
[INFO] Changes detected - recompiling the module!
[INFO] Using Groovy-Eclipse compiler to compile both Java and Groovy files
[INFO] 
[INFO] --- build-helper-maven-plugin:1.8:add-test-source (add-test-source) @ org.eclipse.smarthome.binding.hue.test ---
[INFO] Test Source directory: /jobs/genie.smarthome/BuildRelease/workspace/extensions/binding/org.eclipse.smarthome.binding.hue.test/src/test/groovy added.
[INFO] 
[INFO] --- maven-resources-plugin:2.4.3:testResources (default-testResources) @ org.eclipse.smarthome.binding.hue.test ---
[INFO] Using 'UTF-8' encoding to copy filtered resources.
[INFO] skip non existing resourceDirectory /jobs/genie.smarthome/BuildRelease/workspace/extensions/binding/org.eclipse.smarthome.binding.hue.test/src/test/resources
[INFO] 
[INFO] --- tycho-source-plugin:0.23.1:plugin-source (plugin-source) @ org.eclipse.smarthome.binding.hue.test ---
[WARNING] bundle localization file /jobs/genie.smarthome/BuildRelease/workspace/extensions/binding/org.eclipse.smarthome.binding.hue.test/plugin.properties not found
[INFO] Building jar: /jobs/genie.smarthome/BuildRelease/workspace/extensions/binding/org.eclipse.smarthome.binding.hue.test/target/org.eclipse.smarthome.binding.hue.test-0.9.0.b2-sources.jar
[INFO] 
[INFO] --- target-platform-configuration:0.23.1:target-platform (default-target-platform) @ org.eclipse.smarthome.binding.hue.test ---
[INFO] 
[INFO] --- tycho-packaging-plugin:0.23.1:package-plugin (default-package-plugin) @ org.eclipse.smarthome.binding.hue.test ---
[INFO] Building jar: /jobs/genie.smarthome/BuildRelease/workspace/extensions/binding/org.eclipse.smarthome.binding.hue.test/target/org.eclipse.smarthome.binding.hue.test-0.9.0.b2.jar
[INFO] 
[INFO] --- tycho-p2-plugin:0.23.1:p2-metadata-default (default-p2-metadata-default) @ org.eclipse.smarthome.binding.hue.test ---
[INFO] 
[INFO] --- jacoco-maven-plugin:0.7.4.201502262128:prepare-agent-integration (default-prepare-agent-integration) @ org.eclipse.smarthome.binding.hue.test ---
[INFO] tycho.testArgLine set to -javaagent:/opt/public/hipp/homes/genie.smarthome/.m2/repository/org/jacoco/org.jacoco.agent/0.7.4.201502262128/org.jacoco.agent-0.7.4.201502262128-runtime.jar=destfile=/jobs/genie.smarthome/BuildRelease/workspace/target/coverage.jacoco,append=true,excludes=**/*Test.*
[INFO] 
[INFO] --- tycho-surefire-plugin:0.23.1:test (default-test) @ org.eclipse.smarthome.binding.hue.test ---
[INFO] Expected eclipse log file: /jobs/genie.smarthome/BuildRelease/workspace/extensions/binding/org.eclipse.smarthome.binding.hue.test/target/work/data/.metadata/.log
[INFO] Command line:
	[/opt/public/common/jdk1.7.0_80/jre/bin/java, -Dosgi.noShutdown=false, -Dosgi.os=linux, -Dosgi.ws=gtk, -Dosgi.arch=x86_64, -javaagent:/opt/public/hipp/homes/genie.smarthome/.m2/repository/org/jacoco/org.jacoco.agent/0.7.4.201502262128/org.jacoco.agent-0.7.4.201502262128-runtime.jar=destfile=/jobs/genie.smarthome/BuildRelease/workspace/target/coverage.jacoco,append=true,excludes=**/*Test.*, -Dosgi.clean=true, -jar, /opt/public/hipp/homes/genie.smarthome/.m2/repository/p2/osgi/bundle/org.eclipse.equinox.launcher/1.3.0.v20140415-2008/org.eclipse.equinox.launcher-1.3.0.v20140415-2008.jar, -data, /jobs/genie.smarthome/BuildRelease/workspace/extensions/binding/org.eclipse.smarthome.binding.hue.test/target/work/data, -install, /jobs/genie.smarthome/BuildRelease/workspace/extensions/binding/org.eclipse.smarthome.binding.hue.test/target/work, -configuration, /jobs/genie.smarthome/BuildRelease/workspace/extensions/binding/org.eclipse.smarthome.binding.hue.test/target/work/configuration, -application, org.eclipse.tycho.surefire.osgibooter.headlesstest, -testproperties, /jobs/genie.smarthome/BuildRelease/workspace/extensions/binding/org.eclipse.smarthome.binding.hue.test/target/surefire.properties]
SLF4J: Failed to load class "org.slf4j.impl.StaticLoggerBinder".
SLF4J: Defaulting to no-operation (NOP) logger implementation
SLF4J: See http://www.slf4j.org/codes.html#StaticLoggerBinder for further details.

-------------------------------------------------------
 T E S T S
-------------------------------------------------------
Running org.eclipse.smarthome.binding.hue.test.LightStateConverterOSGiTest
Tests run: 1, Failures: 0, Errors: 0, Skipped: 0, Time elapsed: 0.871 sec - in org.eclipse.smarthome.binding.hue.test.LightStateConverterOSGiTest
assert that LightStateConverter conversion is bijective(org.eclipse.smarthome.binding.hue.test.LightStateConverterOSGiTest)  Time elapsed: 0.339 sec
Running org.eclipse.smarthome.binding.hue.test.HueBridgeDiscoveryParticipantOSGITest
Tests run: 5, Failures: 0, Errors: 0, Skipped: 0, Time elapsed: 0.17 sec - in org.eclipse.smarthome.binding.hue.test.HueBridgeDiscoveryParticipantOSGITest
assert no discovery result for unknown device(org.eclipse.smarthome.binding.hue.test.HueBridgeDiscoveryParticipantOSGITest)  Time elapsed: 0.102 sec
assert correct thing UID(org.eclipse.smarthome.binding.hue.test.HueBridgeDiscoveryParticipantOSGITest)  Time elapsed: 0.008 sec
assert no thing UID for unknown device(org.eclipse.smarthome.binding.hue.test.HueBridgeDiscoveryParticipantOSGITest)  Time elapsed: 0.001 sec
assert correct supported types(org.eclipse.smarthome.binding.hue.test.HueBridgeDiscoveryParticipantOSGITest)  Time elapsed: 0.012 sec
assert valid DiscoveryResult(org.eclipse.smarthome.binding.hue.test.HueBridgeDiscoveryParticipantOSGITest)  Time elapsed: 0.021 sec
Running org.eclipse.smarthome.binding.hue.test.HueBridgeNupnpDiscoveryOSGITest
Tests run: 3, Failures: 0, Errors: 0, Skipped: 0, Time elapsed: 0.385 sec - in org.eclipse.smarthome.binding.hue.test.HueBridgeNupnpDiscoveryOSGITest
assert that invalid bridges are not discovered(org.eclipse.smarthome.binding.hue.test.HueBridgeNupnpDiscoveryOSGITest)  Time elapsed: 0.235 sec
assert that bridge thing type is supported(org.eclipse.smarthome.binding.hue.test.HueBridgeNupnpDiscoveryOSGITest)  Time elapsed: 0.041 sec
assert that valid bridges are discovered(org.eclipse.smarthome.binding.hue.test.HueBridgeNupnpDiscoveryOSGITest)  Time elapsed: 0.074 sec
Running org.eclipse.smarthome.binding.hue.test.HueLightHandlerOSGiTest
Tests run: 31, Failures: 0, Errors: 0, Skipped: 0, Time elapsed: 39.709 sec - in org.eclipse.smarthome.binding.hue.test.HueLightHandlerOSGiTest
assert command for brightness channel: on(org.eclipse.smarthome.binding.hue.test.HueLightHandlerOSGiTest)  Time elapsed: 1.265 sec
assert command for color channel: black(org.eclipse.smarthome.binding.hue.test.HueLightHandlerOSGiTest)  Time elapsed: 1.137 sec
assert command for color channel: white(org.eclipse.smarthome.binding.hue.test.HueLightHandlerOSGiTest)  Time elapsed: 1.116 sec
assert command for color channel: increase(org.eclipse.smarthome.binding.hue.test.HueLightHandlerOSGiTest)  Time elapsed: 3.291 sec
assert command for osram par16 50 for color temperature channel: off(org.eclipse.smarthome.binding.hue.test.HueLightHandlerOSGiTest)  Time elapsed: 1.104 sec
assert command for color channel: decrease(org.eclipse.smarthome.binding.hue.test.HueLightHandlerOSGiTest)  Time elapsed: 2.188 sec
assert command for osram par16 50 for brightness channel: off(org.eclipse.smarthome.binding.hue.test.HueLightHandlerOSGiTest)  Time elapsed: 1.104 sec
assert command for osram par16 50 for color temperature channel: on(org.eclipse.smarthome.binding.hue.test.HueLightHandlerOSGiTest)  Time elapsed: 1.102 sec
assert percentage value of color temperature when ct: 153(org.eclipse.smarthome.binding.hue.test.HueLightHandlerOSGiTest)  Time elapsed: 0.023 sec
assert percentage value of color temperature when ct: 326(org.eclipse.smarthome.binding.hue.test.HueLightHandlerOSGiTest)  Time elapsed: 0.009 sec
assert percentage value of color temperature when ct: 500(org.eclipse.smarthome.binding.hue.test.HueLightHandlerOSGiTest)  Time elapsed: 0.009 sec
assert command for color temperature channel: 0%(org.eclipse.smarthome.binding.hue.test.HueLightHandlerOSGiTest)  Time elapsed: 1.094 sec
assert command for color temperature channel: on(org.eclipse.smarthome.binding.hue.test.HueLightHandlerOSGiTest)  Time elapsed: 1.108 sec
assert command for color channel: 0%(org.eclipse.smarthome.binding.hue.test.HueLightHandlerOSGiTest)  Time elapsed: 1.098 sec
assert command for color channel: on(org.eclipse.smarthome.binding.hue.test.HueLightHandlerOSGiTest)  Time elapsed: 1.096 sec
assert command for brightness channel: 50%(org.eclipse.smarthome.binding.hue.test.HueLightHandlerOSGiTest)  Time elapsed: 1.093 sec
assert command for brightness channel: off(org.eclipse.smarthome.binding.hue.test.HueLightHandlerOSGiTest)  Time elapsed: 1.088 sec
assert command for color temperature channel: 50%(org.eclipse.smarthome.binding.hue.test.HueLightHandlerOSGiTest)  Time elapsed: 1.092 sec
assert command for color temperature channel: off(org.eclipse.smarthome.binding.hue.test.HueLightHandlerOSGiTest)  Time elapsed: 1.096 sec
assert command for color channel: 50%(org.eclipse.smarthome.binding.hue.test.HueLightHandlerOSGiTest)  Time elapsed: 1.097 sec
assert command for color channel: off(org.eclipse.smarthome.binding.hue.test.HueLightHandlerOSGiTest)  Time elapsed: 1.097 sec
assert command for color channel: red(org.eclipse.smarthome.binding.hue.test.HueLightHandlerOSGiTest)  Time elapsed: 1.096 sec
assert command for brightness channel: increase(org.eclipse.smarthome.binding.hue.test.HueLightHandlerOSGiTest)  Time elapsed: 3.238 sec
assert command for alert channel(org.eclipse.smarthome.binding.hue.test.HueLightHandlerOSGiTest)  Time elapsed: 3.265 sec
assert command for brightness channel: decrease(org.eclipse.smarthome.binding.hue.test.HueLightHandlerOSGiTest)  Time elapsed: 2.165 sec
assert command for color temperature channel: 100%(org.eclipse.smarthome.binding.hue.test.HueLightHandlerOSGiTest)  Time elapsed: 1.09 sec
assert that HueLightHandler status detail is set to bridge offline when the bridge is offline(org.eclipse.smarthome.binding.hue.test.HueLightHandlerOSGiTest)  Time elapsed: 0.051 sec
assert command for osram par16 50 for brightness channel: on(org.eclipse.smarthome.binding.hue.test.HueLightHandlerOSGiTest)  Time elapsed: 1.089 sec
assert command for color channel: 100%(org.eclipse.smarthome.binding.hue.test.HueLightHandlerOSGiTest)  Time elapsed: 1.093 sec
assert command for color channel: blue(org.eclipse.smarthome.binding.hue.test.HueLightHandlerOSGiTest)  Time elapsed: 1.099 sec
assert command for effect channel(org.eclipse.smarthome.binding.hue.test.HueLightHandlerOSGiTest)  Time elapsed: 2.178 sec
Running org.eclipse.smarthome.binding.hue.test.HueBridgeHandlerOSGiTest
Tests run: 8, Failures: 0, Errors: 0, Skipped: 0, Time elapsed: 0.269 sec - in org.eclipse.smarthome.binding.hue.test.HueBridgeHandlerOSGiTest
verify offline is set without bridge offline status(org.eclipse.smarthome.binding.hue.test.HueBridgeHandlerOSGiTest)  Time elapsed: 0.025 sec
assert that a status configuration message for missing bridge IP is properly returned (IP is an empty string)(org.eclipse.smarthome.binding.hue.test.HueBridgeHandlerOSGiTest)  Time elapsed: 0.04 sec
assert that an existing user is used if authentication was successful(org.eclipse.smarthome.binding.hue.test.HueBridgeHandlerOSGiTest)  Time elapsed: 0.033 sec
assert correct status if authentication failed for old user(org.eclipse.smarthome.binding.hue.test.HueBridgeHandlerOSGiTest)  Time elapsed: 0.038 sec
verify status if link button is not pressed(org.eclipse.smarthome.binding.hue.test.HueBridgeHandlerOSGiTest)  Time elapsed: 0.033 sec
assert that a status configuration message for missing bridge IP is properly returned (IP is null)(org.eclipse.smarthome.binding.hue.test.HueBridgeHandlerOSGiTest)  Time elapsed: 0.022 sec
assert that a new user is added to config if not existing yet(org.eclipse.smarthome.binding.hue.test.HueBridgeHandlerOSGiTest)  Time elapsed: 0.035 sec
verify status if new user cannot be created(org.eclipse.smarthome.binding.hue.test.HueBridgeHandlerOSGiTest)  Time elapsed: 0.031 sec
Running org.eclipse.smarthome.binding.hue.test.HueLightDiscoveryServiceOSGITest
Tests run: 2, Failures: 0, Errors: 0, Skipped: 0, Time elapsed: 1.099 sec - in org.eclipse.smarthome.binding.hue.test.HueLightDiscoveryServiceOSGITest
assert hue light registration(org.eclipse.smarthome.binding.hue.test.HueLightDiscoveryServiceOSGITest)  Time elapsed: 0.044 sec
assert startSearch is called(org.eclipse.smarthome.binding.hue.test.HueLightDiscoveryServiceOSGITest)  Time elapsed: 1.041 sec

Results :

Tests run: 50, Failures: 0, Errors: 0, Skipped: 0

[INFO] All tests passed!
[INFO] 
[INFO] --- eclipse-jarsigner-plugin:1.0.5:sign (sign) @ org.eclipse.smarthome.binding.hue.test ---
[INFO] Searching org.eclipse.smarthome.binding.hue.test-0.9.0.b2.jar for inner jars...
[INFO] Signed org.eclipse.smarthome.binding:org.eclipse.smarthome.binding.hue.test:eclipse-test-plugin:0.9.0.b2 in 1 seconds.
[INFO] Searching org.eclipse.smarthome.binding.hue.test-0.9.0.b2-sources.jar for inner jars...
[INFO] Signed org.eclipse.smarthome.binding:org.eclipse.smarthome.binding.hue.test:java-source:sources:0.9.0.b2 in 1 seconds.
[INFO] 
[INFO] --- maven-install-plugin:2.3.1:install (default-install) @ org.eclipse.smarthome.binding.hue.test ---
[INFO] Installing /jobs/genie.smarthome/BuildRelease/workspace/extensions/binding/org.eclipse.smarthome.binding.hue.test/target/org.eclipse.smarthome.binding.hue.test-0.9.0.b2.jar to /opt/public/hipp/homes/genie.smarthome/.m2/repository/org/eclipse/smarthome/binding/org.eclipse.smarthome.binding.hue.test/0.9.0.b2/org.eclipse.smarthome.binding.hue.test-0.9.0.b2.jar
[INFO] Installing /jobs/genie.smarthome/BuildRelease/workspace/extensions/binding/org.eclipse.smarthome.binding.hue.test/pom.xml to /opt/public/hipp/homes/genie.smarthome/.m2/repository/org/eclipse/smarthome/binding/org.eclipse.smarthome.binding.hue.test/0.9.0.b2/org.eclipse.smarthome.binding.hue.test-0.9.0.b2.pom
[INFO] Installing /jobs/genie.smarthome/BuildRelease/workspace/extensions/binding/org.eclipse.smarthome.binding.hue.test/target/org.eclipse.smarthome.binding.hue.test-0.9.0.b2-sources.jar to /opt/public/hipp/homes/genie.smarthome/.m2/repository/org/eclipse/smarthome/binding/org.eclipse.smarthome.binding.hue.test/0.9.0.b2/org.eclipse.smarthome.binding.hue.test-0.9.0.b2-sources.jar
[INFO] Installing /jobs/genie.smarthome/BuildRelease/workspace/extensions/binding/org.eclipse.smarthome.binding.hue.test/target/p2content.xml to /opt/public/hipp/homes/genie.smarthome/.m2/repository/org/eclipse/smarthome/binding/org.eclipse.smarthome.binding.hue.test/0.9.0.b2/org.eclipse.smarthome.binding.hue.test-0.9.0.b2-p2metadata.xml
[INFO] Installing /jobs/genie.smarthome/BuildRelease/workspace/extensions/binding/org.eclipse.smarthome.binding.hue.test/target/p2artifacts.xml to /opt/public/hipp/homes/genie.smarthome/.m2/repository/org/eclipse/smarthome/binding/org.eclipse.smarthome.binding.hue.test/0.9.0.b2/org.eclipse.smarthome.binding.hue.test-0.9.0.b2-p2artifacts.xml
[INFO] 
[INFO] --- tycho-p2-plugin:0.23.1:update-local-index (default-update-local-index) @ org.eclipse.smarthome.binding.hue.test ---
[INFO]                                                                         
[INFO] ------------------------------------------------------------------------
[INFO] Building Eclipse SmartHome FSInternetRadio Binding 0.9.0.b2
[INFO] ------------------------------------------------------------------------
[INFO] 
[INFO] --- maven-clean-plugin:2.5:clean (default-clean) @ org.eclipse.smarthome.binding.fsinternetradio ---
[INFO] Deleting /jobs/genie.smarthome/BuildRelease/workspace/extensions/binding/org.eclipse.smarthome.binding.fsinternetradio/target
[INFO] 
[INFO] --- tycho-packaging-plugin:0.23.1:build-qualifier (default-build-qualifier) @ org.eclipse.smarthome.binding.fsinternetradio ---
[INFO] The project's OSGi version is 0.9.0.b2
[INFO] 
[INFO] --- tycho-packaging-plugin:0.23.1:validate-id (default-validate-id) @ org.eclipse.smarthome.binding.fsinternetradio ---
[INFO] 
[INFO] --- tycho-packaging-plugin:0.23.1:validate-version (default-validate-version) @ org.eclipse.smarthome.binding.fsinternetradio ---
[INFO] 
[INFO] --- jacoco-maven-plugin:0.7.4.201502262128:prepare-agent (default-prepare-agent) @ org.eclipse.smarthome.binding.fsinternetradio ---
[INFO] argLine set to -javaagent:/opt/public/hipp/homes/genie.smarthome/.m2/repository/org/jacoco/org.jacoco.agent/0.7.4.201502262128/org.jacoco.agent-0.7.4.201502262128-runtime.jar=destfile=/jobs/genie.smarthome/BuildRelease/workspace/target/coverage.jacoco,append=true,excludes=**/*Test.*
[INFO] 
[INFO] --- build-helper-maven-plugin:1.8:add-source (add-source) @ org.eclipse.smarthome.binding.fsinternetradio ---
[INFO] Source directory: /jobs/genie.smarthome/BuildRelease/workspace/extensions/binding/org.eclipse.smarthome.binding.fsinternetradio/src/main/groovy added.
[INFO] 
[INFO] --- maven-resources-plugin:2.4.3:resources (default-resources) @ org.eclipse.smarthome.binding.fsinternetradio ---
[INFO] Using 'UTF-8' encoding to copy filtered resources.
[INFO] skip non existing resourceDirectory /jobs/genie.smarthome/BuildRelease/workspace/extensions/binding/org.eclipse.smarthome.binding.fsinternetradio/src/main/resources
[INFO] 
[INFO] --- tycho-compiler-plugin:0.23.1:compile (default-compile) @ org.eclipse.smarthome.binding.fsinternetradio ---
[INFO] Compiling 7 source files to /jobs/genie.smarthome/BuildRelease/workspace/extensions/binding/org.eclipse.smarthome.binding.fsinternetradio/target/classes
[INFO] 
[INFO] --- maven-compiler-plugin:3.1:compile (default) @ org.eclipse.smarthome.binding.fsinternetradio ---
[INFO] Changes detected - recompiling the module!
[INFO] Nothing to compile - all classes are up to date
[INFO] 
[INFO] --- build-helper-maven-plugin:1.8:add-test-source (add-test-source) @ org.eclipse.smarthome.binding.fsinternetradio ---
[INFO] Test Source directory: /jobs/genie.smarthome/BuildRelease/workspace/extensions/binding/org.eclipse.smarthome.binding.fsinternetradio/src/test/groovy added.
[INFO] 
[INFO] --- maven-resources-plugin:2.4.3:testResources (default-testResources) @ org.eclipse.smarthome.binding.fsinternetradio ---
[INFO] Using 'UTF-8' encoding to copy filtered resources.
[INFO] skip non existing resourceDirectory /jobs/genie.smarthome/BuildRelease/workspace/extensions/binding/org.eclipse.smarthome.binding.fsinternetradio/src/test/resources
[INFO] 
[INFO] --- tycho-source-plugin:0.23.1:plugin-source (plugin-source) @ org.eclipse.smarthome.binding.fsinternetradio ---
[WARNING] bundle localization file /jobs/genie.smarthome/BuildRelease/workspace/extensions/binding/org.eclipse.smarthome.binding.fsinternetradio/plugin.properties not found
[INFO] Building jar: /jobs/genie.smarthome/BuildRelease/workspace/extensions/binding/org.eclipse.smarthome.binding.fsinternetradio/target/org.eclipse.smarthome.binding.fsinternetradio-0.9.0.b2-sources.jar
[INFO] 
[INFO] --- target-platform-configuration:0.23.1:target-platform (default-target-platform) @ org.eclipse.smarthome.binding.fsinternetradio ---
[INFO] 
[INFO] --- tycho-packaging-plugin:0.23.1:package-plugin (default-package-plugin) @ org.eclipse.smarthome.binding.fsinternetradio ---
[INFO] Building jar: /jobs/genie.smarthome/BuildRelease/workspace/extensions/binding/org.eclipse.smarthome.binding.fsinternetradio/target/org.eclipse.smarthome.binding.fsinternetradio-0.9.0.b2.jar
[INFO] 
[INFO] --- tycho-p2-plugin:0.23.1:p2-metadata-default (default-p2-metadata-default) @ org.eclipse.smarthome.binding.fsinternetradio ---
[INFO] 
[INFO] --- jacoco-maven-plugin:0.7.4.201502262128:prepare-agent-integration (default-prepare-agent-integration) @ org.eclipse.smarthome.binding.fsinternetradio ---
[INFO] argLine set to -javaagent:/opt/public/hipp/homes/genie.smarthome/.m2/repository/org/jacoco/org.jacoco.agent/0.7.4.201502262128/org.jacoco.agent-0.7.4.201502262128-runtime.jar=destfile=/jobs/genie.smarthome/BuildRelease/workspace/target/coverage.jacoco,append=true,excludes=**/*Test.*
[INFO] 
[INFO] --- eclipse-jarsigner-plugin:1.0.5:sign (sign) @ org.eclipse.smarthome.binding.fsinternetradio ---
[INFO] Searching org.eclipse.smarthome.binding.fsinternetradio-0.9.0.b2.jar for inner jars...
[INFO] Signed org.eclipse.smarthome.binding:org.eclipse.smarthome.binding.fsinternetradio:eclipse-plugin:0.9.0.b2 in 1 seconds.
[INFO] Searching org.eclipse.smarthome.binding.fsinternetradio-0.9.0.b2-sources.jar for inner jars...
[INFO] Signed org.eclipse.smarthome.binding:org.eclipse.smarthome.binding.fsinternetradio:java-source:sources:0.9.0.b2 in 1 seconds.
[INFO] 
[INFO] --- maven-install-plugin:2.3.1:install (default-install) @ org.eclipse.smarthome.binding.fsinternetradio ---
[INFO] Installing /jobs/genie.smarthome/BuildRelease/workspace/extensions/binding/org.eclipse.smarthome.binding.fsinternetradio/target/org.eclipse.smarthome.binding.fsinternetradio-0.9.0.b2.jar to /opt/public/hipp/homes/genie.smarthome/.m2/repository/org/eclipse/smarthome/binding/org.eclipse.smarthome.binding.fsinternetradio/0.9.0.b2/org.eclipse.smarthome.binding.fsinternetradio-0.9.0.b2.jar
[INFO] Installing /jobs/genie.smarthome/BuildRelease/workspace/extensions/binding/org.eclipse.smarthome.binding.fsinternetradio/pom.xml to /opt/public/hipp/homes/genie.smarthome/.m2/repository/org/eclipse/smarthome/binding/org.eclipse.smarthome.binding.fsinternetradio/0.9.0.b2/org.eclipse.smarthome.binding.fsinternetradio-0.9.0.b2.pom
[INFO] Installing /jobs/genie.smarthome/BuildRelease/workspace/extensions/binding/org.eclipse.smarthome.binding.fsinternetradio/target/org.eclipse.smarthome.binding.fsinternetradio-0.9.0.b2-sources.jar to /opt/public/hipp/homes/genie.smarthome/.m2/repository/org/eclipse/smarthome/binding/org.eclipse.smarthome.binding.fsinternetradio/0.9.0.b2/org.eclipse.smarthome.binding.fsinternetradio-0.9.0.b2-sources.jar
[INFO] Installing /jobs/genie.smarthome/BuildRelease/workspace/extensions/binding/org.eclipse.smarthome.binding.fsinternetradio/target/p2content.xml to /opt/public/hipp/homes/genie.smarthome/.m2/repository/org/eclipse/smarthome/binding/org.eclipse.smarthome.binding.fsinternetradio/0.9.0.b2/org.eclipse.smarthome.binding.fsinternetradio-0.9.0.b2-p2metadata.xml
[INFO] Installing /jobs/genie.smarthome/BuildRelease/workspace/extensions/binding/org.eclipse.smarthome.binding.fsinternetradio/target/p2artifacts.xml to /opt/public/hipp/homes/genie.smarthome/.m2/repository/org/eclipse/smarthome/binding/org.eclipse.smarthome.binding.fsinternetradio/0.9.0.b2/org.eclipse.smarthome.binding.fsinternetradio-0.9.0.b2-p2artifacts.xml
[INFO] 
[INFO] --- tycho-p2-plugin:0.23.1:update-local-index (default-update-local-index) @ org.eclipse.smarthome.binding.fsinternetradio ---
[INFO]                                                                         
[INFO] ------------------------------------------------------------------------
[INFO] Building Eclipse Smarthome FSInternetRadio Binding Test 0.9.0.b2
[INFO] ------------------------------------------------------------------------
[INFO] 
[INFO] --- maven-clean-plugin:2.5:clean (default-clean) @ org.eclipse.smarthome.binding.fsinternetradio.test ---
[INFO] Deleting /jobs/genie.smarthome/BuildRelease/workspace/extensions/binding/org.eclipse.smarthome.binding.fsinternetradio.test/target
[INFO] 
[INFO] --- tycho-packaging-plugin:0.23.1:build-qualifier (default-build-qualifier) @ org.eclipse.smarthome.binding.fsinternetradio.test ---
[INFO] The project's OSGi version is 0.9.0.b2
[INFO] 
[INFO] --- tycho-packaging-plugin:0.23.1:validate-id (default-validate-id) @ org.eclipse.smarthome.binding.fsinternetradio.test ---
[INFO] 
[INFO] --- tycho-packaging-plugin:0.23.1:validate-version (default-validate-version) @ org.eclipse.smarthome.binding.fsinternetradio.test ---
[INFO] 
[INFO] --- jacoco-maven-plugin:0.7.4.201502262128:prepare-agent (default-prepare-agent) @ org.eclipse.smarthome.binding.fsinternetradio.test ---
[INFO] tycho.testArgLine set to -javaagent:/opt/public/hipp/homes/genie.smarthome/.m2/repository/org/jacoco/org.jacoco.agent/0.7.4.201502262128/org.jacoco.agent-0.7.4.201502262128-runtime.jar=destfile=/jobs/genie.smarthome/BuildRelease/workspace/target/coverage.jacoco,append=true,excludes=**/*Test.*
[INFO] 
[INFO] --- build-helper-maven-plugin:1.8:add-source (add-source) @ org.eclipse.smarthome.binding.fsinternetradio.test ---
[INFO] Source directory: /jobs/genie.smarthome/BuildRelease/workspace/extensions/binding/org.eclipse.smarthome.binding.fsinternetradio.test/src/main/groovy added.
[INFO] 
[INFO] --- maven-resources-plugin:2.4.3:resources (default-resources) @ org.eclipse.smarthome.binding.fsinternetradio.test ---
[INFO] Using 'UTF-8' encoding to copy filtered resources.
[INFO] skip non existing resourceDirectory /jobs/genie.smarthome/BuildRelease/workspace/extensions/binding/org.eclipse.smarthome.binding.fsinternetradio.test/src/main/resources
[INFO] 
[INFO] --- tycho-compiler-plugin:0.23.1:compile (default-compile) @ org.eclipse.smarthome.binding.fsinternetradio.test ---
[INFO] Nothing to compile - all classes are up to date
[INFO] 
[INFO] --- maven-compiler-plugin:3.1:compile (default) @ org.eclipse.smarthome.binding.fsinternetradio.test ---
[INFO] Changes detected - recompiling the module!
[INFO] Using Groovy-Eclipse compiler to compile both Java and Groovy files
[INFO] 
[INFO] --- build-helper-maven-plugin:1.8:add-test-source (add-test-source) @ org.eclipse.smarthome.binding.fsinternetradio.test ---
[INFO] Test Source directory: /jobs/genie.smarthome/BuildRelease/workspace/extensions/binding/org.eclipse.smarthome.binding.fsinternetradio.test/src/test/groovy added.
[INFO] 
[INFO] --- maven-resources-plugin:2.4.3:testResources (default-testResources) @ org.eclipse.smarthome.binding.fsinternetradio.test ---
[INFO] Using 'UTF-8' encoding to copy filtered resources.
[INFO] skip non existing resourceDirectory /jobs/genie.smarthome/BuildRelease/workspace/extensions/binding/org.eclipse.smarthome.binding.fsinternetradio.test/src/test/resources
[INFO] 
[INFO] --- tycho-source-plugin:0.23.1:plugin-source (plugin-source) @ org.eclipse.smarthome.binding.fsinternetradio.test ---
[WARNING] bundle localization file /jobs/genie.smarthome/BuildRelease/workspace/extensions/binding/org.eclipse.smarthome.binding.fsinternetradio.test/plugin.properties not found
[INFO] Building jar: /jobs/genie.smarthome/BuildRelease/workspace/extensions/binding/org.eclipse.smarthome.binding.fsinternetradio.test/target/org.eclipse.smarthome.binding.fsinternetradio.test-0.9.0.b2-sources.jar
[INFO] 
[INFO] --- target-platform-configuration:0.23.1:target-platform (default-target-platform) @ org.eclipse.smarthome.binding.fsinternetradio.test ---
[INFO] 
[INFO] --- tycho-packaging-plugin:0.23.1:package-plugin (default-package-plugin) @ org.eclipse.smarthome.binding.fsinternetradio.test ---
[INFO] Building jar: /jobs/genie.smarthome/BuildRelease/workspace/extensions/binding/org.eclipse.smarthome.binding.fsinternetradio.test/target/org.eclipse.smarthome.binding.fsinternetradio.test-0.9.0.b2.jar
[INFO] 
[INFO] --- tycho-p2-plugin:0.23.1:p2-metadata-default (default-p2-metadata-default) @ org.eclipse.smarthome.binding.fsinternetradio.test ---
[INFO] 
[INFO] --- jacoco-maven-plugin:0.7.4.201502262128:prepare-agent-integration (default-prepare-agent-integration) @ org.eclipse.smarthome.binding.fsinternetradio.test ---
[INFO] tycho.testArgLine set to -javaagent:/opt/public/hipp/homes/genie.smarthome/.m2/repository/org/jacoco/org.jacoco.agent/0.7.4.201502262128/org.jacoco.agent-0.7.4.201502262128-runtime.jar=destfile=/jobs/genie.smarthome/BuildRelease/workspace/target/coverage.jacoco,append=true,excludes=**/*Test.*
[INFO] 
[INFO] --- tycho-surefire-plugin:0.23.1:test (default-test) @ org.eclipse.smarthome.binding.fsinternetradio.test ---
[INFO] Expected eclipse log file: /jobs/genie.smarthome/BuildRelease/workspace/extensions/binding/org.eclipse.smarthome.binding.fsinternetradio.test/target/work/data/.metadata/.log
[INFO] Command line:
	[/opt/public/common/jdk1.7.0_80/jre/bin/java, -Dosgi.noShutdown=false, -Dosgi.os=linux, -Dosgi.ws=gtk, -Dosgi.arch=x86_64, -Djetty.home.bundle=org.eclipse.jetty.osgi.boot, -Djetty.port=9090, -Dosgi.clean=true, -jar, /opt/public/hipp/homes/genie.smarthome/.m2/repository/p2/osgi/bundle/org.eclipse.equinox.launcher/1.3.0.v20140415-2008/org.eclipse.equinox.launcher-1.3.0.v20140415-2008.jar, -data, /jobs/genie.smarthome/BuildRelease/workspace/extensions/binding/org.eclipse.smarthome.binding.fsinternetradio.test/target/work/data, -install, /jobs/genie.smarthome/BuildRelease/workspace/extensions/binding/org.eclipse.smarthome.binding.fsinternetradio.test/target/work, -configuration, /jobs/genie.smarthome/BuildRelease/workspace/extensions/binding/org.eclipse.smarthome.binding.fsinternetradio.test/target/work/configuration, -application, org.eclipse.tycho.surefire.osgibooter.headlesstest, -testproperties, /jobs/genie.smarthome/BuildRelease/workspace/extensions/binding/org.eclipse.smarthome.binding.fsinternetradio.test/target/surefire.properties]
SLF4J: Failed to load class "org.slf4j.impl.StaticLoggerBinder".
SLF4J: Defaulting to no-operation (NOP) logger implementation
SLF4J: See http://www.slf4j.org/codes.html#StaticLoggerBinder for further details.

-------------------------------------------------------
 T E S T S
-------------------------------------------------------
Running org.eclipse.smarthome.binding.fsinternetradio.test.FSInternetRadioHandlerOSGiTest
[Fatal Error] :1:2: The markup in the document preceding the root element must be well-formed.
Tests run: 16, Failures: 0, Errors: 0, Skipped: 0, Time elapsed: 17.914 sec - in org.eclipse.smarthome.binding.fsinternetradio.test.FSInternetRadioHandlerOSGiTest
verify the HTTP status is handled correctly when it is not OK_200(org.eclipse.smarthome.binding.fsinternetradio.test.FSInternetRadioHandlerOSGiTest)  Time elapsed: 0.851 sec
verify the preset channel is updated(org.eclipse.smarthome.binding.fsinternetradio.test.FSInternetRadioHandlerOSGiTest)  Time elapsed: 0.407 sec
verify not registered RadioHandler when the thingTypeUID is not the DEFAULT_THING_TYPE_UID(org.eclipse.smarthome.binding.fsinternetradio.test.FSInternetRadioHandlerOSGiTest)  Time elapsed: 0.029 sec
verify the volume is updated through the CHANNEL_VOLUME_PERCENT(org.eclipse.smarthome.binding.fsinternetradio.test.FSInternetRadioHandlerOSGiTest)  Time elapsed: 3.103 sec
verify the mute channel is updated(org.eclipse.smarthome.binding.fsinternetradio.test.FSInternetRadioHandlerOSGiTest)  Time elapsed: 2.067 sec
verify ONLINE status of a Thing with complete configuration(org.eclipse.smarthome.binding.fsinternetradio.test.FSInternetRadioHandlerOSGiTest)  Time elapsed: 0.08 sec
verify the mode channel is updated(org.eclipse.smarthome.binding.fsinternetradio.test.FSInternetRadioHandlerOSGiTest)  Time elapsed: 2.059 sec
verify OFFLINE Thing-status and NULL Item-state when the IP is NULL(org.eclipse.smarthome.binding.fsinternetradio.test.FSInternetRadioHandlerOSGiTest)  Time elapsed: 0.334 sec
verify OFFLINE Thing-status and NULL Item-state when the PIN is wrong(org.eclipse.smarthome.binding.fsinternetradio.test.FSInternetRadioHandlerOSGiTest)  Time elapsed: 0.372 sec
verify the volume is updated through the CHANNEL_VOLUME_ABSOLUTE(org.eclipse.smarthome.binding.fsinternetradio.test.FSInternetRadioHandlerOSGiTest)  Time elapsed: 3.076 sec
verify OFFLINE Thing-status and NULL Item-state when the HTTP response cannot be parsed correctly(org.eclipse.smarthome.binding.fsinternetradio.test.FSInternetRadioHandlerOSGiTest)  Time elapsed: 0.388 sec
verify OFFLINE Thing-status and NULL Item-state when the PORT is zero(org.eclipse.smarthome.binding.fsinternetradio.test.FSInternetRadioHandlerOSGiTest)  Time elapsed: 0.317 sec
verify the power channel is updated(org.eclipse.smarthome.binding.fsinternetradio.test.FSInternetRadioHandlerOSGiTest)  Time elapsed: 2.039 sec
verify the playInfoText channel is updated(org.eclipse.smarthome.binding.fsinternetradio.test.FSInternetRadioHandlerOSGiTest)  Time elapsed: 1.033 sec
verify the playInfoName channel is updated(org.eclipse.smarthome.binding.fsinternetradio.test.FSInternetRadioHandlerOSGiTest)  Time elapsed: 1.031 sec
verify OFFLINE Thing-status and NULL Item-state when the PIN is empty String(org.eclipse.smarthome.binding.fsinternetradio.test.FSInternetRadioHandlerOSGiTest)  Time elapsed: 0.328 sec
Running org.eclipse.smarthome.binding.fsinternetradio.test.FSInternetRadioDiscoveryParticipantOSGiTest
Tests run: 5, Failures: 0, Errors: 0, Skipped: 0, Time elapsed: 0.099 sec - in org.eclipse.smarthome.binding.fsinternetradio.test.FSInternetRadioDiscoveryParticipantOSGiTest
verify valid DiscoveryResult with FSInterntRadio device without base URL(org.eclipse.smarthome.binding.fsinternetradio.test.FSInternetRadioDiscoveryParticipantOSGiTest)  Time elapsed: 0.055 sec
verify no discovery result for unknown device(org.eclipse.smarthome.binding.fsinternetradio.test.FSInternetRadioDiscoveryParticipantOSGiTest)  Time elapsed: 0.001 sec
verify no discovery result for FSInternetRadio device with null details(org.eclipse.smarthome.binding.fsinternetradio.test.FSInternetRadioDiscoveryParticipantOSGiTest)  Time elapsed: 0.001 sec
verify valid DiscoveryResult with completeFSInterntRadioDevice(org.eclipse.smarthome.binding.fsinternetradio.test.FSInternetRadioDiscoveryParticipantOSGiTest)  Time elapsed: 0.002 sec
verify correct supported types(org.eclipse.smarthome.binding.fsinternetradio.test.FSInternetRadioDiscoveryParticipantOSGiTest)  Time elapsed: 0.005 sec

Results :

Tests run: 21, Failures: 0, Errors: 0, Skipped: 0

[INFO] All tests passed!
[INFO] 
[INFO] --- eclipse-jarsigner-plugin:1.0.5:sign (sign) @ org.eclipse.smarthome.binding.fsinternetradio.test ---
[INFO] Searching org.eclipse.smarthome.binding.fsinternetradio.test-0.9.0.b2.jar for inner jars...
[INFO] Signed org.eclipse.smarthome.binding:org.eclipse.smarthome.binding.fsinternetradio.test:eclipse-test-plugin:0.9.0.b2 in 1 seconds.
[INFO] Searching org.eclipse.smarthome.binding.fsinternetradio.test-0.9.0.b2-sources.jar for inner jars...
[INFO] Signed org.eclipse.smarthome.binding:org.eclipse.smarthome.binding.fsinternetradio.test:java-source:sources:0.9.0.b2 in 1 seconds.
[INFO] 
[INFO] --- maven-install-plugin:2.3.1:install (default-install) @ org.eclipse.smarthome.binding.fsinternetradio.test ---
[INFO] Installing /jobs/genie.smarthome/BuildRelease/workspace/extensions/binding/org.eclipse.smarthome.binding.fsinternetradio.test/target/org.eclipse.smarthome.binding.fsinternetradio.test-0.9.0.b2.jar to /opt/public/hipp/homes/genie.smarthome/.m2/repository/org/eclipse/smarthome/binding/org.eclipse.smarthome.binding.fsinternetradio.test/0.9.0.b2/org.eclipse.smarthome.binding.fsinternetradio.test-0.9.0.b2.jar
[INFO] Installing /jobs/genie.smarthome/BuildRelease/workspace/extensions/binding/org.eclipse.smarthome.binding.fsinternetradio.test/pom.xml to /opt/public/hipp/homes/genie.smarthome/.m2/repository/org/eclipse/smarthome/binding/org.eclipse.smarthome.binding.fsinternetradio.test/0.9.0.b2/org.eclipse.smarthome.binding.fsinternetradio.test-0.9.0.b2.pom
[INFO] Installing /jobs/genie.smarthome/BuildRelease/workspace/extensions/binding/org.eclipse.smarthome.binding.fsinternetradio.test/target/org.eclipse.smarthome.binding.fsinternetradio.test-0.9.0.b2-sources.jar to /opt/public/hipp/homes/genie.smarthome/.m2/repository/org/eclipse/smarthome/binding/org.eclipse.smarthome.binding.fsinternetradio.test/0.9.0.b2/org.eclipse.smarthome.binding.fsinternetradio.test-0.9.0.b2-sources.jar
[INFO] Installing /jobs/genie.smarthome/BuildRelease/workspace/extensions/binding/org.eclipse.smarthome.binding.fsinternetradio.test/target/p2content.xml to /opt/public/hipp/homes/genie.smarthome/.m2/repository/org/eclipse/smarthome/binding/org.eclipse.smarthome.binding.fsinternetradio.test/0.9.0.b2/org.eclipse.smarthome.binding.fsinternetradio.test-0.9.0.b2-p2metadata.xml
[INFO] Installing /jobs/genie.smarthome/BuildRelease/workspace/extensions/binding/org.eclipse.smarthome.binding.fsinternetradio.test/target/p2artifacts.xml to /opt/public/hipp/homes/genie.smarthome/.m2/repository/org/eclipse/smarthome/binding/org.eclipse.smarthome.binding.fsinternetradio.test/0.9.0.b2/org.eclipse.smarthome.binding.fsinternetradio.test-0.9.0.b2-p2artifacts.xml
[INFO] 
[INFO] --- tycho-p2-plugin:0.23.1:update-local-index (default-update-local-index) @ org.eclipse.smarthome.binding.fsinternetradio.test ---
[INFO]                                                                         
[INFO] ------------------------------------------------------------------------
[INFO] Building Eclipse SmartHome LIFX Binding 0.9.0.b2
[INFO] ------------------------------------------------------------------------
[INFO] 
[INFO] --- maven-clean-plugin:2.5:clean (default-clean) @ org.eclipse.smarthome.binding.lifx ---
[INFO] Deleting /jobs/genie.smarthome/BuildRelease/workspace/extensions/binding/org.eclipse.smarthome.binding.lifx/target
[INFO] 
[INFO] --- tycho-packaging-plugin:0.23.1:build-qualifier (default-build-qualifier) @ org.eclipse.smarthome.binding.lifx ---
[INFO] The project's OSGi version is 0.9.0.b2
[INFO] 
[INFO] --- tycho-packaging-plugin:0.23.1:validate-id (default-validate-id) @ org.eclipse.smarthome.binding.lifx ---
[INFO] 
[INFO] --- tycho-packaging-plugin:0.23.1:validate-version (default-validate-version) @ org.eclipse.smarthome.binding.lifx ---
[INFO] 
[INFO] --- jacoco-maven-plugin:0.7.4.201502262128:prepare-agent (default-prepare-agent) @ org.eclipse.smarthome.binding.lifx ---
[INFO] argLine set to -javaagent:/opt/public/hipp/homes/genie.smarthome/.m2/repository/org/jacoco/org.jacoco.agent/0.7.4.201502262128/org.jacoco.agent-0.7.4.201502262128-runtime.jar=destfile=/jobs/genie.smarthome/BuildRelease/workspace/target/coverage.jacoco,append=true,excludes=**/*Test.*
[INFO] 
[INFO] --- build-helper-maven-plugin:1.8:add-source (add-source) @ org.eclipse.smarthome.binding.lifx ---
[INFO] Source directory: /jobs/genie.smarthome/BuildRelease/workspace/extensions/binding/org.eclipse.smarthome.binding.lifx/src/main/groovy added.
[INFO] 
[INFO] --- maven-resources-plugin:2.4.3:resources (default-resources) @ org.eclipse.smarthome.binding.lifx ---
[INFO] Using 'UTF-8' encoding to copy filtered resources.
[INFO] skip non existing resourceDirectory /jobs/genie.smarthome/BuildRelease/workspace/extensions/binding/org.eclipse.smarthome.binding.lifx/src/main/resources
[INFO] 
[INFO] --- tycho-compiler-plugin:0.23.1:compile (default-compile) @ org.eclipse.smarthome.binding.lifx ---
[INFO] Compiling 75 source files to /jobs/genie.smarthome/BuildRelease/workspace/extensions/binding/org.eclipse.smarthome.binding.lifx/target/classes
[INFO] 
[INFO] --- maven-compiler-plugin:3.1:compile (default) @ org.eclipse.smarthome.binding.lifx ---
[INFO] Changes detected - recompiling the module!
[INFO] Nothing to compile - all classes are up to date
[INFO] 
[INFO] --- build-helper-maven-plugin:1.8:add-test-source (add-test-source) @ org.eclipse.smarthome.binding.lifx ---
[INFO] Test Source directory: /jobs/genie.smarthome/BuildRelease/workspace/extensions/binding/org.eclipse.smarthome.binding.lifx/src/test/groovy added.
[INFO] 
[INFO] --- maven-resources-plugin:2.4.3:testResources (default-testResources) @ org.eclipse.smarthome.binding.lifx ---
[INFO] Using 'UTF-8' encoding to copy filtered resources.
[INFO] skip non existing resourceDirectory /jobs/genie.smarthome/BuildRelease/workspace/extensions/binding/org.eclipse.smarthome.binding.lifx/src/test/resources
[INFO] 
[INFO] --- tycho-source-plugin:0.23.1:plugin-source (plugin-source) @ org.eclipse.smarthome.binding.lifx ---
[WARNING] bundle localization file /jobs/genie.smarthome/BuildRelease/workspace/extensions/binding/org.eclipse.smarthome.binding.lifx/plugin.properties not found
[INFO] Building jar: /jobs/genie.smarthome/BuildRelease/workspace/extensions/binding/org.eclipse.smarthome.binding.lifx/target/org.eclipse.smarthome.binding.lifx-0.9.0.b2-sources.jar
[INFO] 
[INFO] --- target-platform-configuration:0.23.1:target-platform (default-target-platform) @ org.eclipse.smarthome.binding.lifx ---
[INFO] 
[INFO] --- tycho-packaging-plugin:0.23.1:package-plugin (default-package-plugin) @ org.eclipse.smarthome.binding.lifx ---
[INFO] Building jar: /jobs/genie.smarthome/BuildRelease/workspace/extensions/binding/org.eclipse.smarthome.binding.lifx/target/org.eclipse.smarthome.binding.lifx-0.9.0.b2.jar
[INFO] 
[INFO] --- tycho-p2-plugin:0.23.1:p2-metadata-default (default-p2-metadata-default) @ org.eclipse.smarthome.binding.lifx ---
[INFO] 
[INFO] --- jacoco-maven-plugin:0.7.4.201502262128:prepare-agent-integration (default-prepare-agent-integration) @ org.eclipse.smarthome.binding.lifx ---
[INFO] argLine set to -javaagent:/opt/public/hipp/homes/genie.smarthome/.m2/repository/org/jacoco/org.jacoco.agent/0.7.4.201502262128/org.jacoco.agent-0.7.4.201502262128-runtime.jar=destfile=/jobs/genie.smarthome/BuildRelease/workspace/target/coverage.jacoco,append=true,excludes=**/*Test.*
[INFO] 
[INFO] --- eclipse-jarsigner-plugin:1.0.5:sign (sign) @ org.eclipse.smarthome.binding.lifx ---
[INFO] Searching org.eclipse.smarthome.binding.lifx-0.9.0.b2.jar for inner jars...
[INFO] Signed org.eclipse.smarthome.binding:org.eclipse.smarthome.binding.lifx:eclipse-plugin:0.9.0.b2 in 1 seconds.
[INFO] Searching org.eclipse.smarthome.binding.lifx-0.9.0.b2-sources.jar for inner jars...
[INFO] Signed org.eclipse.smarthome.binding:org.eclipse.smarthome.binding.lifx:java-source:sources:0.9.0.b2 in 1 seconds.
[INFO] 
[INFO] --- maven-install-plugin:2.3.1:install (default-install) @ org.eclipse.smarthome.binding.lifx ---
[INFO] Installing /jobs/genie.smarthome/BuildRelease/workspace/extensions/binding/org.eclipse.smarthome.binding.lifx/target/org.eclipse.smarthome.binding.lifx-0.9.0.b2.jar to /opt/public/hipp/homes/genie.smarthome/.m2/repository/org/eclipse/smarthome/binding/org.eclipse.smarthome.binding.lifx/0.9.0.b2/org.eclipse.smarthome.binding.lifx-0.9.0.b2.jar
[INFO] Installing /jobs/genie.smarthome/BuildRelease/workspace/extensions/binding/org.eclipse.smarthome.binding.lifx/pom.xml to /opt/public/hipp/homes/genie.smarthome/.m2/repository/org/eclipse/smarthome/binding/org.eclipse.smarthome.binding.lifx/0.9.0.b2/org.eclipse.smarthome.binding.lifx-0.9.0.b2.pom
[INFO] Installing /jobs/genie.smarthome/BuildRelease/workspace/extensions/binding/org.eclipse.smarthome.binding.lifx/target/org.eclipse.smarthome.binding.lifx-0.9.0.b2-sources.jar to /opt/public/hipp/homes/genie.smarthome/.m2/repository/org/eclipse/smarthome/binding/org.eclipse.smarthome.binding.lifx/0.9.0.b2/org.eclipse.smarthome.binding.lifx-0.9.0.b2-sources.jar
[INFO] Installing /jobs/genie.smarthome/BuildRelease/workspace/extensions/binding/org.eclipse.smarthome.binding.lifx/target/p2content.xml to /opt/public/hipp/homes/genie.smarthome/.m2/repository/org/eclipse/smarthome/binding/org.eclipse.smarthome.binding.lifx/0.9.0.b2/org.eclipse.smarthome.binding.lifx-0.9.0.b2-p2metadata.xml
[INFO] Installing /jobs/genie.smarthome/BuildRelease/workspace/extensions/binding/org.eclipse.smarthome.binding.lifx/target/p2artifacts.xml to /opt/public/hipp/homes/genie.smarthome/.m2/repository/org/eclipse/smarthome/binding/org.eclipse.smarthome.binding.lifx/0.9.0.b2/org.eclipse.smarthome.binding.lifx-0.9.0.b2-p2artifacts.xml
[INFO] 
[INFO] --- tycho-p2-plugin:0.23.1:update-local-index (default-update-local-index) @ org.eclipse.smarthome.binding.lifx ---
[INFO]                                                                         
[INFO] ------------------------------------------------------------------------
[INFO] Building Eclipse SmartHome NTP Binding 0.9.0.b2
[INFO] ------------------------------------------------------------------------
[INFO] 
[INFO] --- maven-clean-plugin:2.5:clean (default-clean) @ org.eclipse.smarthome.binding.ntp ---
[INFO] Deleting /jobs/genie.smarthome/BuildRelease/workspace/extensions/binding/org.eclipse.smarthome.binding.ntp/target
[INFO] 
[INFO] --- tycho-packaging-plugin:0.23.1:build-qualifier (default-build-qualifier) @ org.eclipse.smarthome.binding.ntp ---
[INFO] The project's OSGi version is 0.9.0.b2
[INFO] 
[INFO] --- tycho-packaging-plugin:0.23.1:validate-id (default-validate-id) @ org.eclipse.smarthome.binding.ntp ---
[INFO] 
[INFO] --- tycho-packaging-plugin:0.23.1:validate-version (default-validate-version) @ org.eclipse.smarthome.binding.ntp ---
[INFO] 
[INFO] --- jacoco-maven-plugin:0.7.4.201502262128:prepare-agent (default-prepare-agent) @ org.eclipse.smarthome.binding.ntp ---
[INFO] argLine set to -javaagent:/opt/public/hipp/homes/genie.smarthome/.m2/repository/org/jacoco/org.jacoco.agent/0.7.4.201502262128/org.jacoco.agent-0.7.4.201502262128-runtime.jar=destfile=/jobs/genie.smarthome/BuildRelease/workspace/target/coverage.jacoco,append=true,excludes=**/*Test.*
[INFO] 
[INFO] --- build-helper-maven-plugin:1.8:add-source (add-source) @ org.eclipse.smarthome.binding.ntp ---
[INFO] Source directory: /jobs/genie.smarthome/BuildRelease/workspace/extensions/binding/org.eclipse.smarthome.binding.ntp/src/main/groovy added.
[INFO] 
[INFO] --- maven-resources-plugin:2.4.3:resources (default-resources) @ org.eclipse.smarthome.binding.ntp ---
[INFO] Using 'UTF-8' encoding to copy filtered resources.
[INFO] skip non existing resourceDirectory /jobs/genie.smarthome/BuildRelease/workspace/extensions/binding/org.eclipse.smarthome.binding.ntp/src/main/resources
[INFO] 
[INFO] --- tycho-compiler-plugin:0.23.1:compile (default-compile) @ org.eclipse.smarthome.binding.ntp ---
[INFO] Compiling 4 source files to /jobs/genie.smarthome/BuildRelease/workspace/extensions/binding/org.eclipse.smarthome.binding.ntp/target/classes
[INFO] 
[INFO] --- maven-compiler-plugin:3.1:compile (default) @ org.eclipse.smarthome.binding.ntp ---
[INFO] Changes detected - recompiling the module!
[INFO] Nothing to compile - all classes are up to date
[INFO] 
[INFO] --- build-helper-maven-plugin:1.8:add-test-source (add-test-source) @ org.eclipse.smarthome.binding.ntp ---
[INFO] Test Source directory: /jobs/genie.smarthome/BuildRelease/workspace/extensions/binding/org.eclipse.smarthome.binding.ntp/src/test/groovy added.
[INFO] 
[INFO] --- maven-resources-plugin:2.4.3:testResources (default-testResources) @ org.eclipse.smarthome.binding.ntp ---
[INFO] Using 'UTF-8' encoding to copy filtered resources.
[INFO] skip non existing resourceDirectory /jobs/genie.smarthome/BuildRelease/workspace/extensions/binding/org.eclipse.smarthome.binding.ntp/src/test/resources
[INFO] 
[INFO] --- tycho-source-plugin:0.23.1:plugin-source (plugin-source) @ org.eclipse.smarthome.binding.ntp ---
[WARNING] bundle localization file /jobs/genie.smarthome/BuildRelease/workspace/extensions/binding/org.eclipse.smarthome.binding.ntp/plugin.properties not found
[INFO] Building jar: /jobs/genie.smarthome/BuildRelease/workspace/extensions/binding/org.eclipse.smarthome.binding.ntp/target/org.eclipse.smarthome.binding.ntp-0.9.0.b2-sources.jar
[INFO] 
[INFO] --- target-platform-configuration:0.23.1:target-platform (default-target-platform) @ org.eclipse.smarthome.binding.ntp ---
[INFO] 
[INFO] --- tycho-packaging-plugin:0.23.1:package-plugin (default-package-plugin) @ org.eclipse.smarthome.binding.ntp ---
[INFO] Building jar: /jobs/genie.smarthome/BuildRelease/workspace/extensions/binding/org.eclipse.smarthome.binding.ntp/target/org.eclipse.smarthome.binding.ntp-0.9.0.b2.jar
[INFO] 
[INFO] --- tycho-p2-plugin:0.23.1:p2-metadata-default (default-p2-metadata-default) @ org.eclipse.smarthome.binding.ntp ---
[INFO] 
[INFO] --- jacoco-maven-plugin:0.7.4.201502262128:prepare-agent-integration (default-prepare-agent-integration) @ org.eclipse.smarthome.binding.ntp ---
[INFO] argLine set to -javaagent:/opt/public/hipp/homes/genie.smarthome/.m2/repository/org/jacoco/org.jacoco.agent/0.7.4.201502262128/org.jacoco.agent-0.7.4.201502262128-runtime.jar=destfile=/jobs/genie.smarthome/BuildRelease/workspace/target/coverage.jacoco,append=true,excludes=**/*Test.*
[INFO] 
[INFO] --- eclipse-jarsigner-plugin:1.0.5:sign (sign) @ org.eclipse.smarthome.binding.ntp ---
[INFO] Searching org.eclipse.smarthome.binding.ntp-0.9.0.b2.jar for inner jars...
[INFO] Signed org.eclipse.smarthome.binding:org.eclipse.smarthome.binding.ntp:eclipse-plugin:0.9.0.b2 in 1 seconds.
[INFO] Searching org.eclipse.smarthome.binding.ntp-0.9.0.b2-sources.jar for inner jars...
[INFO] Signed org.eclipse.smarthome.binding:org.eclipse.smarthome.binding.ntp:java-source:sources:0.9.0.b2 in 1 seconds.
[INFO] 
[INFO] --- maven-install-plugin:2.3.1:install (default-install) @ org.eclipse.smarthome.binding.ntp ---
[INFO] Installing /jobs/genie.smarthome/BuildRelease/workspace/extensions/binding/org.eclipse.smarthome.binding.ntp/target/org.eclipse.smarthome.binding.ntp-0.9.0.b2.jar to /opt/public/hipp/homes/genie.smarthome/.m2/repository/org/eclipse/smarthome/binding/org.eclipse.smarthome.binding.ntp/0.9.0.b2/org.eclipse.smarthome.binding.ntp-0.9.0.b2.jar
[INFO] Installing /jobs/genie.smarthome/BuildRelease/workspace/extensions/binding/org.eclipse.smarthome.binding.ntp/pom.xml to /opt/public/hipp/homes/genie.smarthome/.m2/repository/org/eclipse/smarthome/binding/org.eclipse.smarthome.binding.ntp/0.9.0.b2/org.eclipse.smarthome.binding.ntp-0.9.0.b2.pom
[INFO] Installing /jobs/genie.smarthome/BuildRelease/workspace/extensions/binding/org.eclipse.smarthome.binding.ntp/target/org.eclipse.smarthome.binding.ntp-0.9.0.b2-sources.jar to /opt/public/hipp/homes/genie.smarthome/.m2/repository/org/eclipse/smarthome/binding/org.eclipse.smarthome.binding.ntp/0.9.0.b2/org.eclipse.smarthome.binding.ntp-0.9.0.b2-sources.jar
[INFO] Installing /jobs/genie.smarthome/BuildRelease/workspace/extensions/binding/org.eclipse.smarthome.binding.ntp/target/p2content.xml to /opt/public/hipp/homes/genie.smarthome/.m2/repository/org/eclipse/smarthome/binding/org.eclipse.smarthome.binding.ntp/0.9.0.b2/org.eclipse.smarthome.binding.ntp-0.9.0.b2-p2metadata.xml
[INFO] Installing /jobs/genie.smarthome/BuildRelease/workspace/extensions/binding/org.eclipse.smarthome.binding.ntp/target/p2artifacts.xml to /opt/public/hipp/homes/genie.smarthome/.m2/repository/org/eclipse/smarthome/binding/org.eclipse.smarthome.binding.ntp/0.9.0.b2/org.eclipse.smarthome.binding.ntp-0.9.0.b2-p2artifacts.xml
[INFO] 
[INFO] --- tycho-p2-plugin:0.23.1:update-local-index (default-update-local-index) @ org.eclipse.smarthome.binding.ntp ---
[INFO]                                                                         
[INFO] ------------------------------------------------------------------------
[INFO] Building Eclipse SmartHome NTP Binding Tests 0.9.0.b2
[INFO] ------------------------------------------------------------------------
[INFO] 
[INFO] --- maven-clean-plugin:2.5:clean (default-clean) @ org.eclipse.smarthome.binding.ntp.test ---
[INFO] Deleting /jobs/genie.smarthome/BuildRelease/workspace/extensions/binding/org.eclipse.smarthome.binding.ntp.test/target
[INFO] 
[INFO] --- tycho-packaging-plugin:0.23.1:build-qualifier (default-build-qualifier) @ org.eclipse.smarthome.binding.ntp.test ---
[INFO] The project's OSGi version is 0.9.0.b2
[INFO] 
[INFO] --- tycho-packaging-plugin:0.23.1:validate-id (default-validate-id) @ org.eclipse.smarthome.binding.ntp.test ---
[INFO] 
[INFO] --- tycho-packaging-plugin:0.23.1:validate-version (default-validate-version) @ org.eclipse.smarthome.binding.ntp.test ---
[INFO] 
[INFO] --- jacoco-maven-plugin:0.7.4.201502262128:prepare-agent (default-prepare-agent) @ org.eclipse.smarthome.binding.ntp.test ---
[INFO] tycho.testArgLine set to -javaagent:/opt/public/hipp/homes/genie.smarthome/.m2/repository/org/jacoco/org.jacoco.agent/0.7.4.201502262128/org.jacoco.agent-0.7.4.201502262128-runtime.jar=destfile=/jobs/genie.smarthome/BuildRelease/workspace/target/coverage.jacoco,append=true,excludes=**/*Test.*
[INFO] 
[INFO] --- build-helper-maven-plugin:1.8:add-source (add-source) @ org.eclipse.smarthome.binding.ntp.test ---
[INFO] Source directory: /jobs/genie.smarthome/BuildRelease/workspace/extensions/binding/org.eclipse.smarthome.binding.ntp.test/src/main/groovy added.
[INFO] 
[INFO] --- maven-resources-plugin:2.4.3:resources (default-resources) @ org.eclipse.smarthome.binding.ntp.test ---
[INFO] Using 'UTF-8' encoding to copy filtered resources.
[INFO] skip non existing resourceDirectory /jobs/genie.smarthome/BuildRelease/workspace/extensions/binding/org.eclipse.smarthome.binding.ntp.test/src/main/resources
[INFO] 
[INFO] --- tycho-compiler-plugin:0.23.1:compile (default-compile) @ org.eclipse.smarthome.binding.ntp.test ---
[INFO] Nothing to compile - all classes are up to date
[INFO] 
[INFO] --- maven-compiler-plugin:3.1:compile (default) @ org.eclipse.smarthome.binding.ntp.test ---
[INFO] Changes detected - recompiling the module!
[INFO] Using Groovy-Eclipse compiler to compile both Java and Groovy files
[INFO] 
[INFO] --- build-helper-maven-plugin:1.8:add-test-source (add-test-source) @ org.eclipse.smarthome.binding.ntp.test ---
[INFO] Test Source directory: /jobs/genie.smarthome/BuildRelease/workspace/extensions/binding/org.eclipse.smarthome.binding.ntp.test/src/test/groovy added.
[INFO] 
[INFO] --- maven-resources-plugin:2.4.3:testResources (default-testResources) @ org.eclipse.smarthome.binding.ntp.test ---
[INFO] Using 'UTF-8' encoding to copy filtered resources.
[INFO] skip non existing resourceDirectory /jobs/genie.smarthome/BuildRelease/workspace/extensions/binding/org.eclipse.smarthome.binding.ntp.test/src/test/resources
[INFO] 
[INFO] --- tycho-source-plugin:0.23.1:plugin-source (plugin-source) @ org.eclipse.smarthome.binding.ntp.test ---
[WARNING] bundle localization file /jobs/genie.smarthome/BuildRelease/workspace/extensions/binding/org.eclipse.smarthome.binding.ntp.test/plugin.properties not found
[WARNING] Bundle-Vendor header not found in /jobs/genie.smarthome/BuildRelease/workspace/extensions/binding/org.eclipse.smarthome.binding.ntp.test/META-INF/MANIFEST.MF, fallback to 'unknown' for source bundle
[INFO] Building jar: /jobs/genie.smarthome/BuildRelease/workspace/extensions/binding/org.eclipse.smarthome.binding.ntp.test/target/org.eclipse.smarthome.binding.ntp.test-0.9.0.b2-sources.jar
[INFO] 
[INFO] --- target-platform-configuration:0.23.1:target-platform (default-target-platform) @ org.eclipse.smarthome.binding.ntp.test ---
[INFO] 
[INFO] --- tycho-packaging-plugin:0.23.1:package-plugin (default-package-plugin) @ org.eclipse.smarthome.binding.ntp.test ---
[INFO] Building jar: /jobs/genie.smarthome/BuildRelease/workspace/extensions/binding/org.eclipse.smarthome.binding.ntp.test/target/org.eclipse.smarthome.binding.ntp.test-0.9.0.b2.jar
[INFO] 
[INFO] --- tycho-p2-plugin:0.23.1:p2-metadata-default (default-p2-metadata-default) @ org.eclipse.smarthome.binding.ntp.test ---
[INFO] 
[INFO] --- jacoco-maven-plugin:0.7.4.201502262128:prepare-agent-integration (default-prepare-agent-integration) @ org.eclipse.smarthome.binding.ntp.test ---
[INFO] tycho.testArgLine set to -javaagent:/opt/public/hipp/homes/genie.smarthome/.m2/repository/org/jacoco/org.jacoco.agent/0.7.4.201502262128/org.jacoco.agent-0.7.4.201502262128-runtime.jar=destfile=/jobs/genie.smarthome/BuildRelease/workspace/target/coverage.jacoco,append=true,excludes=**/*Test.*
[INFO] 
[INFO] --- tycho-surefire-plugin:0.23.1:test (default-test) @ org.eclipse.smarthome.binding.ntp.test ---
[INFO] Expected eclipse log file: /jobs/genie.smarthome/BuildRelease/workspace/extensions/binding/org.eclipse.smarthome.binding.ntp.test/target/work/data/.metadata/.log
[INFO] Command line:
	[/opt/public/common/jdk1.7.0_80/jre/bin/java, -Dosgi.noShutdown=false, -Dosgi.os=linux, -Dosgi.ws=gtk, -Dosgi.arch=x86_64, -javaagent:/opt/public/hipp/homes/genie.smarthome/.m2/repository/org/jacoco/org.jacoco.agent/0.7.4.201502262128/org.jacoco.agent-0.7.4.201502262128-runtime.jar=destfile=/jobs/genie.smarthome/BuildRelease/workspace/target/coverage.jacoco,append=true,excludes=**/*Test.*, -Dosgi.clean=true, -jar, /opt/public/hipp/homes/genie.smarthome/.m2/repository/p2/osgi/bundle/org.eclipse.equinox.launcher/1.3.0.v20140415-2008/org.eclipse.equinox.launcher-1.3.0.v20140415-2008.jar, -data, /jobs/genie.smarthome/BuildRelease/workspace/extensions/binding/org.eclipse.smarthome.binding.ntp.test/target/work/data, -install, /jobs/genie.smarthome/BuildRelease/workspace/extensions/binding/org.eclipse.smarthome.binding.ntp.test/target/work, -configuration, /jobs/genie.smarthome/BuildRelease/workspace/extensions/binding/org.eclipse.smarthome.binding.ntp.test/target/work/configuration, -application, org.eclipse.tycho.surefire.osgibooter.headlesstest, -testproperties, /jobs/genie.smarthome/BuildRelease/workspace/extensions/binding/org.eclipse.smarthome.binding.ntp.test/target/surefire.properties]
SLF4J: Failed to load class "org.slf4j.impl.StaticLoggerBinder".
SLF4J: Defaulting to no-operation (NOP) logger implementation
SLF4J: See http://www.slf4j.org/codes.html#StaticLoggerBinder for further details.

-------------------------------------------------------
 T E S T S
-------------------------------------------------------
Running org.eclipse.smarthome.binding.ntp.test.NtpOSGiTest
Tests run: 16, Failures: 0, Errors: 0, Skipped: 2, Time elapsed: 122.323 sec - in org.eclipse.smarthome.binding.ntp.test.NtpOSGiTest
the dateTime channel is updated with the right time zone(org.eclipse.smarthome.binding.ntp.test.NtpOSGiTest) skipped
time is refreshed when string channel is linked(org.eclipse.smarthome.binding.ntp.test.NtpOSGiTest)  Time elapsed: 10.521 sec
if no time zone is set in the configuration, the dateTime channel is updated with the default one(org.eclipse.smarthome.binding.ntp.test.NtpOSGiTest)  Time elapsed: 10.174 sec
time is refreshed when dateTime channel is linked(org.eclipse.smarthome.binding.ntp.test.NtpOSGiTest)  Time elapsed: 10.114 sec
the status of a thing with string channel is updated with communication error, when unknown host is set in the configuraion(org.eclipse.smarthome.binding.ntp.test.NtpOSGiTest)  Time elapsed: 0.113 sec
the string channel is updated with the right formatting(org.eclipse.smarthome.binding.ntp.test.NtpOSGiTest)  Time elapsed: 10.086 sec
if the property for formatting in the configuration of the string channel is null, the default formatting is used(org.eclipse.smarthome.binding.ntp.test.NtpOSGiTest)  Time elapsed: 10.077 sec
if no property for formatting is set in the configuration of the string channel, the default formatting is used(org.eclipse.smarthome.binding.ntp.test.NtpOSGiTest)  Time elapsed: 10.08 sec
if the property for formatting in the configuration of the string channel is empty string, the default formatting is used(org.eclipse.smarthome.binding.ntp.test.NtpOSGiTest)  Time elapsed: 10.07 sec
the calendar of the dateTime channel is updated with the right time zone(org.eclipse.smarthome.binding.ntp.test.NtpOSGiTest) skipped
the string channel is updated with the right time zone(org.eclipse.smarthome.binding.ntp.test.NtpOSGiTest)  Time elapsed: 10.079 sec
if no time zone is set in the configuration, the string channel is updated with the default one(org.eclipse.smarthome.binding.ntp.test.NtpOSGiTest)  Time elapsed: 10.059 sec
the string channel is updated on handleCommand(org.eclipse.smarthome.binding.ntp.test.NtpOSGiTest)  Time elapsed: 10.036 sec
the dateTime channel is updated on handleCommand(org.eclipse.smarthome.binding.ntp.test.NtpOSGiTest)  Time elapsed: 10.039 sec
if no time zone is set in the configuration, the calendar of the dateTime channel is updated with the default one(org.eclipse.smarthome.binding.ntp.test.NtpOSGiTest)  Time elapsed: 10.082 sec
the status of a thing with dateTime channel is updated with communication error, when unknown host is set in the configuraion(org.eclipse.smarthome.binding.ntp.test.NtpOSGiTest)  Time elapsed: 0.073 sec

Results :

Tests run: 16, Failures: 0, Errors: 0, Skipped: 2

[INFO] All tests passed!
[INFO] 
[INFO] --- eclipse-jarsigner-plugin:1.0.5:sign (sign) @ org.eclipse.smarthome.binding.ntp.test ---
[INFO] Searching org.eclipse.smarthome.binding.ntp.test-0.9.0.b2.jar for inner jars...
[INFO] Signed org.eclipse.smarthome.binding:org.eclipse.smarthome.binding.ntp.test:eclipse-test-plugin:0.9.0.b2 in 1 seconds.
[INFO] Searching org.eclipse.smarthome.binding.ntp.test-0.9.0.b2-sources.jar for inner jars...
[INFO] Signed org.eclipse.smarthome.binding:org.eclipse.smarthome.binding.ntp.test:java-source:sources:0.9.0.b2 in 1 seconds.
[INFO] 
[INFO] --- maven-install-plugin:2.3.1:install (default-install) @ org.eclipse.smarthome.binding.ntp.test ---
[INFO] Installing /jobs/genie.smarthome/BuildRelease/workspace/extensions/binding/org.eclipse.smarthome.binding.ntp.test/target/org.eclipse.smarthome.binding.ntp.test-0.9.0.b2.jar to /opt/public/hipp/homes/genie.smarthome/.m2/repository/org/eclipse/smarthome/binding/org.eclipse.smarthome.binding.ntp.test/0.9.0.b2/org.eclipse.smarthome.binding.ntp.test-0.9.0.b2.jar
[INFO] Installing /jobs/genie.smarthome/BuildRelease/workspace/extensions/binding/org.eclipse.smarthome.binding.ntp.test/pom.xml to /opt/public/hipp/homes/genie.smarthome/.m2/repository/org/eclipse/smarthome/binding/org.eclipse.smarthome.binding.ntp.test/0.9.0.b2/org.eclipse.smarthome.binding.ntp.test-0.9.0.b2.pom
[INFO] Installing /jobs/genie.smarthome/BuildRelease/workspace/extensions/binding/org.eclipse.smarthome.binding.ntp.test/target/org.eclipse.smarthome.binding.ntp.test-0.9.0.b2-sources.jar to /opt/public/hipp/homes/genie.smarthome/.m2/repository/org/eclipse/smarthome/binding/org.eclipse.smarthome.binding.ntp.test/0.9.0.b2/org.eclipse.smarthome.binding.ntp.test-0.9.0.b2-sources.jar
[INFO] Installing /jobs/genie.smarthome/BuildRelease/workspace/extensions/binding/org.eclipse.smarthome.binding.ntp.test/target/p2content.xml to /opt/public/hipp/homes/genie.smarthome/.m2/repository/org/eclipse/smarthome/binding/org.eclipse.smarthome.binding.ntp.test/0.9.0.b2/org.eclipse.smarthome.binding.ntp.test-0.9.0.b2-p2metadata.xml
[INFO] Installing /jobs/genie.smarthome/BuildRelease/workspace/extensions/binding/org.eclipse.smarthome.binding.ntp.test/target/p2artifacts.xml to /opt/public/hipp/homes/genie.smarthome/.m2/repository/org/eclipse/smarthome/binding/org.eclipse.smarthome.binding.ntp.test/0.9.0.b2/org.eclipse.smarthome.binding.ntp.test-0.9.0.b2-p2artifacts.xml
[INFO] 
[INFO] --- tycho-p2-plugin:0.23.1:update-local-index (default-update-local-index) @ org.eclipse.smarthome.binding.ntp.test ---
[INFO]                                                                         
[INFO] ------------------------------------------------------------------------
[INFO] Building Eclipse SmartHome Sonos Binding 0.9.0.b2
[INFO] ------------------------------------------------------------------------
[INFO] 
[INFO] --- maven-clean-plugin:2.5:clean (default-clean) @ org.eclipse.smarthome.binding.sonos ---
[INFO] Deleting /jobs/genie.smarthome/BuildRelease/workspace/extensions/binding/org.eclipse.smarthome.binding.sonos/target
[INFO] 
[INFO] --- tycho-packaging-plugin:0.23.1:build-qualifier (default-build-qualifier) @ org.eclipse.smarthome.binding.sonos ---
[INFO] The project's OSGi version is 0.9.0.b2
[INFO] 
[INFO] --- tycho-packaging-plugin:0.23.1:validate-id (default-validate-id) @ org.eclipse.smarthome.binding.sonos ---
[INFO] 
[INFO] --- tycho-packaging-plugin:0.23.1:validate-version (default-validate-version) @ org.eclipse.smarthome.binding.sonos ---
[INFO] 
[INFO] --- jacoco-maven-plugin:0.7.4.201502262128:prepare-agent (default-prepare-agent) @ org.eclipse.smarthome.binding.sonos ---
[INFO] argLine set to -javaagent:/opt/public/hipp/homes/genie.smarthome/.m2/repository/org/jacoco/org.jacoco.agent/0.7.4.201502262128/org.jacoco.agent-0.7.4.201502262128-runtime.jar=destfile=/jobs/genie.smarthome/BuildRelease/workspace/target/coverage.jacoco,append=true,excludes=**/*Test.*
[INFO] 
[INFO] --- build-helper-maven-plugin:1.8:add-source (add-source) @ org.eclipse.smarthome.binding.sonos ---
[INFO] Source directory: /jobs/genie.smarthome/BuildRelease/workspace/extensions/binding/org.eclipse.smarthome.binding.sonos/src/main/groovy added.
[INFO] 
[INFO] --- maven-resources-plugin:2.4.3:resources (default-resources) @ org.eclipse.smarthome.binding.sonos ---
[INFO] Using 'UTF-8' encoding to copy filtered resources.
[INFO] skip non existing resourceDirectory /jobs/genie.smarthome/BuildRelease/workspace/extensions/binding/org.eclipse.smarthome.binding.sonos/src/main/resources
[INFO] 
[INFO] --- tycho-compiler-plugin:0.23.1:compile (default-compile) @ org.eclipse.smarthome.binding.sonos ---
[INFO] Compiling 13 source files to /jobs/genie.smarthome/BuildRelease/workspace/extensions/binding/org.eclipse.smarthome.binding.sonos/target/classes
[INFO] 
[INFO] --- maven-compiler-plugin:3.1:compile (default) @ org.eclipse.smarthome.binding.sonos ---
[INFO] Changes detected - recompiling the module!
[INFO] Nothing to compile - all classes are up to date
[INFO] 
[INFO] --- build-helper-maven-plugin:1.8:add-test-source (add-test-source) @ org.eclipse.smarthome.binding.sonos ---
[INFO] Test Source directory: /jobs/genie.smarthome/BuildRelease/workspace/extensions/binding/org.eclipse.smarthome.binding.sonos/src/test/groovy added.
[INFO] 
[INFO] --- maven-resources-plugin:2.4.3:testResources (default-testResources) @ org.eclipse.smarthome.binding.sonos ---
[INFO] Using 'UTF-8' encoding to copy filtered resources.
[INFO] skip non existing resourceDirectory /jobs/genie.smarthome/BuildRelease/workspace/extensions/binding/org.eclipse.smarthome.binding.sonos/src/test/resources
[INFO] 
[INFO] --- tycho-source-plugin:0.23.1:plugin-source (plugin-source) @ org.eclipse.smarthome.binding.sonos ---
[WARNING] bundle localization file /jobs/genie.smarthome/BuildRelease/workspace/extensions/binding/org.eclipse.smarthome.binding.sonos/plugin.properties not found
[INFO] Building jar: /jobs/genie.smarthome/BuildRelease/workspace/extensions/binding/org.eclipse.smarthome.binding.sonos/target/org.eclipse.smarthome.binding.sonos-0.9.0.b2-sources.jar
[INFO] 
[INFO] --- target-platform-configuration:0.23.1:target-platform (default-target-platform) @ org.eclipse.smarthome.binding.sonos ---
[INFO] 
[INFO] --- tycho-packaging-plugin:0.23.1:package-plugin (default-package-plugin) @ org.eclipse.smarthome.binding.sonos ---
[INFO] Building jar: /jobs/genie.smarthome/BuildRelease/workspace/extensions/binding/org.eclipse.smarthome.binding.sonos/target/org.eclipse.smarthome.binding.sonos-0.9.0.b2.jar
[INFO] 
[INFO] --- tycho-p2-plugin:0.23.1:p2-metadata-default (default-p2-metadata-default) @ org.eclipse.smarthome.binding.sonos ---
[INFO] 
[INFO] --- jacoco-maven-plugin:0.7.4.201502262128:prepare-agent-integration (default-prepare-agent-integration) @ org.eclipse.smarthome.binding.sonos ---
[INFO] argLine set to -javaagent:/opt/public/hipp/homes/genie.smarthome/.m2/repository/org/jacoco/org.jacoco.agent/0.7.4.201502262128/org.jacoco.agent-0.7.4.201502262128-runtime.jar=destfile=/jobs/genie.smarthome/BuildRelease/workspace/target/coverage.jacoco,append=true,excludes=**/*Test.*
[INFO] 
[INFO] --- eclipse-jarsigner-plugin:1.0.5:sign (sign) @ org.eclipse.smarthome.binding.sonos ---
[INFO] Searching org.eclipse.smarthome.binding.sonos-0.9.0.b2.jar for inner jars...
[INFO] Signed org.eclipse.smarthome.binding:org.eclipse.smarthome.binding.sonos:eclipse-plugin:0.9.0.b2 in 1 seconds.
[INFO] Searching org.eclipse.smarthome.binding.sonos-0.9.0.b2-sources.jar for inner jars...
[INFO] Signed org.eclipse.smarthome.binding:org.eclipse.smarthome.binding.sonos:java-source:sources:0.9.0.b2 in 1 seconds.
[INFO] 
[INFO] --- maven-install-plugin:2.3.1:install (default-install) @ org.eclipse.smarthome.binding.sonos ---
[INFO] Installing /jobs/genie.smarthome/BuildRelease/workspace/extensions/binding/org.eclipse.smarthome.binding.sonos/target/org.eclipse.smarthome.binding.sonos-0.9.0.b2.jar to /opt/public/hipp/homes/genie.smarthome/.m2/repository/org/eclipse/smarthome/binding/org.eclipse.smarthome.binding.sonos/0.9.0.b2/org.eclipse.smarthome.binding.sonos-0.9.0.b2.jar
[INFO] Installing /jobs/genie.smarthome/BuildRelease/workspace/extensions/binding/org.eclipse.smarthome.binding.sonos/pom.xml to /opt/public/hipp/homes/genie.smarthome/.m2/repository/org/eclipse/smarthome/binding/org.eclipse.smarthome.binding.sonos/0.9.0.b2/org.eclipse.smarthome.binding.sonos-0.9.0.b2.pom
[INFO] Installing /jobs/genie.smarthome/BuildRelease/workspace/extensions/binding/org.eclipse.smarthome.binding.sonos/target/org.eclipse.smarthome.binding.sonos-0.9.0.b2-sources.jar to /opt/public/hipp/homes/genie.smarthome/.m2/repository/org/eclipse/smarthome/binding/org.eclipse.smarthome.binding.sonos/0.9.0.b2/org.eclipse.smarthome.binding.sonos-0.9.0.b2-sources.jar
[INFO] Installing /jobs/genie.smarthome/BuildRelease/workspace/extensions/binding/org.eclipse.smarthome.binding.sonos/target/p2content.xml to /opt/public/hipp/homes/genie.smarthome/.m2/repository/org/eclipse/smarthome/binding/org.eclipse.smarthome.binding.sonos/0.9.0.b2/org.eclipse.smarthome.binding.sonos-0.9.0.b2-p2metadata.xml
[INFO] Installing /jobs/genie.smarthome/BuildRelease/workspace/extensions/binding/org.eclipse.smarthome.binding.sonos/target/p2artifacts.xml to /opt/public/hipp/homes/genie.smarthome/.m2/repository/org/eclipse/smarthome/binding/org.eclipse.smarthome.binding.sonos/0.9.0.b2/org.eclipse.smarthome.binding.sonos-0.9.0.b2-p2artifacts.xml
[INFO] 
[INFO] --- tycho-p2-plugin:0.23.1:update-local-index (default-update-local-index) @ org.eclipse.smarthome.binding.sonos ---
[INFO]                                                                         
[INFO] ------------------------------------------------------------------------
[INFO] Building Eclipse SmartHome WeMo Binding 0.9.0.b2
[INFO] ------------------------------------------------------------------------
[INFO] 
[INFO] --- maven-clean-plugin:2.5:clean (default-clean) @ org.eclipse.smarthome.binding.wemo ---
[INFO] Deleting /jobs/genie.smarthome/BuildRelease/workspace/extensions/binding/org.eclipse.smarthome.binding.wemo/target
[INFO] 
[INFO] --- tycho-packaging-plugin:0.23.1:build-qualifier (default-build-qualifier) @ org.eclipse.smarthome.binding.wemo ---
[INFO] The project's OSGi version is 0.9.0.b2
[INFO] 
[INFO] --- tycho-packaging-plugin:0.23.1:validate-id (default-validate-id) @ org.eclipse.smarthome.binding.wemo ---
[INFO] 
[INFO] --- tycho-packaging-plugin:0.23.1:validate-version (default-validate-version) @ org.eclipse.smarthome.binding.wemo ---
[INFO] 
[INFO] --- jacoco-maven-plugin:0.7.4.201502262128:prepare-agent (default-prepare-agent) @ org.eclipse.smarthome.binding.wemo ---
[INFO] argLine set to -javaagent:/opt/public/hipp/homes/genie.smarthome/.m2/repository/org/jacoco/org.jacoco.agent/0.7.4.201502262128/org.jacoco.agent-0.7.4.201502262128-runtime.jar=destfile=/jobs/genie.smarthome/BuildRelease/workspace/target/coverage.jacoco,append=true,excludes=**/*Test.*
[INFO] 
[INFO] --- build-helper-maven-plugin:1.8:add-source (add-source) @ org.eclipse.smarthome.binding.wemo ---
[INFO] Source directory: /jobs/genie.smarthome/BuildRelease/workspace/extensions/binding/org.eclipse.smarthome.binding.wemo/src/main/groovy added.
[INFO] 
[INFO] --- maven-resources-plugin:2.4.3:resources (default-resources) @ org.eclipse.smarthome.binding.wemo ---
[INFO] Using 'UTF-8' encoding to copy filtered resources.
[INFO] skip non existing resourceDirectory /jobs/genie.smarthome/BuildRelease/workspace/extensions/binding/org.eclipse.smarthome.binding.wemo/src/main/resources
[INFO] 
[INFO] --- tycho-compiler-plugin:0.23.1:compile (default-compile) @ org.eclipse.smarthome.binding.wemo ---
[INFO] Compiling 10 source files to /jobs/genie.smarthome/BuildRelease/workspace/extensions/binding/org.eclipse.smarthome.binding.wemo/target/classes
[INFO] 
[INFO] --- maven-compiler-plugin:3.1:compile (default) @ org.eclipse.smarthome.binding.wemo ---
[INFO] Changes detected - recompiling the module!
[INFO] Nothing to compile - all classes are up to date
[INFO] 
[INFO] --- build-helper-maven-plugin:1.8:add-test-source (add-test-source) @ org.eclipse.smarthome.binding.wemo ---
[INFO] Test Source directory: /jobs/genie.smarthome/BuildRelease/workspace/extensions/binding/org.eclipse.smarthome.binding.wemo/src/test/groovy added.
[INFO] 
[INFO] --- maven-resources-plugin:2.4.3:testResources (default-testResources) @ org.eclipse.smarthome.binding.wemo ---
[INFO] Using 'UTF-8' encoding to copy filtered resources.
[INFO] skip non existing resourceDirectory /jobs/genie.smarthome/BuildRelease/workspace/extensions/binding/org.eclipse.smarthome.binding.wemo/src/test/resources
[INFO] 
[INFO] --- tycho-source-plugin:0.23.1:plugin-source (plugin-source) @ org.eclipse.smarthome.binding.wemo ---
[WARNING] bundle localization file /jobs/genie.smarthome/BuildRelease/workspace/extensions/binding/org.eclipse.smarthome.binding.wemo/plugin.properties not found
[INFO] Building jar: /jobs/genie.smarthome/BuildRelease/workspace/extensions/binding/org.eclipse.smarthome.binding.wemo/target/org.eclipse.smarthome.binding.wemo-0.9.0.b2-sources.jar
[INFO] 
[INFO] --- target-platform-configuration:0.23.1:target-platform (default-target-platform) @ org.eclipse.smarthome.binding.wemo ---
[INFO] 
[INFO] --- tycho-packaging-plugin:0.23.1:package-plugin (default-package-plugin) @ org.eclipse.smarthome.binding.wemo ---
[INFO] Building jar: /jobs/genie.smarthome/BuildRelease/workspace/extensions/binding/org.eclipse.smarthome.binding.wemo/target/org.eclipse.smarthome.binding.wemo-0.9.0.b2.jar
[INFO] 
[INFO] --- tycho-p2-plugin:0.23.1:p2-metadata-default (default-p2-metadata-default) @ org.eclipse.smarthome.binding.wemo ---
[INFO] 
[INFO] --- jacoco-maven-plugin:0.7.4.201502262128:prepare-agent-integration (default-prepare-agent-integration) @ org.eclipse.smarthome.binding.wemo ---
[INFO] argLine set to -javaagent:/opt/public/hipp/homes/genie.smarthome/.m2/repository/org/jacoco/org.jacoco.agent/0.7.4.201502262128/org.jacoco.agent-0.7.4.201502262128-runtime.jar=destfile=/jobs/genie.smarthome/BuildRelease/workspace/target/coverage.jacoco,append=true,excludes=**/*Test.*
[INFO] 
[INFO] --- eclipse-jarsigner-plugin:1.0.5:sign (sign) @ org.eclipse.smarthome.binding.wemo ---
[INFO] Searching org.eclipse.smarthome.binding.wemo-0.9.0.b2.jar for inner jars...
[INFO] Signed org.eclipse.smarthome.binding:org.eclipse.smarthome.binding.wemo:eclipse-plugin:0.9.0.b2 in 1 seconds.
[INFO] Searching org.eclipse.smarthome.binding.wemo-0.9.0.b2-sources.jar for inner jars...
[INFO] Signed org.eclipse.smarthome.binding:org.eclipse.smarthome.binding.wemo:java-source:sources:0.9.0.b2 in 1 seconds.
[INFO] 
[INFO] --- maven-install-plugin:2.3.1:install (default-install) @ org.eclipse.smarthome.binding.wemo ---
[INFO] Installing /jobs/genie.smarthome/BuildRelease/workspace/extensions/binding/org.eclipse.smarthome.binding.wemo/target/org.eclipse.smarthome.binding.wemo-0.9.0.b2.jar to /opt/public/hipp/homes/genie.smarthome/.m2/repository/org/eclipse/smarthome/binding/org.eclipse.smarthome.binding.wemo/0.9.0.b2/org.eclipse.smarthome.binding.wemo-0.9.0.b2.jar
[INFO] Installing /jobs/genie.smarthome/BuildRelease/workspace/extensions/binding/org.eclipse.smarthome.binding.wemo/pom.xml to /opt/public/hipp/homes/genie.smarthome/.m2/repository/org/eclipse/smarthome/binding/org.eclipse.smarthome.binding.wemo/0.9.0.b2/org.eclipse.smarthome.binding.wemo-0.9.0.b2.pom
[INFO] Installing /jobs/genie.smarthome/BuildRelease/workspace/extensions/binding/org.eclipse.smarthome.binding.wemo/target/org.eclipse.smarthome.binding.wemo-0.9.0.b2-sources.jar to /opt/public/hipp/homes/genie.smarthome/.m2/repository/org/eclipse/smarthome/binding/org.eclipse.smarthome.binding.wemo/0.9.0.b2/org.eclipse.smarthome.binding.wemo-0.9.0.b2-sources.jar
[INFO] Installing /jobs/genie.smarthome/BuildRelease/workspace/extensions/binding/org.eclipse.smarthome.binding.wemo/target/p2content.xml to /opt/public/hipp/homes/genie.smarthome/.m2/repository/org/eclipse/smarthome/binding/org.eclipse.smarthome.binding.wemo/0.9.0.b2/org.eclipse.smarthome.binding.wemo-0.9.0.b2-p2metadata.xml
[INFO] Installing /jobs/genie.smarthome/BuildRelease/workspace/extensions/binding/org.eclipse.smarthome.binding.wemo/target/p2artifacts.xml to /opt/public/hipp/homes/genie.smarthome/.m2/repository/org/eclipse/smarthome/binding/org.eclipse.smarthome.binding.wemo/0.9.0.b2/org.eclipse.smarthome.binding.wemo-0.9.0.b2-p2artifacts.xml
[INFO] 
[INFO] --- tycho-p2-plugin:0.23.1:update-local-index (default-update-local-index) @ org.eclipse.smarthome.binding.wemo ---
[INFO]                                                                         
[INFO] ------------------------------------------------------------------------
[INFO] Building Eclipse SmartHome Wemo Binding Tests 0.9.0.b2
[INFO] ------------------------------------------------------------------------
[INFO] 
[INFO] --- maven-clean-plugin:2.5:clean (default-clean) @ org.eclipse.smarthome.binding.wemo.test ---
[INFO] Deleting /jobs/genie.smarthome/BuildRelease/workspace/extensions/binding/org.eclipse.smarthome.binding.wemo.test/target
[INFO] 
[INFO] --- tycho-packaging-plugin:0.23.1:build-qualifier (default-build-qualifier) @ org.eclipse.smarthome.binding.wemo.test ---
[INFO] The project's OSGi version is 0.9.0.b2
[INFO] 
[INFO] --- tycho-packaging-plugin:0.23.1:validate-id (default-validate-id) @ org.eclipse.smarthome.binding.wemo.test ---
[INFO] 
[INFO] --- tycho-packaging-plugin:0.23.1:validate-version (default-validate-version) @ org.eclipse.smarthome.binding.wemo.test ---
[INFO] 
[INFO] --- jacoco-maven-plugin:0.7.4.201502262128:prepare-agent (default-prepare-agent) @ org.eclipse.smarthome.binding.wemo.test ---
[INFO] tycho.testArgLine set to -javaagent:/opt/public/hipp/homes/genie.smarthome/.m2/repository/org/jacoco/org.jacoco.agent/0.7.4.201502262128/org.jacoco.agent-0.7.4.201502262128-runtime.jar=destfile=/jobs/genie.smarthome/BuildRelease/workspace/target/coverage.jacoco,append=true,excludes=**/*Test.*
[INFO] 
[INFO] --- build-helper-maven-plugin:1.8:add-source (add-source) @ org.eclipse.smarthome.binding.wemo.test ---
[INFO] Source directory: /jobs/genie.smarthome/BuildRelease/workspace/extensions/binding/org.eclipse.smarthome.binding.wemo.test/src/main/groovy added.
[INFO] 
[INFO] --- maven-resources-plugin:2.4.3:resources (default-resources) @ org.eclipse.smarthome.binding.wemo.test ---
[INFO] Using 'UTF-8' encoding to copy filtered resources.
[INFO] skip non existing resourceDirectory /jobs/genie.smarthome/BuildRelease/workspace/extensions/binding/org.eclipse.smarthome.binding.wemo.test/src/main/resources
[INFO] 
[INFO] --- tycho-compiler-plugin:0.23.1:compile (default-compile) @ org.eclipse.smarthome.binding.wemo.test ---
[INFO] Nothing to compile - all classes are up to date
[INFO] 
[INFO] --- maven-compiler-plugin:3.1:compile (default) @ org.eclipse.smarthome.binding.wemo.test ---
[INFO] Changes detected - recompiling the module!
[INFO] Using Groovy-Eclipse compiler to compile both Java and Groovy files
[INFO] 
[INFO] --- build-helper-maven-plugin:1.8:add-test-source (add-test-source) @ org.eclipse.smarthome.binding.wemo.test ---
[INFO] Test Source directory: /jobs/genie.smarthome/BuildRelease/workspace/extensions/binding/org.eclipse.smarthome.binding.wemo.test/src/test/groovy added.
[INFO] 
[INFO] --- maven-resources-plugin:2.4.3:testResources (default-testResources) @ org.eclipse.smarthome.binding.wemo.test ---
[INFO] Using 'UTF-8' encoding to copy filtered resources.
[INFO] skip non existing resourceDirectory /jobs/genie.smarthome/BuildRelease/workspace/extensions/binding/org.eclipse.smarthome.binding.wemo.test/src/test/resources
[INFO] 
[INFO] --- tycho-source-plugin:0.23.1:plugin-source (plugin-source) @ org.eclipse.smarthome.binding.wemo.test ---
[WARNING] bundle localization file /jobs/genie.smarthome/BuildRelease/workspace/extensions/binding/org.eclipse.smarthome.binding.wemo.test/plugin.properties not found
[WARNING] Bundle-Vendor header not found in /jobs/genie.smarthome/BuildRelease/workspace/extensions/binding/org.eclipse.smarthome.binding.wemo.test/META-INF/MANIFEST.MF, fallback to 'unknown' for source bundle
[INFO] Building jar: /jobs/genie.smarthome/BuildRelease/workspace/extensions/binding/org.eclipse.smarthome.binding.wemo.test/target/org.eclipse.smarthome.binding.wemo.test-0.9.0.b2-sources.jar
[INFO] 
[INFO] --- target-platform-configuration:0.23.1:target-platform (default-target-platform) @ org.eclipse.smarthome.binding.wemo.test ---
[INFO] 
[INFO] --- tycho-packaging-plugin:0.23.1:package-plugin (default-package-plugin) @ org.eclipse.smarthome.binding.wemo.test ---
[INFO] Building jar: /jobs/genie.smarthome/BuildRelease/workspace/extensions/binding/org.eclipse.smarthome.binding.wemo.test/target/org.eclipse.smarthome.binding.wemo.test-0.9.0.b2.jar
[INFO] 
[INFO] --- tycho-p2-plugin:0.23.1:p2-metadata-default (default-p2-metadata-default) @ org.eclipse.smarthome.binding.wemo.test ---
[INFO] 
[INFO] --- jacoco-maven-plugin:0.7.4.201502262128:prepare-agent-integration (default-prepare-agent-integration) @ org.eclipse.smarthome.binding.wemo.test ---
[INFO] tycho.testArgLine set to -javaagent:/opt/public/hipp/homes/genie.smarthome/.m2/repository/org/jacoco/org.jacoco.agent/0.7.4.201502262128/org.jacoco.agent-0.7.4.201502262128-runtime.jar=destfile=/jobs/genie.smarthome/BuildRelease/workspace/target/coverage.jacoco,append=true,excludes=**/*Test.*
[INFO] 
[INFO] --- tycho-surefire-plugin:0.23.1:test (default-test) @ org.eclipse.smarthome.binding.wemo.test ---
[INFO] Expected eclipse log file: /jobs/genie.smarthome/BuildRelease/workspace/extensions/binding/org.eclipse.smarthome.binding.wemo.test/target/work/data/.metadata/.log
[INFO] Command line:
	[/opt/public/common/jdk1.7.0_80/jre/bin/java, -Dosgi.noShutdown=false, -Dosgi.os=linux, -Dosgi.ws=gtk, -Dosgi.arch=x86_64, -Djetty.home.bundle=org.eclipse.jetty.osgi.boot, -Dosgi.clean=true, -jar, /opt/public/hipp/homes/genie.smarthome/.m2/repository/p2/osgi/bundle/org.eclipse.equinox.launcher/1.3.0.v20140415-2008/org.eclipse.equinox.launcher-1.3.0.v20140415-2008.jar, -data, /jobs/genie.smarthome/BuildRelease/workspace/extensions/binding/org.eclipse.smarthome.binding.wemo.test/target/work/data, -install, /jobs/genie.smarthome/BuildRelease/workspace/extensions/binding/org.eclipse.smarthome.binding.wemo.test/target/work, -configuration, /jobs/genie.smarthome/BuildRelease/workspace/extensions/binding/org.eclipse.smarthome.binding.wemo.test/target/work/configuration, -application, org.eclipse.tycho.surefire.osgibooter.headlesstest, -testproperties, /jobs/genie.smarthome/BuildRelease/workspace/extensions/binding/org.eclipse.smarthome.binding.wemo.test/target/surefire.properties]
SLF4J: Failed to load class "org.slf4j.impl.StaticLoggerBinder".
SLF4J: Defaulting to no-operation (NOP) logger implementation
SLF4J: See http://www.slf4j.org/codes.html#StaticLoggerBinder for further details.

-------------------------------------------------------
 T E S T S
-------------------------------------------------------
Running org.eclipse.smarthome.binding.wemo.discovery.test.WemoDiscoveryParticipantTest
Tests run: 6, Failures: 0, Errors: 0, Skipped: 0, Time elapsed: 0.466 sec - in org.eclipse.smarthome.binding.wemo.discovery.test.WemoDiscoveryParticipantTest
assert discovery result for Maker is correct(org.eclipse.smarthome.binding.wemo.discovery.test.WemoDiscoveryParticipantTest)  Time elapsed: 0.173 sec
assert discovery result for Motion is correct(org.eclipse.smarthome.binding.wemo.discovery.test.WemoDiscoveryParticipantTest)  Time elapsed: 0.001 sec
assert discovery result for Bridge is correct(org.eclipse.smarthome.binding.wemo.discovery.test.WemoDiscoveryParticipantTest)  Time elapsed: 0.001 sec
assert discovery result for Insight is correct(org.eclipse.smarthome.binding.wemo.discovery.test.WemoDiscoveryParticipantTest)  Time elapsed: 0.001 sec
assert discovery result for Lightswitch is correct(org.eclipse.smarthome.binding.wemo.discovery.test.WemoDiscoveryParticipantTest)  Time elapsed: 0.001 sec
assert discovery result for Socket is correct(org.eclipse.smarthome.binding.wemo.discovery.test.WemoDiscoveryParticipantTest)  Time elapsed: 0.001 sec
Running org.eclipse.smarthome.binding.wemo.discovery.test.WemoLinkDiscoveryServiceOSGiTest
Tests run: 1, Failures: 0, Errors: 0, Skipped: 0, Time elapsed: 5.997 sec - in org.eclipse.smarthome.binding.wemo.discovery.test.WemoLinkDiscoveryServiceOSGiTest
assert supported thing is discovered(org.eclipse.smarthome.binding.wemo.discovery.test.WemoLinkDiscoveryServiceOSGiTest)  Time elapsed: 5.965 sec
Running org.eclipse.smarthome.binding.wemo.discovery.test.WemoDiscoveryOSGiTest
Tests run: 1, Failures: 0, Errors: 0, Skipped: 0, Time elapsed: 0.142 sec - in org.eclipse.smarthome.binding.wemo.discovery.test.WemoDiscoveryOSGiTest
assert supported thing is discovered(org.eclipse.smarthome.binding.wemo.discovery.test.WemoDiscoveryOSGiTest)  Time elapsed: 0.131 sec
Running org.eclipse.smarthome.binding.wemo.handler.test.WemoHandlerOSGiTest
Tests run: 5, Failures: 3, Errors: 2, Skipped: 0, Time elapsed: 30.555 sec <<< FAILURE! - in org.eclipse.smarthome.binding.wemo.handler.test.WemoHandlerOSGiTest
assert that thing handles OnOff command correctly(org.eclipse.smarthome.binding.wemo.handler.test.WemoHandlerOSGiTest)  Time elapsed: 10.324 sec  <<< FAILURE!
java.lang.AssertionError: 
Expected: is <0>
     but: was <2>
	at org.hamcrest.MatcherAssert.assertThat(MatcherAssert.java:20)
	at org.junit.Assert.assertThat(Assert.java:865)
	at org.junit.Assert.assertThat(Assert.java:832)
	at org.junit.Assert$assertThat.callStatic(Unknown Source)
	at org.eclipse.smarthome.binding.wemo.handler.test.WemoHandlerOSGiTest$_removeThing_closure12.doCall(WemoHandlerOSGiTest.groovy:176)
	at org.eclipse.smarthome.binding.wemo.handler.test.WemoHandlerOSGiTest$_removeThing_closure12.doCall(WemoHandlerOSGiTest.groovy)
	at sun.reflect.GeneratedMethodAccessor8.invoke(Unknown Source)
	at sun.reflect.DelegatingMethodAccessorImpl.invoke(DelegatingMethodAccessorImpl.java:43)
	at java.lang.reflect.Method.invoke(Method.java:606)
	at org.codehaus.groovy.reflection.CachedMethod.invoke(CachedMethod.java:90)
	at groovy.lang.MetaMethod.doMethodInvoke(MetaMethod.java:324)
	at org.codehaus.groovy.runtime.metaclass.ClosureMetaClass.invokeMethod(ClosureMetaClass.java:278)
	at groovy.lang.MetaClassImpl.invokeMethod(MetaClassImpl.java:1016)
	at org.codehaus.groovy.runtime.callsite.PogoMetaClassSite.call(PogoMetaClassSite.java:39)
	at org.codehaus.groovy.runtime.callsite.CallSiteArray.defaultCall(CallSiteArray.java:45)
	at org.codehaus.groovy.runtime.callsite.AbstractCallSite.call(AbstractCallSite.java:108)
	at org.codehaus.groovy.runtime.callsite.AbstractCallSite.call(AbstractCallSite.java:112)
	at org.eclipse.smarthome.test.OSGiTest.waitForAssert(OSGiTest.groovy:199)
	at org.eclipse.smarthome.test.OSGiTest.waitForAssert(OSGiTest.groovy)
	at sun.reflect.NativeMethodAccessorImpl.invoke0(Native Method)
	at sun.reflect.NativeMethodAccessorImpl.invoke(NativeMethodAccessorImpl.java:57)
	at sun.reflect.DelegatingMethodAccessorImpl.invoke(DelegatingMethodAccessorImpl.java:43)
	at java.lang.reflect.Method.invoke(Method.java:606)
	at org.codehaus.groovy.runtime.callsite.PogoMetaMethodSite$PogoCachedMethodSiteNoUnwrapNoCoerce.invoke(PogoMetaMethodSite.java:207)
	at org.codehaus.groovy.runtime.callsite.PogoMetaMethodSite.callCurrent(PogoMetaMethodSite.java:56)
	at org.codehaus.groovy.runtime.callsite.CallSiteArray.defaultCallCurrent(CallSiteArray.java:49)
	at org.codehaus.groovy.runtime.callsite.AbstractCallSite.callCurrent(AbstractCallSite.java:133)
	at org.codehaus.groovy.runtime.callsite.AbstractCallSite.callCurrent(AbstractCallSite.java:141)
	at org.eclipse.smarthome.binding.wemo.handler.test.WemoHandlerOSGiTest.removeThing(WemoHandlerOSGiTest.groovy:175)
	at org.eclipse.smarthome.binding.wemo.handler.test.WemoHandlerOSGiTest.tearDown(WemoHandlerOSGiTest.groovy:62)

assert that thing updates channels states at start(org.eclipse.smarthome.binding.wemo.handler.test.WemoHandlerOSGiTest)  Time elapsed: 10.106 sec  <<< ERROR!
org.osgi.service.http.NamespaceException: The alias '/upnp/control/basicevent1' is already in use.
	at org.eclipse.equinox.http.servlet.internal.ProxyServlet.registerServlet(ProxyServlet.java:169)
	at org.eclipse.equinox.http.servlet.internal.HttpServiceImpl.registerServlet(HttpServiceImpl.java:66)
	at org.osgi.service.http.HttpService$registerServlet.call(Unknown Source)
	at org.eclipse.smarthome.binding.wemo.test.GenericWemoOSGiTest.registerServlet(GenericWemoOSGiTest.groovy:120)
	at sun.reflect.NativeMethodAccessorImpl.invoke0(Native Method)
	at sun.reflect.NativeMethodAccessorImpl.invoke(NativeMethodAccessorImpl.java:57)
	at sun.reflect.DelegatingMethodAccessorImpl.invoke(DelegatingMethodAccessorImpl.java:43)
	at java.lang.reflect.Method.invoke(Method.java:606)
	at org.codehaus.groovy.runtime.callsite.PogoMetaMethodSite$PogoCachedMethodSiteNoUnwrap.invoke(PogoMetaMethodSite.java:187)
	at org.codehaus.groovy.runtime.callsite.PogoMetaMethodSite.callCurrent(PogoMetaMethodSite.java:56)
	at org.codehaus.groovy.runtime.callsite.AbstractCallSite.callCurrent(AbstractCallSite.java:145)
	at org.eclipse.smarthome.binding.wemo.handler.test.WemoHandlerOSGiTest.setUp(WemoHandlerOSGiTest.groovy:57)

assert that thing updates channels states at start(org.eclipse.smarthome.binding.wemo.handler.test.WemoHandlerOSGiTest)  Time elapsed: 10.11 sec  <<< FAILURE!
java.lang.AssertionError: 
Expected: is <0>
     but: was <2>
	at org.hamcrest.MatcherAssert.assertThat(MatcherAssert.java:20)
	at org.junit.Assert.assertThat(Assert.java:865)
	at org.junit.Assert.assertThat(Assert.java:832)
	at org.junit.Assert$assertThat.callStatic(Unknown Source)
	at org.eclipse.smarthome.binding.wemo.handler.test.WemoHandlerOSGiTest$_removeThing_closure12.doCall(WemoHandlerOSGiTest.groovy:176)
	at org.eclipse.smarthome.binding.wemo.handler.test.WemoHandlerOSGiTest$_removeThing_closure12.doCall(WemoHandlerOSGiTest.groovy)
	at sun.reflect.GeneratedMethodAccessor8.invoke(Unknown Source)
	at sun.reflect.DelegatingMethodAccessorImpl.invoke(DelegatingMethodAccessorImpl.java:43)
	at java.lang.reflect.Method.invoke(Method.java:606)
	at org.codehaus.groovy.reflection.CachedMethod.invoke(CachedMethod.java:90)
	at groovy.lang.MetaMethod.doMethodInvoke(MetaMethod.java:324)
	at org.codehaus.groovy.runtime.metaclass.ClosureMetaClass.invokeMethod(ClosureMetaClass.java:278)
	at groovy.lang.MetaClassImpl.invokeMethod(MetaClassImpl.java:1016)
	at org.codehaus.groovy.runtime.callsite.PogoMetaClassSite.call(PogoMetaClassSite.java:39)
	at org.codehaus.groovy.runtime.callsite.AbstractCallSite.call(AbstractCallSite.java:112)
	at org.eclipse.smarthome.test.OSGiTest.waitForAssert(OSGiTest.groovy:199)
	at org.eclipse.smarthome.test.OSGiTest.waitForAssert(OSGiTest.groovy)
	at sun.reflect.NativeMethodAccessorImpl.invoke0(Native Method)
	at sun.reflect.NativeMethodAccessorImpl.invoke(NativeMethodAccessorImpl.java:57)
	at sun.reflect.DelegatingMethodAccessorImpl.invoke(DelegatingMethodAccessorImpl.java:43)
	at java.lang.reflect.Method.invoke(Method.java:606)
	at org.codehaus.groovy.runtime.callsite.PogoMetaMethodSite$PogoCachedMethodSiteNoUnwrapNoCoerce.invoke(PogoMetaMethodSite.java:207)
	at org.codehaus.groovy.runtime.callsite.PogoMetaMethodSite.callCurrent(PogoMetaMethodSite.java:56)
	at org.codehaus.groovy.runtime.callsite.AbstractCallSite.callCurrent(AbstractCallSite.java:141)
	at org.eclipse.smarthome.binding.wemo.handler.test.WemoHandlerOSGiTest.removeThing(WemoHandlerOSGiTest.groovy:175)
	at org.eclipse.smarthome.binding.wemo.handler.test.WemoHandlerOSGiTest.tearDown(WemoHandlerOSGiTest.groovy:62)

assert that thing handles REFRESH command correctly(org.eclipse.smarthome.binding.wemo.handler.test.WemoHandlerOSGiTest)  Time elapsed: 10.104 sec  <<< ERROR!
org.osgi.service.http.NamespaceException: The alias '/upnp/control/basicevent1' is already in use.
	at org.eclipse.equinox.http.servlet.internal.ProxyServlet.registerServlet(ProxyServlet.java:169)
	at org.eclipse.equinox.http.servlet.internal.HttpServiceImpl.registerServlet(HttpServiceImpl.java:66)
	at org.osgi.service.http.HttpService$registerServlet.call(Unknown Source)
	at org.eclipse.smarthome.binding.wemo.test.GenericWemoOSGiTest.registerServlet(GenericWemoOSGiTest.groovy:120)
	at sun.reflect.NativeMethodAccessorImpl.invoke0(Native Method)
	at sun.reflect.NativeMethodAccessorImpl.invoke(NativeMethodAccessorImpl.java:57)
	at sun.reflect.DelegatingMethodAccessorImpl.invoke(DelegatingMethodAccessorImpl.java:43)
	at java.lang.reflect.Method.invoke(Method.java:606)
	at org.codehaus.groovy.runtime.callsite.PogoMetaMethodSite$PogoCachedMethodSiteNoUnwrap.invoke(PogoMetaMethodSite.java:187)
	at org.codehaus.groovy.runtime.callsite.PogoMetaMethodSite.callCurrent(PogoMetaMethodSite.java:56)
	at org.codehaus.groovy.runtime.callsite.AbstractCallSite.callCurrent(AbstractCallSite.java:145)
	at org.eclipse.smarthome.binding.wemo.handler.test.WemoHandlerOSGiTest.setUp(WemoHandlerOSGiTest.groovy:57)

assert that thing handles REFRESH command correctly(org.eclipse.smarthome.binding.wemo.handler.test.WemoHandlerOSGiTest)  Time elapsed: 10.105 sec  <<< FAILURE!
java.lang.AssertionError: 
Expected: is <0>
     but: was <2>
	at org.hamcrest.MatcherAssert.assertThat(MatcherAssert.java:20)
	at org.junit.Assert.assertThat(Assert.java:865)
	at org.junit.Assert.assertThat(Assert.java:832)
	at org.junit.Assert$assertThat.callStatic(Unknown Source)
	at org.eclipse.smarthome.binding.wemo.handler.test.WemoHandlerOSGiTest$_removeThing_closure12.doCall(WemoHandlerOSGiTest.groovy:176)
	at org.eclipse.smarthome.binding.wemo.handler.test.WemoHandlerOSGiTest$_removeThing_closure12.doCall(WemoHandlerOSGiTest.groovy)
	at sun.reflect.GeneratedMethodAccessor8.invoke(Unknown Source)
	at sun.reflect.DelegatingMethodAccessorImpl.invoke(DelegatingMethodAccessorImpl.java:43)
	at java.lang.reflect.Method.invoke(Method.java:606)
	at org.codehaus.groovy.reflection.CachedMethod.invoke(CachedMethod.java:90)
	at groovy.lang.MetaMethod.doMethodInvoke(MetaMethod.java:324)
	at org.codehaus.groovy.runtime.metaclass.ClosureMetaClass.invokeMethod(ClosureMetaClass.java:278)
	at groovy.lang.MetaClassImpl.invokeMethod(MetaClassImpl.java:1016)
	at org.codehaus.groovy.runtime.callsite.PogoMetaClassSite.call(PogoMetaClassSite.java:39)
	at org.codehaus.groovy.runtime.callsite.AbstractCallSite.call(AbstractCallSite.java:112)
	at org.eclipse.smarthome.test.OSGiTest.waitForAssert(OSGiTest.groovy:199)
	at org.eclipse.smarthome.test.OSGiTest.waitForAssert(OSGiTest.groovy)
	at sun.reflect.NativeMethodAccessorImpl.invoke0(Native Method)
	at sun.reflect.NativeMethodAccessorImpl.invoke(NativeMethodAccessorImpl.java:57)
	at sun.reflect.DelegatingMethodAccessorImpl.invoke(DelegatingMethodAccessorImpl.java:43)
	at java.lang.reflect.Method.invoke(Method.java:606)
	at org.codehaus.groovy.runtime.callsite.PogoMetaMethodSite$PogoCachedMethodSiteNoUnwrapNoCoerce.invoke(PogoMetaMethodSite.java:207)
	at org.codehaus.groovy.runtime.callsite.PogoMetaMethodSite.callCurrent(PogoMetaMethodSite.java:56)
	at org.codehaus.groovy.runtime.callsite.AbstractCallSite.callCurrent(AbstractCallSite.java:141)
	at org.eclipse.smarthome.binding.wemo.handler.test.WemoHandlerOSGiTest.removeThing(WemoHandlerOSGiTest.groovy:175)
	at org.eclipse.smarthome.binding.wemo.handler.test.WemoHandlerOSGiTest.tearDown(WemoHandlerOSGiTest.groovy:62)

Running org.eclipse.smarthome.binding.wemo.handler.test.WemoMakerHandlerOSGiTest
Tests run: 6, Failures: 3, Errors: 3, Skipped: 0, Time elapsed: 30.327 sec <<< FAILURE! - in org.eclipse.smarthome.binding.wemo.handler.test.WemoMakerHandlerOSGiTest
assert that thing updates channels at start(org.eclipse.smarthome.binding.wemo.handler.test.WemoMakerHandlerOSGiTest)  Time elapsed: 10.111 sec  <<< ERROR!
org.osgi.service.http.NamespaceException: The alias '/upnp/control/basicevent1' is already in use.
	at org.eclipse.equinox.http.servlet.internal.ProxyServlet.registerServlet(ProxyServlet.java:169)
	at org.eclipse.equinox.http.servlet.internal.HttpServiceImpl.registerServlet(HttpServiceImpl.java:66)
	at org.osgi.service.http.HttpService$registerServlet.call(Unknown Source)
	at org.codehaus.groovy.runtime.callsite.CallSiteArray.defaultCall(CallSiteArray.java:45)
	at org.osgi.service.http.HttpService$registerServlet.call(Unknown Source)
	at org.eclipse.smarthome.binding.wemo.test.GenericWemoOSGiTest.registerServlet(GenericWemoOSGiTest.groovy:120)
	at sun.reflect.NativeMethodAccessorImpl.invoke0(Native Method)
	at sun.reflect.NativeMethodAccessorImpl.invoke(NativeMethodAccessorImpl.java:57)
	at sun.reflect.DelegatingMethodAccessorImpl.invoke(DelegatingMethodAccessorImpl.java:43)
	at java.lang.reflect.Method.invoke(Method.java:606)
	at org.codehaus.groovy.runtime.callsite.PogoMetaMethodSite$PogoCachedMethodSiteNoUnwrap.invoke(PogoMetaMethodSite.java:187)
	at org.codehaus.groovy.runtime.callsite.PogoMetaMethodSite.callCurrent(PogoMetaMethodSite.java:56)
	at org.codehaus.groovy.runtime.callsite.CallSiteArray.defaultCallCurrent(CallSiteArray.java:49)
	at org.codehaus.groovy.runtime.callsite.AbstractCallSite.callCurrent(AbstractCallSite.java:133)
	at org.codehaus.groovy.runtime.callsite.AbstractCallSite.callCurrent(AbstractCallSite.java:145)
	at org.eclipse.smarthome.binding.wemo.handler.test.WemoMakerHandlerOSGiTest.setUp(WemoMakerHandlerOSGiTest.groovy:61)

assert that thing updates channels at start(org.eclipse.smarthome.binding.wemo.handler.test.WemoMakerHandlerOSGiTest)  Time elapsed: 10.112 sec  <<< FAILURE!
java.lang.AssertionError: 
Expected: is <0>
     but: was <2>
	at org.hamcrest.MatcherAssert.assertThat(MatcherAssert.java:20)
	at org.junit.Assert.assertThat(Assert.java:865)
	at org.junit.Assert.assertThat(Assert.java:832)
	at org.junit.Assert$assertThat.callStatic(Unknown Source)
	at org.eclipse.smarthome.binding.wemo.handler.test.WemoMakerHandlerOSGiTest$_removeThing_closure12.doCall(WemoMakerHandlerOSGiTest.groovy:181)
	at org.eclipse.smarthome.binding.wemo.handler.test.WemoMakerHandlerOSGiTest$_removeThing_closure12.doCall(WemoMakerHandlerOSGiTest.groovy)
	at sun.reflect.GeneratedMethodAccessor14.invoke(Unknown Source)
	at sun.reflect.DelegatingMethodAccessorImpl.invoke(DelegatingMethodAccessorImpl.java:43)
	at java.lang.reflect.Method.invoke(Method.java:606)
	at org.codehaus.groovy.reflection.CachedMethod.invoke(CachedMethod.java:90)
	at groovy.lang.MetaMethod.doMethodInvoke(MetaMethod.java:324)
	at org.codehaus.groovy.runtime.metaclass.ClosureMetaClass.invokeMethod(ClosureMetaClass.java:278)
	at groovy.lang.MetaClassImpl.invokeMethod(MetaClassImpl.java:1016)
	at org.codehaus.groovy.runtime.callsite.PogoMetaClassSite.call(PogoMetaClassSite.java:39)
	at org.codehaus.groovy.runtime.callsite.CallSiteArray.defaultCall(CallSiteArray.java:45)
	at org.codehaus.groovy.runtime.callsite.PogoMetaClassSite.call(PogoMetaClassSite.java:54)
	at org.codehaus.groovy.runtime.callsite.AbstractCallSite.call(AbstractCallSite.java:112)
	at org.eclipse.smarthome.test.OSGiTest.waitForAssert(OSGiTest.groovy:199)
	at org.eclipse.smarthome.test.OSGiTest.waitForAssert(OSGiTest.groovy)
	at sun.reflect.GeneratedMethodAccessor12.invoke(Unknown Source)
	at sun.reflect.DelegatingMethodAccessorImpl.invoke(DelegatingMethodAccessorImpl.java:43)
	at java.lang.reflect.Method.invoke(Method.java:606)
	at org.codehaus.groovy.runtime.callsite.PogoMetaMethodSite$PogoCachedMethodSiteNoUnwrapNoCoerce.invoke(PogoMetaMethodSite.java:207)
	at org.codehaus.groovy.runtime.callsite.PogoMetaMethodSite.callCurrent(PogoMetaMethodSite.java:56)
	at org.codehaus.groovy.runtime.callsite.CallSiteArray.defaultCallCurrent(CallSiteArray.java:49)
	at org.codehaus.groovy.runtime.callsite.AbstractCallSite.callCurrent(AbstractCallSite.java:133)
	at org.codehaus.groovy.runtime.callsite.AbstractCallSite.callCurrent(AbstractCallSite.java:141)
	at org.eclipse.smarthome.binding.wemo.handler.test.WemoMakerHandlerOSGiTest.removeThing(WemoMakerHandlerOSGiTest.groovy:180)
	at org.eclipse.smarthome.binding.wemo.handler.test.WemoMakerHandlerOSGiTest.tearDown(WemoMakerHandlerOSGiTest.groovy:67)

assert that thing handles OnOff command correctly(org.eclipse.smarthome.binding.wemo.handler.test.WemoMakerHandlerOSGiTest)  Time elapsed: 10.104 sec  <<< ERROR!
org.osgi.service.http.NamespaceException: The alias '/upnp/control/basicevent1' is already in use.
	at org.eclipse.equinox.http.servlet.internal.ProxyServlet.registerServlet(ProxyServlet.java:169)
	at org.eclipse.equinox.http.servlet.internal.HttpServiceImpl.registerServlet(HttpServiceImpl.java:66)
	at org.osgi.service.http.HttpService$registerServlet.call(Unknown Source)
	at org.eclipse.smarthome.binding.wemo.test.GenericWemoOSGiTest.registerServlet(GenericWemoOSGiTest.groovy:120)
	at sun.reflect.NativeMethodAccessorImpl.invoke0(Native Method)
	at sun.reflect.NativeMethodAccessorImpl.invoke(NativeMethodAccessorImpl.java:57)
	at sun.reflect.DelegatingMethodAccessorImpl.invoke(DelegatingMethodAccessorImpl.java:43)
	at java.lang.reflect.Method.invoke(Method.java:606)
	at org.codehaus.groovy.runtime.callsite.PogoMetaMethodSite$PogoCachedMethodSiteNoUnwrap.invoke(PogoMetaMethodSite.java:187)
	at org.codehaus.groovy.runtime.callsite.PogoMetaMethodSite.callCurrent(PogoMetaMethodSite.java:56)
	at org.codehaus.groovy.runtime.callsite.AbstractCallSite.callCurrent(AbstractCallSite.java:145)
	at org.eclipse.smarthome.binding.wemo.handler.test.WemoMakerHandlerOSGiTest.setUp(WemoMakerHandlerOSGiTest.groovy:61)

assert that thing handles OnOff command correctly(org.eclipse.smarthome.binding.wemo.handler.test.WemoMakerHandlerOSGiTest)  Time elapsed: 10.105 sec  <<< FAILURE!
java.lang.AssertionError: 
Expected: is <0>
     but: was <2>
	at org.hamcrest.MatcherAssert.assertThat(MatcherAssert.java:20)
	at org.junit.Assert.assertThat(Assert.java:865)
	at org.junit.Assert.assertThat(Assert.java:832)
	at org.junit.Assert$assertThat.callStatic(Unknown Source)
	at org.eclipse.smarthome.binding.wemo.handler.test.WemoMakerHandlerOSGiTest$_removeThing_closure12.doCall(WemoMakerHandlerOSGiTest.groovy:181)
	at org.eclipse.smarthome.binding.wemo.handler.test.WemoMakerHandlerOSGiTest$_removeThing_closure12.doCall(WemoMakerHandlerOSGiTest.groovy)
	at sun.reflect.GeneratedMethodAccessor14.invoke(Unknown Source)
	at sun.reflect.DelegatingMethodAccessorImpl.invoke(DelegatingMethodAccessorImpl.java:43)
	at java.lang.reflect.Method.invoke(Method.java:606)
	at org.codehaus.groovy.reflection.CachedMethod.invoke(CachedMethod.java:90)
	at groovy.lang.MetaMethod.doMethodInvoke(MetaMethod.java:324)
	at org.codehaus.groovy.runtime.metaclass.ClosureMetaClass.invokeMethod(ClosureMetaClass.java:278)
	at groovy.lang.MetaClassImpl.invokeMethod(MetaClassImpl.java:1016)
	at org.codehaus.groovy.runtime.callsite.PogoMetaClassSite.call(PogoMetaClassSite.java:39)
	at org.codehaus.groovy.runtime.callsite.AbstractCallSite.call(AbstractCallSite.java:112)
	at org.eclipse.smarthome.test.OSGiTest.waitForAssert(OSGiTest.groovy:199)
	at org.eclipse.smarthome.test.OSGiTest.waitForAssert(OSGiTest.groovy)
	at sun.reflect.GeneratedMethodAccessor12.invoke(Unknown Source)
	at sun.reflect.DelegatingMethodAccessorImpl.invoke(DelegatingMethodAccessorImpl.java:43)
	at java.lang.reflect.Method.invoke(Method.java:606)
	at org.codehaus.groovy.runtime.callsite.PogoMetaMethodSite$PogoCachedMethodSiteNoUnwrapNoCoerce.invoke(PogoMetaMethodSite.java:207)
	at org.codehaus.groovy.runtime.callsite.PogoMetaMethodSite.callCurrent(PogoMetaMethodSite.java:56)
	at org.codehaus.groovy.runtime.callsite.AbstractCallSite.callCurrent(AbstractCallSite.java:141)
	at org.eclipse.smarthome.binding.wemo.handler.test.WemoMakerHandlerOSGiTest.removeThing(WemoMakerHandlerOSGiTest.groovy:180)
	at org.eclipse.smarthome.binding.wemo.handler.test.WemoMakerHandlerOSGiTest.tearDown(WemoMakerHandlerOSGiTest.groovy:67)

assert that thing handles REFRESH command(org.eclipse.smarthome.binding.wemo.handler.test.WemoMakerHandlerOSGiTest)  Time elapsed: 10.092 sec  <<< ERROR!
org.osgi.service.http.NamespaceException: The alias '/upnp/control/basicevent1' is already in use.
	at org.eclipse.equinox.http.servlet.internal.ProxyServlet.registerServlet(ProxyServlet.java:169)
	at org.eclipse.equinox.http.servlet.internal.HttpServiceImpl.registerServlet(HttpServiceImpl.java:66)
	at org.osgi.service.http.HttpService$registerServlet.call(Unknown Source)
	at org.eclipse.smarthome.binding.wemo.test.GenericWemoOSGiTest.registerServlet(GenericWemoOSGiTest.groovy:120)
	at sun.reflect.NativeMethodAccessorImpl.invoke0(Native Method)
	at sun.reflect.NativeMethodAccessorImpl.invoke(NativeMethodAccessorImpl.java:57)
	at sun.reflect.DelegatingMethodAccessorImpl.invoke(DelegatingMethodAccessorImpl.java:43)
	at java.lang.reflect.Method.invoke(Method.java:606)
	at org.codehaus.groovy.runtime.callsite.PogoMetaMethodSite$PogoCachedMethodSiteNoUnwrap.invoke(PogoMetaMethodSite.java:187)
	at org.codehaus.groovy.runtime.callsite.PogoMetaMethodSite.callCurrent(PogoMetaMethodSite.java:56)
	at org.codehaus.groovy.runtime.callsite.AbstractCallSite.callCurrent(AbstractCallSite.java:145)
	at org.eclipse.smarthome.binding.wemo.handler.test.WemoMakerHandlerOSGiTest.setUp(WemoMakerHandlerOSGiTest.groovy:61)

assert that thing handles REFRESH command(org.eclipse.smarthome.binding.wemo.handler.test.WemoMakerHandlerOSGiTest)  Time elapsed: 10.093 sec  <<< FAILURE!
java.lang.AssertionError: 
Expected: is <0>
     but: was <2>
	at org.hamcrest.MatcherAssert.assertThat(MatcherAssert.java:20)
	at org.junit.Assert.assertThat(Assert.java:865)
	at org.junit.Assert.assertThat(Assert.java:832)
	at org.junit.Assert$assertThat.callStatic(Unknown Source)
	at org.eclipse.smarthome.binding.wemo.handler.test.WemoMakerHandlerOSGiTest$_removeThing_closure12.doCall(WemoMakerHandlerOSGiTest.groovy:181)
	at org.eclipse.smarthome.binding.wemo.handler.test.WemoMakerHandlerOSGiTest$_removeThing_closure12.doCall(WemoMakerHandlerOSGiTest.groovy)
	at sun.reflect.GeneratedMethodAccessor14.invoke(Unknown Source)
	at sun.reflect.DelegatingMethodAccessorImpl.invoke(DelegatingMethodAccessorImpl.java:43)
	at java.lang.reflect.Method.invoke(Method.java:606)
	at org.codehaus.groovy.reflection.CachedMethod.invoke(CachedMethod.java:90)
	at groovy.lang.MetaMethod.doMethodInvoke(MetaMethod.java:324)
	at org.codehaus.groovy.runtime.metaclass.ClosureMetaClass.invokeMethod(ClosureMetaClass.java:278)
	at groovy.lang.MetaClassImpl.invokeMethod(MetaClassImpl.java:1016)
	at org.codehaus.groovy.runtime.callsite.PogoMetaClassSite.call(PogoMetaClassSite.java:39)
	at org.codehaus.groovy.runtime.callsite.AbstractCallSite.call(AbstractCallSite.java:112)
	at org.eclipse.smarthome.test.OSGiTest.waitForAssert(OSGiTest.groovy:199)
	at org.eclipse.smarthome.test.OSGiTest.waitForAssert(OSGiTest.groovy)
	at sun.reflect.GeneratedMethodAccessor12.invoke(Unknown Source)
	at sun.reflect.DelegatingMethodAccessorImpl.invoke(DelegatingMethodAccessorImpl.java:43)
	at java.lang.reflect.Method.invoke(Method.java:606)
	at org.codehaus.groovy.runtime.callsite.PogoMetaMethodSite$PogoCachedMethodSiteNoUnwrapNoCoerce.invoke(PogoMetaMethodSite.java:207)
	at org.codehaus.groovy.runtime.callsite.PogoMetaMethodSite.callCurrent(PogoMetaMethodSite.java:56)
	at org.codehaus.groovy.runtime.callsite.AbstractCallSite.callCurrent(AbstractCallSite.java:141)
	at org.eclipse.smarthome.binding.wemo.handler.test.WemoMakerHandlerOSGiTest.removeThing(WemoMakerHandlerOSGiTest.groovy:180)
	at org.eclipse.smarthome.binding.wemo.handler.test.WemoMakerHandlerOSGiTest.tearDown(WemoMakerHandlerOSGiTest.groovy:67)

Running org.eclipse.smarthome.binding.wemo.handler.test.WemoHandlerTest
Tests run: 6, Failures: 0, Errors: 0, Skipped: 0, Time elapsed: 0.054 sec - in org.eclipse.smarthome.binding.wemo.handler.test.WemoHandlerTest
assert that channel AVERAGEPOWER is updated on recevied value(org.eclipse.smarthome.binding.wemo.handler.test.WemoHandlerTest)  Time elapsed: 0.025 sec
assert that channel ONTOTAL is updated on recevied value(org.eclipse.smarthome.binding.wemo.handler.test.WemoHandlerTest)  Time elapsed: 0.002 sec
assert that channel ONTODAY is updated on recevied value(org.eclipse.smarthome.binding.wemo.handler.test.WemoHandlerTest)  Time elapsed: 0.002 sec
assert that channel LASTONFOR is updated on recevied value(org.eclipse.smarthome.binding.wemo.handler.test.WemoHandlerTest)  Time elapsed: 0.002 sec
assert that channel STATE is updated on recevied value(org.eclipse.smarthome.binding.wemo.handler.test.WemoHandlerTest)  Time elapsed: 0.002 sec
assert that channel TIMESPAN is updated on recevied value(org.eclipse.smarthome.binding.wemo.handler.test.WemoHandlerTest)  Time elapsed: 0.001 sec
Running org.eclipse.smarthome.binding.wemo.handler.test.WemoLightHandlerOSGiTest
Tests run: 7, Failures: 7, Errors: 0, Skipped: 0, Time elapsed: 78.51 sec <<< FAILURE! - in org.eclipse.smarthome.binding.wemo.handler.test.WemoLightHandlerOSGiTest
handle Increase command for BRIGHTNESS channel(org.eclipse.smarthome.binding.wemo.handler.test.WemoLightHandlerOSGiTest)  Time elapsed: 11.214 sec  <<< FAILURE!
java.lang.AssertionError: 
Expected: is <0>
     but: was <2>
	at org.hamcrest.MatcherAssert.assertThat(MatcherAssert.java:20)
	at org.junit.Assert.assertThat(Assert.java:865)
	at org.junit.Assert.assertThat(Assert.java:832)
	at org.junit.Assert$assertThat.callStatic(Unknown Source)
	at org.eclipse.smarthome.binding.wemo.test.GenericWemoLightOSGiTest$_removeThing_closure4.doCall(GenericWemoLightOSGiTest.groovy:125)
	at org.eclipse.smarthome.binding.wemo.test.GenericWemoLightOSGiTest$_removeThing_closure4.doCall(GenericWemoLightOSGiTest.groovy)
	at sun.reflect.GeneratedMethodAccessor26.invoke(Unknown Source)
	at sun.reflect.DelegatingMethodAccessorImpl.invoke(DelegatingMethodAccessorImpl.java:43)
	at java.lang.reflect.Method.invoke(Method.java:606)
	at org.codehaus.groovy.reflection.CachedMethod.invoke(CachedMethod.java:90)
	at groovy.lang.MetaMethod.doMethodInvoke(MetaMethod.java:324)
	at org.codehaus.groovy.runtime.metaclass.ClosureMetaClass.invokeMethod(ClosureMetaClass.java:278)
	at groovy.lang.MetaClassImpl.invokeMethod(MetaClassImpl.java:1016)
	at org.codehaus.groovy.runtime.callsite.PogoMetaClassSite.call(PogoMetaClassSite.java:39)
	at org.codehaus.groovy.runtime.callsite.CallSiteArray.defaultCall(CallSiteArray.java:45)
	at org.codehaus.groovy.runtime.callsite.PogoMetaClassSite.call(PogoMetaClassSite.java:54)
	at org.codehaus.groovy.runtime.callsite.AbstractCallSite.call(AbstractCallSite.java:112)
	at org.eclipse.smarthome.test.OSGiTest.waitForAssert(OSGiTest.groovy:199)
	at org.eclipse.smarthome.test.OSGiTest.waitForAssert(OSGiTest.groovy)
	at sun.reflect.GeneratedMethodAccessor12.invoke(Unknown Source)
	at sun.reflect.DelegatingMethodAccessorImpl.invoke(DelegatingMethodAccessorImpl.java:43)
	at java.lang.reflect.Method.invoke(Method.java:606)
	at org.codehaus.groovy.runtime.callsite.PogoMetaMethodSite$PogoCachedMethodSiteNoUnwrapNoCoerce.invoke(PogoMetaMethodSite.java:207)
	at org.codehaus.groovy.runtime.callsite.PogoMetaMethodSite.callCurrent(PogoMetaMethodSite.java:56)
	at org.codehaus.groovy.runtime.callsite.CallSiteArray.defaultCallCurrent(CallSiteArray.java:49)
	at org.codehaus.groovy.runtime.callsite.AbstractCallSite.callCurrent(AbstractCallSite.java:133)
	at org.codehaus.groovy.runtime.callsite.AbstractCallSite.callCurrent(AbstractCallSite.java:141)
	at org.eclipse.smarthome.binding.wemo.test.GenericWemoLightOSGiTest.removeThing(GenericWemoLightOSGiTest.groovy:124)
	at sun.reflect.NativeMethodAccessorImpl.invoke0(Native Method)
	at sun.reflect.NativeMethodAccessorImpl.invoke(NativeMethodAccessorImpl.java:57)
	at sun.reflect.DelegatingMethodAccessorImpl.invoke(DelegatingMethodAccessorImpl.java:43)
	at java.lang.reflect.Method.invoke(Method.java:606)
	at org.codehaus.groovy.runtime.callsite.PogoMetaMethodSite$PogoCachedMethodSiteNoUnwrapNoCoerce.invoke(PogoMetaMethodSite.java:207)
	at org.codehaus.groovy.runtime.callsite.PogoMetaMethodSite.callCurrent(PogoMetaMethodSite.java:56)
	at org.codehaus.groovy.runtime.callsite.CallSiteArray.defaultCallCurrent(CallSiteArray.java:49)
	at org.codehaus.groovy.runtime.callsite.AbstractCallSite.callCurrent(AbstractCallSite.java:133)
	at org.codehaus.groovy.runtime.callsite.AbstractCallSite.callCurrent(AbstractCallSite.java:137)
	at org.eclipse.smarthome.binding.wemo.handler.test.WemoLightHandlerOSGiTest.tearDown(WemoLightHandlerOSGiTest.groovy:55)

assert that thing updates channels at start(org.eclipse.smarthome.binding.wemo.handler.test.WemoLightHandlerOSGiTest)  Time elapsed: 11.196 sec  <<< FAILURE!
java.lang.AssertionError: 
Expected: is <0>
     but: was <2>
	at org.hamcrest.MatcherAssert.assertThat(MatcherAssert.java:20)
	at org.junit.Assert.assertThat(Assert.java:865)
	at org.junit.Assert.assertThat(Assert.java:832)
	at org.junit.Assert$assertThat.callStatic(Unknown Source)
	at org.eclipse.smarthome.binding.wemo.test.GenericWemoLightOSGiTest$_removeThing_closure4.doCall(GenericWemoLightOSGiTest.groovy:125)
	at org.eclipse.smarthome.binding.wemo.test.GenericWemoLightOSGiTest$_removeThing_closure4.doCall(GenericWemoLightOSGiTest.groovy)
	at sun.reflect.GeneratedMethodAccessor26.invoke(Unknown Source)
	at sun.reflect.DelegatingMethodAccessorImpl.invoke(DelegatingMethodAccessorImpl.java:43)
	at java.lang.reflect.Method.invoke(Method.java:606)
	at org.codehaus.groovy.reflection.CachedMethod.invoke(CachedMethod.java:90)
	at groovy.lang.MetaMethod.doMethodInvoke(MetaMethod.java:324)
	at org.codehaus.groovy.runtime.metaclass.ClosureMetaClass.invokeMethod(ClosureMetaClass.java:278)
	at groovy.lang.MetaClassImpl.invokeMethod(MetaClassImpl.java:1016)
	at org.codehaus.groovy.runtime.callsite.PogoMetaClassSite.call(PogoMetaClassSite.java:39)
	at org.codehaus.groovy.runtime.callsite.AbstractCallSite.call(AbstractCallSite.java:112)
	at org.eclipse.smarthome.test.OSGiTest.waitForAssert(OSGiTest.groovy:199)
	at org.eclipse.smarthome.test.OSGiTest.waitForAssert(OSGiTest.groovy)
	at sun.reflect.GeneratedMethodAccessor12.invoke(Unknown Source)
	at sun.reflect.DelegatingMethodAccessorImpl.invoke(DelegatingMethodAccessorImpl.java:43)
	at java.lang.reflect.Method.invoke(Method.java:606)
	at org.codehaus.groovy.runtime.callsite.PogoMetaMethodSite$PogoCachedMethodSiteNoUnwrapNoCoerce.invoke(PogoMetaMethodSite.java:207)
	at org.codehaus.groovy.runtime.callsite.PogoMetaMethodSite.callCurrent(PogoMetaMethodSite.java:56)
	at org.codehaus.groovy.runtime.callsite.AbstractCallSite.callCurrent(AbstractCallSite.java:141)
	at org.eclipse.smarthome.binding.wemo.test.GenericWemoLightOSGiTest.removeThing(GenericWemoLightOSGiTest.groovy:124)
	at sun.reflect.NativeMethodAccessorImpl.invoke0(Native Method)
	at sun.reflect.NativeMethodAccessorImpl.invoke(NativeMethodAccessorImpl.java:57)
	at sun.reflect.DelegatingMethodAccessorImpl.invoke(DelegatingMethodAccessorImpl.java:43)
	at java.lang.reflect.Method.invoke(Method.java:606)
	at org.codehaus.groovy.runtime.callsite.PogoMetaMethodSite$PogoCachedMethodSiteNoUnwrapNoCoerce.invoke(PogoMetaMethodSite.java:207)
	at org.codehaus.groovy.runtime.callsite.PogoMetaMethodSite.callCurrent(PogoMetaMethodSite.java:56)
	at org.codehaus.groovy.runtime.callsite.AbstractCallSite.callCurrent(AbstractCallSite.java:137)
	at org.eclipse.smarthome.binding.wemo.handler.test.WemoLightHandlerOSGiTest.tearDown(WemoLightHandlerOSGiTest.groovy:55)

handle Percent command for BRIGHTNESS channel(org.eclipse.smarthome.binding.wemo.handler.test.WemoLightHandlerOSGiTest)  Time elapsed: 11.197 sec  <<< FAILURE!
java.lang.AssertionError: 
Expected: is <0>
     but: was <2>
	at org.hamcrest.MatcherAssert.assertThat(MatcherAssert.java:20)
	at org.junit.Assert.assertThat(Assert.java:865)
	at org.junit.Assert.assertThat(Assert.java:832)
	at org.junit.Assert$assertThat.callStatic(Unknown Source)
	at org.eclipse.smarthome.binding.wemo.test.GenericWemoLightOSGiTest$_removeThing_closure4.doCall(GenericWemoLightOSGiTest.groovy:125)
	at org.eclipse.smarthome.binding.wemo.test.GenericWemoLightOSGiTest$_removeThing_closure4.doCall(GenericWemoLightOSGiTest.groovy)
	at sun.reflect.GeneratedMethodAccessor26.invoke(Unknown Source)
	at sun.reflect.DelegatingMethodAccessorImpl.invoke(DelegatingMethodAccessorImpl.java:43)
	at java.lang.reflect.Method.invoke(Method.java:606)
	at org.codehaus.groovy.reflection.CachedMethod.invoke(CachedMethod.java:90)
	at groovy.lang.MetaMethod.doMethodInvoke(MetaMethod.java:324)
	at org.codehaus.groovy.runtime.metaclass.ClosureMetaClass.invokeMethod(ClosureMetaClass.java:278)
	at groovy.lang.MetaClassImpl.invokeMethod(MetaClassImpl.java:1016)
	at org.codehaus.groovy.runtime.callsite.PogoMetaClassSite.call(PogoMetaClassSite.java:39)
	at org.codehaus.groovy.runtime.callsite.AbstractCallSite.call(AbstractCallSite.java:112)
	at org.eclipse.smarthome.test.OSGiTest.waitForAssert(OSGiTest.groovy:199)
	at org.eclipse.smarthome.test.OSGiTest.waitForAssert(OSGiTest.groovy)
	at sun.reflect.GeneratedMethodAccessor12.invoke(Unknown Source)
	at sun.reflect.DelegatingMethodAccessorImpl.invoke(DelegatingMethodAccessorImpl.java:43)
	at java.lang.reflect.Method.invoke(Method.java:606)
	at org.codehaus.groovy.runtime.callsite.PogoMetaMethodSite$PogoCachedMethodSiteNoUnwrapNoCoerce.invoke(PogoMetaMethodSite.java:207)
	at org.codehaus.groovy.runtime.callsite.PogoMetaMethodSite.callCurrent(PogoMetaMethodSite.java:56)
	at org.codehaus.groovy.runtime.callsite.AbstractCallSite.callCurrent(AbstractCallSite.java:141)
	at org.eclipse.smarthome.binding.wemo.test.GenericWemoLightOSGiTest.removeThing(GenericWemoLightOSGiTest.groovy:124)
	at sun.reflect.NativeMethodAccessorImpl.invoke0(Native Method)
	at sun.reflect.NativeMethodAccessorImpl.invoke(NativeMethodAccessorImpl.java:57)
	at sun.reflect.DelegatingMethodAccessorImpl.invoke(DelegatingMethodAccessorImpl.java:43)
	at java.lang.reflect.Method.invoke(Method.java:606)
	at org.codehaus.groovy.runtime.callsite.PogoMetaMethodSite$PogoCachedMethodSiteNoUnwrapNoCoerce.invoke(PogoMetaMethodSite.java:207)
	at org.codehaus.groovy.runtime.callsite.PogoMetaMethodSite.callCurrent(PogoMetaMethodSite.java:56)
	at org.codehaus.groovy.runtime.callsite.AbstractCallSite.callCurrent(AbstractCallSite.java:137)
	at org.eclipse.smarthome.binding.wemo.handler.test.WemoLightHandlerOSGiTest.tearDown(WemoLightHandlerOSGiTest.groovy:55)

handle ON command for BRIGHTNESS channel(org.eclipse.smarthome.binding.wemo.handler.test.WemoLightHandlerOSGiTest)  Time elapsed: 11.212 sec  <<< FAILURE!
java.lang.AssertionError: 
Expected: is <0>
     but: was <2>
	at org.hamcrest.MatcherAssert.assertThat(MatcherAssert.java:20)
	at org.junit.Assert.assertThat(Assert.java:865)
	at org.junit.Assert.assertThat(Assert.java:832)
	at org.junit.Assert$assertThat.callStatic(Unknown Source)
	at org.eclipse.smarthome.binding.wemo.test.GenericWemoLightOSGiTest$_removeThing_closure4.doCall(GenericWemoLightOSGiTest.groovy:125)
	at org.eclipse.smarthome.binding.wemo.test.GenericWemoLightOSGiTest$_removeThing_closure4.doCall(GenericWemoLightOSGiTest.groovy)
	at sun.reflect.GeneratedMethodAccessor26.invoke(Unknown Source)
	at sun.reflect.DelegatingMethodAccessorImpl.invoke(DelegatingMethodAccessorImpl.java:43)
	at java.lang.reflect.Method.invoke(Method.java:606)
	at org.codehaus.groovy.reflection.CachedMethod.invoke(CachedMethod.java:90)
	at groovy.lang.MetaMethod.doMethodInvoke(MetaMethod.java:324)
	at org.codehaus.groovy.runtime.metaclass.ClosureMetaClass.invokeMethod(ClosureMetaClass.java:278)
	at groovy.lang.MetaClassImpl.invokeMethod(MetaClassImpl.java:1016)
	at org.codehaus.groovy.runtime.callsite.PogoMetaClassSite.call(PogoMetaClassSite.java:39)
	at org.codehaus.groovy.runtime.callsite.AbstractCallSite.call(AbstractCallSite.java:112)
	at org.eclipse.smarthome.test.OSGiTest.waitForAssert(OSGiTest.groovy:199)
	at org.eclipse.smarthome.test.OSGiTest.waitForAssert(OSGiTest.groovy)
	at sun.reflect.GeneratedMethodAccessor12.invoke(Unknown Source)
	at sun.reflect.DelegatingMethodAccessorImpl.invoke(DelegatingMethodAccessorImpl.java:43)
	at java.lang.reflect.Method.invoke(Method.java:606)
	at org.codehaus.groovy.runtime.callsite.PogoMetaMethodSite$PogoCachedMethodSiteNoUnwrapNoCoerce.invoke(PogoMetaMethodSite.java:207)
	at org.codehaus.groovy.runtime.callsite.PogoMetaMethodSite.callCurrent(PogoMetaMethodSite.java:56)
	at org.codehaus.groovy.runtime.callsite.AbstractCallSite.callCurrent(AbstractCallSite.java:141)
	at org.eclipse.smarthome.binding.wemo.test.GenericWemoLightOSGiTest.removeThing(GenericWemoLightOSGiTest.groovy:124)
	at sun.reflect.NativeMethodAccessorImpl.invoke0(Native Method)
	at sun.reflect.NativeMethodAccessorImpl.invoke(NativeMethodAccessorImpl.java:57)
	at sun.reflect.DelegatingMethodAccessorImpl.invoke(DelegatingMethodAccessorImpl.java:43)
	at java.lang.reflect.Method.invoke(Method.java:606)
	at org.codehaus.groovy.runtime.callsite.PogoMetaMethodSite$PogoCachedMethodSiteNoUnwrapNoCoerce.invoke(PogoMetaMethodSite.java:207)
	at org.codehaus.groovy.runtime.callsite.PogoMetaMethodSite.callCurrent(PogoMetaMethodSite.java:56)
	at org.codehaus.groovy.runtime.callsite.AbstractCallSite.callCurrent(AbstractCallSite.java:137)
	at org.eclipse.smarthome.binding.wemo.handler.test.WemoLightHandlerOSGiTest.tearDown(WemoLightHandlerOSGiTest.groovy:55)

handle Decrease command for BRIGHTNESS channel(org.eclipse.smarthome.binding.wemo.handler.test.WemoLightHandlerOSGiTest)  Time elapsed: 11.22 sec  <<< FAILURE!
java.lang.AssertionError: 
Expected: is <0>
     but: was <2>
	at org.hamcrest.MatcherAssert.assertThat(MatcherAssert.java:20)
	at org.junit.Assert.assertThat(Assert.java:865)
	at org.junit.Assert.assertThat(Assert.java:832)
	at org.junit.Assert$assertThat.callStatic(Unknown Source)
	at org.eclipse.smarthome.binding.wemo.test.GenericWemoLightOSGiTest$_removeThing_closure4.doCall(GenericWemoLightOSGiTest.groovy:125)
	at org.eclipse.smarthome.binding.wemo.test.GenericWemoLightOSGiTest$_removeThing_closure4.doCall(GenericWemoLightOSGiTest.groovy)
	at sun.reflect.GeneratedMethodAccessor26.invoke(Unknown Source)
	at sun.reflect.DelegatingMethodAccessorImpl.invoke(DelegatingMethodAccessorImpl.java:43)
	at java.lang.reflect.Method.invoke(Method.java:606)
	at org.codehaus.groovy.reflection.CachedMethod.invoke(CachedMethod.java:90)
	at groovy.lang.MetaMethod.doMethodInvoke(MetaMethod.java:324)
	at org.codehaus.groovy.runtime.metaclass.ClosureMetaClass.invokeMethod(ClosureMetaClass.java:278)
	at groovy.lang.MetaClassImpl.invokeMethod(MetaClassImpl.java:1016)
	at org.codehaus.groovy.runtime.callsite.PogoMetaClassSite.call(PogoMetaClassSite.java:39)
	at org.codehaus.groovy.runtime.callsite.AbstractCallSite.call(AbstractCallSite.java:112)
	at org.eclipse.smarthome.test.OSGiTest.waitForAssert(OSGiTest.groovy:199)
	at org.eclipse.smarthome.test.OSGiTest.waitForAssert(OSGiTest.groovy)
	at sun.reflect.GeneratedMethodAccessor12.invoke(Unknown Source)
	at sun.reflect.DelegatingMethodAccessorImpl.invoke(DelegatingMethodAccessorImpl.java:43)
	at java.lang.reflect.Method.invoke(Method.java:606)
	at org.codehaus.groovy.runtime.callsite.PogoMetaMethodSite$PogoCachedMethodSiteNoUnwrapNoCoerce.invoke(PogoMetaMethodSite.java:207)
	at org.codehaus.groovy.runtime.callsite.PogoMetaMethodSite.callCurrent(PogoMetaMethodSite.java:56)
	at org.codehaus.groovy.runtime.callsite.AbstractCallSite.callCurrent(AbstractCallSite.java:141)
	at org.eclipse.smarthome.binding.wemo.test.GenericWemoLightOSGiTest.removeThing(GenericWemoLightOSGiTest.groovy:124)
	at sun.reflect.NativeMethodAccessorImpl.invoke0(Native Method)
	at sun.reflect.NativeMethodAccessorImpl.invoke(NativeMethodAccessorImpl.java:57)
	at sun.reflect.DelegatingMethodAccessorImpl.invoke(DelegatingMethodAccessorImpl.java:43)
	at java.lang.reflect.Method.invoke(Method.java:606)
	at org.codehaus.groovy.runtime.callsite.PogoMetaMethodSite$PogoCachedMethodSiteNoUnwrapNoCoerce.invoke(PogoMetaMethodSite.java:207)
	at org.codehaus.groovy.runtime.callsite.PogoMetaMethodSite.callCurrent(PogoMetaMethodSite.java:56)
	at org.codehaus.groovy.runtime.callsite.AbstractCallSite.callCurrent(AbstractCallSite.java:137)
	at org.eclipse.smarthome.binding.wemo.handler.test.WemoLightHandlerOSGiTest.tearDown(WemoLightHandlerOSGiTest.groovy:55)

handle On command for STATE channel(org.eclipse.smarthome.binding.wemo.handler.test.WemoLightHandlerOSGiTest)  Time elapsed: 11.227 sec  <<< FAILURE!
java.lang.AssertionError: 
Expected: is <0>
     but: was <2>
	at org.hamcrest.MatcherAssert.assertThat(MatcherAssert.java:20)
	at org.junit.Assert.assertThat(Assert.java:865)
	at org.junit.Assert.assertThat(Assert.java:832)
	at org.junit.Assert$assertThat.callStatic(Unknown Source)
	at org.eclipse.smarthome.binding.wemo.test.GenericWemoLightOSGiTest$_removeThing_closure4.doCall(GenericWemoLightOSGiTest.groovy:125)
	at org.eclipse.smarthome.binding.wemo.test.GenericWemoLightOSGiTest$_removeThing_closure4.doCall(GenericWemoLightOSGiTest.groovy)
	at sun.reflect.GeneratedMethodAccessor26.invoke(Unknown Source)
	at sun.reflect.DelegatingMethodAccessorImpl.invoke(DelegatingMethodAccessorImpl.java:43)
	at java.lang.reflect.Method.invoke(Method.java:606)
	at org.codehaus.groovy.reflection.CachedMethod.invoke(CachedMethod.java:90)
	at groovy.lang.MetaMethod.doMethodInvoke(MetaMethod.java:324)
	at org.codehaus.groovy.runtime.metaclass.ClosureMetaClass.invokeMethod(ClosureMetaClass.java:278)
	at groovy.lang.MetaClassImpl.invokeMethod(MetaClassImpl.java:1016)
	at org.codehaus.groovy.runtime.callsite.PogoMetaClassSite.call(PogoMetaClassSite.java:39)
	at org.codehaus.groovy.runtime.callsite.AbstractCallSite.call(AbstractCallSite.java:112)
	at org.eclipse.smarthome.test.OSGiTest.waitForAssert(OSGiTest.groovy:199)
	at org.eclipse.smarthome.test.OSGiTest.waitForAssert(OSGiTest.groovy)
	at sun.reflect.GeneratedMethodAccessor12.invoke(Unknown Source)
	at sun.reflect.DelegatingMethodAccessorImpl.invoke(DelegatingMethodAccessorImpl.java:43)
	at java.lang.reflect.Method.invoke(Method.java:606)
	at org.codehaus.groovy.runtime.callsite.PogoMetaMethodSite$PogoCachedMethodSiteNoUnwrapNoCoerce.invoke(PogoMetaMethodSite.java:207)
	at org.codehaus.groovy.runtime.callsite.PogoMetaMethodSite.callCurrent(PogoMetaMethodSite.java:56)
	at org.codehaus.groovy.runtime.callsite.AbstractCallSite.callCurrent(AbstractCallSite.java:141)
	at org.eclipse.smarthome.binding.wemo.test.GenericWemoLightOSGiTest.removeThing(GenericWemoLightOSGiTest.groovy:124)
	at sun.reflect.NativeMethodAccessorImpl.invoke0(Native Method)
	at sun.reflect.NativeMethodAccessorImpl.invoke(NativeMethodAccessorImpl.java:57)
	at sun.reflect.DelegatingMethodAccessorImpl.invoke(DelegatingMethodAccessorImpl.java:43)
	at java.lang.reflect.Method.invoke(Method.java:606)
	at org.codehaus.groovy.runtime.callsite.PogoMetaMethodSite$PogoCachedMethodSiteNoUnwrapNoCoerce.invoke(PogoMetaMethodSite.java:207)
	at org.codehaus.groovy.runtime.callsite.PogoMetaMethodSite.callCurrent(PogoMetaMethodSite.java:56)
	at org.codehaus.groovy.runtime.callsite.AbstractCallSite.callCurrent(AbstractCallSite.java:137)
	at org.eclipse.smarthome.binding.wemo.handler.test.WemoLightHandlerOSGiTest.tearDown(WemoLightHandlerOSGiTest.groovy:55)

handle REFRESH command for channel STATE(org.eclipse.smarthome.binding.wemo.handler.test.WemoLightHandlerOSGiTest)  Time elapsed: 11.216 sec  <<< FAILURE!
java.lang.AssertionError: 
Expected: is <0>
     but: was <2>
	at org.hamcrest.MatcherAssert.assertThat(MatcherAssert.java:20)
	at org.junit.Assert.assertThat(Assert.java:865)
	at org.junit.Assert.assertThat(Assert.java:832)
	at org.junit.Assert$assertThat.callStatic(Unknown Source)
	at org.eclipse.smarthome.binding.wemo.test.GenericWemoLightOSGiTest$_removeThing_closure4.doCall(GenericWemoLightOSGiTest.groovy:125)
	at org.eclipse.smarthome.binding.wemo.test.GenericWemoLightOSGiTest$_removeThing_closure4.doCall(GenericWemoLightOSGiTest.groovy)
	at sun.reflect.GeneratedMethodAccessor26.invoke(Unknown Source)
	at sun.reflect.DelegatingMethodAccessorImpl.invoke(DelegatingMethodAccessorImpl.java:43)
	at java.lang.reflect.Method.invoke(Method.java:606)
	at org.codehaus.groovy.reflection.CachedMethod.invoke(CachedMethod.java:90)
	at groovy.lang.MetaMethod.doMethodInvoke(MetaMethod.java:324)
	at org.codehaus.groovy.runtime.metaclass.ClosureMetaClass.invokeMethod(ClosureMetaClass.java:278)
	at groovy.lang.MetaClassImpl.invokeMethod(MetaClassImpl.java:1016)
	at org.codehaus.groovy.runtime.callsite.PogoMetaClassSite.call(PogoMetaClassSite.java:39)
	at org.codehaus.groovy.runtime.callsite.AbstractCallSite.call(AbstractCallSite.java:112)
	at org.eclipse.smarthome.test.OSGiTest.waitForAssert(OSGiTest.groovy:199)
	at org.eclipse.smarthome.test.OSGiTest.waitForAssert(OSGiTest.groovy)
	at sun.reflect.GeneratedMethodAccessor12.invoke(Unknown Source)
	at sun.reflect.DelegatingMethodAccessorImpl.invoke(DelegatingMethodAccessorImpl.java:43)
	at java.lang.reflect.Method.invoke(Method.java:606)
	at org.codehaus.groovy.runtime.callsite.PogoMetaMethodSite$PogoCachedMethodSiteNoUnwrapNoCoerce.invoke(PogoMetaMethodSite.java:207)
	at org.codehaus.groovy.runtime.callsite.PogoMetaMethodSite.callCurrent(PogoMetaMethodSite.java:56)
	at org.codehaus.groovy.runtime.callsite.AbstractCallSite.callCurrent(AbstractCallSite.java:141)
	at org.eclipse.smarthome.binding.wemo.test.GenericWemoLightOSGiTest.removeThing(GenericWemoLightOSGiTest.groovy:124)
	at sun.reflect.NativeMethodAccessorImpl.invoke0(Native Method)
	at sun.reflect.NativeMethodAccessorImpl.invoke(NativeMethodAccessorImpl.java:57)
	at sun.reflect.DelegatingMethodAccessorImpl.invoke(DelegatingMethodAccessorImpl.java:43)
	at java.lang.reflect.Method.invoke(Method.java:606)
	at org.codehaus.groovy.runtime.callsite.PogoMetaMethodSite$PogoCachedMethodSiteNoUnwrapNoCoerce.invoke(PogoMetaMethodSite.java:207)
	at org.codehaus.groovy.runtime.callsite.PogoMetaMethodSite.callCurrent(PogoMetaMethodSite.java:56)
	at org.codehaus.groovy.runtime.callsite.AbstractCallSite.callCurrent(AbstractCallSite.java:137)
	at org.eclipse.smarthome.binding.wemo.handler.test.WemoLightHandlerOSGiTest.tearDown(WemoLightHandlerOSGiTest.groovy:55)

Running org.eclipse.smarthome.binding.wemo.internal.http.test.WemoHttpCallOSGiTest
Tests run: 1, Failures: 0, Errors: 0, Skipped: 0, Time elapsed: 0.037 sec - in org.eclipse.smarthome.binding.wemo.internal.http.test.WemoHttpCallOSGiTest
assert post request contains correct content header(org.eclipse.smarthome.binding.wemo.internal.http.test.WemoHttpCallOSGiTest)  Time elapsed: 0.03 sec

Results :

Failed tests: 
  WemoHandlerOSGiTest.tearDown:62->removeThing:175->OSGiTest.waitForAssert:-1->OSGiTest.waitForAssert:199 
Expected: is <0>
     but: was <2>
  WemoHandlerOSGiTest.tearDown:62->removeThing:175->OSGiTest.waitForAssert:-1->OSGiTest.waitForAssert:199 
Expected: is <0>
     but: was <2>
  WemoHandlerOSGiTest.tearDown:62->removeThing:175->OSGiTest.waitForAssert:-1->OSGiTest.waitForAssert:199 
Expected: is <0>
     but: was <2>
  WemoMakerHandlerOSGiTest.tearDown:67->removeThing:180->OSGiTest.waitForAssert:-1->OSGiTest.waitForAssert:199 
Expected: is <0>
     but: was <2>
  WemoMakerHandlerOSGiTest.tearDown:67->removeThing:180->OSGiTest.waitForAssert:-1->OSGiTest.waitForAssert:199 
Expected: is <0>
     but: was <2>
  WemoMakerHandlerOSGiTest.tearDown:67->removeThing:180->OSGiTest.waitForAssert:-1->OSGiTest.waitForAssert:199 
Expected: is <0>
     but: was <2>
  WemoLightHandlerOSGiTest.tearDown:55->GenericWemoLightOSGiTest.removeThing:124->OSGiTest.waitForAssert:-1->OSGiTest.waitForAssert:199 
Expected: is <0>
     but: was <2>
  WemoLightHandlerOSGiTest.tearDown:55->GenericWemoLightOSGiTest.removeThing:124->OSGiTest.waitForAssert:-1->OSGiTest.waitForAssert:199 
Expected: is <0>
     but: was <2>
  WemoLightHandlerOSGiTest.tearDown:55->GenericWemoLightOSGiTest.removeThing:124->OSGiTest.waitForAssert:-1->OSGiTest.waitForAssert:199 
Expected: is <0>
     but: was <2>
  WemoLightHandlerOSGiTest.tearDown:55->GenericWemoLightOSGiTest.removeThing:124->OSGiTest.waitForAssert:-1->OSGiTest.waitForAssert:199 
Expected: is <0>
     but: was <2>
  WemoLightHandlerOSGiTest.tearDown:55->GenericWemoLightOSGiTest.removeThing:124->OSGiTest.waitForAssert:-1->OSGiTest.waitForAssert:199 
Expected: is <0>
     but: was <2>
  WemoLightHandlerOSGiTest.tearDown:55->GenericWemoLightOSGiTest.removeThing:124->OSGiTest.waitForAssert:-1->OSGiTest.waitForAssert:199 
Expected: is <0>
     but: was <2>
  WemoLightHandlerOSGiTest.tearDown:55->GenericWemoLightOSGiTest.removeThing:124->OSGiTest.waitForAssert:-1->OSGiTest.waitForAssert:199 
Expected: is <0>
     but: was <2>

Tests in error: 
  WemoHandlerOSGiTest.setUp:57->GenericWemoOSGiTest.registerServlet:120 » Namespace
  WemoHandlerOSGiTest.setUp:57->GenericWemoOSGiTest.registerServlet:120 » Namespace
  WemoMakerHandlerOSGiTest.setUp:61->GenericWemoOSGiTest.registerServlet:120 » Namespace
  WemoMakerHandlerOSGiTest.setUp:61->GenericWemoOSGiTest.registerServlet:120 » Namespace
  WemoMakerHandlerOSGiTest.setUp:61->GenericWemoOSGiTest.registerServlet:120 » Namespace

Tests run: 33, Failures: 13, Errors: 5, Skipped: 0

[INFO] ------------------------------------------------------------------------
[INFO] Reactor Summary:
[INFO] 
[INFO] Eclipse SmartHome .................................. SUCCESS [  1.254 s]
[INFO] Eclipse SmartHome Bundles .......................... SUCCESS [  0.034 s]
[INFO] Eclipse SmartHome Test Components .................. SUCCESS [  0.066 s]
[INFO] Eclipse SmartHome Core Components .................. SUCCESS [  0.063 s]
[INFO] Eclipse SmartHome Core ............................. SUCCESS [  6.718 s]
[INFO] Eclipse SmartHome Configurations ................... SUCCESS [  0.068 s]
[INFO] Eclipse SmartHome Configuration Core ............... SUCCESS [  3.121 s]
[INFO] Eclipse SmartHome Configuration XML ................ SUCCESS [  5.735 s]
[INFO] Eclipse SmartHome AutoUpdate Binding ............... SUCCESS [  2.187 s]
[INFO] Eclipse SmartHome Test ............................. SUCCESS [  3.451 s]
[INFO] Eclipse SmartHome Auth Components .................. SUCCESS [  0.072 s]
[INFO] Eclipse SmartHome JAAS Authentication .............. SUCCESS [  2.295 s]
[INFO] Eclipse SmartHome Configuration Dispatcher ......... SUCCESS [  2.170 s]
[INFO] Eclipse SmartHome Configuration Dispatcher Tests ... SUCCESS [ 21.017 s]
[INFO] Eclipse SmartHome Configuration Core Tests ......... SUCCESS [ 12.944 s]
[INFO] Eclipse SmartHome I/O Components ................... SUCCESS [  0.072 s]
[INFO] Eclipse SmartHome Console .......................... SUCCESS [  2.339 s]
[INFO] Eclipse SmartHome Thing ............................ SUCCESS [  4.123 s]
[INFO] Eclipse SmartHome Configuration Discovery .......... SUCCESS [  2.886 s]
[INFO] Eclipse SmartHome Configuration Discovery Tests .... SUCCESS [ 22.918 s]
[INFO] Eclipse SmartHome Config XML Tests ................. SUCCESS [ 15.082 s]
[INFO] Eclipse SmartHome Core Audio ....................... SUCCESS [  2.382 s]
[INFO] Eclipse SmartHome Sample Extension Service ......... SUCCESS [  2.718 s]
[INFO] Eclipse SmartHome REST Interface ................... SUCCESS [  2.657 s]
[INFO] Eclipse SmartHome Core ID .......................... SUCCESS [  2.398 s]
[INFO] Eclipse SmartHome Thing Tests ...................... SUCCESS [ 10.604 s]
[INFO] Eclipse SmartHome Core Tests ....................... SUCCESS [ 39.790 s]
[INFO] Eclipse SmartHome Thing Tests ...................... SUCCESS [01:05 min]
[INFO] Eclipse SmartHome Core Persistence ................. SUCCESS [  2.882 s]
[INFO] Eclipse SmartHome Core Scheduler Service ........... SUCCESS [  6.519 s]
[INFO] Eclipse SmartHome Core Transformation Service ...... SUCCESS [  2.478 s]
[INFO] Eclipse SmartHome Core Binding XML ................. SUCCESS [  2.198 s]
[INFO] Eclipse SmartHome Core Binding XML Tests ........... SUCCESS [ 12.781 s]
[INFO] Eclipse SmartHome Core Thing XML ................... SUCCESS [  2.624 s]
[INFO] Eclipse SmartHome Core Thing XML Tests ............. SUCCESS [ 15.188 s]
[INFO] Eclipse SmartHome Core Voice ....................... SUCCESS [  2.747 s]
[INFO] Eclipse SmartHome Core Voice Test .................. SUCCESS [ 10.067 s]
[INFO] Eclipse SmartHome Automation ....................... SUCCESS [  0.084 s]
[INFO] Eclipse SmartHome Automation API ................... SUCCESS [  2.537 s]
[INFO] Eclipse SmartHome Automation Commands .............. SUCCESS [  2.718 s]
[INFO] Eclipse SmartHome Automation Parser GSON ........... SUCCESS [  2.310 s]
[INFO] Eclipse SmartHome Automation Providers ............. SUCCESS [  2.465 s]
[INFO] Eclipse SmartHome Automation Provider File ......... SUCCESS [  2.082 s]
[INFO] Eclipse SmartHome Automation Core .................. SUCCESS [  2.835 s]
[INFO] Eclipse SmartHome Automation Core Tests ............ SUCCESS [  9.582 s]
[INFO] Eclipse SmartHome Automation Sample JSON ........... SUCCESS [  2.775 s]
[INFO] Eclipse SmartHome Automation Core Modules .......... SUCCESS [  2.846 s]
[INFO] Eclipse SmartHome Automation Core Module Tests ..... SUCCESS [ 12.853 s]
[INFO] Eclipse SmartHome Automation Media Modules ......... SUCCESS [  2.325 s]
[INFO] Eclipse SmartHome Automation Timer Modules ......... SUCCESS [  2.185 s]
[INFO] Eclipse SmartHome Automation Module Timer Tests .... SUCCESS [ 14.990 s]
[INFO] Eclipse SmartHome Automation Script Modules ........ SUCCESS [  2.691 s]
[INFO] Eclipse SmartHome Models ........................... SUCCESS [  5.519 s]
[INFO] Eclipse SmartHome Model Core ....................... SUCCESS [  3.504 s]
[INFO] Eclipse SmartHome Model Lazy Generation ............ SUCCESS [  2.723 s]
[INFO] Eclipse SmartHome Model Items ...................... SUCCESS [ 21.075 s]
[INFO] Eclipse SmartHome Model Persistence ................ SUCCESS [ 21.809 s]
[INFO] Eclipse SmartHome Automation Script Default Scope .. SUCCESS [  4.099 s]
[INFO] Eclipse SmartHome Automation Script Module Tests ... SUCCESS [ 13.758 s]
[INFO] Eclipse SmartHome Automation Event Tests ........... SUCCESS [ 12.676 s]
[INFO] Eclipse SmartHome Automation Integration Tests ..... SUCCESS [ 35.587 s]
[INFO] Eclipse SmartHome Automation Sample Extension Java . SUCCESS [  2.976 s]
[INFO] Eclipse SmartHome Automation REST API .............. SUCCESS [  2.730 s]
[INFO] Eclipse SmartHome Automation Sample REST API ....... SUCCESS [  2.488 s]
[INFO] Eclipse SmartHome Automation Java Demo ............. SUCCESS [  2.210 s]
[INFO] Eclipse SmartHome Automation Json Demo ............. SUCCESS [  1.107 s]
[INFO] Eclipse SmartHome Automation Module Type Demo ...... SUCCESS [  2.578 s]
[INFO] Eclipse SmartHome Designer Bundles ................. SUCCESS [  0.069 s]
[INFO] Eclipse SmartHome Network I/O ...................... SUCCESS [  2.255 s]
[INFO] Eclipse SmartHome Model Script ..................... SUCCESS [ 34.026 s]
[INFO] Eclipse SmartHome Designer Core Plugin ............. SUCCESS [  4.658 s]
[INFO] Eclipse SmartHome Designer UI Plugin ............... SUCCESS [  2.787 s]
[INFO] Eclipse SmartHome Console for OSGi framework Eclipse Equinox SUCCESS [  2.196 s]
[INFO] Eclipse SmartHome Console for OSGi Console RFC 147 . SUCCESS [  2.463 s]
[INFO] Eclipse SmartHome Console for OSGi runtime Karaf ... SUCCESS [  2.453 s]
[INFO] Eclipse SmartHome Monitor .......................... SUCCESS [  2.218 s]
[INFO] Eclipse SmartHome Network I/O Tests ................ SUCCESS [  9.091 s]
[INFO] Eclipse SmartHome IO REST Tests .................... SUCCESS [ 11.804 s]
[INFO] Eclipse SmartHome Authentication Support for the REST Interface SUCCESS [  3.241 s]
[INFO] Eclipse SmartHome Basic Auth for the REST Interface  SUCCESS [  2.491 s]
[INFO] Eclipse SmartHome Core REST Interface .............. SUCCESS [  3.003 s]
[INFO] Eclipse SmartHome IO REST Core Tests ............... SUCCESS [ 14.107 s]
[INFO] Eclipse SmartHome mDNS Service ..................... SUCCESS [  2.420 s]
[INFO] Eclipse SmartHome REST mDNS Announcer .............. SUCCESS [  2.697 s]
[INFO] Eclipse SmartHome SSE Interface .................... SUCCESS [  2.649 s]
[INFO] Eclipse SmartHome IO SSE Tests ..................... SUCCESS [ 11.935 s]
[INFO] Eclipse SmartHome Model Sitemap .................... SUCCESS [ 36.207 s]
[INFO] Eclipse SmartHome UIs .............................. SUCCESS [  0.061 s]
[INFO] Eclipse SmartHome UI ............................... SUCCESS [  4.487 s]
[INFO] Eclipse SmartHome Sitemap REST Interface ........... SUCCESS [  2.411 s]
[INFO] Eclipse SmartHome Core REST UI Logging Module ...... SUCCESS [  2.816 s]
[INFO] Eclipse SmartHome Voice REST Interface ............. SUCCESS [  4.638 s]
[INFO] Eclipse SmartHome DBus Transport ................... SUCCESS [  5.540 s]
[INFO] Eclipse SmartHome MQTT Transport ................... SUCCESS [  2.716 s]
[INFO] Eclipse SmartHome UPnP Transport ................... SUCCESS [  2.241 s]
[INFO] Eclipse SmartHome IO UPnP Tests .................... SUCCESS [ 16.398 s]
[INFO] Eclipse SmartHome Model Core Tests ................. SUCCESS [ 21.101 s]
[INFO] Eclipse SmartHome Model Items Runtime .............. SUCCESS [  2.753 s]
[INFO] Eclipse SmartHome Model Item UI .................... SUCCESS [  5.388 s]
[INFO] Eclipse SmartHome Items Model Tests ................ SUCCESS [ 12.770 s]
[INFO] Eclipse SmartHome Model Persistence Runtime ........ SUCCESS [  2.749 s]
[INFO] Eclipse SmartHome Model Persistence UI ............. SUCCESS [  6.466 s]
[INFO] Eclipse SmartHome Model Persistence Tests .......... SUCCESS [ 11.952 s]
[INFO] Eclipse SmartHome Model Rules ...................... SUCCESS [01:28 min]
[INFO] Eclipse SmartHome Model Rules Runtime .............. SUCCESS [  3.044 s]
[INFO] Eclipse SmartHome Model Script UI .................. SUCCESS [ 10.384 s]
[INFO] Eclipse SmartHome Model Rules UI ................... SUCCESS [ 10.901 s]
[INFO] Eclipse SmartHome Model Rules Tests ................ SUCCESS [ 10.282 s]
[INFO] Eclipse SmartHome Model Script Runtime ............. SUCCESS [  2.618 s]
[INFO] Eclipse SmartHome Model Script Tests ............... SUCCESS [ 16.980 s]
[INFO] Eclipse SmartHome Model Sitemap Runtime ............ SUCCESS [  3.843 s]
[INFO] Eclipse SmartHome Model Sitemap UI Plugin .......... SUCCESS [ 10.892 s]
[INFO] Eclipse SmartHome Thing Model ...................... SUCCESS [01:02 min]
[INFO] Eclipse SmartHome Thing Model Runtime .............. SUCCESS [  3.015 s]
[INFO] Eclipse SmartHome Thing Model UI ................... SUCCESS [  6.429 s]
[INFO] Eclipse SmartHome Thing Model Tests ................ SUCCESS [ 15.389 s]
[INFO] Eclipse SmartHome UI Tests ......................... SUCCESS [  2.632 s]
[INFO] Eclipse SmartHome UI Icon Support .................. SUCCESS [  3.163 s]
[INFO] Eclipse SmartHome UI Icon Tests .................... SUCCESS [ 11.751 s]
[INFO] Eclipse SmartHome Storages ......................... SUCCESS [  0.075 s]
[INFO] Eclipse SmartHome JSON Storage ..................... SUCCESS [  2.777 s]
[INFO] Eclipse SmartHome Storage JSON Tests ............... SUCCESS [ 11.307 s]
[INFO] Eclipse SmartHome MapDB Storage .................... SUCCESS [  2.262 s]
[INFO] Eclipse SmartHome Storage MapDB Tests .............. SUCCESS [ 12.596 s]
[INFO] Eclipse SmartHome Extensions ....................... SUCCESS [  0.071 s]
[INFO] Eclipse SmartHome Bindings ......................... SUCCESS [  0.068 s]
[INFO] Eclipse SmartHome DigitalSTROM Binding ............. SUCCESS [  8.935 s]
[INFO] Eclipse SmartHome hue Binding ...................... SUCCESS [  3.957 s]
[INFO] Eclipse SmartHome hue Binding Tests ................ SUCCESS [ 54.627 s]
[INFO] Eclipse SmartHome FSInternetRadio Binding .......... SUCCESS [  2.849 s]
[INFO] Eclipse Smarthome FSInternetRadio Binding Test ..... SUCCESS [ 28.129 s]
[INFO] Eclipse SmartHome LIFX Binding ..................... SUCCESS [  3.245 s]
[INFO] Eclipse SmartHome NTP Binding ...................... SUCCESS [  2.472 s]
[INFO] Eclipse SmartHome NTP Binding Tests ................ SUCCESS [02:13 min]
[INFO] Eclipse SmartHome Sonos Binding .................... SUCCESS [  2.831 s]
[INFO] Eclipse SmartHome WeMo Binding ..................... SUCCESS [  2.485 s]
[INFO] Eclipse SmartHome Wemo Binding Tests ............... FAILURE [02:34 min]
[INFO] Eclipse SmartHome YahooWeather Binding ............. SKIPPED
[INFO] Eclipse SmartHome I/O Services ..................... SKIPPED
[INFO] Eclipse SmartHome JavaSound I/O .................... SKIPPED
[INFO] Eclipse SmartHome Web Audio Support ................ SKIPPED
[INFO] Eclipse SmartHome Transformation Services .......... SKIPPED
[INFO] Eclipse SmartHome Exec Transformation Service ...... SKIPPED
[INFO] Eclipse SmartHome Javascript Transformation Service  SKIPPED
[INFO] Eclipse SmartHome Map Transformation Service ....... SKIPPED
[INFO] Eclipse SmartHome Map Transformation Service Tests . SKIPPED
[INFO] Eclipse SmartHome Scale Transformation Service ..... SKIPPED
[INFO] Eclipse SmartHome Scale Transformation Service Tests SKIPPED
[INFO] Eclipse SmartHome RegEx Transformation Service ..... SKIPPED
[INFO] Eclipse SmartHome RegEx Transformation Service Tests SKIPPED
[INFO] Eclipse SmartHome XPath Transformation Service ..... SKIPPED
[INFO] Eclipse SmartHome XPath Transformation Service Tests SKIPPED
[INFO] Eclipse SmartHome JSonPath Transformation Service .. SKIPPED
[INFO] Eclipse SmartHome JSonPath Transformation Service Tests SKIPPED
[INFO] Eclipse SmartHome Xslt Transformation Service ...... SKIPPED
[INFO] Eclipse SmartHome Xslt Transformation Service Tests  SKIPPED
[INFO] Eclipse SmartHome UI Extensions .................... SKIPPED
[INFO] Eclipse SmartHome Icon Sets ........................ SKIPPED
[INFO] Eclipse SmartHome Classic Icon Set ................. SKIPPED
[INFO] Eclipse SmartHome Basic UI ......................... SKIPPED
[INFO] Eclipse SmartHome Classic UI ....................... SKIPPED
[INFO] Eclipse SmartHome Paper UI ......................... SKIPPED
[INFO] Eclipse SmartHome Voice Services ................... SKIPPED
[INFO] Eclipse SmartHome MacOS TTS ........................ SKIPPED
[INFO] Eclipse SmartHome Mac TTS Tests .................... SKIPPED
[INFO] Eclipse SmartHome Features ......................... SKIPPED
[INFO] Eclipse SmartHome Runtime Core Feature ............. SKIPPED
[INFO] Eclipse SmartHome Runtime Model Feature ............ SKIPPED
[INFO] Eclipse SmartHome Runtime UI Feature ............... SKIPPED
[INFO] Eclipse SmartHome Runtime REST Feature ............. SKIPPED
[INFO] Eclipse SmartHome Runtime Automation Feature ....... SKIPPED
[INFO] Eclipse SmartHome Runtime Equinox Console Feature .. SKIPPED
[INFO] Eclipse SmartHome Runtime RfC147 Console Feature ... SKIPPED
[INFO] Eclipse SmartHome Runtime Binding Feature .......... SKIPPED
[INFO] Eclipse SmartHome Designer Dependencies ............ SKIPPED
[INFO] Eclipse SmartHome Designer Feature ................. SKIPPED
[INFO] Eclipse SmartHome Test Dependencies ................ SKIPPED
[INFO] Eclipse SmartHome Karaf Feature .................... SKIPPED
[INFO] Eclipse SmartHome Karaf Target Platform Feature .... SKIPPED
[INFO] Eclipse SmartHome Karaf Feature Verification ....... SKIPPED
[INFO] Eclipse SmartHome Products ......................... SKIPPED
[INFO] Eclipse SmartHome Designer RCP Application ......... SKIPPED
[INFO] Eclipse SmartHome p2 Repository .................... SKIPPED
[INFO] Eclipse SmartHome Tools ............................ SKIPPED
[INFO] Eclipse SmartHome Archetypes ....................... SKIPPED
[INFO] Eclipse Smarthome Binding Archetype ................ SKIPPED
[INFO] Eclipse Smarthome Binding Archetype Testsuite ...... SKIPPED
[INFO] Eclipse SmartHome Target Platform .................. SKIPPED
[INFO] Eclipse SmartHome Distribution ..................... SKIPPED
[INFO] ------------------------------------------------------------------------
[INFO] BUILD FAILURE
[INFO] ------------------------------------------------------------------------
[INFO] Total time: 25:23 min
[INFO] Finished at: 2016-12-22T12:23:27-05:00
[INFO] Final Memory: 537M/981M
[INFO] ------------------------------------------------------------------------
[INFO] o.h.m.e.h.MavenExecutionResultHandler - Build failed with exception(s)
[INFO] o.h.m.e.h.MavenExecutionResultHandler - [1] org.apache.maven.lifecycle.LifecycleExecutionException: Failed to execute goal org.eclipse.tycho:tycho-surefire-plugin:0.23.1:test (default-test) on project org.eclipse.smarthome.binding.wemo.test: There are test failures.

Please refer to /jobs/genie.smarthome/BuildRelease/workspace/extensions/binding/org.eclipse.smarthome.binding.wemo.test/target/surefire-reports for the individual test results.
[DEBUG] Closing connection to remote
[ERROR] Failed to execute goal org.eclipse.tycho:tycho-surefire-plugin:0.23.1:test (default-test) on project org.eclipse.smarthome.binding.wemo.test: There are test failures.
[ERROR] 
[ERROR] Please refer to /jobs/genie.smarthome/BuildRelease/workspace/extensions/binding/org.eclipse.smarthome.binding.wemo.test/target/surefire-reports for the individual test results.
[ERROR] -> [Help 1]
[ERROR] 
[ERROR] To see the full stack trace of the errors, re-run Maven with the -e switch.
[ERROR] Re-run Maven using the -X switch to enable full debug logging.
[ERROR] 
[ERROR] For more information about the errors and possible solutions, please read the following articles:
[ERROR] [Help 1] http://cwiki.apache.org/confluence/display/MAVEN/MojoFailureException
[ERROR] 
[ERROR] After correcting the problems, you can resume the build with the command
[ERROR]   mvn <goals> -rf :org.eclipse.smarthome.binding.wemo.test
[DEBUG] Waiting for process to finish
[DEBUG] Result: 1
Archiving artifacts
Finished: FAILURE