FailedConsole Output

Skipping 796 KB.. Full Log
urces) @ org.eclipse.smarthome.automation.api ---
[INFO] Using 'UTF-8' encoding to copy filtered resources.
[INFO] skip non existing resourceDirectory /jobs/genie.smarthome/PublishRelease/workspace/bundles/automation/org.eclipse.smarthome.automation.api/src/test/resources
[INFO] 
[INFO] --- xtend-maven-plugin:2.9.2:xtend-test-install-debug-info (default) @ org.eclipse.smarthome.automation.api ---
[WARNING] Directory /jobs/genie.smarthome/PublishRelease/workspace/bundles/automation/org.eclipse.smarthome.automation.api/src/test/java is empty. Can't process.
[WARNING] Directory /jobs/genie.smarthome/PublishRelease/workspace/bundles/automation/org.eclipse.smarthome.automation.api/xtend-gen is empty. Can't process.
[WARNING] Directory /jobs/genie.smarthome/PublishRelease/workspace/bundles/automation/org.eclipse.smarthome.automation.api/src/test/groovy is empty. Can't process.
[INFO] Installing Xtend files into 0 class files as secondary (via SMAP) debug sources in: /jobs/genie.smarthome/PublishRelease/workspace/bundles/automation/org.eclipse.smarthome.automation.api/target/test-classes
[INFO] 
[INFO] --- tycho-source-plugin:0.23.1:plugin-source (plugin-source) @ org.eclipse.smarthome.automation.api ---
[WARNING] bundle localization file /jobs/genie.smarthome/PublishRelease/workspace/bundles/automation/org.eclipse.smarthome.automation.api/plugin.properties not found
[INFO] Building jar: /jobs/genie.smarthome/PublishRelease/workspace/bundles/automation/org.eclipse.smarthome.automation.api/target/org.eclipse.smarthome.automation.api-0.8.0.b5-sources.jar
[INFO] 
[INFO] --- target-platform-configuration:0.23.1:target-platform (default-target-platform) @ org.eclipse.smarthome.automation.api ---
[INFO] 
[INFO] --- tycho-packaging-plugin:0.23.1:package-plugin (default-package-plugin) @ org.eclipse.smarthome.automation.api ---
[INFO] Building jar: /jobs/genie.smarthome/PublishRelease/workspace/bundles/automation/org.eclipse.smarthome.automation.api/target/org.eclipse.smarthome.automation.api-0.8.0.b5.jar
[INFO] 
[INFO] --- tycho-p2-plugin:0.23.1:p2-metadata-default (default-p2-metadata-default) @ org.eclipse.smarthome.automation.api ---
[INFO] 
[INFO] --- jacoco-maven-plugin:0.7.4.201502262128:prepare-agent-integration (default-prepare-agent-integration) @ org.eclipse.smarthome.automation.api ---
[INFO] argLine set to -javaagent:/opt/public/hipp/homes/genie.smarthome/.m2/repository/org/jacoco/org.jacoco.agent/0.7.4.201502262128/org.jacoco.agent-0.7.4.201502262128-runtime.jar=destfile=/jobs/genie.smarthome/PublishRelease/workspace/target/coverage.jacoco,append=true,excludes=**/*Test.*
[INFO] 
[INFO] --- eclipse-jarsigner-plugin:1.0.5:sign (sign) @ org.eclipse.smarthome.automation.api ---
[INFO] Searching org.eclipse.smarthome.automation.api-0.8.0.b5.jar for inner jars...
[INFO] Signed org.eclipse.smarthome.automation:org.eclipse.smarthome.automation.api:eclipse-plugin:0.8.0.b5 in 0 seconds.
[INFO] Searching org.eclipse.smarthome.automation.api-0.8.0.b5-sources.jar for inner jars...
[INFO] Signed org.eclipse.smarthome.automation:org.eclipse.smarthome.automation.api:java-source:sources:0.8.0.b5 in 1 seconds.
[INFO] 
[INFO] --- maven-install-plugin:2.3.1:install (default-install) @ org.eclipse.smarthome.automation.api ---
[INFO] Installing /jobs/genie.smarthome/PublishRelease/workspace/bundles/automation/org.eclipse.smarthome.automation.api/target/org.eclipse.smarthome.automation.api-0.8.0.b5.jar to /opt/public/hipp/homes/genie.smarthome/.m2/repository/org/eclipse/smarthome/automation/org.eclipse.smarthome.automation.api/0.8.0.b5/org.eclipse.smarthome.automation.api-0.8.0.b5.jar
[INFO] Installing /jobs/genie.smarthome/PublishRelease/workspace/bundles/automation/org.eclipse.smarthome.automation.api/pom.xml to /opt/public/hipp/homes/genie.smarthome/.m2/repository/org/eclipse/smarthome/automation/org.eclipse.smarthome.automation.api/0.8.0.b5/org.eclipse.smarthome.automation.api-0.8.0.b5.pom
[INFO] Installing /jobs/genie.smarthome/PublishRelease/workspace/bundles/automation/org.eclipse.smarthome.automation.api/target/org.eclipse.smarthome.automation.api-0.8.0.b5-sources.jar to /opt/public/hipp/homes/genie.smarthome/.m2/repository/org/eclipse/smarthome/automation/org.eclipse.smarthome.automation.api/0.8.0.b5/org.eclipse.smarthome.automation.api-0.8.0.b5-sources.jar
[INFO] Installing /jobs/genie.smarthome/PublishRelease/workspace/bundles/automation/org.eclipse.smarthome.automation.api/target/p2content.xml to /opt/public/hipp/homes/genie.smarthome/.m2/repository/org/eclipse/smarthome/automation/org.eclipse.smarthome.automation.api/0.8.0.b5/org.eclipse.smarthome.automation.api-0.8.0.b5-p2metadata.xml
[INFO] Installing /jobs/genie.smarthome/PublishRelease/workspace/bundles/automation/org.eclipse.smarthome.automation.api/target/p2artifacts.xml to /opt/public/hipp/homes/genie.smarthome/.m2/repository/org/eclipse/smarthome/automation/org.eclipse.smarthome.automation.api/0.8.0.b5/org.eclipse.smarthome.automation.api-0.8.0.b5-p2artifacts.xml
[INFO] 
[INFO] --- tycho-p2-plugin:0.23.1:update-local-index (default-update-local-index) @ org.eclipse.smarthome.automation.api ---
[INFO]                                                                         
[INFO] ------------------------------------------------------------------------
[INFO] Building Eclipse SmartHome Automation Commands 0.8.0.b5
[INFO] ------------------------------------------------------------------------
[INFO] 
[INFO] --- maven-clean-plugin:2.5:clean (default-clean) @ org.eclipse.smarthome.automation.commands ---
[INFO] Deleting /jobs/genie.smarthome/PublishRelease/workspace/bundles/automation/org.eclipse.smarthome.automation.commands/target
[INFO] 
[INFO] --- tycho-packaging-plugin:0.23.1:build-qualifier (default-build-qualifier) @ org.eclipse.smarthome.automation.commands ---
[INFO] The project's OSGi version is 0.8.0.b5
[INFO] 
[INFO] --- tycho-packaging-plugin:0.23.1:validate-id (default-validate-id) @ org.eclipse.smarthome.automation.commands ---
[INFO] 
[INFO] --- tycho-packaging-plugin:0.23.1:validate-version (default-validate-version) @ org.eclipse.smarthome.automation.commands ---
[INFO] 
[INFO] --- jacoco-maven-plugin:0.7.4.201502262128:prepare-agent (default-prepare-agent) @ org.eclipse.smarthome.automation.commands ---
[INFO] argLine set to -javaagent:/opt/public/hipp/homes/genie.smarthome/.m2/repository/org/jacoco/org.jacoco.agent/0.7.4.201502262128/org.jacoco.agent-0.7.4.201502262128-runtime.jar=destfile=/jobs/genie.smarthome/PublishRelease/workspace/target/coverage.jacoco,append=true,excludes=**/*Test.*
[INFO] 
[INFO] --- xtend-maven-plugin:2.9.2:compile (default) @ org.eclipse.smarthome.automation.commands ---
[INFO] 
[INFO] --- build-helper-maven-plugin:1.8:add-source (add-source) @ org.eclipse.smarthome.automation.commands ---
[INFO] Source directory: /jobs/genie.smarthome/PublishRelease/workspace/bundles/automation/org.eclipse.smarthome.automation.commands/src/main/groovy added.
[INFO] 
[INFO] --- maven-resources-plugin:2.4.3:resources (default-resources) @ org.eclipse.smarthome.automation.commands ---
[INFO] Using 'UTF-8' encoding to copy filtered resources.
[INFO] skip non existing resourceDirectory /jobs/genie.smarthome/PublishRelease/workspace/bundles/automation/org.eclipse.smarthome.automation.commands/src/main/resources
[INFO] 
[INFO] --- tycho-compiler-plugin:0.23.1:compile (default-compile) @ org.eclipse.smarthome.automation.commands ---
[INFO] Compiling 15 source files to /jobs/genie.smarthome/PublishRelease/workspace/bundles/automation/org.eclipse.smarthome.automation.commands/target/classes
[INFO] 
[INFO] --- maven-compiler-plugin:3.1:compile (default) @ org.eclipse.smarthome.automation.commands ---
[INFO] Changes detected - recompiling the module!
[INFO] Nothing to compile - all classes are up to date
[INFO] 
[INFO] --- xtend-maven-plugin:2.9.2:xtend-install-debug-info (default) @ org.eclipse.smarthome.automation.commands ---
[WARNING] Directory /jobs/genie.smarthome/PublishRelease/workspace/bundles/automation/org.eclipse.smarthome.automation.commands/xtend-gen is empty. Can't process.
[WARNING] Directory /jobs/genie.smarthome/PublishRelease/workspace/bundles/automation/org.eclipse.smarthome.automation.commands/src/main/groovy is empty. Can't process.
[INFO] Installing Xtend files into 0 class files as secondary (via SMAP) debug sources in: /jobs/genie.smarthome/PublishRelease/workspace/bundles/automation/org.eclipse.smarthome.automation.commands/target/classes
[INFO] 
[INFO] --- xtend-maven-plugin:2.9.2:testCompile (default) @ org.eclipse.smarthome.automation.commands ---
[INFO] skip compiling sources because the configured directory '[/jobs/genie.smarthome/PublishRelease/workspace/bundles/automation/org.eclipse.smarthome.automation.commands/src/test/java]' does not exists.
[INFO] 
[INFO] --- build-helper-maven-plugin:1.8:add-test-source (add-test-source) @ org.eclipse.smarthome.automation.commands ---
[INFO] Test Source directory: /jobs/genie.smarthome/PublishRelease/workspace/bundles/automation/org.eclipse.smarthome.automation.commands/src/test/groovy added.
[INFO] 
[INFO] --- maven-resources-plugin:2.4.3:testResources (default-testResources) @ org.eclipse.smarthome.automation.commands ---
[INFO] Using 'UTF-8' encoding to copy filtered resources.
[INFO] skip non existing resourceDirectory /jobs/genie.smarthome/PublishRelease/workspace/bundles/automation/org.eclipse.smarthome.automation.commands/src/test/resources
[INFO] 
[INFO] --- xtend-maven-plugin:2.9.2:xtend-test-install-debug-info (default) @ org.eclipse.smarthome.automation.commands ---
[WARNING] Directory /jobs/genie.smarthome/PublishRelease/workspace/bundles/automation/org.eclipse.smarthome.automation.commands/src/test/java is empty. Can't process.
[WARNING] Directory /jobs/genie.smarthome/PublishRelease/workspace/bundles/automation/org.eclipse.smarthome.automation.commands/xtend-gen is empty. Can't process.
[WARNING] Directory /jobs/genie.smarthome/PublishRelease/workspace/bundles/automation/org.eclipse.smarthome.automation.commands/src/test/groovy is empty. Can't process.
[INFO] Installing Xtend files into 0 class files as secondary (via SMAP) debug sources in: /jobs/genie.smarthome/PublishRelease/workspace/bundles/automation/org.eclipse.smarthome.automation.commands/target/test-classes
[INFO] 
[INFO] --- tycho-source-plugin:0.23.1:plugin-source (plugin-source) @ org.eclipse.smarthome.automation.commands ---
[WARNING] bundle localization file /jobs/genie.smarthome/PublishRelease/workspace/bundles/automation/org.eclipse.smarthome.automation.commands/plugin.properties not found
[INFO] Building jar: /jobs/genie.smarthome/PublishRelease/workspace/bundles/automation/org.eclipse.smarthome.automation.commands/target/org.eclipse.smarthome.automation.commands-0.8.0.b5-sources.jar
[INFO] 
[INFO] --- target-platform-configuration:0.23.1:target-platform (default-target-platform) @ org.eclipse.smarthome.automation.commands ---
[INFO] 
[INFO] --- tycho-packaging-plugin:0.23.1:package-plugin (default-package-plugin) @ org.eclipse.smarthome.automation.commands ---
[INFO] Building jar: /jobs/genie.smarthome/PublishRelease/workspace/bundles/automation/org.eclipse.smarthome.automation.commands/target/org.eclipse.smarthome.automation.commands-0.8.0.b5.jar
[INFO] 
[INFO] --- tycho-p2-plugin:0.23.1:p2-metadata-default (default-p2-metadata-default) @ org.eclipse.smarthome.automation.commands ---
[INFO] 
[INFO] --- jacoco-maven-plugin:0.7.4.201502262128:prepare-agent-integration (default-prepare-agent-integration) @ org.eclipse.smarthome.automation.commands ---
[INFO] argLine set to -javaagent:/opt/public/hipp/homes/genie.smarthome/.m2/repository/org/jacoco/org.jacoco.agent/0.7.4.201502262128/org.jacoco.agent-0.7.4.201502262128-runtime.jar=destfile=/jobs/genie.smarthome/PublishRelease/workspace/target/coverage.jacoco,append=true,excludes=**/*Test.*
[INFO] 
[INFO] --- eclipse-jarsigner-plugin:1.0.5:sign (sign) @ org.eclipse.smarthome.automation.commands ---
[INFO] Searching org.eclipse.smarthome.automation.commands-0.8.0.b5.jar for inner jars...
[INFO] Signed org.eclipse.smarthome.automation:org.eclipse.smarthome.automation.commands:eclipse-plugin:0.8.0.b5 in 1 seconds.
[INFO] Searching org.eclipse.smarthome.automation.commands-0.8.0.b5-sources.jar for inner jars...
[INFO] Signed org.eclipse.smarthome.automation:org.eclipse.smarthome.automation.commands:java-source:sources:0.8.0.b5 in 1 seconds.
[INFO] 
[INFO] --- maven-install-plugin:2.3.1:install (default-install) @ org.eclipse.smarthome.automation.commands ---
[INFO] Installing /jobs/genie.smarthome/PublishRelease/workspace/bundles/automation/org.eclipse.smarthome.automation.commands/target/org.eclipse.smarthome.automation.commands-0.8.0.b5.jar to /opt/public/hipp/homes/genie.smarthome/.m2/repository/org/eclipse/smarthome/automation/org.eclipse.smarthome.automation.commands/0.8.0.b5/org.eclipse.smarthome.automation.commands-0.8.0.b5.jar
[INFO] Installing /jobs/genie.smarthome/PublishRelease/workspace/bundles/automation/org.eclipse.smarthome.automation.commands/pom.xml to /opt/public/hipp/homes/genie.smarthome/.m2/repository/org/eclipse/smarthome/automation/org.eclipse.smarthome.automation.commands/0.8.0.b5/org.eclipse.smarthome.automation.commands-0.8.0.b5.pom
[INFO] Installing /jobs/genie.smarthome/PublishRelease/workspace/bundles/automation/org.eclipse.smarthome.automation.commands/target/org.eclipse.smarthome.automation.commands-0.8.0.b5-sources.jar to /opt/public/hipp/homes/genie.smarthome/.m2/repository/org/eclipse/smarthome/automation/org.eclipse.smarthome.automation.commands/0.8.0.b5/org.eclipse.smarthome.automation.commands-0.8.0.b5-sources.jar
[INFO] Installing /jobs/genie.smarthome/PublishRelease/workspace/bundles/automation/org.eclipse.smarthome.automation.commands/target/p2content.xml to /opt/public/hipp/homes/genie.smarthome/.m2/repository/org/eclipse/smarthome/automation/org.eclipse.smarthome.automation.commands/0.8.0.b5/org.eclipse.smarthome.automation.commands-0.8.0.b5-p2metadata.xml
[INFO] Installing /jobs/genie.smarthome/PublishRelease/workspace/bundles/automation/org.eclipse.smarthome.automation.commands/target/p2artifacts.xml to /opt/public/hipp/homes/genie.smarthome/.m2/repository/org/eclipse/smarthome/automation/org.eclipse.smarthome.automation.commands/0.8.0.b5/org.eclipse.smarthome.automation.commands-0.8.0.b5-p2artifacts.xml
[INFO] 
[INFO] --- tycho-p2-plugin:0.23.1:update-local-index (default-update-local-index) @ org.eclipse.smarthome.automation.commands ---
[INFO]                                                                         
[INFO] ------------------------------------------------------------------------
[INFO] Building Eclipse SmartHome Automation Parser GSON 0.8.0.b5
[INFO] ------------------------------------------------------------------------
[INFO] 
[INFO] --- maven-clean-plugin:2.5:clean (default-clean) @ org.eclipse.smarthome.automation.parser.gson ---
[INFO] Deleting /jobs/genie.smarthome/PublishRelease/workspace/bundles/automation/org.eclipse.smarthome.automation.parser.gson/target
[INFO] 
[INFO] --- tycho-packaging-plugin:0.23.1:build-qualifier (default-build-qualifier) @ org.eclipse.smarthome.automation.parser.gson ---
[INFO] The project's OSGi version is 0.8.0.b5
[INFO] 
[INFO] --- tycho-packaging-plugin:0.23.1:validate-id (default-validate-id) @ org.eclipse.smarthome.automation.parser.gson ---
[INFO] 
[INFO] --- tycho-packaging-plugin:0.23.1:validate-version (default-validate-version) @ org.eclipse.smarthome.automation.parser.gson ---
[INFO] 
[INFO] --- jacoco-maven-plugin:0.7.4.201502262128:prepare-agent (default-prepare-agent) @ org.eclipse.smarthome.automation.parser.gson ---
[INFO] argLine set to -javaagent:/opt/public/hipp/homes/genie.smarthome/.m2/repository/org/jacoco/org.jacoco.agent/0.7.4.201502262128/org.jacoco.agent-0.7.4.201502262128-runtime.jar=destfile=/jobs/genie.smarthome/PublishRelease/workspace/target/coverage.jacoco,append=true,excludes=**/*Test.*
[INFO] 
[INFO] --- xtend-maven-plugin:2.9.2:compile (default) @ org.eclipse.smarthome.automation.parser.gson ---
[INFO] 
[INFO] --- build-helper-maven-plugin:1.8:add-source (add-source) @ org.eclipse.smarthome.automation.parser.gson ---
[INFO] Source directory: /jobs/genie.smarthome/PublishRelease/workspace/bundles/automation/org.eclipse.smarthome.automation.parser.gson/src/main/groovy added.
[INFO] 
[INFO] --- maven-resources-plugin:2.4.3:resources (default-resources) @ org.eclipse.smarthome.automation.parser.gson ---
[INFO] Using 'UTF-8' encoding to copy filtered resources.
[INFO] skip non existing resourceDirectory /jobs/genie.smarthome/PublishRelease/workspace/bundles/automation/org.eclipse.smarthome.automation.parser.gson/src/main/resources
[INFO] 
[INFO] --- tycho-compiler-plugin:0.23.1:compile (default-compile) @ org.eclipse.smarthome.automation.parser.gson ---
[INFO] Compiling 6 source files to /jobs/genie.smarthome/PublishRelease/workspace/bundles/automation/org.eclipse.smarthome.automation.parser.gson/target/classes
[INFO] 
[INFO] --- maven-compiler-plugin:3.1:compile (default) @ org.eclipse.smarthome.automation.parser.gson ---
[INFO] Changes detected - recompiling the module!
[INFO] Nothing to compile - all classes are up to date
[INFO] 
[INFO] --- xtend-maven-plugin:2.9.2:xtend-install-debug-info (default) @ org.eclipse.smarthome.automation.parser.gson ---
[WARNING] Directory /jobs/genie.smarthome/PublishRelease/workspace/bundles/automation/org.eclipse.smarthome.automation.parser.gson/xtend-gen is empty. Can't process.
[WARNING] Directory /jobs/genie.smarthome/PublishRelease/workspace/bundles/automation/org.eclipse.smarthome.automation.parser.gson/src/main/groovy is empty. Can't process.
[INFO] Installing Xtend files into 0 class files as secondary (via SMAP) debug sources in: /jobs/genie.smarthome/PublishRelease/workspace/bundles/automation/org.eclipse.smarthome.automation.parser.gson/target/classes
[INFO] 
[INFO] --- xtend-maven-plugin:2.9.2:testCompile (default) @ org.eclipse.smarthome.automation.parser.gson ---
[INFO] skip compiling sources because the configured directory '[/jobs/genie.smarthome/PublishRelease/workspace/bundles/automation/org.eclipse.smarthome.automation.parser.gson/src/test/java]' does not exists.
[INFO] 
[INFO] --- build-helper-maven-plugin:1.8:add-test-source (add-test-source) @ org.eclipse.smarthome.automation.parser.gson ---
[INFO] Test Source directory: /jobs/genie.smarthome/PublishRelease/workspace/bundles/automation/org.eclipse.smarthome.automation.parser.gson/src/test/groovy added.
[INFO] 
[INFO] --- maven-resources-plugin:2.4.3:testResources (default-testResources) @ org.eclipse.smarthome.automation.parser.gson ---
[INFO] Using 'UTF-8' encoding to copy filtered resources.
[INFO] skip non existing resourceDirectory /jobs/genie.smarthome/PublishRelease/workspace/bundles/automation/org.eclipse.smarthome.automation.parser.gson/src/test/resources
[INFO] 
[INFO] --- xtend-maven-plugin:2.9.2:xtend-test-install-debug-info (default) @ org.eclipse.smarthome.automation.parser.gson ---
[WARNING] Directory /jobs/genie.smarthome/PublishRelease/workspace/bundles/automation/org.eclipse.smarthome.automation.parser.gson/src/test/java is empty. Can't process.
[WARNING] Directory /jobs/genie.smarthome/PublishRelease/workspace/bundles/automation/org.eclipse.smarthome.automation.parser.gson/xtend-gen is empty. Can't process.
[WARNING] Directory /jobs/genie.smarthome/PublishRelease/workspace/bundles/automation/org.eclipse.smarthome.automation.parser.gson/src/test/groovy is empty. Can't process.
[INFO] Installing Xtend files into 0 class files as secondary (via SMAP) debug sources in: /jobs/genie.smarthome/PublishRelease/workspace/bundles/automation/org.eclipse.smarthome.automation.parser.gson/target/test-classes
[INFO] 
[INFO] --- tycho-source-plugin:0.23.1:plugin-source (plugin-source) @ org.eclipse.smarthome.automation.parser.gson ---
[WARNING] bundle localization file /jobs/genie.smarthome/PublishRelease/workspace/bundles/automation/org.eclipse.smarthome.automation.parser.gson/plugin.properties not found
[INFO] Building jar: /jobs/genie.smarthome/PublishRelease/workspace/bundles/automation/org.eclipse.smarthome.automation.parser.gson/target/org.eclipse.smarthome.automation.parser.gson-0.8.0.b5-sources.jar
[INFO] 
[INFO] --- target-platform-configuration:0.23.1:target-platform (default-target-platform) @ org.eclipse.smarthome.automation.parser.gson ---
[INFO] 
[INFO] --- tycho-packaging-plugin:0.23.1:package-plugin (default-package-plugin) @ org.eclipse.smarthome.automation.parser.gson ---
[INFO] Building jar: /jobs/genie.smarthome/PublishRelease/workspace/bundles/automation/org.eclipse.smarthome.automation.parser.gson/target/org.eclipse.smarthome.automation.parser.gson-0.8.0.b5.jar
[INFO] 
[INFO] --- tycho-p2-plugin:0.23.1:p2-metadata-default (default-p2-metadata-default) @ org.eclipse.smarthome.automation.parser.gson ---
[INFO] 
[INFO] --- jacoco-maven-plugin:0.7.4.201502262128:prepare-agent-integration (default-prepare-agent-integration) @ org.eclipse.smarthome.automation.parser.gson ---
[INFO] argLine set to -javaagent:/opt/public/hipp/homes/genie.smarthome/.m2/repository/org/jacoco/org.jacoco.agent/0.7.4.201502262128/org.jacoco.agent-0.7.4.201502262128-runtime.jar=destfile=/jobs/genie.smarthome/PublishRelease/workspace/target/coverage.jacoco,append=true,excludes=**/*Test.*
[INFO] 
[INFO] --- eclipse-jarsigner-plugin:1.0.5:sign (sign) @ org.eclipse.smarthome.automation.parser.gson ---
[INFO] Searching org.eclipse.smarthome.automation.parser.gson-0.8.0.b5.jar for inner jars...
[INFO] Signed org.eclipse.smarthome.automation:org.eclipse.smarthome.automation.parser.gson:eclipse-plugin:0.8.0.b5 in 0 seconds.
[INFO] Searching org.eclipse.smarthome.automation.parser.gson-0.8.0.b5-sources.jar for inner jars...
[INFO] Signed org.eclipse.smarthome.automation:org.eclipse.smarthome.automation.parser.gson:java-source:sources:0.8.0.b5 in 0 seconds.
[INFO] 
[INFO] --- maven-install-plugin:2.3.1:install (default-install) @ org.eclipse.smarthome.automation.parser.gson ---
[INFO] Installing /jobs/genie.smarthome/PublishRelease/workspace/bundles/automation/org.eclipse.smarthome.automation.parser.gson/target/org.eclipse.smarthome.automation.parser.gson-0.8.0.b5.jar to /opt/public/hipp/homes/genie.smarthome/.m2/repository/org/eclipse/smarthome/automation/org.eclipse.smarthome.automation.parser.gson/0.8.0.b5/org.eclipse.smarthome.automation.parser.gson-0.8.0.b5.jar
[INFO] Installing /jobs/genie.smarthome/PublishRelease/workspace/bundles/automation/org.eclipse.smarthome.automation.parser.gson/pom.xml to /opt/public/hipp/homes/genie.smarthome/.m2/repository/org/eclipse/smarthome/automation/org.eclipse.smarthome.automation.parser.gson/0.8.0.b5/org.eclipse.smarthome.automation.parser.gson-0.8.0.b5.pom
[INFO] Installing /jobs/genie.smarthome/PublishRelease/workspace/bundles/automation/org.eclipse.smarthome.automation.parser.gson/target/org.eclipse.smarthome.automation.parser.gson-0.8.0.b5-sources.jar to /opt/public/hipp/homes/genie.smarthome/.m2/repository/org/eclipse/smarthome/automation/org.eclipse.smarthome.automation.parser.gson/0.8.0.b5/org.eclipse.smarthome.automation.parser.gson-0.8.0.b5-sources.jar
[INFO] Installing /jobs/genie.smarthome/PublishRelease/workspace/bundles/automation/org.eclipse.smarthome.automation.parser.gson/target/p2content.xml to /opt/public/hipp/homes/genie.smarthome/.m2/repository/org/eclipse/smarthome/automation/org.eclipse.smarthome.automation.parser.gson/0.8.0.b5/org.eclipse.smarthome.automation.parser.gson-0.8.0.b5-p2metadata.xml
[INFO] Installing /jobs/genie.smarthome/PublishRelease/workspace/bundles/automation/org.eclipse.smarthome.automation.parser.gson/target/p2artifacts.xml to /opt/public/hipp/homes/genie.smarthome/.m2/repository/org/eclipse/smarthome/automation/org.eclipse.smarthome.automation.parser.gson/0.8.0.b5/org.eclipse.smarthome.automation.parser.gson-0.8.0.b5-p2artifacts.xml
[INFO] 
[INFO] --- tycho-p2-plugin:0.23.1:update-local-index (default-update-local-index) @ org.eclipse.smarthome.automation.parser.gson ---
[INFO]                                                                         
[INFO] ------------------------------------------------------------------------
[INFO] Building Eclipse SmartHome Automation Providers 0.8.0.b5
[INFO] ------------------------------------------------------------------------
[INFO] 
[INFO] --- maven-clean-plugin:2.5:clean (default-clean) @ org.eclipse.smarthome.automation.providers ---
[INFO] Deleting /jobs/genie.smarthome/PublishRelease/workspace/bundles/automation/org.eclipse.smarthome.automation.providers/target
[INFO] 
[INFO] --- tycho-packaging-plugin:0.23.1:build-qualifier (default-build-qualifier) @ org.eclipse.smarthome.automation.providers ---
[INFO] The project's OSGi version is 0.8.0.b5
[INFO] 
[INFO] --- tycho-packaging-plugin:0.23.1:validate-id (default-validate-id) @ org.eclipse.smarthome.automation.providers ---
[INFO] 
[INFO] --- tycho-packaging-plugin:0.23.1:validate-version (default-validate-version) @ org.eclipse.smarthome.automation.providers ---
[INFO] 
[INFO] --- jacoco-maven-plugin:0.7.4.201502262128:prepare-agent (default-prepare-agent) @ org.eclipse.smarthome.automation.providers ---
[INFO] argLine set to -javaagent:/opt/public/hipp/homes/genie.smarthome/.m2/repository/org/jacoco/org.jacoco.agent/0.7.4.201502262128/org.jacoco.agent-0.7.4.201502262128-runtime.jar=destfile=/jobs/genie.smarthome/PublishRelease/workspace/target/coverage.jacoco,append=true,excludes=**/*Test.*
[INFO] 
[INFO] --- xtend-maven-plugin:2.9.2:compile (default) @ org.eclipse.smarthome.automation.providers ---
[INFO] 
[INFO] --- build-helper-maven-plugin:1.8:add-source (add-source) @ org.eclipse.smarthome.automation.providers ---
[INFO] Source directory: /jobs/genie.smarthome/PublishRelease/workspace/bundles/automation/org.eclipse.smarthome.automation.providers/src/main/groovy added.
[INFO] 
[INFO] --- maven-resources-plugin:2.4.3:resources (default-resources) @ org.eclipse.smarthome.automation.providers ---
[INFO] Using 'UTF-8' encoding to copy filtered resources.
[INFO] skip non existing resourceDirectory /jobs/genie.smarthome/PublishRelease/workspace/bundles/automation/org.eclipse.smarthome.automation.providers/src/main/resources
[INFO] 
[INFO] --- tycho-compiler-plugin:0.23.1:compile (default-compile) @ org.eclipse.smarthome.automation.providers ---
[INFO] Compiling 11 source files to /jobs/genie.smarthome/PublishRelease/workspace/bundles/automation/org.eclipse.smarthome.automation.providers/target/classes
[INFO] 
[INFO] --- maven-compiler-plugin:3.1:compile (default) @ org.eclipse.smarthome.automation.providers ---
[INFO] Changes detected - recompiling the module!
[INFO] Nothing to compile - all classes are up to date
[INFO] 
[INFO] --- xtend-maven-plugin:2.9.2:xtend-install-debug-info (default) @ org.eclipse.smarthome.automation.providers ---
[WARNING] Directory /jobs/genie.smarthome/PublishRelease/workspace/bundles/automation/org.eclipse.smarthome.automation.providers/xtend-gen is empty. Can't process.
[WARNING] Directory /jobs/genie.smarthome/PublishRelease/workspace/bundles/automation/org.eclipse.smarthome.automation.providers/src/main/groovy is empty. Can't process.
[INFO] Installing Xtend files into 0 class files as secondary (via SMAP) debug sources in: /jobs/genie.smarthome/PublishRelease/workspace/bundles/automation/org.eclipse.smarthome.automation.providers/target/classes
[INFO] 
[INFO] --- xtend-maven-plugin:2.9.2:testCompile (default) @ org.eclipse.smarthome.automation.providers ---
[INFO] skip compiling sources because the configured directory '[/jobs/genie.smarthome/PublishRelease/workspace/bundles/automation/org.eclipse.smarthome.automation.providers/src/test/java]' does not exists.
[INFO] 
[INFO] --- build-helper-maven-plugin:1.8:add-test-source (add-test-source) @ org.eclipse.smarthome.automation.providers ---
[INFO] Test Source directory: /jobs/genie.smarthome/PublishRelease/workspace/bundles/automation/org.eclipse.smarthome.automation.providers/src/test/groovy added.
[INFO] 
[INFO] --- maven-resources-plugin:2.4.3:testResources (default-testResources) @ org.eclipse.smarthome.automation.providers ---
[INFO] Using 'UTF-8' encoding to copy filtered resources.
[INFO] skip non existing resourceDirectory /jobs/genie.smarthome/PublishRelease/workspace/bundles/automation/org.eclipse.smarthome.automation.providers/src/test/resources
[INFO] 
[INFO] --- xtend-maven-plugin:2.9.2:xtend-test-install-debug-info (default) @ org.eclipse.smarthome.automation.providers ---
[WARNING] Directory /jobs/genie.smarthome/PublishRelease/workspace/bundles/automation/org.eclipse.smarthome.automation.providers/src/test/java is empty. Can't process.
[WARNING] Directory /jobs/genie.smarthome/PublishRelease/workspace/bundles/automation/org.eclipse.smarthome.automation.providers/xtend-gen is empty. Can't process.
[WARNING] Directory /jobs/genie.smarthome/PublishRelease/workspace/bundles/automation/org.eclipse.smarthome.automation.providers/src/test/groovy is empty. Can't process.
[INFO] Installing Xtend files into 0 class files as secondary (via SMAP) debug sources in: /jobs/genie.smarthome/PublishRelease/workspace/bundles/automation/org.eclipse.smarthome.automation.providers/target/test-classes
[INFO] 
[INFO] --- tycho-source-plugin:0.23.1:plugin-source (plugin-source) @ org.eclipse.smarthome.automation.providers ---
[WARNING] bundle localization file /jobs/genie.smarthome/PublishRelease/workspace/bundles/automation/org.eclipse.smarthome.automation.providers/plugin.properties not found
[INFO] Building jar: /jobs/genie.smarthome/PublishRelease/workspace/bundles/automation/org.eclipse.smarthome.automation.providers/target/org.eclipse.smarthome.automation.providers-0.8.0.b5-sources.jar
[INFO] 
[INFO] --- target-platform-configuration:0.23.1:target-platform (default-target-platform) @ org.eclipse.smarthome.automation.providers ---
[INFO] 
[INFO] --- tycho-packaging-plugin:0.23.1:package-plugin (default-package-plugin) @ org.eclipse.smarthome.automation.providers ---
[INFO] Building jar: /jobs/genie.smarthome/PublishRelease/workspace/bundles/automation/org.eclipse.smarthome.automation.providers/target/org.eclipse.smarthome.automation.providers-0.8.0.b5.jar
[INFO] 
[INFO] --- tycho-p2-plugin:0.23.1:p2-metadata-default (default-p2-metadata-default) @ org.eclipse.smarthome.automation.providers ---
[INFO] 
[INFO] --- jacoco-maven-plugin:0.7.4.201502262128:prepare-agent-integration (default-prepare-agent-integration) @ org.eclipse.smarthome.automation.providers ---
[INFO] argLine set to -javaagent:/opt/public/hipp/homes/genie.smarthome/.m2/repository/org/jacoco/org.jacoco.agent/0.7.4.201502262128/org.jacoco.agent-0.7.4.201502262128-runtime.jar=destfile=/jobs/genie.smarthome/PublishRelease/workspace/target/coverage.jacoco,append=true,excludes=**/*Test.*
[INFO] 
[INFO] --- eclipse-jarsigner-plugin:1.0.5:sign (sign) @ org.eclipse.smarthome.automation.providers ---
[INFO] Searching org.eclipse.smarthome.automation.providers-0.8.0.b5.jar for inner jars...
[INFO] Signed org.eclipse.smarthome.automation:org.eclipse.smarthome.automation.providers:eclipse-plugin:0.8.0.b5 in 0 seconds.
[INFO] Searching org.eclipse.smarthome.automation.providers-0.8.0.b5-sources.jar for inner jars...
[INFO] Signed org.eclipse.smarthome.automation:org.eclipse.smarthome.automation.providers:java-source:sources:0.8.0.b5 in 0 seconds.
[INFO] 
[INFO] --- maven-install-plugin:2.3.1:install (default-install) @ org.eclipse.smarthome.automation.providers ---
[INFO] Installing /jobs/genie.smarthome/PublishRelease/workspace/bundles/automation/org.eclipse.smarthome.automation.providers/target/org.eclipse.smarthome.automation.providers-0.8.0.b5.jar to /opt/public/hipp/homes/genie.smarthome/.m2/repository/org/eclipse/smarthome/automation/org.eclipse.smarthome.automation.providers/0.8.0.b5/org.eclipse.smarthome.automation.providers-0.8.0.b5.jar
[INFO] Installing /jobs/genie.smarthome/PublishRelease/workspace/bundles/automation/org.eclipse.smarthome.automation.providers/pom.xml to /opt/public/hipp/homes/genie.smarthome/.m2/repository/org/eclipse/smarthome/automation/org.eclipse.smarthome.automation.providers/0.8.0.b5/org.eclipse.smarthome.automation.providers-0.8.0.b5.pom
[INFO] Installing /jobs/genie.smarthome/PublishRelease/workspace/bundles/automation/org.eclipse.smarthome.automation.providers/target/org.eclipse.smarthome.automation.providers-0.8.0.b5-sources.jar to /opt/public/hipp/homes/genie.smarthome/.m2/repository/org/eclipse/smarthome/automation/org.eclipse.smarthome.automation.providers/0.8.0.b5/org.eclipse.smarthome.automation.providers-0.8.0.b5-sources.jar
[INFO] Installing /jobs/genie.smarthome/PublishRelease/workspace/bundles/automation/org.eclipse.smarthome.automation.providers/target/p2content.xml to /opt/public/hipp/homes/genie.smarthome/.m2/repository/org/eclipse/smarthome/automation/org.eclipse.smarthome.automation.providers/0.8.0.b5/org.eclipse.smarthome.automation.providers-0.8.0.b5-p2metadata.xml
[INFO] Installing /jobs/genie.smarthome/PublishRelease/workspace/bundles/automation/org.eclipse.smarthome.automation.providers/target/p2artifacts.xml to /opt/public/hipp/homes/genie.smarthome/.m2/repository/org/eclipse/smarthome/automation/org.eclipse.smarthome.automation.providers/0.8.0.b5/org.eclipse.smarthome.automation.providers-0.8.0.b5-p2artifacts.xml
[INFO] 
[INFO] --- tycho-p2-plugin:0.23.1:update-local-index (default-update-local-index) @ org.eclipse.smarthome.automation.providers ---
[INFO]                                                                         
[INFO] ------------------------------------------------------------------------
[INFO] Building Eclipse SmartHome Automation Core 0.8.0.b5
[INFO] ------------------------------------------------------------------------
[INFO] 
[INFO] --- maven-clean-plugin:2.5:clean (default-clean) @ org.eclipse.smarthome.automation.core ---
[INFO] Deleting /jobs/genie.smarthome/PublishRelease/workspace/bundles/automation/org.eclipse.smarthome.automation.core/target
[INFO] 
[INFO] --- tycho-packaging-plugin:0.23.1:build-qualifier (default-build-qualifier) @ org.eclipse.smarthome.automation.core ---
[INFO] The project's OSGi version is 0.8.0.b5
[INFO] 
[INFO] --- tycho-packaging-plugin:0.23.1:validate-id (default-validate-id) @ org.eclipse.smarthome.automation.core ---
[INFO] 
[INFO] --- tycho-packaging-plugin:0.23.1:validate-version (default-validate-version) @ org.eclipse.smarthome.automation.core ---
[INFO] 
[INFO] --- jacoco-maven-plugin:0.7.4.201502262128:prepare-agent (default-prepare-agent) @ org.eclipse.smarthome.automation.core ---
[INFO] argLine set to -javaagent:/opt/public/hipp/homes/genie.smarthome/.m2/repository/org/jacoco/org.jacoco.agent/0.7.4.201502262128/org.jacoco.agent-0.7.4.201502262128-runtime.jar=destfile=/jobs/genie.smarthome/PublishRelease/workspace/target/coverage.jacoco,append=true,excludes=**/*Test.*
[INFO] 
[INFO] --- xtend-maven-plugin:2.9.2:compile (default) @ org.eclipse.smarthome.automation.core ---
[INFO] 
[INFO] --- build-helper-maven-plugin:1.8:add-source (add-source) @ org.eclipse.smarthome.automation.core ---
[INFO] Source directory: /jobs/genie.smarthome/PublishRelease/workspace/bundles/automation/org.eclipse.smarthome.automation.core/src/main/groovy added.
[INFO] 
[INFO] --- maven-resources-plugin:2.4.3:resources (default-resources) @ org.eclipse.smarthome.automation.core ---
[INFO] Using 'UTF-8' encoding to copy filtered resources.
[INFO] skip non existing resourceDirectory /jobs/genie.smarthome/PublishRelease/workspace/bundles/automation/org.eclipse.smarthome.automation.core/src/main/resources
[INFO] 
[INFO] --- tycho-compiler-plugin:0.23.1:compile (default-compile) @ org.eclipse.smarthome.automation.core ---
[INFO] Compiling 21 source files to /jobs/genie.smarthome/PublishRelease/workspace/bundles/automation/org.eclipse.smarthome.automation.core/target/classes
[INFO] 
[INFO] --- maven-compiler-plugin:3.1:compile (default) @ org.eclipse.smarthome.automation.core ---
[INFO] Changes detected - recompiling the module!
[INFO] Nothing to compile - all classes are up to date
[INFO] 
[INFO] --- xtend-maven-plugin:2.9.2:xtend-install-debug-info (default) @ org.eclipse.smarthome.automation.core ---
[WARNING] Directory /jobs/genie.smarthome/PublishRelease/workspace/bundles/automation/org.eclipse.smarthome.automation.core/xtend-gen is empty. Can't process.
[WARNING] Directory /jobs/genie.smarthome/PublishRelease/workspace/bundles/automation/org.eclipse.smarthome.automation.core/src/main/groovy is empty. Can't process.
[INFO] Installing Xtend files into 0 class files as secondary (via SMAP) debug sources in: /jobs/genie.smarthome/PublishRelease/workspace/bundles/automation/org.eclipse.smarthome.automation.core/target/classes
[INFO] 
[INFO] --- xtend-maven-plugin:2.9.2:testCompile (default) @ org.eclipse.smarthome.automation.core ---
[INFO] skip compiling sources because the configured directory '[/jobs/genie.smarthome/PublishRelease/workspace/bundles/automation/org.eclipse.smarthome.automation.core/src/test/java]' does not exists.
[INFO] 
[INFO] --- build-helper-maven-plugin:1.8:add-test-source (add-test-source) @ org.eclipse.smarthome.automation.core ---
[INFO] Test Source directory: /jobs/genie.smarthome/PublishRelease/workspace/bundles/automation/org.eclipse.smarthome.automation.core/src/test/groovy added.
[INFO] 
[INFO] --- maven-resources-plugin:2.4.3:testResources (default-testResources) @ org.eclipse.smarthome.automation.core ---
[INFO] Using 'UTF-8' encoding to copy filtered resources.
[INFO] skip non existing resourceDirectory /jobs/genie.smarthome/PublishRelease/workspace/bundles/automation/org.eclipse.smarthome.automation.core/src/test/resources
[INFO] 
[INFO] --- xtend-maven-plugin:2.9.2:xtend-test-install-debug-info (default) @ org.eclipse.smarthome.automation.core ---
[WARNING] Directory /jobs/genie.smarthome/PublishRelease/workspace/bundles/automation/org.eclipse.smarthome.automation.core/src/test/java is empty. Can't process.
[WARNING] Directory /jobs/genie.smarthome/PublishRelease/workspace/bundles/automation/org.eclipse.smarthome.automation.core/xtend-gen is empty. Can't process.
[WARNING] Directory /jobs/genie.smarthome/PublishRelease/workspace/bundles/automation/org.eclipse.smarthome.automation.core/src/test/groovy is empty. Can't process.
[INFO] Installing Xtend files into 0 class files as secondary (via SMAP) debug sources in: /jobs/genie.smarthome/PublishRelease/workspace/bundles/automation/org.eclipse.smarthome.automation.core/target/test-classes
[INFO] 
[INFO] --- tycho-source-plugin:0.23.1:plugin-source (plugin-source) @ org.eclipse.smarthome.automation.core ---
[WARNING] bundle localization file /jobs/genie.smarthome/PublishRelease/workspace/bundles/automation/org.eclipse.smarthome.automation.core/plugin.properties not found
[INFO] Building jar: /jobs/genie.smarthome/PublishRelease/workspace/bundles/automation/org.eclipse.smarthome.automation.core/target/org.eclipse.smarthome.automation.core-0.8.0.b5-sources.jar
[INFO] 
[INFO] --- target-platform-configuration:0.23.1:target-platform (default-target-platform) @ org.eclipse.smarthome.automation.core ---
[INFO] 
[INFO] --- tycho-packaging-plugin:0.23.1:package-plugin (default-package-plugin) @ org.eclipse.smarthome.automation.core ---
[INFO] Building jar: /jobs/genie.smarthome/PublishRelease/workspace/bundles/automation/org.eclipse.smarthome.automation.core/target/org.eclipse.smarthome.automation.core-0.8.0.b5.jar
[INFO] 
[INFO] --- tycho-p2-plugin:0.23.1:p2-metadata-default (default-p2-metadata-default) @ org.eclipse.smarthome.automation.core ---
[INFO] 
[INFO] --- jacoco-maven-plugin:0.7.4.201502262128:prepare-agent-integration (default-prepare-agent-integration) @ org.eclipse.smarthome.automation.core ---
[INFO] argLine set to -javaagent:/opt/public/hipp/homes/genie.smarthome/.m2/repository/org/jacoco/org.jacoco.agent/0.7.4.201502262128/org.jacoco.agent-0.7.4.201502262128-runtime.jar=destfile=/jobs/genie.smarthome/PublishRelease/workspace/target/coverage.jacoco,append=true,excludes=**/*Test.*
[INFO] 
[INFO] --- eclipse-jarsigner-plugin:1.0.5:sign (sign) @ org.eclipse.smarthome.automation.core ---
[INFO] Searching org.eclipse.smarthome.automation.core-0.8.0.b5.jar for inner jars...
[INFO] Signed org.eclipse.smarthome.automation:org.eclipse.smarthome.automation.core:eclipse-plugin:0.8.0.b5 in 0 seconds.
[INFO] Searching org.eclipse.smarthome.automation.core-0.8.0.b5-sources.jar for inner jars...
[INFO] Signed org.eclipse.smarthome.automation:org.eclipse.smarthome.automation.core:java-source:sources:0.8.0.b5 in 1 seconds.
[INFO] 
[INFO] --- maven-install-plugin:2.3.1:install (default-install) @ org.eclipse.smarthome.automation.core ---
[INFO] Installing /jobs/genie.smarthome/PublishRelease/workspace/bundles/automation/org.eclipse.smarthome.automation.core/target/org.eclipse.smarthome.automation.core-0.8.0.b5.jar to /opt/public/hipp/homes/genie.smarthome/.m2/repository/org/eclipse/smarthome/automation/org.eclipse.smarthome.automation.core/0.8.0.b5/org.eclipse.smarthome.automation.core-0.8.0.b5.jar
[INFO] Installing /jobs/genie.smarthome/PublishRelease/workspace/bundles/automation/org.eclipse.smarthome.automation.core/pom.xml to /opt/public/hipp/homes/genie.smarthome/.m2/repository/org/eclipse/smarthome/automation/org.eclipse.smarthome.automation.core/0.8.0.b5/org.eclipse.smarthome.automation.core-0.8.0.b5.pom
[INFO] Installing /jobs/genie.smarthome/PublishRelease/workspace/bundles/automation/org.eclipse.smarthome.automation.core/target/org.eclipse.smarthome.automation.core-0.8.0.b5-sources.jar to /opt/public/hipp/homes/genie.smarthome/.m2/repository/org/eclipse/smarthome/automation/org.eclipse.smarthome.automation.core/0.8.0.b5/org.eclipse.smarthome.automation.core-0.8.0.b5-sources.jar
[INFO] Installing /jobs/genie.smarthome/PublishRelease/workspace/bundles/automation/org.eclipse.smarthome.automation.core/target/p2content.xml to /opt/public/hipp/homes/genie.smarthome/.m2/repository/org/eclipse/smarthome/automation/org.eclipse.smarthome.automation.core/0.8.0.b5/org.eclipse.smarthome.automation.core-0.8.0.b5-p2metadata.xml
[INFO] Installing /jobs/genie.smarthome/PublishRelease/workspace/bundles/automation/org.eclipse.smarthome.automation.core/target/p2artifacts.xml to /opt/public/hipp/homes/genie.smarthome/.m2/repository/org/eclipse/smarthome/automation/org.eclipse.smarthome.automation.core/0.8.0.b5/org.eclipse.smarthome.automation.core-0.8.0.b5-p2artifacts.xml
[INFO] 
[INFO] --- tycho-p2-plugin:0.23.1:update-local-index (default-update-local-index) @ org.eclipse.smarthome.automation.core ---
[INFO]                                                                         
[INFO] ------------------------------------------------------------------------
[INFO] Building Eclipse SmartHome Automation Core Tests 0.8.0.b5
[INFO] ------------------------------------------------------------------------
[INFO] 
[INFO] --- maven-clean-plugin:2.5:clean (default-clean) @ org.eclipse.smarthome.automation.core.test ---
[INFO] Deleting /jobs/genie.smarthome/PublishRelease/workspace/bundles/automation/org.eclipse.smarthome.automation.core.test/target
[INFO] 
[INFO] --- tycho-packaging-plugin:0.23.1:build-qualifier (default-build-qualifier) @ org.eclipse.smarthome.automation.core.test ---
[INFO] The project's OSGi version is 0.8.0.b5
[INFO] 
[INFO] --- tycho-packaging-plugin:0.23.1:validate-id (default-validate-id) @ org.eclipse.smarthome.automation.core.test ---
[INFO] 
[INFO] --- tycho-packaging-plugin:0.23.1:validate-version (default-validate-version) @ org.eclipse.smarthome.automation.core.test ---
[INFO] 
[INFO] --- jacoco-maven-plugin:0.7.4.201502262128:prepare-agent (default-prepare-agent) @ org.eclipse.smarthome.automation.core.test ---
[INFO] tycho.testArgLine set to -javaagent:/opt/public/hipp/homes/genie.smarthome/.m2/repository/org/jacoco/org.jacoco.agent/0.7.4.201502262128/org.jacoco.agent-0.7.4.201502262128-runtime.jar=destfile=/jobs/genie.smarthome/PublishRelease/workspace/target/coverage.jacoco,append=true,excludes=**/*Test.*
[INFO] 
[INFO] --- xtend-maven-plugin:2.9.2:compile (default) @ org.eclipse.smarthome.automation.core.test ---
[INFO] 
[INFO] --- build-helper-maven-plugin:1.8:add-source (add-source) @ org.eclipse.smarthome.automation.core.test ---
[INFO] Source directory: /jobs/genie.smarthome/PublishRelease/workspace/bundles/automation/org.eclipse.smarthome.automation.core.test/src/main/groovy added.
[INFO] 
[INFO] --- maven-resources-plugin:2.4.3:resources (default-resources) @ org.eclipse.smarthome.automation.core.test ---
[INFO] Using 'UTF-8' encoding to copy filtered resources.
[INFO] skip non existing resourceDirectory /jobs/genie.smarthome/PublishRelease/workspace/bundles/automation/org.eclipse.smarthome.automation.core.test/src/main/resources
[INFO] 
[INFO] --- tycho-compiler-plugin:0.23.1:compile (default-compile) @ org.eclipse.smarthome.automation.core.test ---
[INFO] Compiling 4 source files to /jobs/genie.smarthome/PublishRelease/workspace/bundles/automation/org.eclipse.smarthome.automation.core.test/target/classes
[INFO] 
[INFO] --- maven-compiler-plugin:3.1:compile (default) @ org.eclipse.smarthome.automation.core.test ---
[INFO] Changes detected - recompiling the module!
[INFO] Nothing to compile - all classes are up to date
[INFO] 
[INFO] --- xtend-maven-plugin:2.9.2:xtend-install-debug-info (default) @ org.eclipse.smarthome.automation.core.test ---
[WARNING] Directory /jobs/genie.smarthome/PublishRelease/workspace/bundles/automation/org.eclipse.smarthome.automation.core.test/src/main/java is empty. Can't process.
[WARNING] Directory /jobs/genie.smarthome/PublishRelease/workspace/bundles/automation/org.eclipse.smarthome.automation.core.test/xtend-gen is empty. Can't process.
[WARNING] Directory /jobs/genie.smarthome/PublishRelease/workspace/bundles/automation/org.eclipse.smarthome.automation.core.test/src/main/groovy is empty. Can't process.
[INFO] Installing Xtend files into 0 class files as secondary (via SMAP) debug sources in: /jobs/genie.smarthome/PublishRelease/workspace/bundles/automation/org.eclipse.smarthome.automation.core.test/target/classes
[INFO] 
[INFO] --- xtend-maven-plugin:2.9.2:testCompile (default) @ org.eclipse.smarthome.automation.core.test ---
[INFO] skip compiling sources because the configured directory '[]' does not exists.
[INFO] 
[INFO] --- build-helper-maven-plugin:1.8:add-test-source (add-test-source) @ org.eclipse.smarthome.automation.core.test ---
[INFO] Test Source directory: /jobs/genie.smarthome/PublishRelease/workspace/bundles/automation/org.eclipse.smarthome.automation.core.test/src/test/groovy added.
[INFO] 
[INFO] --- maven-resources-plugin:2.4.3:testResources (default-testResources) @ org.eclipse.smarthome.automation.core.test ---
[INFO] Using 'UTF-8' encoding to copy filtered resources.
[INFO] skip non existing resourceDirectory /jobs/genie.smarthome/PublishRelease/workspace/bundles/automation/org.eclipse.smarthome.automation.core.test/src/test/resources
[INFO] 
[INFO] --- xtend-maven-plugin:2.9.2:xtend-test-install-debug-info (default) @ org.eclipse.smarthome.automation.core.test ---
[WARNING] Directory /jobs/genie.smarthome/PublishRelease/workspace/bundles/automation/org.eclipse.smarthome.automation.core.test/xtend-gen is empty. Can't process.
[WARNING] Directory /jobs/genie.smarthome/PublishRelease/workspace/bundles/automation/org.eclipse.smarthome.automation.core.test/src/test/groovy is empty. Can't process.
[INFO] Installing Xtend files into 0 class files as secondary (via SMAP) debug sources in: /jobs/genie.smarthome/PublishRelease/workspace/bundles/automation/org.eclipse.smarthome.automation.core.test/target/test-classes
[INFO] 
[INFO] --- tycho-source-plugin:0.23.1:plugin-source (plugin-source) @ org.eclipse.smarthome.automation.core.test ---
[WARNING] bundle localization file /jobs/genie.smarthome/PublishRelease/workspace/bundles/automation/org.eclipse.smarthome.automation.core.test/plugin.properties not found
[INFO] Building jar: /jobs/genie.smarthome/PublishRelease/workspace/bundles/automation/org.eclipse.smarthome.automation.core.test/target/org.eclipse.smarthome.automation.core.test-0.8.0.b5-sources.jar
[INFO] 
[INFO] --- target-platform-configuration:0.23.1:target-platform (default-target-platform) @ org.eclipse.smarthome.automation.core.test ---
[INFO] 
[INFO] --- tycho-packaging-plugin:0.23.1:package-plugin (default-package-plugin) @ org.eclipse.smarthome.automation.core.test ---
[INFO] Building jar: /jobs/genie.smarthome/PublishRelease/workspace/bundles/automation/org.eclipse.smarthome.automation.core.test/target/org.eclipse.smarthome.automation.core.test-0.8.0.b5.jar
[INFO] 
[INFO] --- tycho-p2-plugin:0.23.1:p2-metadata-default (default-p2-metadata-default) @ org.eclipse.smarthome.automation.core.test ---
[INFO] 
[INFO] --- jacoco-maven-plugin:0.7.4.201502262128:prepare-agent-integration (default-prepare-agent-integration) @ org.eclipse.smarthome.automation.core.test ---
[INFO] tycho.testArgLine set to -javaagent:/opt/public/hipp/homes/genie.smarthome/.m2/repository/org/jacoco/org.jacoco.agent/0.7.4.201502262128/org.jacoco.agent-0.7.4.201502262128-runtime.jar=destfile=/jobs/genie.smarthome/PublishRelease/workspace/target/coverage.jacoco,append=true,excludes=**/*Test.*
[INFO] 
[INFO] --- tycho-surefire-plugin:0.23.1:test (default-test) @ org.eclipse.smarthome.automation.core.test ---
[INFO] Expected eclipse log file: /jobs/genie.smarthome/PublishRelease/workspace/bundles/automation/org.eclipse.smarthome.automation.core.test/target/work/data/.metadata/.log
[INFO] Command line:
	[/opt/public/common/jdk1.7.0_80/jre/bin/java, -Dosgi.noShutdown=false, -Dosgi.os=linux, -Dosgi.ws=gtk, -Dosgi.arch=x86_64, -javaagent:/opt/public/hipp/homes/genie.smarthome/.m2/repository/org/jacoco/org.jacoco.agent/0.7.4.201502262128/org.jacoco.agent-0.7.4.201502262128-runtime.jar=destfile=/jobs/genie.smarthome/PublishRelease/workspace/target/coverage.jacoco,append=true,excludes=**/*Test.*, -Dosgi.clean=true, -jar, /opt/public/hipp/homes/genie.smarthome/.m2/repository/p2/osgi/bundle/org.eclipse.equinox.launcher/1.3.0.v20140415-2008/org.eclipse.equinox.launcher-1.3.0.v20140415-2008.jar, -data, /jobs/genie.smarthome/PublishRelease/workspace/bundles/automation/org.eclipse.smarthome.automation.core.test/target/work/data, -install, /jobs/genie.smarthome/PublishRelease/workspace/bundles/automation/org.eclipse.smarthome.automation.core.test/target/work, -configuration, /jobs/genie.smarthome/PublishRelease/workspace/bundles/automation/org.eclipse.smarthome.automation.core.test/target/work/configuration, -application, org.eclipse.tycho.surefire.osgibooter.headlesstest, -testproperties, /jobs/genie.smarthome/PublishRelease/workspace/bundles/automation/org.eclipse.smarthome.automation.core.test/target/surefire.properties]

-------------------------------------------------------
 T E S T S
-------------------------------------------------------
SLF4J: Failed to load class "org.slf4j.impl.StaticLoggerBinder".
SLF4J: Defaulting to no-operation (NOP) logger implementation
SLF4J: See http://www.slf4j.org/codes.html#StaticLoggerBinder for further details.
Running org.eclipse.smarthome.automation.core.internal.ReferenceResolverUtilTest
Tests run: 2, Failures: 0, Errors: 0, Skipped: 0, Time elapsed: 0.09 sec - in org.eclipse.smarthome.automation.core.internal.ReferenceResolverUtilTest
testModuleConfigurationResolving(org.eclipse.smarthome.automation.core.internal.ReferenceResolverUtilTest)  Time elapsed: 0.006 sec
testModuleInputResolving(org.eclipse.smarthome.automation.core.internal.ReferenceResolverUtilTest)  Time elapsed: 0 sec
Running org.eclipse.smarthome.automation.core.internal.RuleEngineTest
Tests run: 9, Failures: 0, Errors: 0, Skipped: 0, Time elapsed: 0.033 sec - in org.eclipse.smarthome.automation.core.internal.RuleEngineTest
testRuleConditions(org.eclipse.smarthome.automation.core.internal.RuleEngineTest)  Time elapsed: 0.013 sec
testRuleTriggers(org.eclipse.smarthome.automation.core.internal.RuleEngineTest)  Time elapsed: 0.001 sec
testAutoMapRuleConnections(org.eclipse.smarthome.automation.core.internal.RuleEngineTest)  Time elapsed: 0.004 sec
testRuleConfigNull(org.eclipse.smarthome.automation.core.internal.RuleEngineTest)  Time elapsed: 0.001 sec
testGetRuleByTags(org.eclipse.smarthome.automation.core.internal.RuleEngineTest)  Time elapsed: 0.002 sec
testAddRetrieveRules(org.eclipse.smarthome.automation.core.internal.RuleEngineTest)  Time elapsed: 0 sec
testRuleConfigValue(org.eclipse.smarthome.automation.core.internal.RuleEngineTest)  Time elapsed: 0.008 sec
testRuleTags(org.eclipse.smarthome.automation.core.internal.RuleEngineTest)  Time elapsed: 0 sec
testRuleActions(org.eclipse.smarthome.automation.core.internal.RuleEngineTest)  Time elapsed: 0 sec

Results :

Tests run: 11, Failures: 0, Errors: 0, Skipped: 0

[INFO] All tests passed!
[INFO] 
[INFO] --- eclipse-jarsigner-plugin:1.0.5:sign (sign) @ org.eclipse.smarthome.automation.core.test ---
[INFO] Searching org.eclipse.smarthome.automation.core.test-0.8.0.b5.jar for inner jars...
[INFO] Signed org.eclipse.smarthome.io:org.eclipse.smarthome.automation.core.test:eclipse-test-plugin:0.8.0.b5 in 1 seconds.
[INFO] Searching org.eclipse.smarthome.automation.core.test-0.8.0.b5-sources.jar for inner jars...
[INFO] Signed org.eclipse.smarthome.io:org.eclipse.smarthome.automation.core.test:java-source:sources:0.8.0.b5 in 0 seconds.
[INFO] 
[INFO] --- maven-install-plugin:2.3.1:install (default-install) @ org.eclipse.smarthome.automation.core.test ---
[INFO] Installing /jobs/genie.smarthome/PublishRelease/workspace/bundles/automation/org.eclipse.smarthome.automation.core.test/target/org.eclipse.smarthome.automation.core.test-0.8.0.b5.jar to /opt/public/hipp/homes/genie.smarthome/.m2/repository/org/eclipse/smarthome/io/org.eclipse.smarthome.automation.core.test/0.8.0.b5/org.eclipse.smarthome.automation.core.test-0.8.0.b5.jar
[INFO] Installing /jobs/genie.smarthome/PublishRelease/workspace/bundles/automation/org.eclipse.smarthome.automation.core.test/pom.xml to /opt/public/hipp/homes/genie.smarthome/.m2/repository/org/eclipse/smarthome/io/org.eclipse.smarthome.automation.core.test/0.8.0.b5/org.eclipse.smarthome.automation.core.test-0.8.0.b5.pom
[INFO] Installing /jobs/genie.smarthome/PublishRelease/workspace/bundles/automation/org.eclipse.smarthome.automation.core.test/target/org.eclipse.smarthome.automation.core.test-0.8.0.b5-sources.jar to /opt/public/hipp/homes/genie.smarthome/.m2/repository/org/eclipse/smarthome/io/org.eclipse.smarthome.automation.core.test/0.8.0.b5/org.eclipse.smarthome.automation.core.test-0.8.0.b5-sources.jar
[INFO] Installing /jobs/genie.smarthome/PublishRelease/workspace/bundles/automation/org.eclipse.smarthome.automation.core.test/target/p2content.xml to /opt/public/hipp/homes/genie.smarthome/.m2/repository/org/eclipse/smarthome/io/org.eclipse.smarthome.automation.core.test/0.8.0.b5/org.eclipse.smarthome.automation.core.test-0.8.0.b5-p2metadata.xml
[INFO] Installing /jobs/genie.smarthome/PublishRelease/workspace/bundles/automation/org.eclipse.smarthome.automation.core.test/target/p2artifacts.xml to /opt/public/hipp/homes/genie.smarthome/.m2/repository/org/eclipse/smarthome/io/org.eclipse.smarthome.automation.core.test/0.8.0.b5/org.eclipse.smarthome.automation.core.test-0.8.0.b5-p2artifacts.xml
[INFO] 
[INFO] --- tycho-p2-plugin:0.23.1:update-local-index (default-update-local-index) @ org.eclipse.smarthome.automation.core.test ---
[INFO]                                                                         
[INFO] ------------------------------------------------------------------------
[INFO] Building Eclipse SmartHome Automation Sample JSON 0.8.0.b5
[INFO] ------------------------------------------------------------------------
[INFO] 
[INFO] --- maven-clean-plugin:2.5:clean (default-clean) @ org.eclipse.smarthome.automation.sample.extension.json ---
[INFO] Deleting /jobs/genie.smarthome/PublishRelease/workspace/bundles/automation/org.eclipse.smarthome.automation.sample.extension.json/target
[INFO] 
[INFO] --- tycho-packaging-plugin:0.23.1:build-qualifier (default-build-qualifier) @ org.eclipse.smarthome.automation.sample.extension.json ---
[INFO] The project's OSGi version is 0.8.0.b5
[INFO] 
[INFO] --- tycho-packaging-plugin:0.23.1:validate-id (default-validate-id) @ org.eclipse.smarthome.automation.sample.extension.json ---
[INFO] 
[INFO] --- tycho-packaging-plugin:0.23.1:validate-version (default-validate-version) @ org.eclipse.smarthome.automation.sample.extension.json ---
[INFO] 
[INFO] --- jacoco-maven-plugin:0.7.4.201502262128:prepare-agent (default-prepare-agent) @ org.eclipse.smarthome.automation.sample.extension.json ---
[INFO] argLine set to -javaagent:/opt/public/hipp/homes/genie.smarthome/.m2/repository/org/jacoco/org.jacoco.agent/0.7.4.201502262128/org.jacoco.agent-0.7.4.201502262128-runtime.jar=destfile=/jobs/genie.smarthome/PublishRelease/workspace/target/coverage.jacoco,append=true,excludes=**/*Test.*
[INFO] 
[INFO] --- xtend-maven-plugin:2.9.2:compile (default) @ org.eclipse.smarthome.automation.sample.extension.json ---
[INFO] 
[INFO] --- build-helper-maven-plugin:1.8:add-source (add-source) @ org.eclipse.smarthome.automation.sample.extension.json ---
[INFO] Source directory: /jobs/genie.smarthome/PublishRelease/workspace/bundles/automation/org.eclipse.smarthome.automation.sample.extension.json/src/main/groovy added.
[INFO] 
[INFO] --- maven-resources-plugin:2.4.3:resources (default-resources) @ org.eclipse.smarthome.automation.sample.extension.json ---
[INFO] Using 'UTF-8' encoding to copy filtered resources.
[INFO] skip non existing resourceDirectory /jobs/genie.smarthome/PublishRelease/workspace/bundles/automation/org.eclipse.smarthome.automation.sample.extension.json/src/main/resources
[INFO] 
[INFO] --- tycho-compiler-plugin:0.23.1:compile (default-compile) @ org.eclipse.smarthome.automation.sample.extension.json ---
[INFO] Compiling 6 source files to /jobs/genie.smarthome/PublishRelease/workspace/bundles/automation/org.eclipse.smarthome.automation.sample.extension.json/target/classes
[INFO] 
[INFO] --- maven-compiler-plugin:3.1:compile (default) @ org.eclipse.smarthome.automation.sample.extension.json ---
[INFO] Changes detected - recompiling the module!
[INFO] Nothing to compile - all classes are up to date
[INFO] 
[INFO] --- xtend-maven-plugin:2.9.2:xtend-install-debug-info (default) @ org.eclipse.smarthome.automation.sample.extension.json ---
[WARNING] Directory /jobs/genie.smarthome/PublishRelease/workspace/bundles/automation/org.eclipse.smarthome.automation.sample.extension.json/xtend-gen is empty. Can't process.
[WARNING] Directory /jobs/genie.smarthome/PublishRelease/workspace/bundles/automation/org.eclipse.smarthome.automation.sample.extension.json/src/main/groovy is empty. Can't process.
[INFO] Installing Xtend files into 0 class files as secondary (via SMAP) debug sources in: /jobs/genie.smarthome/PublishRelease/workspace/bundles/automation/org.eclipse.smarthome.automation.sample.extension.json/target/classes
[INFO] 
[INFO] --- xtend-maven-plugin:2.9.2:testCompile (default) @ org.eclipse.smarthome.automation.sample.extension.json ---
[INFO] skip compiling sources because the configured directory '[/jobs/genie.smarthome/PublishRelease/workspace/bundles/automation/org.eclipse.smarthome.automation.sample.extension.json/src/test/java]' does not exists.
[INFO] 
[INFO] --- build-helper-maven-plugin:1.8:add-test-source (add-test-source) @ org.eclipse.smarthome.automation.sample.extension.json ---
[INFO] Test Source directory: /jobs/genie.smarthome/PublishRelease/workspace/bundles/automation/org.eclipse.smarthome.automation.sample.extension.json/src/test/groovy added.
[INFO] 
[INFO] --- maven-resources-plugin:2.4.3:testResources (default-testResources) @ org.eclipse.smarthome.automation.sample.extension.json ---
[INFO] Using 'UTF-8' encoding to copy filtered resources.
[INFO] skip non existing resourceDirectory /jobs/genie.smarthome/PublishRelease/workspace/bundles/automation/org.eclipse.smarthome.automation.sample.extension.json/src/test/resources
[INFO] 
[INFO] --- xtend-maven-plugin:2.9.2:xtend-test-install-debug-info (default) @ org.eclipse.smarthome.automation.sample.extension.json ---
[WARNING] Directory /jobs/genie.smarthome/PublishRelease/workspace/bundles/automation/org.eclipse.smarthome.automation.sample.extension.json/src/test/java is empty. Can't process.
[WARNING] Directory /jobs/genie.smarthome/PublishRelease/workspace/bundles/automation/org.eclipse.smarthome.automation.sample.extension.json/xtend-gen is empty. Can't process.
[WARNING] Directory /jobs/genie.smarthome/PublishRelease/workspace/bundles/automation/org.eclipse.smarthome.automation.sample.extension.json/src/test/groovy is empty. Can't process.
[INFO] Installing Xtend files into 0 class files as secondary (via SMAP) debug sources in: /jobs/genie.smarthome/PublishRelease/workspace/bundles/automation/org.eclipse.smarthome.automation.sample.extension.json/target/test-classes
[INFO] 
[INFO] --- tycho-source-plugin:0.23.1:plugin-source (plugin-source) @ org.eclipse.smarthome.automation.sample.extension.json ---
[WARNING] bundle localization file /jobs/genie.smarthome/PublishRelease/workspace/bundles/automation/org.eclipse.smarthome.automation.sample.extension.json/plugin.properties not found
[INFO] Building jar: /jobs/genie.smarthome/PublishRelease/workspace/bundles/automation/org.eclipse.smarthome.automation.sample.extension.json/target/org.eclipse.smarthome.automation.sample.extension.json-0.8.0.b5-sources.jar
[INFO] 
[INFO] --- target-platform-configuration:0.23.1:target-platform (default-target-platform) @ org.eclipse.smarthome.automation.sample.extension.json ---
[INFO] 
[INFO] --- tycho-packaging-plugin:0.23.1:package-plugin (default-package-plugin) @ org.eclipse.smarthome.automation.sample.extension.json ---
[INFO] Building jar: /jobs/genie.smarthome/PublishRelease/workspace/bundles/automation/org.eclipse.smarthome.automation.sample.extension.json/target/org.eclipse.smarthome.automation.sample.extension.json-0.8.0.b5.jar
[INFO] 
[INFO] --- tycho-p2-plugin:0.23.1:p2-metadata-default (default-p2-metadata-default) @ org.eclipse.smarthome.automation.sample.extension.json ---
[INFO] 
[INFO] --- jacoco-maven-plugin:0.7.4.201502262128:prepare-agent-integration (default-prepare-agent-integration) @ org.eclipse.smarthome.automation.sample.extension.json ---
[INFO] argLine set to -javaagent:/opt/public/hipp/homes/genie.smarthome/.m2/repository/org/jacoco/org.jacoco.agent/0.7.4.201502262128/org.jacoco.agent-0.7.4.201502262128-runtime.jar=destfile=/jobs/genie.smarthome/PublishRelease/workspace/target/coverage.jacoco,append=true,excludes=**/*Test.*
[INFO] 
[INFO] --- eclipse-jarsigner-plugin:1.0.5:sign (sign) @ org.eclipse.smarthome.automation.sample.extension.json ---
[INFO] Searching org.eclipse.smarthome.automation.sample.extension.json-0.8.0.b5.jar for inner jars...
[INFO] Signed org.eclipse.smarthome.automation:org.eclipse.smarthome.automation.sample.extension.json:eclipse-plugin:0.8.0.b5 in 1 seconds.
[INFO] Searching org.eclipse.smarthome.automation.sample.extension.json-0.8.0.b5-sources.jar for inner jars...
[INFO] Signed org.eclipse.smarthome.automation:org.eclipse.smarthome.automation.sample.extension.json:java-source:sources:0.8.0.b5 in 0 seconds.
[INFO] 
[INFO] --- maven-install-plugin:2.3.1:install (default-install) @ org.eclipse.smarthome.automation.sample.extension.json ---
[INFO] Installing /jobs/genie.smarthome/PublishRelease/workspace/bundles/automation/org.eclipse.smarthome.automation.sample.extension.json/target/org.eclipse.smarthome.automation.sample.extension.json-0.8.0.b5.jar to /opt/public/hipp/homes/genie.smarthome/.m2/repository/org/eclipse/smarthome/automation/org.eclipse.smarthome.automation.sample.extension.json/0.8.0.b5/org.eclipse.smarthome.automation.sample.extension.json-0.8.0.b5.jar
[INFO] Installing /jobs/genie.smarthome/PublishRelease/workspace/bundles/automation/org.eclipse.smarthome.automation.sample.extension.json/pom.xml to /opt/public/hipp/homes/genie.smarthome/.m2/repository/org/eclipse/smarthome/automation/org.eclipse.smarthome.automation.sample.extension.json/0.8.0.b5/org.eclipse.smarthome.automation.sample.extension.json-0.8.0.b5.pom
[INFO] Installing /jobs/genie.smarthome/PublishRelease/workspace/bundles/automation/org.eclipse.smarthome.automation.sample.extension.json/target/org.eclipse.smarthome.automation.sample.extension.json-0.8.0.b5-sources.jar to /opt/public/hipp/homes/genie.smarthome/.m2/repository/org/eclipse/smarthome/automation/org.eclipse.smarthome.automation.sample.extension.json/0.8.0.b5/org.eclipse.smarthome.automation.sample.extension.json-0.8.0.b5-sources.jar
[INFO] Installing /jobs/genie.smarthome/PublishRelease/workspace/bundles/automation/org.eclipse.smarthome.automation.sample.extension.json/target/p2content.xml to /opt/public/hipp/homes/genie.smarthome/.m2/repository/org/eclipse/smarthome/automation/org.eclipse.smarthome.automation.sample.extension.json/0.8.0.b5/org.eclipse.smarthome.automation.sample.extension.json-0.8.0.b5-p2metadata.xml
[INFO] Installing /jobs/genie.smarthome/PublishRelease/workspace/bundles/automation/org.eclipse.smarthome.automation.sample.extension.json/target/p2artifacts.xml to /opt/public/hipp/homes/genie.smarthome/.m2/repository/org/eclipse/smarthome/automation/org.eclipse.smarthome.automation.sample.extension.json/0.8.0.b5/org.eclipse.smarthome.automation.sample.extension.json-0.8.0.b5-p2artifacts.xml
[INFO] 
[INFO] --- tycho-p2-plugin:0.23.1:update-local-index (default-update-local-index) @ org.eclipse.smarthome.automation.sample.extension.json ---
[INFO]                                                                         
[INFO] ------------------------------------------------------------------------
[INFO] Building Eclipse SmartHome Automation Core Modules 0.8.0.b5
[INFO] ------------------------------------------------------------------------
[INFO] 
[INFO] --- maven-clean-plugin:2.5:clean (default-clean) @ org.eclipse.smarthome.automation.module.core ---
[INFO] Deleting /jobs/genie.smarthome/PublishRelease/workspace/bundles/automation/org.eclipse.smarthome.automation.module.core/target
[INFO] 
[INFO] --- tycho-packaging-plugin:0.23.1:build-qualifier (default-build-qualifier) @ org.eclipse.smarthome.automation.module.core ---
[INFO] The project's OSGi version is 0.8.0.b5
[INFO] 
[INFO] --- tycho-packaging-plugin:0.23.1:validate-id (default-validate-id) @ org.eclipse.smarthome.automation.module.core ---
[INFO] 
[INFO] --- tycho-packaging-plugin:0.23.1:validate-version (default-validate-version) @ org.eclipse.smarthome.automation.module.core ---
[INFO] 
[INFO] --- jacoco-maven-plugin:0.7.4.201502262128:prepare-agent (default-prepare-agent) @ org.eclipse.smarthome.automation.module.core ---
[INFO] argLine set to -javaagent:/opt/public/hipp/homes/genie.smarthome/.m2/repository/org/jacoco/org.jacoco.agent/0.7.4.201502262128/org.jacoco.agent-0.7.4.201502262128-runtime.jar=destfile=/jobs/genie.smarthome/PublishRelease/workspace/target/coverage.jacoco,append=true,excludes=**/*Test.*
[INFO] 
[INFO] --- xtend-maven-plugin:2.9.2:compile (default) @ org.eclipse.smarthome.automation.module.core ---
[INFO] 
[INFO] --- build-helper-maven-plugin:1.8:add-source (add-source) @ org.eclipse.smarthome.automation.module.core ---
[INFO] Source directory: /jobs/genie.smarthome/PublishRelease/workspace/bundles/automation/org.eclipse.smarthome.automation.module.core/src/main/groovy added.
[INFO] 
[INFO] --- maven-resources-plugin:2.4.3:resources (default-resources) @ org.eclipse.smarthome.automation.module.core ---
[INFO] Using 'UTF-8' encoding to copy filtered resources.
[INFO] skip non existing resourceDirectory /jobs/genie.smarthome/PublishRelease/workspace/bundles/automation/org.eclipse.smarthome.automation.module.core/src/main/resources
[INFO] 
[INFO] --- tycho-compiler-plugin:0.23.1:compile (default-compile) @ org.eclipse.smarthome.automation.module.core ---
[INFO] Compiling 8 source files to /jobs/genie.smarthome/PublishRelease/workspace/bundles/automation/org.eclipse.smarthome.automation.module.core/target/classes
[INFO] 
[INFO] --- maven-compiler-plugin:3.1:compile (default) @ org.eclipse.smarthome.automation.module.core ---
[INFO] Changes detected - recompiling the module!
[INFO] Nothing to compile - all classes are up to date
[INFO] 
[INFO] --- xtend-maven-plugin:2.9.2:xtend-install-debug-info (default) @ org.eclipse.smarthome.automation.module.core ---
[WARNING] Directory /jobs/genie.smarthome/PublishRelease/workspace/bundles/automation/org.eclipse.smarthome.automation.module.core/xtend-gen is empty. Can't process.
[WARNING] Directory /jobs/genie.smarthome/PublishRelease/workspace/bundles/automation/org.eclipse.smarthome.automation.module.core/src/main/groovy is empty. Can't process.
[INFO] Installing Xtend files into 0 class files as secondary (via SMAP) debug sources in: /jobs/genie.smarthome/PublishRelease/workspace/bundles/automation/org.eclipse.smarthome.automation.module.core/target/classes
[INFO] 
[INFO] --- xtend-maven-plugin:2.9.2:testCompile (default) @ org.eclipse.smarthome.automation.module.core ---
[INFO] skip compiling sources because the configured directory '[/jobs/genie.smarthome/PublishRelease/workspace/bundles/automation/org.eclipse.smarthome.automation.module.core/src/test/java]' does not exists.
[INFO] 
[INFO] --- build-helper-maven-plugin:1.8:add-test-source (add-test-source) @ org.eclipse.smarthome.automation.module.core ---
[INFO] Test Source directory: /jobs/genie.smarthome/PublishRelease/workspace/bundles/automation/org.eclipse.smarthome.automation.module.core/src/test/groovy added.
[INFO] 
[INFO] --- maven-resources-plugin:2.4.3:testResources (default-testResources) @ org.eclipse.smarthome.automation.module.core ---
[INFO] Using 'UTF-8' encoding to copy filtered resources.
[INFO] skip non existing resourceDirectory /jobs/genie.smarthome/PublishRelease/workspace/bundles/automation/org.eclipse.smarthome.automation.module.core/src/test/resources
[INFO] 
[INFO] --- xtend-maven-plugin:2.9.2:xtend-test-install-debug-info (default) @ org.eclipse.smarthome.automation.module.core ---
[WARNING] Directory /jobs/genie.smarthome/PublishRelease/workspace/bundles/automation/org.eclipse.smarthome.automation.module.core/src/test/java is empty. Can't process.
[WARNING] Directory /jobs/genie.smarthome/PublishRelease/workspace/bundles/automation/org.eclipse.smarthome.automation.module.core/xtend-gen is empty. Can't process.
[WARNING] Directory /jobs/genie.smarthome/PublishRelease/workspace/bundles/automation/org.eclipse.smarthome.automation.module.core/src/test/groovy is empty. Can't process.
[INFO] Installing Xtend files into 0 class files as secondary (via SMAP) debug sources in: /jobs/genie.smarthome/PublishRelease/workspace/bundles/automation/org.eclipse.smarthome.automation.module.core/target/test-classes
[INFO] 
[INFO] --- tycho-source-plugin:0.23.1:plugin-source (plugin-source) @ org.eclipse.smarthome.automation.module.core ---
[WARNING] bundle localization file /jobs/genie.smarthome/PublishRelease/workspace/bundles/automation/org.eclipse.smarthome.automation.module.core/plugin.properties not found
[WARNING] Bundle-Vendor header not found in /jobs/genie.smarthome/PublishRelease/workspace/bundles/automation/org.eclipse.smarthome.automation.module.core/META-INF/MANIFEST.MF, fallback to 'unknown' for source bundle
[INFO] Building jar: /jobs/genie.smarthome/PublishRelease/workspace/bundles/automation/org.eclipse.smarthome.automation.module.core/target/org.eclipse.smarthome.automation.module.core-0.8.0.b5-sources.jar
[INFO] 
[INFO] --- target-platform-configuration:0.23.1:target-platform (default-target-platform) @ org.eclipse.smarthome.automation.module.core ---
[INFO] 
[INFO] --- tycho-packaging-plugin:0.23.1:package-plugin (default-package-plugin) @ org.eclipse.smarthome.automation.module.core ---
[INFO] Building jar: /jobs/genie.smarthome/PublishRelease/workspace/bundles/automation/org.eclipse.smarthome.automation.module.core/target/org.eclipse.smarthome.automation.module.core-0.8.0.b5.jar
[INFO] 
[INFO] --- tycho-p2-plugin:0.23.1:p2-metadata-default (default-p2-metadata-default) @ org.eclipse.smarthome.automation.module.core ---
[INFO] 
[INFO] --- jacoco-maven-plugin:0.7.4.201502262128:prepare-agent-integration (default-prepare-agent-integration) @ org.eclipse.smarthome.automation.module.core ---
[INFO] argLine set to -javaagent:/opt/public/hipp/homes/genie.smarthome/.m2/repository/org/jacoco/org.jacoco.agent/0.7.4.201502262128/org.jacoco.agent-0.7.4.201502262128-runtime.jar=destfile=/jobs/genie.smarthome/PublishRelease/workspace/target/coverage.jacoco,append=true,excludes=**/*Test.*
[INFO] 
[INFO] --- eclipse-jarsigner-plugin:1.0.5:sign (sign) @ org.eclipse.smarthome.automation.module.core ---
[INFO] Searching org.eclipse.smarthome.automation.module.core-0.8.0.b5.jar for inner jars...
[INFO] Signed org.eclipse.smarthome.automation:org.eclipse.smarthome.automation.module.core:eclipse-plugin:0.8.0.b5 in 0 seconds.
[INFO] Searching org.eclipse.smarthome.automation.module.core-0.8.0.b5-sources.jar for inner jars...
[INFO] Signed org.eclipse.smarthome.automation:org.eclipse.smarthome.automation.module.core:java-source:sources:0.8.0.b5 in 0 seconds.
[INFO] 
[INFO] --- maven-install-plugin:2.3.1:install (default-install) @ org.eclipse.smarthome.automation.module.core ---
[INFO] Installing /jobs/genie.smarthome/PublishRelease/workspace/bundles/automation/org.eclipse.smarthome.automation.module.core/target/org.eclipse.smarthome.automation.module.core-0.8.0.b5.jar to /opt/public/hipp/homes/genie.smarthome/.m2/repository/org/eclipse/smarthome/automation/org.eclipse.smarthome.automation.module.core/0.8.0.b5/org.eclipse.smarthome.automation.module.core-0.8.0.b5.jar
[INFO] Installing /jobs/genie.smarthome/PublishRelease/workspace/bundles/automation/org.eclipse.smarthome.automation.module.core/pom.xml to /opt/public/hipp/homes/genie.smarthome/.m2/repository/org/eclipse/smarthome/automation/org.eclipse.smarthome.automation.module.core/0.8.0.b5/org.eclipse.smarthome.automation.module.core-0.8.0.b5.pom
[INFO] Installing /jobs/genie.smarthome/PublishRelease/workspace/bundles/automation/org.eclipse.smarthome.automation.module.core/target/org.eclipse.smarthome.automation.module.core-0.8.0.b5-sources.jar to /opt/public/hipp/homes/genie.smarthome/.m2/repository/org/eclipse/smarthome/automation/org.eclipse.smarthome.automation.module.core/0.8.0.b5/org.eclipse.smarthome.automation.module.core-0.8.0.b5-sources.jar
[INFO] Installing /jobs/genie.smarthome/PublishRelease/workspace/bundles/automation/org.eclipse.smarthome.automation.module.core/target/p2content.xml to /opt/public/hipp/homes/genie.smarthome/.m2/repository/org/eclipse/smarthome/automation/org.eclipse.smarthome.automation.module.core/0.8.0.b5/org.eclipse.smarthome.automation.module.core-0.8.0.b5-p2metadata.xml
[INFO] Installing /jobs/genie.smarthome/PublishRelease/workspace/bundles/automation/org.eclipse.smarthome.automation.module.core/target/p2artifacts.xml to /opt/public/hipp/homes/genie.smarthome/.m2/repository/org/eclipse/smarthome/automation/org.eclipse.smarthome.automation.module.core/0.8.0.b5/org.eclipse.smarthome.automation.module.core-0.8.0.b5-p2artifacts.xml
[INFO] 
[INFO] --- tycho-p2-plugin:0.23.1:update-local-index (default-update-local-index) @ org.eclipse.smarthome.automation.module.core ---
[INFO]                                                                         
[INFO] ------------------------------------------------------------------------
[INFO] Building Eclipse SmartHome Automation Core Module Tests 0.8.0.b5
[INFO] ------------------------------------------------------------------------
[INFO] 
[INFO] --- maven-clean-plugin:2.5:clean (default-clean) @ org.eclipse.smarthome.automation.module.core.test ---
[INFO] Deleting /jobs/genie.smarthome/PublishRelease/workspace/bundles/automation/org.eclipse.smarthome.automation.module.core.test/target
[INFO] 
[INFO] --- tycho-packaging-plugin:0.23.1:build-qualifier (default-build-qualifier) @ org.eclipse.smarthome.automation.module.core.test ---
[INFO] The project's OSGi version is 0.8.0.b5
[INFO] 
[INFO] --- tycho-packaging-plugin:0.23.1:validate-id (default-validate-id) @ org.eclipse.smarthome.automation.module.core.test ---
[INFO] 
[INFO] --- tycho-packaging-plugin:0.23.1:validate-version (default-validate-version) @ org.eclipse.smarthome.automation.module.core.test ---
[INFO] 
[INFO] --- jacoco-maven-plugin:0.7.4.201502262128:prepare-agent (default-prepare-agent) @ org.eclipse.smarthome.automation.module.core.test ---
[INFO] tycho.testArgLine set to -javaagent:/opt/public/hipp/homes/genie.smarthome/.m2/repository/org/jacoco/org.jacoco.agent/0.7.4.201502262128/org.jacoco.agent-0.7.4.201502262128-runtime.jar=destfile=/jobs/genie.smarthome/PublishRelease/workspace/target/coverage.jacoco,append=true,excludes=**/*Test.*
[INFO] 
[INFO] --- xtend-maven-plugin:2.9.2:compile (default) @ org.eclipse.smarthome.automation.module.core.test ---
[INFO] 
[INFO] --- build-helper-maven-plugin:1.8:add-source (add-source) @ org.eclipse.smarthome.automation.module.core.test ---
[INFO] Source directory: /jobs/genie.smarthome/PublishRelease/workspace/bundles/automation/org.eclipse.smarthome.automation.module.core.test/src/main/groovy added.
[INFO] 
[INFO] --- maven-resources-plugin:2.4.3:resources (default-resources) @ org.eclipse.smarthome.automation.module.core.test ---
[INFO] Using 'UTF-8' encoding to copy filtered resources.
[INFO] skip non existing resourceDirectory /jobs/genie.smarthome/PublishRelease/workspace/bundles/automation/org.eclipse.smarthome.automation.module.core.test/src/main/resources
[INFO] 
[INFO] --- tycho-compiler-plugin:0.23.1:compile (default-compile) @ org.eclipse.smarthome.automation.module.core.test ---
[INFO] Nothing to compile - all classes are up to date
[INFO] 
[INFO] --- maven-compiler-plugin:3.1:compile (default) @ org.eclipse.smarthome.automation.module.core.test ---
[INFO] Changes detected - recompiling the module!
[INFO] Using Groovy-Eclipse compiler to compile both Java and Groovy files
[INFO] 
[INFO] --- xtend-maven-plugin:2.9.2:xtend-install-debug-info (default) @ org.eclipse.smarthome.automation.module.core.test ---
[WARNING] Directory /jobs/genie.smarthome/PublishRelease/workspace/bundles/automation/org.eclipse.smarthome.automation.module.core.test/src/main/java is empty. Can't process.
[WARNING] Directory /jobs/genie.smarthome/PublishRelease/workspace/bundles/automation/org.eclipse.smarthome.automation.module.core.test/xtend-gen is empty. Can't process.
[WARNING] Directory /jobs/genie.smarthome/PublishRelease/workspace/bundles/automation/org.eclipse.smarthome.automation.module.core.test/src/main/groovy is empty. Can't process.
[INFO] Installing Xtend files into 0 class files as secondary (via SMAP) debug sources in: /jobs/genie.smarthome/PublishRelease/workspace/bundles/automation/org.eclipse.smarthome.automation.module.core.test/target/classes
[INFO] 
[INFO] --- xtend-maven-plugin:2.9.2:testCompile (default) @ org.eclipse.smarthome.automation.module.core.test ---
[INFO] skip compiling sources because the configured directory '[/jobs/genie.smarthome/PublishRelease/workspace/bundles/automation/org.eclipse.smarthome.automation.module.core.test/src/test/java]' does not exists.
[INFO] 
[INFO] --- build-helper-maven-plugin:1.8:add-test-source (add-test-source) @ org.eclipse.smarthome.automation.module.core.test ---
[INFO] Test Source directory: /jobs/genie.smarthome/PublishRelease/workspace/bundles/automation/org.eclipse.smarthome.automation.module.core.test/src/test/groovy added.
[INFO] 
[INFO] --- maven-resources-plugin:2.4.3:testResources (default-testResources) @ org.eclipse.smarthome.automation.module.core.test ---
[INFO] Using 'UTF-8' encoding to copy filtered resources.
[INFO] skip non existing resourceDirectory /jobs/genie.smarthome/PublishRelease/workspace/bundles/automation/org.eclipse.smarthome.automation.module.core.test/src/test/resources
[INFO] 
[INFO] --- xtend-maven-plugin:2.9.2:xtend-test-install-debug-info (default) @ org.eclipse.smarthome.automation.module.core.test ---
[WARNING] Directory /jobs/genie.smarthome/PublishRelease/workspace/bundles/automation/org.eclipse.smarthome.automation.module.core.test/src/test/java is empty. Can't process.
[WARNING] Directory /jobs/genie.smarthome/PublishRelease/workspace/bundles/automation/org.eclipse.smarthome.automation.module.core.test/xtend-gen is empty. Can't process.
[INFO] Installing Xtend files into 0 class files as secondary (via SMAP) debug sources in: /jobs/genie.smarthome/PublishRelease/workspace/bundles/automation/org.eclipse.smarthome.automation.module.core.test/target/test-classes
[INFO] 
[INFO] --- tycho-source-plugin:0.23.1:plugin-source (plugin-source) @ org.eclipse.smarthome.automation.module.core.test ---
[WARNING] bundle localization file /jobs/genie.smarthome/PublishRelease/workspace/bundles/automation/org.eclipse.smarthome.automation.module.core.test/plugin.properties not found
[INFO] Building jar: /jobs/genie.smarthome/PublishRelease/workspace/bundles/automation/org.eclipse.smarthome.automation.module.core.test/target/org.eclipse.smarthome.automation.module.core.test-0.8.0.b5-sources.jar
[INFO] 
[INFO] --- target-platform-configuration:0.23.1:target-platform (default-target-platform) @ org.eclipse.smarthome.automation.module.core.test ---
[INFO] 
[INFO] --- tycho-packaging-plugin:0.23.1:package-plugin (default-package-plugin) @ org.eclipse.smarthome.automation.module.core.test ---
[INFO] Building jar: /jobs/genie.smarthome/PublishRelease/workspace/bundles/automation/org.eclipse.smarthome.automation.module.core.test/target/org.eclipse.smarthome.automation.module.core.test-0.8.0.b5.jar
[INFO] 
[INFO] --- tycho-p2-plugin:0.23.1:p2-metadata-default (default-p2-metadata-default) @ org.eclipse.smarthome.automation.module.core.test ---
[INFO] 
[INFO] --- jacoco-maven-plugin:0.7.4.201502262128:prepare-agent-integration (default-prepare-agent-integration) @ org.eclipse.smarthome.automation.module.core.test ---
[INFO] tycho.testArgLine set to -javaagent:/opt/public/hipp/homes/genie.smarthome/.m2/repository/org/jacoco/org.jacoco.agent/0.7.4.201502262128/org.jacoco.agent-0.7.4.201502262128-runtime.jar=destfile=/jobs/genie.smarthome/PublishRelease/workspace/target/coverage.jacoco,append=true,excludes=**/*Test.*
[INFO] 
[INFO] --- tycho-surefire-plugin:0.23.1:test (default-test) @ org.eclipse.smarthome.automation.module.core.test ---
[INFO] Expected eclipse log file: /jobs/genie.smarthome/PublishRelease/workspace/bundles/automation/org.eclipse.smarthome.automation.module.core.test/target/work/data/.metadata/.log
[INFO] Command line:
	[/opt/public/common/jdk1.7.0_80/jre/bin/java, -Dosgi.noShutdown=false, -Dosgi.os=linux, -Dosgi.ws=gtk, -Dosgi.arch=x86_64, -javaagent:/opt/public/hipp/homes/genie.smarthome/.m2/repository/org/jacoco/org.jacoco.agent/0.7.4.201502262128/org.jacoco.agent-0.7.4.201502262128-runtime.jar=destfile=/jobs/genie.smarthome/PublishRelease/workspace/target/coverage.jacoco,append=true,excludes=**/*Test.*, -Dosgi.clean=true, -jar, /opt/public/hipp/homes/genie.smarthome/.m2/repository/p2/osgi/bundle/org.eclipse.equinox.launcher/1.3.0.v20140415-2008/org.eclipse.equinox.launcher-1.3.0.v20140415-2008.jar, -data, /jobs/genie.smarthome/PublishRelease/workspace/bundles/automation/org.eclipse.smarthome.automation.module.core.test/target/work/data, -install, /jobs/genie.smarthome/PublishRelease/workspace/bundles/automation/org.eclipse.smarthome.automation.module.core.test/target/work, -configuration, /jobs/genie.smarthome/PublishRelease/workspace/bundles/automation/org.eclipse.smarthome.automation.module.core.test/target/work/configuration, -application, org.eclipse.tycho.surefire.osgibooter.headlesstest, -testproperties, /jobs/genie.smarthome/PublishRelease/workspace/bundles/automation/org.eclipse.smarthome.automation.module.core.test/target/surefire.properties]
06:49:21.161 [Start Level: Equinox Container: 706883ab-411f-0016-1da8-90f1e86fe943] DEBUG o.e.s.core.internal.PortableBase64 - PortableBase64 class is running on JavaSE <=7
06:49:21.169 [Start Level: Equinox Container: 706883ab-411f-0016-1da8-90f1e86fe943] DEBUG o.e.s.core.internal.CoreActivator - Core bundle has been started.
06:49:21.747 [Start Level: Equinox Container: 706883ab-411f-0016-1da8-90f1e86fe943] DEBUG o.e.s.c.a.i.AutoUpdateActivator - AutoUpdate binding has been started.
06:49:22.732 [Component Resolve Thread] DEBUG o.e.s.core.common.ThreadPoolManager - Created thread pool 'ConfigStatusService' with size 5-10
06:49:22.751 [Start Level: Equinox Container: 706883ab-411f-0016-1da8-90f1e86fe943] DEBUG o.e.s.a.m.core.internal.Activator - started bundle automation.module

-------------------------------------------------------
 T E S T S
-------------------------------------------------------
Running org.eclipse.smarthome.automation.module.core.internal.RuntimeRuleTest
06:49:24.042 [main] DEBUG o.e.s.c.c.registry.AbstractRegistry - Provider 'com.sun.proxy.$Proxy8' has been added.
06:49:24.053 [main] INFO  o.e.s.a.c.internal.RuleRegistryImpl - Rule provider: org.eclipse.smarthome.automation.core.internal.ManagedRuleProvider@18a7082a is added.
06:49:24.062 [main] DEBUG o.e.s.c.c.registry.AbstractRegistry - Provider 'org.eclipse.smarthome.automation.core.internal.ManagedRuleProvider' has been added.
06:49:24.122 [main] DEBUG o.e.s.a.i.c.p.AutomationResourceBundlesEventQueue - Process bundle event 2, for automation bundle 'org.eclipse.smarthome.automation.module.core' 
06:49:24.159 [main] DEBUG o.e.s.c.c.registry.AbstractRegistry - Provider 'org.eclipse.smarthome.core.items.ManagedItemProvider' has been added.
06:49:24.175 [Automation Provider Processing Queue] DEBUG o.e.s.a.i.c.p.RuleResourceBundleImporter - Parse rules from bundle 'org.eclipse.smarthome.automation.module.core' 
06:49:24.205 [main] INFO  o.e.s.a.m.c.h.CompareConditionHandler - unsupported type for compare condition: null (null)
06:49:24.205 [main] INFO  o.e.s.a.m.c.h.CompareConditionHandler - unsupported type for compare condition: class org.eclipse.smarthome.core.library.types.OnOffType
06:49:24.215 [main] INFO  o.e.s.a.m.c.h.CompareConditionHandler - unsupported type for compare condition: null (null)
06:49:24.216 [main] INFO  o.e.s.a.m.c.h.CompareConditionHandler - unsupported type for compare condition: class org.eclipse.smarthome.core.items.events.ItemStateEvent
06:49:24.231 [main] DEBUG o.e.s.c.c.registry.AbstractRegistry - Provider '$Proxy8' has been removed.
06:49:24.232 [main] INFO  o.e.s.a.c.internal.RuleRegistryImpl - Rule provider: org.eclipse.smarthome.automation.core.internal.ManagedRuleProvider@18a7082a is removed.
06:49:24.232 [main] DEBUG o.e.s.c.c.registry.AbstractRegistry - Provider 'ManagedRuleProvider' has been removed.
06:49:24.233 [main] DEBUG o.e.s.c.c.registry.AbstractRegistry - Provider 'ManagedItemProvider' has been removed.
06:49:24.248 [main] DEBUG o.e.s.c.c.registry.AbstractRegistry - Provider 'com.sun.proxy.$Proxy8' has been added.
06:49:24.250 [main] INFO  o.e.s.a.c.internal.RuleRegistryImpl - Rule provider: org.eclipse.smarthome.automation.core.internal.ManagedRuleProvider@7963936b is added.
06:49:24.250 [main] DEBUG o.e.s.c.c.registry.AbstractRegistry - Provider 'org.eclipse.smarthome.automation.core.internal.ManagedRuleProvider' has been added.
06:49:24.254 [main] DEBUG o.e.s.c.c.registry.AbstractRegistry - Provider 'org.eclipse.smarthome.core.items.ManagedItemProvider' has been added.
06:49:24.291 [main] DEBUG o.e.s.c.c.registry.AbstractRegistry - Provider '$Proxy8' has been removed.
06:49:24.292 [main] INFO  o.e.s.a.c.internal.RuleRegistryImpl - Rule provider: org.eclipse.smarthome.automation.core.internal.ManagedRuleProvider@7963936b is removed.
06:49:24.292 [main] DEBUG o.e.s.c.c.registry.AbstractRegistry - Provider 'ManagedRuleProvider' has been removed.
06:49:24.293 [main] DEBUG o.e.s.c.c.registry.AbstractRegistry - Provider 'ManagedItemProvider' has been removed.
06:49:24.302 [main] DEBUG o.e.s.c.c.registry.AbstractRegistry - Provider 'com.sun.proxy.$Proxy8' has been added.
06:49:24.304 [main] INFO  o.e.s.a.c.internal.RuleRegistryImpl - Rule provider: org.eclipse.smarthome.automation.core.internal.ManagedRuleProvider@7c17394b is added.
06:49:24.304 [main] DEBUG o.e.s.c.c.registry.AbstractRegistry - Provider 'org.eclipse.smarthome.automation.core.internal.ManagedRuleProvider' has been added.
06:49:24.309 [main] DEBUG o.e.s.c.c.registry.AbstractRegistry - Provider 'org.eclipse.smarthome.core.items.ManagedItemProvider' has been added.
06:49:24.354 [main] INFO  o.e.s.a.m.c.internal.RuntimeRuleTest - Rule created: myRule21-202459109_COMPOSITE
06:49:24.372 [main] DEBUG o.e.s.a.core.internal.RuleEngine - Added rule 'myRule21-202459109_COMPOSITE'
06:49:24.374 [main] DEBUG o.e.s.a.c.i.c.CompositeModuleHandlerFactory - create composite module:org.eclipse.smarthome.automation.core.internal.RuntimeTrigger@30144342, of rule: myRule21-202459109_COMPOSITE
06:49:24.381 [main] DEBUG o.e.s.a.c.i.c.CompositeModuleHandlerFactory - Set handler to composite module:org.eclipse.smarthome.automation.core.internal.RuntimeTrigger@30144342 -> org.eclipse.smarthome.automation.core.internal.composite.CompositeTriggerHandler@225284d7
06:49:24.382 [main] DEBUG o.e.s.a.c.i.c.CompositeModuleHandlerFactory - create composite module:org.eclipse.smarthome.automation.core.internal.RuntimeCondition@7f1d0d2e, of rule: myRule21-202459109_COMPOSITE
06:49:24.382 [main] DEBUG o.e.s.a.c.i.c.CompositeModuleHandlerFactory - create composite module:org.eclipse.smarthome.automation.Condition@4c4c8834, of rule: myRule21-202459109_COMPOSITE
06:49:24.384 [main] DEBUG o.e.s.a.c.i.c.CompositeModuleHandlerFactory - Set handler to composite module:org.eclipse.smarthome.automation.Condition@4c4c8834 -> org.eclipse.smarthome.automation.core.internal.composite.CompositeConditionHandler@3d20e870
06:49:24.384 [main] DEBUG o.e.s.a.c.i.c.CompositeModuleHandlerFactory - Set handler to composite module:org.eclipse.smarthome.automation.core.internal.RuntimeCondition@7f1d0d2e -> org.eclipse.smarthome.automation.core.internal.composite.CompositeConditionHandler@3b7c306a
06:49:24.393 [main] DEBUG o.e.s.c.c.r.AbstractManagedProvider - Added new element myRule21-202459109_COMPOSITE to ManagedRuleProvider.
06:49:24.461 [EventAdmin Async Event Dispatcher Thread] DEBUG o.e.s.core.common.ThreadPoolManager - Created thread pool 'safeCall' with size 5-10
06:49:24.512 [ESH-safeCall-5] DEBUG o.e.s.a.core.internal.RuleEngine - The trigger 'ItemStateChangeTrigger3' of rule 'myRule21-202459109_COMPOSITE' is triggred.
06:49:24.515 [pool-2-thread-1] DEBUG o.e.s.a.m.c.h.ItemStateConditionHandler - ItemStateCondition 'ItemStateCondition5'checking if myPresenceItem3 (State=ON) = ON
06:49:24.515 [pool-2-thread-1] DEBUG o.e.s.a.m.c.h.ItemStateConditionHandler - ConditionSatisfied --> true
06:49:24.516 [pool-2-thread-1] DEBUG o.e.s.a.m.c.h.ItemPostCommandActionHandler - Executing ItemPostCommandAction on Item myLampItem3 with Command ON
06:49:24.517 [pool-2-thread-1] DEBUG o.e.s.a.core.internal.RuleEngine - The rule 'myRule21-202459109_COMPOSITE' is executed.
06:49:24.517 [ESH-safeCall-5] INFO  o.e.s.a.m.c.internal.RuntimeRuleTest - RuleEvent: smarthome/rules/myRule21-202459109_COMPOSITE/state
06:49:24.521 [ESH-safeCall-5] INFO  o.e.s.a.m.c.internal.RuntimeRuleTest - RuleEvent: smarthome/rules/myRule21-202459109_COMPOSITE/state
06:49:24.605 [main] DEBUG o.e.s.c.c.registry.AbstractRegistry - Provider '$Proxy8' has been removed.
06:49:24.606 [main] INFO  o.e.s.a.c.internal.RuleRegistryImpl - Rule provider: org.eclipse.smarthome.automation.core.internal.ManagedRuleProvider@7c17394b is removed.
06:49:24.608 [main] DEBUG o.e.s.c.c.registry.AbstractRegistry - Provider 'ManagedRuleProvider' has been removed.
06:49:24.609 [main] DEBUG o.e.s.c.c.registry.AbstractRegistry - Provider 'ManagedItemProvider' has been removed.
06:49:24.617 [main] DEBUG o.e.s.c.c.registry.AbstractRegistry - Provider 'com.sun.proxy.$Proxy8' has been added.
06:49:24.619 [main] INFO  o.e.s.a.c.internal.RuleRegistryImpl - Rule provider: org.eclipse.smarthome.automation.core.internal.ManagedRuleProvider@5a93c236 is added.
06:49:24.619 [main] DEBUG o.e.s.c.c.registry.AbstractRegistry - Provider 'org.eclipse.smarthome.automation.core.internal.ManagedRuleProvider' has been added.
06:49:24.623 [main] DEBUG o.e.s.c.c.registry.AbstractRegistry - Provider 'org.eclipse.smarthome.core.items.ManagedItemProvider' has been added.
06:49:24.625 [main] INFO  o.e.s.a.m.c.internal.RuntimeRuleTest - Rule created: myRule211080795805
06:49:24.626 [main] DEBUG o.e.s.a.core.internal.RuleEngine - Added rule 'myRule211080795805'
06:49:24.627 [main] DEBUG o.e.s.a.c.i.c.CompositeModuleHandlerFactory - create composite module:org.eclipse.smarthome.automation.core.internal.RuntimeCondition@75b6ad84, of rule: myRule211080795805
06:49:24.627 [main] DEBUG o.e.s.a.c.i.c.CompositeModuleHandlerFactory - create composite module:org.eclipse.smarthome.automation.Condition@2c39f17c, of rule: myRule211080795805
06:49:24.627 [main] DEBUG o.e.s.a.c.i.c.CompositeModuleHandlerFactory - Set handler to composite module:org.eclipse.smarthome.automation.Condition@2c39f17c -> org.eclipse.smarthome.automation.core.internal.composite.CompositeConditionHandler@66bbb128
06:49:24.628 [main] DEBUG o.e.s.a.c.i.c.CompositeModuleHandlerFactory - Set handler to composite module:org.eclipse.smarthome.automation.core.internal.RuntimeCondition@75b6ad84 -> org.eclipse.smarthome.automation.core.internal.composite.CompositeConditionHandler@2c6bedc9
06:49:24.629 [main] DEBUG o.e.s.c.c.r.AbstractManagedProvider - Added new element myRule211080795805 to ManagedRuleProvider.
06:49:24.631 [main] INFO  o.e.s.a.core.internal.RuleEngine - The rule rId = myRule211080795805 is already enabled
06:49:24.651 [ESH-safeCall-5] DEBUG o.e.s.a.core.internal.RuleEngine - The trigger 'ItemStateChangeTrigger2' of rule 'myRule211080795805' is triggred.
06:49:24.652 [ESH-safeCall-5] INFO  o.e.s.a.m.c.internal.RuntimeRuleTest - Event: smarthome/items/myMotionItem2/state
06:49:24.653 [pool-3-thread-1] DEBUG o.e.s.a.m.c.h.ItemStateConditionHandler - ItemStateCondition 'ItemStateCondition3'checking if myPresenceItem2 (State=ON) = ON
06:49:24.653 [pool-3-thread-1] DEBUG o.e.s.a.m.c.h.ItemStateConditionHandler - ConditionSatisfied --> true
06:49:24.654 [pool-3-thread-1] DEBUG o.e.s.a.m.c.h.ItemPostCommandActionHandler - Executing ItemPostCommandAction on Item myLampItem2 with Command ON
06:49:24.654 [pool-3-thread-1] DEBUG o.e.s.a.core.internal.RuleEngine - The rule 'myRule211080795805' is executed.
06:49:24.657 [ESH-safeCall-5] INFO  o.e.s.a.m.c.internal.RuntimeRuleTest - Event: smarthome/items/myLampItem2/state
06:49:24.756 [main] INFO  o.e.s.a.m.c.internal.RuntimeRuleTest - myLampItem2 State: ON
06:49:24.761 [main] DEBUG o.e.s.c.c.registry.AbstractRegistry - Provider '$Proxy8' has been removed.
06:49:24.762 [main] INFO  o.e.s.a.c.internal.RuleRegistryImpl - Rule provider: org.eclipse.smarthome.automation.core.internal.ManagedRuleProvider@5a93c236 is removed.
06:49:24.764 [main] DEBUG o.e.s.c.c.registry.AbstractRegistry - Provider 'ManagedRuleProvider' has been removed.
06:49:24.765 [main] DEBUG o.e.s.c.c.registry.AbstractRegistry - Provider 'ManagedItemProvider' has been removed.
Tests run: 5, Failures: 0, Errors: 0, Skipped: 1, Time elapsed: 1.626 sec - in org.eclipse.smarthome.automation.module.core.internal.RuntimeRuleTest
assert that compareCondition works(org.eclipse.smarthome.automation.module.core.internal.RuntimeRuleTest)  Time elapsed: 0.391 sec
check if moduleTypes are registered(org.eclipse.smarthome.automation.module.core.internal.RuntimeRuleTest)  Time elapsed: 0.054 sec
assert that rule is triggered by composite trigger(org.eclipse.smarthome.automation.module.core.internal.RuntimeRuleTest)  Time elapsed: 0.316 sec
assert that item state is updated by simple rule(org.eclipse.smarthome.automation.module.core.internal.RuntimeRuleTest)  Time elapsed: 0.156 sec
testPredefinedRule(org.eclipse.smarthome.automation.module.core.internal.RuntimeRuleTest) skipped

Results :

Tests run: 5, Failures: 0, Errors: 0, Skipped: 1

06:49:24.817 [Framework stop] DEBUG o.e.s.c.x.o.XmlDocumentBundleTracker - Removing the XML related objects from module 'org.eclipse.osgi'...
06:49:24.836 [Framework stop] DEBUG o.e.s.c.x.o.XmlDocumentBundleTracker - Removing the XML related objects from module 'org.eclipse.smarthome.automation.module.core.test'...
06:49:24.838 [Framework stop] DEBUG o.e.s.c.x.o.XmlDocumentBundleTracker - Removing the XML related objects from module 'org.eclipse.smarthome.config.xml'...
06:49:24.839 [Framework stop] DEBUG o.e.s.c.x.o.XmlDocumentBundleTracker - Removing the XML related objects from module 'org.eclipse.smarthome.core.autoupdate'...
06:49:24.839 [Framework stop] DEBUG o.e.s.c.x.o.XmlDocumentBundleTracker - Removing the XML related objects from module 'org.eclipse.equinox.common'...
06:49:24.840 [Framework stop] DEBUG o.e.s.c.x.o.XmlDocumentBundleTracker - Removing the XML related objects from module 'org.eclipse.smarthome.core'...
06:49:24.840 [Framework stop] DEBUG o.e.s.c.x.o.XmlDocumentBundleTracker - Removing the XML related objects from module 'org.codehaus.groovy'...
06:49:24.840 [Framework stop] DEBUG o.e.s.c.x.o.XmlDocumentBundleTracker - Removing the XML related objects from module 'org.eclipse.equinox.preferences'...
06:49:24.840 [Framework stop] DEBUG o.e.s.c.x.o.XmlDocumentBundleTracker - Removing the XML related objects from module 'org.eclipse.core.contenttype'...
06:49:24.840 [Framework stop] DEBUG o.e.s.c.x.o.XmlDocumentBundleTracker - Removing the XML related objects from module 'org.eclipse.equinox.util'...
06:49:24.840 [Framework stop] DEBUG o.e.s.c.x.o.XmlDocumentBundleTracker - Removing the XML related objects from module 'org.eclipse.equinox.registry'...
06:49:24.840 [Framework stop] DEBUG o.e.s.c.x.o.XmlDocumentBundleTracker - Removing the XML related objects from module 'org.eclipse.smarthome.automation.module.core'...
06:49:24.840 [Framework stop] DEBUG o.e.s.c.x.o.XmlDocumentBundleTracker - Removing the XML related objects from module 'org.eclipse.smarthome.config.core'...
06:49:24.840 [Framework stop] DEBUG o.e.s.c.x.o.XmlDocumentBundleTracker - Removing the XML related objects from module 'org.hamcrest.core'...
06:49:24.840 [Framework stop] DEBUG o.e.s.c.x.o.XmlDocumentBundleTracker - Removing the XML related objects from module 'org.eclipse.equinox.event'...
06:49:24.841 [Framework stop] DEBUG o.e.s.c.x.o.XmlDocumentBundleTracker - Removing the XML related objects from module 'org.eclipse.smarthome.automation.providers'...
06:49:24.841 [Framework stop] DEBUG o.e.s.c.x.o.XmlDocumentBundleTracker - Removing the XML related objects from module 'org.eclipse.core.jobs'...
06:49:24.841 [Framework stop] DEBUG o.e.s.c.x.o.XmlDocumentBundleTracker - Removing the XML related objects from module 'org.eclipse.smarthome.automation.api'...
06:49:24.841 [Framework stop] DEBUG o.e.s.c.x.o.XmlDocumentBundleTracker - Removing the XML related objects from module 'org.eclipse.equinox.app'...
06:49:24.841 [Framework stop] DEBUG o.e.s.c.x.o.XmlDocumentBundleTracker - Removing the XML related objects from module 'org.eclipse.tycho.surefire.osgibooter'...
06:49:24.841 [Framework stop] DEBUG o.e.s.c.x.o.XmlDocumentBundleTracker - Removing the XML related objects from module 'org.eclipse.core.runtime'...
06:49:24.841 [Framework stop] DEBUG o.e.s.c.x.o.XmlDocumentBundleTracker - Removing the XML related objects from module 'org.eclipse.equinox.ds'...
06:49:24.841 [Framework stop] DEBUG o.e.s.c.x.o.XmlDocumentBundleTracker - Removing the XML related objects from module 'org.eclipse.smarthome.automation.core'...
06:49:24.841 [Framework stop] DEBUG o.e.s.c.x.o.XmlDocumentBundleTracker - Removing the XML related objects from module 'org.eclipse.smarthome.automation.parser.gson'...
06:49:25.722 [Framework stop] DEBUG o.e.s.c.a.i.AutoUpdateActivator - AutoUpdate binding has been stopped.
06:49:25.859 [Framework stop] DEBUG o.e.s.core.internal.CoreActivator - Core bundle has been stopped.
[INFO] All tests passed!
[INFO] 
[INFO] --- eclipse-jarsigner-plugin:1.0.5:sign (sign) @ org.eclipse.smarthome.automation.module.core.test ---
[INFO] Searching org.eclipse.smarthome.automation.module.core.test-0.8.0.b5.jar for inner jars...
[INFO] Signed org.eclipse.smarthome.bundles:org.eclipse.smarthome.automation.module.core.test:eclipse-test-plugin:0.8.0.b5 in 1 seconds.
[INFO] Searching org.eclipse.smarthome.automation.module.core.test-0.8.0.b5-sources.jar for inner jars...
[INFO] Signed org.eclipse.smarthome.bundles:org.eclipse.smarthome.automation.module.core.test:java-source:sources:0.8.0.b5 in 0 seconds.
[INFO] 
[INFO] --- maven-install-plugin:2.3.1:install (default-install) @ org.eclipse.smarthome.automation.module.core.test ---
[INFO] Installing /jobs/genie.smarthome/PublishRelease/workspace/bundles/automation/org.eclipse.smarthome.automation.module.core.test/target/org.eclipse.smarthome.automation.module.core.test-0.8.0.b5.jar to /opt/public/hipp/homes/genie.smarthome/.m2/repository/org/eclipse/smarthome/bundles/org.eclipse.smarthome.automation.module.core.test/0.8.0.b5/org.eclipse.smarthome.automation.module.core.test-0.8.0.b5.jar
[INFO] Installing /jobs/genie.smarthome/PublishRelease/workspace/bundles/automation/org.eclipse.smarthome.automation.module.core.test/pom.xml to /opt/public/hipp/homes/genie.smarthome/.m2/repository/org/eclipse/smarthome/bundles/org.eclipse.smarthome.automation.module.core.test/0.8.0.b5/org.eclipse.smarthome.automation.module.core.test-0.8.0.b5.pom
[INFO] Installing /jobs/genie.smarthome/PublishRelease/workspace/bundles/automation/org.eclipse.smarthome.automation.module.core.test/target/org.eclipse.smarthome.automation.module.core.test-0.8.0.b5-sources.jar to /opt/public/hipp/homes/genie.smarthome/.m2/repository/org/eclipse/smarthome/bundles/org.eclipse.smarthome.automation.module.core.test/0.8.0.b5/org.eclipse.smarthome.automation.module.core.test-0.8.0.b5-sources.jar
[INFO] Installing /jobs/genie.smarthome/PublishRelease/workspace/bundles/automation/org.eclipse.smarthome.automation.module.core.test/target/p2content.xml to /opt/public/hipp/homes/genie.smarthome/.m2/repository/org/eclipse/smarthome/bundles/org.eclipse.smarthome.automation.module.core.test/0.8.0.b5/org.eclipse.smarthome.automation.module.core.test-0.8.0.b5-p2metadata.xml
[INFO] Installing /jobs/genie.smarthome/PublishRelease/workspace/bundles/automation/org.eclipse.smarthome.automation.module.core.test/target/p2artifacts.xml to /opt/public/hipp/homes/genie.smarthome/.m2/repository/org/eclipse/smarthome/bundles/org.eclipse.smarthome.automation.module.core.test/0.8.0.b5/org.eclipse.smarthome.automation.module.core.test-0.8.0.b5-p2artifacts.xml
[INFO] 
[INFO] --- tycho-p2-plugin:0.23.1:update-local-index (default-update-local-index) @ org.eclipse.smarthome.automation.module.core.test ---
[INFO]                                                                         
[INFO] ------------------------------------------------------------------------
[INFO] Building Eclipse SmartHome Automation Timer Modules 0.8.0.b5
[INFO] ------------------------------------------------------------------------
[INFO] 
[INFO] --- maven-clean-plugin:2.5:clean (default-clean) @ org.eclipse.smarthome.automation.module.timer ---
[INFO] Deleting /jobs/genie.smarthome/PublishRelease/workspace/bundles/automation/org.eclipse.smarthome.automation.module.timer/target
[INFO] 
[INFO] --- tycho-packaging-plugin:0.23.1:build-qualifier (default-build-qualifier) @ org.eclipse.smarthome.automation.module.timer ---
[INFO] The project's OSGi version is 0.8.0.b5
[INFO] 
[INFO] --- tycho-packaging-plugin:0.23.1:validate-id (default-validate-id) @ org.eclipse.smarthome.automation.module.timer ---
[INFO] 
[INFO] --- tycho-packaging-plugin:0.23.1:validate-version (default-validate-version) @ org.eclipse.smarthome.automation.module.timer ---
[INFO] 
[INFO] --- jacoco-maven-plugin:0.7.4.201502262128:prepare-agent (default-prepare-agent) @ org.eclipse.smarthome.automation.module.timer ---
[INFO] argLine set to -javaagent:/opt/public/hipp/homes/genie.smarthome/.m2/repository/org/jacoco/org.jacoco.agent/0.7.4.201502262128/org.jacoco.agent-0.7.4.201502262128-runtime.jar=destfile=/jobs/genie.smarthome/PublishRelease/workspace/target/coverage.jacoco,append=true,excludes=**/*Test.*
[INFO] 
[INFO] --- xtend-maven-plugin:2.9.2:compile (default) @ org.eclipse.smarthome.automation.module.timer ---
[INFO] 
[INFO] --- build-helper-maven-plugin:1.8:add-source (add-source) @ org.eclipse.smarthome.automation.module.timer ---
[INFO] Source directory: /jobs/genie.smarthome/PublishRelease/workspace/bundles/automation/org.eclipse.smarthome.automation.module.timer/src/main/groovy added.
[INFO] 
[INFO] --- maven-resources-plugin:2.4.3:resources (default-resources) @ org.eclipse.smarthome.automation.module.timer ---
[INFO] Using 'UTF-8' encoding to copy filtered resources.
[INFO] skip non existing resourceDirectory /jobs/genie.smarthome/PublishRelease/workspace/bundles/automation/org.eclipse.smarthome.automation.module.timer/src/main/resources
[INFO] 
[INFO] --- tycho-compiler-plugin:0.23.1:compile (default-compile) @ org.eclipse.smarthome.automation.module.timer ---
[INFO] Compiling 4 source files to /jobs/genie.smarthome/PublishRelease/workspace/bundles/automation/org.eclipse.smarthome.automation.module.timer/target/classes
[INFO] 
[INFO] --- maven-compiler-plugin:3.1:compile (default) @ org.eclipse.smarthome.automation.module.timer ---
[INFO] Changes detected - recompiling the module!
[INFO] Nothing to compile - all classes are up to date
[INFO] 
[INFO] --- xtend-maven-plugin:2.9.2:xtend-install-debug-info (default) @ org.eclipse.smarthome.automation.module.timer ---
[WARNING] Directory /jobs/genie.smarthome/PublishRelease/workspace/bundles/automation/org.eclipse.smarthome.automation.module.timer/xtend-gen is empty. Can't process.
[WARNING] Directory /jobs/genie.smarthome/PublishRelease/workspace/bundles/automation/org.eclipse.smarthome.automation.module.timer/src/main/groovy is empty. Can't process.
[INFO] Installing Xtend files into 0 class files as secondary (via SMAP) debug sources in: /jobs/genie.smarthome/PublishRelease/workspace/bundles/automation/org.eclipse.smarthome.automation.module.timer/target/classes
[INFO] 
[INFO] --- xtend-maven-plugin:2.9.2:testCompile (default) @ org.eclipse.smarthome.automation.module.timer ---
[INFO] skip compiling sources because the configured directory '[/jobs/genie.smarthome/PublishRelease/workspace/bundles/automation/org.eclipse.smarthome.automation.module.timer/src/test/java]' does not exists.
[INFO] 
[INFO] --- build-helper-maven-plugin:1.8:add-test-source (add-test-source) @ org.eclipse.smarthome.automation.module.timer ---
[INFO] Test Source directory: /jobs/genie.smarthome/PublishRelease/workspace/bundles/automation/org.eclipse.smarthome.automation.module.timer/src/test/groovy added.
[INFO] 
[INFO] --- maven-resources-plugin:2.4.3:testResources (default-testResources) @ org.eclipse.smarthome.automation.module.timer ---
[INFO] Using 'UTF-8' encoding to copy filtered resources.
[INFO] skip non existing resourceDirectory /jobs/genie.smarthome/PublishRelease/workspace/bundles/automation/org.eclipse.smarthome.automation.module.timer/src/test/resources
[INFO] 
[INFO] --- xtend-maven-plugin:2.9.2:xtend-test-install-debug-info (default) @ org.eclipse.smarthome.automation.module.timer ---
[WARNING] Directory /jobs/genie.smarthome/PublishRelease/workspace/bundles/automation/org.eclipse.smarthome.automation.module.timer/src/test/java is empty. Can't process.
[WARNING] Directory /jobs/genie.smarthome/PublishRelease/workspace/bundles/automation/org.eclipse.smarthome.automation.module.timer/xtend-gen is empty. Can't process.
[WARNING] Directory /jobs/genie.smarthome/PublishRelease/workspace/bundles/automation/org.eclipse.smarthome.automation.module.timer/src/test/groovy is empty. Can't process.
[INFO] Installing Xtend files into 0 class files as secondary (via SMAP) debug sources in: /jobs/genie.smarthome/PublishRelease/workspace/bundles/automation/org.eclipse.smarthome.automation.module.timer/target/test-classes
[INFO] 
[INFO] --- tycho-source-plugin:0.23.1:plugin-source (plugin-source) @ org.eclipse.smarthome.automation.module.timer ---
[WARNING] bundle localization file /jobs/genie.smarthome/PublishRelease/workspace/bundles/automation/org.eclipse.smarthome.automation.module.timer/plugin.properties not found
[INFO] Building jar: /jobs/genie.smarthome/PublishRelease/workspace/bundles/automation/org.eclipse.smarthome.automation.module.timer/target/org.eclipse.smarthome.automation.module.timer-0.8.0.b5-sources.jar
[INFO] 
[INFO] --- target-platform-configuration:0.23.1:target-platform (default-target-platform) @ org.eclipse.smarthome.automation.module.timer ---
[INFO] 
[INFO] --- tycho-packaging-plugin:0.23.1:package-plugin (default-package-plugin) @ org.eclipse.smarthome.automation.module.timer ---
[INFO] Building jar: /jobs/genie.smarthome/PublishRelease/workspace/bundles/automation/org.eclipse.smarthome.automation.module.timer/target/org.eclipse.smarthome.automation.module.timer-0.8.0.b5.jar
[INFO] 
[INFO] --- tycho-p2-plugin:0.23.1:p2-metadata-default (default-p2-metadata-default) @ org.eclipse.smarthome.automation.module.timer ---
[INFO] 
[INFO] --- jacoco-maven-plugin:0.7.4.201502262128:prepare-agent-integration (default-prepare-agent-integration) @ org.eclipse.smarthome.automation.module.timer ---
[INFO] argLine set to -javaagent:/opt/public/hipp/homes/genie.smarthome/.m2/repository/org/jacoco/org.jacoco.agent/0.7.4.201502262128/org.jacoco.agent-0.7.4.201502262128-runtime.jar=destfile=/jobs/genie.smarthome/PublishRelease/workspace/target/coverage.jacoco,append=true,excludes=**/*Test.*
[INFO] 
[INFO] --- eclipse-jarsigner-plugin:1.0.5:sign (sign) @ org.eclipse.smarthome.automation.module.timer ---
[INFO] Searching org.eclipse.smarthome.automation.module.timer-0.8.0.b5.jar for inner jars...
[INFO] Signed org.eclipse.smarthome.automation:org.eclipse.smarthome.automation.module.timer:eclipse-plugin:0.8.0.b5 in 0 seconds.
[INFO] Searching org.eclipse.smarthome.automation.module.timer-0.8.0.b5-sources.jar for inner jars...
[INFO] Signed org.eclipse.smarthome.automation:org.eclipse.smarthome.automation.module.timer:java-source:sources:0.8.0.b5 in 1 seconds.
[INFO] 
[INFO] --- maven-install-plugin:2.3.1:install (default-install) @ org.eclipse.smarthome.automation.module.timer ---
[INFO] Installing /jobs/genie.smarthome/PublishRelease/workspace/bundles/automation/org.eclipse.smarthome.automation.module.timer/target/org.eclipse.smarthome.automation.module.timer-0.8.0.b5.jar to /opt/public/hipp/homes/genie.smarthome/.m2/repository/org/eclipse/smarthome/automation/org.eclipse.smarthome.automation.module.timer/0.8.0.b5/org.eclipse.smarthome.automation.module.timer-0.8.0.b5.jar
[INFO] Installing /jobs/genie.smarthome/PublishRelease/workspace/bundles/automation/org.eclipse.smarthome.automation.module.timer/pom.xml to /opt/public/hipp/homes/genie.smarthome/.m2/repository/org/eclipse/smarthome/automation/org.eclipse.smarthome.automation.module.timer/0.8.0.b5/org.eclipse.smarthome.automation.module.timer-0.8.0.b5.pom
[INFO] Installing /jobs/genie.smarthome/PublishRelease/workspace/bundles/automation/org.eclipse.smarthome.automation.module.timer/target/org.eclipse.smarthome.automation.module.timer-0.8.0.b5-sources.jar to /opt/public/hipp/homes/genie.smarthome/.m2/repository/org/eclipse/smarthome/automation/org.eclipse.smarthome.automation.module.timer/0.8.0.b5/org.eclipse.smarthome.automation.module.timer-0.8.0.b5-sources.jar
[INFO] Installing /jobs/genie.smarthome/PublishRelease/workspace/bundles/automation/org.eclipse.smarthome.automation.module.timer/target/p2content.xml to /opt/public/hipp/homes/genie.smarthome/.m2/repository/org/eclipse/smarthome/automation/org.eclipse.smarthome.automation.module.timer/0.8.0.b5/org.eclipse.smarthome.automation.module.timer-0.8.0.b5-p2metadata.xml
[INFO] Installing /jobs/genie.smarthome/PublishRelease/workspace/bundles/automation/org.eclipse.smarthome.automation.module.timer/target/p2artifacts.xml to /opt/public/hipp/homes/genie.smarthome/.m2/repository/org/eclipse/smarthome/automation/org.eclipse.smarthome.automation.module.timer/0.8.0.b5/org.eclipse.smarthome.automation.module.timer-0.8.0.b5-p2artifacts.xml
[INFO] 
[INFO] --- tycho-p2-plugin:0.23.1:update-local-index (default-update-local-index) @ org.eclipse.smarthome.automation.module.timer ---
[INFO]                                                                         
[INFO] ------------------------------------------------------------------------
[INFO] Building Eclipse SmartHome Automation Module Timer Tests 0.8.0.b5
[INFO] ------------------------------------------------------------------------
[INFO] 
[INFO] --- maven-clean-plugin:2.5:clean (default-clean) @ org.eclipse.smarthome.automation.module.timer.test ---
[INFO] Deleting /jobs/genie.smarthome/PublishRelease/workspace/bundles/automation/org.eclipse.smarthome.automation.module.timer.test/target
[INFO] 
[INFO] --- tycho-packaging-plugin:0.23.1:build-qualifier (default-build-qualifier) @ org.eclipse.smarthome.automation.module.timer.test ---
[INFO] The project's OSGi version is 0.8.0.b5
[INFO] 
[INFO] --- tycho-packaging-plugin:0.23.1:validate-id (default-validate-id) @ org.eclipse.smarthome.automation.module.timer.test ---
[INFO] 
[INFO] --- tycho-packaging-plugin:0.23.1:validate-version (default-validate-version) @ org.eclipse.smarthome.automation.module.timer.test ---
[INFO] 
[INFO] --- jacoco-maven-plugin:0.7.4.201502262128:prepare-agent (default-prepare-agent) @ org.eclipse.smarthome.automation.module.timer.test ---
[INFO] tycho.testArgLine set to -javaagent:/opt/public/hipp/homes/genie.smarthome/.m2/repository/org/jacoco/org.jacoco.agent/0.7.4.201502262128/org.jacoco.agent-0.7.4.201502262128-runtime.jar=destfile=/jobs/genie.smarthome/PublishRelease/workspace/target/coverage.jacoco,append=true,excludes=**/*Test.*
[INFO] 
[INFO] --- xtend-maven-plugin:2.9.2:compile (default) @ org.eclipse.smarthome.automation.module.timer.test ---
[INFO] 
[INFO] --- build-helper-maven-plugin:1.8:add-source (add-source) @ org.eclipse.smarthome.automation.module.timer.test ---
[INFO] Source directory: /jobs/genie.smarthome/PublishRelease/workspace/bundles/automation/org.eclipse.smarthome.automation.module.timer.test/src/main/groovy added.
[INFO] 
[INFO] --- maven-resources-plugin:2.4.3:resources (default-resources) @ org.eclipse.smarthome.automation.module.timer.test ---
[INFO] Using 'UTF-8' encoding to copy filtered resources.
[INFO] skip non existing resourceDirectory /jobs/genie.smarthome/PublishRelease/workspace/bundles/automation/org.eclipse.smarthome.automation.module.timer.test/src/main/resources
[INFO] 
[INFO] --- tycho-compiler-plugin:0.23.1:compile (default-compile) @ org.eclipse.smarthome.automation.module.timer.test ---
[INFO] Nothing to compile - all classes are up to date
[INFO] 
[INFO] --- maven-compiler-plugin:3.1:compile (default) @ org.eclipse.smarthome.automation.module.timer.test ---
[INFO] Changes detected - recompiling the module!
[INFO] Using Groovy-Eclipse compiler to compile both Java and Groovy files
[INFO] 
[INFO] --- xtend-maven-plugin:2.9.2:xtend-install-debug-info (default) @ org.eclipse.smarthome.automation.module.timer.test ---
[WARNING] Directory /jobs/genie.smarthome/PublishRelease/workspace/bundles/automation/org.eclipse.smarthome.automation.module.timer.test/src/main/java is empty. Can't process.
[WARNING] Directory /jobs/genie.smarthome/PublishRelease/workspace/bundles/automation/org.eclipse.smarthome.automation.module.timer.test/xtend-gen is empty. Can't process.
[WARNING] Directory /jobs/genie.smarthome/PublishRelease/workspace/bundles/automation/org.eclipse.smarthome.automation.module.timer.test/src/main/groovy is empty. Can't process.
[INFO] Installing Xtend files into 0 class files as secondary (via SMAP) debug sources in: /jobs/genie.smarthome/PublishRelease/workspace/bundles/automation/org.eclipse.smarthome.automation.module.timer.test/target/classes
[INFO] 
[INFO] --- xtend-maven-plugin:2.9.2:testCompile (default) @ org.eclipse.smarthome.automation.module.timer.test ---
[INFO] skip compiling sources because the configured directory '[/jobs/genie.smarthome/PublishRelease/workspace/bundles/automation/org.eclipse.smarthome.automation.module.timer.test/src/test/java]' does not exists.
[INFO] 
[INFO] --- build-helper-maven-plugin:1.8:add-test-source (add-test-source) @ org.eclipse.smarthome.automation.module.timer.test ---
[INFO] Test Source directory: /jobs/genie.smarthome/PublishRelease/workspace/bundles/automation/org.eclipse.smarthome.automation.module.timer.test/src/test/groovy added.
[INFO] 
[INFO] --- maven-resources-plugin:2.4.3:testResources (default-testResources) @ org.eclipse.smarthome.automation.module.timer.test ---
[INFO] Using 'UTF-8' encoding to copy filtered resources.
[INFO] skip non existing resourceDirectory /jobs/genie.smarthome/PublishRelease/workspace/bundles/automation/org.eclipse.smarthome.automation.module.timer.test/src/test/resources
[INFO] 
[INFO] --- xtend-maven-plugin:2.9.2:xtend-test-install-debug-info (default) @ org.eclipse.smarthome.automation.module.timer.test ---
[WARNING] Directory /jobs/genie.smarthome/PublishRelease/workspace/bundles/automation/org.eclipse.smarthome.automation.module.timer.test/src/test/java is empty. Can't process.
[WARNING] Directory /jobs/genie.smarthome/PublishRelease/workspace/bundles/automation/org.eclipse.smarthome.automation.module.timer.test/xtend-gen is empty. Can't process.
[INFO] Installing Xtend files into 0 class files as secondary (via SMAP) debug sources in: /jobs/genie.smarthome/PublishRelease/workspace/bundles/automation/org.eclipse.smarthome.automation.module.timer.test/target/test-classes
[INFO] 
[INFO] --- tycho-source-plugin:0.23.1:plugin-source (plugin-source) @ org.eclipse.smarthome.automation.module.timer.test ---
[WARNING] bundle localization file /jobs/genie.smarthome/PublishRelease/workspace/bundles/automation/org.eclipse.smarthome.automation.module.timer.test/plugin.properties not found
[INFO] Building jar: /jobs/genie.smarthome/PublishRelease/workspace/bundles/automation/org.eclipse.smarthome.automation.module.timer.test/target/org.eclipse.smarthome.automation.module.timer.test-0.8.0.b5-sources.jar
[INFO] 
[INFO] --- target-platform-configuration:0.23.1:target-platform (default-target-platform) @ org.eclipse.smarthome.automation.module.timer.test ---
[INFO] 
[INFO] --- tycho-packaging-plugin:0.23.1:package-plugin (default-package-plugin) @ org.eclipse.smarthome.automation.module.timer.test ---
[INFO] Building jar: /jobs/genie.smarthome/PublishRelease/workspace/bundles/automation/org.eclipse.smarthome.automation.module.timer.test/target/org.eclipse.smarthome.automation.module.timer.test-0.8.0.b5.jar
[INFO] 
[INFO] --- tycho-p2-plugin:0.23.1:p2-metadata-default (default-p2-metadata-default) @ org.eclipse.smarthome.automation.module.timer.test ---
[INFO] 
[INFO] --- jacoco-maven-plugin:0.7.4.201502262128:prepare-agent-integration (default-prepare-agent-integration) @ org.eclipse.smarthome.automation.module.timer.test ---
[INFO] tycho.testArgLine set to -javaagent:/opt/public/hipp/homes/genie.smarthome/.m2/repository/org/jacoco/org.jacoco.agent/0.7.4.201502262128/org.jacoco.agent-0.7.4.201502262128-runtime.jar=destfile=/jobs/genie.smarthome/PublishRelease/workspace/target/coverage.jacoco,append=true,excludes=**/*Test.*
[INFO] 
[INFO] --- tycho-surefire-plugin:0.23.1:test (default-test) @ org.eclipse.smarthome.automation.module.timer.test ---
[INFO] Expected eclipse log file: /jobs/genie.smarthome/PublishRelease/workspace/bundles/automation/org.eclipse.smarthome.automation.module.timer.test/target/work/data/.metadata/.log
[INFO] Command line:
	[/opt/public/common/jdk1.7.0_80/jre/bin/java, -Dosgi.noShutdown=false, -Dosgi.os=linux, -Dosgi.ws=gtk, -Dosgi.arch=x86_64, -javaagent:/opt/public/hipp/homes/genie.smarthome/.m2/repository/org/jacoco/org.jacoco.agent/0.7.4.201502262128/org.jacoco.agent-0.7.4.201502262128-runtime.jar=destfile=/jobs/genie.smarthome/PublishRelease/workspace/target/coverage.jacoco,append=true,excludes=**/*Test.*, -Dosgi.clean=true, -jar, /opt/public/hipp/homes/genie.smarthome/.m2/repository/p2/osgi/bundle/org.eclipse.equinox.launcher/1.3.0.v20140415-2008/org.eclipse.equinox.launcher-1.3.0.v20140415-2008.jar, -data, /jobs/genie.smarthome/PublishRelease/workspace/bundles/automation/org.eclipse.smarthome.automation.module.timer.test/target/work/data, -install, /jobs/genie.smarthome/PublishRelease/workspace/bundles/automation/org.eclipse.smarthome.automation.module.timer.test/target/work, -configuration, /jobs/genie.smarthome/PublishRelease/workspace/bundles/automation/org.eclipse.smarthome.automation.module.timer.test/target/work/configuration, -application, org.eclipse.tycho.surefire.osgibooter.headlesstest, -testproperties, /jobs/genie.smarthome/PublishRelease/workspace/bundles/automation/org.eclipse.smarthome.automation.module.timer.test/target/surefire.properties]
06:49:36.443 [Start Level: Equinox Container: 006ab1b4-411f-0016-1026-ff10e157781c] DEBUG o.e.s.core.internal.PortableBase64 - PortableBase64 class is running on JavaSE <=7
06:49:36.451 [Start Level: Equinox Container: 006ab1b4-411f-0016-1026-ff10e157781c] DEBUG o.e.s.core.internal.CoreActivator - Core bundle has been started.
06:49:36.998 [Start Level: Equinox Container: 006ab1b4-411f-0016-1026-ff10e157781c] DEBUG o.e.s.c.s.i.SchedulerActivator - Scheduler has been started.
06:49:37.100 [Start Level: Equinox Container: 006ab1b4-411f-0016-1026-ff10e157781c] INFO  org.quartz.impl.StdSchedulerFactory - Using default implementation for ThreadExecutor
06:49:37.113 [Start Level: Equinox Container: 006ab1b4-411f-0016-1026-ff10e157781c] INFO  org.quartz.simpl.SimpleThreadPool - Job execution threads will use class loader of thread: Start Level: Equinox Container: 006ab1b4-411f-0016-1026-ff10e157781c
06:49:37.161 [Start Level: Equinox Container: 006ab1b4-411f-0016-1026-ff10e157781c] INFO  o.quartz.core.SchedulerSignalerImpl - Initialized Scheduler Signaller of type: class org.quartz.core.SchedulerSignalerImpl
06:49:37.163 [Start Level: Equinox Container: 006ab1b4-411f-0016-1026-ff10e157781c] INFO  org.quartz.core.QuartzScheduler - Quartz Scheduler v.2.2.1 created.
06:49:37.166 [Start Level: Equinox Container: 006ab1b4-411f-0016-1026-ff10e157781c] INFO  org.quartz.simpl.RAMJobStore - RAMJobStore initialized.
06:49:37.169 [Start Level: Equinox Container: 006ab1b4-411f-0016-1026-ff10e157781c] INFO  org.quartz.core.QuartzScheduler - Scheduler meta-data: Quartz Scheduler (v2.2.1) 'DefaultQuartzScheduler' with instanceId 'NON_CLUSTERED'
  Scheduler class: 'org.quartz.core.QuartzScheduler' - running locally.
  NOT STARTED.
  Currently in standby mode.
  Number of jobs executed: 0
  Using thread pool 'org.quartz.simpl.SimpleThreadPool' - with 10 threads.
  Using job-store 'org.quartz.simpl.RAMJobStore' - which does not support persistence. and is not clustered.

06:49:37.169 [Start Level: Equinox Container: 006ab1b4-411f-0016-1026-ff10e157781c] INFO  org.quartz.impl.StdSchedulerFactory - Quartz scheduler 'DefaultQuartzScheduler' initialized from default resource file in Quartz package: 'quartz.properties'
06:49:37.169 [Start Level: Equinox Container: 006ab1b4-411f-0016-1026-ff10e157781c] INFO  org.quartz.impl.StdSchedulerFactory - Quartz scheduler version: 2.2.1
06:49:37.169 [Start Level: Equinox Container: 006ab1b4-411f-0016-1026-ff10e157781c] INFO  org.quartz.core.QuartzScheduler - Scheduler DefaultQuartzScheduler_$_NON_CLUSTERED started.
06:49:37.169 [DefaultQuartzScheduler_QuartzSchedulerThread] DEBUG o.quartz.core.QuartzSchedulerThread - batch acquisition of 0 triggers
06:49:37.216 [Start Level: Equinox Container: 006ab1b4-411f-0016-1026-ff10e157781c] DEBUG o.e.s.c.a.i.AutoUpdateActivator - AutoUpdate binding has been started.
06:49:37.282 [Start Level: Equinox Container: 006ab1b4-411f-0016-1026-ff10e157781c] DEBUG o.e.s.a.m.core.internal.Activator - started bundle automation.module
06:49:37.286 [Start Level: Equinox Container: 006ab1b4-411f-0016-1026-ff10e157781c] DEBUG o.e.s.a.m.timer.internal.Activator - started bundle timer.module
06:49:38.163 [Timer-0] DEBUG org.quartz.utils.UpdateChecker - Checking for available updated version of Quartz...
06:49:38.182 [Component Resolve Thread] DEBUG o.e.s.core.common.ThreadPoolManager - Created thread pool 'ConfigStatusService' with size 5-10

-------------------------------------------------------
 T E S T S
-------------------------------------------------------
Running org.eclipse.smarthome.automation.module.timer.internal.RuntimeRuleTest
06:49:39.454 [main] DEBUG o.e.s.c.c.registry.AbstractRegistry - Provider 'com.sun.proxy.$Proxy7' has been added.
06:49:39.465 [main] INFO  o.e.s.a.c.internal.RuleRegistryImpl - Rule provider: org.eclipse.smarthome.automation.core.internal.ManagedRuleProvider@57074779 is added.
06:49:39.474 [main] DEBUG o.e.s.c.c.registry.AbstractRegistry - Provider 'org.eclipse.smarthome.automation.core.internal.ManagedRuleProvider' has been added.
06:49:39.568 [main] DEBUG o.e.s.a.i.c.p.AutomationResourceBundlesEventQueue - Process bundle event 2, for automation bundle 'org.eclipse.smarthome.automation.module.core' 
06:49:39.571 [main] DEBUG o.e.s.a.i.c.p.AutomationResourceBundlesEventQueue - Process bundle event 2, for automation bundle 'org.eclipse.smarthome.automation.module.timer' 
06:49:39.599 [main] DEBUG o.e.s.c.c.registry.AbstractRegistry - Provider 'org.eclipse.smarthome.core.items.ManagedItemProvider' has been added.
06:49:39.615 [Automation Provider Processing Queue] DEBUG o.e.s.a.i.c.p.RuleResourceBundleImporter - Parse rules from bundle 'org.eclipse.smarthome.automation.module.core' 
06:49:39.618 [Automation Provider Processing Queue] DEBUG o.e.s.a.i.c.p.RuleResourceBundleImporter - Parse rules from bundle 'org.eclipse.smarthome.automation.module.timer' 
06:49:39.695 [main] INFO  o.e.s.a.m.t.internal.RuntimeRuleTest - Rule created: MyRule-328773492
06:49:39.718 [EventAdmin Async Event Dispatcher Thread] DEBUG o.e.s.core.common.ThreadPoolManager - Created thread pool 'safeCall' with size 5-10
06:49:39.804 [main] DEBUG o.e.s.a.core.internal.RuleEngine - Added rule 'MyRule-328773492'
06:49:39.835 [main] INFO  org.quartz.core.QuartzScheduler - Scheduler DefaultQuartzScheduler_$_NON_CLUSTERED started.
06:49:39.835 [DefaultQuartzScheduler_QuartzSchedulerThread] DEBUG o.quartz.core.QuartzSchedulerThread - batch acquisition of 0 triggers
06:49:39.845 [DefaultQuartzScheduler_QuartzSchedulerThread] DEBUG o.quartz.core.QuartzSchedulerThread - batch acquisition of 1 triggers
06:49:39.846 [main] DEBUG o.e.s.c.c.r.AbstractManagedProvider - Added new element MyRule-328773492 to ManagedRuleProvider.
06:49:39.848 [main] INFO  o.e.s.a.core.internal.RuleEngine - The rule rId = MyRule-328773492 is already enabled
06:49:39.850 [DefaultQuartzScheduler_QuartzSchedulerThread] DEBUG o.q.simpl.PropertySettingJobFactory - Producing instance of Job 'DEFAULT.TimerTrigger0b47c5e4-ec6b-4281-8385-2f05e1078540', class=org.eclipse.smarthome.automation.module.timer.handler.CallbackJob
NONE
06:49:39.861 [DefaultQuartzScheduler_Worker-1] DEBUG org.quartz.core.JobRunShell - Calling execute on job DEFAULT.TimerTrigger0b47c5e4-ec6b-4281-8385-2f05e1078540
06:49:39.861 [DefaultQuartzScheduler_Worker-1] DEBUG o.e.s.a.core.internal.RuleEngine - The trigger 'MyTimerTrigger' of rule 'MyRule-328773492' is triggred.
06:49:39.864 [DefaultQuartzScheduler_QuartzSchedulerThread] DEBUG o.quartz.core.QuartzSchedulerThread - batch acquisition of 1 triggers
06:49:39.865 [pool-2-thread-1] DEBUG o.e.s.a.m.c.h.ItemStateConditionHandler - ItemStateCondition 'MyItemStateCondition'checking if myLampItem (State=OFF) = OFF
06:49:39.865 [pool-2-thread-1] DEBUG o.e.s.a.m.c.h.ItemStateConditionHandler - ConditionSatisfied --> true
06:49:39.866 [pool-2-thread-1] DEBUG o.e.s.a.m.c.h.ItemPostCommandActionHandler - Executing ItemPostCommandAction on Item myLampItem with Command ON
06:49:39.866 [DefaultQuartzScheduler_QuartzSchedulerThread] DEBUG o.quartz.core.QuartzSchedulerThread - batch acquisition of 0 triggers
06:49:39.866 [pool-2-thread-1] DEBUG o.e.s.a.core.internal.RuleEngine - The rule 'MyRule-328773492' is executed.
06:49:39.919 [main] INFO  o.e.s.a.core.internal.RuleEngine - The rule rId = MyRule-328773492 is already enabled
06:49:40.959 [main] DEBUG o.e.s.c.c.registry.AbstractRegistry - Provider '$Proxy7' has been removed.
06:49:40.960 [main] INFO  o.e.s.a.c.internal.RuleRegistryImpl - Rule provider: org.eclipse.smarthome.automation.core.internal.ManagedRuleProvider@57074779 is removed.
06:49:40.961 [main] DEBUG o.e.s.c.c.registry.AbstractRegistry - Provider 'ManagedRuleProvider' has been removed.
06:49:40.963 [main] DEBUG o.e.s.c.c.registry.AbstractRegistry - Provider 'ManagedItemProvider' has been removed.
06:49:40.980 [main] DEBUG o.e.s.c.c.registry.AbstractRegistry - Provider 'com.sun.proxy.$Proxy7' has been added.
06:49:40.982 [main] INFO  o.e.s.a.c.internal.RuleRegistryImpl - Rule provider: org.eclipse.smarthome.automation.core.internal.ManagedRuleProvider@622155a0 is added.
06:49:40.982 [main] DEBUG o.e.s.c.c.registry.AbstractRegistry - Provider 'org.eclipse.smarthome.automation.core.internal.ManagedRuleProvider' has been added.
06:49:40.987 [main] DEBUG o.e.s.c.c.registry.AbstractRegistry - Provider 'org.eclipse.smarthome.core.items.ManagedItemProvider' has been added.
06:49:41.009 [main] DEBUG o.e.s.c.c.registry.AbstractRegistry - Provider '$Proxy7' has been removed.
06:49:41.010 [main] INFO  o.e.s.a.c.internal.RuleRegistryImpl - Rule provider: org.eclipse.smarthome.automation.core.internal.ManagedRuleProvider@622155a0 is removed.
06:49:41.010 [main] DEBUG o.e.s.c.c.registry.AbstractRegistry - Provider 'ManagedRuleProvider' has been removed.
06:49:41.012 [main] DEBUG o.e.s.c.c.registry.AbstractRegistry - Provider 'ManagedItemProvider' has been removed.
Tests run: 2, Failures: 1, Errors: 0, Skipped: 0, Time elapsed: 2.442 sec <<< FAILURE! - in org.eclipse.smarthome.automation.module.timer.internal.RuntimeRuleTest
assert that timerTrigger works(org.eclipse.smarthome.automation.module.timer.internal.RuntimeRuleTest)  Time elapsed: 1.708 sec  <<< FAILURE!
java.lang.AssertionError: 
Expected: is <ON>
     but: was <OFF>
	at org.hamcrest.MatcherAssert.assertThat(MatcherAssert.java:20)
	at org.junit.Assert.assertThat(Assert.java:865)
	at org.junit.Assert.assertThat(Assert.java:832)
	at org.junit.Assert$assertThat.callStatic(Unknown Source)
	at org.eclipse.smarthome.automation.module.timer.internal.RuntimeRuleTest$_assert_that_timerTrigger_works_closure10.doCall(RuntimeRuleTest.groovy:122)
	at org.eclipse.smarthome.automation.module.timer.internal.RuntimeRuleTest$_assert_that_timerTrigger_works_closure10.doCall(RuntimeRuleTest.groovy)
	at sun.reflect.GeneratedMethodAccessor5.invoke(Unknown Source)
	at sun.reflect.DelegatingMethodAccessorImpl.invoke(DelegatingMethodAccessorImpl.java:43)
	at java.lang.reflect.Method.invoke(Method.java:606)
	at org.codehaus.groovy.reflection.CachedMethod.invoke(CachedMethod.java:90)
	at groovy.lang.MetaMethod.doMethodInvoke(MetaMethod.java:324)
	at org.codehaus.groovy.runtime.metaclass.ClosureMetaClass.invokeMethod(ClosureMetaClass.java:278)
	at groovy.lang.MetaClassImpl.invokeMethod(MetaClassImpl.java:1016)
	at org.codehaus.groovy.runtime.callsite.PogoMetaClassSite.call(PogoMetaClassSite.java:39)
	at org.codehaus.groovy.runtime.callsite.CallSiteArray.defaultCall(CallSiteArray.java:45)
	at org.codehaus.groovy.runtime.callsite.AbstractCallSite.call(AbstractCallSite.java:108)
	at org.codehaus.groovy.runtime.callsite.AbstractCallSite.call(AbstractCallSite.java:112)
	at org.eclipse.smarthome.test.OSGiTest.waitForAssert(OSGiTest.groovy:181)
	at org.eclipse.smarthome.test.OSGiTest.waitForAssert(OSGiTest.groovy)
	at sun.reflect.NativeMethodAccessorImpl.invoke0(Native Method)
	at sun.reflect.NativeMethodAccessorImpl.invoke(NativeMethodAccessorImpl.java:57)
	at sun.reflect.DelegatingMethodAccessorImpl.invoke(DelegatingMethodAccessorImpl.java:43)
	at java.lang.reflect.Method.invoke(Method.java:606)
	at org.codehaus.groovy.runtime.callsite.PogoMetaMethodSite$PogoCachedMethodSiteNoUnwrapNoCoerce.invoke(PogoMetaMethodSite.java:207)
	at org.codehaus.groovy.runtime.callsite.PogoMetaMethodSite.callCurrent(PogoMetaMethodSite.java:56)
	at org.codehaus.groovy.runtime.callsite.CallSiteArray.defaultCallCurrent(CallSiteArray.java:49)
	at org.codehaus.groovy.runtime.callsite.AbstractCallSite.callCurrent(AbstractCallSite.java:133)
	at org.codehaus.groovy.runtime.callsite.AbstractCallSite.callCurrent(AbstractCallSite.java:141)
	at org.eclipse.smarthome.automation.module.timer.internal.RuntimeRuleTest.assert that timerTrigger works(RuntimeRuleTest.groovy:121)

check if timer trigger moduleType is registered(org.eclipse.smarthome.automation.module.timer.internal.RuntimeRuleTest)  Time elapsed: 0.036 sec

Results :

Failed tests: 
  RuntimeRuleTest.assert that timerTrigger works:121->OSGiTest.waitForAssert:-1->OSGiTest.waitForAssert:181 
Expected: is <ON>
     but: was <OFF>

Tests run: 2, Failures: 1, Errors: 0, Skipped: 0

06:49:41.093 [Framework stop] DEBUG o.e.s.c.x.o.XmlDocumentBundleTracker - Removing the XML related objects from module 'org.eclipse.osgi'...
06:49:41.108 [Framework stop] DEBUG o.e.s.c.x.o.XmlDocumentBundleTracker - Removing the XML related objects from module 'org.eclipse.smarthome.automation.module.timer.test'...
06:49:41.110 [Framework stop] DEBUG o.e.s.c.x.o.XmlDocumentBundleTracker - Removing the XML related objects from module 'org.eclipse.smarthome.config.xml'...
06:49:41.111 [Framework stop] DEBUG o.e.s.c.x.o.XmlDocumentBundleTracker - Removing the XML related objects from module 'org.eclipse.equinox.registry'...
06:49:41.111 [Framework stop] DEBUG o.e.s.c.x.o.XmlDocumentBundleTracker - Removing the XML related objects from module 'org.eclipse.smarthome.core.autoupdate'...
06:49:41.111 [Framework stop] DEBUG o.e.s.c.x.o.XmlDocumentBundleTracker - Removing the XML related objects from module 'org.eclipse.smarthome.core.scheduler'...
06:49:41.111 [Framework stop] DEBUG o.e.s.c.x.o.XmlDocumentBundleTracker - Removing the XML related objects from module 'org.eclipse.smarthome.core'...
06:49:41.111 [Framework stop] DEBUG o.e.s.c.x.o.XmlDocumentBundleTracker - Removing the XML related objects from module 'org.eclipse.core.runtime'...
06:49:41.112 [Framework stop] DEBUG o.e.s.c.x.o.XmlDocumentBundleTracker - Removing the XML related objects from module 'org.eclipse.equinox.ds'...
06:49:41.112 [Framework stop] DEBUG o.e.s.c.x.o.XmlDocumentBundleTracker - Removing the XML related objects from module 'org.eclipse.smarthome.automation.providers'...
06:49:41.112 [Framework stop] DEBUG o.e.s.c.x.o.XmlDocumentBundleTracker - Removing the XML related objects from module 'org.eclipse.equinox.common'...
06:49:41.112 [Framework stop] DEBUG o.e.s.c.x.o.XmlDocumentBundleTracker - Removing the XML related objects from module 'org.eclipse.equinox.event'...
06:49:41.112 [Framework stop] DEBUG o.e.s.c.x.o.XmlDocumentBundleTracker - Removing the XML related objects from module 'org.eclipse.equinox.app'...
06:49:41.112 [Framework stop] DEBUG o.e.s.c.x.o.XmlDocumentBundleTracker - Removing the XML related objects from module 'org.eclipse.tycho.surefire.osgibooter'...
06:49:41.112 [Framework stop] DEBUG o.e.s.c.x.o.XmlDocumentBundleTracker - Removing the XML related objects from module 'org.eclipse.smarthome.automation.module.timer'...
06:49:41.112 [Framework stop] DEBUG o.e.s.c.x.o.XmlDocumentBundleTracker - Removing the XML related objects from module 'org.eclipse.equinox.util'...
06:49:41.112 [Framework stop] DEBUG o.e.s.c.x.o.XmlDocumentBundleTracker - Removing the XML related objects from module 'org.eclipse.smarthome.config.core'...
06:49:41.112 [Framework stop] DEBUG o.e.s.c.x.o.XmlDocumentBundleTracker - Removing the XML related objects from module 'org.eclipse.smarthome.automation.parser.gson'...
06:49:41.112 [Framework stop] DEBUG o.e.s.c.x.o.XmlDocumentBundleTracker - Removing the XML related objects from module 'org.eclipse.smarthome.automation.core'...
06:49:41.113 [Framework stop] DEBUG o.e.s.c.x.o.XmlDocumentBundleTracker - Removing the XML related objects from module 'org.eclipse.core.contenttype'...
06:49:41.113 [Framework stop] DEBUG o.e.s.c.x.o.XmlDocumentBundleTracker - Removing the XML related objects from module 'org.hamcrest.core'...
06:49:41.113 [Framework stop] DEBUG o.e.s.c.x.o.XmlDocumentBundleTracker - Removing the XML related objects from module 'org.codehaus.groovy'...
06:49:41.113 [Framework stop] DEBUG o.e.s.c.x.o.XmlDocumentBundleTracker - Removing the XML related objects from module 'org.eclipse.core.jobs'...
06:49:41.113 [Framework stop] DEBUG o.e.s.c.x.o.XmlDocumentBundleTracker - Removing the XML related objects from module 'org.eclipse.smarthome.automation.module.core'...
06:49:41.113 [Framework stop] DEBUG o.e.s.c.x.o.XmlDocumentBundleTracker - Removing the XML related objects from module 'org.eclipse.equinox.preferences'...
06:49:41.113 [Framework stop] DEBUG o.e.s.c.x.o.XmlDocumentBundleTracker - Removing the XML related objects from module 'org.eclipse.smarthome.automation.api'...
06:49:41.246 [Timer-0] DEBUG org.quartz.utils.UpdateChecker - Quartz version update check failed: connect timed out
06:49:42.267 [Framework stop] DEBUG o.e.s.c.a.i.AutoUpdateActivator - AutoUpdate binding has been stopped.
06:49:42.414 [Framework stop] DEBUG o.e.s.c.s.i.SchedulerActivator - Scheduler has been stopped.
06:49:42.415 [Framework stop] INFO  org.quartz.core.QuartzScheduler - Scheduler DefaultQuartzScheduler_$_NON_CLUSTERED shutting down.
06:49:42.415 [Framework stop] INFO  org.quartz.core.QuartzScheduler - Scheduler DefaultQuartzScheduler_$_NON_CLUSTERED paused.
06:49:42.415 [Framework stop] DEBUG org.quartz.simpl.SimpleThreadPool - Shutting down threadpool...
06:49:42.416 [Framework stop] DEBUG org.quartz.simpl.SimpleThreadPool - Shutdown of threadpool complete.
06:49:42.416 [Framework stop] INFO  org.quartz.core.QuartzScheduler - Scheduler DefaultQuartzScheduler_$_NON_CLUSTERED shutdown complete.
06:49:42.418 [Framework stop] DEBUG o.e.s.core.internal.CoreActivator - Core bundle has been stopped.
06:49:42.616 [DefaultQuartzScheduler_Worker-4] DEBUG org.quartz.simpl.SimpleThreadPool - WorkerThread is shut down.
06:49:42.616 [DefaultQuartzScheduler_Worker-2] DEBUG org.quartz.simpl.SimpleThreadPool - WorkerThread is shut down.
06:49:42.618 [DefaultQuartzScheduler_Worker-6] DEBUG org.quartz.simpl.SimpleThreadPool - WorkerThread is shut down.
06:49:42.617 [DefaultQuartzScheduler_Worker-3] DEBUG org.quartz.simpl.SimpleThreadPool - WorkerThread is shut down.
06:49:42.619 [DefaultQuartzScheduler_Worker-7] DEBUG org.quartz.simpl.SimpleThreadPool - WorkerThread is shut down.
06:49:42.619 [DefaultQuartzScheduler_Worker-8] DEBUG org.quartz.simpl.SimpleThreadPool - WorkerThread is shut down.
06:49:42.619 [DefaultQuartzScheduler_Worker-9] DEBUG org.quartz.simpl.SimpleThreadPool - WorkerThread is shut down.
06:49:42.619 [DefaultQuartzScheduler_Worker-5] DEBUG org.quartz.simpl.SimpleThreadPool - WorkerThread is shut down.
06:49:42.619 [DefaultQuartzScheduler_Worker-10] DEBUG org.quartz.simpl.SimpleThreadPool - WorkerThread is shut down.
[INFO] ------------------------------------------------------------------------
[INFO] Reactor Summary:
[INFO] 
[INFO] Eclipse SmartHome .................................. SUCCESS [ 10.025 s]
[INFO] Eclipse SmartHome Bundles .......................... SUCCESS [  0.420 s]
[INFO] Eclipse SmartHome Test Components .................. SUCCESS [  0.089 s]
[INFO] Eclipse SmartHome Core Components .................. SUCCESS [  0.092 s]
[INFO] Eclipse SmartHome Core ............................. SUCCESS [  9.612 s]
[INFO] Eclipse SmartHome Configurations ................... SUCCESS [  0.087 s]
[INFO] Eclipse SmartHome Configuration Core ............... SUCCESS [  3.977 s]
[INFO] Eclipse SmartHome I/O Components ................... SUCCESS [  0.090 s]
[INFO] Eclipse SmartHome Console .......................... SUCCESS [  2.664 s]
[INFO] Eclipse SmartHome Thing ............................ SUCCESS [  4.424 s]
[INFO] Eclipse SmartHome Configuration XML ................ SUCCESS [  6.006 s]
[INFO] Eclipse SmartHome AutoUpdate Binding ............... SUCCESS [  2.424 s]
[INFO] Eclipse SmartHome Test ............................. SUCCESS [  3.837 s]
[INFO] Eclipse SmartHome Configuration Dispatcher ......... SUCCESS [  2.458 s]
[INFO] Eclipse SmartHome Configuration Core Tests ......... SUCCESS [ 15.113 s]
[INFO] Eclipse SmartHome Configuration Discovery .......... SUCCESS [  2.932 s]
[INFO] Eclipse SmartHome Configuration Discovery Tests .... SUCCESS [ 20.712 s]
[INFO] Eclipse SmartHome Config XML Tests ................. SUCCESS [ 15.142 s]
[INFO] Eclipse SmartHome Sample Extension Service ......... SUCCESS [  2.378 s]
[INFO] Eclipse SmartHome mDNS Service ..................... SUCCESS [  2.543 s]
[INFO] Eclipse SmartHome REST Interface ................... SUCCESS [  2.653 s]
[INFO] Eclipse SmartHome Core ID .......................... SUCCESS [  2.517 s]
[INFO] Eclipse SmartHome Thing Tests ...................... SUCCESS [ 11.246 s]
[INFO] Eclipse SmartHome Core Tests ....................... SUCCESS [ 21.005 s]
[INFO] Eclipse SmartHome Thing Tests ...................... SUCCESS [ 18.322 s]
[INFO] Eclipse SmartHome Core Persistence ................. SUCCESS [  2.516 s]
[INFO] Eclipse SmartHome Core Scheduler Service ........... SUCCESS [  6.616 s]
[INFO] Eclipse SmartHome Core Transformation Service ...... SUCCESS [  2.405 s]
[INFO] Eclipse SmartHome Core Binding XML ................. SUCCESS [  2.820 s]
[INFO] Eclipse SmartHome Core Binding XML Tests ........... SUCCESS [ 13.289 s]
[INFO] Eclipse SmartHome Core Thing XML ................... SUCCESS [  2.840 s]
[INFO] Eclipse SmartHome Core Thing XML Tests ............. SUCCESS [ 14.024 s]
[INFO] Eclipse SmartHome Automation ....................... SUCCESS [  0.089 s]
[INFO] Eclipse SmartHome Automation API ................... SUCCESS [  2.676 s]
[INFO] Eclipse SmartHome Automation Commands .............. SUCCESS [  2.805 s]
[INFO] Eclipse SmartHome Automation Parser GSON ........... SUCCESS [  2.307 s]
[INFO] Eclipse SmartHome Automation Providers ............. SUCCESS [  2.413 s]
[INFO] Eclipse SmartHome Automation Core .................. SUCCESS [  2.999 s]
[INFO] Eclipse SmartHome Automation Core Tests ............ SUCCESS [ 10.346 s]
[INFO] Eclipse SmartHome Automation Sample JSON ........... SUCCESS [  2.454 s]
[INFO] Eclipse SmartHome Automation Core Modules .......... SUCCESS [  2.432 s]
[INFO] Eclipse SmartHome Automation Core Module Tests ..... SUCCESS [ 12.838 s]
[INFO] Eclipse SmartHome Automation Timer Modules ......... SUCCESS [  2.504 s]
[INFO] Eclipse SmartHome Automation Module Timer Tests .... FAILURE [ 11.697 s]
[INFO] Eclipse SmartHome Automation Script Modules ........ SKIPPED
[INFO] Eclipse SmartHome Models ........................... SKIPPED
[INFO] Eclipse SmartHome Model Core ....................... SKIPPED
[INFO] Eclipse SmartHome Model Lazy Generation ............ SKIPPED
[INFO] Eclipse SmartHome Model Items ...................... SKIPPED
[INFO] Eclipse SmartHome Model Persistence ................ SKIPPED
[INFO] Eclipse SmartHome Automation Script Default Scope .. SKIPPED
[INFO] Eclipse SmartHome Automation Script Module Tests ... SKIPPED
[INFO] Eclipse SmartHome Automation Event Tests ........... SKIPPED
[INFO] Eclipse SmartHome Automation Integration Tests ..... SKIPPED
[INFO] Eclipse SmartHome Automation Sample Extension Java . SKIPPED
[INFO] Eclipse SmartHome Automation REST API .............. SKIPPED
[INFO] Eclipse SmartHome Automation Sample REST API ....... SKIPPED
[INFO] Eclipse SmartHome Designer Bundles ................. SKIPPED
[INFO] Eclipse SmartHome Network I/O ...................... SKIPPED
[INFO] Eclipse SmartHome Model Script ..................... SKIPPED
[INFO] Eclipse SmartHome Designer Core Plugin ............. SKIPPED
[INFO] Eclipse SmartHome Designer UI Plugin ............... SKIPPED
[INFO] Eclipse SmartHome Audio I/O ........................ SKIPPED
[INFO] Eclipse SmartHome Console for OSGi framework Eclipse Equinox SKIPPED
[INFO] Eclipse SmartHome Console for OSGi Console RFC 147 . SKIPPED
[INFO] Eclipse SmartHome Console for OSGi runtime Karaf ... SKIPPED
[INFO] Eclipse SmartHome Monitor .......................... SKIPPED
[INFO] Eclipse SmartHome Network I/O Tests ................ SKIPPED
[INFO] Eclipse SmartHome IO REST Tests .................... SKIPPED
[INFO] Eclipse SmartHome Core REST Interface .............. SKIPPED
[INFO] Eclipse SmartHome IO REST Core Tests ............... SKIPPED
[INFO] Eclipse SmartHome SSE Interface .................... SKIPPED
[INFO] Eclipse SmartHome IO SSE Tests ..................... SKIPPED
[INFO] Eclipse SmartHome Model Sitemap .................... SKIPPED
[INFO] Eclipse SmartHome UIs .............................. SKIPPED
[INFO] Eclipse SmartHome UI ............................... SKIPPED
[INFO] Eclipse SmartHome Sitemap REST Interface ........... SKIPPED
[INFO] Eclipse SmartHome MQTT Transport ................... SKIPPED
[INFO] Eclipse SmartHome UPnP Transport ................... SKIPPED
[INFO] Eclipse SmartHome IO UPnP Tests .................... SKIPPED
[INFO] Eclipse SmartHome Voice I/O ........................ SKIPPED
[INFO] Eclipse SmartHome Model Items Runtime .............. SKIPPED
[INFO] Eclipse SmartHome Model Item UI .................... SKIPPED
[INFO] Eclipse SmartHome Items Model Tests ................ SKIPPED
[INFO] Eclipse SmartHome Model Persistence Runtime ........ SKIPPED
[INFO] Eclipse SmartHome Model Persistence UI ............. SKIPPED
[INFO] Eclipse SmartHome Model Persistence Tests .......... SKIPPED
[INFO] Eclipse SmartHome Model Rules ...................... SKIPPED
[INFO] Eclipse SmartHome Model Rules Runtime .............. SKIPPED
[INFO] Eclipse SmartHome Model Script UI .................. SKIPPED
[INFO] Eclipse SmartHome Model Rules UI ................... SKIPPED
[INFO] Eclipse SmartHome Model Rules Tests ................ SKIPPED
[INFO] Eclipse SmartHome Model Script Runtime ............. SKIPPED
[INFO] Eclipse SmartHome Model Script Tests ............... SKIPPED
[INFO] Eclipse SmartHome Model Sitemap Runtime ............ SKIPPED
[INFO] Eclipse SmartHome Model Sitemap UI Plugin .......... SKIPPED
[INFO] Eclipse SmartHome Thing Model ...................... SKIPPED
[INFO] Eclipse SmartHome Thing Model Runtime .............. SKIPPED
[INFO] Eclipse SmartHome Thing Model UI ................... SKIPPED
[INFO] Eclipse SmartHome Thing Model Tests ................ SKIPPED
[INFO] Eclipse SmartHome UI Tests ......................... SKIPPED
[INFO] Eclipse SmartHome UI Icon Support .................. SKIPPED
[INFO] Eclipse SmartHome UI Icon Tests .................... SKIPPED
[INFO] Eclipse SmartHome Storages ......................... SKIPPED
[INFO] Eclipse SmartHome MapDB Storage .................... SKIPPED
[INFO] Eclipse SmartHome Storage MapDB Tests .............. SKIPPED
[INFO] Eclipse SmartHome Extensions ....................... SKIPPED
[INFO] Eclipse SmartHome Bindings ......................... SKIPPED
[INFO] DigitalSTROM Binding ............................... SKIPPED
[INFO] Eclipse SmartHome hue Binding ...................... SKIPPED
[INFO] Eclipse SmartHome hue Binding Tests ................ SKIPPED
[INFO] Eclipse SmartHome FSInternetRadio Binding .......... SKIPPED
[INFO] Eclipse SmartHome LIFX Binding ..................... SKIPPED
[INFO] Eclipse SmartHome NTP Binding ...................... SKIPPED
[INFO] Eclipse SmartHome Sonos Binding .................... SKIPPED
[INFO] Eclipse SmartHome WeMo Binding ..................... SKIPPED
[INFO] Eclipse SmartHome YahooWeather Binding ............. SKIPPED
[INFO] Eclipse SmartHome Transformation Services .......... SKIPPED
[INFO] Eclipse SmartHome Exec Transform Service ........... SKIPPED
[INFO] Eclipse SmartHome Javascript Transform Service ..... SKIPPED
[INFO] Eclipse SmartHome Map Transform Service ............ SKIPPED
[INFO] Eclipse SmartHome Map Transformation Service Tests . SKIPPED
[INFO] Eclipse SmartHome Scale Transform Service .......... SKIPPED
[INFO] Eclipse SmartHome Scale Transformation Service Tests SKIPPED
[INFO] Eclipse SmartHome RegEx Transform Service .......... SKIPPED
[INFO] Eclipse SmartHome RegEx Transformation Service Tests SKIPPED
[INFO] Eclipse SmartHome XPath Transform Service .......... SKIPPED
[INFO] Eclipse SmartHome XPath Transformation Service Tests SKIPPED
[INFO] Eclipse SmartHome JSonPath Transform Service ....... SKIPPED
[INFO] Eclipse SmartHome JSonPath Transformation Service Tests SKIPPED
[INFO] Eclipse SmartHome Xslt Transform Service ........... SKIPPED
[INFO] Eclipse SmartHome Xslt Transformation Service Tests  SKIPPED
[INFO] Eclipse SmartHome UI Extensions .................... SKIPPED
[INFO] Eclipse SmartHome Icon Sets ........................ SKIPPED
[INFO] Eclipse SmartHome Classic Icon Set ................. SKIPPED
[INFO] Eclipse SmartHome Basic UI ......................... SKIPPED
[INFO] Eclipse SmartHome Classic UI ....................... SKIPPED
[INFO] Eclipse SmartHome Paper UI ......................... SKIPPED
[INFO] Eclipse SmartHome Voice Services ................... SKIPPED
[INFO] Eclipse SmartHome MacOS TTS ........................ SKIPPED
[INFO] Eclipse SmartHome Features ......................... SKIPPED
[INFO] Eclipse SmartHome Runtime Core Feature ............. SKIPPED
[INFO] Eclipse SmartHome Runtime Model Feature ............ SKIPPED
[INFO] Eclipse SmartHome Runtime UI Feature ............... SKIPPED
[INFO] Eclipse SmartHome Runtime REST Feature ............. SKIPPED
[INFO] Eclipse SmartHome Runtime Automation Feature ....... SKIPPED
[INFO] Eclipse SmartHome Runtime Equinox Console Feature .. SKIPPED
[INFO] Eclipse SmartHome Runtime RfC147 Console Feature ... SKIPPED
[INFO] Eclipse SmartHome Runtime Binding Feature .......... SKIPPED
[INFO] Eclipse SmartHome Designer Dependencies ............ SKIPPED
[INFO] Eclipse SmartHome Designer Feature ................. SKIPPED
[INFO] Eclipse SmartHome Test Dependencies ................ SKIPPED
[INFO] Eclipse SmartHome Karaf Feature .................... SKIPPED
[INFO] Eclipse SmartHome Karaf Target Platform Feature .... SKIPPED
[INFO] Eclipse SmartHome Karaf Feature Verification ....... SKIPPED
[INFO] Eclipse SmartHome Products ......................... SKIPPED
[INFO] Eclipse SmartHome Designer RCP Application ......... SKIPPED
[INFO] Eclipse SmartHome p2 Repository .................... SKIPPED
[INFO] Eclipse SmartHome Tools ............................ SKIPPED
[INFO] Eclipse SmartHome Archetypes ....................... SKIPPED
[INFO] Eclipse Smarthome Binding Archetype ................ SKIPPED
[INFO] Eclipse Smarthome Binding Archetype Testsuite ...... SKIPPED
[INFO] Eclipse SmartHome Target Platform .................. SKIPPED
[INFO] Eclipse SmartHome Distribution ..................... SKIPPED
[INFO] ------------------------------------------------------------------------
[INFO] BUILD FAILURE
[INFO] ------------------------------------------------------------------------
[INFO] Total time: 05:37 min
[INFO] Finished at: 2016-05-21T06:49:42-04:00
[INFO] Final Memory: 206M/637M
[INFO] ------------------------------------------------------------------------
[INFO] o.h.m.e.h.MavenExecutionResultHandler - Build failed with exception(s)
[INFO] o.h.m.e.h.MavenExecutionResultHandler - [1] org.apache.maven.lifecycle.LifecycleExecutionException: Failed to execute goal org.eclipse.tycho:tycho-surefire-plugin:0.23.1:test (default-test) on project org.eclipse.smarthome.automation.module.timer.test: There are test failures.

Please refer to /jobs/genie.smarthome/PublishRelease/workspace/bundles/automation/org.eclipse.smarthome.automation.module.timer.test/target/surefire-reports for the individual test results.
[DEBUG] Closing connection to remote
[ERROR] Failed to execute goal org.eclipse.tycho:tycho-surefire-plugin:0.23.1:test (default-test) on project org.eclipse.smarthome.automation.module.timer.test: There are test failures.
[ERROR] 
[ERROR] Please refer to /jobs/genie.smarthome/PublishRelease/workspace/bundles/automation/org.eclipse.smarthome.automation.module.timer.test/target/surefire-reports for the individual test results.
[ERROR] -> [Help 1]
[ERROR] 
[ERROR] To see the full stack trace of the errors, re-run Maven with the -e switch.
[ERROR] Re-run Maven using the -X switch to enable full debug logging.
[ERROR] 
[ERROR] For more information about the errors and possible solutions, please read the following articles:
[ERROR] [Help 1] http://cwiki.apache.org/confluence/display/MAVEN/MojoFailureException
[ERROR] 
[ERROR] After correcting the problems, you can resume the build with the command
[ERROR]   mvn <goals> -rf :org.eclipse.smarthome.automation.module.timer.test
[DEBUG] Waiting for process to finish
[DEBUG] Result: 1
Archiving artifacts
Finished: FAILURE