FailedConsole Output

Skipping 2,889 KB.. Full Log
/org.eclipse.smarthome.transform.scale/src/main/groovy added.
[INFO] 
[INFO] --- maven-resources-plugin:2.4.3:resources (default-resources) @ org.eclipse.smarthome.transform.scale ---
[INFO] Using 'UTF-8' encoding to copy filtered resources.
[INFO] Copying 1 resource
[INFO] 
[INFO] --- tycho-compiler-plugin:0.23.1:compile (default-compile) @ org.eclipse.smarthome.transform.scale ---
[INFO] Nothing to compile - all classes are up to date
[INFO] 
[INFO] --- maven-compiler-plugin:3.1:compile (default) @ org.eclipse.smarthome.transform.scale ---
[INFO] Changes detected - recompiling the module!
[INFO] Nothing to compile - all classes are up to date
[INFO] 
[INFO] --- xtend-maven-plugin:2.6.2:xtend-install-debug-info (default) @ org.eclipse.smarthome.transform.scale ---
[WARNING] Directory /jobs/genie.smarthome/PublishRelease/workspace/extensions/transform/org.eclipse.smarthome.transform.scale/xtend-gen is empty. Can't process.
[WARNING] Directory /jobs/genie.smarthome/PublishRelease/workspace/extensions/transform/org.eclipse.smarthome.transform.scale/src/main/groovy is empty. Can't process.
[INFO] Installing Xtend files into 0 class files as secondary (via SMAP) debug sources in: /jobs/genie.smarthome/PublishRelease/workspace/extensions/transform/org.eclipse.smarthome.transform.scale/target/classes
[INFO] 
[INFO] --- xtend-maven-plugin:2.6.2:testCompile (default) @ org.eclipse.smarthome.transform.scale ---
[INFO] skip compiling sources because the configured directory '[/jobs/genie.smarthome/PublishRelease/workspace/extensions/transform/org.eclipse.smarthome.transform.scale/src/test/java]' does not exists.
[INFO] 
[INFO] --- build-helper-maven-plugin:1.8:add-test-source (add-test-source) @ org.eclipse.smarthome.transform.scale ---
[INFO] Test Source directory: /jobs/genie.smarthome/PublishRelease/workspace/extensions/transform/org.eclipse.smarthome.transform.scale/src/test/groovy added.
[INFO] 
[INFO] --- maven-resources-plugin:2.4.3:testResources (default-testResources) @ org.eclipse.smarthome.transform.scale ---
[INFO] Using 'UTF-8' encoding to copy filtered resources.
[INFO] skip non existing resourceDirectory /jobs/genie.smarthome/PublishRelease/workspace/extensions/transform/org.eclipse.smarthome.transform.scale/src/test/resources
[INFO] 
[INFO] --- xtend-maven-plugin:2.6.2:xtend-test-install-debug-info (default) @ org.eclipse.smarthome.transform.scale ---
[WARNING] Directory /jobs/genie.smarthome/PublishRelease/workspace/extensions/transform/org.eclipse.smarthome.transform.scale/src/test/java is empty. Can't process.
[WARNING] Directory /jobs/genie.smarthome/PublishRelease/workspace/extensions/transform/org.eclipse.smarthome.transform.scale/xtend-gen is empty. Can't process.
[WARNING] Directory /jobs/genie.smarthome/PublishRelease/workspace/extensions/transform/org.eclipse.smarthome.transform.scale/src/test/groovy is empty. Can't process.
[INFO] Installing Xtend files into 0 class files as secondary (via SMAP) debug sources in: /jobs/genie.smarthome/PublishRelease/workspace/extensions/transform/org.eclipse.smarthome.transform.scale/target/test-classes
[INFO] 
[INFO] --- tycho-source-plugin:0.23.1:plugin-source (plugin-source) @ org.eclipse.smarthome.transform.scale ---
[WARNING] bundle localization file /jobs/genie.smarthome/PublishRelease/workspace/extensions/transform/org.eclipse.smarthome.transform.scale/plugin.properties not found
[INFO] Building jar: /jobs/genie.smarthome/PublishRelease/workspace/extensions/transform/org.eclipse.smarthome.transform.scale/target/org.eclipse.smarthome.transform.scale-0.8.0.b2-sources.jar
[INFO] 
[INFO] --- target-platform-configuration:0.23.1:target-platform (default-target-platform) @ org.eclipse.smarthome.transform.scale ---
[INFO] 
[INFO] --- tycho-packaging-plugin:0.23.1:package-plugin (default-package-plugin) @ org.eclipse.smarthome.transform.scale ---
[INFO] Building jar: /jobs/genie.smarthome/PublishRelease/workspace/extensions/transform/org.eclipse.smarthome.transform.scale/target/org.eclipse.smarthome.transform.scale-0.8.0.b2.jar
[INFO] 
[INFO] --- tycho-p2-plugin:0.23.1:p2-metadata-default (default-p2-metadata-default) @ org.eclipse.smarthome.transform.scale ---
[INFO] 
[INFO] --- maven-deploy-plugin:2.5:deploy (default-cli) @ org.eclipse.smarthome.transform.scale ---
Uploading: https://repo.eclipse.org/content/repositories/smarthome-releases/org/eclipse/smarthome/transform/org.eclipse.smarthome.transform.scale/0.8.0.b2/org.eclipse.smarthome.transform.scale-0.8.0.b2.jar
Uploaded: https://repo.eclipse.org/content/repositories/smarthome-releases/org/eclipse/smarthome/transform/org.eclipse.smarthome.transform.scale/0.8.0.b2/org.eclipse.smarthome.transform.scale-0.8.0.b2.jar (8 KB at 83.2 KB/sec)
Uploading: https://repo.eclipse.org/content/repositories/smarthome-releases/org/eclipse/smarthome/transform/org.eclipse.smarthome.transform.scale/0.8.0.b2/org.eclipse.smarthome.transform.scale-0.8.0.b2.pom
Uploaded: https://repo.eclipse.org/content/repositories/smarthome-releases/org/eclipse/smarthome/transform/org.eclipse.smarthome.transform.scale/0.8.0.b2/org.eclipse.smarthome.transform.scale-0.8.0.b2.pom (652 B at 7.3 KB/sec)
Downloading: https://repo.eclipse.org/content/repositories/smarthome-releases/org/eclipse/smarthome/transform/org.eclipse.smarthome.transform.scale/maven-metadata.xml
Downloaded: https://repo.eclipse.org/content/repositories/smarthome-releases/org/eclipse/smarthome/transform/org.eclipse.smarthome.transform.scale/maven-metadata.xml (354 B at 8.2 KB/sec)
Uploading: https://repo.eclipse.org/content/repositories/smarthome-releases/org/eclipse/smarthome/transform/org.eclipse.smarthome.transform.scale/maven-metadata.xml
Uploaded: https://repo.eclipse.org/content/repositories/smarthome-releases/org/eclipse/smarthome/transform/org.eclipse.smarthome.transform.scale/maven-metadata.xml (388 B at 4.1 KB/sec)
Uploading: https://repo.eclipse.org/content/repositories/smarthome-releases/org/eclipse/smarthome/transform/org.eclipse.smarthome.transform.scale/0.8.0.b2/org.eclipse.smarthome.transform.scale-0.8.0.b2-sources.jar
Uploaded: https://repo.eclipse.org/content/repositories/smarthome-releases/org/eclipse/smarthome/transform/org.eclipse.smarthome.transform.scale/0.8.0.b2/org.eclipse.smarthome.transform.scale-0.8.0.b2-sources.jar (4 KB at 38.5 KB/sec)
Uploading: https://repo.eclipse.org/content/repositories/smarthome-releases/org/eclipse/smarthome/transform/org.eclipse.smarthome.transform.scale/0.8.0.b2/org.eclipse.smarthome.transform.scale-0.8.0.b2-p2metadata.xml
Uploaded: https://repo.eclipse.org/content/repositories/smarthome-releases/org/eclipse/smarthome/transform/org.eclipse.smarthome.transform.scale/0.8.0.b2/org.eclipse.smarthome.transform.scale-0.8.0.b2-p2metadata.xml (4 KB at 54.6 KB/sec)
Uploading: https://repo.eclipse.org/content/repositories/smarthome-releases/org/eclipse/smarthome/transform/org.eclipse.smarthome.transform.scale/0.8.0.b2/org.eclipse.smarthome.transform.scale-0.8.0.b2-p2artifacts.xml
Uploaded: https://repo.eclipse.org/content/repositories/smarthome-releases/org/eclipse/smarthome/transform/org.eclipse.smarthome.transform.scale/0.8.0.b2/org.eclipse.smarthome.transform.scale-0.8.0.b2-p2artifacts.xml (2 KB at 12.9 KB/sec)
[INFO]                                                                         
[INFO] ------------------------------------------------------------------------
[INFO] Building Eclipse SmartHome Scale Transformation Service Tests 0.8.0.b2
[INFO] ------------------------------------------------------------------------
[INFO] 
[INFO] --- tycho-packaging-plugin:0.23.1:build-qualifier (default-build-qualifier) @ org.eclipse.smarthome.transform.scale.test ---
[INFO] The project's OSGi version is 0.8.0.b2
[INFO] 
[INFO] --- tycho-packaging-plugin:0.23.1:validate-id (default-validate-id) @ org.eclipse.smarthome.transform.scale.test ---
[INFO] 
[INFO] --- tycho-packaging-plugin:0.23.1:validate-version (default-validate-version) @ org.eclipse.smarthome.transform.scale.test ---
[INFO] 
[INFO] --- xtend-maven-plugin:2.6.2:compile (default) @ org.eclipse.smarthome.transform.scale.test ---
[INFO] No sources to compile in '/jobs/genie.smarthome/PublishRelease/workspace/extensions/transform/org.eclipse.smarthome.transform.scale.test/src/test/java'
[INFO] 
[INFO] --- build-helper-maven-plugin:1.8:add-source (add-source) @ org.eclipse.smarthome.transform.scale.test ---
[INFO] Source directory: /jobs/genie.smarthome/PublishRelease/workspace/extensions/transform/org.eclipse.smarthome.transform.scale.test/src/main/groovy added.
[INFO] 
[INFO] --- maven-resources-plugin:2.4.3:resources (default-resources) @ org.eclipse.smarthome.transform.scale.test ---
[INFO] Using 'UTF-8' encoding to copy filtered resources.
[INFO] skip non existing resourceDirectory /jobs/genie.smarthome/PublishRelease/workspace/extensions/transform/org.eclipse.smarthome.transform.scale.test/src/main/resources
[INFO] 
[INFO] --- tycho-compiler-plugin:0.23.1:compile (default-compile) @ org.eclipse.smarthome.transform.scale.test ---
[INFO] Nothing to compile - all classes are up to date
[INFO] 
[INFO] --- maven-compiler-plugin:3.1:compile (default) @ org.eclipse.smarthome.transform.scale.test ---
[INFO] Changes detected - recompiling the module!
[INFO] Nothing to compile - all classes are up to date
[INFO] 
[INFO] --- xtend-maven-plugin:2.6.2:xtend-install-debug-info (default) @ org.eclipse.smarthome.transform.scale.test ---
[WARNING] Directory /jobs/genie.smarthome/PublishRelease/workspace/extensions/transform/org.eclipse.smarthome.transform.scale.test/src/main/java is empty. Can't process.
[WARNING] Directory /jobs/genie.smarthome/PublishRelease/workspace/extensions/transform/org.eclipse.smarthome.transform.scale.test/xtend-gen is empty. Can't process.
[WARNING] Directory /jobs/genie.smarthome/PublishRelease/workspace/extensions/transform/org.eclipse.smarthome.transform.scale.test/src/main/groovy is empty. Can't process.
[INFO] Installing Xtend files into 0 class files as secondary (via SMAP) debug sources in: /jobs/genie.smarthome/PublishRelease/workspace/extensions/transform/org.eclipse.smarthome.transform.scale.test/target/classes
[INFO] 
[INFO] --- xtend-maven-plugin:2.6.2:testCompile (default) @ org.eclipse.smarthome.transform.scale.test ---
[INFO] skip compiling sources because the configured directory '[]' does not exists.
[INFO] 
[INFO] --- build-helper-maven-plugin:1.8:add-test-source (add-test-source) @ org.eclipse.smarthome.transform.scale.test ---
[INFO] Test Source directory: /jobs/genie.smarthome/PublishRelease/workspace/extensions/transform/org.eclipse.smarthome.transform.scale.test/src/test/groovy added.
[INFO] 
[INFO] --- maven-resources-plugin:2.4.3:testResources (default-testResources) @ org.eclipse.smarthome.transform.scale.test ---
[INFO] Using 'UTF-8' encoding to copy filtered resources.
[INFO] skip non existing resourceDirectory /jobs/genie.smarthome/PublishRelease/workspace/extensions/transform/org.eclipse.smarthome.transform.scale.test/src/test/resources
[INFO] 
[INFO] --- xtend-maven-plugin:2.6.2:xtend-test-install-debug-info (default) @ org.eclipse.smarthome.transform.scale.test ---
[WARNING] Directory /jobs/genie.smarthome/PublishRelease/workspace/extensions/transform/org.eclipse.smarthome.transform.scale.test/xtend-gen is empty. Can't process.
[WARNING] Directory /jobs/genie.smarthome/PublishRelease/workspace/extensions/transform/org.eclipse.smarthome.transform.scale.test/src/test/groovy is empty. Can't process.
[INFO] Installing Xtend files into 0 class files as secondary (via SMAP) debug sources in: /jobs/genie.smarthome/PublishRelease/workspace/extensions/transform/org.eclipse.smarthome.transform.scale.test/target/test-classes
[INFO] 
[INFO] --- tycho-source-plugin:0.23.1:plugin-source (plugin-source) @ org.eclipse.smarthome.transform.scale.test ---
[WARNING] bundle localization file /jobs/genie.smarthome/PublishRelease/workspace/extensions/transform/org.eclipse.smarthome.transform.scale.test/plugin.properties not found
[INFO] Building jar: /jobs/genie.smarthome/PublishRelease/workspace/extensions/transform/org.eclipse.smarthome.transform.scale.test/target/org.eclipse.smarthome.transform.scale.test-0.8.0.b2-sources.jar
[INFO] 
[INFO] --- target-platform-configuration:0.23.1:target-platform (default-target-platform) @ org.eclipse.smarthome.transform.scale.test ---
[INFO] 
[INFO] --- tycho-packaging-plugin:0.23.1:package-plugin (default-package-plugin) @ org.eclipse.smarthome.transform.scale.test ---
[INFO] Building jar: /jobs/genie.smarthome/PublishRelease/workspace/extensions/transform/org.eclipse.smarthome.transform.scale.test/target/org.eclipse.smarthome.transform.scale.test-0.8.0.b2.jar
[INFO] 
[INFO] --- tycho-p2-plugin:0.23.1:p2-metadata-default (default-p2-metadata-default) @ org.eclipse.smarthome.transform.scale.test ---
[INFO] 
[INFO] --- maven-deploy-plugin:2.5:deploy (default-cli) @ org.eclipse.smarthome.transform.scale.test ---
Uploading: https://repo.eclipse.org/content/repositories/smarthome-releases/org/eclipse/smarthome/transform/org.eclipse.smarthome.transform.scale.test/0.8.0.b2/org.eclipse.smarthome.transform.scale.test-0.8.0.b2.jar
Uploaded: https://repo.eclipse.org/content/repositories/smarthome-releases/org/eclipse/smarthome/transform/org.eclipse.smarthome.transform.scale.test/0.8.0.b2/org.eclipse.smarthome.transform.scale.test-0.8.0.b2.jar (5 KB at 60.3 KB/sec)
Uploading: https://repo.eclipse.org/content/repositories/smarthome-releases/org/eclipse/smarthome/transform/org.eclipse.smarthome.transform.scale.test/0.8.0.b2/org.eclipse.smarthome.transform.scale.test-0.8.0.b2.pom
Uploaded: https://repo.eclipse.org/content/repositories/smarthome-releases/org/eclipse/smarthome/transform/org.eclipse.smarthome.transform.scale.test/0.8.0.b2/org.eclipse.smarthome.transform.scale.test-0.8.0.b2.pom (2 KB at 19.3 KB/sec)
Downloading: https://repo.eclipse.org/content/repositories/smarthome-releases/org/eclipse/smarthome/transform/org.eclipse.smarthome.transform.scale.test/maven-metadata.xml
Downloaded: https://repo.eclipse.org/content/repositories/smarthome-releases/org/eclipse/smarthome/transform/org.eclipse.smarthome.transform.scale.test/maven-metadata.xml (359 B at 5.6 KB/sec)
Uploading: https://repo.eclipse.org/content/repositories/smarthome-releases/org/eclipse/smarthome/transform/org.eclipse.smarthome.transform.scale.test/maven-metadata.xml
Uploaded: https://repo.eclipse.org/content/repositories/smarthome-releases/org/eclipse/smarthome/transform/org.eclipse.smarthome.transform.scale.test/maven-metadata.xml (393 B at 4.3 KB/sec)
Uploading: https://repo.eclipse.org/content/repositories/smarthome-releases/org/eclipse/smarthome/transform/org.eclipse.smarthome.transform.scale.test/0.8.0.b2/org.eclipse.smarthome.transform.scale.test-0.8.0.b2-sources.jar
Uploaded: https://repo.eclipse.org/content/repositories/smarthome-releases/org/eclipse/smarthome/transform/org.eclipse.smarthome.transform.scale.test/0.8.0.b2/org.eclipse.smarthome.transform.scale.test-0.8.0.b2-sources.jar (3 KB at 39.2 KB/sec)
Uploading: https://repo.eclipse.org/content/repositories/smarthome-releases/org/eclipse/smarthome/transform/org.eclipse.smarthome.transform.scale.test/0.8.0.b2/org.eclipse.smarthome.transform.scale.test-0.8.0.b2-p2metadata.xml
Uploaded: https://repo.eclipse.org/content/repositories/smarthome-releases/org/eclipse/smarthome/transform/org.eclipse.smarthome.transform.scale.test/0.8.0.b2/org.eclipse.smarthome.transform.scale.test-0.8.0.b2-p2metadata.xml (4 KB at 64.1 KB/sec)
Uploading: https://repo.eclipse.org/content/repositories/smarthome-releases/org/eclipse/smarthome/transform/org.eclipse.smarthome.transform.scale.test/0.8.0.b2/org.eclipse.smarthome.transform.scale.test-0.8.0.b2-p2artifacts.xml
Uploaded: https://repo.eclipse.org/content/repositories/smarthome-releases/org/eclipse/smarthome/transform/org.eclipse.smarthome.transform.scale.test/0.8.0.b2/org.eclipse.smarthome.transform.scale.test-0.8.0.b2-p2artifacts.xml (2 KB at 13.1 KB/sec)
[INFO]                                                                         
[INFO] ------------------------------------------------------------------------
[INFO] Building Eclipse SmartHome RegEx Transform Service 0.8.0.b2
[INFO] ------------------------------------------------------------------------
[INFO] 
[INFO] --- tycho-packaging-plugin:0.23.1:build-qualifier (default-build-qualifier) @ org.eclipse.smarthome.transform.regex ---
[INFO] The project's OSGi version is 0.8.0.b2
[INFO] 
[INFO] --- tycho-packaging-plugin:0.23.1:validate-id (default-validate-id) @ org.eclipse.smarthome.transform.regex ---
[INFO] 
[INFO] --- tycho-packaging-plugin:0.23.1:validate-version (default-validate-version) @ org.eclipse.smarthome.transform.regex ---
[INFO] 
[INFO] --- xtend-maven-plugin:2.6.2:compile (default) @ org.eclipse.smarthome.transform.regex ---
[INFO] No sources to compile in '/jobs/genie.smarthome/PublishRelease/workspace/extensions/transform/org.eclipse.smarthome.transform.regex/src/main/java:/jobs/genie.smarthome/PublishRelease/workspace/extensions/transform/org.eclipse.smarthome.transform.regex/src/main/resources'
[INFO] 
[INFO] --- build-helper-maven-plugin:1.8:add-source (add-source) @ org.eclipse.smarthome.transform.regex ---
[INFO] Source directory: /jobs/genie.smarthome/PublishRelease/workspace/extensions/transform/org.eclipse.smarthome.transform.regex/src/main/groovy added.
[INFO] 
[INFO] --- maven-resources-plugin:2.4.3:resources (default-resources) @ org.eclipse.smarthome.transform.regex ---
[INFO] Using 'UTF-8' encoding to copy filtered resources.
[INFO] Copying 1 resource
[INFO] 
[INFO] --- tycho-compiler-plugin:0.23.1:compile (default-compile) @ org.eclipse.smarthome.transform.regex ---
[INFO] Nothing to compile - all classes are up to date
[INFO] 
[INFO] --- maven-compiler-plugin:3.1:compile (default) @ org.eclipse.smarthome.transform.regex ---
[INFO] Changes detected - recompiling the module!
[INFO] Nothing to compile - all classes are up to date
[INFO] 
[INFO] --- xtend-maven-plugin:2.6.2:xtend-install-debug-info (default) @ org.eclipse.smarthome.transform.regex ---
[WARNING] Directory /jobs/genie.smarthome/PublishRelease/workspace/extensions/transform/org.eclipse.smarthome.transform.regex/xtend-gen is empty. Can't process.
[WARNING] Directory /jobs/genie.smarthome/PublishRelease/workspace/extensions/transform/org.eclipse.smarthome.transform.regex/src/main/groovy is empty. Can't process.
[INFO] Installing Xtend files into 0 class files as secondary (via SMAP) debug sources in: /jobs/genie.smarthome/PublishRelease/workspace/extensions/transform/org.eclipse.smarthome.transform.regex/target/classes
[INFO] 
[INFO] --- xtend-maven-plugin:2.6.2:testCompile (default) @ org.eclipse.smarthome.transform.regex ---
[INFO] skip compiling sources because the configured directory '[/jobs/genie.smarthome/PublishRelease/workspace/extensions/transform/org.eclipse.smarthome.transform.regex/src/test/java]' does not exists.
[INFO] 
[INFO] --- build-helper-maven-plugin:1.8:add-test-source (add-test-source) @ org.eclipse.smarthome.transform.regex ---
[INFO] Test Source directory: /jobs/genie.smarthome/PublishRelease/workspace/extensions/transform/org.eclipse.smarthome.transform.regex/src/test/groovy added.
[INFO] 
[INFO] --- maven-resources-plugin:2.4.3:testResources (default-testResources) @ org.eclipse.smarthome.transform.regex ---
[INFO] Using 'UTF-8' encoding to copy filtered resources.
[INFO] skip non existing resourceDirectory /jobs/genie.smarthome/PublishRelease/workspace/extensions/transform/org.eclipse.smarthome.transform.regex/src/test/resources
[INFO] 
[INFO] --- xtend-maven-plugin:2.6.2:xtend-test-install-debug-info (default) @ org.eclipse.smarthome.transform.regex ---
[WARNING] Directory /jobs/genie.smarthome/PublishRelease/workspace/extensions/transform/org.eclipse.smarthome.transform.regex/src/test/java is empty. Can't process.
[WARNING] Directory /jobs/genie.smarthome/PublishRelease/workspace/extensions/transform/org.eclipse.smarthome.transform.regex/xtend-gen is empty. Can't process.
[WARNING] Directory /jobs/genie.smarthome/PublishRelease/workspace/extensions/transform/org.eclipse.smarthome.transform.regex/src/test/groovy is empty. Can't process.
[INFO] Installing Xtend files into 0 class files as secondary (via SMAP) debug sources in: /jobs/genie.smarthome/PublishRelease/workspace/extensions/transform/org.eclipse.smarthome.transform.regex/target/test-classes
[INFO] 
[INFO] --- tycho-source-plugin:0.23.1:plugin-source (plugin-source) @ org.eclipse.smarthome.transform.regex ---
[WARNING] bundle localization file /jobs/genie.smarthome/PublishRelease/workspace/extensions/transform/org.eclipse.smarthome.transform.regex/plugin.properties not found
[INFO] Building jar: /jobs/genie.smarthome/PublishRelease/workspace/extensions/transform/org.eclipse.smarthome.transform.regex/target/org.eclipse.smarthome.transform.regex-0.8.0.b2-sources.jar
[INFO] 
[INFO] --- target-platform-configuration:0.23.1:target-platform (default-target-platform) @ org.eclipse.smarthome.transform.regex ---
[INFO] 
[INFO] --- tycho-packaging-plugin:0.23.1:package-plugin (default-package-plugin) @ org.eclipse.smarthome.transform.regex ---
[INFO] Building jar: /jobs/genie.smarthome/PublishRelease/workspace/extensions/transform/org.eclipse.smarthome.transform.regex/target/org.eclipse.smarthome.transform.regex-0.8.0.b2.jar
[INFO] 
[INFO] --- tycho-p2-plugin:0.23.1:p2-metadata-default (default-p2-metadata-default) @ org.eclipse.smarthome.transform.regex ---
[INFO] 
[INFO] --- maven-deploy-plugin:2.5:deploy (default-cli) @ org.eclipse.smarthome.transform.regex ---
Uploading: https://repo.eclipse.org/content/repositories/smarthome-releases/org/eclipse/smarthome/transform/org.eclipse.smarthome.transform.regex/0.8.0.b2/org.eclipse.smarthome.transform.regex-0.8.0.b2.jar
Uploaded: https://repo.eclipse.org/content/repositories/smarthome-releases/org/eclipse/smarthome/transform/org.eclipse.smarthome.transform.regex/0.8.0.b2/org.eclipse.smarthome.transform.regex-0.8.0.b2.jar (6 KB at 72.3 KB/sec)
Uploading: https://repo.eclipse.org/content/repositories/smarthome-releases/org/eclipse/smarthome/transform/org.eclipse.smarthome.transform.regex/0.8.0.b2/org.eclipse.smarthome.transform.regex-0.8.0.b2.pom
Uploaded: https://repo.eclipse.org/content/repositories/smarthome-releases/org/eclipse/smarthome/transform/org.eclipse.smarthome.transform.regex/0.8.0.b2/org.eclipse.smarthome.transform.regex-0.8.0.b2.pom (652 B at 11.4 KB/sec)
Downloading: https://repo.eclipse.org/content/repositories/smarthome-releases/org/eclipse/smarthome/transform/org.eclipse.smarthome.transform.regex/maven-metadata.xml
Downloaded: https://repo.eclipse.org/content/repositories/smarthome-releases/org/eclipse/smarthome/transform/org.eclipse.smarthome.transform.regex/maven-metadata.xml (354 B at 5.2 KB/sec)
Uploading: https://repo.eclipse.org/content/repositories/smarthome-releases/org/eclipse/smarthome/transform/org.eclipse.smarthome.transform.regex/maven-metadata.xml
Uploaded: https://repo.eclipse.org/content/repositories/smarthome-releases/org/eclipse/smarthome/transform/org.eclipse.smarthome.transform.regex/maven-metadata.xml (388 B at 5.3 KB/sec)
Uploading: https://repo.eclipse.org/content/repositories/smarthome-releases/org/eclipse/smarthome/transform/org.eclipse.smarthome.transform.regex/0.8.0.b2/org.eclipse.smarthome.transform.regex-0.8.0.b2-sources.jar
Uploaded: https://repo.eclipse.org/content/repositories/smarthome-releases/org/eclipse/smarthome/transform/org.eclipse.smarthome.transform.regex/0.8.0.b2/org.eclipse.smarthome.transform.regex-0.8.0.b2-sources.jar (4 KB at 37.3 KB/sec)
Uploading: https://repo.eclipse.org/content/repositories/smarthome-releases/org/eclipse/smarthome/transform/org.eclipse.smarthome.transform.regex/0.8.0.b2/org.eclipse.smarthome.transform.regex-0.8.0.b2-p2metadata.xml
Uploaded: https://repo.eclipse.org/content/repositories/smarthome-releases/org/eclipse/smarthome/transform/org.eclipse.smarthome.transform.regex/0.8.0.b2/org.eclipse.smarthome.transform.regex-0.8.0.b2-p2metadata.xml (4 KB at 43.2 KB/sec)
Uploading: https://repo.eclipse.org/content/repositories/smarthome-releases/org/eclipse/smarthome/transform/org.eclipse.smarthome.transform.regex/0.8.0.b2/org.eclipse.smarthome.transform.regex-0.8.0.b2-p2artifacts.xml
Uploaded: https://repo.eclipse.org/content/repositories/smarthome-releases/org/eclipse/smarthome/transform/org.eclipse.smarthome.transform.regex/0.8.0.b2/org.eclipse.smarthome.transform.regex-0.8.0.b2-p2artifacts.xml (2 KB at 14.2 KB/sec)
[INFO]                                                                         
[INFO] ------------------------------------------------------------------------
[INFO] Building Eclipse SmartHome RegEx Transformation Service Tests 0.8.0.b2
[INFO] ------------------------------------------------------------------------
[INFO] 
[INFO] --- tycho-packaging-plugin:0.23.1:build-qualifier (default-build-qualifier) @ org.eclipse.smarthome.transform.regex.test ---
[INFO] The project's OSGi version is 0.8.0.b2
[INFO] 
[INFO] --- tycho-packaging-plugin:0.23.1:validate-id (default-validate-id) @ org.eclipse.smarthome.transform.regex.test ---
[INFO] 
[INFO] --- tycho-packaging-plugin:0.23.1:validate-version (default-validate-version) @ org.eclipse.smarthome.transform.regex.test ---
[INFO] 
[INFO] --- xtend-maven-plugin:2.6.2:compile (default) @ org.eclipse.smarthome.transform.regex.test ---
[INFO] No sources to compile in '/jobs/genie.smarthome/PublishRelease/workspace/extensions/transform/org.eclipse.smarthome.transform.regex.test/src/test/java'
[INFO] 
[INFO] --- build-helper-maven-plugin:1.8:add-source (add-source) @ org.eclipse.smarthome.transform.regex.test ---
[INFO] Source directory: /jobs/genie.smarthome/PublishRelease/workspace/extensions/transform/org.eclipse.smarthome.transform.regex.test/src/main/groovy added.
[INFO] 
[INFO] --- maven-resources-plugin:2.4.3:resources (default-resources) @ org.eclipse.smarthome.transform.regex.test ---
[INFO] Using 'UTF-8' encoding to copy filtered resources.
[INFO] skip non existing resourceDirectory /jobs/genie.smarthome/PublishRelease/workspace/extensions/transform/org.eclipse.smarthome.transform.regex.test/src/main/resources
[INFO] 
[INFO] --- tycho-compiler-plugin:0.23.1:compile (default-compile) @ org.eclipse.smarthome.transform.regex.test ---
[INFO] Nothing to compile - all classes are up to date
[INFO] 
[INFO] --- maven-compiler-plugin:3.1:compile (default) @ org.eclipse.smarthome.transform.regex.test ---
[INFO] Changes detected - recompiling the module!
[INFO] Nothing to compile - all classes are up to date
[INFO] 
[INFO] --- xtend-maven-plugin:2.6.2:xtend-install-debug-info (default) @ org.eclipse.smarthome.transform.regex.test ---
[WARNING] Directory /jobs/genie.smarthome/PublishRelease/workspace/extensions/transform/org.eclipse.smarthome.transform.regex.test/src/main/java is empty. Can't process.
[WARNING] Directory /jobs/genie.smarthome/PublishRelease/workspace/extensions/transform/org.eclipse.smarthome.transform.regex.test/xtend-gen is empty. Can't process.
[WARNING] Directory /jobs/genie.smarthome/PublishRelease/workspace/extensions/transform/org.eclipse.smarthome.transform.regex.test/src/main/groovy is empty. Can't process.
[INFO] Installing Xtend files into 0 class files as secondary (via SMAP) debug sources in: /jobs/genie.smarthome/PublishRelease/workspace/extensions/transform/org.eclipse.smarthome.transform.regex.test/target/classes
[INFO] 
[INFO] --- xtend-maven-plugin:2.6.2:testCompile (default) @ org.eclipse.smarthome.transform.regex.test ---
[INFO] skip compiling sources because the configured directory '[]' does not exists.
[INFO] 
[INFO] --- build-helper-maven-plugin:1.8:add-test-source (add-test-source) @ org.eclipse.smarthome.transform.regex.test ---
[INFO] Test Source directory: /jobs/genie.smarthome/PublishRelease/workspace/extensions/transform/org.eclipse.smarthome.transform.regex.test/src/test/groovy added.
[INFO] 
[INFO] --- maven-resources-plugin:2.4.3:testResources (default-testResources) @ org.eclipse.smarthome.transform.regex.test ---
[INFO] Using 'UTF-8' encoding to copy filtered resources.
[INFO] skip non existing resourceDirectory /jobs/genie.smarthome/PublishRelease/workspace/extensions/transform/org.eclipse.smarthome.transform.regex.test/src/test/resources
[INFO] 
[INFO] --- xtend-maven-plugin:2.6.2:xtend-test-install-debug-info (default) @ org.eclipse.smarthome.transform.regex.test ---
[WARNING] Directory /jobs/genie.smarthome/PublishRelease/workspace/extensions/transform/org.eclipse.smarthome.transform.regex.test/xtend-gen is empty. Can't process.
[WARNING] Directory /jobs/genie.smarthome/PublishRelease/workspace/extensions/transform/org.eclipse.smarthome.transform.regex.test/src/test/groovy is empty. Can't process.
[INFO] Installing Xtend files into 0 class files as secondary (via SMAP) debug sources in: /jobs/genie.smarthome/PublishRelease/workspace/extensions/transform/org.eclipse.smarthome.transform.regex.test/target/test-classes
[INFO] 
[INFO] --- tycho-source-plugin:0.23.1:plugin-source (plugin-source) @ org.eclipse.smarthome.transform.regex.test ---
[WARNING] bundle localization file /jobs/genie.smarthome/PublishRelease/workspace/extensions/transform/org.eclipse.smarthome.transform.regex.test/plugin.properties not found
[INFO] Building jar: /jobs/genie.smarthome/PublishRelease/workspace/extensions/transform/org.eclipse.smarthome.transform.regex.test/target/org.eclipse.smarthome.transform.regex.test-0.8.0.b2-sources.jar
[INFO] 
[INFO] --- target-platform-configuration:0.23.1:target-platform (default-target-platform) @ org.eclipse.smarthome.transform.regex.test ---
[INFO] 
[INFO] --- tycho-packaging-plugin:0.23.1:package-plugin (default-package-plugin) @ org.eclipse.smarthome.transform.regex.test ---
[INFO] Building jar: /jobs/genie.smarthome/PublishRelease/workspace/extensions/transform/org.eclipse.smarthome.transform.regex.test/target/org.eclipse.smarthome.transform.regex.test-0.8.0.b2.jar
[INFO] 
[INFO] --- tycho-p2-plugin:0.23.1:p2-metadata-default (default-p2-metadata-default) @ org.eclipse.smarthome.transform.regex.test ---
[INFO] 
[INFO] --- maven-deploy-plugin:2.5:deploy (default-cli) @ org.eclipse.smarthome.transform.regex.test ---
Uploading: https://repo.eclipse.org/content/repositories/smarthome-releases/org/eclipse/smarthome/transform/org.eclipse.smarthome.transform.regex.test/0.8.0.b2/org.eclipse.smarthome.transform.regex.test-0.8.0.b2.jar
Uploaded: https://repo.eclipse.org/content/repositories/smarthome-releases/org/eclipse/smarthome/transform/org.eclipse.smarthome.transform.regex.test/0.8.0.b2/org.eclipse.smarthome.transform.regex.test-0.8.0.b2.jar (6 KB at 60.2 KB/sec)
Uploading: https://repo.eclipse.org/content/repositories/smarthome-releases/org/eclipse/smarthome/transform/org.eclipse.smarthome.transform.regex.test/0.8.0.b2/org.eclipse.smarthome.transform.regex.test-0.8.0.b2.pom
Uploaded: https://repo.eclipse.org/content/repositories/smarthome-releases/org/eclipse/smarthome/transform/org.eclipse.smarthome.transform.regex.test/0.8.0.b2/org.eclipse.smarthome.transform.regex.test-0.8.0.b2.pom (2 KB at 12.4 KB/sec)
Downloading: https://repo.eclipse.org/content/repositories/smarthome-releases/org/eclipse/smarthome/transform/org.eclipse.smarthome.transform.regex.test/maven-metadata.xml
Downloaded: https://repo.eclipse.org/content/repositories/smarthome-releases/org/eclipse/smarthome/transform/org.eclipse.smarthome.transform.regex.test/maven-metadata.xml (359 B at 5.2 KB/sec)
Uploading: https://repo.eclipse.org/content/repositories/smarthome-releases/org/eclipse/smarthome/transform/org.eclipse.smarthome.transform.regex.test/maven-metadata.xml
Uploaded: https://repo.eclipse.org/content/repositories/smarthome-releases/org/eclipse/smarthome/transform/org.eclipse.smarthome.transform.regex.test/maven-metadata.xml (393 B at 4.7 KB/sec)
Uploading: https://repo.eclipse.org/content/repositories/smarthome-releases/org/eclipse/smarthome/transform/org.eclipse.smarthome.transform.regex.test/0.8.0.b2/org.eclipse.smarthome.transform.regex.test-0.8.0.b2-sources.jar
Uploaded: https://repo.eclipse.org/content/repositories/smarthome-releases/org/eclipse/smarthome/transform/org.eclipse.smarthome.transform.regex.test/0.8.0.b2/org.eclipse.smarthome.transform.regex.test-0.8.0.b2-sources.jar (4 KB at 48.3 KB/sec)
Uploading: https://repo.eclipse.org/content/repositories/smarthome-releases/org/eclipse/smarthome/transform/org.eclipse.smarthome.transform.regex.test/0.8.0.b2/org.eclipse.smarthome.transform.regex.test-0.8.0.b2-p2metadata.xml
Uploaded: https://repo.eclipse.org/content/repositories/smarthome-releases/org/eclipse/smarthome/transform/org.eclipse.smarthome.transform.regex.test/0.8.0.b2/org.eclipse.smarthome.transform.regex.test-0.8.0.b2-p2metadata.xml (4 KB at 48.7 KB/sec)
Uploading: https://repo.eclipse.org/content/repositories/smarthome-releases/org/eclipse/smarthome/transform/org.eclipse.smarthome.transform.regex.test/0.8.0.b2/org.eclipse.smarthome.transform.regex.test-0.8.0.b2-p2artifacts.xml
Uploaded: https://repo.eclipse.org/content/repositories/smarthome-releases/org/eclipse/smarthome/transform/org.eclipse.smarthome.transform.regex.test/0.8.0.b2/org.eclipse.smarthome.transform.regex.test-0.8.0.b2-p2artifacts.xml (2 KB at 15.2 KB/sec)
[INFO]                                                                         
[INFO] ------------------------------------------------------------------------
[INFO] Building Eclipse SmartHome XPath Transform Service 0.8.0.b2
[INFO] ------------------------------------------------------------------------
[INFO] 
[INFO] --- tycho-packaging-plugin:0.23.1:build-qualifier (default-build-qualifier) @ org.eclipse.smarthome.transform.xpath ---
[INFO] The project's OSGi version is 0.8.0.b2
[INFO] 
[INFO] --- tycho-packaging-plugin:0.23.1:validate-id (default-validate-id) @ org.eclipse.smarthome.transform.xpath ---
[INFO] 
[INFO] --- tycho-packaging-plugin:0.23.1:validate-version (default-validate-version) @ org.eclipse.smarthome.transform.xpath ---
[INFO] 
[INFO] --- xtend-maven-plugin:2.6.2:compile (default) @ org.eclipse.smarthome.transform.xpath ---
[INFO] No sources to compile in '/jobs/genie.smarthome/PublishRelease/workspace/extensions/transform/org.eclipse.smarthome.transform.xpath/src/main/java:/jobs/genie.smarthome/PublishRelease/workspace/extensions/transform/org.eclipse.smarthome.transform.xpath/src/main/resources'
[INFO] 
[INFO] --- build-helper-maven-plugin:1.8:add-source (add-source) @ org.eclipse.smarthome.transform.xpath ---
[INFO] Source directory: /jobs/genie.smarthome/PublishRelease/workspace/extensions/transform/org.eclipse.smarthome.transform.xpath/src/main/groovy added.
[INFO] 
[INFO] --- maven-resources-plugin:2.4.3:resources (default-resources) @ org.eclipse.smarthome.transform.xpath ---
[INFO] Using 'UTF-8' encoding to copy filtered resources.
[INFO] Copying 1 resource
[INFO] 
[INFO] --- tycho-compiler-plugin:0.23.1:compile (default-compile) @ org.eclipse.smarthome.transform.xpath ---
[INFO] Nothing to compile - all classes are up to date
[INFO] 
[INFO] --- maven-compiler-plugin:3.1:compile (default) @ org.eclipse.smarthome.transform.xpath ---
[INFO] Changes detected - recompiling the module!
[INFO] Nothing to compile - all classes are up to date
[INFO] 
[INFO] --- xtend-maven-plugin:2.6.2:xtend-install-debug-info (default) @ org.eclipse.smarthome.transform.xpath ---
[WARNING] Directory /jobs/genie.smarthome/PublishRelease/workspace/extensions/transform/org.eclipse.smarthome.transform.xpath/xtend-gen is empty. Can't process.
[WARNING] Directory /jobs/genie.smarthome/PublishRelease/workspace/extensions/transform/org.eclipse.smarthome.transform.xpath/src/main/groovy is empty. Can't process.
[INFO] Installing Xtend files into 0 class files as secondary (via SMAP) debug sources in: /jobs/genie.smarthome/PublishRelease/workspace/extensions/transform/org.eclipse.smarthome.transform.xpath/target/classes
[INFO] 
[INFO] --- xtend-maven-plugin:2.6.2:testCompile (default) @ org.eclipse.smarthome.transform.xpath ---
[INFO] skip compiling sources because the configured directory '[/jobs/genie.smarthome/PublishRelease/workspace/extensions/transform/org.eclipse.smarthome.transform.xpath/src/test/java]' does not exists.
[INFO] 
[INFO] --- build-helper-maven-plugin:1.8:add-test-source (add-test-source) @ org.eclipse.smarthome.transform.xpath ---
[INFO] Test Source directory: /jobs/genie.smarthome/PublishRelease/workspace/extensions/transform/org.eclipse.smarthome.transform.xpath/src/test/groovy added.
[INFO] 
[INFO] --- maven-resources-plugin:2.4.3:testResources (default-testResources) @ org.eclipse.smarthome.transform.xpath ---
[INFO] Using 'UTF-8' encoding to copy filtered resources.
[INFO] skip non existing resourceDirectory /jobs/genie.smarthome/PublishRelease/workspace/extensions/transform/org.eclipse.smarthome.transform.xpath/src/test/resources
[INFO] 
[INFO] --- xtend-maven-plugin:2.6.2:xtend-test-install-debug-info (default) @ org.eclipse.smarthome.transform.xpath ---
[WARNING] Directory /jobs/genie.smarthome/PublishRelease/workspace/extensions/transform/org.eclipse.smarthome.transform.xpath/src/test/java is empty. Can't process.
[WARNING] Directory /jobs/genie.smarthome/PublishRelease/workspace/extensions/transform/org.eclipse.smarthome.transform.xpath/xtend-gen is empty. Can't process.
[WARNING] Directory /jobs/genie.smarthome/PublishRelease/workspace/extensions/transform/org.eclipse.smarthome.transform.xpath/src/test/groovy is empty. Can't process.
[INFO] Installing Xtend files into 0 class files as secondary (via SMAP) debug sources in: /jobs/genie.smarthome/PublishRelease/workspace/extensions/transform/org.eclipse.smarthome.transform.xpath/target/test-classes
[INFO] 
[INFO] --- tycho-source-plugin:0.23.1:plugin-source (plugin-source) @ org.eclipse.smarthome.transform.xpath ---
[WARNING] bundle localization file /jobs/genie.smarthome/PublishRelease/workspace/extensions/transform/org.eclipse.smarthome.transform.xpath/plugin.properties not found
[INFO] Building jar: /jobs/genie.smarthome/PublishRelease/workspace/extensions/transform/org.eclipse.smarthome.transform.xpath/target/org.eclipse.smarthome.transform.xpath-0.8.0.b2-sources.jar
[INFO] 
[INFO] --- target-platform-configuration:0.23.1:target-platform (default-target-platform) @ org.eclipse.smarthome.transform.xpath ---
[INFO] 
[INFO] --- tycho-packaging-plugin:0.23.1:package-plugin (default-package-plugin) @ org.eclipse.smarthome.transform.xpath ---
[INFO] Building jar: /jobs/genie.smarthome/PublishRelease/workspace/extensions/transform/org.eclipse.smarthome.transform.xpath/target/org.eclipse.smarthome.transform.xpath-0.8.0.b2.jar
[INFO] 
[INFO] --- tycho-p2-plugin:0.23.1:p2-metadata-default (default-p2-metadata-default) @ org.eclipse.smarthome.transform.xpath ---
[INFO] 
[INFO] --- maven-deploy-plugin:2.5:deploy (default-cli) @ org.eclipse.smarthome.transform.xpath ---
Uploading: https://repo.eclipse.org/content/repositories/smarthome-releases/org/eclipse/smarthome/transform/org.eclipse.smarthome.transform.xpath/0.8.0.b2/org.eclipse.smarthome.transform.xpath-0.8.0.b2.jar
Uploaded: https://repo.eclipse.org/content/repositories/smarthome-releases/org/eclipse/smarthome/transform/org.eclipse.smarthome.transform.xpath/0.8.0.b2/org.eclipse.smarthome.transform.xpath-0.8.0.b2.jar (7 KB at 18.9 KB/sec)
Uploading: https://repo.eclipse.org/content/repositories/smarthome-releases/org/eclipse/smarthome/transform/org.eclipse.smarthome.transform.xpath/0.8.0.b2/org.eclipse.smarthome.transform.xpath-0.8.0.b2.pom
Uploaded: https://repo.eclipse.org/content/repositories/smarthome-releases/org/eclipse/smarthome/transform/org.eclipse.smarthome.transform.xpath/0.8.0.b2/org.eclipse.smarthome.transform.xpath-0.8.0.b2.pom (652 B at 10.4 KB/sec)
Downloading: https://repo.eclipse.org/content/repositories/smarthome-releases/org/eclipse/smarthome/transform/org.eclipse.smarthome.transform.xpath/maven-metadata.xml
Downloaded: https://repo.eclipse.org/content/repositories/smarthome-releases/org/eclipse/smarthome/transform/org.eclipse.smarthome.transform.xpath/maven-metadata.xml (354 B at 8.2 KB/sec)
Uploading: https://repo.eclipse.org/content/repositories/smarthome-releases/org/eclipse/smarthome/transform/org.eclipse.smarthome.transform.xpath/maven-metadata.xml
Uploaded: https://repo.eclipse.org/content/repositories/smarthome-releases/org/eclipse/smarthome/transform/org.eclipse.smarthome.transform.xpath/maven-metadata.xml (388 B at 5.7 KB/sec)
Uploading: https://repo.eclipse.org/content/repositories/smarthome-releases/org/eclipse/smarthome/transform/org.eclipse.smarthome.transform.xpath/0.8.0.b2/org.eclipse.smarthome.transform.xpath-0.8.0.b2-sources.jar
Uploaded: https://repo.eclipse.org/content/repositories/smarthome-releases/org/eclipse/smarthome/transform/org.eclipse.smarthome.transform.xpath/0.8.0.b2/org.eclipse.smarthome.transform.xpath-0.8.0.b2-sources.jar (4 KB at 33.7 KB/sec)
Uploading: https://repo.eclipse.org/content/repositories/smarthome-releases/org/eclipse/smarthome/transform/org.eclipse.smarthome.transform.xpath/0.8.0.b2/org.eclipse.smarthome.transform.xpath-0.8.0.b2-p2metadata.xml
Uploaded: https://repo.eclipse.org/content/repositories/smarthome-releases/org/eclipse/smarthome/transform/org.eclipse.smarthome.transform.xpath/0.8.0.b2/org.eclipse.smarthome.transform.xpath-0.8.0.b2-p2metadata.xml (4 KB at 48.5 KB/sec)
Uploading: https://repo.eclipse.org/content/repositories/smarthome-releases/org/eclipse/smarthome/transform/org.eclipse.smarthome.transform.xpath/0.8.0.b2/org.eclipse.smarthome.transform.xpath-0.8.0.b2-p2artifacts.xml
Uploaded: https://repo.eclipse.org/content/repositories/smarthome-releases/org/eclipse/smarthome/transform/org.eclipse.smarthome.transform.xpath/0.8.0.b2/org.eclipse.smarthome.transform.xpath-0.8.0.b2-p2artifacts.xml (2 KB at 19.3 KB/sec)
[INFO]                                                                         
[INFO] ------------------------------------------------------------------------
[INFO] Building Eclipse SmartHome XPath Transformation Service Tests 0.8.0.b2
[INFO] ------------------------------------------------------------------------
[INFO] 
[INFO] --- tycho-packaging-plugin:0.23.1:build-qualifier (default-build-qualifier) @ org.eclipse.smarthome.transform.xpath.test ---
[INFO] The project's OSGi version is 0.8.0.b2
[INFO] 
[INFO] --- tycho-packaging-plugin:0.23.1:validate-id (default-validate-id) @ org.eclipse.smarthome.transform.xpath.test ---
[INFO] 
[INFO] --- tycho-packaging-plugin:0.23.1:validate-version (default-validate-version) @ org.eclipse.smarthome.transform.xpath.test ---
[INFO] 
[INFO] --- xtend-maven-plugin:2.6.2:compile (default) @ org.eclipse.smarthome.transform.xpath.test ---
[INFO] No sources to compile in '/jobs/genie.smarthome/PublishRelease/workspace/extensions/transform/org.eclipse.smarthome.transform.xpath.test/src/test/java'
[INFO] 
[INFO] --- build-helper-maven-plugin:1.8:add-source (add-source) @ org.eclipse.smarthome.transform.xpath.test ---
[INFO] Source directory: /jobs/genie.smarthome/PublishRelease/workspace/extensions/transform/org.eclipse.smarthome.transform.xpath.test/src/main/groovy added.
[INFO] 
[INFO] --- maven-resources-plugin:2.4.3:resources (default-resources) @ org.eclipse.smarthome.transform.xpath.test ---
[INFO] Using 'UTF-8' encoding to copy filtered resources.
[INFO] skip non existing resourceDirectory /jobs/genie.smarthome/PublishRelease/workspace/extensions/transform/org.eclipse.smarthome.transform.xpath.test/src/main/resources
[INFO] 
[INFO] --- tycho-compiler-plugin:0.23.1:compile (default-compile) @ org.eclipse.smarthome.transform.xpath.test ---
[INFO] Nothing to compile - all classes are up to date
[INFO] 
[INFO] --- maven-compiler-plugin:3.1:compile (default) @ org.eclipse.smarthome.transform.xpath.test ---
[INFO] Changes detected - recompiling the module!
[INFO] Nothing to compile - all classes are up to date
[INFO] 
[INFO] --- xtend-maven-plugin:2.6.2:xtend-install-debug-info (default) @ org.eclipse.smarthome.transform.xpath.test ---
[WARNING] Directory /jobs/genie.smarthome/PublishRelease/workspace/extensions/transform/org.eclipse.smarthome.transform.xpath.test/src/main/java is empty. Can't process.
[WARNING] Directory /jobs/genie.smarthome/PublishRelease/workspace/extensions/transform/org.eclipse.smarthome.transform.xpath.test/xtend-gen is empty. Can't process.
[WARNING] Directory /jobs/genie.smarthome/PublishRelease/workspace/extensions/transform/org.eclipse.smarthome.transform.xpath.test/src/main/groovy is empty. Can't process.
[INFO] Installing Xtend files into 0 class files as secondary (via SMAP) debug sources in: /jobs/genie.smarthome/PublishRelease/workspace/extensions/transform/org.eclipse.smarthome.transform.xpath.test/target/classes
[INFO] 
[INFO] --- xtend-maven-plugin:2.6.2:testCompile (default) @ org.eclipse.smarthome.transform.xpath.test ---
[INFO] skip compiling sources because the configured directory '[]' does not exists.
[INFO] 
[INFO] --- build-helper-maven-plugin:1.8:add-test-source (add-test-source) @ org.eclipse.smarthome.transform.xpath.test ---
[INFO] Test Source directory: /jobs/genie.smarthome/PublishRelease/workspace/extensions/transform/org.eclipse.smarthome.transform.xpath.test/src/test/groovy added.
[INFO] 
[INFO] --- maven-resources-plugin:2.4.3:testResources (default-testResources) @ org.eclipse.smarthome.transform.xpath.test ---
[INFO] Using 'UTF-8' encoding to copy filtered resources.
[INFO] skip non existing resourceDirectory /jobs/genie.smarthome/PublishRelease/workspace/extensions/transform/org.eclipse.smarthome.transform.xpath.test/src/test/resources
[INFO] 
[INFO] --- xtend-maven-plugin:2.6.2:xtend-test-install-debug-info (default) @ org.eclipse.smarthome.transform.xpath.test ---
[WARNING] Directory /jobs/genie.smarthome/PublishRelease/workspace/extensions/transform/org.eclipse.smarthome.transform.xpath.test/xtend-gen is empty. Can't process.
[WARNING] Directory /jobs/genie.smarthome/PublishRelease/workspace/extensions/transform/org.eclipse.smarthome.transform.xpath.test/src/test/groovy is empty. Can't process.
[INFO] Installing Xtend files into 0 class files as secondary (via SMAP) debug sources in: /jobs/genie.smarthome/PublishRelease/workspace/extensions/transform/org.eclipse.smarthome.transform.xpath.test/target/test-classes
[INFO] 
[INFO] --- tycho-source-plugin:0.23.1:plugin-source (plugin-source) @ org.eclipse.smarthome.transform.xpath.test ---
[WARNING] bundle localization file /jobs/genie.smarthome/PublishRelease/workspace/extensions/transform/org.eclipse.smarthome.transform.xpath.test/plugin.properties not found
[INFO] Building jar: /jobs/genie.smarthome/PublishRelease/workspace/extensions/transform/org.eclipse.smarthome.transform.xpath.test/target/org.eclipse.smarthome.transform.xpath.test-0.8.0.b2-sources.jar
[INFO] 
[INFO] --- target-platform-configuration:0.23.1:target-platform (default-target-platform) @ org.eclipse.smarthome.transform.xpath.test ---
[INFO] 
[INFO] --- tycho-packaging-plugin:0.23.1:package-plugin (default-package-plugin) @ org.eclipse.smarthome.transform.xpath.test ---
[INFO] Building jar: /jobs/genie.smarthome/PublishRelease/workspace/extensions/transform/org.eclipse.smarthome.transform.xpath.test/target/org.eclipse.smarthome.transform.xpath.test-0.8.0.b2.jar
[INFO] 
[INFO] --- tycho-p2-plugin:0.23.1:p2-metadata-default (default-p2-metadata-default) @ org.eclipse.smarthome.transform.xpath.test ---
[INFO] 
[INFO] --- maven-deploy-plugin:2.5:deploy (default-cli) @ org.eclipse.smarthome.transform.xpath.test ---
Uploading: https://repo.eclipse.org/content/repositories/smarthome-releases/org/eclipse/smarthome/transform/org.eclipse.smarthome.transform.xpath.test/0.8.0.b2/org.eclipse.smarthome.transform.xpath.test-0.8.0.b2.jar
Uploaded: https://repo.eclipse.org/content/repositories/smarthome-releases/org/eclipse/smarthome/transform/org.eclipse.smarthome.transform.xpath.test/0.8.0.b2/org.eclipse.smarthome.transform.xpath.test-0.8.0.b2.jar (6 KB at 63.2 KB/sec)
Uploading: https://repo.eclipse.org/content/repositories/smarthome-releases/org/eclipse/smarthome/transform/org.eclipse.smarthome.transform.xpath.test/0.8.0.b2/org.eclipse.smarthome.transform.xpath.test-0.8.0.b2.pom
Uploaded: https://repo.eclipse.org/content/repositories/smarthome-releases/org/eclipse/smarthome/transform/org.eclipse.smarthome.transform.xpath.test/0.8.0.b2/org.eclipse.smarthome.transform.xpath.test-0.8.0.b2.pom (2 KB at 9.4 KB/sec)
Downloading: https://repo.eclipse.org/content/repositories/smarthome-releases/org/eclipse/smarthome/transform/org.eclipse.smarthome.transform.xpath.test/maven-metadata.xml
Downloaded: https://repo.eclipse.org/content/repositories/smarthome-releases/org/eclipse/smarthome/transform/org.eclipse.smarthome.transform.xpath.test/maven-metadata.xml (359 B at 7.8 KB/sec)
Uploading: https://repo.eclipse.org/content/repositories/smarthome-releases/org/eclipse/smarthome/transform/org.eclipse.smarthome.transform.xpath.test/maven-metadata.xml
Uploaded: https://repo.eclipse.org/content/repositories/smarthome-releases/org/eclipse/smarthome/transform/org.eclipse.smarthome.transform.xpath.test/maven-metadata.xml (393 B at 3.7 KB/sec)
Uploading: https://repo.eclipse.org/content/repositories/smarthome-releases/org/eclipse/smarthome/transform/org.eclipse.smarthome.transform.xpath.test/0.8.0.b2/org.eclipse.smarthome.transform.xpath.test-0.8.0.b2-sources.jar
Uploaded: https://repo.eclipse.org/content/repositories/smarthome-releases/org/eclipse/smarthome/transform/org.eclipse.smarthome.transform.xpath.test/0.8.0.b2/org.eclipse.smarthome.transform.xpath.test-0.8.0.b2-sources.jar (4 KB at 40.4 KB/sec)
Uploading: https://repo.eclipse.org/content/repositories/smarthome-releases/org/eclipse/smarthome/transform/org.eclipse.smarthome.transform.xpath.test/0.8.0.b2/org.eclipse.smarthome.transform.xpath.test-0.8.0.b2-p2metadata.xml
Uploaded: https://repo.eclipse.org/content/repositories/smarthome-releases/org/eclipse/smarthome/transform/org.eclipse.smarthome.transform.xpath.test/0.8.0.b2/org.eclipse.smarthome.transform.xpath.test-0.8.0.b2-p2metadata.xml (4 KB at 65.1 KB/sec)
Uploading: https://repo.eclipse.org/content/repositories/smarthome-releases/org/eclipse/smarthome/transform/org.eclipse.smarthome.transform.xpath.test/0.8.0.b2/org.eclipse.smarthome.transform.xpath.test-0.8.0.b2-p2artifacts.xml
Uploaded: https://repo.eclipse.org/content/repositories/smarthome-releases/org/eclipse/smarthome/transform/org.eclipse.smarthome.transform.xpath.test/0.8.0.b2/org.eclipse.smarthome.transform.xpath.test-0.8.0.b2-p2artifacts.xml (2 KB at 15.8 KB/sec)
[INFO]                                                                         
[INFO] ------------------------------------------------------------------------
[INFO] Building Eclipse SmartHome JSonPath Transform Service 0.8.0.b2
[INFO] ------------------------------------------------------------------------
[INFO] 
[INFO] --- tycho-packaging-plugin:0.23.1:build-qualifier (default-build-qualifier) @ org.eclipse.smarthome.transform.jsonpath ---
[INFO] The project's OSGi version is 0.8.0.b2
[INFO] 
[INFO] --- tycho-packaging-plugin:0.23.1:validate-id (default-validate-id) @ org.eclipse.smarthome.transform.jsonpath ---
[INFO] 
[INFO] --- tycho-packaging-plugin:0.23.1:validate-version (default-validate-version) @ org.eclipse.smarthome.transform.jsonpath ---
[INFO] 
[INFO] --- xtend-maven-plugin:2.6.2:compile (default) @ org.eclipse.smarthome.transform.jsonpath ---
[INFO] No sources to compile in '/jobs/genie.smarthome/PublishRelease/workspace/extensions/transform/org.eclipse.smarthome.transform.jsonpath/src/main/java:/jobs/genie.smarthome/PublishRelease/workspace/extensions/transform/org.eclipse.smarthome.transform.jsonpath/src/main/resources'
[INFO] 
[INFO] --- build-helper-maven-plugin:1.8:add-source (add-source) @ org.eclipse.smarthome.transform.jsonpath ---
[INFO] Source directory: /jobs/genie.smarthome/PublishRelease/workspace/extensions/transform/org.eclipse.smarthome.transform.jsonpath/src/main/groovy added.
[INFO] 
[INFO] --- maven-resources-plugin:2.4.3:resources (default-resources) @ org.eclipse.smarthome.transform.jsonpath ---
[INFO] Using 'UTF-8' encoding to copy filtered resources.
[INFO] Copying 1 resource
[INFO] 
[INFO] --- tycho-compiler-plugin:0.23.1:compile (default-compile) @ org.eclipse.smarthome.transform.jsonpath ---
[INFO] Nothing to compile - all classes are up to date
[INFO] 
[INFO] --- maven-compiler-plugin:3.1:compile (default) @ org.eclipse.smarthome.transform.jsonpath ---
[INFO] Changes detected - recompiling the module!
[INFO] Nothing to compile - all classes are up to date
[INFO] 
[INFO] --- xtend-maven-plugin:2.6.2:xtend-install-debug-info (default) @ org.eclipse.smarthome.transform.jsonpath ---
[WARNING] Directory /jobs/genie.smarthome/PublishRelease/workspace/extensions/transform/org.eclipse.smarthome.transform.jsonpath/xtend-gen is empty. Can't process.
[WARNING] Directory /jobs/genie.smarthome/PublishRelease/workspace/extensions/transform/org.eclipse.smarthome.transform.jsonpath/src/main/groovy is empty. Can't process.
[INFO] Installing Xtend files into 0 class files as secondary (via SMAP) debug sources in: /jobs/genie.smarthome/PublishRelease/workspace/extensions/transform/org.eclipse.smarthome.transform.jsonpath/target/classes
[INFO] 
[INFO] --- xtend-maven-plugin:2.6.2:testCompile (default) @ org.eclipse.smarthome.transform.jsonpath ---
[INFO] skip compiling sources because the configured directory '[/jobs/genie.smarthome/PublishRelease/workspace/extensions/transform/org.eclipse.smarthome.transform.jsonpath/src/test/java]' does not exists.
[INFO] 
[INFO] --- build-helper-maven-plugin:1.8:add-test-source (add-test-source) @ org.eclipse.smarthome.transform.jsonpath ---
[INFO] Test Source directory: /jobs/genie.smarthome/PublishRelease/workspace/extensions/transform/org.eclipse.smarthome.transform.jsonpath/src/test/groovy added.
[INFO] 
[INFO] --- maven-resources-plugin:2.4.3:testResources (default-testResources) @ org.eclipse.smarthome.transform.jsonpath ---
[INFO] Using 'UTF-8' encoding to copy filtered resources.
[INFO] skip non existing resourceDirectory /jobs/genie.smarthome/PublishRelease/workspace/extensions/transform/org.eclipse.smarthome.transform.jsonpath/src/test/resources
[INFO] 
[INFO] --- xtend-maven-plugin:2.6.2:xtend-test-install-debug-info (default) @ org.eclipse.smarthome.transform.jsonpath ---
[WARNING] Directory /jobs/genie.smarthome/PublishRelease/workspace/extensions/transform/org.eclipse.smarthome.transform.jsonpath/src/test/java is empty. Can't process.
[WARNING] Directory /jobs/genie.smarthome/PublishRelease/workspace/extensions/transform/org.eclipse.smarthome.transform.jsonpath/xtend-gen is empty. Can't process.
[WARNING] Directory /jobs/genie.smarthome/PublishRelease/workspace/extensions/transform/org.eclipse.smarthome.transform.jsonpath/src/test/groovy is empty. Can't process.
[INFO] Installing Xtend files into 0 class files as secondary (via SMAP) debug sources in: /jobs/genie.smarthome/PublishRelease/workspace/extensions/transform/org.eclipse.smarthome.transform.jsonpath/target/test-classes
[INFO] 
[INFO] --- tycho-source-plugin:0.23.1:plugin-source (plugin-source) @ org.eclipse.smarthome.transform.jsonpath ---
[WARNING] bundle localization file /jobs/genie.smarthome/PublishRelease/workspace/extensions/transform/org.eclipse.smarthome.transform.jsonpath/plugin.properties not found
[INFO] Building jar: /jobs/genie.smarthome/PublishRelease/workspace/extensions/transform/org.eclipse.smarthome.transform.jsonpath/target/org.eclipse.smarthome.transform.jsonpath-0.8.0.b2-sources.jar
[INFO] 
[INFO] --- target-platform-configuration:0.23.1:target-platform (default-target-platform) @ org.eclipse.smarthome.transform.jsonpath ---
[INFO] 
[INFO] --- tycho-packaging-plugin:0.23.1:package-plugin (default-package-plugin) @ org.eclipse.smarthome.transform.jsonpath ---
[INFO] Building jar: /jobs/genie.smarthome/PublishRelease/workspace/extensions/transform/org.eclipse.smarthome.transform.jsonpath/target/org.eclipse.smarthome.transform.jsonpath-0.8.0.b2.jar
[INFO] 
[INFO] --- tycho-p2-plugin:0.23.1:p2-metadata-default (default-p2-metadata-default) @ org.eclipse.smarthome.transform.jsonpath ---
[INFO] 
[INFO] --- maven-deploy-plugin:2.5:deploy (default-cli) @ org.eclipse.smarthome.transform.jsonpath ---
Uploading: https://repo.eclipse.org/content/repositories/smarthome-releases/org/eclipse/smarthome/transform/org.eclipse.smarthome.transform.jsonpath/0.8.0.b2/org.eclipse.smarthome.transform.jsonpath-0.8.0.b2.jar
Uploaded: https://repo.eclipse.org/content/repositories/smarthome-releases/org/eclipse/smarthome/transform/org.eclipse.smarthome.transform.jsonpath/0.8.0.b2/org.eclipse.smarthome.transform.jsonpath-0.8.0.b2.jar (365 KB at 3755.4 KB/sec)
Uploading: https://repo.eclipse.org/content/repositories/smarthome-releases/org/eclipse/smarthome/transform/org.eclipse.smarthome.transform.jsonpath/0.8.0.b2/org.eclipse.smarthome.transform.jsonpath-0.8.0.b2.pom
Uploaded: https://repo.eclipse.org/content/repositories/smarthome-releases/org/eclipse/smarthome/transform/org.eclipse.smarthome.transform.jsonpath/0.8.0.b2/org.eclipse.smarthome.transform.jsonpath-0.8.0.b2.pom (658 B at 10.5 KB/sec)
Downloading: https://repo.eclipse.org/content/repositories/smarthome-releases/org/eclipse/smarthome/transform/org.eclipse.smarthome.transform.jsonpath/maven-metadata.xml
Downloaded: https://repo.eclipse.org/content/repositories/smarthome-releases/org/eclipse/smarthome/transform/org.eclipse.smarthome.transform.jsonpath/maven-metadata.xml (357 B at 7.4 KB/sec)
Uploading: https://repo.eclipse.org/content/repositories/smarthome-releases/org/eclipse/smarthome/transform/org.eclipse.smarthome.transform.jsonpath/maven-metadata.xml
Uploaded: https://repo.eclipse.org/content/repositories/smarthome-releases/org/eclipse/smarthome/transform/org.eclipse.smarthome.transform.jsonpath/maven-metadata.xml (391 B at 5.6 KB/sec)
Uploading: https://repo.eclipse.org/content/repositories/smarthome-releases/org/eclipse/smarthome/transform/org.eclipse.smarthome.transform.jsonpath/0.8.0.b2/org.eclipse.smarthome.transform.jsonpath-0.8.0.b2-sources.jar
Uploaded: https://repo.eclipse.org/content/repositories/smarthome-releases/org/eclipse/smarthome/transform/org.eclipse.smarthome.transform.jsonpath/0.8.0.b2/org.eclipse.smarthome.transform.jsonpath-0.8.0.b2-sources.jar (3 KB at 37.9 KB/sec)
Uploading: https://repo.eclipse.org/content/repositories/smarthome-releases/org/eclipse/smarthome/transform/org.eclipse.smarthome.transform.jsonpath/0.8.0.b2/org.eclipse.smarthome.transform.jsonpath-0.8.0.b2-p2metadata.xml
Uploaded: https://repo.eclipse.org/content/repositories/smarthome-releases/org/eclipse/smarthome/transform/org.eclipse.smarthome.transform.jsonpath/0.8.0.b2/org.eclipse.smarthome.transform.jsonpath-0.8.0.b2-p2metadata.xml (4 KB at 62.2 KB/sec)
Uploading: https://repo.eclipse.org/content/repositories/smarthome-releases/org/eclipse/smarthome/transform/org.eclipse.smarthome.transform.jsonpath/0.8.0.b2/org.eclipse.smarthome.transform.jsonpath-0.8.0.b2-p2artifacts.xml
Uploaded: https://repo.eclipse.org/content/repositories/smarthome-releases/org/eclipse/smarthome/transform/org.eclipse.smarthome.transform.jsonpath/0.8.0.b2/org.eclipse.smarthome.transform.jsonpath-0.8.0.b2-p2artifacts.xml (2 KB at 17.7 KB/sec)
[INFO]                                                                         
[INFO] ------------------------------------------------------------------------
[INFO] Building Eclipse SmartHome JSonPath Transformation Service Tests 0.8.0.b2
[INFO] ------------------------------------------------------------------------
[INFO] 
[INFO] --- tycho-packaging-plugin:0.23.1:build-qualifier (default-build-qualifier) @ org.eclipse.smarthome.transform.jsonpath.test ---
[INFO] The project's OSGi version is 0.8.0.b2
[INFO] 
[INFO] --- tycho-packaging-plugin:0.23.1:validate-id (default-validate-id) @ org.eclipse.smarthome.transform.jsonpath.test ---
[INFO] 
[INFO] --- tycho-packaging-plugin:0.23.1:validate-version (default-validate-version) @ org.eclipse.smarthome.transform.jsonpath.test ---
[INFO] 
[INFO] --- xtend-maven-plugin:2.6.2:compile (default) @ org.eclipse.smarthome.transform.jsonpath.test ---
[INFO] No sources to compile in '/jobs/genie.smarthome/PublishRelease/workspace/extensions/transform/org.eclipse.smarthome.transform.jsonpath.test/src/test/java'
[INFO] 
[INFO] --- build-helper-maven-plugin:1.8:add-source (add-source) @ org.eclipse.smarthome.transform.jsonpath.test ---
[INFO] Source directory: /jobs/genie.smarthome/PublishRelease/workspace/extensions/transform/org.eclipse.smarthome.transform.jsonpath.test/src/main/groovy added.
[INFO] 
[INFO] --- maven-resources-plugin:2.4.3:resources (default-resources) @ org.eclipse.smarthome.transform.jsonpath.test ---
[INFO] Using 'UTF-8' encoding to copy filtered resources.
[INFO] skip non existing resourceDirectory /jobs/genie.smarthome/PublishRelease/workspace/extensions/transform/org.eclipse.smarthome.transform.jsonpath.test/src/main/resources
[INFO] 
[INFO] --- tycho-compiler-plugin:0.23.1:compile (default-compile) @ org.eclipse.smarthome.transform.jsonpath.test ---
[INFO] Nothing to compile - all classes are up to date
[INFO] 
[INFO] --- maven-compiler-plugin:3.1:compile (default) @ org.eclipse.smarthome.transform.jsonpath.test ---
[INFO] Changes detected - recompiling the module!
[INFO] Nothing to compile - all classes are up to date
[INFO] 
[INFO] --- xtend-maven-plugin:2.6.2:xtend-install-debug-info (default) @ org.eclipse.smarthome.transform.jsonpath.test ---
[WARNING] Directory /jobs/genie.smarthome/PublishRelease/workspace/extensions/transform/org.eclipse.smarthome.transform.jsonpath.test/src/main/java is empty. Can't process.
[WARNING] Directory /jobs/genie.smarthome/PublishRelease/workspace/extensions/transform/org.eclipse.smarthome.transform.jsonpath.test/xtend-gen is empty. Can't process.
[WARNING] Directory /jobs/genie.smarthome/PublishRelease/workspace/extensions/transform/org.eclipse.smarthome.transform.jsonpath.test/src/main/groovy is empty. Can't process.
[INFO] Installing Xtend files into 0 class files as secondary (via SMAP) debug sources in: /jobs/genie.smarthome/PublishRelease/workspace/extensions/transform/org.eclipse.smarthome.transform.jsonpath.test/target/classes
[INFO] 
[INFO] --- xtend-maven-plugin:2.6.2:testCompile (default) @ org.eclipse.smarthome.transform.jsonpath.test ---
[INFO] skip compiling sources because the configured directory '[]' does not exists.
[INFO] 
[INFO] --- build-helper-maven-plugin:1.8:add-test-source (add-test-source) @ org.eclipse.smarthome.transform.jsonpath.test ---
[INFO] Test Source directory: /jobs/genie.smarthome/PublishRelease/workspace/extensions/transform/org.eclipse.smarthome.transform.jsonpath.test/src/test/groovy added.
[INFO] 
[INFO] --- maven-resources-plugin:2.4.3:testResources (default-testResources) @ org.eclipse.smarthome.transform.jsonpath.test ---
[INFO] Using 'UTF-8' encoding to copy filtered resources.
[INFO] skip non existing resourceDirectory /jobs/genie.smarthome/PublishRelease/workspace/extensions/transform/org.eclipse.smarthome.transform.jsonpath.test/src/test/resources
[INFO] 
[INFO] --- xtend-maven-plugin:2.6.2:xtend-test-install-debug-info (default) @ org.eclipse.smarthome.transform.jsonpath.test ---
[WARNING] Directory /jobs/genie.smarthome/PublishRelease/workspace/extensions/transform/org.eclipse.smarthome.transform.jsonpath.test/xtend-gen is empty. Can't process.
[WARNING] Directory /jobs/genie.smarthome/PublishRelease/workspace/extensions/transform/org.eclipse.smarthome.transform.jsonpath.test/src/test/groovy is empty. Can't process.
[INFO] Installing Xtend files into 0 class files as secondary (via SMAP) debug sources in: /jobs/genie.smarthome/PublishRelease/workspace/extensions/transform/org.eclipse.smarthome.transform.jsonpath.test/target/test-classes
[INFO] 
[INFO] --- tycho-source-plugin:0.23.1:plugin-source (plugin-source) @ org.eclipse.smarthome.transform.jsonpath.test ---
[WARNING] bundle localization file /jobs/genie.smarthome/PublishRelease/workspace/extensions/transform/org.eclipse.smarthome.transform.jsonpath.test/plugin.properties not found
[INFO] Building jar: /jobs/genie.smarthome/PublishRelease/workspace/extensions/transform/org.eclipse.smarthome.transform.jsonpath.test/target/org.eclipse.smarthome.transform.jsonpath.test-0.8.0.b2-sources.jar
[INFO] 
[INFO] --- target-platform-configuration:0.23.1:target-platform (default-target-platform) @ org.eclipse.smarthome.transform.jsonpath.test ---
[INFO] 
[INFO] --- tycho-packaging-plugin:0.23.1:package-plugin (default-package-plugin) @ org.eclipse.smarthome.transform.jsonpath.test ---
[INFO] Building jar: /jobs/genie.smarthome/PublishRelease/workspace/extensions/transform/org.eclipse.smarthome.transform.jsonpath.test/target/org.eclipse.smarthome.transform.jsonpath.test-0.8.0.b2.jar
[INFO] 
[INFO] --- tycho-p2-plugin:0.23.1:p2-metadata-default (default-p2-metadata-default) @ org.eclipse.smarthome.transform.jsonpath.test ---
[INFO] 
[INFO] --- maven-deploy-plugin:2.5:deploy (default-cli) @ org.eclipse.smarthome.transform.jsonpath.test ---
Uploading: https://repo.eclipse.org/content/repositories/smarthome-releases/org/eclipse/smarthome/transform/org.eclipse.smarthome.transform.jsonpath.test/0.8.0.b2/org.eclipse.smarthome.transform.jsonpath.test-0.8.0.b2.jar
Uploaded: https://repo.eclipse.org/content/repositories/smarthome-releases/org/eclipse/smarthome/transform/org.eclipse.smarthome.transform.jsonpath.test/0.8.0.b2/org.eclipse.smarthome.transform.jsonpath.test-0.8.0.b2.jar (6 KB at 56.7 KB/sec)
Uploading: https://repo.eclipse.org/content/repositories/smarthome-releases/org/eclipse/smarthome/transform/org.eclipse.smarthome.transform.jsonpath.test/0.8.0.b2/org.eclipse.smarthome.transform.jsonpath.test-0.8.0.b2.pom
Uploaded: https://repo.eclipse.org/content/repositories/smarthome-releases/org/eclipse/smarthome/transform/org.eclipse.smarthome.transform.jsonpath.test/0.8.0.b2/org.eclipse.smarthome.transform.jsonpath.test-0.8.0.b2.pom (2 KB at 13.7 KB/sec)
Downloading: https://repo.eclipse.org/content/repositories/smarthome-releases/org/eclipse/smarthome/transform/org.eclipse.smarthome.transform.jsonpath.test/maven-metadata.xml
Downloaded: https://repo.eclipse.org/content/repositories/smarthome-releases/org/eclipse/smarthome/transform/org.eclipse.smarthome.transform.jsonpath.test/maven-metadata.xml (362 B at 7.2 KB/sec)
Uploading: https://repo.eclipse.org/content/repositories/smarthome-releases/org/eclipse/smarthome/transform/org.eclipse.smarthome.transform.jsonpath.test/maven-metadata.xml
Uploaded: https://repo.eclipse.org/content/repositories/smarthome-releases/org/eclipse/smarthome/transform/org.eclipse.smarthome.transform.jsonpath.test/maven-metadata.xml (396 B at 3.7 KB/sec)
Uploading: https://repo.eclipse.org/content/repositories/smarthome-releases/org/eclipse/smarthome/transform/org.eclipse.smarthome.transform.jsonpath.test/0.8.0.b2/org.eclipse.smarthome.transform.jsonpath.test-0.8.0.b2-sources.jar
Uploaded: https://repo.eclipse.org/content/repositories/smarthome-releases/org/eclipse/smarthome/transform/org.eclipse.smarthome.transform.jsonpath.test/0.8.0.b2/org.eclipse.smarthome.transform.jsonpath.test-0.8.0.b2-sources.jar (3 KB at 44.6 KB/sec)
Uploading: https://repo.eclipse.org/content/repositories/smarthome-releases/org/eclipse/smarthome/transform/org.eclipse.smarthome.transform.jsonpath.test/0.8.0.b2/org.eclipse.smarthome.transform.jsonpath.test-0.8.0.b2-p2metadata.xml
Uploaded: https://repo.eclipse.org/content/repositories/smarthome-releases/org/eclipse/smarthome/transform/org.eclipse.smarthome.transform.jsonpath.test/0.8.0.b2/org.eclipse.smarthome.transform.jsonpath.test-0.8.0.b2-p2metadata.xml (4 KB at 63.9 KB/sec)
Uploading: https://repo.eclipse.org/content/repositories/smarthome-releases/org/eclipse/smarthome/transform/org.eclipse.smarthome.transform.jsonpath.test/0.8.0.b2/org.eclipse.smarthome.transform.jsonpath.test-0.8.0.b2-p2artifacts.xml
Uploaded: https://repo.eclipse.org/content/repositories/smarthome-releases/org/eclipse/smarthome/transform/org.eclipse.smarthome.transform.jsonpath.test/0.8.0.b2/org.eclipse.smarthome.transform.jsonpath.test-0.8.0.b2-p2artifacts.xml (2 KB at 12.7 KB/sec)
[INFO]                                                                         
[INFO] ------------------------------------------------------------------------
[INFO] Building Eclipse SmartHome Xslt Transform Service 0.8.0.b2
[INFO] ------------------------------------------------------------------------
[INFO] 
[INFO] --- tycho-packaging-plugin:0.23.1:build-qualifier (default-build-qualifier) @ org.eclipse.smarthome.transform.xslt ---
[INFO] The project's OSGi version is 0.8.0.b2
[INFO] 
[INFO] --- tycho-packaging-plugin:0.23.1:validate-id (default-validate-id) @ org.eclipse.smarthome.transform.xslt ---
[INFO] 
[INFO] --- tycho-packaging-plugin:0.23.1:validate-version (default-validate-version) @ org.eclipse.smarthome.transform.xslt ---
[INFO] 
[INFO] --- xtend-maven-plugin:2.6.2:compile (default) @ org.eclipse.smarthome.transform.xslt ---
[INFO] No sources to compile in '/jobs/genie.smarthome/PublishRelease/workspace/extensions/transform/org.eclipse.smarthome.transform.xslt/src/main/java:/jobs/genie.smarthome/PublishRelease/workspace/extensions/transform/org.eclipse.smarthome.transform.xslt/src/main/resources'
[INFO] 
[INFO] --- build-helper-maven-plugin:1.8:add-source (add-source) @ org.eclipse.smarthome.transform.xslt ---
[INFO] Source directory: /jobs/genie.smarthome/PublishRelease/workspace/extensions/transform/org.eclipse.smarthome.transform.xslt/src/main/groovy added.
[INFO] 
[INFO] --- maven-resources-plugin:2.4.3:resources (default-resources) @ org.eclipse.smarthome.transform.xslt ---
[INFO] Using 'UTF-8' encoding to copy filtered resources.
[INFO] Copying 1 resource
[INFO] 
[INFO] --- tycho-compiler-plugin:0.23.1:compile (default-compile) @ org.eclipse.smarthome.transform.xslt ---
[INFO] Nothing to compile - all classes are up to date
[INFO] 
[INFO] --- maven-compiler-plugin:3.1:compile (default) @ org.eclipse.smarthome.transform.xslt ---
[INFO] Changes detected - recompiling the module!
[INFO] Nothing to compile - all classes are up to date
[INFO] 
[INFO] --- xtend-maven-plugin:2.6.2:xtend-install-debug-info (default) @ org.eclipse.smarthome.transform.xslt ---
[WARNING] Directory /jobs/genie.smarthome/PublishRelease/workspace/extensions/transform/org.eclipse.smarthome.transform.xslt/xtend-gen is empty. Can't process.
[WARNING] Directory /jobs/genie.smarthome/PublishRelease/workspace/extensions/transform/org.eclipse.smarthome.transform.xslt/src/main/groovy is empty. Can't process.
[INFO] Installing Xtend files into 0 class files as secondary (via SMAP) debug sources in: /jobs/genie.smarthome/PublishRelease/workspace/extensions/transform/org.eclipse.smarthome.transform.xslt/target/classes
[INFO] 
[INFO] --- xtend-maven-plugin:2.6.2:testCompile (default) @ org.eclipse.smarthome.transform.xslt ---
[INFO] skip compiling sources because the configured directory '[/jobs/genie.smarthome/PublishRelease/workspace/extensions/transform/org.eclipse.smarthome.transform.xslt/src/test/java]' does not exists.
[INFO] 
[INFO] --- build-helper-maven-plugin:1.8:add-test-source (add-test-source) @ org.eclipse.smarthome.transform.xslt ---
[INFO] Test Source directory: /jobs/genie.smarthome/PublishRelease/workspace/extensions/transform/org.eclipse.smarthome.transform.xslt/src/test/groovy added.
[INFO] 
[INFO] --- maven-resources-plugin:2.4.3:testResources (default-testResources) @ org.eclipse.smarthome.transform.xslt ---
[INFO] Using 'UTF-8' encoding to copy filtered resources.
[INFO] skip non existing resourceDirectory /jobs/genie.smarthome/PublishRelease/workspace/extensions/transform/org.eclipse.smarthome.transform.xslt/src/test/resources
[INFO] 
[INFO] --- xtend-maven-plugin:2.6.2:xtend-test-install-debug-info (default) @ org.eclipse.smarthome.transform.xslt ---
[WARNING] Directory /jobs/genie.smarthome/PublishRelease/workspace/extensions/transform/org.eclipse.smarthome.transform.xslt/src/test/java is empty. Can't process.
[WARNING] Directory /jobs/genie.smarthome/PublishRelease/workspace/extensions/transform/org.eclipse.smarthome.transform.xslt/xtend-gen is empty. Can't process.
[WARNING] Directory /jobs/genie.smarthome/PublishRelease/workspace/extensions/transform/org.eclipse.smarthome.transform.xslt/src/test/groovy is empty. Can't process.
[INFO] Installing Xtend files into 0 class files as secondary (via SMAP) debug sources in: /jobs/genie.smarthome/PublishRelease/workspace/extensions/transform/org.eclipse.smarthome.transform.xslt/target/test-classes
[INFO] 
[INFO] --- tycho-source-plugin:0.23.1:plugin-source (plugin-source) @ org.eclipse.smarthome.transform.xslt ---
[WARNING] bundle localization file /jobs/genie.smarthome/PublishRelease/workspace/extensions/transform/org.eclipse.smarthome.transform.xslt/plugin.properties not found
[INFO] Building jar: /jobs/genie.smarthome/PublishRelease/workspace/extensions/transform/org.eclipse.smarthome.transform.xslt/target/org.eclipse.smarthome.transform.xslt-0.8.0.b2-sources.jar
[INFO] 
[INFO] --- target-platform-configuration:0.23.1:target-platform (default-target-platform) @ org.eclipse.smarthome.transform.xslt ---
[INFO] 
[INFO] --- tycho-packaging-plugin:0.23.1:package-plugin (default-package-plugin) @ org.eclipse.smarthome.transform.xslt ---
[INFO] Building jar: /jobs/genie.smarthome/PublishRelease/workspace/extensions/transform/org.eclipse.smarthome.transform.xslt/target/org.eclipse.smarthome.transform.xslt-0.8.0.b2.jar
[INFO] 
[INFO] --- tycho-p2-plugin:0.23.1:p2-metadata-default (default-p2-metadata-default) @ org.eclipse.smarthome.transform.xslt ---
[INFO] 
[INFO] --- maven-deploy-plugin:2.5:deploy (default-cli) @ org.eclipse.smarthome.transform.xslt ---
Uploading: https://repo.eclipse.org/content/repositories/smarthome-releases/org/eclipse/smarthome/transform/org.eclipse.smarthome.transform.xslt/0.8.0.b2/org.eclipse.smarthome.transform.xslt-0.8.0.b2.jar
Uploaded: https://repo.eclipse.org/content/repositories/smarthome-releases/org/eclipse/smarthome/transform/org.eclipse.smarthome.transform.xslt/0.8.0.b2/org.eclipse.smarthome.transform.xslt-0.8.0.b2.jar (6 KB at 21.6 KB/sec)
Uploading: https://repo.eclipse.org/content/repositories/smarthome-releases/org/eclipse/smarthome/transform/org.eclipse.smarthome.transform.xslt/0.8.0.b2/org.eclipse.smarthome.transform.xslt-0.8.0.b2.pom
Uploaded: https://repo.eclipse.org/content/repositories/smarthome-releases/org/eclipse/smarthome/transform/org.eclipse.smarthome.transform.xslt/0.8.0.b2/org.eclipse.smarthome.transform.xslt-0.8.0.b2.pom (650 B at 9.2 KB/sec)
Downloading: https://repo.eclipse.org/content/repositories/smarthome-releases/org/eclipse/smarthome/transform/org.eclipse.smarthome.transform.xslt/maven-metadata.xml
Downloaded: https://repo.eclipse.org/content/repositories/smarthome-releases/org/eclipse/smarthome/transform/org.eclipse.smarthome.transform.xslt/maven-metadata.xml (353 B at 5.5 KB/sec)
Uploading: https://repo.eclipse.org/content/repositories/smarthome-releases/org/eclipse/smarthome/transform/org.eclipse.smarthome.transform.xslt/maven-metadata.xml
Uploaded: https://repo.eclipse.org/content/repositories/smarthome-releases/org/eclipse/smarthome/transform/org.eclipse.smarthome.transform.xslt/maven-metadata.xml (387 B at 4.0 KB/sec)
Uploading: https://repo.eclipse.org/content/repositories/smarthome-releases/org/eclipse/smarthome/transform/org.eclipse.smarthome.transform.xslt/0.8.0.b2/org.eclipse.smarthome.transform.xslt-0.8.0.b2-sources.jar
Uploaded: https://repo.eclipse.org/content/repositories/smarthome-releases/org/eclipse/smarthome/transform/org.eclipse.smarthome.transform.xslt/0.8.0.b2/org.eclipse.smarthome.transform.xslt-0.8.0.b2-sources.jar (4 KB at 52.1 KB/sec)
Uploading: https://repo.eclipse.org/content/repositories/smarthome-releases/org/eclipse/smarthome/transform/org.eclipse.smarthome.transform.xslt/0.8.0.b2/org.eclipse.smarthome.transform.xslt-0.8.0.b2-p2metadata.xml
Uploaded: https://repo.eclipse.org/content/repositories/smarthome-releases/org/eclipse/smarthome/transform/org.eclipse.smarthome.transform.xslt/0.8.0.b2/org.eclipse.smarthome.transform.xslt-0.8.0.b2-p2metadata.xml (4 KB at 57.8 KB/sec)
Uploading: https://repo.eclipse.org/content/repositories/smarthome-releases/org/eclipse/smarthome/transform/org.eclipse.smarthome.transform.xslt/0.8.0.b2/org.eclipse.smarthome.transform.xslt-0.8.0.b2-p2artifacts.xml
Uploaded: https://repo.eclipse.org/content/repositories/smarthome-releases/org/eclipse/smarthome/transform/org.eclipse.smarthome.transform.xslt/0.8.0.b2/org.eclipse.smarthome.transform.xslt-0.8.0.b2-p2artifacts.xml (2 KB at 13.8 KB/sec)
[INFO]                                                                         
[INFO] ------------------------------------------------------------------------
[INFO] Building Eclipse SmartHome Xslt Transformation Service Tests 0.8.0.b2
[INFO] ------------------------------------------------------------------------
[INFO] 
[INFO] --- tycho-packaging-plugin:0.23.1:build-qualifier (default-build-qualifier) @ org.eclipse.smarthome.transform.xslt.test ---
[INFO] The project's OSGi version is 0.8.0.b2
[INFO] 
[INFO] --- tycho-packaging-plugin:0.23.1:validate-id (default-validate-id) @ org.eclipse.smarthome.transform.xslt.test ---
[INFO] 
[INFO] --- tycho-packaging-plugin:0.23.1:validate-version (default-validate-version) @ org.eclipse.smarthome.transform.xslt.test ---
[INFO] 
[INFO] --- xtend-maven-plugin:2.6.2:compile (default) @ org.eclipse.smarthome.transform.xslt.test ---
[INFO] No sources to compile in '/jobs/genie.smarthome/PublishRelease/workspace/extensions/transform/org.eclipse.smarthome.transform.xslt.test/src/test/java'
[INFO] 
[INFO] --- build-helper-maven-plugin:1.8:add-source (add-source) @ org.eclipse.smarthome.transform.xslt.test ---
[INFO] Source directory: /jobs/genie.smarthome/PublishRelease/workspace/extensions/transform/org.eclipse.smarthome.transform.xslt.test/src/main/groovy added.
[INFO] 
[INFO] --- maven-resources-plugin:2.4.3:resources (default-resources) @ org.eclipse.smarthome.transform.xslt.test ---
[INFO] Using 'UTF-8' encoding to copy filtered resources.
[INFO] skip non existing resourceDirectory /jobs/genie.smarthome/PublishRelease/workspace/extensions/transform/org.eclipse.smarthome.transform.xslt.test/src/main/resources
[INFO] 
[INFO] --- tycho-compiler-plugin:0.23.1:compile (default-compile) @ org.eclipse.smarthome.transform.xslt.test ---
[INFO] Nothing to compile - all classes are up to date
[INFO] 
[INFO] --- maven-compiler-plugin:3.1:compile (default) @ org.eclipse.smarthome.transform.xslt.test ---
[INFO] Changes detected - recompiling the module!
[INFO] Nothing to compile - all classes are up to date
[INFO] 
[INFO] --- xtend-maven-plugin:2.6.2:xtend-install-debug-info (default) @ org.eclipse.smarthome.transform.xslt.test ---
[WARNING] Directory /jobs/genie.smarthome/PublishRelease/workspace/extensions/transform/org.eclipse.smarthome.transform.xslt.test/src/main/java is empty. Can't process.
[WARNING] Directory /jobs/genie.smarthome/PublishRelease/workspace/extensions/transform/org.eclipse.smarthome.transform.xslt.test/xtend-gen is empty. Can't process.
[WARNING] Directory /jobs/genie.smarthome/PublishRelease/workspace/extensions/transform/org.eclipse.smarthome.transform.xslt.test/src/main/groovy is empty. Can't process.
[INFO] Installing Xtend files into 0 class files as secondary (via SMAP) debug sources in: /jobs/genie.smarthome/PublishRelease/workspace/extensions/transform/org.eclipse.smarthome.transform.xslt.test/target/classes
[INFO] 
[INFO] --- xtend-maven-plugin:2.6.2:testCompile (default) @ org.eclipse.smarthome.transform.xslt.test ---
[INFO] skip compiling sources because the configured directory '[]' does not exists.
[INFO] 
[INFO] --- build-helper-maven-plugin:1.8:add-test-source (add-test-source) @ org.eclipse.smarthome.transform.xslt.test ---
[INFO] Test Source directory: /jobs/genie.smarthome/PublishRelease/workspace/extensions/transform/org.eclipse.smarthome.transform.xslt.test/src/test/groovy added.
[INFO] 
[INFO] --- maven-resources-plugin:2.4.3:testResources (default-testResources) @ org.eclipse.smarthome.transform.xslt.test ---
[INFO] Using 'UTF-8' encoding to copy filtered resources.
[INFO] skip non existing resourceDirectory /jobs/genie.smarthome/PublishRelease/workspace/extensions/transform/org.eclipse.smarthome.transform.xslt.test/src/test/resources
[INFO] 
[INFO] --- xtend-maven-plugin:2.6.2:xtend-test-install-debug-info (default) @ org.eclipse.smarthome.transform.xslt.test ---
[WARNING] Directory /jobs/genie.smarthome/PublishRelease/workspace/extensions/transform/org.eclipse.smarthome.transform.xslt.test/xtend-gen is empty. Can't process.
[WARNING] Directory /jobs/genie.smarthome/PublishRelease/workspace/extensions/transform/org.eclipse.smarthome.transform.xslt.test/src/test/groovy is empty. Can't process.
[INFO] Installing Xtend files into 0 class files as secondary (via SMAP) debug sources in: /jobs/genie.smarthome/PublishRelease/workspace/extensions/transform/org.eclipse.smarthome.transform.xslt.test/target/test-classes
[INFO] 
[INFO] --- tycho-source-plugin:0.23.1:plugin-source (plugin-source) @ org.eclipse.smarthome.transform.xslt.test ---
[WARNING] bundle localization file /jobs/genie.smarthome/PublishRelease/workspace/extensions/transform/org.eclipse.smarthome.transform.xslt.test/plugin.properties not found
[INFO] Building jar: /jobs/genie.smarthome/PublishRelease/workspace/extensions/transform/org.eclipse.smarthome.transform.xslt.test/target/org.eclipse.smarthome.transform.xslt.test-0.8.0.b2-sources.jar
[INFO] 
[INFO] --- target-platform-configuration:0.23.1:target-platform (default-target-platform) @ org.eclipse.smarthome.transform.xslt.test ---
[INFO] 
[INFO] --- tycho-packaging-plugin:0.23.1:package-plugin (default-package-plugin) @ org.eclipse.smarthome.transform.xslt.test ---
[INFO] Building jar: /jobs/genie.smarthome/PublishRelease/workspace/extensions/transform/org.eclipse.smarthome.transform.xslt.test/target/org.eclipse.smarthome.transform.xslt.test-0.8.0.b2.jar
[INFO] 
[INFO] --- tycho-p2-plugin:0.23.1:p2-metadata-default (default-p2-metadata-default) @ org.eclipse.smarthome.transform.xslt.test ---
[INFO] 
[INFO] --- maven-deploy-plugin:2.5:deploy (default-cli) @ org.eclipse.smarthome.transform.xslt.test ---
Uploading: https://repo.eclipse.org/content/repositories/smarthome-releases/org/eclipse/smarthome/transform/org.eclipse.smarthome.transform.xslt.test/0.8.0.b2/org.eclipse.smarthome.transform.xslt.test-0.8.0.b2.jar
Uploaded: https://repo.eclipse.org/content/repositories/smarthome-releases/org/eclipse/smarthome/transform/org.eclipse.smarthome.transform.xslt.test/0.8.0.b2/org.eclipse.smarthome.transform.xslt.test-0.8.0.b2.jar (6 KB at 71.2 KB/sec)
Uploading: https://repo.eclipse.org/content/repositories/smarthome-releases/org/eclipse/smarthome/transform/org.eclipse.smarthome.transform.xslt.test/0.8.0.b2/org.eclipse.smarthome.transform.xslt.test-0.8.0.b2.pom
Uploaded: https://repo.eclipse.org/content/repositories/smarthome-releases/org/eclipse/smarthome/transform/org.eclipse.smarthome.transform.xslt.test/0.8.0.b2/org.eclipse.smarthome.transform.xslt.test-0.8.0.b2.pom (2 KB at 9.9 KB/sec)
Downloading: https://repo.eclipse.org/content/repositories/smarthome-releases/org/eclipse/smarthome/transform/org.eclipse.smarthome.transform.xslt.test/maven-metadata.xml
Downloaded: https://repo.eclipse.org/content/repositories/smarthome-releases/org/eclipse/smarthome/transform/org.eclipse.smarthome.transform.xslt.test/maven-metadata.xml (358 B at 7.9 KB/sec)
Uploading: https://repo.eclipse.org/content/repositories/smarthome-releases/org/eclipse/smarthome/transform/org.eclipse.smarthome.transform.xslt.test/maven-metadata.xml
Uploaded: https://repo.eclipse.org/content/repositories/smarthome-releases/org/eclipse/smarthome/transform/org.eclipse.smarthome.transform.xslt.test/maven-metadata.xml (392 B at 3.2 KB/sec)
Uploading: https://repo.eclipse.org/content/repositories/smarthome-releases/org/eclipse/smarthome/transform/org.eclipse.smarthome.transform.xslt.test/0.8.0.b2/org.eclipse.smarthome.transform.xslt.test-0.8.0.b2-sources.jar
Uploaded: https://repo.eclipse.org/content/repositories/smarthome-releases/org/eclipse/smarthome/transform/org.eclipse.smarthome.transform.xslt.test/0.8.0.b2/org.eclipse.smarthome.transform.xslt.test-0.8.0.b2-sources.jar (4 KB at 60.2 KB/sec)
Uploading: https://repo.eclipse.org/content/repositories/smarthome-releases/org/eclipse/smarthome/transform/org.eclipse.smarthome.transform.xslt.test/0.8.0.b2/org.eclipse.smarthome.transform.xslt.test-0.8.0.b2-p2metadata.xml
Uploaded: https://repo.eclipse.org/content/repositories/smarthome-releases/org/eclipse/smarthome/transform/org.eclipse.smarthome.transform.xslt.test/0.8.0.b2/org.eclipse.smarthome.transform.xslt.test-0.8.0.b2-p2metadata.xml (4 KB at 68.3 KB/sec)
Uploading: https://repo.eclipse.org/content/repositories/smarthome-releases/org/eclipse/smarthome/transform/org.eclipse.smarthome.transform.xslt.test/0.8.0.b2/org.eclipse.smarthome.transform.xslt.test-0.8.0.b2-p2artifacts.xml
Uploaded: https://repo.eclipse.org/content/repositories/smarthome-releases/org/eclipse/smarthome/transform/org.eclipse.smarthome.transform.xslt.test/0.8.0.b2/org.eclipse.smarthome.transform.xslt.test-0.8.0.b2-p2artifacts.xml (2 KB at 13.4 KB/sec)
[INFO]                                                                         
[INFO] ------------------------------------------------------------------------
[INFO] Building Eclipse SmartHome UI Extensions 0.8.0.b2
[INFO] ------------------------------------------------------------------------
[INFO] 
[INFO] --- xtend-maven-plugin:2.6.2:compile (default) @ pom ---
[INFO] skip compiling sources because the configured directory '[/jobs/genie.smarthome/PublishRelease/workspace/extensions/ui/src/main/java]' does not exists.
[INFO] 
[INFO] --- build-helper-maven-plugin:1.8:add-source (add-source) @ pom ---
[INFO] Source directory: /jobs/genie.smarthome/PublishRelease/workspace/extensions/ui/src/main/groovy added.
[INFO] 
[INFO] --- maven-compiler-plugin:3.1:compile (default) @ pom ---
[INFO] No sources to compile
[INFO] 
[INFO] --- xtend-maven-plugin:2.6.2:xtend-install-debug-info (default) @ pom ---
[WARNING] Directory /jobs/genie.smarthome/PublishRelease/workspace/extensions/ui/src/main/java is empty. Can't process.
[WARNING] Directory /jobs/genie.smarthome/PublishRelease/workspace/extensions/ui/xtend-gen is empty. Can't process.
[WARNING] Directory /jobs/genie.smarthome/PublishRelease/workspace/extensions/ui/src/main/groovy is empty. Can't process.
[INFO] Installing Xtend files into 0 class files as secondary (via SMAP) debug sources in: /jobs/genie.smarthome/PublishRelease/workspace/extensions/ui/target/classes
[INFO] 
[INFO] --- xtend-maven-plugin:2.6.2:testCompile (default) @ pom ---
[INFO] skip compiling sources because the configured directory '[/jobs/genie.smarthome/PublishRelease/workspace/extensions/ui/src/test/java]' does not exists.
[INFO] 
[INFO] --- build-helper-maven-plugin:1.8:add-test-source (add-test-source) @ pom ---
[INFO] Test Source directory: /jobs/genie.smarthome/PublishRelease/workspace/extensions/ui/src/test/groovy added.
[INFO] 
[INFO] --- xtend-maven-plugin:2.6.2:xtend-test-install-debug-info (default) @ pom ---
[WARNING] Directory /jobs/genie.smarthome/PublishRelease/workspace/extensions/ui/src/test/java is empty. Can't process.
[WARNING] Directory /jobs/genie.smarthome/PublishRelease/workspace/extensions/ui/xtend-gen is empty. Can't process.
[WARNING] Directory /jobs/genie.smarthome/PublishRelease/workspace/extensions/ui/src/test/groovy is empty. Can't process.
[INFO] Installing Xtend files into 0 class files as secondary (via SMAP) debug sources in: /jobs/genie.smarthome/PublishRelease/workspace/extensions/ui/target/test-classes
[INFO] 
[INFO] --- tycho-source-plugin:0.23.1:plugin-source (plugin-source) @ pom ---
[INFO] 
[INFO] --- maven-deploy-plugin:2.7:deploy (default-cli) @ pom ---
Uploading: https://repo.eclipse.org/content/repositories/smarthome-releases/org/eclipse/smarthome/extension/ui/pom/0.8.0.b2/pom-0.8.0.b2.pom
Uploaded: https://repo.eclipse.org/content/repositories/smarthome-releases/org/eclipse/smarthome/extension/ui/pom/0.8.0.b2/pom-0.8.0.b2.pom (816 B at 11.2 KB/sec)
Downloading: https://repo.eclipse.org/content/repositories/smarthome-releases/org/eclipse/smarthome/extension/ui/pom/maven-metadata.xml
Downloaded: https://repo.eclipse.org/content/repositories/smarthome-releases/org/eclipse/smarthome/extension/ui/pom/maven-metadata.xml (323 B at 5.3 KB/sec)
Uploading: https://repo.eclipse.org/content/repositories/smarthome-releases/org/eclipse/smarthome/extension/ui/pom/maven-metadata.xml
Uploaded: https://repo.eclipse.org/content/repositories/smarthome-releases/org/eclipse/smarthome/extension/ui/pom/maven-metadata.xml (357 B at 4.1 KB/sec)
[INFO]                                                                         
[INFO] ------------------------------------------------------------------------
[INFO] Building Eclipse SmartHome Icon Sets 0.8.0.b2
[INFO] ------------------------------------------------------------------------
[INFO] 
[INFO] --- xtend-maven-plugin:2.6.2:compile (default) @ pom ---
[INFO] skip compiling sources because the configured directory '[/jobs/genie.smarthome/PublishRelease/workspace/extensions/ui/iconset/src/main/java]' does not exists.
[INFO] 
[INFO] --- build-helper-maven-plugin:1.8:add-source (add-source) @ pom ---
[INFO] Source directory: /jobs/genie.smarthome/PublishRelease/workspace/extensions/ui/iconset/src/main/groovy added.
[INFO] 
[INFO] --- maven-compiler-plugin:3.1:compile (default) @ pom ---
[INFO] No sources to compile
[INFO] 
[INFO] --- xtend-maven-plugin:2.6.2:xtend-install-debug-info (default) @ pom ---
[WARNING] Directory /jobs/genie.smarthome/PublishRelease/workspace/extensions/ui/iconset/src/main/java is empty. Can't process.
[WARNING] Directory /jobs/genie.smarthome/PublishRelease/workspace/extensions/ui/iconset/xtend-gen is empty. Can't process.
[WARNING] Directory /jobs/genie.smarthome/PublishRelease/workspace/extensions/ui/iconset/src/main/groovy is empty. Can't process.
[INFO] Installing Xtend files into 0 class files as secondary (via SMAP) debug sources in: /jobs/genie.smarthome/PublishRelease/workspace/extensions/ui/iconset/target/classes
[INFO] 
[INFO] --- xtend-maven-plugin:2.6.2:testCompile (default) @ pom ---
[INFO] skip compiling sources because the configured directory '[/jobs/genie.smarthome/PublishRelease/workspace/extensions/ui/iconset/src/test/java]' does not exists.
[INFO] 
[INFO] --- build-helper-maven-plugin:1.8:add-test-source (add-test-source) @ pom ---
[INFO] Test Source directory: /jobs/genie.smarthome/PublishRelease/workspace/extensions/ui/iconset/src/test/groovy added.
[INFO] 
[INFO] --- xtend-maven-plugin:2.6.2:xtend-test-install-debug-info (default) @ pom ---
[WARNING] Directory /jobs/genie.smarthome/PublishRelease/workspace/extensions/ui/iconset/src/test/java is empty. Can't process.
[WARNING] Directory /jobs/genie.smarthome/PublishRelease/workspace/extensions/ui/iconset/xtend-gen is empty. Can't process.
[WARNING] Directory /jobs/genie.smarthome/PublishRelease/workspace/extensions/ui/iconset/src/test/groovy is empty. Can't process.
[INFO] Installing Xtend files into 0 class files as secondary (via SMAP) debug sources in: /jobs/genie.smarthome/PublishRelease/workspace/extensions/ui/iconset/target/test-classes
[INFO] 
[INFO] --- tycho-source-plugin:0.23.1:plugin-source (plugin-source) @ pom ---
[INFO] 
[INFO] --- maven-deploy-plugin:2.7:deploy (default-cli) @ pom ---
Uploading: https://repo.eclipse.org/content/repositories/smarthome-releases/org/eclipse/smarthome/extension/ui/iconset/pom/0.8.0.b2/pom-0.8.0.b2.pom
Uploaded: https://repo.eclipse.org/content/repositories/smarthome-releases/org/eclipse/smarthome/extension/ui/iconset/pom/0.8.0.b2/pom-0.8.0.b2.pom (698 B at 8.3 KB/sec)
Downloading: https://repo.eclipse.org/content/repositories/smarthome-releases/org/eclipse/smarthome/extension/ui/iconset/pom/maven-metadata.xml
Downloaded: https://repo.eclipse.org/content/repositories/smarthome-releases/org/eclipse/smarthome/extension/ui/iconset/pom/maven-metadata.xml (331 B at 7.9 KB/sec)
Uploading: https://repo.eclipse.org/content/repositories/smarthome-releases/org/eclipse/smarthome/extension/ui/iconset/pom/maven-metadata.xml
Uploaded: https://repo.eclipse.org/content/repositories/smarthome-releases/org/eclipse/smarthome/extension/ui/iconset/pom/maven-metadata.xml (365 B at 5.2 KB/sec)
[INFO]                                                                         
[INFO] ------------------------------------------------------------------------
[INFO] Building Eclipse SmartHome Classic Icon Set 0.8.0.b2
[INFO] ------------------------------------------------------------------------
[INFO] 
[INFO] --- tycho-packaging-plugin:0.23.1:build-qualifier (default-build-qualifier) @ org.eclipse.smarthome.ui.iconset.classic ---
[INFO] The project's OSGi version is 0.8.0.b2
[INFO] 
[INFO] --- tycho-packaging-plugin:0.23.1:validate-id (default-validate-id) @ org.eclipse.smarthome.ui.iconset.classic ---
[INFO] 
[INFO] --- tycho-packaging-plugin:0.23.1:validate-version (default-validate-version) @ org.eclipse.smarthome.ui.iconset.classic ---
[INFO] 
[INFO] --- xtend-maven-plugin:2.6.2:compile (default) @ org.eclipse.smarthome.ui.iconset.classic ---
[INFO] No sources to compile in '/jobs/genie.smarthome/PublishRelease/workspace/extensions/ui/iconset/org.eclipse.smarthome.ui.iconset.classic/src/main/java'
[INFO] 
[INFO] --- build-helper-maven-plugin:1.8:add-source (add-source) @ org.eclipse.smarthome.ui.iconset.classic ---
[INFO] Source directory: /jobs/genie.smarthome/PublishRelease/workspace/extensions/ui/iconset/org.eclipse.smarthome.ui.iconset.classic/src/main/groovy added.
[INFO] 
[INFO] --- maven-resources-plugin:2.4.3:resources (default-resources) @ org.eclipse.smarthome.ui.iconset.classic ---
[INFO] Using 'UTF-8' encoding to copy filtered resources.
[INFO] skip non existing resourceDirectory /jobs/genie.smarthome/PublishRelease/workspace/extensions/ui/iconset/org.eclipse.smarthome.ui.iconset.classic/src/main/resources
[INFO] 
[INFO] --- tycho-compiler-plugin:0.23.1:compile (default-compile) @ org.eclipse.smarthome.ui.iconset.classic ---
[INFO] Nothing to compile - all classes are up to date
[INFO] 
[INFO] --- maven-compiler-plugin:3.1:compile (default) @ org.eclipse.smarthome.ui.iconset.classic ---
[INFO] Changes detected - recompiling the module!
[INFO] Nothing to compile - all classes are up to date
[INFO] 
[INFO] --- xtend-maven-plugin:2.6.2:xtend-install-debug-info (default) @ org.eclipse.smarthome.ui.iconset.classic ---
[WARNING] Directory /jobs/genie.smarthome/PublishRelease/workspace/extensions/ui/iconset/org.eclipse.smarthome.ui.iconset.classic/xtend-gen is empty. Can't process.
[WARNING] Directory /jobs/genie.smarthome/PublishRelease/workspace/extensions/ui/iconset/org.eclipse.smarthome.ui.iconset.classic/src/main/groovy is empty. Can't process.
[INFO] Installing Xtend files into 0 class files as secondary (via SMAP) debug sources in: /jobs/genie.smarthome/PublishRelease/workspace/extensions/ui/iconset/org.eclipse.smarthome.ui.iconset.classic/target/classes
[INFO] 
[INFO] --- xtend-maven-plugin:2.6.2:testCompile (default) @ org.eclipse.smarthome.ui.iconset.classic ---
[INFO] skip compiling sources because the configured directory '[/jobs/genie.smarthome/PublishRelease/workspace/extensions/ui/iconset/org.eclipse.smarthome.ui.iconset.classic/src/test/java]' does not exists.
[INFO] 
[INFO] --- build-helper-maven-plugin:1.8:add-test-source (add-test-source) @ org.eclipse.smarthome.ui.iconset.classic ---
[INFO] Test Source directory: /jobs/genie.smarthome/PublishRelease/workspace/extensions/ui/iconset/org.eclipse.smarthome.ui.iconset.classic/src/test/groovy added.
[INFO] 
[INFO] --- maven-resources-plugin:2.4.3:testResources (default-testResources) @ org.eclipse.smarthome.ui.iconset.classic ---
[INFO] Using 'UTF-8' encoding to copy filtered resources.
[INFO] skip non existing resourceDirectory /jobs/genie.smarthome/PublishRelease/workspace/extensions/ui/iconset/org.eclipse.smarthome.ui.iconset.classic/src/test/resources
[INFO] 
[INFO] --- xtend-maven-plugin:2.6.2:xtend-test-install-debug-info (default) @ org.eclipse.smarthome.ui.iconset.classic ---
[WARNING] Directory /jobs/genie.smarthome/PublishRelease/workspace/extensions/ui/iconset/org.eclipse.smarthome.ui.iconset.classic/src/test/java is empty. Can't process.
[WARNING] Directory /jobs/genie.smarthome/PublishRelease/workspace/extensions/ui/iconset/org.eclipse.smarthome.ui.iconset.classic/xtend-gen is empty. Can't process.
[WARNING] Directory /jobs/genie.smarthome/PublishRelease/workspace/extensions/ui/iconset/org.eclipse.smarthome.ui.iconset.classic/src/test/groovy is empty. Can't process.
[INFO] Installing Xtend files into 0 class files as secondary (via SMAP) debug sources in: /jobs/genie.smarthome/PublishRelease/workspace/extensions/ui/iconset/org.eclipse.smarthome.ui.iconset.classic/target/test-classes
[INFO] 
[INFO] --- tycho-source-plugin:0.23.1:plugin-source (plugin-source) @ org.eclipse.smarthome.ui.iconset.classic ---
[WARNING] bundle localization file /jobs/genie.smarthome/PublishRelease/workspace/extensions/ui/iconset/org.eclipse.smarthome.ui.iconset.classic/plugin.properties not found
[INFO] Building jar: /jobs/genie.smarthome/PublishRelease/workspace/extensions/ui/iconset/org.eclipse.smarthome.ui.iconset.classic/target/org.eclipse.smarthome.ui.iconset.classic-0.8.0.b2-sources.jar
[INFO] 
[INFO] --- target-platform-configuration:0.23.1:target-platform (default-target-platform) @ org.eclipse.smarthome.ui.iconset.classic ---
[INFO] 
[INFO] --- tycho-packaging-plugin:0.23.1:package-plugin (default-package-plugin) @ org.eclipse.smarthome.ui.iconset.classic ---
[INFO] Building jar: /jobs/genie.smarthome/PublishRelease/workspace/extensions/ui/iconset/org.eclipse.smarthome.ui.iconset.classic/target/org.eclipse.smarthome.ui.iconset.classic-0.8.0.b2.jar
[INFO] 
[INFO] --- tycho-p2-plugin:0.23.1:p2-metadata-default (default-p2-metadata-default) @ org.eclipse.smarthome.ui.iconset.classic ---
[INFO] 
[INFO] --- maven-deploy-plugin:2.5:deploy (default-cli) @ org.eclipse.smarthome.ui.iconset.classic ---
Uploading: https://repo.eclipse.org/content/repositories/smarthome-releases/org/eclipse/smarthome/extension/ui/iconset/org.eclipse.smarthome.ui.iconset.classic/0.8.0.b2/org.eclipse.smarthome.ui.iconset.classic-0.8.0.b2.jar
Uploaded: https://repo.eclipse.org/content/repositories/smarthome-releases/org/eclipse/smarthome/extension/ui/iconset/org.eclipse.smarthome.ui.iconset.classic/0.8.0.b2/org.eclipse.smarthome.ui.iconset.classic-0.8.0.b2.jar (16 KB at 174.7 KB/sec)
Uploading: https://repo.eclipse.org/content/repositories/smarthome-releases/org/eclipse/smarthome/extension/ui/iconset/org.eclipse.smarthome.ui.iconset.classic/0.8.0.b2/org.eclipse.smarthome.ui.iconset.classic-0.8.0.b2.pom
Uploaded: https://repo.eclipse.org/content/repositories/smarthome-releases/org/eclipse/smarthome/extension/ui/iconset/org.eclipse.smarthome.ui.iconset.classic/0.8.0.b2/org.eclipse.smarthome.ui.iconset.classic-0.8.0.b2.pom (670 B at 7.8 KB/sec)
Downloading: https://repo.eclipse.org/content/repositories/smarthome-releases/org/eclipse/smarthome/extension/ui/iconset/org.eclipse.smarthome.ui.iconset.classic/maven-metadata.xml
Downloaded: https://repo.eclipse.org/content/repositories/smarthome-releases/org/eclipse/smarthome/extension/ui/iconset/org.eclipse.smarthome.ui.iconset.classic/maven-metadata.xml (368 B at 6.7 KB/sec)
Uploading: https://repo.eclipse.org/content/repositories/smarthome-releases/org/eclipse/smarthome/extension/ui/iconset/org.eclipse.smarthome.ui.iconset.classic/maven-metadata.xml
Uploaded: https://repo.eclipse.org/content/repositories/smarthome-releases/org/eclipse/smarthome/extension/ui/iconset/org.eclipse.smarthome.ui.iconset.classic/maven-metadata.xml (402 B at 5.0 KB/sec)
Uploading: https://repo.eclipse.org/content/repositories/smarthome-releases/org/eclipse/smarthome/extension/ui/iconset/org.eclipse.smarthome.ui.iconset.classic/0.8.0.b2/org.eclipse.smarthome.ui.iconset.classic-0.8.0.b2-sources.jar
Uploaded: https://repo.eclipse.org/content/repositories/smarthome-releases/org/eclipse/smarthome/extension/ui/iconset/org.eclipse.smarthome.ui.iconset.classic/0.8.0.b2/org.eclipse.smarthome.ui.iconset.classic-0.8.0.b2-sources.jar (4 KB at 38.6 KB/sec)
Uploading: https://repo.eclipse.org/content/repositories/smarthome-releases/org/eclipse/smarthome/extension/ui/iconset/org.eclipse.smarthome.ui.iconset.classic/0.8.0.b2/org.eclipse.smarthome.ui.iconset.classic-0.8.0.b2-p2metadata.xml
Uploaded: https://repo.eclipse.org/content/repositories/smarthome-releases/org/eclipse/smarthome/extension/ui/iconset/org.eclipse.smarthome.ui.iconset.classic/0.8.0.b2/org.eclipse.smarthome.ui.iconset.classic-0.8.0.b2-p2metadata.xml (4 KB at 58.0 KB/sec)
Uploading: https://repo.eclipse.org/content/repositories/smarthome-releases/org/eclipse/smarthome/extension/ui/iconset/org.eclipse.smarthome.ui.iconset.classic/0.8.0.b2/org.eclipse.smarthome.ui.iconset.classic-0.8.0.b2-p2artifacts.xml
Uploaded: https://repo.eclipse.org/content/repositories/smarthome-releases/org/eclipse/smarthome/extension/ui/iconset/org.eclipse.smarthome.ui.iconset.classic/0.8.0.b2/org.eclipse.smarthome.ui.iconset.classic-0.8.0.b2-p2artifacts.xml (2 KB at 13.1 KB/sec)
[INFO]                                                                         
[INFO] ------------------------------------------------------------------------
[INFO] Building Eclipse SmartHome Basic UI 0.8.0.b2
[INFO] ------------------------------------------------------------------------
[INFO] 
[INFO] --- tycho-packaging-plugin:0.23.1:build-qualifier (default-build-qualifier) @ org.eclipse.smarthome.ui.basic ---
[INFO] The project's OSGi version is 0.8.0.b2
[INFO] 
[INFO] --- tycho-packaging-plugin:0.23.1:validate-id (default-validate-id) @ org.eclipse.smarthome.ui.basic ---
[INFO] 
[INFO] --- tycho-packaging-plugin:0.23.1:validate-version (default-validate-version) @ org.eclipse.smarthome.ui.basic ---
[INFO] 
[INFO] --- xtend-maven-plugin:2.6.2:compile (default) @ org.eclipse.smarthome.ui.basic ---
[INFO] No sources to compile in '/jobs/genie.smarthome/PublishRelease/workspace/extensions/ui/org.eclipse.smarthome.ui.basic/src/main/java:/jobs/genie.smarthome/PublishRelease/workspace/extensions/ui/org.eclipse.smarthome.ui.basic/src/main/resources'
[INFO] 
[INFO] --- build-helper-maven-plugin:1.8:add-source (add-source) @ org.eclipse.smarthome.ui.basic ---
[INFO] Source directory: /jobs/genie.smarthome/PublishRelease/workspace/extensions/ui/org.eclipse.smarthome.ui.basic/src/main/groovy added.
[INFO] 
[INFO] --- maven-resources-plugin:2.4.3:resources (default-resources) @ org.eclipse.smarthome.ui.basic ---
[INFO] Using 'UTF-8' encoding to copy filtered resources.
[INFO] Copying 1 resource
[INFO] 
[INFO] --- tycho-compiler-plugin:0.23.1:compile (default-compile) @ org.eclipse.smarthome.ui.basic ---
[INFO] Nothing to compile - all classes are up to date
[INFO] 
[INFO] --- maven-compiler-plugin:3.1:compile (default) @ org.eclipse.smarthome.ui.basic ---
[INFO] Changes detected - recompiling the module!
[INFO] Nothing to compile - all classes are up to date
[INFO] 
[INFO] --- xtend-maven-plugin:2.6.2:xtend-install-debug-info (default) @ org.eclipse.smarthome.ui.basic ---
[WARNING] Directory /jobs/genie.smarthome/PublishRelease/workspace/extensions/ui/org.eclipse.smarthome.ui.basic/xtend-gen is empty. Can't process.
[WARNING] Directory /jobs/genie.smarthome/PublishRelease/workspace/extensions/ui/org.eclipse.smarthome.ui.basic/src/main/groovy is empty. Can't process.
[INFO] Installing Xtend files into 0 class files as secondary (via SMAP) debug sources in: /jobs/genie.smarthome/PublishRelease/workspace/extensions/ui/org.eclipse.smarthome.ui.basic/target/classes
[INFO] 
[INFO] --- xtend-maven-plugin:2.6.2:testCompile (default) @ org.eclipse.smarthome.ui.basic ---
[INFO] skip compiling sources because the configured directory '[/jobs/genie.smarthome/PublishRelease/workspace/extensions/ui/org.eclipse.smarthome.ui.basic/src/test/java]' does not exists.
[INFO] 
[INFO] --- build-helper-maven-plugin:1.8:add-test-source (add-test-source) @ org.eclipse.smarthome.ui.basic ---
[INFO] Test Source directory: /jobs/genie.smarthome/PublishRelease/workspace/extensions/ui/org.eclipse.smarthome.ui.basic/src/test/groovy added.
[INFO] 
[INFO] --- maven-resources-plugin:2.4.3:testResources (default-testResources) @ org.eclipse.smarthome.ui.basic ---
[INFO] Using 'UTF-8' encoding to copy filtered resources.
[INFO] skip non existing resourceDirectory /jobs/genie.smarthome/PublishRelease/workspace/extensions/ui/org.eclipse.smarthome.ui.basic/src/test/resources
[INFO] 
[INFO] --- xtend-maven-plugin:2.6.2:xtend-test-install-debug-info (default) @ org.eclipse.smarthome.ui.basic ---
[WARNING] Directory /jobs/genie.smarthome/PublishRelease/workspace/extensions/ui/org.eclipse.smarthome.ui.basic/src/test/java is empty. Can't process.
[WARNING] Directory /jobs/genie.smarthome/PublishRelease/workspace/extensions/ui/org.eclipse.smarthome.ui.basic/xtend-gen is empty. Can't process.
[WARNING] Directory /jobs/genie.smarthome/PublishRelease/workspace/extensions/ui/org.eclipse.smarthome.ui.basic/src/test/groovy is empty. Can't process.
[INFO] Installing Xtend files into 0 class files as secondary (via SMAP) debug sources in: /jobs/genie.smarthome/PublishRelease/workspace/extensions/ui/org.eclipse.smarthome.ui.basic/target/test-classes
[INFO] 
[INFO] --- tycho-source-plugin:0.23.1:plugin-source (plugin-source) @ org.eclipse.smarthome.ui.basic ---
[WARNING] bundle localization file /jobs/genie.smarthome/PublishRelease/workspace/extensions/ui/org.eclipse.smarthome.ui.basic/plugin.properties not found
[INFO] Building jar: /jobs/genie.smarthome/PublishRelease/workspace/extensions/ui/org.eclipse.smarthome.ui.basic/target/org.eclipse.smarthome.ui.basic-0.8.0.b2-sources.jar
[INFO] 
[INFO] --- target-platform-configuration:0.23.1:target-platform (default-target-platform) @ org.eclipse.smarthome.ui.basic ---
[INFO] 
[INFO] --- tycho-packaging-plugin:0.23.1:package-plugin (default-package-plugin) @ org.eclipse.smarthome.ui.basic ---
[INFO] Building jar: /jobs/genie.smarthome/PublishRelease/workspace/extensions/ui/org.eclipse.smarthome.ui.basic/target/org.eclipse.smarthome.ui.basic-0.8.0.b2.jar
[INFO] 
[INFO] --- tycho-p2-plugin:0.23.1:p2-metadata-default (default-p2-metadata-default) @ org.eclipse.smarthome.ui.basic ---
[INFO] 
[INFO] --- maven-deploy-plugin:2.5:deploy (default-cli) @ org.eclipse.smarthome.ui.basic ---
Uploading: https://repo.eclipse.org/content/repositories/smarthome-releases/org/eclipse/smarthome/extension/ui/org.eclipse.smarthome.ui.basic/0.8.0.b2/org.eclipse.smarthome.ui.basic-0.8.0.b2.jar
Uploaded: https://repo.eclipse.org/content/repositories/smarthome-releases/org/eclipse/smarthome/extension/ui/org.eclipse.smarthome.ui.basic/0.8.0.b2/org.eclipse.smarthome.ui.basic-0.8.0.b2.jar (1054 KB at 8230.8 KB/sec)
Uploading: https://repo.eclipse.org/content/repositories/smarthome-releases/org/eclipse/smarthome/extension/ui/org.eclipse.smarthome.ui.basic/0.8.0.b2/org.eclipse.smarthome.ui.basic-0.8.0.b2.pom
Uploaded: https://repo.eclipse.org/content/repositories/smarthome-releases/org/eclipse/smarthome/extension/ui/org.eclipse.smarthome.ui.basic/0.8.0.b2/org.eclipse.smarthome.ui.basic-0.8.0.b2.pom (580 B at 9.4 KB/sec)
Downloading: https://repo.eclipse.org/content/repositories/smarthome-releases/org/eclipse/smarthome/extension/ui/org.eclipse.smarthome.ui.basic/maven-metadata.xml
Downloaded: https://repo.eclipse.org/content/repositories/smarthome-releases/org/eclipse/smarthome/extension/ui/org.eclipse.smarthome.ui.basic/maven-metadata.xml (350 B at 6.3 KB/sec)
Uploading: https://repo.eclipse.org/content/repositories/smarthome-releases/org/eclipse/smarthome/extension/ui/org.eclipse.smarthome.ui.basic/maven-metadata.xml
Uploaded: https://repo.eclipse.org/content/repositories/smarthome-releases/org/eclipse/smarthome/extension/ui/org.eclipse.smarthome.ui.basic/maven-metadata.xml (384 B at 5.5 KB/sec)
Uploading: https://repo.eclipse.org/content/repositories/smarthome-releases/org/eclipse/smarthome/extension/ui/org.eclipse.smarthome.ui.basic/0.8.0.b2/org.eclipse.smarthome.ui.basic-0.8.0.b2-sources.jar
Uploaded: https://repo.eclipse.org/content/repositories/smarthome-releases/org/eclipse/smarthome/extension/ui/org.eclipse.smarthome.ui.basic/0.8.0.b2/org.eclipse.smarthome.ui.basic-0.8.0.b2-sources.jar (33 KB at 357.3 KB/sec)
Uploading: https://repo.eclipse.org/content/repositories/smarthome-releases/org/eclipse/smarthome/extension/ui/org.eclipse.smarthome.ui.basic/0.8.0.b2/org.eclipse.smarthome.ui.basic-0.8.0.b2-p2metadata.xml
Uploaded: https://repo.eclipse.org/content/repositories/smarthome-releases/org/eclipse/smarthome/extension/ui/org.eclipse.smarthome.ui.basic/0.8.0.b2/org.eclipse.smarthome.ui.basic-0.8.0.b2-p2metadata.xml (6 KB at 90.3 KB/sec)
Uploading: https://repo.eclipse.org/content/repositories/smarthome-releases/org/eclipse/smarthome/extension/ui/org.eclipse.smarthome.ui.basic/0.8.0.b2/org.eclipse.smarthome.ui.basic-0.8.0.b2-p2artifacts.xml
Uploaded: https://repo.eclipse.org/content/repositories/smarthome-releases/org/eclipse/smarthome/extension/ui/org.eclipse.smarthome.ui.basic/0.8.0.b2/org.eclipse.smarthome.ui.basic-0.8.0.b2-p2artifacts.xml (2 KB at 17.3 KB/sec)
[INFO]                                                                         
[INFO] ------------------------------------------------------------------------
[INFO] Building Eclipse SmartHome Classic UI 0.8.0.b2
[INFO] ------------------------------------------------------------------------
[INFO] 
[INFO] --- tycho-packaging-plugin:0.23.1:build-qualifier (default-build-qualifier) @ org.eclipse.smarthome.ui.classic ---
[INFO] The project's OSGi version is 0.8.0.b2
[INFO] 
[INFO] --- tycho-packaging-plugin:0.23.1:validate-id (default-validate-id) @ org.eclipse.smarthome.ui.classic ---
[INFO] 
[INFO] --- tycho-packaging-plugin:0.23.1:validate-version (default-validate-version) @ org.eclipse.smarthome.ui.classic ---
[INFO] 
[INFO] --- xtend-maven-plugin:2.6.2:compile (default) @ org.eclipse.smarthome.ui.classic ---
[INFO] No sources to compile in '/jobs/genie.smarthome/PublishRelease/workspace/extensions/ui/org.eclipse.smarthome.ui.classic/src/main/java:/jobs/genie.smarthome/PublishRelease/workspace/extensions/ui/org.eclipse.smarthome.ui.classic/src/main/resources'
[INFO] 
[INFO] --- build-helper-maven-plugin:1.8:add-source (add-source) @ org.eclipse.smarthome.ui.classic ---
[INFO] Source directory: /jobs/genie.smarthome/PublishRelease/workspace/extensions/ui/org.eclipse.smarthome.ui.classic/src/main/groovy added.
[INFO] 
[INFO] --- maven-resources-plugin:2.4.3:resources (default-resources) @ org.eclipse.smarthome.ui.classic ---
[INFO] Using 'UTF-8' encoding to copy filtered resources.
[INFO] Copying 1 resource
[INFO] 
[INFO] --- tycho-compiler-plugin:0.23.1:compile (default-compile) @ org.eclipse.smarthome.ui.classic ---
[INFO] Nothing to compile - all classes are up to date
[INFO] 
[INFO] --- maven-compiler-plugin:3.1:compile (default) @ org.eclipse.smarthome.ui.classic ---
[INFO] Changes detected - recompiling the module!
[INFO] Nothing to compile - all classes are up to date
[INFO] 
[INFO] --- xtend-maven-plugin:2.6.2:xtend-install-debug-info (default) @ org.eclipse.smarthome.ui.classic ---
[WARNING] Directory /jobs/genie.smarthome/PublishRelease/workspace/extensions/ui/org.eclipse.smarthome.ui.classic/xtend-gen is empty. Can't process.
[WARNING] Directory /jobs/genie.smarthome/PublishRelease/workspace/extensions/ui/org.eclipse.smarthome.ui.classic/src/main/groovy is empty. Can't process.
[INFO] Installing Xtend files into 0 class files as secondary (via SMAP) debug sources in: /jobs/genie.smarthome/PublishRelease/workspace/extensions/ui/org.eclipse.smarthome.ui.classic/target/classes
[INFO] 
[INFO] --- xtend-maven-plugin:2.6.2:testCompile (default) @ org.eclipse.smarthome.ui.classic ---
[INFO] skip compiling sources because the configured directory '[/jobs/genie.smarthome/PublishRelease/workspace/extensions/ui/org.eclipse.smarthome.ui.classic/src/test/java]' does not exists.
[INFO] 
[INFO] --- build-helper-maven-plugin:1.8:add-test-source (add-test-source) @ org.eclipse.smarthome.ui.classic ---
[INFO] Test Source directory: /jobs/genie.smarthome/PublishRelease/workspace/extensions/ui/org.eclipse.smarthome.ui.classic/src/test/groovy added.
[INFO] 
[INFO] --- maven-resources-plugin:2.4.3:testResources (default-testResources) @ org.eclipse.smarthome.ui.classic ---
[INFO] Using 'UTF-8' encoding to copy filtered resources.
[INFO] skip non existing resourceDirectory /jobs/genie.smarthome/PublishRelease/workspace/extensions/ui/org.eclipse.smarthome.ui.classic/src/test/resources
[INFO] 
[INFO] --- xtend-maven-plugin:2.6.2:xtend-test-install-debug-info (default) @ org.eclipse.smarthome.ui.classic ---
[WARNING] Directory /jobs/genie.smarthome/PublishRelease/workspace/extensions/ui/org.eclipse.smarthome.ui.classic/src/test/java is empty. Can't process.
[WARNING] Directory /jobs/genie.smarthome/PublishRelease/workspace/extensions/ui/org.eclipse.smarthome.ui.classic/xtend-gen is empty. Can't process.
[WARNING] Directory /jobs/genie.smarthome/PublishRelease/workspace/extensions/ui/org.eclipse.smarthome.ui.classic/src/test/groovy is empty. Can't process.
[INFO] Installing Xtend files into 0 class files as secondary (via SMAP) debug sources in: /jobs/genie.smarthome/PublishRelease/workspace/extensions/ui/org.eclipse.smarthome.ui.classic/target/test-classes
[INFO] 
[INFO] --- tycho-source-plugin:0.23.1:plugin-source (plugin-source) @ org.eclipse.smarthome.ui.classic ---
[WARNING] bundle localization file /jobs/genie.smarthome/PublishRelease/workspace/extensions/ui/org.eclipse.smarthome.ui.classic/plugin.properties not found
[INFO] Building jar: /jobs/genie.smarthome/PublishRelease/workspace/extensions/ui/org.eclipse.smarthome.ui.classic/target/org.eclipse.smarthome.ui.classic-0.8.0.b2-sources.jar
[INFO] 
[INFO] --- target-platform-configuration:0.23.1:target-platform (default-target-platform) @ org.eclipse.smarthome.ui.classic ---
[INFO] 
[INFO] --- tycho-packaging-plugin:0.23.1:package-plugin (default-package-plugin) @ org.eclipse.smarthome.ui.classic ---
[INFO] Building jar: /jobs/genie.smarthome/PublishRelease/workspace/extensions/ui/org.eclipse.smarthome.ui.classic/target/org.eclipse.smarthome.ui.classic-0.8.0.b2.jar
[INFO] 
[INFO] --- tycho-p2-plugin:0.23.1:p2-metadata-default (default-p2-metadata-default) @ org.eclipse.smarthome.ui.classic ---
[INFO] 
[INFO] --- maven-deploy-plugin:2.5:deploy (default-cli) @ org.eclipse.smarthome.ui.classic ---
Uploading: https://repo.eclipse.org/content/repositories/smarthome-releases/org/eclipse/smarthome/extension/ui/org.eclipse.smarthome.ui.classic/0.8.0.b2/org.eclipse.smarthome.ui.classic-0.8.0.b2.jar
Uploaded: https://repo.eclipse.org/content/repositories/smarthome-releases/org/eclipse/smarthome/extension/ui/org.eclipse.smarthome.ui.classic/0.8.0.b2/org.eclipse.smarthome.ui.classic-0.8.0.b2.jar (223 KB at 2477.0 KB/sec)
Uploading: https://repo.eclipse.org/content/repositories/smarthome-releases/org/eclipse/smarthome/extension/ui/org.eclipse.smarthome.ui.classic/0.8.0.b2/org.eclipse.smarthome.ui.classic-0.8.0.b2.pom
Uploaded: https://repo.eclipse.org/content/repositories/smarthome-releases/org/eclipse/smarthome/extension/ui/org.eclipse.smarthome.ui.classic/0.8.0.b2/org.eclipse.smarthome.ui.classic-0.8.0.b2.pom (769 B at 12.1 KB/sec)
Downloading: https://repo.eclipse.org/content/repositories/smarthome-releases/org/eclipse/smarthome/extension/ui/org.eclipse.smarthome.ui.classic/maven-metadata.xml
Downloaded: https://repo.eclipse.org/content/repositories/smarthome-releases/org/eclipse/smarthome/extension/ui/org.eclipse.smarthome.ui.classic/maven-metadata.xml (352 B at 8.2 KB/sec)
Uploading: https://repo.eclipse.org/content/repositories/smarthome-releases/org/eclipse/smarthome/extension/ui/org.eclipse.smarthome.ui.classic/maven-metadata.xml
Uploaded: https://repo.eclipse.org/content/repositories/smarthome-releases/org/eclipse/smarthome/extension/ui/org.eclipse.smarthome.ui.classic/maven-metadata.xml (386 B at 5.1 KB/sec)
Uploading: https://repo.eclipse.org/content/repositories/smarthome-releases/org/eclipse/smarthome/extension/ui/org.eclipse.smarthome.ui.classic/0.8.0.b2/org.eclipse.smarthome.ui.classic-0.8.0.b2-sources.jar
Uploaded: https://repo.eclipse.org/content/repositories/smarthome-releases/org/eclipse/smarthome/extension/ui/org.eclipse.smarthome.ui.classic/0.8.0.b2/org.eclipse.smarthome.ui.classic-0.8.0.b2-sources.jar (33 KB at 399.0 KB/sec)
Uploading: https://repo.eclipse.org/content/repositories/smarthome-releases/org/eclipse/smarthome/extension/ui/org.eclipse.smarthome.ui.classic/0.8.0.b2/org.eclipse.smarthome.ui.classic-0.8.0.b2-p2metadata.xml
Uploaded: https://repo.eclipse.org/content/repositories/smarthome-releases/org/eclipse/smarthome/extension/ui/org.eclipse.smarthome.ui.classic/0.8.0.b2/org.eclipse.smarthome.ui.classic-0.8.0.b2-p2metadata.xml (6 KB at 84.6 KB/sec)
Uploading: https://repo.eclipse.org/content/repositories/smarthome-releases/org/eclipse/smarthome/extension/ui/org.eclipse.smarthome.ui.classic/0.8.0.b2/org.eclipse.smarthome.ui.classic-0.8.0.b2-p2artifacts.xml
Uploaded: https://repo.eclipse.org/content/repositories/smarthome-releases/org/eclipse/smarthome/extension/ui/org.eclipse.smarthome.ui.classic/0.8.0.b2/org.eclipse.smarthome.ui.classic-0.8.0.b2-p2artifacts.xml (2 KB at 14.6 KB/sec)
[INFO]                                                                         
[INFO] ------------------------------------------------------------------------
[INFO] Building Eclipse SmartHome Paper UI 0.8.0.b2
[INFO] ------------------------------------------------------------------------
[INFO] 
[INFO] --- tycho-packaging-plugin:0.23.1:build-qualifier (default-build-qualifier) @ org.eclipse.smarthome.ui.paper ---
[INFO] The project's OSGi version is 0.8.0.b2
[INFO] 
[INFO] --- tycho-packaging-plugin:0.23.1:validate-id (default-validate-id) @ org.eclipse.smarthome.ui.paper ---
[INFO] 
[INFO] --- tycho-packaging-plugin:0.23.1:validate-version (default-validate-version) @ org.eclipse.smarthome.ui.paper ---
[INFO] 
[INFO] --- xtend-maven-plugin:2.6.2:compile (default) @ org.eclipse.smarthome.ui.paper ---
[INFO] No sources to compile in '/jobs/genie.smarthome/PublishRelease/workspace/extensions/ui/org.eclipse.smarthome.ui.paper/src/main/java'
[INFO] 
[INFO] --- build-helper-maven-plugin:1.8:add-source (add-source) @ org.eclipse.smarthome.ui.paper ---
[INFO] Source directory: /jobs/genie.smarthome/PublishRelease/workspace/extensions/ui/org.eclipse.smarthome.ui.paper/src/main/groovy added.
[INFO] 
[INFO] --- frontend-maven-plugin:0.0.23:install-node-and-npm (Install node and npm) @ org.eclipse.smarthome.ui.paper ---
[INFO] c.g.e.m.p.f.l.DefaultNodeAndNPMInstaller - Node v0.12.3 is already installed.
[INFO] c.g.e.m.p.f.l.DefaultNodeAndNPMInstaller - Found NPM version 2.10.0
[INFO] 
[INFO] --- frontend-maven-plugin:0.0.23:npm (npm install) @ org.eclipse.smarthome.ui.paper ---
[INFO] c.g.e.m.p.f.l.DefaultNpmRunner - Running 'npm install --color=false --proxy=http://proxy.eclipse.org:9898' in /jobs/genie.smarthome/PublishRelease/workspace/extensions/ui/org.eclipse.smarthome.ui.paper
[INFO] 
[INFO] --- frontend-maven-plugin:0.0.23:bower (bower install) @ org.eclipse.smarthome.ui.paper ---
[INFO] c.g.e.m.p.f.l.DefaultBowerRunner - Running 'bower install' in /jobs/genie.smarthome/PublishRelease/workspace/extensions/ui/org.eclipse.smarthome.ui.paper
[INFO] 
[INFO] --- maven-resources-plugin:2.4.3:resources (default-resources) @ org.eclipse.smarthome.ui.paper ---
[INFO] Using 'UTF-8' encoding to copy filtered resources.
[INFO] skip non existing resourceDirectory /jobs/genie.smarthome/PublishRelease/workspace/extensions/ui/org.eclipse.smarthome.ui.paper/src/main/resources
[INFO] 
[INFO] --- tycho-compiler-plugin:0.23.1:compile (default-compile) @ org.eclipse.smarthome.ui.paper ---
[INFO] Nothing to compile - all classes are up to date
[INFO] 
[INFO] --- maven-compiler-plugin:3.1:compile (default) @ org.eclipse.smarthome.ui.paper ---
[INFO] Changes detected - recompiling the module!
[INFO] Nothing to compile - all classes are up to date
[INFO] 
[INFO] --- xtend-maven-plugin:2.6.2:xtend-install-debug-info (default) @ org.eclipse.smarthome.ui.paper ---
[WARNING] Directory /jobs/genie.smarthome/PublishRelease/workspace/extensions/ui/org.eclipse.smarthome.ui.paper/xtend-gen is empty. Can't process.
[WARNING] Directory /jobs/genie.smarthome/PublishRelease/workspace/extensions/ui/org.eclipse.smarthome.ui.paper/src/main/groovy is empty. Can't process.
[INFO] Installing Xtend files into 0 class files as secondary (via SMAP) debug sources in: /jobs/genie.smarthome/PublishRelease/workspace/extensions/ui/org.eclipse.smarthome.ui.paper/target/classes
[INFO] 
[INFO] --- xtend-maven-plugin:2.6.2:testCompile (default) @ org.eclipse.smarthome.ui.paper ---
[INFO] skip compiling sources because the configured directory '[/jobs/genie.smarthome/PublishRelease/workspace/extensions/ui/org.eclipse.smarthome.ui.paper/src/test/java]' does not exists.
[INFO] 
[INFO] --- build-helper-maven-plugin:1.8:add-test-source (add-test-source) @ org.eclipse.smarthome.ui.paper ---
[INFO] Test Source directory: /jobs/genie.smarthome/PublishRelease/workspace/extensions/ui/org.eclipse.smarthome.ui.paper/src/test/groovy added.
[INFO] 
[INFO] --- maven-resources-plugin:2.4.3:testResources (default-testResources) @ org.eclipse.smarthome.ui.paper ---
[INFO] Using 'UTF-8' encoding to copy filtered resources.
[INFO] skip non existing resourceDirectory /jobs/genie.smarthome/PublishRelease/workspace/extensions/ui/org.eclipse.smarthome.ui.paper/src/test/resources
[INFO] 
[INFO] --- xtend-maven-plugin:2.6.2:xtend-test-install-debug-info (default) @ org.eclipse.smarthome.ui.paper ---
[WARNING] Directory /jobs/genie.smarthome/PublishRelease/workspace/extensions/ui/org.eclipse.smarthome.ui.paper/src/test/java is empty. Can't process.
[WARNING] Directory /jobs/genie.smarthome/PublishRelease/workspace/extensions/ui/org.eclipse.smarthome.ui.paper/xtend-gen is empty. Can't process.
[WARNING] Directory /jobs/genie.smarthome/PublishRelease/workspace/extensions/ui/org.eclipse.smarthome.ui.paper/src/test/groovy is empty. Can't process.
[INFO] Installing Xtend files into 0 class files as secondary (via SMAP) debug sources in: /jobs/genie.smarthome/PublishRelease/workspace/extensions/ui/org.eclipse.smarthome.ui.paper/target/test-classes
[INFO] 
[INFO] --- tycho-source-plugin:0.23.1:plugin-source (plugin-source) @ org.eclipse.smarthome.ui.paper ---
[WARNING] bundle localization file /jobs/genie.smarthome/PublishRelease/workspace/extensions/ui/org.eclipse.smarthome.ui.paper/plugin.properties not found
[INFO] Building jar: /jobs/genie.smarthome/PublishRelease/workspace/extensions/ui/org.eclipse.smarthome.ui.paper/target/org.eclipse.smarthome.ui.paper-0.8.0.b2-sources.jar
[INFO] 
[INFO] --- target-platform-configuration:0.23.1:target-platform (default-target-platform) @ org.eclipse.smarthome.ui.paper ---
[INFO] 
[INFO] --- tycho-packaging-plugin:0.23.1:package-plugin (default-package-plugin) @ org.eclipse.smarthome.ui.paper ---
[INFO] Building jar: /jobs/genie.smarthome/PublishRelease/workspace/extensions/ui/org.eclipse.smarthome.ui.paper/target/org.eclipse.smarthome.ui.paper-0.8.0.b2.jar
[INFO] 
[INFO] --- tycho-p2-plugin:0.23.1:p2-metadata-default (default-p2-metadata-default) @ org.eclipse.smarthome.ui.paper ---
[INFO] 
[INFO] --- maven-deploy-plugin:2.5:deploy (default-cli) @ org.eclipse.smarthome.ui.paper ---
Uploading: https://repo.eclipse.org/content/repositories/smarthome-releases/org/eclipse/smarthome/extension/ui/org.eclipse.smarthome.ui.paper/0.8.0.b2/org.eclipse.smarthome.ui.paper-0.8.0.b2.jar
Uploaded: https://repo.eclipse.org/content/repositories/smarthome-releases/org/eclipse/smarthome/extension/ui/org.eclipse.smarthome.ui.paper/0.8.0.b2/org.eclipse.smarthome.ui.paper-0.8.0.b2.jar (1940 KB at 12274.4 KB/sec)
Uploading: https://repo.eclipse.org/content/repositories/smarthome-releases/org/eclipse/smarthome/extension/ui/org.eclipse.smarthome.ui.paper/0.8.0.b2/org.eclipse.smarthome.ui.paper-0.8.0.b2.pom
Uploaded: https://repo.eclipse.org/content/repositories/smarthome-releases/org/eclipse/smarthome/extension/ui/org.eclipse.smarthome.ui.paper/0.8.0.b2/org.eclipse.smarthome.ui.paper-0.8.0.b2.pom (2 KB at 30.0 KB/sec)
Downloading: https://repo.eclipse.org/content/repositories/smarthome-releases/org/eclipse/smarthome/extension/ui/org.eclipse.smarthome.ui.paper/maven-metadata.xml
Downloaded: https://repo.eclipse.org/content/repositories/smarthome-releases/org/eclipse/smarthome/extension/ui/org.eclipse.smarthome.ui.paper/maven-metadata.xml (350 B at 6.0 KB/sec)
Uploading: https://repo.eclipse.org/content/repositories/smarthome-releases/org/eclipse/smarthome/extension/ui/org.eclipse.smarthome.ui.paper/maven-metadata.xml
Uploaded: https://repo.eclipse.org/content/repositories/smarthome-releases/org/eclipse/smarthome/extension/ui/org.eclipse.smarthome.ui.paper/maven-metadata.xml (384 B at 5.8 KB/sec)
Uploading: https://repo.eclipse.org/content/repositories/smarthome-releases/org/eclipse/smarthome/extension/ui/org.eclipse.smarthome.ui.paper/0.8.0.b2/org.eclipse.smarthome.ui.paper-0.8.0.b2-sources.jar
Uploaded: https://repo.eclipse.org/content/repositories/smarthome-releases/org/eclipse/smarthome/extension/ui/org.eclipse.smarthome.ui.paper/0.8.0.b2/org.eclipse.smarthome.ui.paper-0.8.0.b2-sources.jar (3 KB at 44.7 KB/sec)
Uploading: https://repo.eclipse.org/content/repositories/smarthome-releases/org/eclipse/smarthome/extension/ui/org.eclipse.smarthome.ui.paper/0.8.0.b2/org.eclipse.smarthome.ui.paper-0.8.0.b2-p2metadata.xml
Uploaded: https://repo.eclipse.org/content/repositories/smarthome-releases/org/eclipse/smarthome/extension/ui/org.eclipse.smarthome.ui.paper/0.8.0.b2/org.eclipse.smarthome.ui.paper-0.8.0.b2-p2metadata.xml (4 KB at 63.7 KB/sec)
Uploading: https://repo.eclipse.org/content/repositories/smarthome-releases/org/eclipse/smarthome/extension/ui/org.eclipse.smarthome.ui.paper/0.8.0.b2/org.eclipse.smarthome.ui.paper-0.8.0.b2-p2artifacts.xml
Uploaded: https://repo.eclipse.org/content/repositories/smarthome-releases/org/eclipse/smarthome/extension/ui/org.eclipse.smarthome.ui.paper/0.8.0.b2/org.eclipse.smarthome.ui.paper-0.8.0.b2-p2artifacts.xml (2 KB at 19.7 KB/sec)
[INFO]                                                                         
[INFO] ------------------------------------------------------------------------
[INFO] Building Eclipse SmartHome Features 0.8.0.b2
[INFO] ------------------------------------------------------------------------
[INFO] 
[INFO] --- xtend-maven-plugin:2.6.2:compile (default) @ features ---
[INFO] skip compiling sources because the configured directory '[/jobs/genie.smarthome/PublishRelease/workspace/features/src/main/java]' does not exists.
[INFO] 
[INFO] --- build-helper-maven-plugin:1.8:add-source (add-source) @ features ---
[INFO] Source directory: /jobs/genie.smarthome/PublishRelease/workspace/features/src/main/groovy added.
[INFO] 
[INFO] --- maven-compiler-plugin:3.1:compile (default) @ features ---
[INFO] No sources to compile
[INFO] 
[INFO] --- xtend-maven-plugin:2.6.2:xtend-install-debug-info (default) @ features ---
[WARNING] Directory /jobs/genie.smarthome/PublishRelease/workspace/features/src/main/java is empty. Can't process.
[WARNING] Directory /jobs/genie.smarthome/PublishRelease/workspace/features/xtend-gen is empty. Can't process.
[WARNING] Directory /jobs/genie.smarthome/PublishRelease/workspace/features/src/main/groovy is empty. Can't process.
[INFO] Installing Xtend files into 0 class files as secondary (via SMAP) debug sources in: /jobs/genie.smarthome/PublishRelease/workspace/features/target/classes
[INFO] 
[INFO] --- xtend-maven-plugin:2.6.2:testCompile (default) @ features ---
[INFO] skip compiling sources because the configured directory '[/jobs/genie.smarthome/PublishRelease/workspace/features/src/test/java]' does not exists.
[INFO] 
[INFO] --- build-helper-maven-plugin:1.8:add-test-source (add-test-source) @ features ---
[INFO] Test Source directory: /jobs/genie.smarthome/PublishRelease/workspace/features/src/test/groovy added.
[INFO] 
[INFO] --- xtend-maven-plugin:2.6.2:xtend-test-install-debug-info (default) @ features ---
[WARNING] Directory /jobs/genie.smarthome/PublishRelease/workspace/features/src/test/java is empty. Can't process.
[WARNING] Directory /jobs/genie.smarthome/PublishRelease/workspace/features/xtend-gen is empty. Can't process.
[WARNING] Directory /jobs/genie.smarthome/PublishRelease/workspace/features/src/test/groovy is empty. Can't process.
[INFO] Installing Xtend files into 0 class files as secondary (via SMAP) debug sources in: /jobs/genie.smarthome/PublishRelease/workspace/features/target/test-classes
[INFO] 
[INFO] --- maven-deploy-plugin:2.7:deploy (default-cli) @ features ---
Uploading: https://repo.eclipse.org/content/repositories/smarthome-releases/org/eclipse/smarthome/features/0.8.0.b2/features-0.8.0.b2.pom
Uploaded: https://repo.eclipse.org/content/repositories/smarthome-releases/org/eclipse/smarthome/features/0.8.0.b2/features-0.8.0.b2.pom (2 KB at 21.6 KB/sec)
Downloading: https://repo.eclipse.org/content/repositories/smarthome-releases/org/eclipse/smarthome/features/maven-metadata.xml
Downloaded: https://repo.eclipse.org/content/repositories/smarthome-releases/org/eclipse/smarthome/features/maven-metadata.xml (315 B at 7.7 KB/sec)
Uploading: https://repo.eclipse.org/content/repositories/smarthome-releases/org/eclipse/smarthome/features/maven-metadata.xml
Uploaded: https://repo.eclipse.org/content/repositories/smarthome-releases/org/eclipse/smarthome/features/maven-metadata.xml (349 B at 4.5 KB/sec)
[INFO]                                                                         
[INFO] ------------------------------------------------------------------------
[INFO] Building Eclipse SmartHome Runtime Core Feature 0.8.0.b2
[INFO] ------------------------------------------------------------------------
[INFO] 
[INFO] --- tycho-packaging-plugin:0.23.1:build-qualifier-aggregator (default-build-qualifier-aggregator) @ org.eclipse.smarthome.feature.runtime.core ---
[INFO] The project's OSGi version is 0.8.0.b2
[INFO] 
[INFO] --- tycho-packaging-plugin:0.23.1:validate-id (default-validate-id) @ org.eclipse.smarthome.feature.runtime.core ---
[INFO] 
[INFO] --- tycho-packaging-plugin:0.23.1:validate-version (default-validate-version) @ org.eclipse.smarthome.feature.runtime.core ---
[INFO] 
[INFO] --- xtend-maven-plugin:2.6.2:compile (default) @ org.eclipse.smarthome.feature.runtime.core ---
[INFO] skip compiling sources because the configured directory '[/jobs/genie.smarthome/PublishRelease/workspace/features/org.eclipse.smarthome.feature.runtime.core/src/main/java]' does not exists.
[INFO] 
[INFO] --- build-helper-maven-plugin:1.8:add-source (add-source) @ org.eclipse.smarthome.feature.runtime.core ---
[INFO] Source directory: /jobs/genie.smarthome/PublishRelease/workspace/features/org.eclipse.smarthome.feature.runtime.core/src/main/groovy added.
[INFO] 
[INFO] --- maven-compiler-plugin:3.1:compile (default) @ org.eclipse.smarthome.feature.runtime.core ---
[INFO] No sources to compile
[INFO] 
[INFO] --- xtend-maven-plugin:2.6.2:xtend-install-debug-info (default) @ org.eclipse.smarthome.feature.runtime.core ---
[WARNING] Directory /jobs/genie.smarthome/PublishRelease/workspace/features/org.eclipse.smarthome.feature.runtime.core/src/main/java is empty. Can't process.
[WARNING] Directory /jobs/genie.smarthome/PublishRelease/workspace/features/org.eclipse.smarthome.feature.runtime.core/xtend-gen is empty. Can't process.
[WARNING] Directory /jobs/genie.smarthome/PublishRelease/workspace/features/org.eclipse.smarthome.feature.runtime.core/src/main/groovy is empty. Can't process.
[INFO] Installing Xtend files into 0 class files as secondary (via SMAP) debug sources in: /jobs/genie.smarthome/PublishRelease/workspace/features/org.eclipse.smarthome.feature.runtime.core/target/classes
[INFO] 
[INFO] --- xtend-maven-plugin:2.6.2:testCompile (default) @ org.eclipse.smarthome.feature.runtime.core ---
[INFO] skip compiling sources because the configured directory '[/jobs/genie.smarthome/PublishRelease/workspace/features/org.eclipse.smarthome.feature.runtime.core/src/test/java]' does not exists.
[INFO] 
[INFO] --- build-helper-maven-plugin:1.8:add-test-source (add-test-source) @ org.eclipse.smarthome.feature.runtime.core ---
[INFO] Test Source directory: /jobs/genie.smarthome/PublishRelease/workspace/features/org.eclipse.smarthome.feature.runtime.core/src/test/groovy added.
[INFO] 
[INFO] --- xtend-maven-plugin:2.6.2:xtend-test-install-debug-info (default) @ org.eclipse.smarthome.feature.runtime.core ---
[WARNING] Directory /jobs/genie.smarthome/PublishRelease/workspace/features/org.eclipse.smarthome.feature.runtime.core/src/test/java is empty. Can't process.
[WARNING] Directory /jobs/genie.smarthome/PublishRelease/workspace/features/org.eclipse.smarthome.feature.runtime.core/xtend-gen is empty. Can't process.
[WARNING] Directory /jobs/genie.smarthome/PublishRelease/workspace/features/org.eclipse.smarthome.feature.runtime.core/src/test/groovy is empty. Can't process.
[INFO] Installing Xtend files into 0 class files as secondary (via SMAP) debug sources in: /jobs/genie.smarthome/PublishRelease/workspace/features/org.eclipse.smarthome.feature.runtime.core/target/test-classes
[INFO] 
[INFO] --- target-platform-configuration:0.23.1:target-platform (default-target-platform) @ org.eclipse.smarthome.feature.runtime.core ---
[INFO] 
[INFO] --- tycho-packaging-plugin:0.23.1:package-feature (default-package-feature) @ org.eclipse.smarthome.feature.runtime.core ---
[INFO] Building jar: /jobs/genie.smarthome/PublishRelease/workspace/features/org.eclipse.smarthome.feature.runtime.core/target/org.eclipse.smarthome.feature.runtime.core-0.8.0.b2.jar
[INFO] 
[INFO] --- tycho-p2-plugin:0.23.1:p2-metadata-default (default-p2-metadata-default) @ org.eclipse.smarthome.feature.runtime.core ---
[INFO] 
[INFO] --- tycho-p2-plugin:0.23.1:feature-p2-metadata (default-feature-p2-metadata) @ org.eclipse.smarthome.feature.runtime.core ---
[INFO] 
[INFO] --- tycho-source-feature-plugin:0.23.1:source-feature (source-feature) @ org.eclipse.smarthome.feature.runtime.core ---
[INFO] Building jar: /jobs/genie.smarthome/PublishRelease/workspace/features/org.eclipse.smarthome.feature.runtime.core/target/org.eclipse.smarthome.feature.runtime.core-0.8.0.b2-sources-feature.jar
[INFO] 
[INFO] --- tycho-p2-plugin:0.23.1:p2-metadata (attach-p2-metadata) @ org.eclipse.smarthome.feature.runtime.core ---
[INFO] 
[INFO] --- maven-deploy-plugin:2.5:deploy (default-cli) @ org.eclipse.smarthome.feature.runtime.core ---
Uploading: https://repo.eclipse.org/content/repositories/smarthome-releases/org/eclipse/smarthome/org.eclipse.smarthome.feature.runtime.core/0.8.0.b2/org.eclipse.smarthome.feature.runtime.core-0.8.0.b2.jar
Uploaded: https://repo.eclipse.org/content/repositories/smarthome-releases/org/eclipse/smarthome/org.eclipse.smarthome.feature.runtime.core/0.8.0.b2/org.eclipse.smarthome.feature.runtime.core-0.8.0.b2.jar (11 KB at 133.9 KB/sec)
Uploading: https://repo.eclipse.org/content/repositories/smarthome-releases/org/eclipse/smarthome/org.eclipse.smarthome.feature.runtime.core/0.8.0.b2/org.eclipse.smarthome.feature.runtime.core-0.8.0.b2.pom
Uploaded: https://repo.eclipse.org/content/repositories/smarthome-releases/org/eclipse/smarthome/org.eclipse.smarthome.feature.runtime.core/0.8.0.b2/org.eclipse.smarthome.feature.runtime.core-0.8.0.b2.pom (2 KB at 22.7 KB/sec)
Downloading: https://repo.eclipse.org/content/repositories/smarthome-releases/org/eclipse/smarthome/org.eclipse.smarthome.feature.runtime.core/maven-metadata.xml
Downloaded: https://repo.eclipse.org/content/repositories/smarthome-releases/org/eclipse/smarthome/org.eclipse.smarthome.feature.runtime.core/maven-metadata.xml (349 B at 6.2 KB/sec)
Uploading: https://repo.eclipse.org/content/repositories/smarthome-releases/org/eclipse/smarthome/org.eclipse.smarthome.feature.runtime.core/maven-metadata.xml
Uploaded: https://repo.eclipse.org/content/repositories/smarthome-releases/org/eclipse/smarthome/org.eclipse.smarthome.feature.runtime.core/maven-metadata.xml (383 B at 4.3 KB/sec)
Uploading: https://repo.eclipse.org/content/repositories/smarthome-releases/org/eclipse/smarthome/org.eclipse.smarthome.feature.runtime.core/0.8.0.b2/org.eclipse.smarthome.feature.runtime.core-0.8.0.b2-p2metadata.xml
Uploaded: https://repo.eclipse.org/content/repositories/smarthome-releases/org/eclipse/smarthome/org.eclipse.smarthome.feature.runtime.core/0.8.0.b2/org.eclipse.smarthome.feature.runtime.core-0.8.0.b2-p2metadata.xml (48 KB at 517.0 KB/sec)
Uploading: https://repo.eclipse.org/content/repositories/smarthome-releases/org/eclipse/smarthome/org.eclipse.smarthome.feature.runtime.core/0.8.0.b2/org.eclipse.smarthome.feature.runtime.core-0.8.0.b2-p2artifacts.xml
Uploaded: https://repo.eclipse.org/content/repositories/smarthome-releases/org/eclipse/smarthome/org.eclipse.smarthome.feature.runtime.core/0.8.0.b2/org.eclipse.smarthome.feature.runtime.core-0.8.0.b2-p2artifacts.xml (2 KB at 19.1 KB/sec)
Uploading: https://repo.eclipse.org/content/repositories/smarthome-releases/org/eclipse/smarthome/org.eclipse.smarthome.feature.runtime.core/0.8.0.b2/org.eclipse.smarthome.feature.runtime.core-0.8.0.b2-sources-feature.jar
Uploaded: https://repo.eclipse.org/content/repositories/smarthome-releases/org/eclipse/smarthome/org.eclipse.smarthome.feature.runtime.core/0.8.0.b2/org.eclipse.smarthome.feature.runtime.core-0.8.0.b2-sources-feature.jar (6 KB at 61.9 KB/sec)
Uploading: https://repo.eclipse.org/content/repositories/smarthome-releases/org/eclipse/smarthome/org.eclipse.smarthome.feature.runtime.core/0.8.0.b2/org.eclipse.smarthome.feature.runtime.core-0.8.0.b2-p2metadata.xml
[INFO] ------------------------------------------------------------------------
[INFO] Reactor Summary:
[INFO] 
[INFO] Eclipse SmartHome .................................. SUCCESS [  5.108 s]
[INFO] Eclipse SmartHome Bundles .......................... SUCCESS [  0.292 s]
[INFO] Eclipse SmartHome Test Components .................. SUCCESS [  0.265 s]
[INFO] Eclipse SmartHome Core Components .................. SUCCESS [  0.266 s]
[INFO] Eclipse SmartHome Core ............................. SUCCESS [  3.722 s]
[INFO] Eclipse SmartHome Configurations ................... SUCCESS [  0.283 s]
[INFO] Eclipse SmartHome Configuration Core ............... SUCCESS [  1.053 s]
[INFO] Eclipse SmartHome Configuration XML ................ SUCCESS [  0.965 s]
[INFO] Eclipse SmartHome AutoUpdate Binding ............... SUCCESS [  0.654 s]
[INFO] Eclipse SmartHome Test ............................. SUCCESS [  1.927 s]
[INFO] Eclipse SmartHome Configuration Dispatcher ......... SUCCESS [  0.648 s]
[INFO] Eclipse SmartHome Configuration Core Tests ......... SUCCESS [  1.911 s]
[INFO] Eclipse SmartHome I/O Components ................... SUCCESS [  0.264 s]
[INFO] Eclipse SmartHome Console .......................... SUCCESS [  0.909 s]
[INFO] Eclipse SmartHome Thing ............................ SUCCESS [  1.251 s]
[INFO] Eclipse SmartHome Configuration Discovery .......... SUCCESS [  1.075 s]
[INFO] Eclipse SmartHome Configuration Discovery Tests .... SUCCESS [  1.776 s]
[INFO] Eclipse SmartHome Config XML Tests ................. SUCCESS [  1.089 s]
[INFO] Eclipse SmartHome Sample Extension Service ......... SUCCESS [  0.832 s]
[INFO] Eclipse SmartHome mDNS Service ..................... SUCCESS [  0.706 s]
[INFO] Eclipse SmartHome REST Interface ................... SUCCESS [  0.939 s]
[INFO] Eclipse SmartHome Core ID .......................... SUCCESS [  0.779 s]
[INFO] Eclipse SmartHome Thing Tests ...................... SUCCESS [  0.986 s]
[INFO] Eclipse SmartHome Core Tests ....................... SUCCESS [  1.904 s]
[INFO] Eclipse SmartHome Thing Tests ...................... SUCCESS [  2.206 s]
[INFO] Eclipse SmartHome Core Persistence ................. SUCCESS [  0.689 s]
[INFO] Eclipse SmartHome Core Scheduler Service ........... SUCCESS [  0.785 s]
[INFO] Eclipse SmartHome Network I/O ...................... SUCCESS [  0.714 s]
[INFO] Eclipse SmartHome Models ........................... SUCCESS [  0.288 s]
[INFO] Eclipse SmartHome Model Core ....................... SUCCESS [  0.769 s]
[INFO] Eclipse SmartHome Model Lazy Generation ............ SUCCESS [  0.737 s]
[INFO] Eclipse SmartHome Model Items ...................... SUCCESS [ 15.424 s]
[INFO] Eclipse SmartHome Model Persistence ................ SUCCESS [ 11.230 s]
[INFO] Eclipse SmartHome Model Script ..................... SUCCESS [ 23.356 s]
[INFO] Eclipse SmartHome Core Transformation Service ...... SUCCESS [  0.724 s]
[INFO] Eclipse SmartHome Core Binding XML ................. SUCCESS [  0.650 s]
[INFO] Eclipse SmartHome Core Binding XML Tests ........... SUCCESS [  0.992 s]
[INFO] Eclipse SmartHome Core Thing XML ................... SUCCESS [  0.718 s]
[INFO] Eclipse SmartHome Core Thing XML Tests ............. SUCCESS [  1.186 s]
[INFO] Eclipse SmartHome Automation ....................... SUCCESS [  0.259 s]
[INFO] Eclipse SmartHome Automation API ................... SUCCESS [  0.738 s]
[INFO] Eclipse SmartHome Automation Core .................. SUCCESS [  0.787 s]
[INFO] Eclipse SmartHome Automation Commands .............. SUCCESS [  0.769 s]
[INFO] Eclipse SmartHome Automation Parser GSON ........... SUCCESS [  0.675 s]
[INFO] Eclipse SmartHome Automation Providers ............. SUCCESS [  0.725 s]
[INFO] Eclipse SmartHome Automation Core Tests ............ SUCCESS [  0.748 s]
[INFO] Eclipse SmartHome Automation Sample Handler ........ SUCCESS [  0.818 s]
[INFO] Eclipse SmartHome Automation Core Modules .......... SUCCESS [  0.672 s]
[INFO] Eclipse SmartHome Automation Core Module Tests ..... SUCCESS [  1.063 s]
[INFO] Eclipse SmartHome Automation Timer Modules ......... SUCCESS [  0.908 s]
[INFO] Eclipse SmartHome Automation Module Timer Tests .... SUCCESS [  0.960 s]
[INFO] Eclipse SmartHome Automation Script Modules ........ SUCCESS [  0.784 s]
[INFO] Eclipse SmartHome Automation Script Default Scope .. SUCCESS [  0.826 s]
[INFO] Eclipse SmartHome Automation Script Module Tests ... SUCCESS [  1.122 s]
[INFO] Eclipse SmartHome Automation Event Tests ........... SUCCESS [  0.982 s]
[INFO] Eclipse SmartHome Automation Integration Tests ..... SUCCESS [  1.283 s]
[INFO] Eclipse SmartHome Core REST Interface .............. SUCCESS [  0.985 s]
[INFO] Eclipse SmartHome Automation REST API .............. SUCCESS [  0.750 s]
[INFO] Eclipse SmartHome Designer Bundles ................. SUCCESS [  0.257 s]
[INFO] Eclipse SmartHome Designer Core Plugin ............. SUCCESS [  2.915 s]
[INFO] Eclipse SmartHome Designer UI Plugin ............... SUCCESS [  0.967 s]
[INFO] Eclipse SmartHome Console for OSGi framework Eclipse Equinox SUCCESS [  1.577 s]
[INFO] Eclipse SmartHome Console for OSGi Console RFC 147 . SUCCESS [  0.678 s]
[INFO] Eclipse SmartHome Console for OSGi runtime Karaf ... SUCCESS [  0.702 s]
[INFO] Eclipse SmartHome Monitor .......................... SUCCESS [  0.688 s]
[INFO] Eclipse SmartHome Multimedia I/O ................... SUCCESS [  0.673 s]
[INFO] Eclipse SmartHome Network I/O Tests ................ SUCCESS [  0.769 s]
[INFO] Eclipse SmartHome IO REST Tests .................... SUCCESS [  0.991 s]
[INFO] Eclipse SmartHome IO REST Core Tests ............... SUCCESS [  1.269 s]
[INFO] Eclipse SmartHome SSE Interface .................... SUCCESS [  0.635 s]
[INFO] Eclipse SmartHome IO SSE Tests ..................... SUCCESS [  0.825 s]
[INFO] Eclipse SmartHome Model Sitemap .................... SUCCESS [ 21.428 s]
[INFO] Eclipse SmartHome UIs .............................. SUCCESS [  0.249 s]
[INFO] Eclipse SmartHome UI ............................... SUCCESS [  0.833 s]
[INFO] Eclipse SmartHome Sitemap REST Interface ........... SUCCESS [  0.734 s]
[INFO] Eclipse SmartHome MQTT Transport ................... SUCCESS [  0.618 s]
[INFO] Eclipse SmartHome UPnP Transport ................... SUCCESS [  0.627 s]
[INFO] Eclipse SmartHome IO UPnP Tests .................... SUCCESS [  0.828 s]
[INFO] Eclipse SmartHome Model Items Runtime .............. SUCCESS [  0.688 s]
[INFO] Eclipse SmartHome Model Item UI .................... SUCCESS [  3.203 s]
[INFO] Eclipse SmartHome Items Model Tests ................ SUCCESS [  0.888 s]
[INFO] Eclipse SmartHome Model Persistence Runtime ........ SUCCESS [  0.639 s]
[INFO] Eclipse SmartHome Model Persistence UI ............. SUCCESS [  2.949 s]
[INFO] Eclipse SmartHome Model Persistence Tests .......... SUCCESS [  0.718 s]
[INFO] Eclipse SmartHome Model Rules ...................... SUCCESS [ 22.744 s]
[INFO] Eclipse SmartHome Model Rules Runtime .............. SUCCESS [  0.801 s]
[INFO] Eclipse SmartHome Model Script UI .................. SUCCESS [  5.808 s]
[INFO] Eclipse SmartHome Model Rules UI ................... SUCCESS [  5.849 s]
[INFO] Eclipse SmartHome Model Rules Tests ................ SUCCESS [  0.576 s]
[INFO] Eclipse SmartHome Model Script Runtime ............. SUCCESS [  0.687 s]
[INFO] Eclipse SmartHome Model Script Tests ............... SUCCESS [  1.038 s]
[INFO] Eclipse SmartHome Model Sitemap Runtime ............ SUCCESS [  0.676 s]
[INFO] Eclipse SmartHome Model Sitemap UI Plugin .......... SUCCESS [  4.192 s]
[INFO] Eclipse SmartHome Thing Model ...................... SUCCESS [ 12.059 s]
[INFO] Eclipse SmartHome Thing Model Runtime .............. SUCCESS [  0.845 s]
[INFO] Eclipse SmartHome Thing Model UI ................... SUCCESS [  3.222 s]
[INFO] Eclipse SmartHome Thing Model Tests ................ SUCCESS [  1.708 s]
[INFO] Eclipse SmartHome UI Tests ......................... SUCCESS [  0.845 s]
[INFO] Eclipse SmartHome UI Icon Support .................. SUCCESS [  0.676 s]
[INFO] Eclipse SmartHome UI Icon Tests .................... SUCCESS [  0.999 s]
[INFO] Eclipse SmartHome Storages ......................... SUCCESS [  0.247 s]
[INFO] Eclipse SmartHome MapDB Storage .................... SUCCESS [  0.724 s]
[INFO] Eclipse SmartHome Storage MapDB Tests .............. SUCCESS [  0.992 s]
[INFO] Eclipse SmartHome Extensions ....................... SUCCESS [  0.270 s]
[INFO] Eclipse SmartHome Bindings ......................... SUCCESS [  0.279 s]
[INFO] Eclipse SmartHome hue Binding ...................... SUCCESS [  0.688 s]
[INFO] Eclipse SmartHome hue Binding Tests ................ SUCCESS [  1.558 s]
[INFO] Eclipse SmartHome FSInternetRadio Binding .......... SUCCESS [  0.627 s]
[INFO] Eclipse SmartHome LIFX Binding ..................... SUCCESS [  0.662 s]
[INFO] Eclipse SmartHome NTP Binding ...................... SUCCESS [  0.660 s]
[INFO] Eclipse SmartHome Sonos Binding .................... SUCCESS [  0.763 s]
[INFO] Eclipse SmartHome WeMo Binding ..................... SUCCESS [  0.724 s]
[INFO] Eclipse SmartHome YahooWeather Binding ............. SUCCESS [  0.651 s]
[INFO] Eclipse SmartHome Transformation Services .......... SUCCESS [  0.244 s]
[INFO] Eclipse SmartHome Exec Transform Service ........... SUCCESS [  0.695 s]
[INFO] Eclipse SmartHome Javascript Transform Service ..... SUCCESS [  0.758 s]
[INFO] Eclipse SmartHome Map Transform Service ............ SUCCESS [  0.750 s]
[INFO] Eclipse SmartHome Map Transformation Service Tests . SUCCESS [  0.904 s]
[INFO] Eclipse SmartHome Scale Transform Service .......... SUCCESS [  0.800 s]
[INFO] Eclipse SmartHome Scale Transformation Service Tests SUCCESS [  0.837 s]
[INFO] Eclipse SmartHome RegEx Transform Service .......... SUCCESS [  0.773 s]
[INFO] Eclipse SmartHome RegEx Transformation Service Tests SUCCESS [  0.915 s]
[INFO] Eclipse SmartHome XPath Transform Service .......... SUCCESS [  0.970 s]
[INFO] Eclipse SmartHome XPath Transformation Service Tests SUCCESS [  0.883 s]
[INFO] Eclipse SmartHome JSonPath Transform Service ....... SUCCESS [  0.733 s]
[INFO] Eclipse SmartHome JSonPath Transformation Service Tests SUCCESS [  0.904 s]
[INFO] Eclipse SmartHome Xslt Transform Service ........... SUCCESS [  0.953 s]
[INFO] Eclipse SmartHome Xslt Transformation Service Tests  SUCCESS [  0.861 s]
[INFO] Eclipse SmartHome UI Extensions .................... SUCCESS [  0.288 s]
[INFO] Eclipse SmartHome Icon Sets ........................ SUCCESS [  0.261 s]
[INFO] Eclipse SmartHome Classic Icon Set ................. SUCCESS [  0.712 s]
[INFO] Eclipse SmartHome Basic UI ......................... SUCCESS [  1.097 s]
[INFO] Eclipse SmartHome Classic UI ....................... SUCCESS [  0.898 s]
[INFO] Eclipse SmartHome Paper UI ......................... SUCCESS [  5.368 s]
[INFO] Eclipse SmartHome Features ......................... SUCCESS [  0.240 s]
[INFO] Eclipse SmartHome Runtime Core Feature ............. FAILURE [  1.819 s]
[INFO] Eclipse SmartHome Runtime Model Feature ............ SKIPPED
[INFO] Eclipse SmartHome Runtime UI Feature ............... SKIPPED
[INFO] Eclipse SmartHome Runtime REST Feature ............. SKIPPED
[INFO] Eclipse SmartHome Runtime Automation Feature ....... SKIPPED
[INFO] Eclipse SmartHome Runtime Equinox Console Feature .. SKIPPED
[INFO] Eclipse SmartHome Runtime RfC147 Console Feature ... SKIPPED
[INFO] Eclipse SmartHome Runtime Binding Feature .......... SKIPPED
[INFO] Eclipse SmartHome Designer Dependencies ............ SKIPPED
[INFO] Eclipse SmartHome Designer Feature ................. SKIPPED
[INFO] Eclipse SmartHome Test Dependencies ................ SKIPPED
[INFO] Eclipse SmartHome Karaf Feature .................... SKIPPED
[INFO] Eclipse SmartHome Products ......................... SKIPPED
[INFO] Eclipse SmartHome Designer RCP Application ......... SKIPPED
[INFO] Eclipse SmartHome p2 Repository .................... SKIPPED
[INFO] Eclipse SmartHome Tools ............................ SKIPPED
[INFO] Eclipse SmartHome Archetypes ....................... SKIPPED
[INFO] Eclipse Smarthome Binding Archetype ................ SKIPPED
[INFO] Eclipse Smarthome Binding Archetype Testsuite ...... SKIPPED
[INFO] Eclipse SmartHome Target Platform .................. SKIPPED
[INFO] Eclipse SmartHome Distribution ..................... SKIPPED
[INFO] ------------------------------------------------------------------------
[INFO] BUILD FAILURE
[INFO] ------------------------------------------------------------------------
[INFO] Total time: 05:20 min
[INFO] Finished at: 2016-01-08T18:30:34-05:00
[INFO] Final Memory: 379M/961M
[INFO] ------------------------------------------------------------------------
[INFO] o.h.m.e.h.MavenExecutionResultHandler - Build failed with exception(s)
[INFO] o.h.m.e.h.MavenExecutionResultHandler - [1] org.apache.maven.lifecycle.LifecycleExecutionException: Failed to execute goal org.apache.maven.plugins:maven-deploy-plugin:2.5:deploy (default-cli) on project org.eclipse.smarthome.feature.runtime.core: Failed to deploy artifacts: Could not transfer artifact org.eclipse.smarthome:org.eclipse.smarthome.feature.runtime.core:xml:p2metadata:0.8.0.b2 from/to repo.eclipse.org (https://repo.eclipse.org/content/repositories/smarthome-releases/): Failed to transfer file: https://repo.eclipse.org/content/repositories/smarthome-releases/org/eclipse/smarthome/org.eclipse.smarthome.feature.runtime.core/0.8.0.b2/org.eclipse.smarthome.feature.runtime.core-0.8.0.b2-p2metadata.xml. Return code is: 400, ReasonPhrase: Bad Request.
[DEBUG] Closing connection to remote
[ERROR] Failed to execute goal org.apache.maven.plugins:maven-deploy-plugin:2.5:deploy (default-cli) on project org.eclipse.smarthome.feature.runtime.core: Failed to deploy artifacts: Could not transfer artifact org.eclipse.smarthome:org.eclipse.smarthome.feature.runtime.core:xml:p2metadata:0.8.0.b2 from/to repo.eclipse.org (https://repo.eclipse.org/content/repositories/smarthome-releases/): Failed to transfer file: https://repo.eclipse.org/content/repositories/smarthome-releases/org/eclipse/smarthome/org.eclipse.smarthome.feature.runtime.core/0.8.0.b2/org.eclipse.smarthome.feature.runtime.core-0.8.0.b2-p2metadata.xml. Return code is: 400, ReasonPhrase: Bad Request. -> [Help 1]
[ERROR] 
[ERROR] To see the full stack trace of the errors, re-run Maven with the -e switch.
[ERROR] Re-run Maven using the -X switch to enable full debug logging.
[ERROR] 
[ERROR] For more information about the errors and possible solutions, please read the following articles:
[ERROR] [Help 1] http://cwiki.apache.org/confluence/display/MAVEN/MojoExecutionException
[ERROR] 
[ERROR] After correcting the problems, you can resume the build with the command
[ERROR]   mvn <goals> -rf :org.eclipse.smarthome.feature.runtime.core
[DEBUG] Waiting for process to finish
[DEBUG] Result: 1
Archiving artifacts
Finished: FAILURE