FailedConsole Output

Skipping 1,499 KB.. Full Log
BBAAAAYB+LCAAAAAAAAP9b85aBtbiIQSmjNKU4P0+vJLE4u1gvPjexLDVPzxdEGvvmZ+X75ZekLlOVfvTjc8FPJgaGiiIGKaiG5Py84vycVD1nCA1SyAABjCCFBQCV27OjYAAAAA==[INFO] --- tycho-packaging-plugin:1.4.0:validate-id (default-validate-id) @ org.eclipse.sirius.tests.sample.migration ---
12:59:05 [INFO] 
12:59:05 [INFO] --- tycho-packaging-plugin:1.4.0:validate-version (default-validate-version) @ org.eclipse.sirius.tests.sample.migration ---
12:59:05 [INFO] 
12:59:05 [INFO] --- jacoco-maven-plugin:0.7.9:prepare-agent (agent-for-ut) @ org.eclipse.sirius.tests.sample.migration ---
12:59:05 [INFO] jacoco.agent.ut.arg set to -javaagent:/home/jenkins/workspace/sirius.sonar-master/.repository/org/jacoco/org.jacoco.agent/0.7.9/org.jacoco.agent-0.7.9-runtime.jar=destfile=/home/jenkins/workspace/sirius.sonar-master/plugins/org.eclipse.sirius.tests.sample.migration/../../packaging/org.eclipse.sirius.parent/target/jacoco.exec,append=true
12:59:05 [INFO] 
12:59:05 [INFO] --- maven-resources-plugin:2.4.1:resources (default-resources) @ org.eclipse.sirius.tests.sample.migration ---
12:59:05 [INFO] Using 'ISO-8859-1' encoding to copy filtered resources.
12:59:05 [INFO] skip non existing resourceDirectory /home/jenkins/workspace/sirius.sonar-master/plugins/org.eclipse.sirius.tests.sample.migration/src/main/resources
12:59:05 [INFO] 
12:59:05 [INFO] --- tycho-compiler-plugin:1.4.0:compile (default-compile) @ org.eclipse.sirius.tests.sample.migration ---
12:59:05 [INFO] Compiling 88 source files to /home/jenkins/workspace/sirius.sonar-master/plugins/org.eclipse.sirius.tests.sample.migration/target/classes
12:59:06 [INFO] 
12:59:06 [INFO] --- maven-resources-plugin:2.4.1:testResources (default-testResources) @ org.eclipse.sirius.tests.sample.migration ---
12:59:06 [INFO] Using 'ISO-8859-1' encoding to copy filtered resources.
12:59:06 [INFO] skip non existing resourceDirectory /home/jenkins/workspace/sirius.sonar-master/plugins/org.eclipse.sirius.tests.sample.migration/src/test/resources
12:59:06 [INFO] 
12:59:06 [INFO] --- tycho-source-plugin:1.4.0:plugin-source (plugin-source) @ org.eclipse.sirius.tests.sample.migration ---
12:59:06 [INFO] Building jar: /home/jenkins/workspace/sirius.sonar-master/plugins/org.eclipse.sirius.tests.sample.migration/target/org.eclipse.sirius.tests.sample.migration-6.2.1-SNAPSHOT-sources.jar
12:59:06 [INFO] 
12:59:06 [INFO] --- target-platform-configuration:1.4.0:target-platform (default-target-platform) @ org.eclipse.sirius.tests.sample.migration ---
12:59:06 [INFO] 
12:59:06 [INFO] --- tycho-packaging-plugin:1.4.0:package-plugin (default-package-plugin) @ org.eclipse.sirius.tests.sample.migration ---
12:59:06 [INFO] Building jar: /home/jenkins/workspace/sirius.sonar-master/plugins/org.eclipse.sirius.tests.sample.migration/target/org.eclipse.sirius.tests.sample.migration-6.2.1-SNAPSHOT.jar
12:59:06 [INFO] 
12:59:06 [INFO] --- tycho-p2-plugin:1.4.0:p2-metadata-default (default-p2-metadata-default) @ org.eclipse.sirius.tests.sample.migration ---
12:59:06 [INFO] 
12:59:06 [INFO] --- tycho-source-feature-plugin:1.4.0:source-feature (source-feature) @ org.eclipse.sirius.tests.sample.migration ---
12:59:06 [INFO] 
12:59:06 [INFO] --- tycho-p2-plugin:1.4.0:p2-metadata (p2-metadata) @ org.eclipse.sirius.tests.sample.migration ---
12:59:06 [INFO] 
12:59:06 [INFO] --- jacoco-maven-plugin:0.7.9:prepare-agent-integration (agent-for-it) @ org.eclipse.sirius.tests.sample.migration ---
12:59:06 [INFO] jacoco.agent.it.arg set to -javaagent:/home/jenkins/workspace/sirius.sonar-master/.repository/org/jacoco/org.jacoco.agent/0.7.9/org.jacoco.agent-0.7.9-runtime.jar=destfile=/home/jenkins/workspace/sirius.sonar-master/plugins/org.eclipse.sirius.tests.sample.migration/../../packaging/org.eclipse.sirius.parent/target/jacoco-it.exec,append=true
12:59:06 [INFO] 
12:59:06 [INFO] --< org.eclipse.sirius:org.eclipse.sirius.tests.sample.migration.design >--
12:59:06 [INFO] Building org.eclipse.sirius.tests.sample.migration.design 6.2.1-SNAPSHOT [136/159]
12:59:06 [INFO] ---------------------------[ eclipse-plugin ]---------------------------
12:59:06 [INFO] 
12:59:06 [INFO] --- maven-clean-plugin:2.5:clean (default-clean) @ org.eclipse.sirius.tests.sample.migration.design ---
12:59:06 [INFO] 
12:59:06 [INFO] --- tycho-packaging-plugin:1.4.0:build-qualifier (default-build-qualifier) @ org.eclipse.sirius.tests.sample.migration.design ---
12:59:06 [INFO] The project's OSGi version is 6.2.1.201906241254
12:59:06 [INFO] 
12:59:06 [INFO] --- tycho-packaging-plugin:1.4.0:validate-id (default-validate-id) @ org.eclipse.sirius.tests.sample.migration.design ---
12:59:06 [INFO] 
12:59:06 [INFO] --- tycho-packaging-plugin:1.4.0:validate-version (default-validate-version) @ org.eclipse.sirius.tests.sample.migration.design ---
12:59:06 [INFO] 
12:59:06 [INFO] --- jacoco-maven-plugin:0.7.9:prepare-agent (agent-for-ut) @ org.eclipse.sirius.tests.sample.migration.design ---
12:59:06 [INFO] jacoco.agent.ut.arg set to -javaagent:/home/jenkins/workspace/sirius.sonar-master/.repository/org/jacoco/org.jacoco.agent/0.7.9/org.jacoco.agent-0.7.9-runtime.jar=destfile=/home/jenkins/workspace/sirius.sonar-master/plugins/org.eclipse.sirius.tests.sample.migration.design/../../packaging/org.eclipse.sirius.parent/target/jacoco.exec,append=true
12:59:06 [INFO] 
12:59:06 [INFO] --- maven-resources-plugin:2.4.1:resources (default-resources) @ org.eclipse.sirius.tests.sample.migration.design ---
12:59:06 [INFO] Using 'ISO-8859-1' encoding to copy filtered resources.
12:59:06 [INFO] skip non existing resourceDirectory /home/jenkins/workspace/sirius.sonar-master/plugins/org.eclipse.sirius.tests.sample.migration.design/src/main/resources
12:59:06 [INFO] 
12:59:06 [INFO] --- tycho-compiler-plugin:1.4.0:compile (default-compile) @ org.eclipse.sirius.tests.sample.migration.design ---
12:59:06 [INFO] Compiling 5 source files to /home/jenkins/workspace/sirius.sonar-master/plugins/org.eclipse.sirius.tests.sample.migration.design/target/classes
12:59:06 [INFO] 
12:59:06 [INFO] --- maven-resources-plugin:2.4.1:testResources (default-testResources) @ org.eclipse.sirius.tests.sample.migration.design ---
12:59:06 [INFO] Using 'ISO-8859-1' encoding to copy filtered resources.
12:59:06 [INFO] skip non existing resourceDirectory /home/jenkins/workspace/sirius.sonar-master/plugins/org.eclipse.sirius.tests.sample.migration.design/src/test/resources
12:59:06 [INFO] 
12:59:06 [INFO] --- tycho-source-plugin:1.4.0:plugin-source (plugin-source) @ org.eclipse.sirius.tests.sample.migration.design ---
12:59:06 [INFO] Building jar: /home/jenkins/workspace/sirius.sonar-master/plugins/org.eclipse.sirius.tests.sample.migration.design/target/org.eclipse.sirius.tests.sample.migration.design-6.2.1-SNAPSHOT-sources.jar
12:59:06 [INFO] 
12:59:06 [INFO] --- target-platform-configuration:1.4.0:target-platform (default-target-platform) @ org.eclipse.sirius.tests.sample.migration.design ---
12:59:06 [INFO] 
12:59:06 [INFO] --- tycho-packaging-plugin:1.4.0:package-plugin (default-package-plugin) @ org.eclipse.sirius.tests.sample.migration.design ---
12:59:06 [INFO] Building jar: /home/jenkins/workspace/sirius.sonar-master/plugins/org.eclipse.sirius.tests.sample.migration.design/target/org.eclipse.sirius.tests.sample.migration.design-6.2.1-SNAPSHOT.jar
12:59:06 [INFO] 
12:59:06 [INFO] --- tycho-p2-plugin:1.4.0:p2-metadata-default (default-p2-metadata-default) @ org.eclipse.sirius.tests.sample.migration.design ---
12:59:06 [INFO] 
12:59:06 [INFO] --- tycho-source-feature-plugin:1.4.0:source-feature (source-feature) @ org.eclipse.sirius.tests.sample.migration.design ---
12:59:06 [INFO] 
12:59:06 [INFO] --- tycho-p2-plugin:1.4.0:p2-metadata (p2-metadata) @ org.eclipse.sirius.tests.sample.migration.design ---
12:59:06 [INFO] 
12:59:06 [INFO] --- jacoco-maven-plugin:0.7.9:prepare-agent-integration (agent-for-it) @ org.eclipse.sirius.tests.sample.migration.design ---
12:59:06 [INFO] jacoco.agent.it.arg set to -javaagent:/home/jenkins/workspace/sirius.sonar-master/.repository/org/jacoco/org.jacoco.agent/0.7.9/org.jacoco.agent-0.7.9-runtime.jar=destfile=/home/jenkins/workspace/sirius.sonar-master/plugins/org.eclipse.sirius.tests.sample.migration.design/../../packaging/org.eclipse.sirius.parent/target/jacoco-it.exec,append=true
12:59:06 [INFO] 
12:59:06 [INFO] ----< org.eclipse.sirius:org.eclipse.sirius.tests.sample.component >----
12:59:06 [INFO] Building org.eclipse.sirius.tests.sample.component 6.2.1-SNAPSHOT [137/159]
12:59:06 [INFO] ---------------------------[ eclipse-plugin ]---------------------------
12:59:06 [INFO] 
12:59:06 [INFO] --- maven-clean-plugin:2.5:clean (default-clean) @ org.eclipse.sirius.tests.sample.component ---
12:59:06 [INFO] 
12:59:06 [INFO] --- tycho-packaging-plugin:1.4.0:build-qualifier (default-build-qualifier) @ org.eclipse.sirius.tests.sample.component ---
12:59:06 [INFO] The project's OSGi version is 6.2.1.201906241254
12:59:06 [INFO] 
12:59:06 [INFO] --- tycho-packaging-plugin:1.4.0:validate-id (default-validate-id) @ org.eclipse.sirius.tests.sample.component ---
12:59:06 [INFO] 
12:59:06 [INFO] --- tycho-packaging-plugin:1.4.0:validate-version (default-validate-version) @ org.eclipse.sirius.tests.sample.component ---
12:59:06 [INFO] 
12:59:06 [INFO] --- jacoco-maven-plugin:0.7.9:prepare-agent (agent-for-ut) @ org.eclipse.sirius.tests.sample.component ---
12:59:06 [INFO] jacoco.agent.ut.arg set to -javaagent:/home/jenkins/workspace/sirius.sonar-master/.repository/org/jacoco/org.jacoco.agent/0.7.9/org.jacoco.agent-0.7.9-runtime.jar=destfile=/home/jenkins/workspace/sirius.sonar-master/plugins/org.eclipse.sirius.tests.sample.component/../../packaging/org.eclipse.sirius.parent/target/jacoco.exec,append=true
12:59:06 [INFO] 
12:59:06 [INFO] --- maven-resources-plugin:2.4.1:resources (default-resources) @ org.eclipse.sirius.tests.sample.component ---
12:59:06 [INFO] Using 'ISO-8859-1' encoding to copy filtered resources.
12:59:06 [INFO] skip non existing resourceDirectory /home/jenkins/workspace/sirius.sonar-master/plugins/org.eclipse.sirius.tests.sample.component/src/main/resources
12:59:06 [INFO] 
12:59:06 [INFO] --- tycho-compiler-plugin:1.4.0:compile (default-compile) @ org.eclipse.sirius.tests.sample.component ---
12:59:06 [INFO] Compiling 10 source files to /home/jenkins/workspace/sirius.sonar-master/plugins/org.eclipse.sirius.tests.sample.component/target/classes
12:59:06 [INFO] 
12:59:06 [INFO] --- maven-resources-plugin:2.4.1:testResources (default-testResources) @ org.eclipse.sirius.tests.sample.component ---
12:59:06 [INFO] Using 'ISO-8859-1' encoding to copy filtered resources.
12:59:06 [INFO] skip non existing resourceDirectory /home/jenkins/workspace/sirius.sonar-master/plugins/org.eclipse.sirius.tests.sample.component/src/test/resources
12:59:06 [INFO] 
12:59:06 [INFO] --- tycho-source-plugin:1.4.0:plugin-source (plugin-source) @ org.eclipse.sirius.tests.sample.component ---
12:59:06 [INFO] Building jar: /home/jenkins/workspace/sirius.sonar-master/plugins/org.eclipse.sirius.tests.sample.component/target/org.eclipse.sirius.tests.sample.component-6.2.1-SNAPSHOT-sources.jar
12:59:06 [INFO] 
12:59:06 [INFO] --- target-platform-configuration:1.4.0:target-platform (default-target-platform) @ org.eclipse.sirius.tests.sample.component ---
12:59:06 [INFO] 
12:59:06 [INFO] --- tycho-packaging-plugin:1.4.0:package-plugin (default-package-plugin) @ org.eclipse.sirius.tests.sample.component ---
12:59:06 [INFO] Building jar: /home/jenkins/workspace/sirius.sonar-master/plugins/org.eclipse.sirius.tests.sample.component/target/org.eclipse.sirius.tests.sample.component-6.2.1-SNAPSHOT.jar
12:59:06 [INFO] 
12:59:06 [INFO] --- tycho-p2-plugin:1.4.0:p2-metadata-default (default-p2-metadata-default) @ org.eclipse.sirius.tests.sample.component ---
12:59:06 [INFO] 
12:59:06 [INFO] --- tycho-source-feature-plugin:1.4.0:source-feature (source-feature) @ org.eclipse.sirius.tests.sample.component ---
12:59:06 [INFO] 
12:59:06 [INFO] --- tycho-p2-plugin:1.4.0:p2-metadata (p2-metadata) @ org.eclipse.sirius.tests.sample.component ---
12:59:06 [INFO] 
12:59:06 [INFO] --- jacoco-maven-plugin:0.7.9:prepare-agent-integration (agent-for-it) @ org.eclipse.sirius.tests.sample.component ---
12:59:06 [INFO] jacoco.agent.it.arg set to -javaagent:/home/jenkins/workspace/sirius.sonar-master/.repository/org/jacoco/org.jacoco.agent/0.7.9/org.jacoco.agent-0.7.9-runtime.jar=destfile=/home/jenkins/workspace/sirius.sonar-master/plugins/org.eclipse.sirius.tests.sample.component/../../packaging/org.eclipse.sirius.parent/target/jacoco-it.exec,append=true
12:59:06 [INFO] 
12:59:06 [INFO] ------< org.eclipse.sirius:org.eclipse.sirius.tests.sample.scxml >------
12:59:06 [INFO] Building org.eclipse.sirius.tests.sample.scxml 6.2.1-SNAPSHOT  [138/159]
12:59:06 [INFO] ---------------------------[ eclipse-plugin ]---------------------------
12:59:06 [INFO] 
12:59:06 [INFO] --- maven-clean-plugin:2.5:clean (default-clean) @ org.eclipse.sirius.tests.sample.scxml ---
12:59:06 [INFO] 
12:59:06 [INFO] --- tycho-packaging-plugin:1.4.0:build-qualifier (default-build-qualifier) @ org.eclipse.sirius.tests.sample.scxml ---
12:59:06 [INFO] The project's OSGi version is 6.2.1.201906241254
12:59:06 [INFO] 
12:59:06 [INFO] --- tycho-packaging-plugin:1.4.0:validate-id (default-validate-id) @ org.eclipse.sirius.tests.sample.scxml ---
12:59:06 [INFO] 
12:59:06 [INFO] --- tycho-packaging-plugin:1.4.0:validate-version (default-validate-version) @ org.eclipse.sirius.tests.sample.scxml ---
12:59:06 [INFO] 
12:59:06 [INFO] --- jacoco-maven-plugin:0.7.9:prepare-agent (agent-for-ut) @ org.eclipse.sirius.tests.sample.scxml ---
12:59:06 [INFO] jacoco.agent.ut.arg set to -javaagent:/home/jenkins/workspace/sirius.sonar-master/.repository/org/jacoco/org.jacoco.agent/0.7.9/org.jacoco.agent-0.7.9-runtime.jar=destfile=/home/jenkins/workspace/sirius.sonar-master/plugins/org.eclipse.sirius.tests.sample.scxml/../../packaging/org.eclipse.sirius.parent/target/jacoco.exec,append=true
12:59:06 [INFO] 
12:59:06 [INFO] --- maven-resources-plugin:2.4.1:resources (default-resources) @ org.eclipse.sirius.tests.sample.scxml ---
12:59:06 [INFO] Using 'ISO-8859-1' encoding to copy filtered resources.
12:59:06 [INFO] skip non existing resourceDirectory /home/jenkins/workspace/sirius.sonar-master/plugins/org.eclipse.sirius.tests.sample.scxml/src/main/resources
12:59:06 [INFO] 
12:59:06 [INFO] --- tycho-compiler-plugin:1.4.0:compile (default-compile) @ org.eclipse.sirius.tests.sample.scxml ---
12:59:06 [INFO] Compiling 70 source files to /home/jenkins/workspace/sirius.sonar-master/plugins/org.eclipse.sirius.tests.sample.scxml/target/classes
12:59:06 [INFO] 
12:59:06 [INFO] --- maven-resources-plugin:2.4.1:testResources (default-testResources) @ org.eclipse.sirius.tests.sample.scxml ---
12:59:06 [INFO] Using 'ISO-8859-1' encoding to copy filtered resources.
12:59:06 [INFO] skip non existing resourceDirectory /home/jenkins/workspace/sirius.sonar-master/plugins/org.eclipse.sirius.tests.sample.scxml/src/test/resources
12:59:06 [INFO] 
12:59:06 [INFO] --- tycho-source-plugin:1.4.0:plugin-source (plugin-source) @ org.eclipse.sirius.tests.sample.scxml ---
12:59:06 [INFO] Building jar: /home/jenkins/workspace/sirius.sonar-master/plugins/org.eclipse.sirius.tests.sample.scxml/target/org.eclipse.sirius.tests.sample.scxml-6.2.1-SNAPSHOT-sources.jar
12:59:06 [INFO] 
12:59:06 [INFO] --- target-platform-configuration:1.4.0:target-platform (default-target-platform) @ org.eclipse.sirius.tests.sample.scxml ---
12:59:06 [INFO] 
12:59:06 [INFO] --- tycho-packaging-plugin:1.4.0:package-plugin (default-package-plugin) @ org.eclipse.sirius.tests.sample.scxml ---
12:59:06 [INFO] Building jar: /home/jenkins/workspace/sirius.sonar-master/plugins/org.eclipse.sirius.tests.sample.scxml/target/org.eclipse.sirius.tests.sample.scxml-6.2.1-SNAPSHOT.jar
12:59:06 [INFO] 
12:59:06 [INFO] --- tycho-p2-plugin:1.4.0:p2-metadata-default (default-p2-metadata-default) @ org.eclipse.sirius.tests.sample.scxml ---
12:59:06 [INFO] 
12:59:06 [INFO] --- tycho-source-feature-plugin:1.4.0:source-feature (source-feature) @ org.eclipse.sirius.tests.sample.scxml ---
12:59:06 [INFO] 
12:59:06 [INFO] --- tycho-p2-plugin:1.4.0:p2-metadata (p2-metadata) @ org.eclipse.sirius.tests.sample.scxml ---
12:59:06 [INFO] 
12:59:06 [INFO] --- jacoco-maven-plugin:0.7.9:prepare-agent-integration (agent-for-it) @ org.eclipse.sirius.tests.sample.scxml ---
12:59:06 [INFO] jacoco.agent.it.arg set to -javaagent:/home/jenkins/workspace/sirius.sonar-master/.repository/org/jacoco/org.jacoco.agent/0.7.9/org.jacoco.agent-0.7.9-runtime.jar=destfile=/home/jenkins/workspace/sirius.sonar-master/plugins/org.eclipse.sirius.tests.sample.scxml/../../packaging/org.eclipse.sirius.parent/target/jacoco-it.exec,append=true
12:59:06 [INFO] 
12:59:06 [INFO] --< org.eclipse.sirius:org.eclipse.sirius.tests.sample.scxml.design >---
12:59:06 [INFO] Building org.eclipse.sirius.tests.sample.scxml.design 6.2.1-SNAPSHOT [139/159]
12:59:06 [INFO] ---------------------------[ eclipse-plugin ]---------------------------
12:59:06 [INFO] 
12:59:06 [INFO] --- maven-clean-plugin:2.5:clean (default-clean) @ org.eclipse.sirius.tests.sample.scxml.design ---
12:59:06 [INFO] 
12:59:06 [INFO] --- tycho-packaging-plugin:1.4.0:build-qualifier (default-build-qualifier) @ org.eclipse.sirius.tests.sample.scxml.design ---
12:59:06 [INFO] The project's OSGi version is 6.2.1.201906241254
12:59:06 [INFO] 
12:59:06 [INFO] --- tycho-packaging-plugin:1.4.0:validate-id (default-validate-id) @ org.eclipse.sirius.tests.sample.scxml.design ---
12:59:06 [INFO] 
12:59:06 [INFO] --- tycho-packaging-plugin:1.4.0:validate-version (default-validate-version) @ org.eclipse.sirius.tests.sample.scxml.design ---
12:59:06 [INFO] 
12:59:06 [INFO] --- jacoco-maven-plugin:0.7.9:prepare-agent (agent-for-ut) @ org.eclipse.sirius.tests.sample.scxml.design ---
12:59:06 [INFO] jacoco.agent.ut.arg set to -javaagent:/home/jenkins/workspace/sirius.sonar-master/.repository/org/jacoco/org.jacoco.agent/0.7.9/org.jacoco.agent-0.7.9-runtime.jar=destfile=/home/jenkins/workspace/sirius.sonar-master/plugins/org.eclipse.sirius.tests.sample.scxml.design/../../packaging/org.eclipse.sirius.parent/target/jacoco.exec,append=true
12:59:06 [INFO] 
12:59:06 [INFO] --- maven-resources-plugin:2.4.1:resources (default-resources) @ org.eclipse.sirius.tests.sample.scxml.design ---
12:59:06 [INFO] Using 'ISO-8859-1' encoding to copy filtered resources.
12:59:06 [INFO] skip non existing resourceDirectory /home/jenkins/workspace/sirius.sonar-master/plugins/org.eclipse.sirius.tests.sample.scxml.design/src/main/resources
12:59:06 [INFO] 
12:59:06 [INFO] --- tycho-compiler-plugin:1.4.0:compile (default-compile) @ org.eclipse.sirius.tests.sample.scxml.design ---
12:59:06 [INFO] Compiling 2 source files to /home/jenkins/workspace/sirius.sonar-master/plugins/org.eclipse.sirius.tests.sample.scxml.design/target/classes
12:59:06 [INFO] 
12:59:06 [INFO] --- maven-resources-plugin:2.4.1:testResources (default-testResources) @ org.eclipse.sirius.tests.sample.scxml.design ---
12:59:06 [INFO] Using 'ISO-8859-1' encoding to copy filtered resources.
12:59:06 [INFO] skip non existing resourceDirectory /home/jenkins/workspace/sirius.sonar-master/plugins/org.eclipse.sirius.tests.sample.scxml.design/src/test/resources
12:59:06 [INFO] 
12:59:06 [INFO] --- tycho-source-plugin:1.4.0:plugin-source (plugin-source) @ org.eclipse.sirius.tests.sample.scxml.design ---
12:59:06 [INFO] Building jar: /home/jenkins/workspace/sirius.sonar-master/plugins/org.eclipse.sirius.tests.sample.scxml.design/target/org.eclipse.sirius.tests.sample.scxml.design-6.2.1-SNAPSHOT-sources.jar
12:59:06 [INFO] 
12:59:06 [INFO] --- target-platform-configuration:1.4.0:target-platform (default-target-platform) @ org.eclipse.sirius.tests.sample.scxml.design ---
12:59:06 [INFO] 
12:59:06 [INFO] --- tycho-packaging-plugin:1.4.0:package-plugin (default-package-plugin) @ org.eclipse.sirius.tests.sample.scxml.design ---
12:59:06 [INFO] Building jar: /home/jenkins/workspace/sirius.sonar-master/plugins/org.eclipse.sirius.tests.sample.scxml.design/target/org.eclipse.sirius.tests.sample.scxml.design-6.2.1-SNAPSHOT.jar
12:59:06 [INFO] 
12:59:06 [INFO] --- tycho-p2-plugin:1.4.0:p2-metadata-default (default-p2-metadata-default) @ org.eclipse.sirius.tests.sample.scxml.design ---
12:59:06 [INFO] 
12:59:06 [INFO] --- tycho-source-feature-plugin:1.4.0:source-feature (source-feature) @ org.eclipse.sirius.tests.sample.scxml.design ---
12:59:06 [INFO] 
12:59:06 [INFO] --- tycho-p2-plugin:1.4.0:p2-metadata (p2-metadata) @ org.eclipse.sirius.tests.sample.scxml.design ---
12:59:06 [INFO] 
12:59:06 [INFO] --- jacoco-maven-plugin:0.7.9:prepare-agent-integration (agent-for-it) @ org.eclipse.sirius.tests.sample.scxml.design ---
12:59:06 [INFO] jacoco.agent.it.arg set to -javaagent:/home/jenkins/workspace/sirius.sonar-master/.repository/org/jacoco/org.jacoco.agent/0.7.9/org.jacoco.agent-0.7.9-runtime.jar=destfile=/home/jenkins/workspace/sirius.sonar-master/plugins/org.eclipse.sirius.tests.sample.scxml.design/../../packaging/org.eclipse.sirius.parent/target/jacoco-it.exec,append=true
12:59:06 [INFO] 
12:59:06 [INFO] --< org.eclipse.sirius:org.eclipse.sirius.tests.sample.component.design >--
12:59:06 [INFO] Building org.eclipse.sirius.tests.sample.component.design 6.2.1-SNAPSHOT [140/159]
12:59:06 [INFO] ---------------------------[ eclipse-plugin ]---------------------------
12:59:06 [INFO] 
12:59:06 [INFO] --- maven-clean-plugin:2.5:clean (default-clean) @ org.eclipse.sirius.tests.sample.component.design ---
12:59:06 [INFO] 
12:59:06 [INFO] --- tycho-packaging-plugin:1.4.0:build-qualifier (default-build-qualifier) @ org.eclipse.sirius.tests.sample.component.design ---
12:59:06 [INFO] The project's OSGi version is 6.2.1.201906241254
12:59:06 [INFO] 
12:59:06 [INFO] --- tycho-packaging-plugin:1.4.0:validate-id (default-validate-id) @ org.eclipse.sirius.tests.sample.component.design ---
12:59:06 [INFO] 
12:59:06 [INFO] --- tycho-packaging-plugin:1.4.0:validate-version (default-validate-version) @ org.eclipse.sirius.tests.sample.component.design ---
12:59:06 [INFO] 
12:59:06 [INFO] --- jacoco-maven-plugin:0.7.9:prepare-agent (agent-for-ut) @ org.eclipse.sirius.tests.sample.component.design ---
12:59:06 [INFO] jacoco.agent.ut.arg set to -javaagent:/home/jenkins/workspace/sirius.sonar-master/.repository/org/jacoco/org.jacoco.agent/0.7.9/org.jacoco.agent-0.7.9-runtime.jar=destfile=/home/jenkins/workspace/sirius.sonar-master/plugins/org.eclipse.sirius.tests.sample.component.design/../../packaging/org.eclipse.sirius.parent/target/jacoco.exec,append=true
12:59:06 [INFO] 
12:59:06 [INFO] --- maven-resources-plugin:2.4.1:resources (default-resources) @ org.eclipse.sirius.tests.sample.component.design ---
12:59:06 [INFO] Using 'ISO-8859-1' encoding to copy filtered resources.
12:59:06 [INFO] skip non existing resourceDirectory /home/jenkins/workspace/sirius.sonar-master/plugins/org.eclipse.sirius.tests.sample.component.design/src/main/resources
12:59:06 [INFO] 
12:59:06 [INFO] --- tycho-compiler-plugin:1.4.0:compile (default-compile) @ org.eclipse.sirius.tests.sample.component.design ---
12:59:06 [INFO] Compiling 6 source files to /home/jenkins/workspace/sirius.sonar-master/plugins/org.eclipse.sirius.tests.sample.component.design/target/classes
12:59:06 [INFO] 
12:59:06 [INFO] --- maven-resources-plugin:2.4.1:testResources (default-testResources) @ org.eclipse.sirius.tests.sample.component.design ---
12:59:06 [INFO] Using 'ISO-8859-1' encoding to copy filtered resources.
12:59:06 [INFO] skip non existing resourceDirectory /home/jenkins/workspace/sirius.sonar-master/plugins/org.eclipse.sirius.tests.sample.component.design/src/test/resources
12:59:06 [INFO] 
12:59:06 [INFO] --- tycho-source-plugin:1.4.0:plugin-source (plugin-source) @ org.eclipse.sirius.tests.sample.component.design ---
12:59:06 [INFO] Building jar: /home/jenkins/workspace/sirius.sonar-master/plugins/org.eclipse.sirius.tests.sample.component.design/target/org.eclipse.sirius.tests.sample.component.design-6.2.1-SNAPSHOT-sources.jar
12:59:06 [INFO] 
12:59:06 [INFO] --- target-platform-configuration:1.4.0:target-platform (default-target-platform) @ org.eclipse.sirius.tests.sample.component.design ---
12:59:06 [INFO] 
12:59:06 [INFO] --- tycho-packaging-plugin:1.4.0:package-plugin (default-package-plugin) @ org.eclipse.sirius.tests.sample.component.design ---
12:59:06 [INFO] Building jar: /home/jenkins/workspace/sirius.sonar-master/plugins/org.eclipse.sirius.tests.sample.component.design/target/org.eclipse.sirius.tests.sample.component.design-6.2.1-SNAPSHOT.jar
12:59:06 [INFO] 
12:59:06 [INFO] --- tycho-p2-plugin:1.4.0:p2-metadata-default (default-p2-metadata-default) @ org.eclipse.sirius.tests.sample.component.design ---
12:59:06 [INFO] 
12:59:06 [INFO] --- tycho-source-feature-plugin:1.4.0:source-feature (source-feature) @ org.eclipse.sirius.tests.sample.component.design ---
12:59:06 [INFO] 
12:59:06 [INFO] --- tycho-p2-plugin:1.4.0:p2-metadata (p2-metadata) @ org.eclipse.sirius.tests.sample.component.design ---
12:59:06 [INFO] 
12:59:06 [INFO] --- jacoco-maven-plugin:0.7.9:prepare-agent-integration (agent-for-it) @ org.eclipse.sirius.tests.sample.component.design ---
12:59:06 [INFO] jacoco.agent.it.arg set to -javaagent:/home/jenkins/workspace/sirius.sonar-master/.repository/org/jacoco/org.jacoco.agent/0.7.9/org.jacoco.agent-0.7.9-runtime.jar=destfile=/home/jenkins/workspace/sirius.sonar-master/plugins/org.eclipse.sirius.tests.sample.component.design/../../packaging/org.eclipse.sirius.parent/target/jacoco-it.exec,append=true
12:59:06 [INFO] 
12:59:06 [INFO] ---------< org.eclipse.sirius:org.eclipse.sirius.tests.junit >----------
12:59:06 [INFO] Building org.eclipse.sirius.tests.junit 6.2.1-SNAPSHOT         [141/159]
12:59:06 [INFO] ------------------------[ eclipse-test-plugin ]-------------------------
12:59:06 [INFO] 
12:59:06 [INFO] --- maven-clean-plugin:2.5:clean (default-clean) @ org.eclipse.sirius.tests.junit ---
12:59:06 [INFO] 
12:59:06 [INFO] --- tycho-packaging-plugin:1.4.0:build-qualifier (default-build-qualifier) @ org.eclipse.sirius.tests.junit ---
12:59:06 [INFO] The project's OSGi version is 6.2.1.201906241254
12:59:06 [INFO] 
12:59:06 [INFO] --- tycho-packaging-plugin:1.4.0:validate-id (default-validate-id) @ org.eclipse.sirius.tests.junit ---
12:59:06 [INFO] 
12:59:06 [INFO] --- tycho-packaging-plugin:1.4.0:validate-version (default-validate-version) @ org.eclipse.sirius.tests.junit ---
12:59:06 [INFO] 
12:59:06 [INFO] --- jacoco-maven-plugin:0.7.9:prepare-agent (agent-for-ut) @ org.eclipse.sirius.tests.junit ---
12:59:06 [INFO] jacoco.agent.ut.arg set to -javaagent:/home/jenkins/workspace/sirius.sonar-master/.repository/org/jacoco/org.jacoco.agent/0.7.9/org.jacoco.agent-0.7.9-runtime.jar=destfile=/home/jenkins/workspace/sirius.sonar-master/plugins/org.eclipse.sirius.tests.junit/../../packaging/org.eclipse.sirius.parent/target/jacoco.exec,append=true
12:59:06 [INFO] 
12:59:06 [INFO] --- maven-resources-plugin:2.4.1:resources (default-resources) @ org.eclipse.sirius.tests.junit ---
12:59:06 [INFO] Using 'ISO-8859-1' encoding to copy filtered resources.
12:59:06 [INFO] skip non existing resourceDirectory /home/jenkins/workspace/sirius.sonar-master/plugins/org.eclipse.sirius.tests.junit/src/main/resources
12:59:06 [INFO] 
12:59:06 [INFO] --- tycho-compiler-plugin:1.4.0:compile (default-compile) @ org.eclipse.sirius.tests.junit ---
12:59:07 [INFO] Compiling 645 source files to /home/jenkins/workspace/sirius.sonar-master/plugins/org.eclipse.sirius.tests.junit/target/classes
12:59:08 [INFO] 
12:59:08 [INFO] --- org.eclipse.acceleo.maven:3.5.2:acceleo-compile (acceleo-compile) @ org.eclipse.sirius.tests.junit ---
12:59:08 [INFO] Acceleo maven stand alone build...
12:59:08 [INFO] Starting packages registration...
12:59:09 [INFO] Registering package 'org.eclipse.emf.ecore.EcorePackage'.
12:59:09 [INFO] Starting the build sequence for the project '/home/jenkins/workspace/sirius.sonar-master/plugins/org.eclipse.sirius.tests.junit'...
12:59:09 [INFO] Mapping the pom.xml to AcceleoProject...
12:59:09 [INFO] Adding jar dependencies...
12:59:09 [INFO] Starting parsing...
12:59:09 [INFO] Saving ouput file for '/home/jenkins/workspace/sirius.sonar-master/plugins/org.eclipse.sirius.tests.junit/src/org/eclipse/sirius/tests/unit/common/interpreter/acceleo/mtl/AcceleoMtlInterpreterTestModule2.mtl'.
12:59:09 [INFO] Saving ouput file for '/home/jenkins/workspace/sirius.sonar-master/plugins/org.eclipse.sirius.tests.junit/src/org/eclipse/sirius/tests/unit/common/interpreter/acceleo/mtl/AcceleoMtlInterpreterTestModule.mtl'.
12:59:09 [INFO] Build completed.
12:59:09 [INFO] 
12:59:09 [INFO] --- org.eclipse.acceleo.maven:3.5.2:acceleo-compile (default) @ org.eclipse.sirius.tests.junit ---
12:59:09 [INFO] Acceleo maven stand alone build...
12:59:09 [INFO] Starting packages registration...
12:59:09 [INFO] Registering package 'org.eclipse.emf.ecore.EcorePackage'.
12:59:09 [INFO] Starting the build sequence for the project '/home/jenkins/workspace/sirius.sonar-master/plugins/org.eclipse.sirius.tests.junit'...
12:59:09 [INFO] Mapping the pom.xml to AcceleoProject...
12:59:09 [INFO] Adding jar dependencies...
12:59:09 [INFO] Starting parsing...
12:59:09 [INFO] Build completed.
12:59:09 [INFO] 
12:59:09 [INFO] --- maven-resources-plugin:2.4.1:testResources (default-testResources) @ org.eclipse.sirius.tests.junit ---
12:59:09 [INFO] Using 'ISO-8859-1' encoding to copy filtered resources.
12:59:09 [INFO] skip non existing resourceDirectory /home/jenkins/workspace/sirius.sonar-master/plugins/org.eclipse.sirius.tests.junit/src/test/resources
12:59:09 [INFO] 
12:59:09 [INFO] --- tycho-source-plugin:1.4.0:plugin-source (plugin-source) @ org.eclipse.sirius.tests.junit ---
12:59:09 [INFO] Building jar: /home/jenkins/workspace/sirius.sonar-master/plugins/org.eclipse.sirius.tests.junit/target/org.eclipse.sirius.tests.junit-6.2.1-SNAPSHOT-sources.jar
12:59:09 [INFO] 
12:59:09 [INFO] --- target-platform-configuration:1.4.0:target-platform (default-target-platform) @ org.eclipse.sirius.tests.junit ---
12:59:09 [INFO] 
12:59:09 [INFO] --- tycho-packaging-plugin:1.4.0:package-plugin (default-package-plugin) @ org.eclipse.sirius.tests.junit ---
12:59:09 [INFO] Building jar: /home/jenkins/workspace/sirius.sonar-master/plugins/org.eclipse.sirius.tests.junit/target/org.eclipse.sirius.tests.junit-6.2.1-SNAPSHOT.jar
12:59:10 [INFO] 
12:59:10 [INFO] --- tycho-p2-plugin:1.4.0:p2-metadata-default (default-p2-metadata-default) @ org.eclipse.sirius.tests.junit ---
12:59:10 [INFO] 
12:59:10 [INFO] --- tycho-source-feature-plugin:1.4.0:source-feature (source-feature) @ org.eclipse.sirius.tests.junit ---
12:59:10 [INFO] 
12:59:10 [INFO] --- tycho-p2-plugin:1.4.0:p2-metadata (p2-metadata) @ org.eclipse.sirius.tests.junit ---
12:59:10 [INFO] 
12:59:10 [INFO] --- jacoco-maven-plugin:0.7.9:prepare-agent-integration (agent-for-it) @ org.eclipse.sirius.tests.junit ---
12:59:10 [INFO] jacoco.agent.it.arg set to -javaagent:/home/jenkins/workspace/sirius.sonar-master/.repository/org/jacoco/org.jacoco.agent/0.7.9/org.jacoco.agent-0.7.9-runtime.jar=destfile=/home/jenkins/workspace/sirius.sonar-master/plugins/org.eclipse.sirius.tests.junit/../../packaging/org.eclipse.sirius.parent/target/jacoco-it.exec,append=true
12:59:10 [INFO] 
12:59:10 [INFO] --- tycho-surefire-plugin:1.4.0:test (default-test) @ org.eclipse.sirius.tests.junit ---
12:59:11 [INFO] Expected eclipse log file: /home/jenkins/workspace/sirius.sonar-master/plugins/org.eclipse.sirius.tests.junit/target/work/data/.metadata/.log
12:59:11 [INFO] Command line:
12:59:11 	[/opt/tools/java/oracle/jdk-8/1.8.0_202/jre/bin/java, -Dosgi.noShutdown=false, -Dosgi.os=linux, -Dosgi.ws=gtk, -Dosgi.arch=x86_64, -javaagent:/home/jenkins/workspace/sirius.sonar-master/.repository/org/jacoco/org.jacoco.agent/0.7.9/org.jacoco.agent-0.7.9-runtime.jar=destfile=/home/jenkins/workspace/sirius.sonar-master/plugins/org.eclipse.sirius.tests.junit/../../packaging/org.eclipse.sirius.parent/target/jacoco.exec,append=true, -Xmx2048m, -XX:+HeapDumpOnOutOfMemoryError, -Dosgi.clean=true, -DcreateLocalRepresentationInSeparateResource=null, -Dorg.eclipse.sirius.tests.skipLongTests=true, -Dorg.eclipse.sirius.tests.skipUnreliableTests=true, -jar, /home/jenkins/workspace/sirius.sonar-master/.repository/p2/osgi/bundle/org.eclipse.equinox.launcher/1.5.0.v20180512-1130/org.eclipse.equinox.launcher-1.5.0.v20180512-1130.jar, -data, /home/jenkins/workspace/sirius.sonar-master/plugins/org.eclipse.sirius.tests.junit/target/work/data, -install, /home/jenkins/workspace/sirius.sonar-master/plugins/org.eclipse.sirius.tests.junit/target/work, -configuration, /home/jenkins/workspace/sirius.sonar-master/plugins/org.eclipse.sirius.tests.junit/target/work/configuration, -application, org.eclipse.tycho.surefire.osgibooter.uitest, -testproperties, /home/jenkins/workspace/sirius.sonar-master/plugins/org.eclipse.sirius.tests.junit/target/surefire.properties]
12:59:11 Picked up JAVA_TOOL_OPTIONS: -XX:+IgnoreUnrecognizedVMOptions -XX:+UseContainerSupport -XX:+UnlockExperimentalVMOptions -XX:+UseCGroupMemoryLimitForHeap
12:59:11 Picked up _JAVA_OPTIONS: -XX:MaxRAMPercentage=64.0
12:59:17 Running org.eclipse.sirius.tests.suite.AllSiriusTestSuite
12:59:20 Setup of org.eclipse.sirius.tests.unit.refresh.RefreshFromViewpointActivationTests.testRefreshAfterViewpointActivation()
12:59:25 Setup of org.eclipse.sirius.tests.unit.common.DialectEditorsOpeningWithFailingSessionOpeningTests.testTreeEditorOpeningWithCanceledSessionOpening()
12:59:26 Setup of org.eclipse.sirius.tests.unit.common.DialectEditorsOpeningWithFailingSessionOpeningTests.testCrossTableEditorOpeningWithCanceledSessionOpening()
12:59:26 Setup of org.eclipse.sirius.tests.unit.common.DialectEditorsOpeningWithFailingSessionOpeningTests.testEditionTableEditorOpeningWithFailingSessionOpening()
12:59:26 Setup of org.eclipse.sirius.tests.unit.common.DialectEditorsOpeningWithFailingSessionOpeningTests.testDiagramEditorOpeningWithFailingSessionOpening()
12:59:26 Setup of org.eclipse.sirius.tests.unit.common.DialectEditorsOpeningWithFailingSessionOpeningTests.testCrossTableEditorOpeningWithFailingSessionOpening()
12:59:26 Setup of org.eclipse.sirius.tests.unit.common.DialectEditorsOpeningWithFailingSessionOpeningTests.testDiagramEditorOpeningWithCanceledSessionOpening()
12:59:26 Setup of org.eclipse.sirius.tests.unit.common.DialectEditorsOpeningWithFailingSessionOpeningTests.testEditionTableEditorOpeningWithCanceledSessionOpening()
12:59:27 Setup of org.eclipse.sirius.tests.unit.common.DialectEditorsOpeningWithFailingSessionOpeningTests.testTreeEditorOpeningWithFailingSessionOpening()
12:59:27 Setup of org.eclipse.sirius.tests.unit.common.PreferencesTests.testPreferenceValuesSynchronizationOnChangefromSirius()
12:59:27 Setup of org.eclipse.sirius.tests.unit.common.PreferencesTests.testPreferenceValuesSynchronization()
12:59:27 Setup of org.eclipse.sirius.tests.unit.common.PreferencesTests.testDefaultPreferenceValuesSynchronization()
12:59:27 Setup of org.eclipse.sirius.tests.unit.common.PreferencesTests.testPreferenceValuesSynchronizationOnChangeFromSiriusUI()
12:59:27 Setup of org.eclipse.sirius.tests.unit.api.convert.ConvertProjectToModelingProjectTest.testConvertToModelingProjectWithoutRepresentationFileNorSemanticResources()
12:59:27 Setup of org.eclipse.sirius.tests.unit.api.convert.ConvertProjectToModelingProjectTest.testConverProjectToModelingProjectWithNonLoadableResources()
12:59:27 Setup of org.eclipse.sirius.tests.unit.api.convert.ConvertProjectToModelingProjectTest.testConverProjectToModelingProjectWithIgnoredFiles()
12:59:27 Setup of org.eclipse.sirius.tests.unit.api.convert.ConvertProjectToModelingProjectTest.testConvertToModelingProjectWithoutRepresentationFileButSemanticResources()
12:59:27 Setup of org.eclipse.sirius.tests.unit.api.convert.ConvertProjectToModelingProjectTest.testConvertToModelingProjectWith2RepresentationFile()
12:59:28 Setup of org.eclipse.sirius.tests.unit.api.convert.ConvertProjectToModelingProjectTest.testConvertAndRemoveProjectToModelingProject()
12:59:28 Setup of org.eclipse.sirius.tests.unit.api.convert.ConvertProjectToModelingProjectTest.testConverProjectToModelingProjectWithExistingResourcesAndAird()
12:59:28 Setup of org.eclipse.sirius.tests.unit.diagram.migration.RepairOnLabelHiddenTest.testRepairOnLabelHidden()
12:59:28 Setup of org.eclipse.sirius.tests.unit.diagram.migration.RepairTest.testStyleChangeFromBIToSquare()
12:59:29 Setup of org.eclipse.sirius.tests.unit.diagram.migration.MigrationLabelBoundsToLocationTest.testLabelsHaveLocationInsteadOfBounds()
12:59:29 Setup of org.eclipse.sirius.tests.unit.diagram.migration.MigrationLabelBoundsToLocationTest.testMigrationIsNeededOnData()
12:59:29 Setup of org.eclipse.sirius.tests.unit.diagram.migration.MigrationEdgeLabelLocationToBoundsTest.testEdgeLabelsHaveLocationInsteadOfBounds()
12:59:29 Setup of org.eclipse.sirius.tests.unit.diagram.migration.MigrationEdgeLabelLocationToBoundsTest.testMigrationIsNeededOnData()
12:59:29 Setup of org.eclipse.sirius.tests.unit.diagram.migration.MigrationCompartmentWithLayoutConstraintsTest.testMigrationIsNeededOnData()
12:59:29 Setup of org.eclipse.sirius.tests.unit.diagram.migration.MigrationCompartmentWithLayoutConstraintsTest.testCompartmentsWithLayoutConstraints()
12:59:29 Setup of org.eclipse.sirius.tests.unit.diagram.migration.MigrationInconsistentGMFVisibilityTest.testMigrationIsNeededOnData()
12:59:29 Setup of org.eclipse.sirius.tests.unit.diagram.migration.MigrationInconsistentGMFVisibilityTest.testGMFViewpointVisibilityConsistency()
12:59:29 Setup of org.eclipse.sirius.tests.unit.diagram.migration.RepairMigrateLostDiagramElementsTC1Test.testCreationOfElementsWithCreationOptionToFalseButContainedInElementWithCreationOptionToTrue1()
12:59:30 Setup of org.eclipse.sirius.tests.unit.diagram.migration.RepairMigrateLostDiagramElementsTC2Test.testCreationOfElementsWithCreationOptionToFalseButContainedInElementWithCreationOptionToTrue2()
12:59:30 Setup of org.eclipse.sirius.tests.unit.diagram.migration.RepairMigratePinStatusTest.testPinStatusConservation()
12:59:31 Setup of org.eclipse.sirius.tests.unit.common.migration.GeneralMigrationMechanismTest.testReplaceAirdWithOlderVersion()
12:59:31 Setup of org.eclipse.sirius.tests.unit.common.migration.GeneralMigrationMechanismTest.testReloadAlreadyMigratedAird()
12:59:31 Setup of org.eclipse.sirius.tests.unit.common.migration.GeneralMigrationMechanismTest.testReplaceOdesignOlderVersionWithMigratedVersion()
12:59:31 Setup of org.eclipse.sirius.tests.unit.common.migration.GeneralMigrationMechanismTest.testReloadAlreadyMigratedOdesign()
12:59:31 Setup of org.eclipse.sirius.tests.unit.common.migration.GeneralMigrationMechanismTest.testReplaceAirdOldVersionWithAnOtherOldVersion()
12:59:31 Setup of org.eclipse.sirius.tests.unit.common.migration.GeneralMigrationMechanismTest.testReplaceAirdOlderVersionWithMigratedVersion()
12:59:31 Setup of org.eclipse.sirius.tests.unit.common.migration.GeneralMigrationMechanismTest.testReplaceOdesignWithOlderVersion()
12:59:31 Setup of org.eclipse.sirius.tests.unit.common.migration.GeneralMigrationMechanismTest.testReplaceOdesignOldVersionWithAnOtherOldVersion()
12:59:31 Setup of org.eclipse.sirius.tests.unit.diagram.migration.FragmentedFilesMigrationTest.testMigrationWithReadOnlyFilePressOk()
12:59:31 Setup of org.eclipse.sirius.tests.unit.diagram.migration.FragmentedFilesMigrationTest.testMigrationWithReadOnlyFilePressCancel()
12:59:31 Setup of org.eclipse.sirius.tests.unit.diagram.migration.FragmentedFilesMigrationTest.testVisibilityMigration()
12:59:32 Setup of org.eclipse.sirius.tests.unit.diagram.migration.FragmentedFilesMigrationTest.testFiltersRulesBehaviorMigration()
12:59:32 Setup of org.eclipse.sirius.tests.unit.diagram.migration.FragmentedFilesMigrationTest.testMigrationWithFragmentedFile()
12:59:33 Setup of org.eclipse.sirius.tests.unit.diagram.migration.MigrationOfCollapsedBorderedNodeTest.testMigrationIsNeededOnData()
12:59:33 Setup of org.eclipse.sirius.tests.unit.diagram.migration.MigrationOfCollapsedBorderedNodeTest.testMigration()
12:59:33 Setup of org.eclipse.sirius.tests.unit.diagram.migration.MigrationOfHideLabelFilterInconsistencyTest.testMigrationIsNeededOnData()
12:59:33 Setup of org.eclipse.sirius.tests.unit.diagram.migration.MigrationOfHideLabelFilterInconsistencyTest.testMigration()
12:59:33 Setup of org.eclipse.sirius.tests.unit.diagram.migration.ListContainerAttributeMigrationTest.testMigrationIsNeededOnData()
12:59:33 Setup of org.eclipse.sirius.tests.unit.diagram.migration.ListContainerAttributeMigrationTest.testListContainerAttributeMigrationDoneInPlugin()
12:59:34 Setup of org.eclipse.sirius.tests.unit.diagram.migration.ListContainerAttributeMigrationTest.testListContainerAttributeMigrationDone()
12:59:34 Setup of org.eclipse.sirius.tests.unit.diagram.migration.DiagramSplitMigrationTest.testMigrationIsNeededOnData()
12:59:34 Setup of org.eclipse.sirius.tests.unit.diagram.migration.DiagramSplitMigrationTest.testDiagramSplitRepresentationFileMigrationDone()
12:59:34 Setup of org.eclipse.sirius.tests.unit.diagram.migration.DiagramSplitMigrationTest.testDiagramSplitVSMMigrationDone()
12:59:34 Setup of org.eclipse.sirius.tests.unit.diagram.migration.RunRepairTest.testNoDirtyAfterMigrationWithFilterApplied()
12:59:34 Setup of org.eclipse.sirius.tests.unit.diagram.migration.RunRepairTest.testBlankAird()
12:59:34 Setup of org.eclipse.sirius.tests.unit.diagram.migration.RunRepairTest.testFragmentedMigrationNotAddUnecessaryModelsReferences()
12:59:34 Setup of org.eclipse.sirius.tests.unit.diagram.migration.RunRepairTest.testAirdWithUnexistingModel()
12:59:35 Setup of org.eclipse.sirius.tests.unit.diagram.migration.RunRepairTest.testDiagramElementWithUnexistingTarget()
12:59:35 Setup of org.eclipse.sirius.tests.unit.diagram.migration.RunRepairTest.testMigrationOfBreakdownDiagram()
12:59:35 Setup of org.eclipse.sirius.tests.unit.diagram.migration.RunRepairTest.testFragmentedMigration()
12:59:36 Setup of org.eclipse.sirius.tests.unit.diagram.migration.RunRepairTest.testFragmentedMigrationKeepModelsReferencesAfterMigration()
12:59:36 Setup of org.eclipse.sirius.tests.unit.diagram.migration.RunRepairTest.testContainerWithNullMappingWhenDoingRepairMigrate()
12:59:37 Setup of org.eclipse.sirius.tests.unit.diagram.migration.RunRepairTest.testMissingTransactionWhenDoingRepairMigrate()
12:59:37 Setup of org.eclipse.sirius.tests.unit.diagram.migration.DDiagramSetRemovalMigrationTest.testDDiagramSetRemovalMigrationDone()
12:59:37 Setup of org.eclipse.sirius.tests.unit.diagram.migration.DDiagramSetRemovalMigrationTest.testMigrationIsNeededOnData()
12:59:37 Setup of org.eclipse.sirius.tests.unit.diagram.migration.ReferencedModelResourceMigrationTest.testMigrationOfBaseVSMIsNotPartialWhenMigratingReferencingVSM()
12:59:37 Setup of org.eclipse.sirius.tests.unit.diagram.migration.RemoveAcceleoReferencesMigrationTest.testMigrationIsNeededOnData()
12:59:37 Setup of org.eclipse.sirius.tests.unit.diagram.migration.RemoveAcceleoReferencesMigrationTest.testRemoveAcceleoReferencesMigration()
12:59:37 Setup of org.eclipse.sirius.tests.unit.diagram.migration.RemoveAcceleoReferencesMigrationTest.testValuesAfterMigration()
12:59:37 Setup of org.eclipse.sirius.tests.unit.diagram.migration.FontStyleForDNodeListElementMigrationTest.testNodeListElementAfterMigration()
12:59:37 Setup of org.eclipse.sirius.tests.unit.diagram.migration.FontStyleForDNodeListElementMigrationTest.testMigrationIsNeededOnData()
12:59:37 Setup of org.eclipse.sirius.tests.unit.diagram.migration.FontStyleForDNodeListElementMigrationTest.testMigration()
12:59:37 Setup of org.eclipse.sirius.tests.unit.diagram.migration.OptionalLayerToAdditionalLayerMigrationTest.testMigrationIsNeededOnData()
12:59:37 Setup of org.eclipse.sirius.tests.unit.diagram.migration.OptionalLayerToAdditionalLayerMigrationTest.testVSMReferencingAlreadyMigratedVSMMigration()
12:59:37 Setup of org.eclipse.sirius.tests.unit.diagram.migration.OptionalLayerToAdditionalLayerMigrationTest.testRepresentationsFileMigrationInWorkspace()
12:59:37 Setup of org.eclipse.sirius.tests.unit.diagram.migration.OptionalLayerToAdditionalLayerMigrationTest.testVSMMigrationInPlugin()
12:59:37 Setup of org.eclipse.sirius.tests.unit.diagram.migration.OptionalLayerToAdditionalLayerMigrationTest.testVSMMigrationInWorkspace()
12:59:37 Setup of org.eclipse.sirius.tests.unit.diagram.migration.OptionalLayerToAdditionalLayerMigrationTest.testRepresentationsFileReferencingAlreadyMigratedVSMMigration()
12:59:37 Setup of org.eclipse.sirius.tests.unit.diagram.migration.OptionalLayerToAdditionalLayerMigrationTest.testRepresentationsFileMigrationInPlugin()
12:59:37 Setup of org.eclipse.sirius.tests.unit.diagram.migration.MigrationRoutingStyleEndUserOverrideTest.testMigrationIsNeededOnData()
12:59:37 Setup of org.eclipse.sirius.tests.unit.diagram.migration.MigrationRoutingStyleEndUserOverrideTest.testMigration()
12:59:38 Setup of org.eclipse.sirius.tests.unit.diagram.migration.CorruptedViewsMigrationTests.testMigrationIsNeededOnData()
12:59:39 Setup of org.eclipse.sirius.tests.unit.diagram.migration.CorruptedViewsMigrationTests.testSessionDoesNotContainViewWithUnsettedElements()
12:59:39 Setup of org.eclipse.sirius.tests.unit.common.OperationCanceledExceptionSessionTest.testOperationCanceledExceptionAtOpeningTime()
12:59:39 Setup of org.eclipse.sirius.tests.unit.common.migration.MigrationFromSirius0_9Test.testMigrationIsNeededOnData()
12:59:39 Setup of org.eclipse.sirius.tests.unit.common.migration.MigrationFromSirius0_9Test.testMigration()
12:59:39 Setup of org.eclipse.sirius.tests.unit.common.migration.MigrationFromSirius1_0_0_M5Test.testMigrationIsNeededOnData()
12:59:39 Setup of org.eclipse.sirius.tests.unit.common.migration.MigrationFromSirius1_0_0_M5Test.testMigration()
12:59:39 Setup of org.eclipse.sirius.tests.unit.diagram.migration.ComputedStyleDescriptionCachePackingFileMigrationParticipantTests.testMigrationIsNeededOnData()
12:59:39 Setup of org.eclipse.sirius.tests.unit.diagram.migration.ComputedStyleDescriptionCachePackingFileMigrationParticipantTests.testMigration()
12:59:39 Setup of org.eclipse.sirius.tests.unit.diagram.migration.RgbValuesEDataTypeMigrationTest.testMigrationIsNeededOnData()
12:59:40 Setup of org.eclipse.sirius.tests.unit.diagram.migration.RgbValuesEDataTypeMigrationTest.testRGBValuesToEDataTypeMigrationDone()
12:59:40 Setup of org.eclipse.sirius.tests.unit.diagram.migration.RgbValuesEDataTypeMigrationTest.testRGBValuesToEDataTypeMigrationDoneInPlugin()
12:59:40 Setup of org.eclipse.sirius.tests.unit.diagram.migration.NoteShapeDefaultLabelAlignmentMigrationTest.testMigrationIsNeededOnData()
12:59:40 Setup of org.eclipse.sirius.tests.unit.diagram.migration.NoteShapeDefaultLabelAlignmentMigrationTest.testNoteShapeAlignmentAfterMigration()
12:59:40 Setup of org.eclipse.sirius.tests.unit.diagram.migration.SnapBackDistantLabelsMigrationTest.testMigrationIsNeededOnData()
12:59:40 Setup of org.eclipse.sirius.tests.unit.diagram.migration.SnapBackDistantLabelsMigrationTest.testDiagramSizeAfterMigration()
12:59:40 Setup of org.eclipse.sirius.tests.unit.api.convert.ConvertViewpointModelingProjectToSiriusModelingProjectTest.testConvertOldViewpointModelingProject()
12:59:40 Setup of org.eclipse.sirius.tests.unit.diagram.migration.FontFormatMigrationTest.testFontFormatDescriptionAfterMigration()
12:59:40 Setup of org.eclipse.sirius.tests.unit.diagram.migration.FontFormatMigrationTest.testMigrationIsNeededOnData()
12:59:40 Setup of org.eclipse.sirius.tests.unit.diagram.migration.FontFormatMigrationTest.testFontFormatAfterMigration()
12:59:40 Setup of org.eclipse.sirius.tests.unit.diagram.migration.BorderSizeMigrationTest.testBorderSizeComputationExpressionMigrationDoneInPlugin()
12:59:40 Setup of org.eclipse.sirius.tests.unit.diagram.migration.BorderSizeMigrationTest.testBorderSizeComputationExpressionMigrationDone()
12:59:40 Setup of org.eclipse.sirius.tests.unit.diagram.migration.BorderSizeMigrationTest.testBorderSizeComputationExpressionMigrationNotDoneOn3_1_3_files()
12:59:40 Setup of org.eclipse.sirius.tests.unit.diagram.migration.BorderSizeMigrationTest.testBorderSizeMigrationDoneInPlugin()
12:59:40 Setup of org.eclipse.sirius.tests.unit.diagram.migration.BorderSizeMigrationTest.testAirdMigrationIsNeededOnData()
12:59:40 Setup of org.eclipse.sirius.tests.unit.diagram.migration.BorderSizeMigrationTest.testVsmMigrationIsNeededOnData()
12:59:40 Setup of org.eclipse.sirius.tests.unit.diagram.migration.BorderSizeMigrationTest.testBorderSizeMigrationDone()
12:59:40 Setup of org.eclipse.sirius.tests.unit.diagram.migration.BorderSizeMigrationTest.testBorderSizeComputationExpressionMigrationNotDoneOn3_1_0_files()
12:59:41 Setup of org.eclipse.sirius.tests.unit.common.migration.VariableMigrationTest.testFilterVariableValueToEObjectVariableValueMigration()
12:59:41 Setup of org.eclipse.sirius.tests.unit.common.migration.VariableMigrationTest.testRepMigrationIsNeededOnData()
12:59:41 Setup of org.eclipse.sirius.tests.unit.common.migration.VariableMigrationTest.testFilterVariableToSelectModelElementVariableMigration()
12:59:41 Setup of org.eclipse.sirius.tests.unit.common.migration.VariableMigrationTest.testVSMMigrationIsNeededOnData()
12:59:41 Setup of org.eclipse.sirius.tests.unit.common.migration.LabelEditToolVariableMigrationTest.testLabelEditToolVariableMigration()
12:59:41 Setup of org.eclipse.sirius.tests.unit.common.migration.LabelEditToolVariableMigrationTest.testVSMMigrationIsNeededOnData()
12:59:41 Setup of org.eclipse.sirius.tests.unit.diagram.migration.DRepresentationContainerRemovalMigrationTest.testMigrationIsNeededOnData()
12:59:41 Setup of org.eclipse.sirius.tests.unit.diagram.migration.DRepresentationContainerRemovalMigrationTest.testDRepresentationContainerRemovalMigrationDone()
12:59:41 Setup of org.eclipse.sirius.tests.unit.diagram.migration.NoteAttachmentMigrationTest.testMigrationIsNeededOnData()
12:59:41 Setup of org.eclipse.sirius.tests.unit.diagram.migration.NoteAttachmentMigrationTest.testNoteAttachmentCorrectlyRemoved2()
12:59:41 Setup of org.eclipse.sirius.tests.unit.diagram.migration.NoteAttachmentMigrationTest.testNoteAttachmentCorrectlyRemovedAndBendpointRepairing()
12:59:41 Setup of org.eclipse.sirius.tests.unit.diagram.migration.DRepInDViewToRootObjectsAndWithDRepDescRepPathMigrationTest.testMigrationIsNeededOnData()
12:59:41 Setup of org.eclipse.sirius.tests.unit.diagram.migration.DRepInDViewToRootObjectsAndWithDRepDescRepPathMigrationTest.testDRepresentationMoveToRootObjectsMigrationDone()
12:59:41 Setup of org.eclipse.sirius.tests.unit.diagram.migration.DecorationDescriptionImageExpressionMigrationTest.testMigrationIsNeededOnData()
12:59:41 Setup of org.eclipse.sirius.tests.unit.diagram.migration.DecorationDescriptionImageExpressionMigrationTest.testVSMMigrationInWorkspace()
12:59:41 Setup of org.eclipse.sirius.tests.unit.diagram.migration.DeleteMultipleConnectorStyleMigrationParticipantTest.testMigrationIsNeededOnData()
12:59:41 Setup of org.eclipse.sirius.tests.unit.diagram.migration.DeleteMultipleConnectorStyleMigrationParticipantTest.testConnectorStylesHaveBeenRemoved()
12:59:41 Setup of org.eclipse.sirius.tests.unit.diagram.migration.RepairGMFbendpointsMigrationParticipantTest.testMigrationIsNeededOnData()
12:59:41 Setup of org.eclipse.sirius.tests.unit.diagram.migration.RepairGMFbendpointsMigrationParticipantTest.testBendpointsHaveBeenRepaired()
12:59:41 Setup of org.eclipse.sirius.tests.unit.diagram.migration.TransientLayerMigrationTest.testMigrationIsNeededOnData()
12:59:41 Setup of org.eclipse.sirius.tests.unit.diagram.migration.TransientLayerMigrationTest.testDRepresentationContainerRemovalMigrationDone()
12:59:41 Setup of org.eclipse.sirius.tests.unit.diagram.migration.RepresentationLinkMigrationParticipantTest.testMigrationIsNeededOnData()
12:59:41 Setup of org.eclipse.sirius.tests.unit.diagram.migration.RepresentationLinkMigrationParticipantTest.testMigration()
12:59:41 Setup of org.eclipse.sirius.tests.unit.diagram.migration.TechnicalUidMigrationTest.testMigrationIsNeededOnData()
12:59:41 Setup of org.eclipse.sirius.tests.unit.diagram.migration.TechnicalUidMigrationTest.testTechnicalUidMigrationDone()
12:59:41 Setup of org.eclipse.sirius.tests.unit.diagram.migration.ViewWithNullElementMigrationParticipantTest.testMigrationIsNeededOnData()
12:59:41 Setup of org.eclipse.sirius.tests.unit.diagram.migration.ViewWithNullElementMigrationParticipantTest.testNoteAttachmentCorrectlyRemoved2()
12:59:41 Setup of org.eclipse.sirius.tests.unit.diagram.migration.ViewWithNullElementMigrationParticipantTest.testNoteAttachmentCorrectlyRemovedAndBendpointRepairing()
12:59:42 Setup of org.eclipse.sirius.tests.unit.common.migration.DiagramMigrationTestCampaign01.null()
12:59:42 Setup of org.eclipse.sirius.tests.unit.common.migration.DiagramMigrationTestCampaign01.null()
12:59:42 Setup of org.eclipse.sirius.tests.unit.common.migration.DiagramMigrationTestCampaign01.null()
12:59:42 Setup of org.eclipse.sirius.tests.unit.common.migration.DiagramMigrationTestCampaign01.null()
12:59:43 Setup of org.eclipse.sirius.tests.unit.common.migration.DiagramMigrationTestCampaign01.null()
12:59:43 Setup of org.eclipse.sirius.tests.unit.common.migration.DiagramMigrationTestCampaign01.null()
12:59:43 Setup of org.eclipse.sirius.tests.unit.common.migration.DiagramMigrationTestCampaign01.null()
12:59:44 Setup of org.eclipse.sirius.tests.unit.common.migration.DiagramMigrationTestCampaign01.null()
12:59:44 Setup of org.eclipse.sirius.tests.unit.common.migration.DiagramMigrationTestCampaign01.null()
12:59:44 Setup of org.eclipse.sirius.tests.unit.common.migration.DiagramMigrationTestCampaign01.null()
12:59:44 Setup of org.eclipse.sirius.tests.unit.common.migration.DiagramMigrationTestCampaign01.null()
12:59:45 Setup of org.eclipse.sirius.tests.unit.common.migration.DiagramMigrationTestCampaign02.null()
12:59:45 Setup of org.eclipse.sirius.tests.unit.common.migration.DiagramMigrationTestCampaign02.null()
12:59:45 Setup of org.eclipse.sirius.tests.unit.common.migration.DiagramMigrationTestCampaign02.null()
12:59:45 Setup of org.eclipse.sirius.tests.unit.common.migration.DiagramMigrationTestCampaign02.null()
12:59:45 Setup of org.eclipse.sirius.tests.unit.common.migration.DiagramMigrationTestCampaign02.null()
12:59:46 Setup of org.eclipse.sirius.tests.unit.common.migration.DiagramMigrationTestCampaign02.null()
12:59:46 Setup of org.eclipse.sirius.tests.unit.common.migration.DiagramMigrationTestCampaign02.null()
12:59:46 Setup of org.eclipse.sirius.tests.unit.common.migration.DiagramMigrationTestCampaign02.null()
12:59:46 Setup of org.eclipse.sirius.tests.unit.common.migration.DiagramMigrationTestCampaign02.null()
12:59:47 Setup of org.eclipse.sirius.tests.unit.common.migration.DiagramMigrationTestCampaign02.null()
12:59:47 Setup of org.eclipse.sirius.tests.unit.common.migration.DiagramMigrationTestCampaign02.null()
12:59:47 Setup of org.eclipse.sirius.tests.unit.common.migration.DiagramMigrationTestCampaign02.null()
12:59:47 Setup of org.eclipse.sirius.tests.unit.common.migration.DiagramMigrationTestCampaign02.null()
12:59:48 Setup of org.eclipse.sirius.tests.unit.common.migration.DiagramMigrationTestCampaign02.null()
12:59:48 Setup of org.eclipse.sirius.tests.unit.common.migration.DiagramMigrationTestCampaign02.null()
12:59:48 Setup of org.eclipse.sirius.tests.unit.common.migration.DiagramMigrationTestCampaign02.null()
12:59:48 Setup of org.eclipse.sirius.tests.unit.common.migration.DiagramMigrationTestCampaign02.null()
12:59:49 Setup of org.eclipse.sirius.tests.unit.common.migration.DiagramMigrationTestCampaign02.null()
12:59:49 Setup of org.eclipse.sirius.tests.unit.common.migration.DiagramMigrationTestCampaign02.null()
12:59:49 Setup of org.eclipse.sirius.tests.unit.common.migration.DiagramMigrationTestCampaign02.null()
12:59:49 Setup of org.eclipse.sirius.tests.unit.common.migration.DiagramMigrationTestCampaign02.null()
12:59:49 Setup of org.eclipse.sirius.tests.unit.common.migration.DiagramMigrationTestCampaign02.null()
12:59:50 Setup of org.eclipse.sirius.tests.unit.common.migration.DiagramMigrationTestCampaign02.null()
12:59:50 Setup of org.eclipse.sirius.tests.unit.common.migration.DiagramMigrationTestCampaign02.null()
12:59:51 Setup of org.eclipse.sirius.tests.unit.common.migration.DiagramMigrationTestCampaign02.null()
12:59:51 Setup of org.eclipse.sirius.tests.unit.common.migration.DiagramMigrationTestCampaign02.null()
12:59:52 Setup of org.eclipse.sirius.tests.unit.common.migration.DiagramMigrationTestCampaign03.null()
12:59:52 Setup of org.eclipse.sirius.tests.unit.common.migration.DiagramMigrationTestCampaign03.null()
12:59:52 Setup of org.eclipse.sirius.tests.unit.common.migration.DiagramMigrationTestCampaign03.null()
12:59:52 Setup of org.eclipse.sirius.tests.unit.common.migration.DiagramMigrationTestCampaign03.null()
12:59:52 Setup of org.eclipse.sirius.tests.unit.common.migration.DiagramMigrationTestCampaign03.null()
12:59:52 Setup of org.eclipse.sirius.tests.unit.common.migration.DiagramMigrationTestCampaign03.null()
12:59:53 Setup of org.eclipse.sirius.tests.unit.common.migration.DiagramMigrationTestCampaign03.null()
12:59:53 Setup of org.eclipse.sirius.tests.unit.common.migration.DiagramMigrationTestCampaign03.null()
12:59:53 Setup of org.eclipse.sirius.tests.unit.common.migration.DiagramMigrationTestCampaign03.null()
12:59:53 Setup of org.eclipse.sirius.tests.unit.common.migration.DiagramMigrationTestCampaign03.null()
12:59:53 Setup of org.eclipse.sirius.tests.unit.common.migration.DiagramMigrationTestCampaign03.null()
12:59:54 Setup of org.eclipse.sirius.tests.unit.common.migration.DiagramMigrationTestCampaign03.null()
12:59:54 Setup of org.eclipse.sirius.tests.unit.common.migration.DiagramMigrationTestCampaign04.null()
12:59:54 Setup of org.eclipse.sirius.tests.unit.common.migration.DiagramMigrationTestCampaign04.null()
12:59:54 Setup of org.eclipse.sirius.tests.unit.common.migration.DiagramMigrationTestCampaign04.null()
12:59:55 Setup of org.eclipse.sirius.tests.unit.common.migration.DiagramMigrationTestCampaign04.null()
12:59:55 Setup of org.eclipse.sirius.tests.unit.common.migration.DiagramMigrationTestCampaign04.null()
12:59:55 Setup of org.eclipse.sirius.tests.unit.common.migration.DiagramMigrationTestCampaign04.null()
12:59:55 Setup of org.eclipse.sirius.tests.unit.common.migration.DiagramMigrationTestCampaign04.null()
12:59:55 Setup of org.eclipse.sirius.tests.unit.common.migration.DiagramMigrationTestCampaign04.null()
12:59:55 Setup of org.eclipse.sirius.tests.unit.common.migration.DiagramMigrationTestCampaign04.null()
12:59:56 Setup of org.eclipse.sirius.tests.unit.common.migration.DiagramMigrationTestCampaign04.null()
12:59:56 Setup of org.eclipse.sirius.tests.unit.common.migration.DiagramMigrationTestCampaign05.null()
12:59:56 Setup of org.eclipse.sirius.tests.unit.common.migration.DiagramMigrationTestCampaign05.null()
12:59:56 Setup of org.eclipse.sirius.tests.unit.common.migration.DiagramMigrationTestCampaign05.null()
12:59:56 Setup of org.eclipse.sirius.tests.unit.common.migration.DiagramMigrationTestCampaign05.null()
12:59:56 Setup of org.eclipse.sirius.tests.unit.common.migration.DiagramMigrationTestCampaign05.null()
12:59:57 Setup of org.eclipse.sirius.tests.unit.common.migration.DiagramMigrationTestCampaign06.testAllDiagramElementPresentUnsynchroDiagram()
12:59:58 Setup of org.eclipse.sirius.tests.unit.common.migration.DiagramMigrationTestCampaign07.null()
12:59:58 Setup of org.eclipse.sirius.tests.unit.common.migration.DiagramMigrationTestCampaign07.null()
12:59:58 Setup of org.eclipse.sirius.tests.unit.common.migration.DiagramMigrationTestCampaign08.null()
12:59:58 Setup of org.eclipse.sirius.tests.unit.common.migration.DiagramMigrationTestCampaign08.null()
12:59:58 Setup of org.eclipse.sirius.tests.unit.common.migration.DiagramMigrationTestCampaign09.null()
12:59:59 Setup of org.eclipse.sirius.tests.unit.common.migration.DiagramMigrationTestCampaign09.null()
12:59:59 Setup of org.eclipse.sirius.tests.unit.common.migration.DiagramMigrationTestCampaign09.null()
12:59:59 Setup of org.eclipse.sirius.tests.unit.common.migration.DiagramMigrationTestCampaign09.null()
12:59:59 Setup of org.eclipse.sirius.tests.unit.common.migration.DiagramMigrationTestCampaign09.null()
12:59:59 Setup of org.eclipse.sirius.tests.unit.common.migration.DiagramMigrationTestCampaign09.null()
13:00:00 Setup of org.eclipse.sirius.tests.unit.common.migration.DiagramMigrationTestCampaign09.null()
13:00:00 Setup of org.eclipse.sirius.tests.unit.common.migration.DiagramMigrationTestCampaign09.null()
13:00:00 Setup of org.eclipse.sirius.tests.unit.common.migration.DiagramMigrationTestCampaign09.null()
13:00:00 Setup of org.eclipse.sirius.tests.unit.common.migration.DiagramMigrationTestCampaign09.null()
13:00:00 Setup of org.eclipse.sirius.tests.unit.common.migration.DiagramMigrationTestCampaign09.null()
13:00:01 Setup of org.eclipse.sirius.tests.unit.common.migration.DiagramMigrationTestCampaign09.null()
13:00:01 Setup of org.eclipse.sirius.tests.unit.common.migration.DiagramMigrationTestCampaign09.null()
13:00:01 Setup of org.eclipse.sirius.tests.unit.common.migration.DiagramMigrationTestCampaign09.null()
13:00:01 Setup of org.eclipse.sirius.tests.unit.common.migration.DiagramMigrationTestCampaign10.null()
13:00:02 Setup of org.eclipse.sirius.tests.unit.api.initialization.InitializationTest.testInitializationWith3Mappings()
13:00:02 Setup of org.eclipse.sirius.tests.unit.api.initialization.InitializationTest.testSimpleInitialization()
13:00:03 Setup of org.eclipse.sirius.tests.unit.api.interpreter.CompletionTests.testGetStructuralFeatures()
13:00:03 Setup of org.eclipse.sirius.tests.unit.api.interpreter.CompletionTests.testGetContainerVariableOnToolPrecondition()
13:00:03 Setup of org.eclipse.sirius.tests.unit.api.componentization.DiagramComponentizationManagerTest.testToolGroups()
13:00:03 Setup of org.eclipse.sirius.tests.unit.api.componentization.DiagramComponentizationManagerTest.testContributedLayers()
13:00:03 Setup of org.eclipse.sirius.tests.unit.api.componentization.DiagramComponentizationManagerTest.testLayers()
13:00:03 Setup of org.eclipse.sirius.tests.unit.api.componentization.DiagramComponentizationManagerTest.testSections()
13:00:03 Setup of org.eclipse.sirius.tests.unit.api.componentization.DiagramExtensionDescriptionTest.testOpeningDiagramWith2Extension()
13:00:04 Setup of org.eclipse.sirius.tests.unit.api.componentization.MetamodelSpecificationInRepresentationExtensionDescriptionTest.testDisplayMetamodelExtensionElements()
13:00:04 Setup of org.eclipse.sirius.tests.unit.api.componentization.MetamodelSpecificationInRepresentationExtensionDescriptionTest.testExtensionElementsPackageIsProvided()
13:00:04 Setup of org.eclipse.sirius.tests.unit.api.componentization.MetamodelSpecificationInRepresentationExtensionDescriptionTest.testCreateExtensionElements()
13:00:04 Setup of org.eclipse.sirius.tests.unit.api.dialect.DialectEditorCloserTest.testDialectEditorCloserOnDViewAdditionUndo()
13:00:04 Setup of org.eclipse.sirius.tests.unit.api.dialect.DialectUIManagerTest.testOpenEditor()
13:00:05 Setup of org.eclipse.sirius.tests.unit.api.dialect.DialectUIManagerTest.testCanHandleRepresentation()
13:00:05 Setup of org.eclipse.sirius.tests.unit.api.dialect.DialectUIManagerTest.testManagement()
13:00:05 Setup of org.eclipse.sirius.tests.unit.api.find.FindTest.testSearchEdges()
13:00:06 Setup of org.eclipse.sirius.tests.unit.api.find.FindTest.testSearchMiddle()
13:00:06 Setup of org.eclipse.sirius.tests.unit.api.find.FindTest.testSearchPrefix()
13:00:06 Setup of org.eclipse.sirius.tests.unit.api.find.FindTest.testSearchSuffix()
13:00:07 Setup of org.eclipse.sirius.tests.unit.api.routing.EdgeRoutingStyleTests.testTreeRoutingStyleIsAppliedDuringDiagramCreation()
13:00:08 Setup of org.eclipse.sirius.tests.unit.api.routing.EdgeRoutingStyleEdgeConditionalStyleTest.testTreeRoutingStyleIsAppliedWithConditionalStyle()
13:00:08 Setup of org.eclipse.sirius.tests.unit.api.routing.EdgeRoutingStyleEndUserOverrideTest.testCreateEdgeEnabledUserSpecificTree()
13:00:09 Setup of org.eclipse.sirius.tests.unit.api.routing.EdgeRoutingStyleEndUserOverrideTest.testCreateEdgeEnabledUserSpecificRectilinear()
13:00:09 Setup of org.eclipse.sirius.tests.unit.api.routing.EdgeRoutingStyleEndUserOverrideTest.testCreateEdgeEnabledUserSpecificOblic()
13:00:09 Setup of org.eclipse.sirius.tests.unit.api.session.DAnalysisSessionTests.testAcceleoRefreshRepresentations()
13:00:09 Setup of org.eclipse.sirius.tests.unit.api.session.DAnalysisSessionTests.testSaveSessionWithErrorDuringSave()
13:00:11 Setup of org.eclipse.sirius.tests.unit.api.session.DAnalysisSessionTests.testCreateSessionFromEcoreResource()
13:00:11 Setup of org.eclipse.sirius.tests.unit.api.session.DAnalysisSessionTests.testAddRemoveSpecialResourceDoesNotUnloadIt()
13:00:11 Setup of org.eclipse.sirius.tests.unit.api.session.DAnalysisSessionTests.testUnloadAnalysisResourceManageyBySession()
13:00:11 Setup of org.eclipse.sirius.tests.unit.api.session.DAnalysisSessionTests.testCreateViews()
13:00:12 Setup of org.eclipse.sirius.tests.unit.api.session.DAnalysisSessionTests.testAcceleoClassDiagramCreation()
13:00:12 Setup of org.eclipse.sirius.tests.unit.api.session.DAnalysisSessionTests.testOCLClassDiagramCreation()
13:00:12 Setup of org.eclipse.sirius.tests.unit.api.session.DAnalysisSessionTests.testOCLDiagramOpening()
13:00:12 Setup of org.eclipse.sirius.tests.unit.api.session.DAnalysisSessionTests.testCleanup()
13:00:13 Setup of org.eclipse.sirius.tests.unit.api.session.DAnalysisSessionTests.testOCLCloseEditors()
13:00:13 Setup of org.eclipse.sirius.tests.unit.api.session.DAnalysisSessionTests.testCreateWrongSession()
13:00:13 Setup of org.eclipse.sirius.tests.unit.api.session.DAnalysisSessionTests.testOpenSession()
13:00:13 Setup of org.eclipse.sirius.tests.unit.api.session.DAnalysisSessionTests.testSession()
13:00:13 Setup of org.eclipse.sirius.tests.unit.api.session.DAnalysisSessionTests.testOCLRefreshRepresentations()
13:00:13 Setup of org.eclipse.sirius.tests.unit.api.session.DAnalysisSessionTests.testAcceleoDiagramOpening()
13:00:14 Setup of org.eclipse.sirius.tests.unit.api.session.DAnalysisSessionTests.testWarmup()
13:00:14 Setup of org.eclipse.sirius.tests.unit.api.session.DAnalysisSessionTests.testWarmup()
13:00:14 Setup of org.eclipse.sirius.tests.unit.api.session.DAnalysisSessionTests.testSelectView()
13:00:14 Setup of org.eclipse.sirius.tests.unit.api.session.DAnalysisSessionTests.testAcceleoCloseEditors()
13:00:14 Setup of org.eclipse.sirius.tests.unit.api.session.SampleSessionTest.testDeleteSessionWithRepresentationOpened()
13:00:15 Setup of org.eclipse.sirius.tests.unit.api.session.SampleSessionTest.testOpenDiagram()
13:00:15 Setup of org.eclipse.sirius.tests.unit.api.session.SampleSessionTest.testOpenSession()
13:00:15 Setup of org.eclipse.sirius.tests.unit.api.session.SampleSessionTest.testSaveSessionInAnotherThreadThanUIThread()
13:00:15 Setup of org.eclipse.sirius.tests.unit.api.session.ResourceVersionMismatchTest.testMainAirdResourceVersionMismatch()
13:00:16 Setup of org.eclipse.sirius.tests.unit.api.session.ResourceVersionMismatchTest.testReferencedAirdResourceVersionMismatch()
13:00:16 Setup of org.eclipse.sirius.tests.unit.api.session.ResourceVersionMismatchTest.testVSMAndAirdResourceVersionMismatch()
13:00:16 Setup of org.eclipse.sirius.tests.unit.api.session.ResourceVersionMismatchTest.testVSMResourceVersionMismatch()
13:00:16 Setup of org.eclipse.sirius.tests.unit.api.session.ResourceVersionMismatchTest.testViewRegistryWithVSMResourceVersionMismatch()
13:00:16 Setup of org.eclipse.sirius.tests.unit.api.session.SiriusRegistryListener2Tests.testVSMFileCreation()
13:00:16 Setup of org.eclipse.sirius.tests.unit.api.session.SiriusRegistryListener2Tests.testVSMFileCreationFollowedByANotVSMFileCreation()
13:00:17 Setup of org.eclipse.sirius.tests.unit.api.session.SiriusRegistryListener2Tests.testNotVSMFileCreation()
13:00:17 Setup of org.eclipse.sirius.tests.unit.api.session.SiriusRegistryListener2Tests.testMultipleVSMFileCreation()
13:00:17 Setup of org.eclipse.sirius.tests.unit.api.session.SessionSemanticResourceTests.testTransitiveSemanticResourceAdditionWithLoop()
13:00:17 Setup of org.eclipse.sirius.tests.unit.api.session.SessionSemanticResourceTests.testTransitiveSemanticResourceRemovalAfterGraphResourceDependenciesRemoval()
13:00:17 Setup of org.eclipse.sirius.tests.unit.api.session.SessionSemanticResourceTests.testTransitiveSemanticResourceAddition()
13:00:17 Setup of org.eclipse.sirius.tests.unit.api.session.SessionSemanticResourceTests.testTransitiveSemanticResourceRemovalAfterGraphResourceDependenciesAddition()
13:00:17 Setup of org.eclipse.sirius.tests.unit.api.session.SessionSemanticResourceTests.testTransitiveSemanticResourceRemovalWithLoop()
13:00:17 Setup of org.eclipse.sirius.tests.unit.api.session.SessionSemanticResourceTests.testSimpleSemanticResourceRemoval()
13:00:17 Setup of org.eclipse.sirius.tests.unit.api.session.SessionSemanticResourceTests.testReferencedAnalysisAddition()
13:00:17 Setup of org.eclipse.sirius.tests.unit.api.session.SessionSemanticResourceTests.testSimpleSemanticResourceAddition()
13:00:17 Setup of org.eclipse.sirius.tests.unit.api.session.SessionSemanticResourceTests.testTransitiveSemanticResourceRemoval()
13:00:17 Setup of org.eclipse.sirius.tests.unit.api.session.SessionServiceTest.testPutCustomData()
13:00:18 Setup of org.eclipse.sirius.tests.unit.api.session.SessionServiceTest.testGetCustomData()
13:00:18 Setup of org.eclipse.sirius.tests.unit.api.session.SessionServiceTest.testClearGMFData()
13:00:18 Setup of org.eclipse.sirius.tests.unit.api.editors.EditorNameAdapterTests.testRegister()
13:00:18 Setup of org.eclipse.sirius.tests.unit.api.editors.EditorNameAdapterTests.testRename()
13:00:19 Setup of org.eclipse.sirius.tests.unit.api.editors.EditorVariousTests.testNoNpeWhenGetShowInContext()
13:00:19 Setup of org.eclipse.sirius.tests.unit.api.editors.EntitiesSpecificEditorTests.testOpen()
13:00:20 Setup of org.eclipse.sirius.tests.unit.api.editors.EntitiesSpecificEditorTests.testSessionisCreated()
13:00:20 Setup of org.eclipse.sirius.tests.unit.api.editors.EntitiesSpecificEditorTests.testDiagramContentSucced()
13:00:20 Setup of org.eclipse.sirius.tests.unit.api.editors.EntitiesSpecificEditorTests.testIsDirtyWhenDiagramResourceChange()
13:00:21 Setup of org.eclipse.sirius.tests.unit.api.editors.traceability.GoToMarkerTests.testElementIsInCurrentOpenedEditorWithCrossTableEditor()
13:00:21 Setup of org.eclipse.sirius.tests.unit.api.editors.traceability.GoToMarkerTests.testElementIsInCurrentOpenedEditorWithTableEditor()
13:00:22 Setup of org.eclipse.sirius.tests.unit.api.editors.traceability.GoToMarkerTests.testElementIsInOneOfOpenedEditorWithDiagramEditor()
13:00:22 Setup of org.eclipse.sirius.tests.unit.api.editors.traceability.GoToMarkerTests.testElementIsInCurrentOpenedEditorWithDiagramEditor()
13:00:22 Setup of org.eclipse.sirius.tests.unit.api.editors.traceability.GoToMarkerTests.testElementIsInOneOfOpenedEditorWithTableEditor()
13:00:23 Setup of org.eclipse.sirius.tests.unit.api.editors.traceability.GoToMarkerTests.testOneMatchInNotOpenedRepresentationsWithTreeEditor()
13:00:23 Setup of org.eclipse.sirius.tests.unit.api.editors.traceability.GoToMarkerTests.testOneMatchInNotOpenedRepresentationsWithTableEditor()
13:00:23 Setup of org.eclipse.sirius.tests.unit.api.editors.traceability.GoToMarkerTests.testElementIsInOneOfOpenedEditorWithCrossTableEditor()
13:00:24 Setup of org.eclipse.sirius.tests.unit.api.editors.traceability.GoToMarkerTests.testElementIsInOneOfOpenedEditorWithTreeEditor()
13:00:24 Setup of org.eclipse.sirius.tests.unit.api.editors.traceability.GoToMarkerTests.testOneMatchInNotOpenedRepresentationsWithDiagramEditor()
13:00:25 Setup of org.eclipse.sirius.tests.unit.api.editors.traceability.GoToMarkerTests.testElementIsInCurrentOpenedEditorWithTreeEditor()
13:00:25 Setup of org.eclipse.sirius.tests.unit.api.editors.traceability.GoToMarkerTests.testOneMatchInNotOpenedRepresentationsWithCrossTableEditor()
13:00:25 Setup of org.eclipse.sirius.tests.unit.api.editors.WorkspaceEPackageRegistryTests.testWorkspaceEPackageRegistryWithTwoSameEPackageNSURIInDifferentEcoreResource()
13:00:25 Setup of org.eclipse.sirius.tests.unit.api.editors.WorkspaceEPackageRegistryTests.testWorkspaceEPackageRegistryWithNullEPackageNSURI()
13:00:25 Setup of org.eclipse.sirius.tests.unit.api.editors.WorkspaceEPackageRegistryTests.testWorkspaceEPackageRegistryWithTwoSameEPackageNSURIInSameEcoreResource()
13:00:25 Setup of org.eclipse.sirius.tests.unit.api.editors.WorkspaceEPackageRegistryTests.testWorkspaceEPackageRegistryWithNullEClassName()
13:00:25 Setup of org.eclipse.sirius.tests.unit.api.resource.WorkspaceDragAndDropSupportTests.testRetrieveSessionFromFolder()
13:00:26 Setup of org.eclipse.sirius.tests.unit.api.resource.WorkspaceDragAndDropSupportTests.testRetrieveSessionFromModelFile()
13:00:26 Setup of org.eclipse.sirius.tests.unit.api.resource.WorkspaceDragAndDropSupportTests.testRetrieveSessionFromNonModelFile()
13:00:26 Setup of org.eclipse.sirius.tests.unit.api.resource.WorkspaceDragAndDropSupportTests.testCreateDFile()
13:00:26 Setup of org.eclipse.sirius.tests.unit.api.resource.WorkspaceDragAndDropSupportTests.testRetrieveSessionFromProject()
13:00:26 Setup of org.eclipse.sirius.tests.unit.api.resource.WorkspaceDragAndDropSupportTests.testCreateDProject()
13:00:26 Setup of org.eclipse.sirius.tests.unit.api.resource.WorkspaceDragAndDropSupportTests.testCreateDResourceHierarchy()
13:00:27 Setup of org.eclipse.sirius.tests.unit.api.resource.WorkspaceDragAndDropSupportTests.testCreateDFolder()
13:00:27 Setup of org.eclipse.sirius.tests.unit.api.resource.WorkspaceDragAndDropSupportTests.testCreateModelFile()
13:00:27 Setup of org.eclipse.sirius.tests.unit.api.resource.WorkspaceDragAndDropSupportTests.testRetrieveWorspaceFileFromNonModelFile()
13:00:27 Setup of org.eclipse.sirius.tests.unit.api.resource.WorkspaceDragAndDropSupportTests.testRetrieveWorspaceFileFromModelFile()
13:00:27 Setup of org.eclipse.sirius.tests.unit.api.modelingproject.SemanticResourcesManagementTests.testRemoveAndAddSameSemanticResource()
13:00:30 Setup of org.eclipse.sirius.tests.unit.api.modelingproject.SemanticResourcesManagementTests.testAddASemanticResource()
13:00:31 Setup of org.eclipse.sirius.tests.unit.api.modelingproject.SaveWhenNoEditorsTests.testRenameWithoutEditors()
13:00:31 Setup of org.eclipse.sirius.tests.unit.api.modelingproject.SaveWhenNoEditorsTests.testOpenEditor()
13:00:32 Setup of org.eclipse.sirius.tests.unit.api.modelingproject.SaveWhenNoEditorsTests.testRenameProjectWithEditor()
13:00:34 Setup of org.eclipse.sirius.tests.unit.api.modelingproject.SaveWhenNoEditorsTests.testRenameProjectWithoutEditor()
13:00:34 Setup of org.eclipse.sirius.tests.unit.api.modelingproject.SaveWhenNoEditorsTests.testRenameWithEditor()
13:00:35 Setup of org.eclipse.sirius.tests.unit.api.refresh.ModifyHeaderLabelExpressionTest.testModificationOfHeaderLabelExpression()
13:00:37 Setup of org.eclipse.sirius.tests.unit.common.interpreter.CreateCellToolInterpreterTest.testEditMaskVariable()
13:00:39 Setup of org.eclipse.sirius.tests.unit.api.interpreter.crossReferencer.AcceleoCrossReferencerTest.testAcceleoCrossReferencer()
13:00:39 Setup of org.eclipse.sirius.tests.unit.common.interpreter.acceleo.mtl.IInterpreterValidationExpressionTest.testValidationExpressionWithAcceleo3OnNodeMappings()
13:00:43 Setup of org.eclipse.sirius.tests.unit.common.interpreter.acceleo.mtl.IInterpreterValidationExpressionTest.testValidationExpressionWithAcceleo3OnSequenceDiagramInstanceRole()
13:00:45 Setup of org.eclipse.sirius.tests.unit.common.interpreter.acceleo.mtl.IInterpreterValidationExpressionTest.testValidationExpressionWithAcceleo3OnConditionalStyle()
13:00:45 Setup of org.eclipse.sirius.tests.unit.common.interpreter.acceleo.mtl.IInterpreterValidationExpressionTest.testValidationExpressionWithAcceleo3OnTreeItemConditionalStyle()
13:00:46 Setup of org.eclipse.sirius.tests.unit.common.interpreter.acceleo.mtl.IInterpreterValidationExpressionTest.testValidationExpressionWithAcceleo3OnLineForegroundConditionalStyle()
13:00:46 Setup of org.eclipse.sirius.tests.unit.common.interpreter.acceleo.mtl.IInterpreterValidationExpressionTest.testValidationExpressionWithAcceleo3OnTreeItemMapping()
13:00:46 Setup of org.eclipse.sirius.tests.unit.common.interpreter.acceleo.mtl.IInterpreterValidationExpressionTest.testValidationExpressionWithAcceleo3OnGoToInsideCreateTool()
13:00:47 Setup of org.eclipse.sirius.tests.unit.common.interpreter.acceleo.mtl.IInterpreterValidationExpressionTest.testValidationExpressionWithAcceleo3AndVariables()
13:00:47 Setup of org.eclipse.sirius.tests.unit.common.interpreter.acceleo.mtl.IInterpreterValidationExpressionTest.testValidationExpressionWithTool()
13:00:48 Setup of org.eclipse.sirius.tests.unit.common.interpreter.acceleo.mtl.IInterpreterValidationExpressionTest.testValidationExpressionWithAcceleo3OnNodeMappingsWithinvalidFeatureDomainClass()
13:00:51 Setup of org.eclipse.sirius.tests.unit.common.interpreter.acceleo.mtl.IInterpreterValidationExpressionTest.testValidationExpressionWithAcceleo3OnLineMapping()
13:00:51 Setup of org.eclipse.sirius.tests.unit.common.interpreter.acceleo.mtl.IInterpreterValidationExpressionTest.testValidationExpressionWithAcceleo3OnAudits()
13:00:52 Setup of org.eclipse.sirius.tests.unit.common.interpreter.acceleo.mtl.IInterpreterValidationExpressionTest.testValidationExpressionWithAcceleo3OnSequenceDiagramExecution()
13:00:52 Setup of org.eclipse.sirius.tests.unit.common.interpreter.acceleo.mtl.IInterpreterValidationExpressionTest.testValidationExpressionWithAcceleo3OnSequenceDiagramMessageEnd()
13:00:54 Setup of org.eclipse.sirius.tests.unit.common.interpreter.acceleo.mtl.IInterpreterValidationExpressionTest.testAValidationExpressionWithAQL()
13:00:55 Setup of org.eclipse.sirius.tests.unit.common.interpreter.acceleo.mtl.IInterpreterValidationExpressionTest.testValidationExpressionWithAcceleo3OnRelationBasedEdgeMapping()
13:01:00 Setup of org.eclipse.sirius.tests.unit.common.interpreter.acceleo.mtl.IInterpreterValidationExpressionTest.testValidationExpressionWithAcceleo3OnFeatureColumnMapping()
13:01:00 Setup of org.eclipse.sirius.tests.unit.common.interpreter.acceleo.mtl.IInterpreterValidationExpressionTest.testValidationExpressionWithAcceleo3SetValueInsideGoto()
13:01:01 Setup of org.eclipse.sirius.tests.unit.common.interpreter.service.ServiceInterpreterTests.testServiceInterpreterEvaluationWithSpecificServiceExpression()
13:01:01 Setup of org.eclipse.sirius.tests.unit.common.interpreter.service.ServiceInterpreterTests.testAddImportWithPathOfMtlFile()
13:01:01 Setup of org.eclipse.sirius.tests.unit.common.interpreter.service.ServiceInterpreterTests.testServiceInterpreterEvaluationWithSpecificServiceExpressionOnSelf()
13:01:01 Setup of org.eclipse.sirius.tests.unit.common.interpreter.service.ServiceInterpreterTests.testServiceInterpreterEvaluationWithSpecificServiceExpressionHavingOneParameterWithSpaceAtEnd()
13:01:01 Setup of org.eclipse.sirius.tests.unit.common.interpreter.service.ServiceInterpreterTests.testServiceInterpreterEvaluationWithNullExpression()
13:01:01 Setup of org.eclipse.sirius.tests.unit.common.interpreter.service.ServiceInterpreterTests.testServiceInterpreterEvaluationWithSpecificServiceExpressionWithSpaceAtEnd()
13:01:01 Setup of org.eclipse.sirius.tests.unit.common.interpreter.service.ServiceInterpreterTests.testServiceInterpreterEvaluationWithEmptyExpression()
13:01:01 Setup of org.eclipse.sirius.tests.unit.common.interpreter.service.ServiceInterpreterTests.testAddImportWithInvalidPathContainintPoint()
13:01:01 Setup of org.eclipse.sirius.tests.unit.common.interpreter.service.ServiceInterpreterTests.testServiceInterpreterEvaluationWithNullTargetAndEmptyExpression()
13:01:01 Setup of org.eclipse.sirius.tests.unit.common.interpreter.service.ServiceInterpreterTests.testServiceInterpreterEvaluationAfterVariableModifiations()
13:01:01 Setup of org.eclipse.sirius.tests.unit.common.interpreter.service.ServiceInterpreterTests.testServiceInterpreterEvaluationWithSpecificServiceExpressionOnVariable()
13:01:01 Setup of org.eclipse.sirius.tests.unit.common.interpreter.service.ServiceInterpreterTests.testServiceInterpreterEvaluationWithSpecificServiceExpressionHavingOneParameter()
13:01:01 Setup of org.eclipse.sirius.tests.unit.common.interpreter.service.ServiceInterpreterTests.testServiceInterpreterEvaluationWithSpecificServiceExpressionHavingOneParameterAndSpecificReceiverEObject()
13:01:01 Setup of org.eclipse.sirius.tests.unit.common.interpreter.service.ServiceInterpreterTests.testServiceInterpreterEvaluationWithIncorretServiceExpression()
13:01:01 Setup of org.eclipse.sirius.tests.unit.common.interpreter.service.ServiceInterpreterTests.testServiceInterpreterEvaluationWithNullParameters()
13:01:01 Setup of org.eclipse.sirius.tests.unit.common.interpreter.service.ServiceInterpreterTests.testServiceInterpreterEvaluationWithSpecificServiceExpressionHavingOneParameterAndSpecificReceiverNotEObject()
13:01:01 Setup of org.eclipse.sirius.tests.unit.common.interpreter.acceleo.mtl.InterpretedExpressionTargetSwitchTest.testInterpretedExpressionTargetOnGroup()
13:01:01 Setup of org.eclipse.sirius.tests.unit.common.interpreter.acceleo.mtl.InterpretedExpressionTargetSwitchTest.testInterpretedExpressionTargetOnTable()
13:01:01 Setup of org.eclipse.sirius.tests.unit.common.interpreter.acceleo.mtl.InterpretedExpressionTargetSwitchTest.testInterpretedExpressionTargetOnTree()
13:01:01 Setup of org.eclipse.sirius.tests.unit.api.session.ReloadSessionTest.testModifyFragmentSessionFromInternalTextEditor()
13:01:01 Setup of org.eclipse.sirius.tests.unit.api.session.ReloadSessionTest.testModifyFragmentSessionFromExternalTextEditor()
13:01:02 Setup of org.eclipse.sirius.tests.unit.common.EclipseUtilTest.testGetSuffixedFilesFromWorkspace()
13:01:02 Setup of org.eclipse.sirius.tests.unit.common.EclipseUtilTest.testGetPrefixedFilesFromWorkspace()
13:01:02 Setup of org.eclipse.sirius.tests.unit.common.EclipseUtilTest.testGetAllFilesFromWorkspace()
13:01:02 Setup of org.eclipse.sirius.tests.unit.common.EclipseUtilTest.testGetPrefixedSuffixedFilesFromWorkspace()
13:01:02 Setup of org.eclipse.sirius.tests.unit.common.TooltipProviderTests.testTooltipOnCrossTableDialect()
13:01:02 Setup of org.eclipse.sirius.tests.unit.common.TooltipProviderTests.testTooltipOnTreeDialect()
13:01:02 Setup of org.eclipse.sirius.tests.unit.common.TooltipProviderTests.testTooltipOnDiagramDialect()
13:01:03 Setup of org.eclipse.sirius.tests.unit.common.TooltipProviderTests.testTooltipOnTableEditionDialect()
13:01:03 Setup of org.eclipse.sirius.tests.unit.common.TransientSessionTests.testDiagramWithTransientSession()
13:01:03 Setup of org.eclipse.sirius.tests.unit.common.TransientSessionTests.testTableWithTransientSession()
13:01:03 Setup of org.eclipse.sirius.tests.unit.common.TransientSessionTests.testDiagramAndTableWithTransientSession()
13:01:04 Setup of org.eclipse.sirius.tests.unit.common.RestoreSessionFromEditorInputTests.testRestoreSessionFromHistoryWithClosedSession()
13:01:04 Setup of org.eclipse.sirius.tests.unit.common.RestoreSessionFromEditorInputTests.testRestoreSessionFromHistory()
13:01:04 Setup of org.eclipse.sirius.tests.unit.common.SiriusCrossReferenceAdapterTests.testDisablingCrossReferencerWhileDeletingResource()
13:01:04 Setup of org.eclipse.sirius.tests.unit.common.SiriusCrossReferenceAdapterTests.testNoAdapterRemovalAfterLateRemoveNotificationReception()
13:01:04 Setup of org.eclipse.sirius.tests.unit.common.SiriusCrossReferenceAdapterTests.testDisablingCrossReferencerWhileReloadingResource()
13:01:04 Setup of org.eclipse.sirius.tests.unit.api.semantic.XSDSemanticResourceTests.testSemanticResourceAdditionInNonModelingProject()
13:01:04 Setup of org.eclipse.sirius.tests.unit.api.semantic.XSDSemanticResourceTests.testSemanticResourceDetectionInModelingProject()
13:01:05 Setup of org.eclipse.sirius.tests.unit.api.semantic.XSDSemanticResourceTests.testAirResourceAddition()
13:01:05 Setup of org.eclipse.sirius.tests.unit.common.migration.ModelsToSemanticResourcesMigrationTest.testMigrationIsNeededOnData()
13:01:05 Setup of org.eclipse.sirius.tests.unit.common.migration.ModelsToSemanticResourcesMigrationTest.testModelsToSemanticResourcesMigration()
13:01:05 Setup of org.eclipse.sirius.tests.unit.common.migration.ModelsToSemanticResourcesMigrationTest.testModelsToSemanticResourcesMigrationForNonResolvableModel()
13:01:05 Setup of org.eclipse.sirius.tests.unit.api.resource.SemanticResourceURIInAirdTests.testSemanticResourcesTagInAird()
13:01:05 Setup of org.eclipse.sirius.tests.unit.api.resource.ResourceStrategyTests.testProvidedResourceStrategy()
13:01:05 Setup of org.eclipse.sirius.tests.unit.api.resource.ResourceStrategyTests.testResourceStrategyWithControlledResource()
13:01:05 Setup of org.eclipse.sirius.tests.unit.api.resource.ResourceStrategyTests.testOptimizedResourceStrategyIsNotUsed()
13:01:05 Setup of org.eclipse.sirius.tests.unit.api.resource.ResourceStrategyTests.testResourceReleasingAtSessionClosure()
13:01:06 Setup of org.eclipse.sirius.tests.unit.api.resource.ResourceStrategyTests.testResourcestrategyExtensionPoint()
13:01:06 Setup of org.eclipse.sirius.tests.unit.api.resource.ResourceStrategyForUmlTests.testDefaultOptimizedResourceStrategy()
13:01:06 Setup of org.eclipse.sirius.tests.unit.api.session.OpenSessionTest.testResourceLoadingAtOpenSession()
13:01:06 Setup of org.eclipse.sirius.tests.unit.api.session.ModelAccessorLifecycleTest.testPermissionAfterEnablingFirstViewpoint()
13:01:06 Setup of org.eclipse.sirius.tests.unit.api.session.ModelAccessorLifecycleTest.testPermissionAuthorityAfterCreatingAnotherSession()
13:01:06 Setup of org.eclipse.sirius.tests.unit.api.representation.DRepresentationLocationManagerTest.testDRepresentationLocationManagerWithSplitDeactivated()
13:01:06 Setup of org.eclipse.sirius.tests.unit.api.representation.DRepresentationLocationManagerTest.testDRepresentationLocationManagerWithSplitActivated()
13:01:06 Setup of org.eclipse.sirius.tests.unit.api.representation.DRepresentationLocationManagerTest.testDRepresentationLocationManagerIntegration()
13:01:06 Setup of org.eclipse.sirius.tests.unit.api.representation.InvalidRepresentationTest.testInvalidRepresentationWithNonSplitRep()
13:01:07 Setup of org.eclipse.sirius.tests.unit.api.representation.InvalidRepresentationTest.testInvalidRepresentationWithSplitRep()
13:01:07 Setup of org.eclipse.sirius.tests.unit.common.ZombieViewpointsTest.testViewpointRemovedFromWorkspaceDoNotReappear()
13:01:07 Setup of org.eclipse.sirius.tests.unit.api.mm.DAnnotationTest.testDAnnotationOnDRepDesc()
13:01:07 Setup of org.eclipse.sirius.tests.unit.airdeditor.PageOrdererTest.testMultiPageOrderingBeforeConflict()
13:01:07 Setup of org.eclipse.sirius.tests.unit.airdeditor.PageOrdererTest.testMultiPageOrderingNoPositioningAndBefore()
13:01:07 Setup of org.eclipse.sirius.tests.unit.airdeditor.PageOrdererTest.testMultiPageOrderingBefore()
13:01:07 Setup of org.eclipse.sirius.tests.unit.airdeditor.PageOrdererTest.testMultiPageOrderingBeforeConflict2()
13:01:07 Setup of org.eclipse.sirius.tests.unit.airdeditor.PageOrdererTest.testMultiPageOrderingReplaceConflict()
13:01:07 Setup of org.eclipse.sirius.tests.unit.airdeditor.PageOrdererTest.testMultiPageOrderingReplaceConflict2()
13:01:07 Setup of org.eclipse.sirius.tests.unit.airdeditor.PageOrdererTest.testPageOrderingReplaceMissingPage()
13:01:07 Setup of org.eclipse.sirius.tests.unit.airdeditor.PageOrdererTest.testMultiPageOrderingConflict()
13:01:07 Setup of org.eclipse.sirius.tests.unit.airdeditor.PageOrdererTest.testMultiPageOrderingReplace()
13:01:07 Setup of org.eclipse.sirius.tests.unit.airdeditor.PageOrdererTest.testPageOrderingBefore()
13:01:07 Setup of org.eclipse.sirius.tests.unit.airdeditor.PageOrdererTest.testPageOrderingBeforeMissingPage()
13:01:07 Setup of org.eclipse.sirius.tests.unit.airdeditor.PageOrdererTest.testMultiPageOrderingAfterConflict2()
13:01:07 Setup of org.eclipse.sirius.tests.unit.airdeditor.PageOrdererTest.testPageOrderingReplacement()
13:01:07 Setup of org.eclipse.sirius.tests.unit.airdeditor.PageOrdererTest.testMultiPageOrderingClustering2()
13:01:07 Setup of org.eclipse.sirius.tests.unit.airdeditor.PageOrdererTest.testPageOrderingAfter()
13:01:07 Setup of org.eclipse.sirius.tests.unit.airdeditor.PageOrdererTest.testMultiPageOrderingAfter()
13:01:07 Setup of org.eclipse.sirius.tests.unit.airdeditor.PageOrdererTest.testPageOrderingAfterMissingPage()
13:01:07 Setup of org.eclipse.sirius.tests.unit.airdeditor.PageOrdererTest.testPageOrderingNoPositioning()
13:01:07 Setup of org.eclipse.sirius.tests.unit.airdeditor.PageOrdererTest.testMultiPageOrderingAfterFirstPage()
13:01:07 Setup of org.eclipse.sirius.tests.unit.airdeditor.PageOrdererTest.testMultiPageOrderingClustering()
13:01:07 Setup of org.eclipse.sirius.tests.unit.airdeditor.PageOrdererTest.testMultiPageOrderingNoPositioning()
13:01:07 Setup of org.eclipse.sirius.tests.unit.airdeditor.PageOrdererTest.testMultiPageOrderingAfterConflict()
13:01:07 Setup of org.eclipse.sirius.tests.unit.api.modelingproject.ModelingProjectDetectionTest.test_modeling_project_with_multiple_aird_and_no_viewpoints()
13:01:07 Setup of org.eclipse.sirius.tests.unit.table.unit.refresh.DTableSynchronizerTest.testSemanticElementsInEditionTable()
13:01:07 Setup of org.eclipse.sirius.tests.unit.table.unit.refresh.DTableSynchronizerTest.testSimpleEditionTable()
13:01:08 Setup of org.eclipse.sirius.tests.unit.table.unit.refresh.DTableSynchronizerTest.testCrossClassBackgroundColors()
13:01:08 Setup of org.eclipse.sirius.tests.unit.table.unit.refresh.DTableSynchronizerTest.testStyleRefreshCrossTable()
13:01:08 Setup of org.eclipse.sirius.tests.unit.table.unit.refresh.DTableSynchronizerTest.testCrossClassWithAssociations()
13:01:08 Setup of org.eclipse.sirius.tests.unit.table.unit.refresh.DTableSynchronizerTest.testCrossClassForegroundColors()
13:01:09 Setup of org.eclipse.sirius.tests.unit.table.unit.refresh.DTableSynchronizerTest.testStyleRefreshEditionTable()
13:01:09 Setup of org.eclipse.sirius.tests.unit.table.unit.refresh.DTableSynchronizerTest.testVariablesForCellInCrossTable()
13:01:09 Setup of org.eclipse.sirius.tests.unit.table.unit.refresh.DTableSynchronizerTest.testPreconditionInIntersectionMappingDomainBased()
13:01:09 Setup of org.eclipse.sirius.tests.unit.table.unit.refresh.DTableSynchronizerTest.testCrossClassWithGeneralization()
13:01:10 Setup of org.eclipse.sirius.tests.unit.table.unit.refresh.DTableSynchronizerTest.testVariablesForCellInSimpleTable()
13:01:10 Setup of org.eclipse.sirius.tests.unit.table.unit.refresh.DTableSynchronizerTest.testPreconditionInIntersectionMappingNoDomainBased()
13:01:10 Setup of org.eclipse.sirius.tests.unit.table.unit.refresh.DTableSynchronizerTest.testVirtualFeatureColumns()
13:01:10 Setup of org.eclipse.sirius.tests.unit.table.unit.refresh.DTableSynchronizerTest.testSemanticElementsInCrossTable()
13:01:11 Setup of org.eclipse.sirius.tests.unit.table.unit.refresh.DTableSynchronizerWithEditorTest.testSimpleEditionTable()
13:01:11 Setup of org.eclipse.sirius.tests.unit.table.unit.refresh.DTableSynchronizerWithEditorTest.testCrossClassBackgroundColors()
13:01:11 Setup of org.eclipse.sirius.tests.unit.table.unit.refresh.DTableSynchronizerWithEditorTest.testAddSemanticLineInSimpleEditionTable()
13:01:12 Setup of org.eclipse.sirius.tests.unit.table.unit.refresh.DTableSynchronizerWithEditorTest.testCrossClassWithAssociations()
13:01:12 Setup of org.eclipse.sirius.tests.unit.table.unit.refresh.DTableSynchronizerWithEditorTest.testCrossClassForegroundColors()
13:01:12 Setup of org.eclipse.sirius.tests.unit.table.unit.refresh.DTableSynchronizerWithEditorTest.testVariablesForCellInCrossTable()
13:01:12 Setup of org.eclipse.sirius.tests.unit.table.unit.refresh.DTableSynchronizerWithEditorTest.testAddSemanticElementInCrossTableFromOtherDiagram()
13:01:13 Setup of org.eclipse.sirius.tests.unit.table.unit.refresh.DTableSynchronizerWithEditorTest.testCrossClassWithGeneralization()
13:01:13 Setup of org.eclipse.sirius.tests.unit.table.unit.refresh.DTableSynchronizerWithEditorTest.testVariablesForFeatureParentExpressionInSimpleTable()
13:01:14 Setup of org.eclipse.sirius.tests.unit.table.unit.refresh.DTableSynchronizerWithEditorTest.testDeleteSemanticElementsInCrossTableFromOtherDiagramInAutoRefreshMode()
13:01:14 Setup of org.eclipse.sirius.tests.unit.table.unit.refresh.DTableSynchronizerWithEditorTest.testAddSemanticElementInSimpleEditionTableFromOtherDiagram()
13:01:15 Setup of org.eclipse.sirius.tests.unit.table.unit.refresh.DTableSynchronizerWithEditorTest.testDeleteSemanticElementsInSimpleEditionTableFromOtherDiagram()
13:01:15 Setup of org.eclipse.sirius.tests.unit.table.unit.refresh.DTableSynchronizerWithEditorTest.testDeleteSemanticElementsInCrossTableFromOtherDiagram()
13:01:16 Setup of org.eclipse.sirius.tests.unit.table.unit.refresh.DTableCellStylesTest.testFeatureColumnForegroundFontStyle()
13:01:16 Setup of org.eclipse.sirius.tests.unit.table.unit.refresh.DTableCellStylesTest.testFeatureColumnBackgroundStyle()
13:01:16 Setup of org.eclipse.sirius.tests.unit.table.unit.refresh.DTableCellStylesTest.testFeatureColumnForegroundSizeStyle()
13:01:17 Setup of org.eclipse.sirius.tests.unit.table.unit.refresh.DTableCellStylesTest.testFeatureColumnForegroundColorStyle()
13:01:17 Setup of org.eclipse.sirius.tests.unit.table.unit.sort.DTableSortByColumnTest.testNormalSort()
13:01:17 Setup of org.eclipse.sirius.tests.unit.table.unit.sort.DTableSortByColumnTest.testDescendingSortOnNameColumn()
13:01:17 Setup of org.eclipse.sirius.tests.unit.table.unit.sort.DTableSortByColumnTest.testAscendingSortOnNameColumn()
13:01:17 Setup of org.eclipse.sirius.tests.unit.table.unit.sort.DTableSortByColumnTestWithEditor.testNormalSort()
13:01:18 Setup of org.eclipse.sirius.tests.unit.table.unit.sort.DTableSortByColumnTestWithEditor.testDescendingSortOnNameColumn()
13:01:18 Setup of org.eclipse.sirius.tests.unit.table.unit.sort.DTableSortByColumnTestWithEditor.testAscendingSortOnNameColumn()
13:01:18 Setup of org.eclipse.sirius.tests.unit.table.unit.sort.DTableSortByLineTest.testNormalSort()
13:01:19 Setup of org.eclipse.sirius.tests.unit.table.unit.sort.DTableSortByLineTest.testAscendingSortOnFirstLine()
13:01:19 Setup of org.eclipse.sirius.tests.unit.table.unit.sort.DTableSortByLineTest.testDescendingSortOnFirstLine()
13:01:19 Setup of org.eclipse.sirius.tests.unit.table.unit.sort.DTableSortByLineWithEditorTests.testNormalSort()
13:01:19 Setup of org.eclipse.sirius.tests.unit.table.unit.sort.DTableSortByLineWithEditorTests.testAscendingSortOnFirstLine()
13:01:20 Setup of org.eclipse.sirius.tests.unit.table.unit.sort.DTableSortByLineWithEditorTests.testDescendingSortOnFirstLine()
13:01:20 Setup of org.eclipse.sirius.tests.unit.table.unit.export.ExportToCsvTest.testEditionTableCsvTransformation()
13:01:20 Setup of org.eclipse.sirius.tests.unit.table.unit.export.ExportToCsvTest.testCrossTableCsvTransformation()
13:01:21 Setup of org.eclipse.sirius.tests.unit.table.unit.export.ExportToCsvTest.testEditionTableCsvTransformationWithHiddenElements()
13:01:21 Setup of org.eclipse.sirius.tests.unit.table.unit.export.ExportToCsvTest.testCrossTableCsvExport()
13:01:21 Setup of org.eclipse.sirius.tests.unit.table.unit.export.ExportToCsvTest.testEditionTableCsvExport()
13:01:21 Setup of org.eclipse.sirius.tests.unit.table.unit.export.MultiLineExportToCsvTest.testEditionTableCsvExport()
13:01:22 Setup of org.eclipse.sirius.tests.unit.table.unit.export.MultiLineExportToCsvTest.testEditionTableCsvTransformationWithCroppedMultiLineLabel()
13:01:22 Setup of org.eclipse.sirius.tests.unit.table.tests.provider.TreeLabelProviderTest.testTableLabelProvider()
13:01:22 Setup of org.eclipse.sirius.tests.unit.table.tests.provider.TreeLabelProviderTest.testCrossTableLabelProvider()
13:01:22 Setup of org.eclipse.sirius.tests.unit.table.tests.srs.SpecifyArrays_Test.test_REQ_056()
13:01:22 Setup of org.eclipse.sirius.tests.unit.table.tests.srs.SpecifyArrays_Test.test_REQ_057()
13:01:23 Setup of org.eclipse.sirius.tests.unit.table.tests.srs.SpecifyArrays_Test.test_REQ_058()
13:01:23 Setup of org.eclipse.sirius.tests.unit.table.tests.srs.SpecifyArrays_Test.test_REQ_059()
13:01:23 Setup of org.eclipse.sirius.tests.unit.table.tests.srs.SpecifyArrays_Test.test_REQ_060()
13:01:23 Setup of org.eclipse.sirius.tests.unit.table.tests.srs.SpecifyArrays_Test.test_REQ_061()
13:01:24 Setup of org.eclipse.sirius.tests.unit.table.tests.srs.SpecifyArrays_Test.test_REQ_062()
13:01:24 Setup of org.eclipse.sirius.tests.unit.table.tests.srs.SpecifyArrays_Test.test_REQ_063()
13:01:24 Setup of org.eclipse.sirius.tests.unit.table.tests.srs.SpecifyArrays_Test.test_REQ_064()
13:01:24 Setup of org.eclipse.sirius.tests.unit.table.unit.tools.CreateTableWithToolWithPrecondtionTest.testOpenTableWithPreconditionOnCreatColumnTool()
13:01:24 Setup of org.eclipse.sirius.tests.unit.table.unit.tools.CreateTableWithToolWithPrecondtionTest.testOpenTableWithPreconditionOnCreateLineTool()
13:01:24 Setup of org.eclipse.sirius.tests.unit.table.unit.tools.RefreshToolActionBarTest.testRefreshToolBarCreateLine()
13:01:24 Setup of org.eclipse.sirius.tests.unit.table.unit.tools.TableToolPreconditionCompletionTest.testDeleteLineTool()
13:01:24 Setup of org.eclipse.sirius.tests.unit.table.unit.tools.TableToolPreconditionCompletionTest.testCreateColumnTool()
13:01:25 Setup of org.eclipse.sirius.tests.unit.table.unit.tools.TableToolPreconditionCompletionTest.testCreateCellTool()
13:01:25 Setup of org.eclipse.sirius.tests.unit.table.unit.tools.TableToolPreconditionCompletionTest.testDeleteColumnTool()
13:01:25 Setup of org.eclipse.sirius.tests.unit.table.unit.tools.TableToolPreconditionCompletionTest.testCreateLineTool()
13:01:25 Setup of org.eclipse.sirius.tests.unit.table.unit.refresh.DTableSynchronizerVSMWithEditorTest.testRefreshAfterDeleteAllColumns()
13:01:25 Setup of org.eclipse.sirius.tests.unit.table.unit.refresh.DTableSynchronizerVSMWithEditorTest.testRefreshFeatureColumnOtherLevelSubLineMappingWithVSModificationSurroundByCloseAndOpen()
13:01:26 Setup of org.eclipse.sirius.tests.unit.table.unit.refresh.DTableSynchronizerVSMWithEditorTest.testRefreshFeatureColumn()
13:01:26 Setup of org.eclipse.sirius.tests.unit.table.unit.refresh.DTableSynchronizerVSMWithEditorTest.testRefreshFeatureColumnFirstLevelSubLineMappingWithVSModificationSurroundByCloseAndOpen()
13:01:26 Setup of org.eclipse.sirius.tests.unit.table.unit.refresh.DTableSynchronizerVSMWithEditorTest.testRefreshDeleteOneColumn()
13:01:27 Setup of org.eclipse.sirius.tests.unit.table.unit.refresh.DCrossTableSynchronizerVSMWithEditorTest.testRefreshFeatureColumnOtherLevelSubLineMappingWithVSModificationSurroundByCloseAndOpen()
13:01:27 Setup of org.eclipse.sirius.tests.unit.table.unit.refresh.DCrossTableSynchronizerVSMWithEditorTest.testRefreshFeatureColumn()
13:01:27 Setup of org.eclipse.sirius.tests.unit.table.unit.refresh.DCrossTableSynchronizerVSMWithEditorTest.testRefreshFeatureColumnFirstLevelSubLineMappingWithVSModificationSurroundByCloseAndOpen()
13:01:28 Setup of org.eclipse.sirius.tests.unit.table.unit.refresh.DCrossTableNoDomainSynchronizerVSMWithEditorTest.testRefreshFeatureColumnOtherLevelSubLineMappingWithVSModificationSurroundByCloseAndOpen()
13:01:28 Setup of org.eclipse.sirius.tests.unit.table.unit.refresh.DCrossTableNoDomainSynchronizerVSMWithEditorTest.testRefreshFeatureColumn()
13:01:28 Setup of org.eclipse.sirius.tests.unit.table.unit.refresh.DCrossTableNoDomainSynchronizerVSMWithEditorTest.testRefreshFeatureColumnFirstLevelSubLineMappingWithVSModificationSurroundByCloseAndOpen()
13:01:29 Setup of org.eclipse.sirius.tests.unit.table.unit.refresh.InvalidParentExpressionTest.testCellWithInvalidFeatureParentExpressionIsBlank()
13:01:29 Setup of org.eclipse.sirius.tests.unit.table.unit.refresh.TableManuelRefreshTests.testTableDialectUIManagerRefresh()
13:01:29 Setup of org.eclipse.sirius.tests.unit.table.unit.refresh.TableManuelRefreshTests.testLocalRefreshAfterAEClassNameChange()
13:01:29 Setup of org.eclipse.sirius.tests.unit.table.unit.refresh.TableNotDirtyOnOpeningTest.testRefreshFeatureColumn()
13:01:30 Setup of org.eclipse.sirius.tests.unit.table.tests.srs.ExploitArrays_SimpleTest.test_REQ_155()
13:01:30 Setup of org.eclipse.sirius.tests.unit.table.tests.srs.ExploitArrays_SimpleTest.test_REQ_158()
13:01:30 Setup of org.eclipse.sirius.tests.unit.table.tests.srs.ExploitArrays_SimpleTest.test_REQ_159()
13:01:30 Setup of org.eclipse.sirius.tests.unit.table.tests.srs.ExploitArrays_SimpleTest.test_REQ_162()
13:01:31 Setup of org.eclipse.sirius.tests.unit.table.tests.srs.REQ_157_Test.test_REQ_157_ascendingSortOnNameColumn()
13:01:31 Setup of org.eclipse.sirius.tests.unit.table.tests.srs.REQ_157_Test.test_REQ_157_NormalSort()
13:01:31 Setup of org.eclipse.sirius.tests.unit.table.tests.srs.REQ_157_Test.test_REQ_157_descendingSortOnNameColumn()
13:01:31 Setup of org.eclipse.sirius.tests.unit.table.tests.srs.REQ_161_Test.test_REQ_161_ascendingSortOnSecondColumn()
13:01:32 Setup of org.eclipse.sirius.tests.unit.table.tests.srs.REQ_161_Test.test_REQ_161_ascendingSortOnFirstLine()
13:01:32 Setup of org.eclipse.sirius.tests.unit.table.tests.srs.REQ_161_Test.test_REQ_161_descendingSortOnSeconfColumn()
13:01:32 Setup of org.eclipse.sirius.tests.unit.table.tests.srs.REQ_161_Test.test_REQ_161_descendingSortOnFirstLine()
13:01:32 Setup of org.eclipse.sirius.tests.unit.table.tests.srs.REQ_161_Test.test_REQ_161_NormalSort()
13:01:32 Setup of org.eclipse.sirius.tests.unit.table.unit.refresh.DCellDeleteTest.testDeleteLastDomainBasedCellInLine()
13:01:33 Setup of org.eclipse.sirius.tests.unit.table.unit.refresh.DCellDeleteTest.testDeleteLastCellInLine()
13:01:33 Setup of org.eclipse.sirius.tests.unit.table.unit.refresh.DCellDeleteTest.testDeleteManyCells()
13:01:33 Setup of org.eclipse.sirius.tests.unit.table.unit.refresh.CrossReferencedDLineDeleteTest.testDeleteSemanticDeleteCrossReferencedLine()
13:01:33 Setup of org.eclipse.sirius.tests.unit.table.unit.TableContentTest.testTableContainsAsManyLinesAndManyColumnsAsEClassesAfterRefresh_1024()
13:01:33 Setup of org.eclipse.sirius.tests.unit.table.unit.TableContentTest.testTableContainsAsManyLinesAndManyColumnsAsEClassesAfterRefresh_2048()
13:01:33 Setup of org.eclipse.sirius.tests.unit.table.unit.TableContentTest.testTableContainsAsManyLinesAndManyColumnsAsEClassesAfterCreation_128()
13:01:33 Setup of org.eclipse.sirius.tests.unit.table.unit.TableContentTest.testTableContainsAsManyLinesAndManyColumnsAsEClassesAfterCreation_256()
13:01:33 Setup of org.eclipse.sirius.tests.unit.table.unit.TableContentTest.testTableContainsAsManyLinesAndManyColumnsAsEClassesAfterCreation_1024()
13:01:34 Setup of org.eclipse.sirius.tests.unit.table.unit.TableContentTest.testTableContainsAsManyLinesAndManyColumnsAsEClassesAfterCreation_2048()
13:01:34 Setup of org.eclipse.sirius.tests.unit.table.unit.TableContentTest.testTableContainsAsManyLinesAndManyColumnsAsEClassesAfterRefresh_128()
13:01:34 Setup of org.eclipse.sirius.tests.unit.table.unit.TableContentTest.testTableContainsAsManyLinesAndManyColumnsAsEClassesAfterRefresh_256()
13:01:34 Setup of org.eclipse.sirius.tests.unit.table.unit.vsm.interpreted.expression.variables.VariableOnTableCreationToolsTest.testColumnCreationWithToolUsingVariables()
13:01:34 Setup of org.eclipse.sirius.tests.unit.table.unit.vsm.interpreted.expression.variables.VariableOnTableCreationToolsTest.testCrossColumnCreationWithToolUsingVariables()
13:01:34 Setup of org.eclipse.sirius.tests.unit.table.unit.refresh.TableStyleRefreshTest.testConditionalStyleChange()
13:01:35 Setup of org.eclipse.sirius.tests.unit.table.unit.TableWithMultivaluedAttributeTest.testTableWithMultivaluedAttribute()
13:01:35 Setup of org.eclipse.sirius.tests.unit.table.unit.TableWithHeaderColumnWidthTest.testWidthHeaderColumnTo50_onEditionTable()
13:01:35 Setup of org.eclipse.sirius.tests.unit.table.unit.TableWithHeaderColumnWidthTest.testWidthHeaderColumnToMinus1_onCrossTable()
13:01:35 Setup of org.eclipse.sirius.tests.unit.table.unit.TableWithHeaderColumnWidthTest.testWidthHeaderColumnTo50_onCrossTable()
13:01:35 Setup of org.eclipse.sirius.tests.unit.table.unit.TableWithHeaderColumnWidthTest.testHideHeaderColumn_onEditionTable()
13:01:35 Setup of org.eclipse.sirius.tests.unit.table.unit.TableWithHeaderColumnWidthTest.testWidthHeaderColumnTo0_onCrossTable()
13:01:35 Setup of org.eclipse.sirius.tests.unit.table.unit.TableWithHeaderColumnWidthTest.testWidthHeaderColumnTo0_onEditionTable()
13:01:35 Setup of org.eclipse.sirius.tests.unit.diagram.style.InterpolatedColorTest.testNoColorStep()
13:01:35 Setup of org.eclipse.sirius.tests.unit.diagram.style.InterpolatedColorTest.test1ValidColorStep()
13:01:36 Setup of org.eclipse.sirius.tests.unit.diagram.style.InterpolatedColorTest.test3ValidColorSteps()
13:01:36 Setup of org.eclipse.sirius.tests.unit.diagram.style.InterpolatedColorTest.testNoValidColorStepManyUndefinedColorSteps()
13:01:36 Setup of org.eclipse.sirius.tests.unit.diagram.style.ComputedColorTest.testInitAndRefreshComputedColor()
13:01:36 Setup of org.eclipse.sirius.tests.unit.diagram.style.ComputedColorTest.testDefaultComputedColor()
13:01:36 Setup of org.eclipse.sirius.tests.unit.diagram.style.LabelColorTest.testInitAndRefreshLabelColorWithMigration()
13:01:37 Setup of org.eclipse.sirius.tests.unit.diagram.style.LabelColorTest.testInitAndRefreshLabelColor()
13:01:38 Setup of org.eclipse.sirius.tests.unit.diagram.style.LabelColorOnListElementTest.testLabelColorOnListElementOnNewRepresentation()
13:01:39 Setup of org.eclipse.sirius.tests.unit.api.command.CreateDiagramElementCommandTests.testCreateContainer()
13:01:39 Setup of org.eclipse.sirius.tests.unit.api.command.CreateDiagramElementCommandTests.testCreateEdge()
13:01:39 Setup of org.eclipse.sirius.tests.unit.api.command.CreateDiagramElementCommandTests.testCreateNode()
13:01:40 Setup of org.eclipse.sirius.tests.unit.api.command.CreationAndDeletionUndoRedoTests.testCreationWithUndoFromDiagram()
13:01:40 Setup of org.eclipse.sirius.tests.unit.api.command.CreationAndDeletionUndoRedoTests.testCreation()
13:01:40 Setup of org.eclipse.sirius.tests.unit.api.command.CreationAndDeletionUndoRedoTests.testCreationWithEmptyDiagram()
13:01:41 Setup of org.eclipse.sirius.tests.unit.api.command.CreationAndDeletionUndoRedoTests.testDeletionWithEmptyDiagram()
13:01:41 Setup of org.eclipse.sirius.tests.unit.api.command.CreationAndDeletionUndoRedoTests.testCreationWithEmptyDiagramWithUndoFromDiagram()
13:01:41 Setup of org.eclipse.sirius.tests.unit.api.command.CreationAndDeletionUndoRedoTests.testDeletion()
13:01:42 Setup of org.eclipse.sirius.tests.unit.api.validation.DiagramValidationTest.testValidation()
13:01:43 Setup of org.eclipse.sirius.tests.unit.api.validation.DiagramValidationTest.testValidationOnlyOneErrorMessage()
13:01:43 Setup of org.eclipse.sirius.tests.unit.api.diagramintegrity.RetrieveEditPartFromSemanticElementTests.testFind()
13:01:43 Setup of org.eclipse.sirius.tests.unit.api.diagramintegrity.RetrieveEditPartFromSemanticElementTests.testUnsynchronizedDeleteAndUnregister()
13:01:44 Setup of org.eclipse.sirius.tests.unit.api.diagramintegrity.RetrieveEditPartFromSemanticElementTests.testRegister()
13:01:44 Setup of org.eclipse.sirius.tests.unit.api.diagramintegrity.RetrieveEditPartFromSemanticElementTests.testUnregister()
13:01:44 Setup of org.eclipse.sirius.tests.unit.api.diagramintegrity.RetrieveEditPartFromSemanticElementTests.testDeleteAndUnregister()
13:01:45 Setup of org.eclipse.sirius.tests.unit.diagram.modelers.dynamicinstance.DynamicInstanceTests.testDiagramWithPrefixCreation()
13:01:45 Setup of org.eclipse.sirius.tests.unit.diagram.modelers.dynamicinstance.DynamicInstanceTests.testDiagramWithoutPrefixCreation()
13:01:45 Setup of org.eclipse.sirius.tests.unit.diagram.CanonicalDBorderItemLocatorTest.testVisibilityConsistency()
13:01:45 Setup of org.eclipse.sirius.tests.unit.diagram.dialect.DiagramDialectServicesTests.testDescriptionCreationWithRootElementDomainClassWIthAQLSyntax()
13:01:45 Setup of org.eclipse.sirius.tests.unit.diagram.dialect.DiagramUIDialectServicesTests.testDiagramDialectUIManagerRefresh()
13:01:46 Setup of org.eclipse.sirius.tests.unit.diagram.dialect.DiagramUIDialectServicesTests.testDiagramOpeningAfterDeletionUndo()
13:01:46 Setup of org.eclipse.sirius.tests.unit.diagram.modeler.ecore.documentation.EntitiesDiagramDocumentationFiltersTests.testHideGeneralizations()
13:01:46 Setup of org.eclipse.sirius.tests.unit.diagram.modeler.ecore.documentation.EntitiesDiagramDocumentationFiltersTests.testHideReferences()
13:01:46 Setup of org.eclipse.sirius.tests.unit.diagram.modeler.ecore.documentation.EntitiesDiagramDocumentationFiltersTests.testHideClassContentFilter()
13:01:47 Setup of org.eclipse.sirius.tests.unit.diagram.modeler.ecore.documentation.EntitiesDiagramDocumentationToolsTests.testDefaultLayerReferenceCreation()
13:01:47 Setup of org.eclipse.sirius.tests.unit.diagram.modeler.ecore.documentation.EntitiesDiagramDocumentationToolsTests.testDefaultLayerNameEdition()
13:01:47 Setup of org.eclipse.sirius.tests.unit.diagram.modeler.ecore.documentation.EntitiesDiagramDocumentationToolsTests.testDefaultLayerAttributeCreation()
13:01:48 Setup of org.eclipse.sirius.tests.unit.diagram.modeler.ecore.documentation.EntitiesDiagramDocumentationToolsTests.testDefaultLayerSupertypeCreation()
13:01:48 Setup of org.eclipse.sirius.tests.unit.diagram.modeler.ecore.documentation.EntitiesDiagramDocumentationToolsTests.testDefaultLayerOperationCreation()
13:01:48 Setup of org.eclipse.sirius.tests.unit.diagram.modeler.ecore.documentation.EntitiesDiagramDocumentationToolsTests.testDefaultLayerCompositionCreation()
13:01:48 Setup of org.eclipse.sirius.tests.unit.diagram.modeler.ecore.documentation.EntitiesDiagramDocumentationToolsTests.testPackageLayerPackageCreation()
13:01:49 Setup of org.eclipse.sirius.tests.unit.diagram.modeler.ecore.documentation.EntitiesDiagramDocumentationToolsTests.testDefaultLayerClassCreation()
13:01:49 Setup of org.eclipse.sirius.tests.unit.diagram.session.MultiAirdResourcesSessionTest.testCheckNoVisibilityPropagatorAdapterWhenNoEditor()
13:01:49 Setup of org.eclipse.sirius.tests.unit.diagram.session.MultiAirdResourcesSessionTest.testCheckEachOpenDiagramHasItsVisibilityPropagatorAdapter()
13:01:49 Setup of org.eclipse.sirius.tests.unit.diagram.session.MultiAirdResourcesSessionTest.testCheckAllOpenDiagramHaveOnlyOneVisibilityPropagatorAdapter()
13:01:49 Setup of org.eclipse.sirius.tests.unit.diagram.modeler.ecore.design.EntitiesDiagramModificationOutsideEditorTests.testRevertAirdFileAfterDiagramCreation()
13:01:50 Setup of org.eclipse.sirius.tests.unit.diagram.modeler.ecore.design.EntitiesDiagramModificationOutsideEditorTests.testDeleteSemanticElementCorrespondingToNode()
13:01:50 Setup of org.eclipse.sirius.tests.unit.diagram.modeler.ecore.design.EntitiesDiagramModificationOutsideEditorTests.testNoMsgInErrorLogWhenSelectedADNodeListWithProxyTarget()
13:01:51 Setup of org.eclipse.sirius.tests.unit.diagram.modeler.ecore.design.EntitiesDiagramRefreshTests.testDefaultLayerRefresh()
13:01:51 Setup of org.eclipse.sirius.tests.unit.diagram.modeler.ecore.design.EntitiesDiagramRefreshTests.testPackageLayerRefresh()
13:01:52 Setup of org.eclipse.sirius.tests.unit.diagram.modeler.ecore.design.EntitiesDiagramLayersTests.testDefaultLayerVisibility()
13:01:52 Setup of org.eclipse.sirius.tests.unit.diagram.modeler.ecore.design.EntitiesDiagramLayersTests.testPackageLayerVisibility()
13:01:52 Setup of org.eclipse.sirius.tests.unit.diagram.modeler.ecore.design.EntitiesDiagramFiltersTests.testHideOperations()
13:01:53 Setup of org.eclipse.sirius.tests.unit.diagram.modeler.ecore.design.EntitiesDiagramFiltersTests.testHideDerivedFeature()
13:01:53 Setup of org.eclipse.sirius.tests.unit.diagram.modeler.ecore.design.EntitiesDiagramFiltersTests.testHideGeneralizations()
13:01:54 Setup of org.eclipse.sirius.tests.unit.diagram.modeler.ecore.design.EntitiesDiagramFiltersTests.testHideReferences()
13:01:54 Setup of org.eclipse.sirius.tests.unit.diagram.modeler.ecore.design.EntitiesDiagramFiltersTests.testHideClassContentFilter()
13:01:54 Setup of org.eclipse.sirius.tests.unit.diagram.modeler.ecore.design.EntitiesDiagramToolsTests.testDefaultLayerReferenceCreation()
13:01:55 Setup of org.eclipse.sirius.tests.unit.diagram.modeler.ecore.design.EntitiesDiagramToolsTests.testDefaultLayerNameEdition()
13:01:55 Setup of org.eclipse.sirius.tests.unit.diagram.modeler.ecore.design.EntitiesDiagramToolsTests.testDefaultLayerAttributeCreation()
13:01:55 Setup of org.eclipse.sirius.tests.unit.diagram.modeler.ecore.design.EntitiesDiagramToolsTests.testDefaultLayerSupertypeCreation()
13:01:56 Setup of org.eclipse.sirius.tests.unit.diagram.modeler.ecore.design.EntitiesDiagramToolsTests.testDefaultLayerOperationCreation()
13:01:56 Setup of org.eclipse.sirius.tests.unit.diagram.modeler.ecore.design.EntitiesDiagramToolsTests.testDefaultLayerCompositionCreation()
13:01:56 Setup of org.eclipse.sirius.tests.unit.diagram.modeler.ecore.design.EntitiesDiagramToolsTests.testDefaultLayerBiReferenceCreation()
13:01:56 Setup of org.eclipse.sirius.tests.unit.diagram.modeler.ecore.design.EntitiesDiagramToolsTests.testPackageLayerPackageCreation()
13:01:56 Setup of org.eclipse.sirius.tests.unit.diagram.modeler.ecore.design.EntitiesDiagramToolsTests.testDefaultLayerClassCreation()
13:01:57 Setup of org.eclipse.sirius.tests.unit.diagram.modeler.ecore.design.EntitiesDiagramTooltipsTests.testTooltipInitializedOnDiagramCreation()
13:01:57 Setup of org.eclipse.sirius.tests.unit.diagram.modeler.ecore.design.EntitiesDiagramTooltipsRefreshTests.testTooltipsComputedOnNewElements()
13:01:58 Setup of org.eclipse.sirius.tests.unit.diagram.modeler.ecore.design.EntitiesDiagramTooltipsRefreshTests.testTooltipsRefreshedOnSemanticChanges()
13:01:58 Setup of org.eclipse.sirius.tests.unit.diagram.modeler.ecore.design.EntitiesDiagramDropTests.testDropExternalEClass()
13:01:58 Setup of org.eclipse.sirius.tests.unit.diagram.modeler.ecore.design.EntitiesDiagramZoomTests.testZoomToPageIsAvailable()
13:01:59 Setup of org.eclipse.sirius.tests.unit.diagram.modeler.ecore.design.EntitiesDiagramZoomTests.testZoomToHeightIsAvailable()
13:01:59 Setup of org.eclipse.sirius.tests.unit.diagram.modeler.ecore.design.EntitiesDiagramZoomTests.testZoomAndCheckEdgePosition()
13:01:59 Setup of org.eclipse.sirius.tests.unit.diagram.modeler.ecore.design.EntitiesDiagramZoomTests.testZoomToWidthIsAvailable()
13:01:59 Setup of org.eclipse.sirius.tests.unit.api.initialization.InitOperationForDiagramsTests.testInitialOperationLaunchingWhenSessionGetsCreated()
13:01:59 Setup of org.eclipse.sirius.tests.unit.api.initialization.InitOperationForDiagramsTests.testInitialOperationLaunchingWhenCreatingANewDiagram()
13:01:59 Setup of org.eclipse.sirius.tests.unit.diagram.modeler.ecore.quality.DependenciesDiagramRefreshTests.testDefaultLayerRefresh()
13:02:00 Setup of org.eclipse.sirius.tests.unit.diagram.modeler.ecore.quality.DependenciesDiagramRefreshTests.testContentLayerRefresh()
13:02:00 Setup of org.eclipse.sirius.tests.unit.diagram.modeler.ecore.quality.DependenciesDiagramLayersTests.testContentLayerVisibility()
13:02:00 Setup of org.eclipse.sirius.tests.unit.diagram.modeler.ecore.quality.DependenciesDiagramLayersTests.testDefaultLayerVisibility()
13:02:00 Setup of org.eclipse.sirius.tests.unit.diagram.modeler.ecore.quality.HierarchyDiagramRefreshTests.testDefaultLayerRefresh()
13:02:00 Setup of org.eclipse.sirius.tests.unit.diagram.modeler.ecore.quality.HierarchyDiagramLayersTests.testDefaultLayerVisibility()
13:02:00 Setup of org.eclipse.sirius.tests.unit.diagram.modeler.ecore.quality.RelationsDiagramRefreshTests.testUsesLayerRefresh()
13:02:00 Setup of org.eclipse.sirius.tests.unit.diagram.modeler.ecore.quality.RelationsDiagramRefreshTests.testDefaultLayerRefresh()
13:02:00 Setup of org.eclipse.sirius.tests.unit.diagram.modeler.ecore.quality.RelationsDiagramRefreshTests.testUsedByLayerRefresh()
13:02:01 Setup of org.eclipse.sirius.tests.unit.diagram.modeler.ecore.quality.RelationsDiagramLayersTests.testUsedbyLayerVisibility()
13:02:01 Setup of org.eclipse.sirius.tests.unit.diagram.modeler.ecore.quality.RelationsDiagramLayersTests.testDefaultLayerVisibility()
13:02:01 Setup of org.eclipse.sirius.tests.unit.diagram.modeler.ecore.quality.RelationsDiagramLayersTests.testUsesLayerVisibility()
13:02:01 Setup of org.eclipse.sirius.tests.unit.diagram.modeler.ecore.documentation.EntitiesDiagramRefreshTests.testDefaultLayerRefresh()
13:02:01 Setup of org.eclipse.sirius.tests.unit.diagram.modeler.ecore.documentation.EntitiesDiagramRefreshTests.testPackageLayerRefresh()
13:02:01 Setup of org.eclipse.sirius.tests.unit.diagram.modeler.ecore.documentation.EntitiesDiagramLayersTests.testDefaultLayerVisibility()
13:02:02 Setup of org.eclipse.sirius.tests.unit.diagram.modeler.ecore.documentation.EntitiesDiagramLayersTests.testPackageLayerVisibility()
13:02:02 Setup of org.eclipse.sirius.tests.unit.api.startup.StartupRepresentationsTests.testDiagramStartup_ExistingRepresentation()
13:02:02 Setup of org.eclipse.sirius.tests.unit.api.startup.StartupRepresentationsTests.testTableStartupNoInit_NewSession()
13:02:02 Setup of org.eclipse.sirius.tests.unit.api.startup.StartupRepresentationsTests.testTableStartupInit_NewSession()
13:02:02 Setup of org.eclipse.sirius.tests.unit.api.startup.StartupRepresentationsTests.testTableStartup_ExistingRepresentation()
13:02:02 Setup of org.eclipse.sirius.tests.unit.api.startup.StartupRepresentationsTests.testDiagramStartupInit_NewSession()
13:02:02 Setup of org.eclipse.sirius.tests.unit.api.startup.StartupRepresentationsTests.testDiagramStartupNoInit_NewSession()
13:02:02 Setup of org.eclipse.sirius.tests.unit.api.session.SessionWorkspaceSyncTests.testOpenRepresentationInEditor()
13:02:03 Setup of org.eclipse.sirius.tests.unit.api.session.SessionWorkspaceSyncTests.testCreateRepresentationMakesSave()
13:02:03 Setup of org.eclipse.sirius.tests.unit.api.session.SessionWorkspaceSyncTests.testOpenMultipleSessions()
13:02:04 Setup of org.eclipse.sirius.tests.unit.api.session.SessionWorkspaceSyncTests.testMultipleSameNotifications()
13:02:04 Setup of org.eclipse.sirius.tests.unit.api.session.SessionWorkspaceSyncTests.testReloadingWithOutsideModifications()
13:02:05 Setup of org.eclipse.sirius.tests.unit.api.session.SessionWorkspaceSyncTests.testRepresentationsNotifications()
13:02:05 Setup of org.eclipse.sirius.tests.unit.api.session.SessionWorkspaceSyncTests.testDeleteAirdDirtySession()
13:02:07 Setup of org.eclipse.sirius.tests.unit.api.session.SessionWorkspaceSyncTests.testCreateRepresentationMakesDirty()
13:02:08 Setup of org.eclipse.sirius.tests.unit.api.session.SessionWorkspaceSyncTests.testCreateUndoSaveMakesNotDirty()
13:02:08 Setup of org.eclipse.sirius.tests.unit.api.session.SessionWorkspaceSyncTests.testSessionResourceSetSyncInstallation()
13:02:08 Setup of org.eclipse.sirius.tests.unit.api.session.SessionWorkspaceSyncTests.testNoSemanticNotification()
13:02:08 Setup of org.eclipse.sirius.tests.unit.diagram.modeler.ecore.design.EntitiesDiagramDeleteFromDiagramTests.testDeleteNoteFromModel()
13:02:09 Setup of org.eclipse.sirius.tests.unit.diagram.modeler.ecore.design.EntitiesDiagramDeleteFromDiagramTests.testActionEnablementForActionBarButton()
13:02:09 Setup of org.eclipse.sirius.tests.unit.diagram.modeler.ecore.design.EntitiesDiagramDeleteFromDiagramTests.testDeleteNoteFromDiagram()
13:02:10 Setup of org.eclipse.sirius.tests.unit.diagram.modeler.ecore.quality.EntitiesDiagramCustomizationsTests.testBackgroundInterpolatedColor()
13:02:10 Setup of org.eclipse.sirius.tests.unit.diagram.modeler.ecore.design.EntitiesDiagramDirectEditToolOnOperationTests.testDirectEditOnEPackage()
13:02:10 Setup of org.eclipse.sirius.tests.unit.diagram.modeler.ecore.design.EntitiesDiagramDirectEditToolOnOperationTests.testDirectEditOnOperation()
13:02:10 Setup of org.eclipse.sirius.tests.unit.diagram.modeler.ecore.design.EntitiesDiagramContainerList.testInsertNewElement()
13:02:11 Setup of org.eclipse.sirius.tests.unit.diagram.modeler.ecore.design.EntitiesDiagramContainerList.testMoveElement()
13:02:11 Setup of org.eclipse.sirius.tests.unit.diagram.modeler.ecore.design.EntitiesDiagramStyleRefreshTests.testListContainerStyle()
13:02:11 Setup of org.eclipse.sirius.tests.unit.diagram.modeler.ecore.design.EntitiesDiagramStyleRefreshTests.testContainerStyle()
13:02:12 Setup of org.eclipse.sirius.tests.unit.diagram.modeler.ecore.design.EntitiesDiagramDerivedReferenceTests.testDerivedReferences()
13:02:12 Setup of org.eclipse.sirius.tests.unit.diagram.modeler.ecore.design.EntitiesDiagramSiriussConflictTest.testCreateEdgeBetweenAnArchetypeAndAnEClass()
13:02:12 Setup of org.eclipse.sirius.tests.unit.diagram.modeler.ecore.design.EntitiesDiagramSiriussConflictTest.testCreateEdgeBetween2Archetype()
13:02:12 Setup of org.eclipse.sirius.tests.unit.diagram.modeler.ecore.design.EntitiesDiagramSiriussConflictTest.testCreateEdgeBetween2EClass()
13:02:12 Setup of org.eclipse.sirius.tests.unit.diagram.layoutingmode.LayoutingModeOnECoreModelerTest.testLayoutingModeOnEdgeReconnection()
13:02:13 Setup of org.eclipse.sirius.tests.unit.diagram.layoutingmode.LayoutingModeOnECoreModelerTest.testLayoutingModeOnDragAndDrop()
13:02:14 Setup of org.eclipse.sirius.tests.unit.diagram.layoutingmode.LayoutingModeOnECoreModelerTest.testLayoutingModeOnDirectEdit()
13:02:14 Setup of org.eclipse.sirius.tests.unit.diagram.layoutingmode.LayoutingModeOnCustomModelerTest.testLayoutingModeOnDragOnDropWithBorderedNodes()
13:02:15 Setup of org.eclipse.sirius.tests.unit.diagram.layoutingmode.LayoutingModeOnCustomModelerTest.testLayoutingModeOnDoubleClickToolsWithoutNavigationDescription()
13:02:15 Setup of org.eclipse.sirius.tests.unit.diagram.layoutingmode.LayoutingModeOnCustomModelerTest.testLayoutingModeOnDoubleClickToolsWithNavigationDescription()
13:02:16 Setup of org.eclipse.sirius.tests.unit.diagram.modeler.ecore.design.EntitiesDiagramBackgroundTests.testDiagramBackgroundColorWithComputedColor()
13:02:16 Setup of org.eclipse.sirius.tests.unit.diagram.modeler.ecore.design.EntitiesDiagramBackgroundTests.testDiagramBackgroundColorWithFixedColor()
13:02:16 Setup of org.eclipse.sirius.tests.unit.diagram.layers.LayersTest.testNodeMappingVisibilityWithCloseAndReopenSession()
13:02:17 Setup of org.eclipse.sirius.tests.unit.diagram.layers.LayersTest.testNodeMappingVisibility()
13:02:17 Setup of org.eclipse.sirius.tests.unit.diagram.layers.LayersTest.testContainerMappingVisibility()
13:02:17 Setup of org.eclipse.sirius.tests.unit.diagram.layers.LayersTest.testContainerMappingImportsWithoutSemanticElements()
13:02:17 Setup of org.eclipse.sirius.tests.unit.diagram.layers.LayersTest.testNodeMappingImportsWithSemanticElementsAndHideMapping()
13:02:17 Setup of org.eclipse.sirius.tests.unit.diagram.layers.LayersTest.testNodeMappingImportsWithSemanticElements()
13:02:17 Setup of org.eclipse.sirius.tests.unit.diagram.layers.LayersTest.testNodeMappingImportsWithoutSemanticElements()
13:02:17 Setup of org.eclipse.sirius.tests.unit.diagram.layers.LayersTest.testContainerMappingImportsWithSemanticElements()
13:02:17 Setup of org.eclipse.sirius.tests.unit.diagram.layers.LayersTest.testReuseContainerMappingImportsWithoutSemanticElements()
13:02:18 Setup of org.eclipse.sirius.tests.unit.diagram.layers.LayersTest.testContainerMappingImportsWithoutSemanticElementsAndExtension()
13:02:18 Setup of org.eclipse.sirius.tests.unit.diagram.layers.Layers1203Tests.testBorderedMappingImportOnContainerMappingImport()
13:02:18 Setup of org.eclipse.sirius.tests.unit.diagram.layers.Layers1302Tests.testConditionalStyleWithMappingImport()
13:02:18 Setup of org.eclipse.sirius.tests.unit.diagram.layers.Layers1796Tests.testRefreshWithEdgeMappingImport()
13:02:18 Setup of org.eclipse.sirius.tests.unit.diagram.layers.Layers1887Tests.testOverrideConditionnalStyles()
13:02:18 Setup of org.eclipse.sirius.tests.unit.diagram.mapping.EdgeMappingCreationDescriptionTests.testBestMappingWhenEdgeCreationDescriptionHaveTwoMappings()
13:02:18 Setup of org.eclipse.sirius.tests.unit.diagram.operations.OperationTest.testForOperation()
13:02:18 Setup of org.eclipse.sirius.tests.unit.diagram.operations.OperationTest.testLetOperationOverrideSelf()
13:02:18 Setup of org.eclipse.sirius.tests.unit.diagram.operations.OperationTest.testIFOperation()
13:02:18 Setup of org.eclipse.sirius.tests.unit.diagram.operations.OperationTest.testSwitchOperationConditionError()
13:02:18 Setup of org.eclipse.sirius.tests.unit.diagram.operations.OperationTest.testChangeContextOperation()
13:02:18 Setup of org.eclipse.sirius.tests.unit.diagram.operations.OperationTest.testSwitchOperationDefault()
13:02:19 Setup of org.eclipse.sirius.tests.unit.diagram.operations.OperationTest.testLetOperation()
13:02:19 Setup of org.eclipse.sirius.tests.unit.diagram.operations.OperationTest.testRemoveOperation()
13:02:19 Setup of org.eclipse.sirius.tests.unit.diagram.operations.OperationTest.testIFOperationConditionError()
13:02:19 Setup of org.eclipse.sirius.tests.unit.diagram.operations.OperationTest.testSwitchOperationConditionNull()
13:02:19 Setup of org.eclipse.sirius.tests.unit.diagram.operations.OperationTest.testSetObjectOperation()
13:02:19 Setup of org.eclipse.sirius.tests.unit.diagram.operations.OperationTest.testUnsetOperation()
13:02:19 Setup of org.eclipse.sirius.tests.unit.diagram.operations.OperationTest.testMoveOperation()
13:02:19 Setup of org.eclipse.sirius.tests.unit.diagram.operations.OperationTest.testSetValueOperation()
13:02:19 Setup of org.eclipse.sirius.tests.unit.diagram.operations.OperationTest.testCreateInstanceOperation()
13:02:19 Setup of org.eclipse.sirius.tests.unit.diagram.operations.OperationTest.testCreateEdgeView()
13:02:19 Setup of org.eclipse.sirius.tests.unit.diagram.operations.OperationTest.testSwitchOperation()
13:02:19 Setup of org.eclipse.sirius.tests.unit.diagram.operations.OperationTest.testLetOperationOverrideExistingVariable()
13:02:20 Setup of org.eclipse.sirius.tests.unit.api.dialect.ExportAsImageTest.testExportAsImage()
13:02:21 Setup of org.eclipse.sirius.tests.unit.api.dialect.ExportAsImageTest.testExportAsPNGAutoScalingIfLarger2()
13:02:21 Setup of org.eclipse.sirius.tests.unit.api.dialect.ExportAsImageTest.testExportAsJPGAutoScalingDownScale()
13:02:21 Setup of org.eclipse.sirius.tests.unit.api.dialect.ExportAsImageTest.testExportTooLargeDiagram()
13:02:21 Setup of org.eclipse.sirius.tests.unit.api.dialect.ExportAsImageTest.testExportAsSVGAutoScalingIfLarger2()
13:02:22 Setup of org.eclipse.sirius.tests.unit.api.dialect.ExportAsImageTest.testExportAsJPGAutoScaling()
13:02:23 Setup of org.eclipse.sirius.tests.unit.api.dialect.ExportAsImageTest.testExportAsJPEGAutoScalingIfLarger2()
13:02:23 Setup of org.eclipse.sirius.tests.unit.api.dialect.ExportAsImageTest.testExportAsSVGZNoAutoScaling()
13:02:23 Setup of org.eclipse.sirius.tests.unit.api.dialect.ExportAsImageTest.testExportTooLargeDiagramThatLeadsToNaNComputation()
13:02:23 Setup of org.eclipse.sirius.tests.unit.api.dialect.ExportAsImageTest.testExportAsJPGAutoScalingIfLarger2()
13:02:23 Setup of org.eclipse.sirius.tests.unit.api.dialect.ExportAsImageTest.testExportAsPNGNoAutoScaling()
13:02:23 Setup of org.eclipse.sirius.tests.unit.api.dialect.ExportAsImageTest.testExportAsSVGZAutoScalingDownScale()
13:02:24 Setup of org.eclipse.sirius.tests.unit.api.dialect.ExportAsImageTest.testExportAsGIFAutoScalingDownScale()
13:02:25 [INFO] ------------------------------------------------------------------------
13:02:25 [INFO] Reactor Summary:
13:02:25 [INFO] 
13:02:25 [INFO] Sirius Parent 6.2.1-SNAPSHOT ....................... SUCCESS [ 16.891 s]
13:02:25 [INFO] org.eclipse.sirius.ext.base 6.2.1-SNAPSHOT ......... SUCCESS [  8.599 s]
13:02:25 [INFO] org.eclipse.sirius.ext.e3 6.2.1-SNAPSHOT ........... SUCCESS [  0.057 s]
13:02:25 [INFO] org.eclipse.sirius.ext.emf 6.2.1-SNAPSHOT .......... SUCCESS [  0.116 s]
13:02:25 [INFO] org.eclipse.sirius.ext.emf.edit 6.2.1-SNAPSHOT ..... SUCCESS [  0.119 s]
13:02:25 [INFO] org.eclipse.sirius.ext.emf.tx 6.2.1-SNAPSHOT ....... SUCCESS [  0.089 s]
13:02:25 [INFO] org.eclipse.sirius.ext.gmf.notation 6.2.1-SNAPSHOT . SUCCESS [  0.058 s]
13:02:25 [INFO] org.eclipse.sirius.ext.ide 6.2.1-SNAPSHOT .......... SUCCESS [  0.206 s]
13:02:25 [INFO] org.eclipse.sirius.ecore.extender 6.2.1-SNAPSHOT ... SUCCESS [  0.327 s]
13:02:25 [INFO] org.eclipse.sirius.common 6.2.1-SNAPSHOT ........... SUCCESS [  0.603 s]
13:02:25 [INFO] org.eclipse.sirius 6.2.1-SNAPSHOT .................. SUCCESS [  1.986 s]
13:02:25 [INFO] org.eclipse.sirius.common.acceleo.aql 6.2.1-SNAPSHOT SUCCESS [  0.180 s]
13:02:25 [INFO] org.eclipse.sirius.common.acceleo.mtl 6.2.1-SNAPSHOT SUCCESS [  0.152 s]
13:02:25 [INFO] org.eclipse.sirius.common.interpreter 6.2.1-SNAPSHOT SUCCESS [  0.091 s]
13:02:25 [INFO] org.eclipse.sirius.common.ocl 6.2.1-SNAPSHOT ....... SUCCESS [  0.103 s]
13:02:25 [INFO] org.eclipse.sirius.diagram 6.2.1-SNAPSHOT .......... SUCCESS [  1.502 s]
13:02:25 [INFO] org.eclipse.sirius.diagram.formatdata 6.2.1-SNAPSHOT SUCCESS [  0.239 s]
13:02:25 [INFO] org.eclipse.sirius.synchronizer 6.2.1-SNAPSHOT ..... SUCCESS [  0.104 s]
13:02:25 [INFO] org.eclipse.sirius.table 6.2.1-SNAPSHOT ............ SUCCESS [  0.431 s]
13:02:25 [INFO] org.eclipse.sirius.tree 6.2.1-SNAPSHOT ............. SUCCESS [  0.328 s]
13:02:25 [INFO] org.eclipse.sirius.workflow.model 6.2.1-SNAPSHOT ... SUCCESS [  0.142 s]
13:02:25 [INFO] org.eclipse.sirius.runtime 6.2.1-SNAPSHOT .......... SUCCESS [  0.203 s]
13:02:25 [INFO] org.eclipse.sirius.runtime.acceleo 6.2.1-SNAPSHOT .. SUCCESS [  0.038 s]
13:02:25 [INFO] org.eclipse.sirius.runtime.aql 6.2.1-SNAPSHOT ...... SUCCESS [  0.829 s]
13:02:25 [INFO] org.eclipse.sirius.runtime.ocl 6.2.1-SNAPSHOT ...... SUCCESS [  0.052 s]
13:02:25 [INFO] org.eclipse.sirius.headless.update 6.2.1-SNAPSHOT .. SUCCESS [  1.850 s]
13:02:25 [INFO] org.eclipse.sirius.services.common 6.2.1-SNAPSHOT .. SUCCESS [  0.097 s]
13:02:25 [INFO] org.eclipse.sirius.services.diagram 6.2.1-SNAPSHOT . SUCCESS [  0.172 s]
13:02:25 [INFO] org.eclipse.sirius.services.graphql.common 6.2.1-SNAPSHOT SUCCESS [  0.116 s]
13:02:25 [INFO] org.eclipse.sirius.services.graphql.core 6.2.1-SNAPSHOT SUCCESS [  0.205 s]
13:02:25 [INFO] org.eclipse.sirius.services.graphql.emf 6.2.1-SNAPSHOT SUCCESS [  0.108 s]
13:02:25 [INFO] org.eclipse.sirius.services.graphql.workspace 6.2.1-SNAPSHOT SUCCESS [  0.123 s]
13:02:25 [INFO] org.eclipse.sirius.services.graphql 6.2.1-SNAPSHOT . SUCCESS [  0.177 s]
13:02:25 [INFO] org.eclipse.sirius.server 6.2.1-SNAPSHOT ........... SUCCESS [  0.139 s]
13:02:25 [INFO] org.eclipse.sirius.server.application 6.2.1-SNAPSHOT SUCCESS [  0.063 s]
13:02:25 [INFO] org.eclipse.sirius.server.backend 6.2.1-SNAPSHOT ... SUCCESS [  0.182 s]
13:02:25 [INFO] org.eclipse.sirius.server.images 6.2.1-SNAPSHOT .... SUCCESS [  0.102 s]
13:02:25 [INFO] org.eclipse.sirius.server.diagram 6.2.1-SNAPSHOT ... SUCCESS [  0.168 s]
13:02:25 [INFO] org.eclipse.sirius.server.frontend 6.2.1-SNAPSHOT .. SUCCESS [  0.131 s]
13:02:25 [INFO] org.eclipse.sirius.server.frontend.workflow 6.2.1-SNAPSHOT SUCCESS [  0.147 s]
13:02:25 [INFO] org.eclipse.sirius.server.graphql 6.2.1-SNAPSHOT ... SUCCESS [  0.095 s]
13:02:25 [INFO] org.eclipse.sirius.tests.server 6.2.1-SNAPSHOT ..... SUCCESS [  2.794 s]
13:02:25 [INFO] org.eclipse.sirius.tests.services.graphql 6.2.1-SNAPSHOT SUCCESS [  5.645 s]
13:02:25 [INFO] org.eclipse.sirius.server.feature 6.2.1-SNAPSHOT ... SUCCESS [  0.106 s]
13:02:25 [INFO] org.eclipse.sirius.server.product.feature 6.2.1-SNAPSHOT SUCCESS [  0.059 s]
13:02:25 [INFO] org.eclipse.sirius.server.product 6.2.1-SNAPSHOT ... SUCCESS [ 11.192 s]
13:02:25 [INFO] org.eclipse.sirius.ext.draw2d 6.2.1-SNAPSHOT ....... SUCCESS [  0.072 s]
13:02:25 [INFO] org.eclipse.sirius.ext.e3.ui 6.2.1-SNAPSHOT ........ SUCCESS [  0.136 s]
13:02:25 [INFO] org.eclipse.sirius.ext.emf.ui 6.2.1-SNAPSHOT ....... SUCCESS [  0.069 s]
13:02:25 [INFO] org.eclipse.sirius.ext.gef 6.2.1-SNAPSHOT .......... SUCCESS [  0.096 s]
13:02:25 [INFO] org.eclipse.sirius.ext.gmf.runtime 6.2.1-SNAPSHOT .. SUCCESS [  0.167 s]
13:02:25 [INFO] org.eclipse.sirius.ext.jface 6.2.1-SNAPSHOT ........ SUCCESS [  0.064 s]
13:02:25 [INFO] org.eclipse.sirius.ext.swt 6.2.1-SNAPSHOT .......... SUCCESS [  0.046 s]
13:02:25 [INFO] org.eclipse.sirius.common.acceleo.aql.ide 6.2.1-SNAPSHOT SUCCESS [  0.152 s]
13:02:25 [INFO] org.eclipse.sirius.common.acceleo.mtl.ide 6.2.1-SNAPSHOT SUCCESS [  0.169 s]
13:02:25 [INFO] org.eclipse.sirius.common.ui 6.2.1-SNAPSHOT ........ SUCCESS [  0.335 s]
13:02:25 [INFO] org.eclipse.sirius.common.ui.ext 6.2.1-SNAPSHOT .... SUCCESS [  0.096 s]
13:02:25 [INFO] org.eclipse.sirius.common.xtext 6.2.1-SNAPSHOT ..... SUCCESS [  0.153 s]
13:02:25 [INFO] org.eclipse.sirius.ui 6.2.1-SNAPSHOT ............... SUCCESS [  1.152 s]
13:02:25 [INFO] org.eclipse.sirius.diagram.ui 6.2.1-SNAPSHOT ....... SUCCESS [  2.802 s]
13:02:25 [INFO] org.eclipse.sirius.diagram.elk 6.2.1-SNAPSHOT ...... SUCCESS [  0.209 s]
13:02:25 [INFO] org.eclipse.sirius.diagram.ui.ext 6.2.1-SNAPSHOT ... SUCCESS [  0.170 s]
13:02:25 [INFO] org.eclipse.sirius.diagram.sequence 6.2.1-SNAPSHOT . SUCCESS [  0.724 s]
13:02:25 [INFO] org.eclipse.sirius.diagram.sequence.edit 6.2.1-SNAPSHOT SUCCESS [  0.253 s]
13:02:25 [INFO] org.eclipse.sirius.diagram.sequence.ui 6.2.1-SNAPSHOT SUCCESS [  0.475 s]
13:02:25 [INFO] org.eclipse.sirius.doc 6.2.1-SNAPSHOT .............. SUCCESS [  0.861 s]
13:02:25 [INFO] org.eclipse.sirius.editor 6.2.1-SNAPSHOT ........... SUCCESS [  0.933 s]
13:02:25 [INFO] org.eclipse.sirius.editor.diagram 6.2.1-SNAPSHOT ... SUCCESS [  0.733 s]
13:02:25 [INFO] org.eclipse.sirius.editor.sequence 6.2.1-SNAPSHOT .. SUCCESS [  0.367 s]
13:02:25 [INFO] org.eclipse.sirius.table.ui 6.2.1-SNAPSHOT ......... SUCCESS [  0.579 s]
13:02:25 [INFO] org.eclipse.sirius.editor.table 6.2.1-SNAPSHOT ..... SUCCESS [  0.288 s]
13:02:25 [INFO] org.eclipse.sirius.tree.ui 6.2.1-SNAPSHOT .......... SUCCESS [  0.307 s]
13:02:25 [INFO] org.eclipse.sirius.editor.tree 6.2.1-SNAPSHOT ...... SUCCESS [  0.216 s]
13:02:25 [INFO] org.eclipse.sirius.editor.workflow 6.2.1-SNAPSHOT .. SUCCESS [  0.211 s]
13:02:25 [INFO] org.eclipse.sirius.eef.adapters 6.2.1-SNAPSHOT ..... SUCCESS [  0.193 s]
13:02:25 [INFO] org.eclipse.sirius.interpreter 6.2.1-SNAPSHOT ...... SUCCESS [  0.185 s]
13:02:25 [INFO] org.eclipse.sirius.table.ui.ext 6.2.1-SNAPSHOT ..... SUCCESS [  0.097 s]
13:02:25 [INFO] org.eclipse.sirius.tree.ui.ext 6.2.1-SNAPSHOT ...... SUCCESS [  0.094 s]
13:02:25 [INFO] org.eclipse.sirius.ui.ext 6.2.1-SNAPSHOT ........... SUCCESS [  0.097 s]
13:02:25 [INFO] org.eclipse.sirius.ui.editor 6.2.1-SNAPSHOT ........ SUCCESS [  0.170 s]
13:02:25 [INFO] org.eclipse.sirius.tests.junit.support 6.2.1-SNAPSHOT SUCCESS [  0.276 s]
13:02:25 [INFO] org.eclipse.sirius.tests.swtbot.support 6.2.1-SNAPSHOT SUCCESS [  0.505 s]
13:02:25 [INFO] org.eclipse.sirius.workflow.edit 6.2.1-SNAPSHOT .... SUCCESS [  0.131 s]
13:02:25 [INFO] org.eclipse.sirius.sample.basicfamily 1.0.0-SNAPSHOT SUCCESS [  0.076 s]
13:02:25 [INFO] org.eclipse.sirius.sample.basicfamily.edit 1.0.0-SNAPSHOT SUCCESS [  0.077 s]
13:02:25 [INFO] org.eclipse.sirius.sample.basicfamily.editor 1.0.0-SNAPSHOT SUCCESS [  0.132 s]
13:02:25 [INFO] org.eclipse.sirius.sample.basicfamily.design 1.0.0-SNAPSHOT SUCCESS [  0.078 s]
13:02:25 [INFO] org.eclipse.sirius.samples.family 6.2.1-SNAPSHOT ... SUCCESS [  0.091 s]
13:02:25 [INFO] org.eclipse.sirius.common.interpreter.aql 6.2.1-SNAPSHOT SUCCESS [  0.072 s]
13:02:25 [INFO] org.eclipse.sirius.properties 6.2.1-SNAPSHOT ....... SUCCESS [  0.398 s]
13:02:25 [INFO] org.eclipse.sirius.properties.edit 6.2.1-SNAPSHOT .. SUCCESS [  0.321 s]
13:02:25 [INFO] org.eclipse.sirius.properties.ext.widgets.reference 6.2.1-SNAPSHOT SUCCESS [  0.103 s]
13:02:25 [INFO] org.eclipse.sirius.properties.ext.widgets.reference.edit 6.2.1-SNAPSHOT SUCCESS [  0.133 s]
13:02:25 [INFO] org.eclipse.sirius.properties.defaultrules 6.2.1-SNAPSHOT SUCCESS [  0.075 s]
13:02:25 [INFO] org.eclipse.sirius.properties.core 6.2.1-SNAPSHOT .. SUCCESS [  0.227 s]
13:02:25 [INFO] org.eclipse.sirius.editor.properties 6.2.1-SNAPSHOT  SUCCESS [  0.780 s]
13:02:25 [INFO] org.eclipse.sirius.editor.properties.ext.widgets.reference 6.2.1-SNAPSHOT SUCCESS [  0.179 s]
13:02:25 [INFO] org.eclipse.sirius.ui.properties 6.2.1-SNAPSHOT .... SUCCESS [  0.179 s]
13:02:25 [INFO] org.eclipse.sirius.ui.properties.ext.widgets.reference 6.2.1-SNAPSHOT SUCCESS [  0.111 s]
13:02:25 [INFO] org.eclipse.sirius.sample.properties 6.2.1-SNAPSHOT  SUCCESS [  0.089 s]
13:02:25 [INFO] org.eclipse.sirius.sample.properties.checkbox 6.2.1-SNAPSHOT SUCCESS [  0.072 s]
13:02:25 [INFO] org.eclipse.sirius.sample.properties.radio 6.2.1-SNAPSHOT SUCCESS [  0.129 s]
13:02:25 [INFO] org.eclipse.sirius.sample.properties.textarea 6.2.1-SNAPSHOT SUCCESS [  0.074 s]
13:02:25 [INFO] org.eclipse.sirius.tests.ui.properties 6.2.1-SNAPSHOT SUCCESS [ 13.571 s]
13:02:25 [INFO] org.eclipse.sirius.workflow.ui.page 6.2.1-SNAPSHOT . SUCCESS [  0.122 s]
13:02:25 [INFO] org.eclipse.sirius.server.ui.autostart 6.2.1-SNAPSHOT SUCCESS [  0.091 s]
13:02:25 [INFO] org.eclipse.sirius.aql 6.2.1-SNAPSHOT .............. SUCCESS [  0.055 s]
13:02:25 [INFO] org.eclipse.sirius.doc.feature 6.2.1-SNAPSHOT ...... SUCCESS [  0.036 s]
13:02:25 [INFO] org.eclipse.sirius.runtime.ide.eef 6.2.1-SNAPSHOT .. SUCCESS [  0.064 s]
13:02:25 [INFO] org.eclipse.sirius.runtime.ide.ui.acceleo 6.2.1-SNAPSHOT SUCCESS [  0.035 s]
13:02:25 [INFO] org.eclipse.sirius.runtime.ide.ui 6.2.1-SNAPSHOT ... SUCCESS [  0.222 s]
13:02:25 [INFO] org.eclipse.sirius.runtime.ide.xtext 6.2.1-SNAPSHOT  SUCCESS [  0.053 s]
13:02:25 [INFO] org.eclipse.sirius.samples 6.2.1-SNAPSHOT .......... SUCCESS [  0.091 s]
13:02:25 [INFO] org.eclipse.sirius.specifier 6.2.1-SNAPSHOT ........ SUCCESS [  0.337 s]
13:02:25 [INFO] org.eclipse.sirius.specifier.ide.ui.acceleo 6.2.1-SNAPSHOT SUCCESS [  0.040 s]
13:02:25 [INFO] org.eclipse.sirius.specifier.ide.ui.aql 6.2.1-SNAPSHOT SUCCESS [  0.036 s]
13:02:25 [INFO] org.eclipse.sirius.specifier.ide.ui 6.2.1-SNAPSHOT . SUCCESS [  0.072 s]
13:02:25 [INFO] org.eclipse.sirius.tests.support 6.2.1-SNAPSHOT .... SUCCESS [  0.055 s]
13:02:25 [INFO] org.eclipse.sirius.interpreter.feature 6.2.1-SNAPSHOT SUCCESS [  0.048 s]
13:02:25 [INFO] org.eclipse.sirius.properties.feature 6.2.1-SNAPSHOT SUCCESS [  0.074 s]
13:02:25 [INFO] org.eclipse.sirius.specifier.properties.feature 6.2.1-SNAPSHOT SUCCESS [  0.061 s]
13:02:25 [INFO] org.eclipse.sirius.samples.properties.feature 6.2.1-SNAPSHOT SUCCESS [  0.573 s]
13:02:25 [INFO] org.eclipse.sirius.workflow.feature 6.2.1-SNAPSHOT . SUCCESS [  0.087 s]
13:02:25 [INFO] org.eclipse.sirius.diagram.elk.feature 6.2.1-SNAPSHOT SUCCESS [  0.064 s]
13:02:25 [INFO] org.eclipse.sirius.server.ui.autostart.feature 6.2.1-SNAPSHOT SUCCESS [  0.055 s]
13:02:25 [INFO] org.eclipse.sirius.sample.basicfamily.feature 6.2.1-SNAPSHOT SUCCESS [  0.043 s]
13:02:25 [INFO] org.eclipse.sirius.sample.ecore.design 6.2.1-SNAPSHOT SUCCESS [  0.196 s]
13:02:25 [INFO] org.eclipse.sirius.sample.interactions 6.2.1-SNAPSHOT SUCCESS [  0.141 s]
13:02:25 [INFO] org.eclipse.sirius.sample.interactions.design 6.2.1-SNAPSHOT SUCCESS [  0.162 s]
13:02:25 [INFO] org.eclipse.sirius.sample.interactions.edit 6.2.1-SNAPSHOT SUCCESS [  0.101 s]
13:02:25 [INFO] org.eclipse.sirius.sample.interactions.editor 6.2.1-SNAPSHOT SUCCESS [  0.163 s]
13:02:25 [INFO] org.eclipse.sirius.tests.sample.benchmark 6.2.1-SNAPSHOT SUCCESS [  0.093 s]
13:02:25 [INFO] org.eclipse.sirius.tests.sample.docbook 6.2.1-SNAPSHOT SUCCESS [  0.112 s]
13:02:25 [INFO] org.eclipse.sirius.tests.sample.docbook.design 6.2.1-SNAPSHOT SUCCESS [  0.083 s]
13:02:25 [INFO] org.eclipse.sirius.tests.sample.migration 6.2.1-SNAPSHOT SUCCESS [  0.228 s]
13:02:25 [INFO] org.eclipse.sirius.tests.sample.migration.design 6.2.1-SNAPSHOT SUCCESS [  0.189 s]
13:02:25 [INFO] org.eclipse.sirius.tests.sample.component 6.2.1-SNAPSHOT SUCCESS [  0.091 s]
13:02:25 [INFO] org.eclipse.sirius.tests.sample.scxml 6.2.1-SNAPSHOT SUCCESS [  0.233 s]
13:02:25 [INFO] org.eclipse.sirius.tests.sample.scxml.design 6.2.1-SNAPSHOT SUCCESS [  0.119 s]
13:02:25 [INFO] org.eclipse.sirius.tests.sample.component.design 6.2.1-SNAPSHOT SUCCESS [  0.202 s]
13:02:25 [INFO] org.eclipse.sirius.tests.junit 6.2.1-SNAPSHOT ...... FAILURE [03:18 min]
13:02:25 [INFO] org.eclipse.sirius.tests.tree 6.2.1-SNAPSHOT ....... SKIPPED
13:02:25 [INFO] org.eclipse.sirius.tests.swtbot 6.2.1-SNAPSHOT ..... SKIPPED
13:02:25 [INFO] org.eclipse.sirius.tests 6.2.1-SNAPSHOT ............ SKIPPED
13:02:25 [INFO] org.eclipse.sirius.tests.rcptt.properties 6.2.1-SNAPSHOT SKIPPED
13:02:25 [INFO] org.eclipse.sirius.tests.rcptt.properties.edit 6.2.1-SNAPSHOT SKIPPED
13:02:25 [INFO] org.eclipse.sirius.tests.rcptt.properties.editor 6.2.1-SNAPSHOT SKIPPED
13:02:25 [INFO] org.eclipse.sirius.tests.rcptt.properties.samples 6.2.1-SNAPSHOT SKIPPED
13:02:25 [INFO] org.eclipse.sirius.tests.rcptt.feature 6.2.1-SNAPSHOT SKIPPED
13:02:25 [INFO] org.eclipse.sirius.update 6.2.1-SNAPSHOT ........... SKIPPED
13:02:25 [INFO] org.eclipse.sirius.sample.basicfamily.update 6.2.1-SNAPSHOT SKIPPED
13:02:25 [INFO] org.eclipse.sirius.tests.sample.docbook.edit 6.2.1-SNAPSHOT SKIPPED
13:02:25 [INFO] org.eclipse.sirius.tests.sample.docbook.editor 6.2.1-SNAPSHOT SKIPPED
13:02:25 [INFO] org.eclipse.sirius.tests.sample.xtext.statemachine 6.2.1-SNAPSHOT SKIPPED
13:02:25 [INFO] org.eclipse.sirius.tests.sample.xtext.statemachine.ide 6.2.1-SNAPSHOT SKIPPED
13:02:25 [INFO] org.eclipse.sirius.tests.sample.xtext.statemachine.ui 6.2.1-SNAPSHOT SKIPPED
13:02:25 [INFO] org.eclipse.sirius.tests.sample.xtext.statemachine.design 6.2.1-SNAPSHOT SKIPPED
13:02:25 [INFO] org.eclipse.sirius.tests.junit.xtext 6.2.1-SNAPSHOT  SKIPPED
13:02:25 [INFO] org.eclipse.sirius.tests.update 6.2.1-SNAPSHOT ..... SKIPPED
13:02:25 [INFO] ------------------------------------------------------------------------
13:02:25 [INFO] BUILD FAILURE
13:02:25 [INFO] ------------------------------------------------------------------------
13:02:25 [INFO] Total time:  08:19 min
13:02:25 [INFO] Finished at: 2019-06-24T13:02:25Z
13:02:25 [INFO] ------------------------------------------------------------------------
13:02:25 [ERROR] Failed to execute goal org.eclipse.tycho:tycho-surefire-plugin:1.4.0:test (default-test) on project org.eclipse.sirius.tests.junit: An unexpected error occured while launching the test runtime (return code 137). See log /home/jenkins/workspace/sirius.sonar-master/plugins/org.eclipse.sirius.tests.junit/target/work/data/.metadata/.log for details. -> [Help 1]
13:02:25 [ERROR] 
13:02:25 [ERROR] To see the full stack trace of the errors, re-run Maven with the -e switch.
13:02:25 [ERROR] Re-run Maven using the -X switch to enable full debug logging.
13:02:25 [ERROR] 
13:02:25 [ERROR] For more information about the errors and possible solutions, please read the following articles:
13:02:25 [ERROR] [Help 1] http://cwiki.apache.org/confluence/display/MAVEN/MojoFailureException
13:02:25 [ERROR] 
13:02:25 [ERROR] After correcting the problems, you can resume the build with the command
13:02:25 [ERROR]   mvn <goals> -rf :org.eclipse.sirius.tests.junit
13:02:26 Build step 'Invoke top-level Maven targets' marked build as failure
13:02:26 Terminating xvnc.
13:04:28 Skipping sonar analysis due to bad build status FAILURE
13:04:28 Recording test results
13:04:29 Archiving artifacts
13:04:34 Finished: FAILURE