FailedConsole Output

12:50:42 Started by user Arthur van Dorp
12:50:42 Running as Arthur van Dorp
12:50:42 Agent basic-8d1cc is provisioned from template basic
12:50:42 ---
12:50:42 apiVersion: "v1"
12:50:42 kind: "Pod"
12:50:42 metadata:
12:50:42   annotations: {}
12:50:42   labels:
12:50:42     jenkins: "slave"
12:50:42     jenkins/label: ""
12:50:42   name: "basic-8d1cc"
12:50:42 spec:
12:50:42   containers:
12:50:42   - env:
12:50:42     - name: "JENKINS_SECRET"
12:50:42       value: "********"
12:50:42     - name: "JENKINS_TUNNEL"
12:50:42       value: "jenkins-discovery.scout.svc.cluster.local:50000"
12:50:42     - name: "JENKINS_AGENT_NAME"
12:50:42       value: "basic-8d1cc"
12:50:42     - name: "JENKINS_REMOTING_JAVA_OPTS"
12:50:42       value: "-showversion -XshowSettings:vm -Xmx256m -Dorg.jenkinsci.remoting.engine.JnlpProtocol3.disabled=true\
12:50:42         \ -Dorg.jenkinsci.plugins.gitclient.CliGitAPIImpl.useSETSID=true"
12:50:42     - name: "JAVA_TOOL_OPTIONS"
12:50:42       value: ""
12:50:42     - name: "_JAVA_OPTIONS"
12:50:42       value: ""
12:50:42     - name: "OPENJ9_JAVA_OPTIONS"
12:50:42       value: "-XX:+IgnoreUnrecognizedVMOptions -XX:+IdleTuningCompactOnIdle -XX:+IdleTuningGcOnIdle"
12:50:42     - name: "JENKINS_NAME"
12:50:42       value: "basic-8d1cc"
12:50:42     - name: "JENKINS_AGENT_WORKDIR"
12:50:42       value: "/home/jenkins/agent"
12:50:42     - name: "JENKINS_URL"
12:50:42       value: "http://jenkins-ui.scout.svc.cluster.local/scout/"
12:50:42     image: "docker.io/eclipsecbi/jiro-agent-basic:remoting-4.5"
12:50:42     imagePullPolicy: "Always"
12:50:42     name: "jnlp"
12:50:42     resources:
12:50:42       limits:
12:50:42         memory: "4096Mi"
12:50:42         cpu: "2000m"
12:50:42       requests:
12:50:42         memory: "4096Mi"
12:50:42         cpu: "1000m"
12:50:42     securityContext:
12:50:42       privileged: false
12:50:42     tty: true
12:50:42     volumeMounts:
12:50:42     - mountPath: "/home/jenkins/.m2/toolchains.xml"
12:50:42       name: "m2-dir"
12:50:42       readOnly: true
12:50:42       subPath: "toolchains.xml"
12:50:42     - mountPath: "/home/jenkins/.mavenrc"
12:50:42       name: "m2-dir"
12:50:42       readOnly: true
12:50:42       subPath: ".mavenrc"
12:50:42     - mountPath: "/opt/tools"
12:50:42       name: "volume-0"
12:50:42       readOnly: false
12:50:42     - mountPath: "/home/jenkins"
12:50:42       name: "volume-2"
12:50:42       readOnly: false
12:50:42     - mountPath: "/home/jenkins/.m2/repository"
12:50:42       name: "volume-3"
12:50:42       readOnly: false
12:50:42     - mountPath: "/home/jenkins/.m2/settings-security.xml"
12:50:42       name: "m2-secret-dir"
12:50:42       readOnly: true
12:50:42       subPath: "settings-security.xml"
12:50:42     - mountPath: "/home/jenkins/.m2/wrapper"
12:50:42       name: "volume-4"
12:50:42       readOnly: false
12:50:42     - mountPath: "/home/jenkins/.m2/settings.xml"
12:50:42       name: "m2-secret-dir"
12:50:42       readOnly: true
12:50:42       subPath: "settings.xml"
12:50:42     - mountPath: "/home/jenkins/.ssh"
12:50:42       name: "volume-1"
12:50:42       readOnly: false
12:50:42     - mountPath: "/home/jenkins/agent"
12:50:42       name: "workspace-volume"
12:50:42       readOnly: false
12:50:42     workingDir: "/home/jenkins/agent"
12:50:42   nodeSelector:
12:50:42     beta.kubernetes.io/os: "linux"
12:50:42   restartPolicy: "Never"
12:50:42   securityContext: {}
12:50:42   volumes:
12:50:42   - name: "volume-0"
12:50:42     persistentVolumeClaim:
12:50:42       claimName: "tools-claim-jiro-scout"
12:50:42       readOnly: true
12:50:42   - name: "m2-secret-dir"
12:50:42     secret:
12:50:42       secretName: "m2-secret-dir"
12:50:42   - emptyDir:
12:50:42       medium: ""
12:50:42     name: "volume-2"
12:50:42   - configMap:
12:50:42       name: "m2-dir"
12:50:42     name: "m2-dir"
12:50:42   - configMap:
12:50:42       name: "known-hosts"
12:50:42     name: "volume-1"
12:50:42   - emptyDir:
12:50:42       medium: ""
12:50:42     name: "workspace-volume"
12:50:42   - emptyDir:
12:50:42       medium: ""
12:50:42     name: "volume-4"
12:50:42   - emptyDir:
12:50:42       medium: ""
12:50:42     name: "volume-3"
12:50:42 
12:50:42 Building remotely on basic-8d1cc in workspace /home/jenkins/agent/workspace/org.eclipse.scout.sdk_deploy_from_tag_10
12:50:42 [ssh-agent] Looking for ssh-agent implementation...
12:50:42 [ssh-agent]   Exec ssh-agent (binary ssh-agent on a remote machine)
12:50:42 $ ssh-agent
12:50:42 SSH_AUTH_SOCK=/tmp/ssh-8qlvVM4stNyZ/agent.60
12:50:42 SSH_AGENT_PID=62
12:50:42 [ssh-agent] Started.
12:50:42 Running ssh-add (command line suppressed)
12:50:42 Identity added: /home/jenkins/agent/workspace/org.eclipse.scout.sdk_deploy_from_tag_10@tmp/private_key_13821325867097098009.key (/home/jenkins/agent/workspace/org.eclipse.scout.sdk_deploy_from_tag_10@tmp/private_key_13821325867097098009.key)
12:50:42 [ssh-agent] Using credentials genie.scout (ssh://genie.scout@projects-storage.eclipse.org)
12:50:42 The recommended git tool is: NONE
12:50:43 No credentials specified
12:50:44 Cloning the remote Git repository
12:50:44 Cloning repository git://git.eclipse.org/gitroot/scout/org.eclipse.scout.sdk.git
12:50:44  > git init /home/jenkins/agent/workspace/org.eclipse.scout.sdk_deploy_from_tag_10 # timeout=10
12:50:44 Fetching upstream changes from git://git.eclipse.org/gitroot/scout/org.eclipse.scout.sdk.git
12:50:44  > git --version # timeout=10
12:50:44  > git --version # 'git version 2.26.2'
12:50:44  > git fetch --tags --force --progress -- git://git.eclipse.org/gitroot/scout/org.eclipse.scout.sdk.git +refs/heads/*:refs/remotes/origin/* # timeout=10
12:50:47  > git config remote.origin.url git://git.eclipse.org/gitroot/scout/org.eclipse.scout.sdk.git # timeout=10
12:50:47  > git config --add remote.origin.fetch +refs/heads/*:refs/remotes/origin/* # timeout=10
12:50:47 Avoid second fetch
12:50:47  > git rev-parse origin/11.0.3^{commit} # timeout=10
12:50:48  > git rev-parse 11.0.3^{commit} # timeout=10
12:50:48 Checking out Revision e306a50b059c332d1d8c83a446e665b4601c88b3 (11.0.3)
12:50:48  > git config core.sparsecheckout # timeout=10
12:50:48  > git checkout -f e306a50b059c332d1d8c83a446e665b4601c88b3 # timeout=10
12:50:51 Commit message: "[release] Version 11.0.3"
12:50:51 First time build. Skipping changelog.
12:50:52 [org.eclipse.scout.sdk_deploy_from_tag_10] $ /opt/tools/apache-maven/latest/bin/mvn -f org.eclipse.scout.sdk/pom.xml -DbuildId=3 -Dtag=11.0.3 -DstageTargetDir=releases/11.0/ -Dmaven.repo.local=/home/jenkins/agent/workspace/org.eclipse.scout.sdk_deploy_from_tag_10/.repository clean install -Dmaven.test.skip=true
12:50:52 Apache Maven 3.6.3 (cecedd343002696d0abb50b32b541b8a6ba2883f)
12:50:52 Maven home: /opt/tools/apache-maven/latest
12:50:52 Java version: 1.8.0_202, vendor: Oracle Corporation, runtime: /opt/tools/java/oracle/jdk-8/1.8.0_202/jre
12:50:52 Default locale: en_US, platform encoding: UTF-8
12:50:52 OS name: "linux", version: "3.10.0-1062.el7.x86_64", arch: "amd64", family: "unix"
12:50:53 [INFO] Scanning for projects...
12:51:05 [INFO] ------------------------------------------------------------------------
12:51:05 [INFO] Reactor Build Order:
12:51:05 [INFO] 
12:51:05 [INFO] Scout Hello World Sample Application                   [maven-archetype]
12:51:05 [INFO] Scout JaxWs Module                                     [maven-archetype]
12:51:05 [INFO] ScoutJS Sample Application                             [maven-archetype]
12:51:05 [INFO] Eclipse Scout SDK                                                  [pom]
12:51:05 [INFO] org.eclipse.scout.sdk:org.eclipse.scout.sdk.core                   [jar]
12:51:05 [INFO] org.eclipse.scout.sdk:org.eclipse.scout.sdk.core.ecj               [jar]
12:51:05 [INFO] org.eclipse.scout.sdk:org.eclipse.scout.sdk.core.test              [jar]
12:51:05 [INFO] org.eclipse.scout.sdk:org.eclipse.scout.sdk.core.s                 [jar]
12:51:05 [INFO] org.eclipse.scout.sdk:org.eclipse.scout.sdk.core.s.test            [jar]
12:51:05 [INFO] org.eclipse.scout.sdk.s2e:org.eclipse.scout.sdk.s2e             [bundle]
12:51:05 [INFO] org.eclipse.scout.sdk.s2e:org.eclipse.scout.sdk.s2e.test           [jar]
12:51:05 [INFO] org.eclipse.scout.sdk.s2e:org.eclipse.scout.sdk.s2e.doc         [bundle]
12:51:05 [INFO] org.eclipse.scout.sdk.s2e:org.eclipse.scout.sdk.s2e.ui          [bundle]
12:51:05 [INFO] 
12:51:05 [INFO] ---------< org.eclipse.scout.archetypes:scout-helloworld-app >----------
12:51:05 [INFO] Building Scout Hello World Sample Application 11.0.3              [1/13]
12:51:05 [INFO] --------------------------[ maven-archetype ]---------------------------
12:51:08 [INFO] 
12:51:08 [INFO] --- maven-clean-plugin:3.1.0:clean (default-clean) @ scout-helloworld-app ---
12:51:08 [INFO] 
12:51:08 [INFO] --- maven-enforcer-plugin:3.0.0-M3:enforce (enforce-rules) @ scout-helloworld-app ---
12:51:10 [WARNING] Rule 2: org.apache.maven.plugins.enforcer.RequireJavaVersion failed with message:
12:51:10 To build this project JDK 11 (or upper) is required. Please install it.
12:51:10 [INFO] ------------------------------------------------------------------------
12:51:10 [INFO] Reactor Summary for Eclipse Scout SDK 11.0.3:
12:51:10 [INFO] 
12:51:10 [INFO] Scout Hello World Sample Application ............... FAILURE [  4.593 s]
12:51:10 [INFO] Scout JaxWs Module ................................. SKIPPED
12:51:10 [INFO] ScoutJS Sample Application ......................... SKIPPED
12:51:10 [INFO] Eclipse Scout SDK .................................. SKIPPED
12:51:10 [INFO] org.eclipse.scout.sdk:org.eclipse.scout.sdk.core ... SKIPPED
12:51:10 [INFO] org.eclipse.scout.sdk:org.eclipse.scout.sdk.core.ecj SKIPPED
12:51:10 [INFO] org.eclipse.scout.sdk:org.eclipse.scout.sdk.core.test SKIPPED
12:51:10 [INFO] org.eclipse.scout.sdk:org.eclipse.scout.sdk.core.s . SKIPPED
12:51:10 [INFO] org.eclipse.scout.sdk:org.eclipse.scout.sdk.core.s.test SKIPPED
12:51:10 [INFO] org.eclipse.scout.sdk.s2e:org.eclipse.scout.sdk.s2e  SKIPPED
12:51:10 [INFO] org.eclipse.scout.sdk.s2e:org.eclipse.scout.sdk.s2e.test SKIPPED
12:51:10 [INFO] org.eclipse.scout.sdk.s2e:org.eclipse.scout.sdk.s2e.doc SKIPPED
12:51:10 [INFO] org.eclipse.scout.sdk.s2e:org.eclipse.scout.sdk.s2e.ui SKIPPED
12:51:10 [INFO] ------------------------------------------------------------------------
12:51:10 [INFO] BUILD FAILURE
12:51:10 [INFO] ------------------------------------------------------------------------
12:51:10 [INFO] Total time:  16.867 s
12:51:10 [INFO] Finished at: 2021-02-02T17:51:10Z
12:51:10 [INFO] ------------------------------------------------------------------------
12:51:10 [ERROR] Failed to execute goal org.apache.maven.plugins:maven-enforcer-plugin:3.0.0-M3:enforce (enforce-rules) on project scout-helloworld-app: Some Enforcer rules have failed. Look above for specific messages explaining why the rule failed. -> [Help 1]
12:51:10 [ERROR] 
12:51:10 [ERROR] To see the full stack trace of the errors, re-run Maven with the -e switch.
12:51:10 [ERROR] Re-run Maven using the -X switch to enable full debug logging.
12:51:10 [ERROR] 
12:51:10 [ERROR] For more information about the errors and possible solutions, please read the following articles:
12:51:10 [ERROR] [Help 1] http://cwiki.apache.org/confluence/display/MAVEN/MojoExecutionException
12:51:10 Build step 'Invoke top-level Maven targets' marked build as failure
12:51:10 $ ssh-agent -k
12:51:10 unset SSH_AUTH_SOCK;
12:51:10 unset SSH_AGENT_PID;
12:51:10 echo Agent pid 62 killed;
12:51:10 [ssh-agent] Stopped.
12:51:11 Archiving artifacts
12:51:11 Sending e-mails to: arthur.vandorp@bsi-software.com
12:51:12 Recording test results
12:51:12 ERROR: Step ‘Publish JUnit test result report’ failed: No test report files were found. Configuration error?
12:51:12 Triggering a new build of publish_staged_builds
12:51:12 Finished: FAILURE