FailedConsole Output

Skipping 206 KB.. Full Log
ava:51)
19:33:10 	at org.junit.platform.launcher.core.DefaultLauncher.execute(DefaultLauncher.java:248)
19:33:10 	at org.junit.platform.launcher.core.DefaultLauncher.lambda$execute$5(DefaultLauncher.java:211)
19:33:10 	at org.junit.platform.launcher.core.DefaultLauncher.withInterceptedStreams(DefaultLauncher.java:226)
19:33:10 	at org.junit.platform.launcher.core.DefaultLauncher.execute(DefaultLauncher.java:199)
19:33:10 	at org.junit.platform.launcher.core.DefaultLauncher.execute(DefaultLauncher.java:132)
19:33:10 	at org.apache.maven.surefire.junitplatform.JUnitPlatformProvider.invokeAllTests(JUnitPlatformProvider.java:142)
19:33:10 	at org.apache.maven.surefire.junitplatform.JUnitPlatformProvider.invoke(JUnitPlatformProvider.java:117)
19:33:10 	at org.apache.maven.surefire.booter.ForkedBooter.invokeProviderInSameClassLoader(ForkedBooter.java:384)
19:33:10 	at org.apache.maven.surefire.booter.ForkedBooter.runSuitesInProcess(ForkedBooter.java:345)
19:33:10 	at org.apache.maven.surefire.booter.ForkedBooter.execute(ForkedBooter.java:126)
19:33:10 	at org.apache.maven.surefire.booter.ForkedBooter.main(ForkedBooter.java:418)
19:33:10 2020-08-06 23:33:10.596 [SEVERE]  Failed to execute goal org.codehaus.mojo:exec-maven-plugin:1.6.0:exec (npm-update) on project artifact.ui.html: Command execution failed. Process exited with an error: 1 (Exit value: 1) -> [Help 1]
19:33:10 org.apache.maven.lifecycle.LifecycleExecutionException: Failed to execute goal org.codehaus.mojo:exec-maven-plugin:1.6.0:exec (npm-update) on project artifact.ui.html: Command execution failed.
19:33:10 	at org.apache.maven.lifecycle.internal.MojoExecutor.execute(MojoExecutor.java:215)
19:33:10 	at org.apache.maven.lifecycle.internal.MojoExecutor.execute(MojoExecutor.java:156)
19:33:10 	at org.apache.maven.lifecycle.internal.MojoExecutor.execute(MojoExecutor.java:148)
19:33:10 	at org.apache.maven.lifecycle.internal.LifecycleModuleBuilder.buildProject(LifecycleModuleBuilder.java:117)
19:33:10 	at org.apache.maven.lifecycle.internal.LifecycleModuleBuilder.buildProject(LifecycleModuleBuilder.java:81)
19:33:10 	at org.apache.maven.lifecycle.internal.builder.singlethreaded.SingleThreadedBuilder.build(SingleThreadedBuilder.java:56)
19:33:10 	at org.apache.maven.lifecycle.internal.LifecycleStarter.execute(LifecycleStarter.java:128)
19:33:10 	at org.apache.maven.DefaultMaven.doExecute(DefaultMaven.java:305)
19:33:10 	at org.apache.maven.DefaultMaven.doExecute(DefaultMaven.java:192)
19:33:10 	at org.apache.maven.DefaultMaven.execute(DefaultMaven.java:105)
19:33:10 	at org.apache.maven.cli.MavenCli.execute(MavenCli.java:957)
19:33:10 	at org.apache.maven.cli.MavenCli.doMain(MavenCli.java:289)
19:33:10 	at org.apache.maven.cli.MavenCli.doMain(MavenCli.java:244)
19:33:10 	at java.base/jdk.internal.reflect.NativeMethodAccessorImpl.invoke0(Native Method)
19:33:10 	at java.base/jdk.internal.reflect.NativeMethodAccessorImpl.invoke(NativeMethodAccessorImpl.java:62)
19:33:10 	at java.base/jdk.internal.reflect.DelegatingMethodAccessorImpl.invoke(DelegatingMethodAccessorImpl.java:43)
19:33:10 	at java.base/java.lang.reflect.Method.invoke(Method.java:566)
19:33:10 	at org.eclipse.scout.sdk.core.s.testing.maven.MavenCliRunner.runMavenInSandbox(MavenCliRunner.java:153)
19:33:10 	at org.eclipse.scout.sdk.core.s.testing.maven.MavenCliRunner.execute(MavenCliRunner.java:87)
19:33:10 	at org.eclipse.scout.sdk.core.s.testing.maven.MavenCliRunner.execute(MavenCliRunner.java:67)
19:33:10 	at org.eclipse.scout.sdk.core.s.util.maven.MavenRunner.execute(MavenRunner.java:76)
19:33:10 	at org.eclipse.scout.sdk.core.s.testing.CoreScoutTestingUtils.runMavenCommand(CoreScoutTestingUtils.java:246)
19:33:10 	at org.eclipse.scout.sdk.core.s.testing.CoreScoutTestingUtils.runMavenCleanTest(CoreScoutTestingUtils.java:223)
19:33:10 	at org.eclipse.scout.sdk.core.s.jaxws.WebServiceNewOperationTest.createWebService(WebServiceNewOperationTest.java:252)
19:33:10 	at org.eclipse.scout.sdk.core.s.jaxws.WebServiceNewOperationTest.createWebServiceProvider(WebServiceNewOperationTest.java:178)
19:33:10 	at org.eclipse.scout.sdk.core.s.jaxws.WebServiceUpdateOperationTest.lambda$1(WebServiceUpdateOperationTest.java:128)
19:33:10 	at org.eclipse.scout.sdk.core.s.testing.context.TestingEnvironmentBuilder.lambda$0(TestingEnvironmentBuilder.java:61)
19:33:10 	at org.eclipse.scout.sdk.core.s.testing.context.TestingEnvironmentBuilder.runInTestingEnvironment(TestingEnvironmentBuilder.java:77)
19:33:10 	at org.eclipse.scout.sdk.core.s.testing.context.TestingEnvironmentBuilder.lambda$2(TestingEnvironmentBuilder.java:71)
19:33:10 	at org.eclipse.scout.sdk.core.s.testing.context.TestingEnvironmentBuilder.lambda$3(TestingEnvironmentBuilder.java:82)
19:33:10 	at org.eclipse.scout.sdk.core.s.testing.context.TestingEnvironmentBuilder.lambda$1(TestingEnvironmentBuilder.java:71)
19:33:10 	at org.eclipse.scout.sdk.core.s.testing.context.TestingEnvironmentBuilder.lambda$3(TestingEnvironmentBuilder.java:82)
19:33:10 	at org.eclipse.scout.sdk.core.s.testing.context.TestingEnvironmentBuilder.call(TestingEnvironmentBuilder.java:70)
19:33:10 	at org.eclipse.scout.sdk.core.s.testing.context.TestingEnvironmentBuilder.run(TestingEnvironmentBuilder.java:60)
19:33:10 	at org.eclipse.scout.sdk.core.s.jaxws.WebServiceNewOperationTest.runCreateJaxWsModule(WebServiceNewOperationTest.java:129)
19:33:10 	at org.eclipse.scout.sdk.core.s.jaxws.WebServiceUpdateOperationTest.testUpdateWebServiceProvider(WebServiceUpdateOperationTest.java:68)
19:33:10 	at java.base/jdk.internal.reflect.NativeMethodAccessorImpl.invoke0(Native Method)
19:33:10 	at java.base/jdk.internal.reflect.NativeMethodAccessorImpl.invoke(NativeMethodAccessorImpl.java:62)
19:33:10 	at java.base/jdk.internal.reflect.DelegatingMethodAccessorImpl.invoke(DelegatingMethodAccessorImpl.java:43)
19:33:10 	at java.base/java.lang.reflect.Method.invoke(Method.java:566)
19:33:10 	at org.junit.platform.commons.util.ReflectionUtils.invokeMethod(ReflectionUtils.java:686)
19:33:10 	at org.junit.jupiter.engine.execution.MethodInvocation.proceed(MethodInvocation.java:60)
19:33:10 	at org.junit.jupiter.engine.execution.InvocationInterceptorChain$ValidatingInvocation.proceed(InvocationInterceptorChain.java:131)
19:33:10 	at org.junit.jupiter.engine.extension.TimeoutExtension.intercept(TimeoutExtension.java:149)
19:33:10 	at org.junit.jupiter.engine.extension.TimeoutExtension.interceptTestableMethod(TimeoutExtension.java:140)
19:33:10 	at org.junit.jupiter.engine.extension.TimeoutExtension.interceptTestMethod(TimeoutExtension.java:84)
19:33:10 	at org.junit.jupiter.engine.execution.ExecutableInvoker$ReflectiveInterceptorCall.lambda$ofVoidMethod$0(ExecutableInvoker.java:115)
19:33:10 	at org.junit.jupiter.engine.execution.ExecutableInvoker.lambda$invoke$0(ExecutableInvoker.java:105)
19:33:10 	at org.junit.jupiter.engine.execution.InvocationInterceptorChain$InterceptedInvocation.proceed(InvocationInterceptorChain.java:106)
19:33:10 	at org.junit.jupiter.engine.execution.InvocationInterceptorChain.proceed(InvocationInterceptorChain.java:64)
19:33:10 	at org.junit.jupiter.engine.execution.InvocationInterceptorChain.chainAndInvoke(InvocationInterceptorChain.java:45)
19:33:10 	at org.junit.jupiter.engine.execution.InvocationInterceptorChain.invoke(InvocationInterceptorChain.java:37)
19:33:10 	at org.junit.jupiter.engine.execution.ExecutableInvoker.invoke(ExecutableInvoker.java:104)
19:33:10 	at org.junit.jupiter.engine.execution.ExecutableInvoker.invoke(ExecutableInvoker.java:98)
19:33:10 	at org.junit.jupiter.engine.descriptor.TestMethodTestDescriptor.lambda$invokeTestMethod$6(TestMethodTestDescriptor.java:212)
19:33:10 	at org.junit.platform.engine.support.hierarchical.ThrowableCollector.execute(ThrowableCollector.java:73)
19:33:10 	at org.junit.jupiter.engine.descriptor.TestMethodTestDescriptor.invokeTestMethod(TestMethodTestDescriptor.java:208)
19:33:10 	at org.junit.jupiter.engine.descriptor.TestMethodTestDescriptor.execute(TestMethodTestDescriptor.java:137)
19:33:10 	at org.junit.jupiter.engine.descriptor.TestMethodTestDescriptor.execute(TestMethodTestDescriptor.java:71)
19:33:10 	at org.junit.platform.engine.support.hierarchical.NodeTestTask.lambda$executeRecursively$5(NodeTestTask.java:135)
19:33:10 	at org.junit.platform.engine.support.hierarchical.ThrowableCollector.execute(ThrowableCollector.java:73)
19:33:10 	at org.junit.platform.engine.support.hierarchical.NodeTestTask.lambda$executeRecursively$7(NodeTestTask.java:125)
19:33:10 	at org.junit.platform.engine.support.hierarchical.Node.around(Node.java:135)
19:33:10 	at org.junit.platform.engine.support.hierarchical.NodeTestTask.lambda$executeRecursively$8(NodeTestTask.java:123)
19:33:10 	at org.junit.platform.engine.support.hierarchical.ThrowableCollector.execute(ThrowableCollector.java:73)
19:33:10 	at org.junit.platform.engine.support.hierarchical.NodeTestTask.executeRecursively(NodeTestTask.java:122)
19:33:10 	at org.junit.platform.engine.support.hierarchical.NodeTestTask.execute(NodeTestTask.java:80)
19:33:10 	at java.base/java.util.ArrayList.forEach(ArrayList.java:1540)
19:33:10 	at org.junit.platform.engine.support.hierarchical.SameThreadHierarchicalTestExecutorService.invokeAll(SameThreadHierarchicalTestExecutorService.java:38)
19:33:10 	at org.junit.platform.engine.support.hierarchical.NodeTestTask.lambda$executeRecursively$5(NodeTestTask.java:139)
19:33:10 	at org.junit.platform.engine.support.hierarchical.ThrowableCollector.execute(ThrowableCollector.java:73)
19:33:10 	at org.junit.platform.engine.support.hierarchical.NodeTestTask.lambda$executeRecursively$7(NodeTestTask.java:125)
19:33:10 	at org.junit.platform.engine.support.hierarchical.Node.around(Node.java:135)
19:33:10 	at org.junit.platform.engine.support.hierarchical.NodeTestTask.lambda$executeRecursively$8(NodeTestTask.java:123)
19:33:10 	at org.junit.platform.engine.support.hierarchical.ThrowableCollector.execute(ThrowableCollector.java:73)
19:33:10 	at org.junit.platform.engine.support.hierarchical.NodeTestTask.executeRecursively(NodeTestTask.java:122)
19:33:10 	at org.junit.platform.engine.support.hierarchical.NodeTestTask.execute(NodeTestTask.java:80)
19:33:10 	at java.base/java.util.ArrayList.forEach(ArrayList.java:1540)
19:33:10 	at org.junit.platform.engine.support.hierarchical.SameThreadHierarchicalTestExecutorService.invokeAll(SameThreadHierarchicalTestExecutorService.java:38)
19:33:10 	at org.junit.platform.engine.support.hierarchical.NodeTestTask.lambda$executeRecursively$5(NodeTestTask.java:139)
19:33:10 	at org.junit.platform.engine.support.hierarchical.ThrowableCollector.execute(ThrowableCollector.java:73)
19:33:10 	at org.junit.platform.engine.support.hierarchical.NodeTestTask.lambda$executeRecursively$7(NodeTestTask.java:125)
19:33:10 	at org.junit.platform.engine.support.hierarchical.Node.around(Node.java:135)
19:33:10 	at org.junit.platform.engine.support.hierarchical.NodeTestTask.lambda$executeRecursively$8(NodeTestTask.java:123)
19:33:10 	at org.junit.platform.engine.support.hierarchical.ThrowableCollector.execute(ThrowableCollector.java:73)
19:33:10 	at org.junit.platform.engine.support.hierarchical.NodeTestTask.executeRecursively(NodeTestTask.java:122)
19:33:10 	at org.junit.platform.engine.support.hierarchical.NodeTestTask.execute(NodeTestTask.java:80)
19:33:10 	at org.junit.platform.engine.support.hierarchical.SameThreadHierarchicalTestExecutorService.submit(SameThreadHierarchicalTestExecutorService.java:32)
19:33:10 	at org.junit.platform.engine.support.hierarchical.HierarchicalTestExecutor.execute(HierarchicalTestExecutor.java:57)
19:33:10 	at org.junit.platform.engine.support.hierarchical.HierarchicalTestEngine.execute(HierarchicalTestEngine.java:51)
19:33:10 	at org.junit.platform.launcher.core.DefaultLauncher.execute(DefaultLauncher.java:248)
19:33:10 	at org.junit.platform.launcher.core.DefaultLauncher.lambda$execute$5(DefaultLauncher.java:211)
19:33:10 	at org.junit.platform.launcher.core.DefaultLauncher.withInterceptedStreams(DefaultLauncher.java:226)
19:33:10 	at org.junit.platform.launcher.core.DefaultLauncher.execute(DefaultLauncher.java:199)
19:33:10 	at org.junit.platform.launcher.core.DefaultLauncher.execute(DefaultLauncher.java:132)
19:33:10 	at org.apache.maven.surefire.junitplatform.JUnitPlatformProvider.invokeAllTests(JUnitPlatformProvider.java:142)
19:33:10 	at org.apache.maven.surefire.junitplatform.JUnitPlatformProvider.invoke(JUnitPlatformProvider.java:117)
19:33:10 	at org.apache.maven.surefire.booter.ForkedBooter.invokeProviderInSameClassLoader(ForkedBooter.java:384)
19:33:10 	at org.apache.maven.surefire.booter.ForkedBooter.runSuitesInProcess(ForkedBooter.java:345)
19:33:10 	at org.apache.maven.surefire.booter.ForkedBooter.execute(ForkedBooter.java:126)
19:33:10 	at org.apache.maven.surefire.booter.ForkedBooter.main(ForkedBooter.java:418)
19:33:10 Caused by: org.apache.maven.plugin.MojoExecutionException: Command execution failed.
19:33:10 	at org.codehaus.mojo.exec.ExecMojo.execute(ExecMojo.java:326)
19:33:10 	at org.apache.maven.plugin.DefaultBuildPluginManager.executeMojo(DefaultBuildPluginManager.java:137)
19:33:10 	at org.apache.maven.lifecycle.internal.MojoExecutor.execute(MojoExecutor.java:210)
19:33:10 	... 100 more
19:33:10 Caused by: org.apache.commons.exec.ExecuteException: Process exited with an error: 1 (Exit value: 1)
19:33:10 	at org.apache.commons.exec.DefaultExecutor.executeInternal(DefaultExecutor.java:404)
19:33:10 	at org.apache.commons.exec.DefaultExecutor.execute(DefaultExecutor.java:166)
19:33:10 	at org.codehaus.mojo.exec.ExecMojo.executeCommandLine(ExecMojo.java:804)
19:33:10 	at org.codehaus.mojo.exec.ExecMojo.executeCommandLine(ExecMojo.java:751)
19:33:10 	at org.codehaus.mojo.exec.ExecMojo.execute(ExecMojo.java:313)
19:33:10 	... 102 more
19:33:10 2020-08-06 23:33:10.597 [SEVERE]  
19:33:10 2020-08-06 23:33:10.598 [SEVERE]  Re-run Maven using the -X switch to enable full debug logging.
19:33:10 2020-08-06 23:33:10.598 [SEVERE]  
19:33:10 2020-08-06 23:33:10.598 [SEVERE]  For more information about the errors and possible solutions, please read the following articles:
19:33:10 2020-08-06 23:33:10.598 [SEVERE]  [Help 1] http://cwiki.apache.org/confluence/display/MAVEN/MojoExecutionException
19:33:10 2020-08-06 23:33:10.598 [SEVERE]  
19:33:10 2020-08-06 23:33:10.598 [SEVERE]  After correcting the problems, you can resume the build with the command
19:33:10 2020-08-06 23:33:10.598 [SEVERE]    mvn <args> -rf :artifact.ui.html
19:33:10 2020-08-06 23:33:10.603 [SEVERE]  Output of embedded Maven call:
19:33:10 MVN-BEGIN
19:33:10 2020-08-06 23:32:59,502 WARN  [main] org.eclipse.scout.testing.client.ClientSessionProviderWithCache.registerSessionForNotifications(ClientSessionProviderWithCache.java:164) - Failed to register session for notifications. - MDC[]
19:33:10 2020-08-06 23:32:59,504 WARN  [main] org.eclipse.scout.rt.client.AbstractClientSession.getUserAgent(AbstractClientSession.java:162) - UserAgent not set; using default [default=UNKNOWN|UNKNOWN|UNKNOWN|UNKNOWN|Linux] - MDC[]
19:33:10 
19:33:10 MVN-END
19:33:10 
19:33:15 2020-08-06 23:33:15.275 [WARNING] Don't override file /tmp/CoreScoutTestingUtils-projectDir2475828518740490179/artifact/artifact/pom.xml
19:33:15 2020-08-06 23:33:15.418 [WARNING] Don't override file /tmp/CoreScoutTestingUtils-projectDir2475828518740490179/artifact/artifact.ui.html/src/main/js/artifact.js
19:33:15 2020-08-06 23:33:15.418 [WARNING] Don't override file /tmp/CoreScoutTestingUtils-projectDir2475828518740490179/artifact/artifact.ui.html/src/main/js/index.js
19:33:15 2020-08-06 23:33:15.418 [WARNING] Don't override file /tmp/CoreScoutTestingUtils-projectDir2475828518740490179/artifact/artifact.ui.html/src/main/js/login.js
19:33:15 2020-08-06 23:33:15.418 [WARNING] Don't override file /tmp/CoreScoutTestingUtils-projectDir2475828518740490179/artifact/artifact.ui.html/src/main/js/logout.js
19:33:15 2020-08-06 23:33:15.423 [WARNING] Don't override file /tmp/CoreScoutTestingUtils-projectDir2475828518740490179/artifact/artifact.ui.html/src/main/resources/WebContent/favicon/manifest.json
19:33:15 2020-08-06 23:33:15.427 [WARNING] Don't override file /tmp/CoreScoutTestingUtils-projectDir2475828518740490179/artifact/artifact.ui.html/src/main/resources/WebContent/popup-window.js
19:33:20 2020-08-06 23:33:20.289 [WARNING] CP Don't override file /tmp/jaxws-module-tmp18218480306325533988/artifact.server.jaxws/src/main/resources/META-INF/scout.xml
19:34:27 2020-08-06 23:34:27.295 [WARNING] /tmp/CoreScoutTestingUtils-projectDir2475828518740490179/artifact/artifact.shared/src/main/java/group/artifact/shared/security/AccessControlService.java:[4] 
19:34:27 	import org.eclipse.scout.rt.security.IAccessControlService;
19:34:27 	       ^^^^^^^^^^^^^^^^^^^^^^^^^^^^^^^^^^^^^^^^^^^^^^^^^^^
19:34:27 The import org.eclipse.scout.rt.security.IAccessControlService is never used
19:34:27 2020-08-06 23:34:27.295 [WARNING] /tmp/CoreScoutTestingUtils-projectDir2475828518740490179/artifact/artifact.shared/src/main/java/group/artifact/shared/security/AccessControlService.java:[6] 
19:34:27 	import org.eclipse.scout.rt.shared.ISession;
19:34:27 	       ^^^^^^^^^^^^^^^^^^^^^^^^^^^^^^^^^^^^
19:34:27 The import org.eclipse.scout.rt.shared.ISession is never used
19:34:27 2 problems (2 warnings)
19:35:00 2020-08-06 23:35:00.215 [WARNING] /tmp/CoreScoutTestingUtils-projectDir2475828518740490179/artifact/artifact.server.jaxws/target/generated-sources/wsimport/test/consumer/multifile/ErrorResponse.java:[15] 
19:35:00 	public class ErrorResponse
19:35:00 	             ^^^^^^^^^^^^^
19:35:00 The serializable class ErrorResponse does not declare a static final serialVersionUID field of type long
19:35:00 2. WARNING: Annotation processing: Annotation processing started... [processor=JaxWsAnnotationProcessor]
19:35:00 3. WARNING: Annotation processing: Skipped entry point generation for endpoint interface 'test.consumer.multifile.IScoutQueryInterface2PortType' because not configured with WebServiceEntryPoint annotation. [processor=JaxWsAnnotationProcessor]
19:35:00 4. WARNING: Annotation processing: Annotation processing started... [processor=JaxWsAnnotationProcessor]
19:35:00 4 problems (4 warnings)
19:35:02 2020-08-06 23:35:02.474 [WARNING] /tmp/CoreScoutTestingUtils-projectDir2475828518740490179/artifact/artifact.client/src/main/java/group/artifact/client/ClientSession.java:[4] 
19:35:02 	import org.eclipse.scout.rt.client.IClientSession;
19:35:02 	       ^^^^^^^^^^^^^^^^^^^^^^^^^^^^^^^^^^^^^^^^^^
19:35:02 The import org.eclipse.scout.rt.client.IClientSession is never used
19:35:02 1 problem (1 warning)
19:35:02 2020-08-06 23:35:02.533 [WARNING] /tmp/CoreScoutTestingUtils-projectDir2475828518740490179/artifact/artifact.client/src/test/java/group/artifact/client/helloworld/HelloWorldFormTest.java:[8] 
19:35:02 	import group.artifact.client.helloworld.HelloWorldForm.MainBox.TopBox.MessageField;
19:35:02 	       ^^^^^^^^^^^^^^^^^^^^^^^^^^^^^^^^^^^^^^^^^^^^^^^^^^^^^^^^^^^^^^^^^^^^^^^^^^^
19:35:02 The import group.artifact.client.helloworld.HelloWorldForm.MainBox.TopBox.MessageField is never used
19:35:02 1 problem (1 warning)
19:35:16 2020-08-06 23:35:16.893 [SEVERE]  Command execution failed.
19:35:16 org.apache.commons.exec.ExecuteException: Process exited with an error: 1 (Exit value: 1)
19:35:16 	at org.apache.commons.exec.DefaultExecutor.executeInternal(DefaultExecutor.java:404)
19:35:16 	at org.apache.commons.exec.DefaultExecutor.execute(DefaultExecutor.java:166)
19:35:16 	at org.codehaus.mojo.exec.ExecMojo.executeCommandLine(ExecMojo.java:804)
19:35:16 	at org.codehaus.mojo.exec.ExecMojo.executeCommandLine(ExecMojo.java:751)
19:35:16 	at org.codehaus.mojo.exec.ExecMojo.execute(ExecMojo.java:313)
19:35:16 	at org.apache.maven.plugin.DefaultBuildPluginManager.executeMojo(DefaultBuildPluginManager.java:137)
19:35:16 	at org.apache.maven.lifecycle.internal.MojoExecutor.execute(MojoExecutor.java:210)
19:35:16 	at org.apache.maven.lifecycle.internal.MojoExecutor.execute(MojoExecutor.java:156)
19:35:16 	at org.apache.maven.lifecycle.internal.MojoExecutor.execute(MojoExecutor.java:148)
19:35:16 	at org.apache.maven.lifecycle.internal.LifecycleModuleBuilder.buildProject(LifecycleModuleBuilder.java:117)
19:35:16 	at org.apache.maven.lifecycle.internal.LifecycleModuleBuilder.buildProject(LifecycleModuleBuilder.java:81)
19:35:16 	at org.apache.maven.lifecycle.internal.builder.singlethreaded.SingleThreadedBuilder.build(SingleThreadedBuilder.java:56)
19:35:16 	at org.apache.maven.lifecycle.internal.LifecycleStarter.execute(LifecycleStarter.java:128)
19:35:16 	at org.apache.maven.DefaultMaven.doExecute(DefaultMaven.java:305)
19:35:16 	at org.apache.maven.DefaultMaven.doExecute(DefaultMaven.java:192)
19:35:16 	at org.apache.maven.DefaultMaven.execute(DefaultMaven.java:105)
19:35:16 	at org.apache.maven.cli.MavenCli.execute(MavenCli.java:957)
19:35:16 	at org.apache.maven.cli.MavenCli.doMain(MavenCli.java:289)
19:35:16 	at org.apache.maven.cli.MavenCli.doMain(MavenCli.java:244)
19:35:16 	at java.base/jdk.internal.reflect.NativeMethodAccessorImpl.invoke0(Native Method)
19:35:16 	at java.base/jdk.internal.reflect.NativeMethodAccessorImpl.invoke(NativeMethodAccessorImpl.java:62)
19:35:16 	at java.base/jdk.internal.reflect.DelegatingMethodAccessorImpl.invoke(DelegatingMethodAccessorImpl.java:43)
19:35:16 	at java.base/java.lang.reflect.Method.invoke(Method.java:566)
19:35:16 	at org.eclipse.scout.sdk.core.s.testing.maven.MavenCliRunner.runMavenInSandbox(MavenCliRunner.java:153)
19:35:16 	at org.eclipse.scout.sdk.core.s.testing.maven.MavenCliRunner.execute(MavenCliRunner.java:87)
19:35:16 	at org.eclipse.scout.sdk.core.s.testing.maven.MavenCliRunner.execute(MavenCliRunner.java:67)
19:35:16 	at org.eclipse.scout.sdk.core.s.util.maven.MavenRunner.execute(MavenRunner.java:76)
19:35:16 	at org.eclipse.scout.sdk.core.s.testing.CoreScoutTestingUtils.runMavenCommand(CoreScoutTestingUtils.java:246)
19:35:16 	at org.eclipse.scout.sdk.core.s.testing.CoreScoutTestingUtils.runMavenCleanTest(CoreScoutTestingUtils.java:223)
19:35:16 	at org.eclipse.scout.sdk.core.s.jaxws.WebServiceNewOperationTest.createWebService(WebServiceNewOperationTest.java:252)
19:35:16 	at org.eclipse.scout.sdk.core.s.jaxws.WebServiceNewOperationTest.createWebServiceConsumer(WebServiceNewOperationTest.java:170)
19:35:16 	at org.eclipse.scout.sdk.core.s.jaxws.WebServiceUpdateOperationTest.lambda$0(WebServiceUpdateOperationTest.java:81)
19:35:16 	at org.eclipse.scout.sdk.core.s.testing.context.TestingEnvironmentBuilder.lambda$0(TestingEnvironmentBuilder.java:61)
19:35:16 	at org.eclipse.scout.sdk.core.s.testing.context.TestingEnvironmentBuilder.runInTestingEnvironment(TestingEnvironmentBuilder.java:77)
19:35:16 	at org.eclipse.scout.sdk.core.s.testing.context.TestingEnvironmentBuilder.lambda$2(TestingEnvironmentBuilder.java:71)
19:35:16 	at org.eclipse.scout.sdk.core.s.testing.context.TestingEnvironmentBuilder.lambda$3(TestingEnvironmentBuilder.java:82)
19:35:16 	at org.eclipse.scout.sdk.core.s.testing.context.TestingEnvironmentBuilder.lambda$1(TestingEnvironmentBuilder.java:71)
19:35:16 	at org.eclipse.scout.sdk.core.s.testing.context.TestingEnvironmentBuilder.lambda$3(TestingEnvironmentBuilder.java:82)
19:35:16 	at org.eclipse.scout.sdk.core.s.testing.context.TestingEnvironmentBuilder.call(TestingEnvironmentBuilder.java:70)
19:35:16 	at org.eclipse.scout.sdk.core.s.testing.context.TestingEnvironmentBuilder.run(TestingEnvironmentBuilder.java:60)
19:35:16 	at org.eclipse.scout.sdk.core.s.jaxws.WebServiceNewOperationTest.runCreateJaxWsModule(WebServiceNewOperationTest.java:129)
19:35:16 	at org.eclipse.scout.sdk.core.s.jaxws.WebServiceUpdateOperationTest.testUpdateWebServiceConsumer(WebServiceUpdateOperationTest.java:55)
19:35:16 	at java.base/jdk.internal.reflect.NativeMethodAccessorImpl.invoke0(Native Method)
19:35:16 	at java.base/jdk.internal.reflect.NativeMethodAccessorImpl.invoke(NativeMethodAccessorImpl.java:62)
19:35:16 	at java.base/jdk.internal.reflect.DelegatingMethodAccessorImpl.invoke(DelegatingMethodAccessorImpl.java:43)
19:35:16 	at java.base/java.lang.reflect.Method.invoke(Method.java:566)
19:35:16 	at org.junit.platform.commons.util.ReflectionUtils.invokeMethod(ReflectionUtils.java:686)
19:35:16 	at org.junit.jupiter.engine.execution.MethodInvocation.proceed(MethodInvocation.java:60)
19:35:16 	at org.junit.jupiter.engine.execution.InvocationInterceptorChain$ValidatingInvocation.proceed(InvocationInterceptorChain.java:131)
19:35:16 	at org.junit.jupiter.engine.extension.TimeoutExtension.intercept(TimeoutExtension.java:149)
19:35:16 	at org.junit.jupiter.engine.extension.TimeoutExtension.interceptTestableMethod(TimeoutExtension.java:140)
19:35:16 	at org.junit.jupiter.engine.extension.TimeoutExtension.interceptTestMethod(TimeoutExtension.java:84)
19:35:16 	at org.junit.jupiter.engine.execution.ExecutableInvoker$ReflectiveInterceptorCall.lambda$ofVoidMethod$0(ExecutableInvoker.java:115)
19:35:16 	at org.junit.jupiter.engine.execution.ExecutableInvoker.lambda$invoke$0(ExecutableInvoker.java:105)
19:35:16 	at org.junit.jupiter.engine.execution.InvocationInterceptorChain$InterceptedInvocation.proceed(InvocationInterceptorChain.java:106)
19:35:16 	at org.junit.jupiter.engine.execution.InvocationInterceptorChain.proceed(InvocationInterceptorChain.java:64)
19:35:16 	at org.junit.jupiter.engine.execution.InvocationInterceptorChain.chainAndInvoke(InvocationInterceptorChain.java:45)
19:35:16 	at org.junit.jupiter.engine.execution.InvocationInterceptorChain.invoke(InvocationInterceptorChain.java:37)
19:35:16 	at org.junit.jupiter.engine.execution.ExecutableInvoker.invoke(ExecutableInvoker.java:104)
19:35:16 	at org.junit.jupiter.engine.execution.ExecutableInvoker.invoke(ExecutableInvoker.java:98)
19:35:16 	at org.junit.jupiter.engine.descriptor.TestMethodTestDescriptor.lambda$invokeTestMethod$6(TestMethodTestDescriptor.java:212)
19:35:16 	at org.junit.platform.engine.support.hierarchical.ThrowableCollector.execute(ThrowableCollector.java:73)
19:35:16 	at org.junit.jupiter.engine.descriptor.TestMethodTestDescriptor.invokeTestMethod(TestMethodTestDescriptor.java:208)
19:35:16 	at org.junit.jupiter.engine.descriptor.TestMethodTestDescriptor.execute(TestMethodTestDescriptor.java:137)
19:35:16 	at org.junit.jupiter.engine.descriptor.TestMethodTestDescriptor.execute(TestMethodTestDescriptor.java:71)
19:35:16 	at org.junit.platform.engine.support.hierarchical.NodeTestTask.lambda$executeRecursively$5(NodeTestTask.java:135)
19:35:16 	at org.junit.platform.engine.support.hierarchical.ThrowableCollector.execute(ThrowableCollector.java:73)
19:35:16 	at org.junit.platform.engine.support.hierarchical.NodeTestTask.lambda$executeRecursively$7(NodeTestTask.java:125)
19:35:16 	at org.junit.platform.engine.support.hierarchical.Node.around(Node.java:135)
19:35:16 	at org.junit.platform.engine.support.hierarchical.NodeTestTask.lambda$executeRecursively$8(NodeTestTask.java:123)
19:35:16 	at org.junit.platform.engine.support.hierarchical.ThrowableCollector.execute(ThrowableCollector.java:73)
19:35:16 	at org.junit.platform.engine.support.hierarchical.NodeTestTask.executeRecursively(NodeTestTask.java:122)
19:35:16 	at org.junit.platform.engine.support.hierarchical.NodeTestTask.execute(NodeTestTask.java:80)
19:35:16 	at java.base/java.util.ArrayList.forEach(ArrayList.java:1540)
19:35:16 	at org.junit.platform.engine.support.hierarchical.SameThreadHierarchicalTestExecutorService.invokeAll(SameThreadHierarchicalTestExecutorService.java:38)
19:35:16 	at org.junit.platform.engine.support.hierarchical.NodeTestTask.lambda$executeRecursively$5(NodeTestTask.java:139)
19:35:16 	at org.junit.platform.engine.support.hierarchical.ThrowableCollector.execute(ThrowableCollector.java:73)
19:35:16 	at org.junit.platform.engine.support.hierarchical.NodeTestTask.lambda$executeRecursively$7(NodeTestTask.java:125)
19:35:16 	at org.junit.platform.engine.support.hierarchical.Node.around(Node.java:135)
19:35:16 	at org.junit.platform.engine.support.hierarchical.NodeTestTask.lambda$executeRecursively$8(NodeTestTask.java:123)
19:35:16 	at org.junit.platform.engine.support.hierarchical.ThrowableCollector.execute(ThrowableCollector.java:73)
19:35:16 	at org.junit.platform.engine.support.hierarchical.NodeTestTask.executeRecursively(NodeTestTask.java:122)
19:35:16 	at org.junit.platform.engine.support.hierarchical.NodeTestTask.execute(NodeTestTask.java:80)
19:35:16 	at java.base/java.util.ArrayList.forEach(ArrayList.java:1540)
19:35:16 	at org.junit.platform.engine.support.hierarchical.SameThreadHierarchicalTestExecutorService.invokeAll(SameThreadHierarchicalTestExecutorService.java:38)
19:35:16 	at org.junit.platform.engine.support.hierarchical.NodeTestTask.lambda$executeRecursively$5(NodeTestTask.java:139)
19:35:16 	at org.junit.platform.engine.support.hierarchical.ThrowableCollector.execute(ThrowableCollector.java:73)
19:35:16 	at org.junit.platform.engine.support.hierarchical.NodeTestTask.lambda$executeRecursively$7(NodeTestTask.java:125)
19:35:16 	at org.junit.platform.engine.support.hierarchical.Node.around(Node.java:135)
19:35:16 	at org.junit.platform.engine.support.hierarchical.NodeTestTask.lambda$executeRecursively$8(NodeTestTask.java:123)
19:35:16 	at org.junit.platform.engine.support.hierarchical.ThrowableCollector.execute(ThrowableCollector.java:73)
19:35:16 	at org.junit.platform.engine.support.hierarchical.NodeTestTask.executeRecursively(NodeTestTask.java:122)
19:35:16 	at org.junit.platform.engine.support.hierarchical.NodeTestTask.execute(NodeTestTask.java:80)
19:35:16 	at org.junit.platform.engine.support.hierarchical.SameThreadHierarchicalTestExecutorService.submit(SameThreadHierarchicalTestExecutorService.java:32)
19:35:16 	at org.junit.platform.engine.support.hierarchical.HierarchicalTestExecutor.execute(HierarchicalTestExecutor.java:57)
19:35:16 	at org.junit.platform.engine.support.hierarchical.HierarchicalTestEngine.execute(HierarchicalTestEngine.java:51)
19:35:16 	at org.junit.platform.launcher.core.DefaultLauncher.execute(DefaultLauncher.java:248)
19:35:16 	at org.junit.platform.launcher.core.DefaultLauncher.lambda$execute$5(DefaultLauncher.java:211)
19:35:16 	at org.junit.platform.launcher.core.DefaultLauncher.withInterceptedStreams(DefaultLauncher.java:226)
19:35:16 	at org.junit.platform.launcher.core.DefaultLauncher.execute(DefaultLauncher.java:199)
19:35:16 	at org.junit.platform.launcher.core.DefaultLauncher.execute(DefaultLauncher.java:132)
19:35:16 	at org.apache.maven.surefire.junitplatform.JUnitPlatformProvider.invokeAllTests(JUnitPlatformProvider.java:142)
19:35:16 	at org.apache.maven.surefire.junitplatform.JUnitPlatformProvider.invoke(JUnitPlatformProvider.java:117)
19:35:16 	at org.apache.maven.surefire.booter.ForkedBooter.invokeProviderInSameClassLoader(ForkedBooter.java:384)
19:35:16 	at org.apache.maven.surefire.booter.ForkedBooter.runSuitesInProcess(ForkedBooter.java:345)
19:35:16 	at org.apache.maven.surefire.booter.ForkedBooter.execute(ForkedBooter.java:126)
19:35:16 	at org.apache.maven.surefire.booter.ForkedBooter.main(ForkedBooter.java:418)
19:35:16 2020-08-06 23:35:16.895 [SEVERE]  Failed to execute goal org.codehaus.mojo:exec-maven-plugin:1.6.0:exec (npm-update) on project artifact.ui.html: Command execution failed. Process exited with an error: 1 (Exit value: 1) -> [Help 1]
19:35:16 org.apache.maven.lifecycle.LifecycleExecutionException: Failed to execute goal org.codehaus.mojo:exec-maven-plugin:1.6.0:exec (npm-update) on project artifact.ui.html: Command execution failed.
19:35:16 	at org.apache.maven.lifecycle.internal.MojoExecutor.execute(MojoExecutor.java:215)
19:35:16 	at org.apache.maven.lifecycle.internal.MojoExecutor.execute(MojoExecutor.java:156)
19:35:16 	at org.apache.maven.lifecycle.internal.MojoExecutor.execute(MojoExecutor.java:148)
19:35:16 	at org.apache.maven.lifecycle.internal.LifecycleModuleBuilder.buildProject(LifecycleModuleBuilder.java:117)
19:35:16 	at org.apache.maven.lifecycle.internal.LifecycleModuleBuilder.buildProject(LifecycleModuleBuilder.java:81)
19:35:16 	at org.apache.maven.lifecycle.internal.builder.singlethreaded.SingleThreadedBuilder.build(SingleThreadedBuilder.java:56)
19:35:16 	at org.apache.maven.lifecycle.internal.LifecycleStarter.execute(LifecycleStarter.java:128)
19:35:16 	at org.apache.maven.DefaultMaven.doExecute(DefaultMaven.java:305)
19:35:16 	at org.apache.maven.DefaultMaven.doExecute(DefaultMaven.java:192)
19:35:16 	at org.apache.maven.DefaultMaven.execute(DefaultMaven.java:105)
19:35:16 	at org.apache.maven.cli.MavenCli.execute(MavenCli.java:957)
19:35:16 	at org.apache.maven.cli.MavenCli.doMain(MavenCli.java:289)
19:35:16 	at org.apache.maven.cli.MavenCli.doMain(MavenCli.java:244)
19:35:16 	at java.base/jdk.internal.reflect.NativeMethodAccessorImpl.invoke0(Native Method)
19:35:16 	at java.base/jdk.internal.reflect.NativeMethodAccessorImpl.invoke(NativeMethodAccessorImpl.java:62)
19:35:16 	at java.base/jdk.internal.reflect.DelegatingMethodAccessorImpl.invoke(DelegatingMethodAccessorImpl.java:43)
19:35:16 	at java.base/java.lang.reflect.Method.invoke(Method.java:566)
19:35:16 	at org.eclipse.scout.sdk.core.s.testing.maven.MavenCliRunner.runMavenInSandbox(MavenCliRunner.java:153)
19:35:16 	at org.eclipse.scout.sdk.core.s.testing.maven.MavenCliRunner.execute(MavenCliRunner.java:87)
19:35:16 	at org.eclipse.scout.sdk.core.s.testing.maven.MavenCliRunner.execute(MavenCliRunner.java:67)
19:35:16 	at org.eclipse.scout.sdk.core.s.util.maven.MavenRunner.execute(MavenRunner.java:76)
19:35:16 	at org.eclipse.scout.sdk.core.s.testing.CoreScoutTestingUtils.runMavenCommand(CoreScoutTestingUtils.java:246)
19:35:16 	at org.eclipse.scout.sdk.core.s.testing.CoreScoutTestingUtils.runMavenCleanTest(CoreScoutTestingUtils.java:223)
19:35:16 	at org.eclipse.scout.sdk.core.s.jaxws.WebServiceNewOperationTest.createWebService(WebServiceNewOperationTest.java:252)
19:35:16 	at org.eclipse.scout.sdk.core.s.jaxws.WebServiceNewOperationTest.createWebServiceConsumer(WebServiceNewOperationTest.java:170)
19:35:16 	at org.eclipse.scout.sdk.core.s.jaxws.WebServiceUpdateOperationTest.lambda$0(WebServiceUpdateOperationTest.java:81)
19:35:16 	at org.eclipse.scout.sdk.core.s.testing.context.TestingEnvironmentBuilder.lambda$0(TestingEnvironmentBuilder.java:61)
19:35:16 	at org.eclipse.scout.sdk.core.s.testing.context.TestingEnvironmentBuilder.runInTestingEnvironment(TestingEnvironmentBuilder.java:77)
19:35:16 	at org.eclipse.scout.sdk.core.s.testing.context.TestingEnvironmentBuilder.lambda$2(TestingEnvironmentBuilder.java:71)
19:35:16 	at org.eclipse.scout.sdk.core.s.testing.context.TestingEnvironmentBuilder.lambda$3(TestingEnvironmentBuilder.java:82)
19:35:16 	at org.eclipse.scout.sdk.core.s.testing.context.TestingEnvironmentBuilder.lambda$1(TestingEnvironmentBuilder.java:71)
19:35:16 	at org.eclipse.scout.sdk.core.s.testing.context.TestingEnvironmentBuilder.lambda$3(TestingEnvironmentBuilder.java:82)
19:35:16 	at org.eclipse.scout.sdk.core.s.testing.context.TestingEnvironmentBuilder.call(TestingEnvironmentBuilder.java:70)
19:35:16 	at org.eclipse.scout.sdk.core.s.testing.context.TestingEnvironmentBuilder.run(TestingEnvironmentBuilder.java:60)
19:35:16 	at org.eclipse.scout.sdk.core.s.jaxws.WebServiceNewOperationTest.runCreateJaxWsModule(WebServiceNewOperationTest.java:129)
19:35:16 	at org.eclipse.scout.sdk.core.s.jaxws.WebServiceUpdateOperationTest.testUpdateWebServiceConsumer(WebServiceUpdateOperationTest.java:55)
19:35:16 	at java.base/jdk.internal.reflect.NativeMethodAccessorImpl.invoke0(Native Method)
19:35:16 	at java.base/jdk.internal.reflect.NativeMethodAccessorImpl.invoke(NativeMethodAccessorImpl.java:62)
19:35:16 	at java.base/jdk.internal.reflect.DelegatingMethodAccessorImpl.invoke(DelegatingMethodAccessorImpl.java:43)
19:35:16 	at java.base/java.lang.reflect.Method.invoke(Method.java:566)
19:35:16 	at org.junit.platform.commons.util.ReflectionUtils.invokeMethod(ReflectionUtils.java:686)
19:35:16 	at org.junit.jupiter.engine.execution.MethodInvocation.proceed(MethodInvocation.java:60)
19:35:16 	at org.junit.jupiter.engine.execution.InvocationInterceptorChain$ValidatingInvocation.proceed(InvocationInterceptorChain.java:131)
19:35:16 	at org.junit.jupiter.engine.extension.TimeoutExtension.intercept(TimeoutExtension.java:149)
19:35:16 	at org.junit.jupiter.engine.extension.TimeoutExtension.interceptTestableMethod(TimeoutExtension.java:140)
19:35:16 	at org.junit.jupiter.engine.extension.TimeoutExtension.interceptTestMethod(TimeoutExtension.java:84)
19:35:16 	at org.junit.jupiter.engine.execution.ExecutableInvoker$ReflectiveInterceptorCall.lambda$ofVoidMethod$0(ExecutableInvoker.java:115)
19:35:16 	at org.junit.jupiter.engine.execution.ExecutableInvoker.lambda$invoke$0(ExecutableInvoker.java:105)
19:35:16 	at org.junit.jupiter.engine.execution.InvocationInterceptorChain$InterceptedInvocation.proceed(InvocationInterceptorChain.java:106)
19:35:16 	at org.junit.jupiter.engine.execution.InvocationInterceptorChain.proceed(InvocationInterceptorChain.java:64)
19:35:16 	at org.junit.jupiter.engine.execution.InvocationInterceptorChain.chainAndInvoke(InvocationInterceptorChain.java:45)
19:35:16 	at org.junit.jupiter.engine.execution.InvocationInterceptorChain.invoke(InvocationInterceptorChain.java:37)
19:35:16 	at org.junit.jupiter.engine.execution.ExecutableInvoker.invoke(ExecutableInvoker.java:104)
19:35:16 	at org.junit.jupiter.engine.execution.ExecutableInvoker.invoke(ExecutableInvoker.java:98)
19:35:16 	at org.junit.jupiter.engine.descriptor.TestMethodTestDescriptor.lambda$invokeTestMethod$6(TestMethodTestDescriptor.java:212)
19:35:16 	at org.junit.platform.engine.support.hierarchical.ThrowableCollector.execute(ThrowableCollector.java:73)
19:35:16 	at org.junit.jupiter.engine.descriptor.TestMethodTestDescriptor.invokeTestMethod(TestMethodTestDescriptor.java:208)
19:35:16 	at org.junit.jupiter.engine.descriptor.TestMethodTestDescriptor.execute(TestMethodTestDescriptor.java:137)
19:35:16 	at org.junit.jupiter.engine.descriptor.TestMethodTestDescriptor.execute(TestMethodTestDescriptor.java:71)
19:35:16 	at org.junit.platform.engine.support.hierarchical.NodeTestTask.lambda$executeRecursively$5(NodeTestTask.java:135)
19:35:16 	at org.junit.platform.engine.support.hierarchical.ThrowableCollector.execute(ThrowableCollector.java:73)
19:35:16 	at org.junit.platform.engine.support.hierarchical.NodeTestTask.lambda$executeRecursively$7(NodeTestTask.java:125)
19:35:16 	at org.junit.platform.engine.support.hierarchical.Node.around(Node.java:135)
19:35:16 	at org.junit.platform.engine.support.hierarchical.NodeTestTask.lambda$executeRecursively$8(NodeTestTask.java:123)
19:35:16 	at org.junit.platform.engine.support.hierarchical.ThrowableCollector.execute(ThrowableCollector.java:73)
19:35:16 	at org.junit.platform.engine.support.hierarchical.NodeTestTask.executeRecursively(NodeTestTask.java:122)
19:35:16 	at org.junit.platform.engine.support.hierarchical.NodeTestTask.execute(NodeTestTask.java:80)
19:35:16 	at java.base/java.util.ArrayList.forEach(ArrayList.java:1540)
19:35:16 	at org.junit.platform.engine.support.hierarchical.SameThreadHierarchicalTestExecutorService.invokeAll(SameThreadHierarchicalTestExecutorService.java:38)
19:35:16 	at org.junit.platform.engine.support.hierarchical.NodeTestTask.lambda$executeRecursively$5(NodeTestTask.java:139)
19:35:16 	at org.junit.platform.engine.support.hierarchical.ThrowableCollector.execute(ThrowableCollector.java:73)
19:35:16 	at org.junit.platform.engine.support.hierarchical.NodeTestTask.lambda$executeRecursively$7(NodeTestTask.java:125)
19:35:16 	at org.junit.platform.engine.support.hierarchical.Node.around(Node.java:135)
19:35:16 	at org.junit.platform.engine.support.hierarchical.NodeTestTask.lambda$executeRecursively$8(NodeTestTask.java:123)
19:35:16 	at org.junit.platform.engine.support.hierarchical.ThrowableCollector.execute(ThrowableCollector.java:73)
19:35:16 	at org.junit.platform.engine.support.hierarchical.NodeTestTask.executeRecursively(NodeTestTask.java:122)
19:35:16 	at org.junit.platform.engine.support.hierarchical.NodeTestTask.execute(NodeTestTask.java:80)
19:35:16 	at java.base/java.util.ArrayList.forEach(ArrayList.java:1540)
19:35:16 	at org.junit.platform.engine.support.hierarchical.SameThreadHierarchicalTestExecutorService.invokeAll(SameThreadHierarchicalTestExecutorService.java:38)
19:35:16 	at org.junit.platform.engine.support.hierarchical.NodeTestTask.lambda$executeRecursively$5(NodeTestTask.java:139)
19:35:16 	at org.junit.platform.engine.support.hierarchical.ThrowableCollector.execute(ThrowableCollector.java:73)
19:35:16 	at org.junit.platform.engine.support.hierarchical.NodeTestTask.lambda$executeRecursively$7(NodeTestTask.java:125)
19:35:16 	at org.junit.platform.engine.support.hierarchical.Node.around(Node.java:135)
19:35:16 	at org.junit.platform.engine.support.hierarchical.NodeTestTask.lambda$executeRecursively$8(NodeTestTask.java:123)
19:35:16 	at org.junit.platform.engine.support.hierarchical.ThrowableCollector.execute(ThrowableCollector.java:73)
19:35:16 	at org.junit.platform.engine.support.hierarchical.NodeTestTask.executeRecursively(NodeTestTask.java:122)
19:35:16 	at org.junit.platform.engine.support.hierarchical.NodeTestTask.execute(NodeTestTask.java:80)
19:35:16 	at org.junit.platform.engine.support.hierarchical.SameThreadHierarchicalTestExecutorService.submit(SameThreadHierarchicalTestExecutorService.java:32)
19:35:16 	at org.junit.platform.engine.support.hierarchical.HierarchicalTestExecutor.execute(HierarchicalTestExecutor.java:57)
19:35:16 	at org.junit.platform.engine.support.hierarchical.HierarchicalTestEngine.execute(HierarchicalTestEngine.java:51)
19:35:16 	at org.junit.platform.launcher.core.DefaultLauncher.execute(DefaultLauncher.java:248)
19:35:16 	at org.junit.platform.launcher.core.DefaultLauncher.lambda$execute$5(DefaultLauncher.java:211)
19:35:16 	at org.junit.platform.launcher.core.DefaultLauncher.withInterceptedStreams(DefaultLauncher.java:226)
19:35:16 	at org.junit.platform.launcher.core.DefaultLauncher.execute(DefaultLauncher.java:199)
19:35:16 	at org.junit.platform.launcher.core.DefaultLauncher.execute(DefaultLauncher.java:132)
19:35:16 	at org.apache.maven.surefire.junitplatform.JUnitPlatformProvider.invokeAllTests(JUnitPlatformProvider.java:142)
19:35:16 	at org.apache.maven.surefire.junitplatform.JUnitPlatformProvider.invoke(JUnitPlatformProvider.java:117)
19:35:16 	at org.apache.maven.surefire.booter.ForkedBooter.invokeProviderInSameClassLoader(ForkedBooter.java:384)
19:35:16 	at org.apache.maven.surefire.booter.ForkedBooter.runSuitesInProcess(ForkedBooter.java:345)
19:35:16 	at org.apache.maven.surefire.booter.ForkedBooter.execute(ForkedBooter.java:126)
19:35:16 	at org.apache.maven.surefire.booter.ForkedBooter.main(ForkedBooter.java:418)
19:35:16 Caused by: org.apache.maven.plugin.MojoExecutionException: Command execution failed.
19:35:16 	at org.codehaus.mojo.exec.ExecMojo.execute(ExecMojo.java:326)
19:35:16 	at org.apache.maven.plugin.DefaultBuildPluginManager.executeMojo(DefaultBuildPluginManager.java:137)
19:35:16 	at org.apache.maven.lifecycle.internal.MojoExecutor.execute(MojoExecutor.java:210)
19:35:16 	... 100 more
19:35:16 Caused by: org.apache.commons.exec.ExecuteException: Process exited with an error: 1 (Exit value: 1)
19:35:16 	at org.apache.commons.exec.DefaultExecutor.executeInternal(DefaultExecutor.java:404)
19:35:16 	at org.apache.commons.exec.DefaultExecutor.execute(DefaultExecutor.java:166)
19:35:16 	at org.codehaus.mojo.exec.ExecMojo.executeCommandLine(ExecMojo.java:804)
19:35:16 	at org.codehaus.mojo.exec.ExecMojo.executeCommandLine(ExecMojo.java:751)
19:35:16 	at org.codehaus.mojo.exec.ExecMojo.execute(ExecMojo.java:313)
19:35:16 	... 102 more
19:35:16 2020-08-06 23:35:16.897 [SEVERE]  
19:35:16 2020-08-06 23:35:16.899 [SEVERE]  Re-run Maven using the -X switch to enable full debug logging.
19:35:16 2020-08-06 23:35:16.899 [SEVERE]  
19:35:16 2020-08-06 23:35:16.899 [SEVERE]  For more information about the errors and possible solutions, please read the following articles:
19:35:16 2020-08-06 23:35:16.899 [SEVERE]  [Help 1] http://cwiki.apache.org/confluence/display/MAVEN/MojoExecutionException
19:35:16 2020-08-06 23:35:16.899 [SEVERE]  
19:35:16 2020-08-06 23:35:16.900 [SEVERE]  After correcting the problems, you can resume the build with the command
19:35:16 2020-08-06 23:35:16.900 [SEVERE]    mvn <args> -rf :artifact.ui.html
19:35:16 2020-08-06 23:35:16.904 [SEVERE]  Output of embedded Maven call:
19:35:16 MVN-BEGIN
19:35:16 2020-08-06 23:35:03,604 WARN  [main] org.eclipse.scout.testing.client.ClientSessionProviderWithCache.registerSessionForNotifications(ClientSessionProviderWithCache.java:164) - Failed to register session for notifications. - MDC[]
19:35:16 2020-08-06 23:35:03,606 WARN  [main] org.eclipse.scout.rt.client.AbstractClientSession.getUserAgent(AbstractClientSession.java:162) - UserAgent not set; using default [default=UNKNOWN|UNKNOWN|UNKNOWN|UNKNOWN|Linux] - MDC[]
19:35:16 
19:35:16 MVN-END
19:35:16 
19:35:17 [ERROR] Tests run: 2, Failures: 0, Errors: 2, Skipped: 0, Time elapsed: 290.344 s <<< FAILURE! - in org.eclipse.scout.sdk.core.s.jaxws.WebServiceUpdateOperationTest
19:35:17 [ERROR] testUpdateWebServiceProvider  Time elapsed: 164.065 s  <<< ERROR!
19:35:17 org.eclipse.scout.sdk.core.util.SdkException: 
19:35:17 	at org.eclipse.scout.sdk.core.s.testing.maven.MavenCliRunner.execute(MavenCliRunner.java:70)
19:35:17 	at org.eclipse.scout.sdk.core.s.util.maven.MavenRunner.execute(MavenRunner.java:76)
19:35:17 	at org.eclipse.scout.sdk.core.s.testing.CoreScoutTestingUtils.runMavenCommand(CoreScoutTestingUtils.java:246)
19:35:17 	at org.eclipse.scout.sdk.core.s.testing.CoreScoutTestingUtils.runMavenCleanTest(CoreScoutTestingUtils.java:223)
19:35:17 	at org.eclipse.scout.sdk.core.s.jaxws.WebServiceNewOperationTest.createWebService(WebServiceNewOperationTest.java:252)
19:35:17 	at org.eclipse.scout.sdk.core.s.jaxws.WebServiceNewOperationTest.createWebServiceProvider(WebServiceNewOperationTest.java:178)
19:35:17 	at org.eclipse.scout.sdk.core.s.jaxws.WebServiceUpdateOperationTest.lambda$1(WebServiceUpdateOperationTest.java:128)
19:35:17 	at org.eclipse.scout.sdk.core.s.testing.context.TestingEnvironmentBuilder.lambda$0(TestingEnvironmentBuilder.java:61)
19:35:17 	at org.eclipse.scout.sdk.core.s.testing.context.TestingEnvironmentBuilder.runInTestingEnvironment(TestingEnvironmentBuilder.java:77)
19:35:17 	at org.eclipse.scout.sdk.core.s.testing.context.TestingEnvironmentBuilder.lambda$2(TestingEnvironmentBuilder.java:71)
19:35:17 	at org.eclipse.scout.sdk.core.s.testing.context.TestingEnvironmentBuilder.lambda$3(TestingEnvironmentBuilder.java:82)
19:35:17 	at org.eclipse.scout.sdk.core.s.testing.context.TestingEnvironmentBuilder.lambda$1(TestingEnvironmentBuilder.java:71)
19:35:17 	at org.eclipse.scout.sdk.core.s.testing.context.TestingEnvironmentBuilder.lambda$3(TestingEnvironmentBuilder.java:82)
19:35:17 	at org.eclipse.scout.sdk.core.s.testing.context.TestingEnvironmentBuilder.call(TestingEnvironmentBuilder.java:70)
19:35:17 	at org.eclipse.scout.sdk.core.s.testing.context.TestingEnvironmentBuilder.run(TestingEnvironmentBuilder.java:60)
19:35:17 	at org.eclipse.scout.sdk.core.s.jaxws.WebServiceNewOperationTest.runCreateJaxWsModule(WebServiceNewOperationTest.java:129)
19:35:17 	at org.eclipse.scout.sdk.core.s.jaxws.WebServiceUpdateOperationTest.testUpdateWebServiceProvider(WebServiceUpdateOperationTest.java:68)
19:35:17 	at java.base/jdk.internal.reflect.NativeMethodAccessorImpl.invoke0(Native Method)
19:35:17 	at java.base/jdk.internal.reflect.NativeMethodAccessorImpl.invoke(NativeMethodAccessorImpl.java:62)
19:35:17 	at java.base/jdk.internal.reflect.DelegatingMethodAccessorImpl.invoke(DelegatingMethodAccessorImpl.java:43)
19:35:17 	at java.base/java.lang.reflect.Method.invoke(Method.java:566)
19:35:17 	at org.junit.platform.commons.util.ReflectionUtils.invokeMethod(ReflectionUtils.java:686)
19:35:17 	at org.junit.jupiter.engine.execution.MethodInvocation.proceed(MethodInvocation.java:60)
19:35:17 	at org.junit.jupiter.engine.execution.InvocationInterceptorChain$ValidatingInvocation.proceed(InvocationInterceptorChain.java:131)
19:35:17 	at org.junit.jupiter.engine.extension.TimeoutExtension.intercept(TimeoutExtension.java:149)
19:35:17 	at org.junit.jupiter.engine.extension.TimeoutExtension.interceptTestableMethod(TimeoutExtension.java:140)
19:35:17 	at org.junit.jupiter.engine.extension.TimeoutExtension.interceptTestMethod(TimeoutExtension.java:84)
19:35:17 	at org.junit.jupiter.engine.execution.ExecutableInvoker$ReflectiveInterceptorCall.lambda$ofVoidMethod$0(ExecutableInvoker.java:115)
19:35:17 	at org.junit.jupiter.engine.execution.ExecutableInvoker.lambda$invoke$0(ExecutableInvoker.java:105)
19:35:17 	at org.junit.jupiter.engine.execution.InvocationInterceptorChain$InterceptedInvocation.proceed(InvocationInterceptorChain.java:106)
19:35:17 	at org.junit.jupiter.engine.execution.InvocationInterceptorChain.proceed(InvocationInterceptorChain.java:64)
19:35:17 	at org.junit.jupiter.engine.execution.InvocationInterceptorChain.chainAndInvoke(InvocationInterceptorChain.java:45)
19:35:17 	at org.junit.jupiter.engine.execution.InvocationInterceptorChain.invoke(InvocationInterceptorChain.java:37)
19:35:17 	at org.junit.jupiter.engine.execution.ExecutableInvoker.invoke(ExecutableInvoker.java:104)
19:35:17 	at org.junit.jupiter.engine.execution.ExecutableInvoker.invoke(ExecutableInvoker.java:98)
19:35:17 	at org.junit.jupiter.engine.descriptor.TestMethodTestDescriptor.lambda$invokeTestMethod$6(TestMethodTestDescriptor.java:212)
19:35:17 	at org.junit.platform.engine.support.hierarchical.ThrowableCollector.execute(ThrowableCollector.java:73)
19:35:17 	at org.junit.jupiter.engine.descriptor.TestMethodTestDescriptor.invokeTestMethod(TestMethodTestDescriptor.java:208)
19:35:17 	at org.junit.jupiter.engine.descriptor.TestMethodTestDescriptor.execute(TestMethodTestDescriptor.java:137)
19:35:17 	at org.junit.jupiter.engine.descriptor.TestMethodTestDescriptor.execute(TestMethodTestDescriptor.java:71)
19:35:17 	at org.junit.platform.engine.support.hierarchical.NodeTestTask.lambda$executeRecursively$5(NodeTestTask.java:135)
19:35:17 	at org.junit.platform.engine.support.hierarchical.ThrowableCollector.execute(ThrowableCollector.java:73)
19:35:17 	at org.junit.platform.engine.support.hierarchical.NodeTestTask.lambda$executeRecursively$7(NodeTestTask.java:125)
19:35:17 	at org.junit.platform.engine.support.hierarchical.Node.around(Node.java:135)
19:35:17 	at org.junit.platform.engine.support.hierarchical.NodeTestTask.lambda$executeRecursively$8(NodeTestTask.java:123)
19:35:17 	at org.junit.platform.engine.support.hierarchical.ThrowableCollector.execute(ThrowableCollector.java:73)
19:35:17 	at org.junit.platform.engine.support.hierarchical.NodeTestTask.executeRecursively(NodeTestTask.java:122)
19:35:17 	at org.junit.platform.engine.support.hierarchical.NodeTestTask.execute(NodeTestTask.java:80)
19:35:17 	at java.base/java.util.ArrayList.forEach(ArrayList.java:1540)
19:35:17 	at org.junit.platform.engine.support.hierarchical.SameThreadHierarchicalTestExecutorService.invokeAll(SameThreadHierarchicalTestExecutorService.java:38)
19:35:17 	at org.junit.platform.engine.support.hierarchical.NodeTestTask.lambda$executeRecursively$5(NodeTestTask.java:139)
19:35:17 	at org.junit.platform.engine.support.hierarchical.ThrowableCollector.execute(ThrowableCollector.java:73)
19:35:17 	at org.junit.platform.engine.support.hierarchical.NodeTestTask.lambda$executeRecursively$7(NodeTestTask.java:125)
19:35:17 	at org.junit.platform.engine.support.hierarchical.Node.around(Node.java:135)
19:35:17 	at org.junit.platform.engine.support.hierarchical.NodeTestTask.lambda$executeRecursively$8(NodeTestTask.java:123)
19:35:17 	at org.junit.platform.engine.support.hierarchical.ThrowableCollector.execute(ThrowableCollector.java:73)
19:35:17 	at org.junit.platform.engine.support.hierarchical.NodeTestTask.executeRecursively(NodeTestTask.java:122)
19:35:17 	at org.junit.platform.engine.support.hierarchical.NodeTestTask.execute(NodeTestTask.java:80)
19:35:17 	at java.base/java.util.ArrayList.forEach(ArrayList.java:1540)
19:35:17 	at org.junit.platform.engine.support.hierarchical.SameThreadHierarchicalTestExecutorService.invokeAll(SameThreadHierarchicalTestExecutorService.java:38)
19:35:17 	at org.junit.platform.engine.support.hierarchical.NodeTestTask.lambda$executeRecursively$5(NodeTestTask.java:139)
19:35:17 	at org.junit.platform.engine.support.hierarchical.ThrowableCollector.execute(ThrowableCollector.java:73)
19:35:17 	at org.junit.platform.engine.support.hierarchical.NodeTestTask.lambda$executeRecursively$7(NodeTestTask.java:125)
19:35:17 	at org.junit.platform.engine.support.hierarchical.Node.around(Node.java:135)
19:35:17 	at org.junit.platform.engine.support.hierarchical.NodeTestTask.lambda$executeRecursively$8(NodeTestTask.java:123)
19:35:17 	at org.junit.platform.engine.support.hierarchical.ThrowableCollector.execute(ThrowableCollector.java:73)
19:35:17 	at org.junit.platform.engine.support.hierarchical.NodeTestTask.executeRecursively(NodeTestTask.java:122)
19:35:17 	at org.junit.platform.engine.support.hierarchical.NodeTestTask.execute(NodeTestTask.java:80)
19:35:17 	at org.junit.platform.engine.support.hierarchical.SameThreadHierarchicalTestExecutorService.submit(SameThreadHierarchicalTestExecutorService.java:32)
19:35:17 	at org.junit.platform.engine.support.hierarchical.HierarchicalTestExecutor.execute(HierarchicalTestExecutor.java:57)
19:35:17 	at org.junit.platform.engine.support.hierarchical.HierarchicalTestEngine.execute(HierarchicalTestEngine.java:51)
19:35:17 	at org.junit.platform.launcher.core.DefaultLauncher.execute(DefaultLauncher.java:248)
19:35:17 	at org.junit.platform.launcher.core.DefaultLauncher.lambda$execute$5(DefaultLauncher.java:211)
19:35:17 	at org.junit.platform.launcher.core.DefaultLauncher.withInterceptedStreams(DefaultLauncher.java:226)
19:35:17 	at org.junit.platform.launcher.core.DefaultLauncher.execute(DefaultLauncher.java:199)
19:35:17 	at org.junit.platform.launcher.core.DefaultLauncher.execute(DefaultLauncher.java:132)
19:35:17 	at org.apache.maven.surefire.junitplatform.JUnitPlatformProvider.invokeAllTests(JUnitPlatformProvider.java:142)
19:35:17 	at org.apache.maven.surefire.junitplatform.JUnitPlatformProvider.invoke(JUnitPlatformProvider.java:117)
19:35:17 	at org.apache.maven.surefire.booter.ForkedBooter.invokeProviderInSameClassLoader(ForkedBooter.java:384)
19:35:17 	at org.apache.maven.surefire.booter.ForkedBooter.runSuitesInProcess(ForkedBooter.java:345)
19:35:17 	at org.apache.maven.surefire.booter.ForkedBooter.execute(ForkedBooter.java:126)
19:35:17 	at org.apache.maven.surefire.booter.ForkedBooter.main(ForkedBooter.java:418)
19:35:17 Caused by: java.io.IOException: Maven call failed.
19:35:17 	at org.eclipse.scout.sdk.core.s.testing.maven.MavenCliRunner.runMavenInSandbox(MavenCliRunner.java:159)
19:35:17 	at org.eclipse.scout.sdk.core.s.testing.maven.MavenCliRunner.execute(MavenCliRunner.java:87)
19:35:17 	at org.eclipse.scout.sdk.core.s.testing.maven.MavenCliRunner.execute(MavenCliRunner.java:67)
19:35:17 	... 81 more
19:35:17 
19:35:17 [ERROR] testUpdateWebServiceConsumer  Time elapsed: 126.274 s  <<< ERROR!
19:35:17 org.eclipse.scout.sdk.core.util.SdkException: 
19:35:17 	at org.eclipse.scout.sdk.core.s.testing.maven.MavenCliRunner.execute(MavenCliRunner.java:70)
19:35:17 	at org.eclipse.scout.sdk.core.s.util.maven.MavenRunner.execute(MavenRunner.java:76)
19:35:17 	at org.eclipse.scout.sdk.core.s.testing.CoreScoutTestingUtils.runMavenCommand(CoreScoutTestingUtils.java:246)
19:35:17 	at org.eclipse.scout.sdk.core.s.testing.CoreScoutTestingUtils.runMavenCleanTest(CoreScoutTestingUtils.java:223)
19:35:17 	at org.eclipse.scout.sdk.core.s.jaxws.WebServiceNewOperationTest.createWebService(WebServiceNewOperationTest.java:252)
19:35:17 	at org.eclipse.scout.sdk.core.s.jaxws.WebServiceNewOperationTest.createWebServiceConsumer(WebServiceNewOperationTest.java:170)
19:35:17 	at org.eclipse.scout.sdk.core.s.jaxws.WebServiceUpdateOperationTest.lambda$0(WebServiceUpdateOperationTest.java:81)
19:35:17 	at org.eclipse.scout.sdk.core.s.testing.context.TestingEnvironmentBuilder.lambda$0(TestingEnvironmentBuilder.java:61)
19:35:17 	at org.eclipse.scout.sdk.core.s.testing.context.TestingEnvironmentBuilder.runInTestingEnvironment(TestingEnvironmentBuilder.java:77)
19:35:17 	at org.eclipse.scout.sdk.core.s.testing.context.TestingEnvironmentBuilder.lambda$2(TestingEnvironmentBuilder.java:71)
19:35:17 	at org.eclipse.scout.sdk.core.s.testing.context.TestingEnvironmentBuilder.lambda$3(TestingEnvironmentBuilder.java:82)
19:35:17 	at org.eclipse.scout.sdk.core.s.testing.context.TestingEnvironmentBuilder.lambda$1(TestingEnvironmentBuilder.java:71)
19:35:17 	at org.eclipse.scout.sdk.core.s.testing.context.TestingEnvironmentBuilder.lambda$3(TestingEnvironmentBuilder.java:82)
19:35:17 	at org.eclipse.scout.sdk.core.s.testing.context.TestingEnvironmentBuilder.call(TestingEnvironmentBuilder.java:70)
19:35:17 	at org.eclipse.scout.sdk.core.s.testing.context.TestingEnvironmentBuilder.run(TestingEnvironmentBuilder.java:60)
19:35:17 	at org.eclipse.scout.sdk.core.s.jaxws.WebServiceNewOperationTest.runCreateJaxWsModule(WebServiceNewOperationTest.java:129)
19:35:17 	at org.eclipse.scout.sdk.core.s.jaxws.WebServiceUpdateOperationTest.testUpdateWebServiceConsumer(WebServiceUpdateOperationTest.java:55)
19:35:17 	at java.base/jdk.internal.reflect.NativeMethodAccessorImpl.invoke0(Native Method)
19:35:17 	at java.base/jdk.internal.reflect.NativeMethodAccessorImpl.invoke(NativeMethodAccessorImpl.java:62)
19:35:17 	at java.base/jdk.internal.reflect.DelegatingMethodAccessorImpl.invoke(DelegatingMethodAccessorImpl.java:43)
19:35:17 	at java.base/java.lang.reflect.Method.invoke(Method.java:566)
19:35:17 	at org.junit.platform.commons.util.ReflectionUtils.invokeMethod(ReflectionUtils.java:686)
19:35:17 	at org.junit.jupiter.engine.execution.MethodInvocation.proceed(MethodInvocation.java:60)
19:35:17 	at org.junit.jupiter.engine.execution.InvocationInterceptorChain$ValidatingInvocation.proceed(InvocationInterceptorChain.java:131)
19:35:17 	at org.junit.jupiter.engine.extension.TimeoutExtension.intercept(TimeoutExtension.java:149)
19:35:17 	at org.junit.jupiter.engine.extension.TimeoutExtension.interceptTestableMethod(TimeoutExtension.java:140)
19:35:17 	at org.junit.jupiter.engine.extension.TimeoutExtension.interceptTestMethod(TimeoutExtension.java:84)
19:35:17 	at org.junit.jupiter.engine.execution.ExecutableInvoker$ReflectiveInterceptorCall.lambda$ofVoidMethod$0(ExecutableInvoker.java:115)
19:35:17 	at org.junit.jupiter.engine.execution.ExecutableInvoker.lambda$invoke$0(ExecutableInvoker.java:105)
19:35:17 	at org.junit.jupiter.engine.execution.InvocationInterceptorChain$InterceptedInvocation.proceed(InvocationInterceptorChain.java:106)
19:35:17 	at org.junit.jupiter.engine.execution.InvocationInterceptorChain.proceed(InvocationInterceptorChain.java:64)
19:35:17 	at org.junit.jupiter.engine.execution.InvocationInterceptorChain.chainAndInvoke(InvocationInterceptorChain.java:45)
19:35:17 	at org.junit.jupiter.engine.execution.InvocationInterceptorChain.invoke(InvocationInterceptorChain.java:37)
19:35:17 	at org.junit.jupiter.engine.execution.ExecutableInvoker.invoke(ExecutableInvoker.java:104)
19:35:17 	at org.junit.jupiter.engine.execution.ExecutableInvoker.invoke(ExecutableInvoker.java:98)
19:35:17 	at org.junit.jupiter.engine.descriptor.TestMethodTestDescriptor.lambda$invokeTestMethod$6(TestMethodTestDescriptor.java:212)
19:35:17 	at org.junit.platform.engine.support.hierarchical.ThrowableCollector.execute(ThrowableCollector.java:73)
19:35:17 	at org.junit.jupiter.engine.descriptor.TestMethodTestDescriptor.invokeTestMethod(TestMethodTestDescriptor.java:208)
19:35:17 	at org.junit.jupiter.engine.descriptor.TestMethodTestDescriptor.execute(TestMethodTestDescriptor.java:137)
19:35:17 	at org.junit.jupiter.engine.descriptor.TestMethodTestDescriptor.execute(TestMethodTestDescriptor.java:71)
19:35:17 	at org.junit.platform.engine.support.hierarchical.NodeTestTask.lambda$executeRecursively$5(NodeTestTask.java:135)
19:35:17 	at org.junit.platform.engine.support.hierarchical.ThrowableCollector.execute(ThrowableCollector.java:73)
19:35:17 	at org.junit.platform.engine.support.hierarchical.NodeTestTask.lambda$executeRecursively$7(NodeTestTask.java:125)
19:35:17 	at org.junit.platform.engine.support.hierarchical.Node.around(Node.java:135)
19:35:17 	at org.junit.platform.engine.support.hierarchical.NodeTestTask.lambda$executeRecursively$8(NodeTestTask.java:123)
19:35:17 	at org.junit.platform.engine.support.hierarchical.ThrowableCollector.execute(ThrowableCollector.java:73)
19:35:17 	at org.junit.platform.engine.support.hierarchical.NodeTestTask.executeRecursively(NodeTestTask.java:122)
19:35:17 	at org.junit.platform.engine.support.hierarchical.NodeTestTask.execute(NodeTestTask.java:80)
19:35:17 	at java.base/java.util.ArrayList.forEach(ArrayList.java:1540)
19:35:17 	at org.junit.platform.engine.support.hierarchical.SameThreadHierarchicalTestExecutorService.invokeAll(SameThreadHierarchicalTestExecutorService.java:38)
19:35:17 	at org.junit.platform.engine.support.hierarchical.NodeTestTask.lambda$executeRecursively$5(NodeTestTask.java:139)
19:35:17 	at org.junit.platform.engine.support.hierarchical.ThrowableCollector.execute(ThrowableCollector.java:73)
19:35:17 	at org.junit.platform.engine.support.hierarchical.NodeTestTask.lambda$executeRecursively$7(NodeTestTask.java:125)
19:35:17 	at org.junit.platform.engine.support.hierarchical.Node.around(Node.java:135)
19:35:17 	at org.junit.platform.engine.support.hierarchical.NodeTestTask.lambda$executeRecursively$8(NodeTestTask.java:123)
19:35:17 	at org.junit.platform.engine.support.hierarchical.ThrowableCollector.execute(ThrowableCollector.java:73)
19:35:17 	at org.junit.platform.engine.support.hierarchical.NodeTestTask.executeRecursively(NodeTestTask.java:122)
19:35:17 	at org.junit.platform.engine.support.hierarchical.NodeTestTask.execute(NodeTestTask.java:80)
19:35:17 	at java.base/java.util.ArrayList.forEach(ArrayList.java:1540)
19:35:17 	at org.junit.platform.engine.support.hierarchical.SameThreadHierarchicalTestExecutorService.invokeAll(SameThreadHierarchicalTestExecutorService.java:38)
19:35:17 	at org.junit.platform.engine.support.hierarchical.NodeTestTask.lambda$executeRecursively$5(NodeTestTask.java:139)
19:35:17 	at org.junit.platform.engine.support.hierarchical.ThrowableCollector.execute(ThrowableCollector.java:73)
19:35:17 	at org.junit.platform.engine.support.hierarchical.NodeTestTask.lambda$executeRecursively$7(NodeTestTask.java:125)
19:35:17 	at org.junit.platform.engine.support.hierarchical.Node.around(Node.java:135)
19:35:17 	at org.junit.platform.engine.support.hierarchical.NodeTestTask.lambda$executeRecursively$8(NodeTestTask.java:123)
19:35:17 	at org.junit.platform.engine.support.hierarchical.ThrowableCollector.execute(ThrowableCollector.java:73)
19:35:17 	at org.junit.platform.engine.support.hierarchical.NodeTestTask.executeRecursively(NodeTestTask.java:122)
19:35:17 	at org.junit.platform.engine.support.hierarchical.NodeTestTask.execute(NodeTestTask.java:80)
19:35:17 	at org.junit.platform.engine.support.hierarchical.SameThreadHierarchicalTestExecutorService.submit(SameThreadHierarchicalTestExecutorService.java:32)
19:35:17 	at org.junit.platform.engine.support.hierarchical.HierarchicalTestExecutor.execute(HierarchicalTestExecutor.java:57)
19:35:17 	at org.junit.platform.engine.support.hierarchical.HierarchicalTestEngine.execute(HierarchicalTestEngine.java:51)
19:35:17 	at org.junit.platform.launcher.core.DefaultLauncher.execute(DefaultLauncher.java:248)
19:35:17 	at org.junit.platform.launcher.core.DefaultLauncher.lambda$execute$5(DefaultLauncher.java:211)
19:35:17 	at org.junit.platform.launcher.core.DefaultLauncher.withInterceptedStreams(DefaultLauncher.java:226)
19:35:17 	at org.junit.platform.launcher.core.DefaultLauncher.execute(DefaultLauncher.java:199)
19:35:17 	at org.junit.platform.launcher.core.DefaultLauncher.execute(DefaultLauncher.java:132)
19:35:17 	at org.apache.maven.surefire.junitplatform.JUnitPlatformProvider.invokeAllTests(JUnitPlatformProvider.java:142)
19:35:17 	at org.apache.maven.surefire.junitplatform.JUnitPlatformProvider.invoke(JUnitPlatformProvider.java:117)
19:35:17 	at org.apache.maven.surefire.booter.ForkedBooter.invokeProviderInSameClassLoader(ForkedBooter.java:384)
19:35:17 	at org.apache.maven.surefire.booter.ForkedBooter.runSuitesInProcess(ForkedBooter.java:345)
19:35:17 	at org.apache.maven.surefire.booter.ForkedBooter.execute(ForkedBooter.java:126)
19:35:17 	at org.apache.maven.surefire.booter.ForkedBooter.main(ForkedBooter.java:418)
19:35:17 Caused by: java.io.IOException: Maven call failed.
19:35:17 	at org.eclipse.scout.sdk.core.s.testing.maven.MavenCliRunner.runMavenInSandbox(MavenCliRunner.java:159)
19:35:17 	at org.eclipse.scout.sdk.core.s.testing.maven.MavenCliRunner.execute(MavenCliRunner.java:87)
19:35:17 	at org.eclipse.scout.sdk.core.s.testing.maven.MavenCliRunner.execute(MavenCliRunner.java:67)
19:35:17 	... 81 more
19:35:17 
19:35:17 [INFO] Running org.eclipse.scout.sdk.core.s.jaxws.WebServiceNewOperationTest
19:35:21 2020-08-06 23:35:21.735 [WARNING] Don't override file /tmp/CoreScoutTestingUtils-projectDir3256162514336181052/artifact/artifact/pom.xml
19:35:21 2020-08-06 23:35:21.845 [WARNING] Don't override file /tmp/CoreScoutTestingUtils-projectDir3256162514336181052/artifact/artifact.ui.html/src/main/js/artifact.js
19:35:21 2020-08-06 23:35:21.845 [WARNING] Don't override file /tmp/CoreScoutTestingUtils-projectDir3256162514336181052/artifact/artifact.ui.html/src/main/js/index.js
19:35:21 2020-08-06 23:35:21.846 [WARNING] Don't override file /tmp/CoreScoutTestingUtils-projectDir3256162514336181052/artifact/artifact.ui.html/src/main/js/login.js
19:35:21 2020-08-06 23:35:21.846 [WARNING] Don't override file /tmp/CoreScoutTestingUtils-projectDir3256162514336181052/artifact/artifact.ui.html/src/main/js/logout.js
19:35:21 2020-08-06 23:35:21.849 [WARNING] Don't override file /tmp/CoreScoutTestingUtils-projectDir3256162514336181052/artifact/artifact.ui.html/src/main/resources/WebContent/favicon/manifest.json
19:35:21 2020-08-06 23:35:21.871 [WARNING] Don't override file /tmp/CoreScoutTestingUtils-projectDir3256162514336181052/artifact/artifact.ui.html/src/main/resources/WebContent/popup-window.js
19:35:27 2020-08-06 23:35:27.495 [WARNING] CP Don't override file /tmp/jaxws-module-tmp3890854710623879940/artifact.server.jaxws/src/main/resources/META-INF/scout.xml
19:37:06 2020-08-06 23:37:06.851 [WARNING] /tmp/CoreScoutTestingUtils-projectDir3256162514336181052/artifact/artifact.shared/src/main/java/group/artifact/shared/security/AccessControlService.java:[4] 
19:37:06 	import org.eclipse.scout.rt.security.IAccessControlService;
19:37:06 	       ^^^^^^^^^^^^^^^^^^^^^^^^^^^^^^^^^^^^^^^^^^^^^^^^^^^
19:37:06 The import org.eclipse.scout.rt.security.IAccessControlService is never used
19:37:06 2020-08-06 23:37:06.851 [WARNING] /tmp/CoreScoutTestingUtils-projectDir3256162514336181052/artifact/artifact.shared/src/main/java/group/artifact/shared/security/AccessControlService.java:[6] 
19:37:06 	import org.eclipse.scout.rt.shared.ISession;
19:37:06 	       ^^^^^^^^^^^^^^^^^^^^^^^^^^^^^^^^^^^^
19:37:06 The import org.eclipse.scout.rt.shared.ISession is never used
19:37:06 2 problems (2 warnings)
19:37:39 2020-08-06 23:37:39.727 [WARNING] /tmp/CoreScoutTestingUtils-projectDir3256162514336181052/artifact/artifact.server.jaxws/target/generated-sources/wsimport/test/provider/multifile/ErrorResponse.java:[15] 
19:37:39 	public class ErrorResponse
19:37:39 	             ^^^^^^^^^^^^^
19:37:39 The serializable class ErrorResponse does not declare a static final serialVersionUID field of type long
19:37:39 2. WARNING: Annotation processing: Annotation processing started... [processor=JaxWsAnnotationProcessor]
19:37:39 3. WARNING: Annotation processing: Generate entry point for endpoint interface 'test.provider.multifile.IScoutQueryInterface2PortType' [entryPoint=test.provider.multifile.ScoutQueryInterface2WebServiceEntryPoint, wsdl:portType=scoutQueryInterface2, wsdl:service=scoutQuery, wsdl:port=scoutQueryPort] [processor=JaxWsAnnotationProcessor]
19:37:39 4. WARNING: Annotation processing: Generate handler delegate [handler=org.eclipse.scout.rt.server.jaxws.handler.WsProviderCorrelationIdHandler, handlerDelegate=test.provider.multifile.ScoutQueryInterface2WebServiceEntryPoint_WsProviderCorrelationIdHandler, portTypeDefinition=test.provider.multifile.IScoutQueryInterface2WebServiceEntryPointDefinition, endpointInterface=test.provider.multifile.IScoutQueryInterface2PortType] [processor=JaxWsAnnotationProcessor]
19:37:39 5. WARNING: Annotation processing: Generate handler delegate [handler=org.eclipse.scout.rt.server.jaxws.handler.LogHandler, handlerDelegate=test.provider.multifile.ScoutQueryInterface2WebServiceEntryPoint_LogHandler, portTypeDefinition=test.provider.multifile.IScoutQueryInterface2WebServiceEntryPointDefinition, endpointInterface=test.provider.multifile.IScoutQueryInterface2PortType] [processor=JaxWsAnnotationProcessor]
19:37:39 6. WARNING: Annotation processing: Generate AuthHandler [authHandler=test.provider.multifile.ScoutQueryInterface2WebServiceEntryPoint_AuthHandler, portTypeDefinition=test.provider.multifile.IScoutQueryInterface2WebServiceEntryPointDefinition, endpointInterface=test.provider.multifile.IScoutQueryInterface2PortType] [processor=JaxWsAnnotationProcessor]
19:37:39 7. WARNING: Annotation processing: Generate handler chain XML-file [file=ScoutQueryInterface2WebServiceEntryPoint_handler-chain.xml, portTypeDefinition=test.provider.multifile.IScoutQueryInterface2WebServiceEntryPointDefinition, endpointInterface=test.provider.multifile.IScoutQueryInterface2PortType] [processor=JaxWsAnnotationProcessor]
19:37:39 8. WARNING: Annotation processing: Entry point successfully generated. [entryPoint=test.provider.multifile.ScoutQueryInterface2WebServiceEntryPoint, endpointInterface=test.provider.multifile.IScoutQueryInterface2PortType, entryPointDefinition=test.provider.multifile.IScoutQueryInterface2WebServiceEntryPointDefinition] [processor=JaxWsAnnotationProcessor]
19:37:39 9. WARNING: Annotation processing: Annotation processing started... [processor=JaxWsAnnotationProcessor]
19:37:39 10. WARNING: Annotation processing: Annotation processing started... [processor=JaxWsAnnotationProcessor]
19:37:39 10 problems (10 warnings)
19:37:41 2020-08-06 23:37:41.902 [WARNING] /tmp/CoreScoutTestingUtils-projectDir3256162514336181052/artifact/artifact.client/src/main/java/group/artifact/client/ClientSession.java:[4] 
19:37:41 	import org.eclipse.scout.rt.client.IClientSession;
19:37:41 	       ^^^^^^^^^^^^^^^^^^^^^^^^^^^^^^^^^^^^^^^^^^
19:37:41 The import org.eclipse.scout.rt.client.IClientSession is never used
19:37:41 1 problem (1 warning)
19:37:41 2020-08-06 23:37:41.984 [WARNING] /tmp/CoreScoutTestingUtils-projectDir3256162514336181052/artifact/artifact.client/src/test/java/group/artifact/client/helloworld/HelloWorldFormTest.java:[8] 
19:37:41 	import group.artifact.client.helloworld.HelloWorldForm.MainBox.TopBox.MessageField;
19:37:41 	       ^^^^^^^^^^^^^^^^^^^^^^^^^^^^^^^^^^^^^^^^^^^^^^^^^^^^^^^^^^^^^^^^^^^^^^^^^^^
19:37:41 The import group.artifact.client.helloworld.HelloWorldForm.MainBox.TopBox.MessageField is never used
19:37:41 1 problem (1 warning)
19:37:53 2020-08-06 23:37:53.384 [SEVERE]  Command execution failed.
19:37:53 org.apache.commons.exec.ExecuteException: Process exited with an error: 1 (Exit value: 1)
19:37:53 	at org.apache.commons.exec.DefaultExecutor.executeInternal(DefaultExecutor.java:404)
19:37:53 	at org.apache.commons.exec.DefaultExecutor.execute(DefaultExecutor.java:166)
19:37:53 	at org.codehaus.mojo.exec.ExecMojo.executeCommandLine(ExecMojo.java:804)
19:37:53 	at org.codehaus.mojo.exec.ExecMojo.executeCommandLine(ExecMojo.java:751)
19:37:53 	at org.codehaus.mojo.exec.ExecMojo.execute(ExecMojo.java:313)
19:37:53 	at org.apache.maven.plugin.DefaultBuildPluginManager.executeMojo(DefaultBuildPluginManager.java:137)
19:37:53 	at org.apache.maven.lifecycle.internal.MojoExecutor.execute(MojoExecutor.java:210)
19:37:53 	at org.apache.maven.lifecycle.internal.MojoExecutor.execute(MojoExecutor.java:156)
19:37:53 	at org.apache.maven.lifecycle.internal.MojoExecutor.execute(MojoExecutor.java:148)
19:37:53 	at org.apache.maven.lifecycle.internal.LifecycleModuleBuilder.buildProject(LifecycleModuleBuilder.java:117)
19:37:53 	at org.apache.maven.lifecycle.internal.LifecycleModuleBuilder.buildProject(LifecycleModuleBuilder.java:81)
19:37:53 	at org.apache.maven.lifecycle.internal.builder.singlethreaded.SingleThreadedBuilder.build(SingleThreadedBuilder.java:56)
19:37:53 	at org.apache.maven.lifecycle.internal.LifecycleStarter.execute(LifecycleStarter.java:128)
19:37:53 	at org.apache.maven.DefaultMaven.doExecute(DefaultMaven.java:305)
19:37:53 	at org.apache.maven.DefaultMaven.doExecute(DefaultMaven.java:192)
19:37:53 	at org.apache.maven.DefaultMaven.execute(DefaultMaven.java:105)
19:37:53 	at org.apache.maven.cli.MavenCli.execute(MavenCli.java:957)
19:37:53 	at org.apache.maven.cli.MavenCli.doMain(MavenCli.java:289)
19:37:53 	at org.apache.maven.cli.MavenCli.doMain(MavenCli.java:244)
19:37:53 	at java.base/jdk.internal.reflect.NativeMethodAccessorImpl.invoke0(Native Method)
19:37:53 	at java.base/jdk.internal.reflect.NativeMethodAccessorImpl.invoke(NativeMethodAccessorImpl.java:62)
19:37:53 	at java.base/jdk.internal.reflect.DelegatingMethodAccessorImpl.invoke(DelegatingMethodAccessorImpl.java:43)
19:37:53 	at java.base/java.lang.reflect.Method.invoke(Method.java:566)
19:37:53 	at org.eclipse.scout.sdk.core.s.testing.maven.MavenCliRunner.runMavenInSandbox(MavenCliRunner.java:153)
19:37:53 	at org.eclipse.scout.sdk.core.s.testing.maven.MavenCliRunner.execute(MavenCliRunner.java:87)
19:37:53 	at org.eclipse.scout.sdk.core.s.testing.maven.MavenCliRunner.execute(MavenCliRunner.java:67)
19:37:53 	at org.eclipse.scout.sdk.core.s.util.maven.MavenRunner.execute(MavenRunner.java:76)
19:37:53 	at org.eclipse.scout.sdk.core.s.testing.CoreScoutTestingUtils.runMavenCommand(CoreScoutTestingUtils.java:246)
19:37:53 	at org.eclipse.scout.sdk.core.s.testing.CoreScoutTestingUtils.runMavenCleanTest(CoreScoutTestingUtils.java:223)
19:37:53 	at org.eclipse.scout.sdk.core.s.jaxws.WebServiceNewOperationTest.createWebService(WebServiceNewOperationTest.java:252)
19:37:53 	at org.eclipse.scout.sdk.core.s.jaxws.WebServiceNewOperationTest.createWebServiceProvider(WebServiceNewOperationTest.java:178)
19:37:53 	at org.eclipse.scout.sdk.core.s.jaxws.WebServiceNewOperationTest.lambda$3(WebServiceNewOperationTest.java:104)
19:37:53 	at org.eclipse.scout.sdk.core.s.testing.context.TestingEnvironmentBuilder.lambda$0(TestingEnvironmentBuilder.java:61)
19:37:53 	at org.eclipse.scout.sdk.core.s.testing.context.TestingEnvironmentBuilder.runInTestingEnvironment(TestingEnvironmentBuilder.java:77)
19:37:53 	at org.eclipse.scout.sdk.core.s.testing.context.TestingEnvironmentBuilder.lambda$2(TestingEnvironmentBuilder.java:71)
19:37:53 	at org.eclipse.scout.sdk.core.s.testing.context.TestingEnvironmentBuilder.lambda$3(TestingEnvironmentBuilder.java:82)
19:37:53 	at org.eclipse.scout.sdk.core.s.testing.context.TestingEnvironmentBuilder.lambda$1(TestingEnvironmentBuilder.java:71)
19:37:53 	at org.eclipse.scout.sdk.core.s.testing.context.TestingEnvironmentBuilder.lambda$3(TestingEnvironmentBuilder.java:82)
19:37:53 	at org.eclipse.scout.sdk.core.s.testing.context.TestingEnvironmentBuilder.call(TestingEnvironmentBuilder.java:70)
19:37:53 	at org.eclipse.scout.sdk.core.s.testing.context.TestingEnvironmentBuilder.run(TestingEnvironmentBuilder.java:60)
19:37:53 	at org.eclipse.scout.sdk.core.s.jaxws.WebServiceNewOperationTest.runCreateJaxWsModule(WebServiceNewOperationTest.java:129)
19:37:53 	at org.eclipse.scout.sdk.core.s.jaxws.WebServiceNewOperationTest.testNewWebServicesProviderFirst(WebServiceNewOperationTest.java:103)
19:37:53 	at java.base/jdk.internal.reflect.NativeMethodAccessorImpl.invoke0(Native Method)
19:37:53 	at java.base/jdk.internal.reflect.NativeMethodAccessorImpl.invoke(NativeMethodAccessorImpl.java:62)
19:37:53 	at java.base/jdk.internal.reflect.DelegatingMethodAccessorImpl.invoke(DelegatingMethodAccessorImpl.java:43)
19:37:53 	at java.base/java.lang.reflect.Method.invoke(Method.java:566)
19:37:53 	at org.junit.platform.commons.util.ReflectionUtils.invokeMethod(ReflectionUtils.java:686)
19:37:53 	at org.junit.jupiter.engine.execution.MethodInvocation.proceed(MethodInvocation.java:60)
19:37:53 	at org.junit.jupiter.engine.execution.InvocationInterceptorChain$ValidatingInvocation.proceed(InvocationInterceptorChain.java:131)
19:37:53 	at org.junit.jupiter.engine.extension.TimeoutExtension.intercept(TimeoutExtension.java:149)
19:37:53 	at org.junit.jupiter.engine.extension.TimeoutExtension.interceptTestableMethod(TimeoutExtension.java:140)
19:37:53 	at org.junit.jupiter.engine.extension.TimeoutExtension.interceptTestMethod(TimeoutExtension.java:84)
19:37:53 	at org.junit.jupiter.engine.execution.ExecutableInvoker$ReflectiveInterceptorCall.lambda$ofVoidMethod$0(ExecutableInvoker.java:115)
19:37:53 	at org.junit.jupiter.engine.execution.ExecutableInvoker.lambda$invoke$0(ExecutableInvoker.java:105)
19:37:53 	at org.junit.jupiter.engine.execution.InvocationInterceptorChain$InterceptedInvocation.proceed(InvocationInterceptorChain.java:106)
19:37:53 	at org.junit.jupiter.engine.execution.InvocationInterceptorChain.proceed(InvocationInterceptorChain.java:64)
19:37:53 	at org.junit.jupiter.engine.execution.InvocationInterceptorChain.chainAndInvoke(InvocationInterceptorChain.java:45)
19:37:53 	at org.junit.jupiter.engine.execution.InvocationInterceptorChain.invoke(InvocationInterceptorChain.java:37)
19:37:53 	at org.junit.jupiter.engine.execution.ExecutableInvoker.invoke(ExecutableInvoker.java:104)
19:37:53 	at org.junit.jupiter.engine.execution.ExecutableInvoker.invoke(ExecutableInvoker.java:98)
19:37:53 	at org.junit.jupiter.engine.descriptor.TestMethodTestDescriptor.lambda$invokeTestMethod$6(TestMethodTestDescriptor.java:212)
19:37:53 	at org.junit.platform.engine.support.hierarchical.ThrowableCollector.execute(ThrowableCollector.java:73)
19:37:53 	at org.junit.jupiter.engine.descriptor.TestMethodTestDescriptor.invokeTestMethod(TestMethodTestDescriptor.java:208)
19:37:53 	at org.junit.jupiter.engine.descriptor.TestMethodTestDescriptor.execute(TestMethodTestDescriptor.java:137)
19:37:53 	at org.junit.jupiter.engine.descriptor.TestMethodTestDescriptor.execute(TestMethodTestDescriptor.java:71)
19:37:53 	at org.junit.platform.engine.support.hierarchical.NodeTestTask.lambda$executeRecursively$5(NodeTestTask.java:135)
19:37:53 	at org.junit.platform.engine.support.hierarchical.ThrowableCollector.execute(ThrowableCollector.java:73)
19:37:53 	at org.junit.platform.engine.support.hierarchical.NodeTestTask.lambda$executeRecursively$7(NodeTestTask.java:125)
19:37:53 	at org.junit.platform.engine.support.hierarchical.Node.around(Node.java:135)
19:37:53 	at org.junit.platform.engine.support.hierarchical.NodeTestTask.lambda$executeRecursively$8(NodeTestTask.java:123)
19:37:53 	at org.junit.platform.engine.support.hierarchical.ThrowableCollector.execute(ThrowableCollector.java:73)
19:37:53 	at org.junit.platform.engine.support.hierarchical.NodeTestTask.executeRecursively(NodeTestTask.java:122)
19:37:53 	at org.junit.platform.engine.support.hierarchical.NodeTestTask.execute(NodeTestTask.java:80)
19:37:53 	at java.base/java.util.ArrayList.forEach(ArrayList.java:1540)
19:37:53 	at org.junit.platform.engine.support.hierarchical.SameThreadHierarchicalTestExecutorService.invokeAll(SameThreadHierarchicalTestExecutorService.java:38)
19:37:53 	at org.junit.platform.engine.support.hierarchical.NodeTestTask.lambda$executeRecursively$5(NodeTestTask.java:139)
19:37:53 	at org.junit.platform.engine.support.hierarchical.ThrowableCollector.execute(ThrowableCollector.java:73)
19:37:53 	at org.junit.platform.engine.support.hierarchical.NodeTestTask.lambda$executeRecursively$7(NodeTestTask.java:125)
19:37:53 	at org.junit.platform.engine.support.hierarchical.Node.around(Node.java:135)
19:37:53 	at org.junit.platform.engine.support.hierarchical.NodeTestTask.lambda$executeRecursively$8(NodeTestTask.java:123)
19:37:53 	at org.junit.platform.engine.support.hierarchical.ThrowableCollector.execute(ThrowableCollector.java:73)
19:37:53 	at org.junit.platform.engine.support.hierarchical.NodeTestTask.executeRecursively(NodeTestTask.java:122)
19:37:53 	at org.junit.platform.engine.support.hierarchical.NodeTestTask.execute(NodeTestTask.java:80)
19:37:53 	at java.base/java.util.ArrayList.forEach(ArrayList.java:1540)
19:37:53 	at org.junit.platform.engine.support.hierarchical.SameThreadHierarchicalTestExecutorService.invokeAll(SameThreadHierarchicalTestExecutorService.java:38)
19:37:53 	at org.junit.platform.engine.support.hierarchical.NodeTestTask.lambda$executeRecursively$5(NodeTestTask.java:139)
19:37:53 	at org.junit.platform.engine.support.hierarchical.ThrowableCollector.execute(ThrowableCollector.java:73)
19:37:53 	at org.junit.platform.engine.support.hierarchical.NodeTestTask.lambda$executeRecursively$7(NodeTestTask.java:125)
19:37:53 	at org.junit.platform.engine.support.hierarchical.Node.around(Node.java:135)
19:37:53 	at org.junit.platform.engine.support.hierarchical.NodeTestTask.lambda$executeRecursively$8(NodeTestTask.java:123)
19:37:53 	at org.junit.platform.engine.support.hierarchical.ThrowableCollector.execute(ThrowableCollector.java:73)
19:37:53 	at org.junit.platform.engine.support.hierarchical.NodeTestTask.executeRecursively(NodeTestTask.java:122)
19:37:53 	at org.junit.platform.engine.support.hierarchical.NodeTestTask.execute(NodeTestTask.java:80)
19:37:53 	at org.junit.platform.engine.support.hierarchical.SameThreadHierarchicalTestExecutorService.submit(SameThreadHierarchicalTestExecutorService.java:32)
19:37:53 	at org.junit.platform.engine.support.hierarchical.HierarchicalTestExecutor.execute(HierarchicalTestExecutor.java:57)
19:37:53 	at org.junit.platform.engine.support.hierarchical.HierarchicalTestEngine.execute(HierarchicalTestEngine.java:51)
19:37:53 	at org.junit.platform.launcher.core.DefaultLauncher.execute(DefaultLauncher.java:248)
19:37:53 	at org.junit.platform.launcher.core.DefaultLauncher.lambda$execute$5(DefaultLauncher.java:211)
19:37:53 	at org.junit.platform.launcher.core.DefaultLauncher.withInterceptedStreams(DefaultLauncher.java:226)
19:37:53 	at org.junit.platform.launcher.core.DefaultLauncher.execute(DefaultLauncher.java:199)
19:37:53 	at org.junit.platform.launcher.core.DefaultLauncher.execute(DefaultLauncher.java:132)
19:37:53 	at org.apache.maven.surefire.junitplatform.JUnitPlatformProvider.invokeAllTests(JUnitPlatformProvider.java:142)
19:37:53 	at org.apache.maven.surefire.junitplatform.JUnitPlatformProvider.invoke(JUnitPlatformProvider.java:117)
19:37:53 	at org.apache.maven.surefire.booter.ForkedBooter.invokeProviderInSameClassLoader(ForkedBooter.java:384)
19:37:53 	at org.apache.maven.surefire.booter.ForkedBooter.runSuitesInProcess(ForkedBooter.java:345)
19:37:53 	at org.apache.maven.surefire.booter.ForkedBooter.execute(ForkedBooter.java:126)
19:37:53 	at org.apache.maven.surefire.booter.ForkedBooter.main(ForkedBooter.java:418)
19:37:53 2020-08-06 23:37:53.386 [SEVERE]  Failed to execute goal org.codehaus.mojo:exec-maven-plugin:1.6.0:exec (npm-update) on project artifact.ui.html: Command execution failed. Process exited with an error: 1 (Exit value: 1) -> [Help 1]
19:37:53 org.apache.maven.lifecycle.LifecycleExecutionException: Failed to execute goal org.codehaus.mojo:exec-maven-plugin:1.6.0:exec (npm-update) on project artifact.ui.html: Command execution failed.
19:37:53 	at org.apache.maven.lifecycle.internal.MojoExecutor.execute(MojoExecutor.java:215)
19:37:53 	at org.apache.maven.lifecycle.internal.MojoExecutor.execute(MojoExecutor.java:156)
19:37:53 	at org.apache.maven.lifecycle.internal.MojoExecutor.execute(MojoExecutor.java:148)
19:37:53 	at org.apache.maven.lifecycle.internal.LifecycleModuleBuilder.buildProject(LifecycleModuleBuilder.java:117)
19:37:53 	at org.apache.maven.lifecycle.internal.LifecycleModuleBuilder.buildProject(LifecycleModuleBuilder.java:81)
19:37:53 	at org.apache.maven.lifecycle.internal.builder.singlethreaded.SingleThreadedBuilder.build(SingleThreadedBuilder.java:56)
19:37:53 	at org.apache.maven.lifecycle.internal.LifecycleStarter.execute(LifecycleStarter.java:128)
19:37:53 	at org.apache.maven.DefaultMaven.doExecute(DefaultMaven.java:305)
19:37:53 	at org.apache.maven.DefaultMaven.doExecute(DefaultMaven.java:192)
19:37:53 	at org.apache.maven.DefaultMaven.execute(DefaultMaven.java:105)
19:37:53 	at org.apache.maven.cli.MavenCli.execute(MavenCli.java:957)
19:37:53 	at org.apache.maven.cli.MavenCli.doMain(MavenCli.java:289)
19:37:53 	at org.apache.maven.cli.MavenCli.doMain(MavenCli.java:244)
19:37:53 	at java.base/jdk.internal.reflect.NativeMethodAccessorImpl.invoke0(Native Method)
19:37:53 	at java.base/jdk.internal.reflect.NativeMethodAccessorImpl.invoke(NativeMethodAccessorImpl.java:62)
19:37:53 	at java.base/jdk.internal.reflect.DelegatingMethodAccessorImpl.invoke(DelegatingMethodAccessorImpl.java:43)
19:37:53 	at java.base/java.lang.reflect.Method.invoke(Method.java:566)
19:37:53 	at org.eclipse.scout.sdk.core.s.testing.maven.MavenCliRunner.runMavenInSandbox(MavenCliRunner.java:153)
19:37:53 	at org.eclipse.scout.sdk.core.s.testing.maven.MavenCliRunner.execute(MavenCliRunner.java:87)
19:37:53 	at org.eclipse.scout.sdk.core.s.testing.maven.MavenCliRunner.execute(MavenCliRunner.java:67)
19:37:53 	at org.eclipse.scout.sdk.core.s.util.maven.MavenRunner.execute(MavenRunner.java:76)
19:37:53 	at org.eclipse.scout.sdk.core.s.testing.CoreScoutTestingUtils.runMavenCommand(CoreScoutTestingUtils.java:246)
19:37:53 	at org.eclipse.scout.sdk.core.s.testing.CoreScoutTestingUtils.runMavenCleanTest(CoreScoutTestingUtils.java:223)
19:37:53 	at org.eclipse.scout.sdk.core.s.jaxws.WebServiceNewOperationTest.createWebService(WebServiceNewOperationTest.java:252)
19:37:53 	at org.eclipse.scout.sdk.core.s.jaxws.WebServiceNewOperationTest.createWebServiceProvider(WebServiceNewOperationTest.java:178)
19:37:53 	at org.eclipse.scout.sdk.core.s.jaxws.WebServiceNewOperationTest.lambda$3(WebServiceNewOperationTest.java:104)
19:37:53 	at org.eclipse.scout.sdk.core.s.testing.context.TestingEnvironmentBuilder.lambda$0(TestingEnvironmentBuilder.java:61)
19:37:53 	at org.eclipse.scout.sdk.core.s.testing.context.TestingEnvironmentBuilder.runInTestingEnvironment(TestingEnvironmentBuilder.java:77)
19:37:53 	at org.eclipse.scout.sdk.core.s.testing.context.TestingEnvironmentBuilder.lambda$2(TestingEnvironmentBuilder.java:71)
19:37:53 	at org.eclipse.scout.sdk.core.s.testing.context.TestingEnvironmentBuilder.lambda$3(TestingEnvironmentBuilder.java:82)
19:37:53 	at org.eclipse.scout.sdk.core.s.testing.context.TestingEnvironmentBuilder.lambda$1(TestingEnvironmentBuilder.java:71)
19:37:53 	at org.eclipse.scout.sdk.core.s.testing.context.TestingEnvironmentBuilder.lambda$3(TestingEnvironmentBuilder.java:82)
19:37:53 	at org.eclipse.scout.sdk.core.s.testing.context.TestingEnvironmentBuilder.call(TestingEnvironmentBuilder.java:70)
19:37:53 	at org.eclipse.scout.sdk.core.s.testing.context.TestingEnvironmentBuilder.run(TestingEnvironmentBuilder.java:60)
19:37:53 	at org.eclipse.scout.sdk.core.s.jaxws.WebServiceNewOperationTest.runCreateJaxWsModule(WebServiceNewOperationTest.java:129)
19:37:53 	at org.eclipse.scout.sdk.core.s.jaxws.WebServiceNewOperationTest.testNewWebServicesProviderFirst(WebServiceNewOperationTest.java:103)
19:37:53 	at java.base/jdk.internal.reflect.NativeMethodAccessorImpl.invoke0(Native Method)
19:37:53 	at java.base/jdk.internal.reflect.NativeMethodAccessorImpl.invoke(NativeMethodAccessorImpl.java:62)
19:37:53 	at java.base/jdk.internal.reflect.DelegatingMethodAccessorImpl.invoke(DelegatingMethodAccessorImpl.java:43)
19:37:53 	at java.base/java.lang.reflect.Method.invoke(Method.java:566)
19:37:53 	at org.junit.platform.commons.util.ReflectionUtils.invokeMethod(ReflectionUtils.java:686)
19:37:53 	at org.junit.jupiter.engine.execution.MethodInvocation.proceed(MethodInvocation.java:60)
19:37:53 	at org.junit.jupiter.engine.execution.InvocationInterceptorChain$ValidatingInvocation.proceed(InvocationInterceptorChain.java:131)
19:37:53 	at org.junit.jupiter.engine.extension.TimeoutExtension.intercept(TimeoutExtension.java:149)
19:37:53 	at org.junit.jupiter.engine.extension.TimeoutExtension.interceptTestableMethod(TimeoutExtension.java:140)
19:37:53 	at org.junit.jupiter.engine.extension.TimeoutExtension.interceptTestMethod(TimeoutExtension.java:84)
19:37:53 	at org.junit.jupiter.engine.execution.ExecutableInvoker$ReflectiveInterceptorCall.lambda$ofVoidMethod$0(ExecutableInvoker.java:115)
19:37:53 	at org.junit.jupiter.engine.execution.ExecutableInvoker.lambda$invoke$0(ExecutableInvoker.java:105)
19:37:53 	at org.junit.jupiter.engine.execution.InvocationInterceptorChain$InterceptedInvocation.proceed(InvocationInterceptorChain.java:106)
19:37:53 	at org.junit.jupiter.engine.execution.InvocationInterceptorChain.proceed(InvocationInterceptorChain.java:64)
19:37:53 	at org.junit.jupiter.engine.execution.InvocationInterceptorChain.chainAndInvoke(InvocationInterceptorChain.java:45)
19:37:53 	at org.junit.jupiter.engine.execution.InvocationInterceptorChain.invoke(InvocationInterceptorChain.java:37)
19:37:53 	at org.junit.jupiter.engine.execution.ExecutableInvoker.invoke(ExecutableInvoker.java:104)
19:37:53 	at org.junit.jupiter.engine.execution.ExecutableInvoker.invoke(ExecutableInvoker.java:98)
19:37:53 	at org.junit.jupiter.engine.descriptor.TestMethodTestDescriptor.lambda$invokeTestMethod$6(TestMethodTestDescriptor.java:212)
19:37:53 	at org.junit.platform.engine.support.hierarchical.ThrowableCollector.execute(ThrowableCollector.java:73)
19:37:53 	at org.junit.jupiter.engine.descriptor.TestMethodTestDescriptor.invokeTestMethod(TestMethodTestDescriptor.java:208)
19:37:53 	at org.junit.jupiter.engine.descriptor.TestMethodTestDescriptor.execute(TestMethodTestDescriptor.java:137)
19:37:53 	at org.junit.jupiter.engine.descriptor.TestMethodTestDescriptor.execute(TestMethodTestDescriptor.java:71)
19:37:53 	at org.junit.platform.engine.support.hierarchical.NodeTestTask.lambda$executeRecursively$5(NodeTestTask.java:135)
19:37:53 	at org.junit.platform.engine.support.hierarchical.ThrowableCollector.execute(ThrowableCollector.java:73)
19:37:53 	at org.junit.platform.engine.support.hierarchical.NodeTestTask.lambda$executeRecursively$7(NodeTestTask.java:125)
19:37:53 	at org.junit.platform.engine.support.hierarchical.Node.around(Node.java:135)
19:37:53 	at org.junit.platform.engine.support.hierarchical.NodeTestTask.lambda$executeRecursively$8(NodeTestTask.java:123)
19:37:53 	at org.junit.platform.engine.support.hierarchical.ThrowableCollector.execute(ThrowableCollector.java:73)
19:37:53 	at org.junit.platform.engine.support.hierarchical.NodeTestTask.executeRecursively(NodeTestTask.java:122)
19:37:53 	at org.junit.platform.engine.support.hierarchical.NodeTestTask.execute(NodeTestTask.java:80)
19:37:53 	at java.base/java.util.ArrayList.forEach(ArrayList.java:1540)
19:37:53 	at org.junit.platform.engine.support.hierarchical.SameThreadHierarchicalTestExecutorService.invokeAll(SameThreadHierarchicalTestExecutorService.java:38)
19:37:53 	at org.junit.platform.engine.support.hierarchical.NodeTestTask.lambda$executeRecursively$5(NodeTestTask.java:139)
19:37:53 	at org.junit.platform.engine.support.hierarchical.ThrowableCollector.execute(ThrowableCollector.java:73)
19:37:53 	at org.junit.platform.engine.support.hierarchical.NodeTestTask.lambda$executeRecursively$7(NodeTestTask.java:125)
19:37:53 	at org.junit.platform.engine.support.hierarchical.Node.around(Node.java:135)
19:37:53 	at org.junit.platform.engine.support.hierarchical.NodeTestTask.lambda$executeRecursively$8(NodeTestTask.java:123)
19:37:53 	at org.junit.platform.engine.support.hierarchical.ThrowableCollector.execute(ThrowableCollector.java:73)
19:37:53 	at org.junit.platform.engine.support.hierarchical.NodeTestTask.executeRecursively(NodeTestTask.java:122)
19:37:53 	at org.junit.platform.engine.support.hierarchical.NodeTestTask.execute(NodeTestTask.java:80)
19:37:53 	at java.base/java.util.ArrayList.forEach(ArrayList.java:1540)
19:37:53 	at org.junit.platform.engine.support.hierarchical.SameThreadHierarchicalTestExecutorService.invokeAll(SameThreadHierarchicalTestExecutorService.java:38)
19:37:53 	at org.junit.platform.engine.support.hierarchical.NodeTestTask.lambda$executeRecursively$5(NodeTestTask.java:139)
19:37:53 	at org.junit.platform.engine.support.hierarchical.ThrowableCollector.execute(ThrowableCollector.java:73)
19:37:53 	at org.junit.platform.engine.support.hierarchical.NodeTestTask.lambda$executeRecursively$7(NodeTestTask.java:125)
19:37:53 	at org.junit.platform.engine.support.hierarchical.Node.around(Node.java:135)
19:37:53 	at org.junit.platform.engine.support.hierarchical.NodeTestTask.lambda$executeRecursively$8(NodeTestTask.java:123)
19:37:53 	at org.junit.platform.engine.support.hierarchical.ThrowableCollector.execute(ThrowableCollector.java:73)
19:37:53 	at org.junit.platform.engine.support.hierarchical.NodeTestTask.executeRecursively(NodeTestTask.java:122)
19:37:53 	at org.junit.platform.engine.support.hierarchical.NodeTestTask.execute(NodeTestTask.java:80)
19:37:53 	at org.junit.platform.engine.support.hierarchical.SameThreadHierarchicalTestExecutorService.submit(SameThreadHierarchicalTestExecutorService.java:32)
19:37:53 	at org.junit.platform.engine.support.hierarchical.HierarchicalTestExecutor.execute(HierarchicalTestExecutor.java:57)
19:37:53 	at org.junit.platform.engine.support.hierarchical.HierarchicalTestEngine.execute(HierarchicalTestEngine.java:51)
19:37:53 	at org.junit.platform.launcher.core.DefaultLauncher.execute(DefaultLauncher.java:248)
19:37:53 	at org.junit.platform.launcher.core.DefaultLauncher.lambda$execute$5(DefaultLauncher.java:211)
19:37:53 	at org.junit.platform.launcher.core.DefaultLauncher.withInterceptedStreams(DefaultLauncher.java:226)
19:37:53 	at org.junit.platform.launcher.core.DefaultLauncher.execute(DefaultLauncher.java:199)
19:37:53 	at org.junit.platform.launcher.core.DefaultLauncher.execute(DefaultLauncher.java:132)
19:37:53 	at org.apache.maven.surefire.junitplatform.JUnitPlatformProvider.invokeAllTests(JUnitPlatformProvider.java:142)
19:37:53 	at org.apache.maven.surefire.junitplatform.JUnitPlatformProvider.invoke(JUnitPlatformProvider.java:117)
19:37:53 	at org.apache.maven.surefire.booter.ForkedBooter.invokeProviderInSameClassLoader(ForkedBooter.java:384)
19:37:53 	at org.apache.maven.surefire.booter.ForkedBooter.runSuitesInProcess(ForkedBooter.java:345)
19:37:53 	at org.apache.maven.surefire.booter.ForkedBooter.execute(ForkedBooter.java:126)
19:37:53 	at org.apache.maven.surefire.booter.ForkedBooter.main(ForkedBooter.java:418)
19:37:53 Caused by: org.apache.maven.plugin.MojoExecutionException: Command execution failed.
19:37:53 	at org.codehaus.mojo.exec.ExecMojo.execute(ExecMojo.java:326)
19:37:53 	at org.apache.maven.plugin.DefaultBuildPluginManager.executeMojo(DefaultBuildPluginManager.java:137)
19:37:53 	at org.apache.maven.lifecycle.internal.MojoExecutor.execute(MojoExecutor.java:210)
19:37:53 	... 100 more
19:37:53 Caused by: org.apache.commons.exec.ExecuteException: Process exited with an error: 1 (Exit value: 1)
19:37:53 	at org.apache.commons.exec.DefaultExecutor.executeInternal(DefaultExecutor.java:404)
19:37:53 	at org.apache.commons.exec.DefaultExecutor.execute(DefaultExecutor.java:166)
19:37:53 	at org.codehaus.mojo.exec.ExecMojo.executeCommandLine(ExecMojo.java:804)
19:37:53 	at org.codehaus.mojo.exec.ExecMojo.executeCommandLine(ExecMojo.java:751)
19:37:53 	at org.codehaus.mojo.exec.ExecMojo.execute(ExecMojo.java:313)
19:37:53 	... 102 more
19:37:53 2020-08-06 23:37:53.389 [SEVERE]  
19:37:53 2020-08-06 23:37:53.391 [SEVERE]  Re-run Maven using the -X switch to enable full debug logging.
19:37:53 2020-08-06 23:37:53.391 [SEVERE]  
19:37:53 2020-08-06 23:37:53.391 [SEVERE]  For more information about the errors and possible solutions, please read the following articles:
19:37:53 2020-08-06 23:37:53.391 [SEVERE]  [Help 1] http://cwiki.apache.org/confluence/display/MAVEN/MojoExecutionException
19:37:53 2020-08-06 23:37:53.391 [SEVERE]  
19:37:53 2020-08-06 23:37:53.391 [SEVERE]  After correcting the problems, you can resume the build with the command
19:37:53 2020-08-06 23:37:53.391 [SEVERE]    mvn <args> -rf :artifact.ui.html
19:37:53 2020-08-06 23:37:53.398 [SEVERE]  Output of embedded Maven call:
19:37:53 MVN-BEGIN
19:37:53 2020-08-06 23:37:43,092 WARN  [main] org.eclipse.scout.testing.client.ClientSessionProviderWithCache.registerSessionForNotifications(ClientSessionProviderWithCache.java:164) - Failed to register session for notifications. - MDC[]
19:37:53 2020-08-06 23:37:43,094 WARN  [main] org.eclipse.scout.rt.client.AbstractClientSession.getUserAgent(AbstractClientSession.java:162) - UserAgent not set; using default [default=UNKNOWN|UNKNOWN|UNKNOWN|UNKNOWN|Linux] - MDC[]
19:37:53 
19:37:53 MVN-END
19:37:53 
19:37:58 2020-08-06 23:37:58.331 [WARNING] Don't override file /tmp/CoreScoutTestingUtils-projectDir15876467915177951485/artifact/artifact/pom.xml
19:37:58 2020-08-06 23:37:58.473 [WARNING] Don't override file /tmp/CoreScoutTestingUtils-projectDir15876467915177951485/artifact/artifact.ui.html/src/main/js/artifact.js
19:37:58 2020-08-06 23:37:58.473 [WARNING] Don't override file /tmp/CoreScoutTestingUtils-projectDir15876467915177951485/artifact/artifact.ui.html/src/main/js/index.js
19:37:58 2020-08-06 23:37:58.474 [WARNING] Don't override file /tmp/CoreScoutTestingUtils-projectDir15876467915177951485/artifact/artifact.ui.html/src/main/js/login.js
19:37:58 2020-08-06 23:37:58.474 [WARNING] Don't override file /tmp/CoreScoutTestingUtils-projectDir15876467915177951485/artifact/artifact.ui.html/src/main/js/logout.js
19:37:58 2020-08-06 23:37:58.479 [WARNING] Don't override file /tmp/CoreScoutTestingUtils-projectDir15876467915177951485/artifact/artifact.ui.html/src/main/resources/WebContent/favicon/manifest.json
19:37:58 2020-08-06 23:37:58.483 [WARNING] Don't override file /tmp/CoreScoutTestingUtils-projectDir15876467915177951485/artifact/artifact.ui.html/src/main/resources/WebContent/popup-window.js
19:38:03 2020-08-06 23:38:03.375 [WARNING] CP Don't override file /tmp/jaxws-module-tmp15155221677670214823/artifact.server.jaxws/src/main/resources/META-INF/scout.xml
19:39:09 2020-08-06 23:39:09.836 [WARNING] /tmp/CoreScoutTestingUtils-projectDir15876467915177951485/artifact/artifact.shared/src/main/java/group/artifact/shared/security/AccessControlService.java:[4] 
19:39:09 	import org.eclipse.scout.rt.security.IAccessControlService;
19:39:09 	       ^^^^^^^^^^^^^^^^^^^^^^^^^^^^^^^^^^^^^^^^^^^^^^^^^^^
19:39:09 The import org.eclipse.scout.rt.security.IAccessControlService is never used
19:39:09 2020-08-06 23:39:09.836 [WARNING] /tmp/CoreScoutTestingUtils-projectDir15876467915177951485/artifact/artifact.shared/src/main/java/group/artifact/shared/security/AccessControlService.java:[6] 
19:39:09 	import org.eclipse.scout.rt.shared.ISession;
19:39:09 	       ^^^^^^^^^^^^^^^^^^^^^^^^^^^^^^^^^^^^
19:39:09 The import org.eclipse.scout.rt.shared.ISession is never used
19:39:09 2 problems (2 warnings)
19:39:42 2020-08-06 23:39:42.445 [WARNING] /tmp/CoreScoutTestingUtils-projectDir15876467915177951485/artifact/artifact.server.jaxws/target/generated-sources/wsimport/test/consumer/ErrorResponse.java:[15] 
19:39:42 	public class ErrorResponse
19:39:42 	             ^^^^^^^^^^^^^
19:39:42 The serializable class ErrorResponse does not declare a static final serialVersionUID field of type long
19:39:42 2. WARNING: Annotation processing: Annotation processing started... [processor=JaxWsAnnotationProcessor]
19:39:42 3. WARNING: Annotation processing: Skipped entry point generation for endpoint interface 'test.consumer.IScoutQueryInterface2PortType' because not configured with WebServiceEntryPoint annotation. [processor=JaxWsAnnotationProcessor]
19:39:42 4. WARNING: Annotation processing: Annotation processing started... [processor=JaxWsAnnotationProcessor]
19:39:42 4 problems (4 warnings)
19:39:44 2020-08-06 23:39:44.870 [WARNING] /tmp/CoreScoutTestingUtils-projectDir15876467915177951485/artifact/artifact.client/src/main/java/group/artifact/client/ClientSession.java:[4] 
19:39:44 	import org.eclipse.scout.rt.client.IClientSession;
19:39:44 	       ^^^^^^^^^^^^^^^^^^^^^^^^^^^^^^^^^^^^^^^^^^
19:39:44 The import org.eclipse.scout.rt.client.IClientSession is never used
19:39:44 1 problem (1 warning)
19:39:44 2020-08-06 23:39:44.970 [WARNING] /tmp/CoreScoutTestingUtils-projectDir15876467915177951485/artifact/artifact.client/src/test/java/group/artifact/client/helloworld/HelloWorldFormTest.java:[8] 
19:39:44 	import group.artifact.client.helloworld.HelloWorldForm.MainBox.TopBox.MessageField;
19:39:44 	       ^^^^^^^^^^^^^^^^^^^^^^^^^^^^^^^^^^^^^^^^^^^^^^^^^^^^^^^^^^^^^^^^^^^^^^^^^^^
19:39:44 The import group.artifact.client.helloworld.HelloWorldForm.MainBox.TopBox.MessageField is never used
19:39:44 1 problem (1 warning)
19:39:56 2020-08-06 23:39:56.651 [SEVERE]  Command execution failed.
19:39:56 org.apache.commons.exec.ExecuteException: Process exited with an error: 1 (Exit value: 1)
19:39:56 	at org.apache.commons.exec.DefaultExecutor.executeInternal(DefaultExecutor.java:404)
19:39:56 	at org.apache.commons.exec.DefaultExecutor.execute(DefaultExecutor.java:166)
19:39:56 	at org.codehaus.mojo.exec.ExecMojo.executeCommandLine(ExecMojo.java:804)
19:39:56 	at org.codehaus.mojo.exec.ExecMojo.executeCommandLine(ExecMojo.java:751)
19:39:56 	at org.codehaus.mojo.exec.ExecMojo.execute(ExecMojo.java:313)
19:39:56 	at org.apache.maven.plugin.DefaultBuildPluginManager.executeMojo(DefaultBuildPluginManager.java:137)
19:39:56 	at org.apache.maven.lifecycle.internal.MojoExecutor.execute(MojoExecutor.java:210)
19:39:56 	at org.apache.maven.lifecycle.internal.MojoExecutor.execute(MojoExecutor.java:156)
19:39:56 	at org.apache.maven.lifecycle.internal.MojoExecutor.execute(MojoExecutor.java:148)
19:39:56 	at org.apache.maven.lifecycle.internal.LifecycleModuleBuilder.buildProject(LifecycleModuleBuilder.java:117)
19:39:56 	at org.apache.maven.lifecycle.internal.LifecycleModuleBuilder.buildProject(LifecycleModuleBuilder.java:81)
19:39:56 	at org.apache.maven.lifecycle.internal.builder.singlethreaded.SingleThreadedBuilder.build(SingleThreadedBuilder.java:56)
19:39:56 	at org.apache.maven.lifecycle.internal.LifecycleStarter.execute(LifecycleStarter.java:128)
19:39:56 	at org.apache.maven.DefaultMaven.doExecute(DefaultMaven.java:305)
19:39:56 	at org.apache.maven.DefaultMaven.doExecute(DefaultMaven.java:192)
19:39:56 	at org.apache.maven.DefaultMaven.execute(DefaultMaven.java:105)
19:39:56 	at org.apache.maven.cli.MavenCli.execute(MavenCli.java:957)
19:39:56 	at org.apache.maven.cli.MavenCli.doMain(MavenCli.java:289)
19:39:56 	at org.apache.maven.cli.MavenCli.doMain(MavenCli.java:244)
19:39:56 	at java.base/jdk.internal.reflect.NativeMethodAccessorImpl.invoke0(Native Method)
19:39:56 	at java.base/jdk.internal.reflect.NativeMethodAccessorImpl.invoke(NativeMethodAccessorImpl.java:62)
19:39:56 	at java.base/jdk.internal.reflect.DelegatingMethodAccessorImpl.invoke(DelegatingMethodAccessorImpl.java:43)
19:39:56 	at java.base/java.lang.reflect.Method.invoke(Method.java:566)
19:39:56 	at org.eclipse.scout.sdk.core.s.testing.maven.MavenCliRunner.runMavenInSandbox(MavenCliRunner.java:153)
19:39:56 	at org.eclipse.scout.sdk.core.s.testing.maven.MavenCliRunner.execute(MavenCliRunner.java:87)
19:39:56 	at org.eclipse.scout.sdk.core.s.testing.maven.MavenCliRunner.execute(MavenCliRunner.java:67)
19:39:56 	at org.eclipse.scout.sdk.core.s.util.maven.MavenRunner.execute(MavenRunner.java:76)
19:39:56 	at org.eclipse.scout.sdk.core.s.testing.CoreScoutTestingUtils.runMavenCommand(CoreScoutTestingUtils.java:246)
19:39:56 	at org.eclipse.scout.sdk.core.s.testing.CoreScoutTestingUtils.runMavenCleanTest(CoreScoutTestingUtils.java:223)
19:39:56 	at org.eclipse.scout.sdk.core.s.jaxws.WebServiceNewOperationTest.createWebService(WebServiceNewOperationTest.java:252)
19:39:56 	at org.eclipse.scout.sdk.core.s.jaxws.WebServiceNewOperationTest.createWebServiceConsumer(WebServiceNewOperationTest.java:170)
19:39:56 	at org.eclipse.scout.sdk.core.s.jaxws.WebServiceNewOperationTest.lambda$0(WebServiceNewOperationTest.java:75)
19:39:56 	at org.eclipse.scout.sdk.core.s.testing.context.TestingEnvironmentBuilder.lambda$0(TestingEnvironmentBuilder.java:61)
19:39:56 	at org.eclipse.scout.sdk.core.s.testing.context.TestingEnvironmentBuilder.runInTestingEnvironment(TestingEnvironmentBuilder.java:77)
19:39:56 	at org.eclipse.scout.sdk.core.s.testing.context.TestingEnvironmentBuilder.lambda$2(TestingEnvironmentBuilder.java:71)
19:39:56 	at org.eclipse.scout.sdk.core.s.testing.context.TestingEnvironmentBuilder.lambda$3(TestingEnvironmentBuilder.java:82)
19:39:56 	at org.eclipse.scout.sdk.core.s.testing.context.TestingEnvironmentBuilder.lambda$1(TestingEnvironmentBuilder.java:71)
19:39:56 	at org.eclipse.scout.sdk.core.s.testing.context.TestingEnvironmentBuilder.lambda$3(TestingEnvironmentBuilder.java:82)
19:39:56 	at org.eclipse.scout.sdk.core.s.testing.context.TestingEnvironmentBuilder.call(TestingEnvironmentBuilder.java:70)
19:39:56 	at org.eclipse.scout.sdk.core.s.testing.context.TestingEnvironmentBuilder.run(TestingEnvironmentBuilder.java:60)
19:39:56 	at org.eclipse.scout.sdk.core.s.jaxws.WebServiceNewOperationTest.runCreateJaxWsModule(WebServiceNewOperationTest.java:129)
19:39:56 	at org.eclipse.scout.sdk.core.s.jaxws.WebServiceNewOperationTest.testNewWebServicesConsumerFirst(WebServiceNewOperationTest.java:74)
19:39:56 	at java.base/jdk.internal.reflect.NativeMethodAccessorImpl.invoke0(Native Method)
19:39:56 	at java.base/jdk.internal.reflect.NativeMethodAccessorImpl.invoke(NativeMethodAccessorImpl.java:62)
19:39:56 	at java.base/jdk.internal.reflect.DelegatingMethodAccessorImpl.invoke(DelegatingMethodAccessorImpl.java:43)
19:39:56 	at java.base/java.lang.reflect.Method.invoke(Method.java:566)
19:39:56 	at org.junit.platform.commons.util.ReflectionUtils.invokeMethod(ReflectionUtils.java:686)
19:39:56 	at org.junit.jupiter.engine.execution.MethodInvocation.proceed(MethodInvocation.java:60)
19:39:56 	at org.junit.jupiter.engine.execution.InvocationInterceptorChain$ValidatingInvocation.proceed(InvocationInterceptorChain.java:131)
19:39:56 	at org.junit.jupiter.engine.extension.TimeoutExtension.intercept(TimeoutExtension.java:149)
19:39:56 	at org.junit.jupiter.engine.extension.TimeoutExtension.interceptTestableMethod(TimeoutExtension.java:140)
19:39:56 	at org.junit.jupiter.engine.extension.TimeoutExtension.interceptTestMethod(TimeoutExtension.java:84)
19:39:56 	at org.junit.jupiter.engine.execution.ExecutableInvoker$ReflectiveInterceptorCall.lambda$ofVoidMethod$0(ExecutableInvoker.java:115)
19:39:56 	at org.junit.jupiter.engine.execution.ExecutableInvoker.lambda$invoke$0(ExecutableInvoker.java:105)
19:39:56 	at org.junit.jupiter.engine.execution.InvocationInterceptorChain$InterceptedInvocation.proceed(InvocationInterceptorChain.java:106)
19:39:56 	at org.junit.jupiter.engine.execution.InvocationInterceptorChain.proceed(InvocationInterceptorChain.java:64)
19:39:56 	at org.junit.jupiter.engine.execution.InvocationInterceptorChain.chainAndInvoke(InvocationInterceptorChain.java:45)
19:39:56 	at org.junit.jupiter.engine.execution.InvocationInterceptorChain.invoke(InvocationInterceptorChain.java:37)
19:39:56 	at org.junit.jupiter.engine.execution.ExecutableInvoker.invoke(ExecutableInvoker.java:104)
19:39:56 	at org.junit.jupiter.engine.execution.ExecutableInvoker.invoke(ExecutableInvoker.java:98)
19:39:56 	at org.junit.jupiter.engine.descriptor.TestMethodTestDescriptor.lambda$invokeTestMethod$6(TestMethodTestDescriptor.java:212)
19:39:56 	at org.junit.platform.engine.support.hierarchical.ThrowableCollector.execute(ThrowableCollector.java:73)
19:39:56 	at org.junit.jupiter.engine.descriptor.TestMethodTestDescriptor.invokeTestMethod(TestMethodTestDescriptor.java:208)
19:39:56 	at org.junit.jupiter.engine.descriptor.TestMethodTestDescriptor.execute(TestMethodTestDescriptor.java:137)
19:39:56 	at org.junit.jupiter.engine.descriptor.TestMethodTestDescriptor.execute(TestMethodTestDescriptor.java:71)
19:39:56 	at org.junit.platform.engine.support.hierarchical.NodeTestTask.lambda$executeRecursively$5(NodeTestTask.java:135)
19:39:56 	at org.junit.platform.engine.support.hierarchical.ThrowableCollector.execute(ThrowableCollector.java:73)
19:39:56 	at org.junit.platform.engine.support.hierarchical.NodeTestTask.lambda$executeRecursively$7(NodeTestTask.java:125)
19:39:56 	at org.junit.platform.engine.support.hierarchical.Node.around(Node.java:135)
19:39:56 	at org.junit.platform.engine.support.hierarchical.NodeTestTask.lambda$executeRecursively$8(NodeTestTask.java:123)
19:39:56 	at org.junit.platform.engine.support.hierarchical.ThrowableCollector.execute(ThrowableCollector.java:73)
19:39:56 	at org.junit.platform.engine.support.hierarchical.NodeTestTask.executeRecursively(NodeTestTask.java:122)
19:39:56 	at org.junit.platform.engine.support.hierarchical.NodeTestTask.execute(NodeTestTask.java:80)
19:39:56 	at java.base/java.util.ArrayList.forEach(ArrayList.java:1540)
19:39:56 	at org.junit.platform.engine.support.hierarchical.SameThreadHierarchicalTestExecutorService.invokeAll(SameThreadHierarchicalTestExecutorService.java:38)
19:39:56 	at org.junit.platform.engine.support.hierarchical.NodeTestTask.lambda$executeRecursively$5(NodeTestTask.java:139)
19:39:56 	at org.junit.platform.engine.support.hierarchical.ThrowableCollector.execute(ThrowableCollector.java:73)
19:39:56 	at org.junit.platform.engine.support.hierarchical.NodeTestTask.lambda$executeRecursively$7(NodeTestTask.java:125)
19:39:56 	at org.junit.platform.engine.support.hierarchical.Node.around(Node.java:135)
19:39:56 	at org.junit.platform.engine.support.hierarchical.NodeTestTask.lambda$executeRecursively$8(NodeTestTask.java:123)
19:39:56 	at org.junit.platform.engine.support.hierarchical.ThrowableCollector.execute(ThrowableCollector.java:73)
19:39:56 	at org.junit.platform.engine.support.hierarchical.NodeTestTask.executeRecursively(NodeTestTask.java:122)
19:39:56 	at org.junit.platform.engine.support.hierarchical.NodeTestTask.execute(NodeTestTask.java:80)
19:39:56 	at java.base/java.util.ArrayList.forEach(ArrayList.java:1540)
19:39:56 	at org.junit.platform.engine.support.hierarchical.SameThreadHierarchicalTestExecutorService.invokeAll(SameThreadHierarchicalTestExecutorService.java:38)
19:39:56 	at org.junit.platform.engine.support.hierarchical.NodeTestTask.lambda$executeRecursively$5(NodeTestTask.java:139)
19:39:56 	at org.junit.platform.engine.support.hierarchical.ThrowableCollector.execute(ThrowableCollector.java:73)
19:39:56 	at org.junit.platform.engine.support.hierarchical.NodeTestTask.lambda$executeRecursively$7(NodeTestTask.java:125)
19:39:56 	at org.junit.platform.engine.support.hierarchical.Node.around(Node.java:135)
19:39:56 	at org.junit.platform.engine.support.hierarchical.NodeTestTask.lambda$executeRecursively$8(NodeTestTask.java:123)
19:39:56 	at org.junit.platform.engine.support.hierarchical.ThrowableCollector.execute(ThrowableCollector.java:73)
19:39:56 	at org.junit.platform.engine.support.hierarchical.NodeTestTask.executeRecursively(NodeTestTask.java:122)
19:39:56 	at org.junit.platform.engine.support.hierarchical.NodeTestTask.execute(NodeTestTask.java:80)
19:39:56 	at org.junit.platform.engine.support.hierarchical.SameThreadHierarchicalTestExecutorService.submit(SameThreadHierarchicalTestExecutorService.java:32)
19:39:56 	at org.junit.platform.engine.support.hierarchical.HierarchicalTestExecutor.execute(HierarchicalTestExecutor.java:57)
19:39:56 	at org.junit.platform.engine.support.hierarchical.HierarchicalTestEngine.execute(HierarchicalTestEngine.java:51)
19:39:56 	at org.junit.platform.launcher.core.DefaultLauncher.execute(DefaultLauncher.java:248)
19:39:56 	at org.junit.platform.launcher.core.DefaultLauncher.lambda$execute$5(DefaultLauncher.java:211)
19:39:56 	at org.junit.platform.launcher.core.DefaultLauncher.withInterceptedStreams(DefaultLauncher.java:226)
19:39:56 	at org.junit.platform.launcher.core.DefaultLauncher.execute(DefaultLauncher.java:199)
19:39:56 	at org.junit.platform.launcher.core.DefaultLauncher.execute(DefaultLauncher.java:132)
19:39:56 	at org.apache.maven.surefire.junitplatform.JUnitPlatformProvider.invokeAllTests(JUnitPlatformProvider.java:142)
19:39:56 	at org.apache.maven.surefire.junitplatform.JUnitPlatformProvider.invoke(JUnitPlatformProvider.java:117)
19:39:56 	at org.apache.maven.surefire.booter.ForkedBooter.invokeProviderInSameClassLoader(ForkedBooter.java:384)
19:39:56 	at org.apache.maven.surefire.booter.ForkedBooter.runSuitesInProcess(ForkedBooter.java:345)
19:39:56 	at org.apache.maven.surefire.booter.ForkedBooter.execute(ForkedBooter.java:126)
19:39:56 	at org.apache.maven.surefire.booter.ForkedBooter.main(ForkedBooter.java:418)
19:39:56 2020-08-06 23:39:56.652 [SEVERE]  Failed to execute goal org.codehaus.mojo:exec-maven-plugin:1.6.0:exec (npm-update) on project artifact.ui.html: Command execution failed. Process exited with an error: 1 (Exit value: 1) -> [Help 1]
19:39:56 org.apache.maven.lifecycle.LifecycleExecutionException: Failed to execute goal org.codehaus.mojo:exec-maven-plugin:1.6.0:exec (npm-update) on project artifact.ui.html: Command execution failed.
19:39:56 	at org.apache.maven.lifecycle.internal.MojoExecutor.execute(MojoExecutor.java:215)
19:39:56 	at org.apache.maven.lifecycle.internal.MojoExecutor.execute(MojoExecutor.java:156)
19:39:56 	at org.apache.maven.lifecycle.internal.MojoExecutor.execute(MojoExecutor.java:148)
19:39:56 	at org.apache.maven.lifecycle.internal.LifecycleModuleBuilder.buildProject(LifecycleModuleBuilder.java:117)
19:39:56 	at org.apache.maven.lifecycle.internal.LifecycleModuleBuilder.buildProject(LifecycleModuleBuilder.java:81)
19:39:56 	at org.apache.maven.lifecycle.internal.builder.singlethreaded.SingleThreadedBuilder.build(SingleThreadedBuilder.java:56)
19:39:56 	at org.apache.maven.lifecycle.internal.LifecycleStarter.execute(LifecycleStarter.java:128)
19:39:56 	at org.apache.maven.DefaultMaven.doExecute(DefaultMaven.java:305)
19:39:56 	at org.apache.maven.DefaultMaven.doExecute(DefaultMaven.java:192)
19:39:56 	at org.apache.maven.DefaultMaven.execute(DefaultMaven.java:105)
19:39:56 	at org.apache.maven.cli.MavenCli.execute(MavenCli.java:957)
19:39:56 	at org.apache.maven.cli.MavenCli.doMain(MavenCli.java:289)
19:39:56 	at org.apache.maven.cli.MavenCli.doMain(MavenCli.java:244)
19:39:56 	at java.base/jdk.internal.reflect.NativeMethodAccessorImpl.invoke0(Native Method)
19:39:56 	at java.base/jdk.internal.reflect.NativeMethodAccessorImpl.invoke(NativeMethodAccessorImpl.java:62)
19:39:56 	at java.base/jdk.internal.reflect.DelegatingMethodAccessorImpl.invoke(DelegatingMethodAccessorImpl.java:43)
19:39:56 	at java.base/java.lang.reflect.Method.invoke(Method.java:566)
19:39:56 	at org.eclipse.scout.sdk.core.s.testing.maven.MavenCliRunner.runMavenInSandbox(MavenCliRunner.java:153)
19:39:56 	at org.eclipse.scout.sdk.core.s.testing.maven.MavenCliRunner.execute(MavenCliRunner.java:87)
19:39:56 	at org.eclipse.scout.sdk.core.s.testing.maven.MavenCliRunner.execute(MavenCliRunner.java:67)
19:39:56 	at org.eclipse.scout.sdk.core.s.util.maven.MavenRunner.execute(MavenRunner.java:76)
19:39:56 	at org.eclipse.scout.sdk.core.s.testing.CoreScoutTestingUtils.runMavenCommand(CoreScoutTestingUtils.java:246)
19:39:56 	at org.eclipse.scout.sdk.core.s.testing.CoreScoutTestingUtils.runMavenCleanTest(CoreScoutTestingUtils.java:223)
19:39:56 	at org.eclipse.scout.sdk.core.s.jaxws.WebServiceNewOperationTest.createWebService(WebServiceNewOperationTest.java:252)
19:39:56 	at org.eclipse.scout.sdk.core.s.jaxws.WebServiceNewOperationTest.createWebServiceConsumer(WebServiceNewOperationTest.java:170)
19:39:56 	at org.eclipse.scout.sdk.core.s.jaxws.WebServiceNewOperationTest.lambda$0(WebServiceNewOperationTest.java:75)
19:39:56 	at org.eclipse.scout.sdk.core.s.testing.context.TestingEnvironmentBuilder.lambda$0(TestingEnvironmentBuilder.java:61)
19:39:56 	at org.eclipse.scout.sdk.core.s.testing.context.TestingEnvironmentBuilder.runInTestingEnvironment(TestingEnvironmentBuilder.java:77)
19:39:56 	at org.eclipse.scout.sdk.core.s.testing.context.TestingEnvironmentBuilder.lambda$2(TestingEnvironmentBuilder.java:71)
19:39:56 	at org.eclipse.scout.sdk.core.s.testing.context.TestingEnvironmentBuilder.lambda$3(TestingEnvironmentBuilder.java:82)
19:39:56 	at org.eclipse.scout.sdk.core.s.testing.context.TestingEnvironmentBuilder.lambda$1(TestingEnvironmentBuilder.java:71)
19:39:56 	at org.eclipse.scout.sdk.core.s.testing.context.TestingEnvironmentBuilder.lambda$3(TestingEnvironmentBuilder.java:82)
19:39:56 	at org.eclipse.scout.sdk.core.s.testing.context.TestingEnvironmentBuilder.call(TestingEnvironmentBuilder.java:70)
19:39:56 	at org.eclipse.scout.sdk.core.s.testing.context.TestingEnvironmentBuilder.run(TestingEnvironmentBuilder.java:60)
19:39:56 	at org.eclipse.scout.sdk.core.s.jaxws.WebServiceNewOperationTest.runCreateJaxWsModule(WebServiceNewOperationTest.java:129)
19:39:56 	at org.eclipse.scout.sdk.core.s.jaxws.WebServiceNewOperationTest.testNewWebServicesConsumerFirst(WebServiceNewOperationTest.java:74)
19:39:56 	at java.base/jdk.internal.reflect.NativeMethodAccessorImpl.invoke0(Native Method)
19:39:56 	at java.base/jdk.internal.reflect.NativeMethodAccessorImpl.invoke(NativeMethodAccessorImpl.java:62)
19:39:56 	at java.base/jdk.internal.reflect.DelegatingMethodAccessorImpl.invoke(DelegatingMethodAccessorImpl.java:43)
19:39:56 	at java.base/java.lang.reflect.Method.invoke(Method.java:566)
19:39:56 	at org.junit.platform.commons.util.ReflectionUtils.invokeMethod(ReflectionUtils.java:686)
19:39:56 	at org.junit.jupiter.engine.execution.MethodInvocation.proceed(MethodInvocation.java:60)
19:39:56 	at org.junit.jupiter.engine.execution.InvocationInterceptorChain$ValidatingInvocation.proceed(InvocationInterceptorChain.java:131)
19:39:56 	at org.junit.jupiter.engine.extension.TimeoutExtension.intercept(TimeoutExtension.java:149)
19:39:56 	at org.junit.jupiter.engine.extension.TimeoutExtension.interceptTestableMethod(TimeoutExtension.java:140)
19:39:56 	at org.junit.jupiter.engine.extension.TimeoutExtension.interceptTestMethod(TimeoutExtension.java:84)
19:39:56 	at org.junit.jupiter.engine.execution.ExecutableInvoker$ReflectiveInterceptorCall.lambda$ofVoidMethod$0(ExecutableInvoker.java:115)
19:39:56 	at org.junit.jupiter.engine.execution.ExecutableInvoker.lambda$invoke$0(ExecutableInvoker.java:105)
19:39:56 	at org.junit.jupiter.engine.execution.InvocationInterceptorChain$InterceptedInvocation.proceed(InvocationInterceptorChain.java:106)
19:39:56 	at org.junit.jupiter.engine.execution.InvocationInterceptorChain.proceed(InvocationInterceptorChain.java:64)
19:39:56 	at org.junit.jupiter.engine.execution.InvocationInterceptorChain.chainAndInvoke(InvocationInterceptorChain.java:45)
19:39:56 	at org.junit.jupiter.engine.execution.InvocationInterceptorChain.invoke(InvocationInterceptorChain.java:37)
19:39:56 	at org.junit.jupiter.engine.execution.ExecutableInvoker.invoke(ExecutableInvoker.java:104)
19:39:56 	at org.junit.jupiter.engine.execution.ExecutableInvoker.invoke(ExecutableInvoker.java:98)
19:39:56 	at org.junit.jupiter.engine.descriptor.TestMethodTestDescriptor.lambda$invokeTestMethod$6(TestMethodTestDescriptor.java:212)
19:39:56 	at org.junit.platform.engine.support.hierarchical.ThrowableCollector.execute(ThrowableCollector.java:73)
19:39:56 	at org.junit.jupiter.engine.descriptor.TestMethodTestDescriptor.invokeTestMethod(TestMethodTestDescriptor.java:208)
19:39:56 	at org.junit.jupiter.engine.descriptor.TestMethodTestDescriptor.execute(TestMethodTestDescriptor.java:137)
19:39:56 	at org.junit.jupiter.engine.descriptor.TestMethodTestDescriptor.execute(TestMethodTestDescriptor.java:71)
19:39:56 	at org.junit.platform.engine.support.hierarchical.NodeTestTask.lambda$executeRecursively$5(NodeTestTask.java:135)
19:39:56 	at org.junit.platform.engine.support.hierarchical.ThrowableCollector.execute(ThrowableCollector.java:73)
19:39:56 	at org.junit.platform.engine.support.hierarchical.NodeTestTask.lambda$executeRecursively$7(NodeTestTask.java:125)
19:39:56 	at org.junit.platform.engine.support.hierarchical.Node.around(Node.java:135)
19:39:56 	at org.junit.platform.engine.support.hierarchical.NodeTestTask.lambda$executeRecursively$8(NodeTestTask.java:123)
19:39:56 	at org.junit.platform.engine.support.hierarchical.ThrowableCollector.execute(ThrowableCollector.java:73)
19:39:56 	at org.junit.platform.engine.support.hierarchical.NodeTestTask.executeRecursively(NodeTestTask.java:122)
19:39:56 	at org.junit.platform.engine.support.hierarchical.NodeTestTask.execute(NodeTestTask.java:80)
19:39:56 	at java.base/java.util.ArrayList.forEach(ArrayList.java:1540)
19:39:56 	at org.junit.platform.engine.support.hierarchical.SameThreadHierarchicalTestExecutorService.invokeAll(SameThreadHierarchicalTestExecutorService.java:38)
19:39:56 	at org.junit.platform.engine.support.hierarchical.NodeTestTask.lambda$executeRecursively$5(NodeTestTask.java:139)
19:39:56 	at org.junit.platform.engine.support.hierarchical.ThrowableCollector.execute(ThrowableCollector.java:73)
19:39:56 	at org.junit.platform.engine.support.hierarchical.NodeTestTask.lambda$executeRecursively$7(NodeTestTask.java:125)
19:39:56 	at org.junit.platform.engine.support.hierarchical.Node.around(Node.java:135)
19:39:56 	at org.junit.platform.engine.support.hierarchical.NodeTestTask.lambda$executeRecursively$8(NodeTestTask.java:123)
19:39:56 	at org.junit.platform.engine.support.hierarchical.ThrowableCollector.execute(ThrowableCollector.java:73)
19:39:56 	at org.junit.platform.engine.support.hierarchical.NodeTestTask.executeRecursively(NodeTestTask.java:122)
19:39:56 	at org.junit.platform.engine.support.hierarchical.NodeTestTask.execute(NodeTestTask.java:80)
19:39:56 	at java.base/java.util.ArrayList.forEach(ArrayList.java:1540)
19:39:56 	at org.junit.platform.engine.support.hierarchical.SameThreadHierarchicalTestExecutorService.invokeAll(SameThreadHierarchicalTestExecutorService.java:38)
19:39:56 	at org.junit.platform.engine.support.hierarchical.NodeTestTask.lambda$executeRecursively$5(NodeTestTask.java:139)
19:39:56 	at org.junit.platform.engine.support.hierarchical.ThrowableCollector.execute(ThrowableCollector.java:73)
19:39:56 	at org.junit.platform.engine.support.hierarchical.NodeTestTask.lambda$executeRecursively$7(NodeTestTask.java:125)
19:39:56 	at org.junit.platform.engine.support.hierarchical.Node.around(Node.java:135)
19:39:56 	at org.junit.platform.engine.support.hierarchical.NodeTestTask.lambda$executeRecursively$8(NodeTestTask.java:123)
19:39:56 	at org.junit.platform.engine.support.hierarchical.ThrowableCollector.execute(ThrowableCollector.java:73)
19:39:56 	at org.junit.platform.engine.support.hierarchical.NodeTestTask.executeRecursively(NodeTestTask.java:122)
19:39:56 	at org.junit.platform.engine.support.hierarchical.NodeTestTask.execute(NodeTestTask.java:80)
19:39:56 	at org.junit.platform.engine.support.hierarchical.SameThreadHierarchicalTestExecutorService.submit(SameThreadHierarchicalTestExecutorService.java:32)
19:39:56 	at org.junit.platform.engine.support.hierarchical.HierarchicalTestExecutor.execute(HierarchicalTestExecutor.java:57)
19:39:56 	at org.junit.platform.engine.support.hierarchical.HierarchicalTestEngine.execute(HierarchicalTestEngine.java:51)
19:39:56 	at org.junit.platform.launcher.core.DefaultLauncher.execute(DefaultLauncher.java:248)
19:39:56 	at org.junit.platform.launcher.core.DefaultLauncher.lambda$execute$5(DefaultLauncher.java:211)
19:39:56 	at org.junit.platform.launcher.core.DefaultLauncher.withInterceptedStreams(DefaultLauncher.java:226)
19:39:56 	at org.junit.platform.launcher.core.DefaultLauncher.execute(DefaultLauncher.java:199)
19:39:56 	at org.junit.platform.launcher.core.DefaultLauncher.execute(DefaultLauncher.java:132)
19:39:56 	at org.apache.maven.surefire.junitplatform.JUnitPlatformProvider.invokeAllTests(JUnitPlatformProvider.java:142)
19:39:56 	at org.apache.maven.surefire.junitplatform.JUnitPlatformProvider.invoke(JUnitPlatformProvider.java:117)
19:39:56 	at org.apache.maven.surefire.booter.ForkedBooter.invokeProviderInSameClassLoader(ForkedBooter.java:384)
19:39:56 	at org.apache.maven.surefire.booter.ForkedBooter.runSuitesInProcess(ForkedBooter.java:345)
19:39:56 	at org.apache.maven.surefire.booter.ForkedBooter.execute(ForkedBooter.java:126)
19:39:56 	at org.apache.maven.surefire.booter.ForkedBooter.main(ForkedBooter.java:418)
19:39:56 Caused by: org.apache.maven.plugin.MojoExecutionException: Command execution failed.
19:39:56 	at org.codehaus.mojo.exec.ExecMojo.execute(ExecMojo.java:326)
19:39:56 	at org.apache.maven.plugin.DefaultBuildPluginManager.executeMojo(DefaultBuildPluginManager.java:137)
19:39:56 	at org.apache.maven.lifecycle.internal.MojoExecutor.execute(MojoExecutor.java:210)
19:39:56 	... 100 more
19:39:56 Caused by: org.apache.commons.exec.ExecuteException: Process exited with an error: 1 (Exit value: 1)
19:39:56 	at org.apache.commons.exec.DefaultExecutor.executeInternal(DefaultExecutor.java:404)
19:39:56 	at org.apache.commons.exec.DefaultExecutor.execute(DefaultExecutor.java:166)
19:39:56 	at org.codehaus.mojo.exec.ExecMojo.executeCommandLine(ExecMojo.java:804)
19:39:56 	at org.codehaus.mojo.exec.ExecMojo.executeCommandLine(ExecMojo.java:751)
19:39:56 	at org.codehaus.mojo.exec.ExecMojo.execute(ExecMojo.java:313)
19:39:56 	... 102 more
19:39:56 2020-08-06 23:39:56.653 [SEVERE]  
19:39:56 2020-08-06 23:39:56.654 [SEVERE]  Re-run Maven using the -X switch to enable full debug logging.
19:39:56 2020-08-06 23:39:56.655 [SEVERE]  
19:39:56 2020-08-06 23:39:56.655 [SEVERE]  For more information about the errors and possible solutions, please read the following articles:
19:39:56 2020-08-06 23:39:56.655 [SEVERE]  [Help 1] http://cwiki.apache.org/confluence/display/MAVEN/MojoExecutionException
19:39:56 2020-08-06 23:39:56.655 [SEVERE]  
19:39:56 2020-08-06 23:39:56.655 [SEVERE]  After correcting the problems, you can resume the build with the command
19:39:56 2020-08-06 23:39:56.655 [SEVERE]    mvn <args> -rf :artifact.ui.html
19:39:56 2020-08-06 23:39:56.661 [SEVERE]  Output of embedded Maven call:
19:39:56 MVN-BEGIN
19:39:56 2020-08-06 23:39:46,023 WARN  [main] org.eclipse.scout.testing.client.ClientSessionProviderWithCache.registerSessionForNotifications(ClientSessionProviderWithCache.java:164) - Failed to register session for notifications. - MDC[]
19:39:56 2020-08-06 23:39:46,025 WARN  [main] org.eclipse.scout.rt.client.AbstractClientSession.getUserAgent(AbstractClientSession.java:162) - UserAgent not set; using default [default=UNKNOWN|UNKNOWN|UNKNOWN|UNKNOWN|Linux] - MDC[]
19:39:56 
19:39:56 MVN-END
19:39:56 
19:39:57 [ERROR] Tests run: 3, Failures: 0, Errors: 2, Skipped: 0, Time elapsed: 279.373 s <<< FAILURE! - in org.eclipse.scout.sdk.core.s.jaxws.WebServiceNewOperationTest
19:39:57 [ERROR] testNewWebServicesProviderFirst  Time elapsed: 156.122 s  <<< ERROR!
19:39:57 org.eclipse.scout.sdk.core.util.SdkException: 
19:39:57 	at org.eclipse.scout.sdk.core.s.testing.maven.MavenCliRunner.execute(MavenCliRunner.java:70)
19:39:57 	at org.eclipse.scout.sdk.core.s.util.maven.MavenRunner.execute(MavenRunner.java:76)
19:39:57 	at org.eclipse.scout.sdk.core.s.testing.CoreScoutTestingUtils.runMavenCommand(CoreScoutTestingUtils.java:246)
19:39:57 	at org.eclipse.scout.sdk.core.s.testing.CoreScoutTestingUtils.runMavenCleanTest(CoreScoutTestingUtils.java:223)
19:39:57 	at org.eclipse.scout.sdk.core.s.jaxws.WebServiceNewOperationTest.createWebService(WebServiceNewOperationTest.java:252)
19:39:57 	at org.eclipse.scout.sdk.core.s.jaxws.WebServiceNewOperationTest.createWebServiceProvider(WebServiceNewOperationTest.java:178)
19:39:57 	at org.eclipse.scout.sdk.core.s.jaxws.WebServiceNewOperationTest.lambda$3(WebServiceNewOperationTest.java:104)
19:39:57 	at org.eclipse.scout.sdk.core.s.testing.context.TestingEnvironmentBuilder.lambda$0(TestingEnvironmentBuilder.java:61)
19:39:57 	at org.eclipse.scout.sdk.core.s.testing.context.TestingEnvironmentBuilder.runInTestingEnvironment(TestingEnvironmentBuilder.java:77)
19:39:57 	at org.eclipse.scout.sdk.core.s.testing.context.TestingEnvironmentBuilder.lambda$2(TestingEnvironmentBuilder.java:71)
19:39:57 	at org.eclipse.scout.sdk.core.s.testing.context.TestingEnvironmentBuilder.lambda$3(TestingEnvironmentBuilder.java:82)
19:39:57 	at org.eclipse.scout.sdk.core.s.testing.context.TestingEnvironmentBuilder.lambda$1(TestingEnvironmentBuilder.java:71)
19:39:57 	at org.eclipse.scout.sdk.core.s.testing.context.TestingEnvironmentBuilder.lambda$3(TestingEnvironmentBuilder.java:82)
19:39:57 	at org.eclipse.scout.sdk.core.s.testing.context.TestingEnvironmentBuilder.call(TestingEnvironmentBuilder.java:70)
19:39:57 	at org.eclipse.scout.sdk.core.s.testing.context.TestingEnvironmentBuilder.run(TestingEnvironmentBuilder.java:60)
19:39:57 	at org.eclipse.scout.sdk.core.s.jaxws.WebServiceNewOperationTest.runCreateJaxWsModule(WebServiceNewOperationTest.java:129)
19:39:57 	at org.eclipse.scout.sdk.core.s.jaxws.WebServiceNewOperationTest.testNewWebServicesProviderFirst(WebServiceNewOperationTest.java:103)
19:39:57 	at java.base/jdk.internal.reflect.NativeMethodAccessorImpl.invoke0(Native Method)
19:39:57 	at java.base/jdk.internal.reflect.NativeMethodAccessorImpl.invoke(NativeMethodAccessorImpl.java:62)
19:39:57 	at java.base/jdk.internal.reflect.DelegatingMethodAccessorImpl.invoke(DelegatingMethodAccessorImpl.java:43)
19:39:57 	at java.base/java.lang.reflect.Method.invoke(Method.java:566)
19:39:57 	at org.junit.platform.commons.util.ReflectionUtils.invokeMethod(ReflectionUtils.java:686)
19:39:57 	at org.junit.jupiter.engine.execution.MethodInvocation.proceed(MethodInvocation.java:60)
19:39:57 	at org.junit.jupiter.engine.execution.InvocationInterceptorChain$ValidatingInvocation.proceed(InvocationInterceptorChain.java:131)
19:39:57 	at org.junit.jupiter.engine.extension.TimeoutExtension.intercept(TimeoutExtension.java:149)
19:39:57 	at org.junit.jupiter.engine.extension.TimeoutExtension.interceptTestableMethod(TimeoutExtension.java:140)
19:39:57 	at org.junit.jupiter.engine.extension.TimeoutExtension.interceptTestMethod(TimeoutExtension.java:84)
19:39:57 	at org.junit.jupiter.engine.execution.ExecutableInvoker$ReflectiveInterceptorCall.lambda$ofVoidMethod$0(ExecutableInvoker.java:115)
19:39:57 	at org.junit.jupiter.engine.execution.ExecutableInvoker.lambda$invoke$0(ExecutableInvoker.java:105)
19:39:57 	at org.junit.jupiter.engine.execution.InvocationInterceptorChain$InterceptedInvocation.proceed(InvocationInterceptorChain.java:106)
19:39:57 	at org.junit.jupiter.engine.execution.InvocationInterceptorChain.proceed(InvocationInterceptorChain.java:64)
19:39:57 	at org.junit.jupiter.engine.execution.InvocationInterceptorChain.chainAndInvoke(InvocationInterceptorChain.java:45)
19:39:57 	at org.junit.jupiter.engine.execution.InvocationInterceptorChain.invoke(InvocationInterceptorChain.java:37)
19:39:57 	at org.junit.jupiter.engine.execution.ExecutableInvoker.invoke(ExecutableInvoker.java:104)
19:39:57 	at org.junit.jupiter.engine.execution.ExecutableInvoker.invoke(ExecutableInvoker.java:98)
19:39:57 	at org.junit.jupiter.engine.descriptor.TestMethodTestDescriptor.lambda$invokeTestMethod$6(TestMethodTestDescriptor.java:212)
19:39:57 	at org.junit.platform.engine.support.hierarchical.ThrowableCollector.execute(ThrowableCollector.java:73)
19:39:57 	at org.junit.jupiter.engine.descriptor.TestMethodTestDescriptor.invokeTestMethod(TestMethodTestDescriptor.java:208)
19:39:57 	at org.junit.jupiter.engine.descriptor.TestMethodTestDescriptor.execute(TestMethodTestDescriptor.java:137)
19:39:57 	at org.junit.jupiter.engine.descriptor.TestMethodTestDescriptor.execute(TestMethodTestDescriptor.java:71)
19:39:57 	at org.junit.platform.engine.support.hierarchical.NodeTestTask.lambda$executeRecursively$5(NodeTestTask.java:135)
19:39:57 	at org.junit.platform.engine.support.hierarchical.ThrowableCollector.execute(ThrowableCollector.java:73)
19:39:57 	at org.junit.platform.engine.support.hierarchical.NodeTestTask.lambda$executeRecursively$7(NodeTestTask.java:125)
19:39:57 	at org.junit.platform.engine.support.hierarchical.Node.around(Node.java:135)
19:39:57 	at org.junit.platform.engine.support.hierarchical.NodeTestTask.lambda$executeRecursively$8(NodeTestTask.java:123)
19:39:57 	at org.junit.platform.engine.support.hierarchical.ThrowableCollector.execute(ThrowableCollector.java:73)
19:39:57 	at org.junit.platform.engine.support.hierarchical.NodeTestTask.executeRecursively(NodeTestTask.java:122)
19:39:57 	at org.junit.platform.engine.support.hierarchical.NodeTestTask.execute(NodeTestTask.java:80)
19:39:57 	at java.base/java.util.ArrayList.forEach(ArrayList.java:1540)
19:39:57 	at org.junit.platform.engine.support.hierarchical.SameThreadHierarchicalTestExecutorService.invokeAll(SameThreadHierarchicalTestExecutorService.java:38)
19:39:57 	at org.junit.platform.engine.support.hierarchical.NodeTestTask.lambda$executeRecursively$5(NodeTestTask.java:139)
19:39:57 	at org.junit.platform.engine.support.hierarchical.ThrowableCollector.execute(ThrowableCollector.java:73)
19:39:57 	at org.junit.platform.engine.support.hierarchical.NodeTestTask.lambda$executeRecursively$7(NodeTestTask.java:125)
19:39:57 	at org.junit.platform.engine.support.hierarchical.Node.around(Node.java:135)
19:39:57 	at org.junit.platform.engine.support.hierarchical.NodeTestTask.lambda$executeRecursively$8(NodeTestTask.java:123)
19:39:57 	at org.junit.platform.engine.support.hierarchical.ThrowableCollector.execute(ThrowableCollector.java:73)
19:39:57 	at org.junit.platform.engine.support.hierarchical.NodeTestTask.executeRecursively(NodeTestTask.java:122)
19:39:57 	at org.junit.platform.engine.support.hierarchical.NodeTestTask.execute(NodeTestTask.java:80)
19:39:57 	at java.base/java.util.ArrayList.forEach(ArrayList.java:1540)
19:39:57 	at org.junit.platform.engine.support.hierarchical.SameThreadHierarchicalTestExecutorService.invokeAll(SameThreadHierarchicalTestExecutorService.java:38)
19:39:57 	at org.junit.platform.engine.support.hierarchical.NodeTestTask.lambda$executeRecursively$5(NodeTestTask.java:139)
19:39:57 	at org.junit.platform.engine.support.hierarchical.ThrowableCollector.execute(ThrowableCollector.java:73)
19:39:57 	at org.junit.platform.engine.support.hierarchical.NodeTestTask.lambda$executeRecursively$7(NodeTestTask.java:125)
19:39:57 	at org.junit.platform.engine.support.hierarchical.Node.around(Node.java:135)
19:39:57 	at org.junit.platform.engine.support.hierarchical.NodeTestTask.lambda$executeRecursively$8(NodeTestTask.java:123)
19:39:57 	at org.junit.platform.engine.support.hierarchical.ThrowableCollector.execute(ThrowableCollector.java:73)
19:39:57 	at org.junit.platform.engine.support.hierarchical.NodeTestTask.executeRecursively(NodeTestTask.java:122)
19:39:57 	at org.junit.platform.engine.support.hierarchical.NodeTestTask.execute(NodeTestTask.java:80)
19:39:57 	at org.junit.platform.engine.support.hierarchical.SameThreadHierarchicalTestExecutorService.submit(SameThreadHierarchicalTestExecutorService.java:32)
19:39:57 	at org.junit.platform.engine.support.hierarchical.HierarchicalTestExecutor.execute(HierarchicalTestExecutor.java:57)
19:39:57 	at org.junit.platform.engine.support.hierarchical.HierarchicalTestEngine.execute(HierarchicalTestEngine.java:51)
19:39:57 	at org.junit.platform.launcher.core.DefaultLauncher.execute(DefaultLauncher.java:248)
19:39:57 	at org.junit.platform.launcher.core.DefaultLauncher.lambda$execute$5(DefaultLauncher.java:211)
19:39:57 	at org.junit.platform.launcher.core.DefaultLauncher.withInterceptedStreams(DefaultLauncher.java:226)
19:39:57 	at org.junit.platform.launcher.core.DefaultLauncher.execute(DefaultLauncher.java:199)
19:39:57 	at org.junit.platform.launcher.core.DefaultLauncher.execute(DefaultLauncher.java:132)
19:39:57 	at org.apache.maven.surefire.junitplatform.JUnitPlatformProvider.invokeAllTests(JUnitPlatformProvider.java:142)
19:39:57 	at org.apache.maven.surefire.junitplatform.JUnitPlatformProvider.invoke(JUnitPlatformProvider.java:117)
19:39:57 	at org.apache.maven.surefire.booter.ForkedBooter.invokeProviderInSameClassLoader(ForkedBooter.java:384)
19:39:57 	at org.apache.maven.surefire.booter.ForkedBooter.runSuitesInProcess(ForkedBooter.java:345)
19:39:57 	at org.apache.maven.surefire.booter.ForkedBooter.execute(ForkedBooter.java:126)
19:39:57 	at org.apache.maven.surefire.booter.ForkedBooter.main(ForkedBooter.java:418)
19:39:57 Caused by: java.io.IOException: Maven call failed.
19:39:57 	at org.eclipse.scout.sdk.core.s.testing.maven.MavenCliRunner.runMavenInSandbox(MavenCliRunner.java:159)
19:39:57 	at org.eclipse.scout.sdk.core.s.testing.maven.MavenCliRunner.execute(MavenCliRunner.java:87)
19:39:57 	at org.eclipse.scout.sdk.core.s.testing.maven.MavenCliRunner.execute(MavenCliRunner.java:67)
19:39:57 	... 81 more
19:39:57 
19:39:57 [ERROR] testNewWebServicesConsumerFirst  Time elapsed: 123.244 s  <<< ERROR!
19:39:57 org.eclipse.scout.sdk.core.util.SdkException: 
19:39:57 	at org.eclipse.scout.sdk.core.s.testing.maven.MavenCliRunner.execute(MavenCliRunner.java:70)
19:39:57 	at org.eclipse.scout.sdk.core.s.util.maven.MavenRunner.execute(MavenRunner.java:76)
19:39:57 	at org.eclipse.scout.sdk.core.s.testing.CoreScoutTestingUtils.runMavenCommand(CoreScoutTestingUtils.java:246)
19:39:57 	at org.eclipse.scout.sdk.core.s.testing.CoreScoutTestingUtils.runMavenCleanTest(CoreScoutTestingUtils.java:223)
19:39:57 	at org.eclipse.scout.sdk.core.s.jaxws.WebServiceNewOperationTest.createWebService(WebServiceNewOperationTest.java:252)
19:39:57 	at org.eclipse.scout.sdk.core.s.jaxws.WebServiceNewOperationTest.createWebServiceConsumer(WebServiceNewOperationTest.java:170)
19:39:57 	at org.eclipse.scout.sdk.core.s.jaxws.WebServiceNewOperationTest.lambda$0(WebServiceNewOperationTest.java:75)
19:39:57 	at org.eclipse.scout.sdk.core.s.testing.context.TestingEnvironmentBuilder.lambda$0(TestingEnvironmentBuilder.java:61)
19:39:57 	at org.eclipse.scout.sdk.core.s.testing.context.TestingEnvironmentBuilder.runInTestingEnvironment(TestingEnvironmentBuilder.java:77)
19:39:57 	at org.eclipse.scout.sdk.core.s.testing.context.TestingEnvironmentBuilder.lambda$2(TestingEnvironmentBuilder.java:71)
19:39:57 	at org.eclipse.scout.sdk.core.s.testing.context.TestingEnvironmentBuilder.lambda$3(TestingEnvironmentBuilder.java:82)
19:39:57 	at org.eclipse.scout.sdk.core.s.testing.context.TestingEnvironmentBuilder.lambda$1(TestingEnvironmentBuilder.java:71)
19:39:57 	at org.eclipse.scout.sdk.core.s.testing.context.TestingEnvironmentBuilder.lambda$3(TestingEnvironmentBuilder.java:82)
19:39:57 	at org.eclipse.scout.sdk.core.s.testing.context.TestingEnvironmentBuilder.call(TestingEnvironmentBuilder.java:70)
19:39:57 	at org.eclipse.scout.sdk.core.s.testing.context.TestingEnvironmentBuilder.run(TestingEnvironmentBuilder.java:60)
19:39:57 	at org.eclipse.scout.sdk.core.s.jaxws.WebServiceNewOperationTest.runCreateJaxWsModule(WebServiceNewOperationTest.java:129)
19:39:57 	at org.eclipse.scout.sdk.core.s.jaxws.WebServiceNewOperationTest.testNewWebServicesConsumerFirst(WebServiceNewOperationTest.java:74)
19:39:57 	at java.base/jdk.internal.reflect.NativeMethodAccessorImpl.invoke0(Native Method)
19:39:57 	at java.base/jdk.internal.reflect.NativeMethodAccessorImpl.invoke(NativeMethodAccessorImpl.java:62)
19:39:57 	at java.base/jdk.internal.reflect.DelegatingMethodAccessorImpl.invoke(DelegatingMethodAccessorImpl.java:43)
19:39:57 	at java.base/java.lang.reflect.Method.invoke(Method.java:566)
19:39:57 	at org.junit.platform.commons.util.ReflectionUtils.invokeMethod(ReflectionUtils.java:686)
19:39:57 	at org.junit.jupiter.engine.execution.MethodInvocation.proceed(MethodInvocation.java:60)
19:39:57 	at org.junit.jupiter.engine.execution.InvocationInterceptorChain$ValidatingInvocation.proceed(InvocationInterceptorChain.java:131)
19:39:57 	at org.junit.jupiter.engine.extension.TimeoutExtension.intercept(TimeoutExtension.java:149)
19:39:57 	at org.junit.jupiter.engine.extension.TimeoutExtension.interceptTestableMethod(TimeoutExtension.java:140)
19:39:57 	at org.junit.jupiter.engine.extension.TimeoutExtension.interceptTestMethod(TimeoutExtension.java:84)
19:39:57 	at org.junit.jupiter.engine.execution.ExecutableInvoker$ReflectiveInterceptorCall.lambda$ofVoidMethod$0(ExecutableInvoker.java:115)
19:39:57 	at org.junit.jupiter.engine.execution.ExecutableInvoker.lambda$invoke$0(ExecutableInvoker.java:105)
19:39:57 	at org.junit.jupiter.engine.execution.InvocationInterceptorChain$InterceptedInvocation.proceed(InvocationInterceptorChain.java:106)
19:39:57 	at org.junit.jupiter.engine.execution.InvocationInterceptorChain.proceed(InvocationInterceptorChain.java:64)
19:39:57 	at org.junit.jupiter.engine.execution.InvocationInterceptorChain.chainAndInvoke(InvocationInterceptorChain.java:45)
19:39:57 	at org.junit.jupiter.engine.execution.InvocationInterceptorChain.invoke(InvocationInterceptorChain.java:37)
19:39:57 	at org.junit.jupiter.engine.execution.ExecutableInvoker.invoke(ExecutableInvoker.java:104)
19:39:57 	at org.junit.jupiter.engine.execution.ExecutableInvoker.invoke(ExecutableInvoker.java:98)
19:39:57 	at org.junit.jupiter.engine.descriptor.TestMethodTestDescriptor.lambda$invokeTestMethod$6(TestMethodTestDescriptor.java:212)
19:39:57 	at org.junit.platform.engine.support.hierarchical.ThrowableCollector.execute(ThrowableCollector.java:73)
19:39:57 	at org.junit.jupiter.engine.descriptor.TestMethodTestDescriptor.invokeTestMethod(TestMethodTestDescriptor.java:208)
19:39:57 	at org.junit.jupiter.engine.descriptor.TestMethodTestDescriptor.execute(TestMethodTestDescriptor.java:137)
19:39:57 	at org.junit.jupiter.engine.descriptor.TestMethodTestDescriptor.execute(TestMethodTestDescriptor.java:71)
19:39:57 	at org.junit.platform.engine.support.hierarchical.NodeTestTask.lambda$executeRecursively$5(NodeTestTask.java:135)
19:39:57 	at org.junit.platform.engine.support.hierarchical.ThrowableCollector.execute(ThrowableCollector.java:73)
19:39:57 	at org.junit.platform.engine.support.hierarchical.NodeTestTask.lambda$executeRecursively$7(NodeTestTask.java:125)
19:39:57 	at org.junit.platform.engine.support.hierarchical.Node.around(Node.java:135)
19:39:57 	at org.junit.platform.engine.support.hierarchical.NodeTestTask.lambda$executeRecursively$8(NodeTestTask.java:123)
19:39:57 	at org.junit.platform.engine.support.hierarchical.ThrowableCollector.execute(ThrowableCollector.java:73)
19:39:57 	at org.junit.platform.engine.support.hierarchical.NodeTestTask.executeRecursively(NodeTestTask.java:122)
19:39:57 	at org.junit.platform.engine.support.hierarchical.NodeTestTask.execute(NodeTestTask.java:80)
19:39:57 	at java.base/java.util.ArrayList.forEach(ArrayList.java:1540)
19:39:57 	at org.junit.platform.engine.support.hierarchical.SameThreadHierarchicalTestExecutorService.invokeAll(SameThreadHierarchicalTestExecutorService.java:38)
19:39:57 	at org.junit.platform.engine.support.hierarchical.NodeTestTask.lambda$executeRecursively$5(NodeTestTask.java:139)
19:39:57 	at org.junit.platform.engine.support.hierarchical.ThrowableCollector.execute(ThrowableCollector.java:73)
19:39:57 	at org.junit.platform.engine.support.hierarchical.NodeTestTask.lambda$executeRecursively$7(NodeTestTask.java:125)
19:39:57 	at org.junit.platform.engine.support.hierarchical.Node.around(Node.java:135)
19:39:57 	at org.junit.platform.engine.support.hierarchical.NodeTestTask.lambda$executeRecursively$8(NodeTestTask.java:123)
19:39:57 	at org.junit.platform.engine.support.hierarchical.ThrowableCollector.execute(ThrowableCollector.java:73)
19:39:57 	at org.junit.platform.engine.support.hierarchical.NodeTestTask.executeRecursively(NodeTestTask.java:122)
19:39:57 	at org.junit.platform.engine.support.hierarchical.NodeTestTask.execute(NodeTestTask.java:80)
19:39:57 	at java.base/java.util.ArrayList.forEach(ArrayList.java:1540)
19:39:57 	at org.junit.platform.engine.support.hierarchical.SameThreadHierarchicalTestExecutorService.invokeAll(SameThreadHierarchicalTestExecutorService.java:38)
19:39:57 	at org.junit.platform.engine.support.hierarchical.NodeTestTask.lambda$executeRecursively$5(NodeTestTask.java:139)
19:39:57 	at org.junit.platform.engine.support.hierarchical.ThrowableCollector.execute(ThrowableCollector.java:73)
19:39:57 	at org.junit.platform.engine.support.hierarchical.NodeTestTask.lambda$executeRecursively$7(NodeTestTask.java:125)
19:39:57 	at org.junit.platform.engine.support.hierarchical.Node.around(Node.java:135)
19:39:57 	at org.junit.platform.engine.support.hierarchical.NodeTestTask.lambda$executeRecursively$8(NodeTestTask.java:123)
19:39:57 	at org.junit.platform.engine.support.hierarchical.ThrowableCollector.execute(ThrowableCollector.java:73)
19:39:57 	at org.junit.platform.engine.support.hierarchical.NodeTestTask.executeRecursively(NodeTestTask.java:122)
19:39:57 	at org.junit.platform.engine.support.hierarchical.NodeTestTask.execute(NodeTestTask.java:80)
19:39:57 	at org.junit.platform.engine.support.hierarchical.SameThreadHierarchicalTestExecutorService.submit(SameThreadHierarchicalTestExecutorService.java:32)
19:39:57 	at org.junit.platform.engine.support.hierarchical.HierarchicalTestExecutor.execute(HierarchicalTestExecutor.java:57)
19:39:57 	at org.junit.platform.engine.support.hierarchical.HierarchicalTestEngine.execute(HierarchicalTestEngine.java:51)
19:39:57 	at org.junit.platform.launcher.core.DefaultLauncher.execute(DefaultLauncher.java:248)
19:39:57 	at org.junit.platform.launcher.core.DefaultLauncher.lambda$execute$5(DefaultLauncher.java:211)
19:39:57 	at org.junit.platform.launcher.core.DefaultLauncher.withInterceptedStreams(DefaultLauncher.java:226)
19:39:57 	at org.junit.platform.launcher.core.DefaultLauncher.execute(DefaultLauncher.java:199)
19:39:57 	at org.junit.platform.launcher.core.DefaultLauncher.execute(DefaultLauncher.java:132)
19:39:57 	at org.apache.maven.surefire.junitplatform.JUnitPlatformProvider.invokeAllTests(JUnitPlatformProvider.java:142)
19:39:57 	at org.apache.maven.surefire.junitplatform.JUnitPlatformProvider.invoke(JUnitPlatformProvider.java:117)
19:39:57 	at org.apache.maven.surefire.booter.ForkedBooter.invokeProviderInSameClassLoader(ForkedBooter.java:384)
19:39:57 	at org.apache.maven.surefire.booter.ForkedBooter.runSuitesInProcess(ForkedBooter.java:345)
19:39:57 	at org.apache.maven.surefire.booter.ForkedBooter.execute(ForkedBooter.java:126)
19:39:57 	at org.apache.maven.surefire.booter.ForkedBooter.main(ForkedBooter.java:418)
19:39:57 Caused by: java.io.IOException: Maven call failed.
19:39:57 	at org.eclipse.scout.sdk.core.s.testing.maven.MavenCliRunner.runMavenInSandbox(MavenCliRunner.java:159)
19:39:57 	at org.eclipse.scout.sdk.core.s.testing.maven.MavenCliRunner.execute(MavenCliRunner.java:87)
19:39:57 	at org.eclipse.scout.sdk.core.s.testing.maven.MavenCliRunner.execute(MavenCliRunner.java:67)
19:39:57 	... 81 more
19:39:57 
19:39:57 [INFO] Running org.eclipse.scout.sdk.core.s.jaxws.JaxWsUtilsTest
19:39:57 [INFO] Tests run: 4, Failures: 0, Errors: 0, Skipped: 0, Time elapsed: 0 s - in org.eclipse.scout.sdk.core.s.jaxws.JaxWsUtilsTest
19:39:57 [INFO] Running org.eclipse.scout.sdk.core.s.jaxws.JaxWsModuleNewHelperTest
19:39:57 [INFO] Tests run: 1, Failures: 0, Errors: 0, Skipped: 0, Time elapsed: 0 s - in org.eclipse.scout.sdk.core.s.jaxws.JaxWsModuleNewHelperTest
19:39:57 [INFO] Running org.eclipse.scout.sdk.core.s.jaxws.EmptyWsdlGeneratorTest
19:39:57 [INFO] Tests run: 1, Failures: 0, Errors: 0, Skipped: 0, Time elapsed: 0 s - in org.eclipse.scout.sdk.core.s.jaxws.EmptyWsdlGeneratorTest
19:39:57 [INFO] Running org.eclipse.scout.sdk.core.s.form.FormNewOperationTest
19:40:00 [INFO] Tests run: 32, Failures: 0, Errors: 0, Skipped: 0, Time elapsed: 3.396 s - in org.eclipse.scout.sdk.core.s.form.FormNewOperationTest
19:40:00 [INFO] Running org.eclipse.scout.sdk.core.s.form.FormGeneratorTest
19:40:00 [INFO] Tests run: 1, Failures: 0, Errors: 0, Skipped: 0, Time elapsed: 0.302 s - in org.eclipse.scout.sdk.core.s.form.FormGeneratorTest
19:40:00 [INFO] Running org.eclipse.scout.sdk.core.s.environment.SdkFutureTest
19:40:00 [INFO] Tests run: 5, Failures: 0, Errors: 0, Skipped: 0, Time elapsed: 0.001 s - in org.eclipse.scout.sdk.core.s.environment.SdkFutureTest
19:40:00 [INFO] Running org.eclipse.scout.sdk.core.s.dto.TableFieldWithIgnoredColumnsTest
19:40:01 [INFO] Tests run: 5, Failures: 0, Errors: 0, Skipped: 0, Time elapsed: 0.418 s - in org.eclipse.scout.sdk.core.s.dto.TableFieldWithIgnoredColumnsTest
19:40:01 [INFO] Running org.eclipse.scout.sdk.core.s.dto.TableFieldFormTest
19:40:01 [INFO] Tests run: 1, Failures: 0, Errors: 0, Skipped: 0, Time elapsed: 0.098 s - in org.eclipse.scout.sdk.core.s.dto.TableFieldFormTest
19:40:01 [INFO] Running org.eclipse.scout.sdk.core.s.dto.TableFieldExtensionTest
19:40:01 [INFO] Tests run: 2, Failures: 0, Errors: 0, Skipped: 0, Time elapsed: 0.152 s - in org.eclipse.scout.sdk.core.s.dto.TableFieldExtensionTest
19:40:01 [INFO] Running org.eclipse.scout.sdk.core.s.dto.TableFieldBeanTest
19:40:02 2020-08-06 23:40:02.073 [WARNING] Column 'formdata.client.ui.forms.ColumnWithoutTypeForm$MainBox$MyTableField$Table$MyColumn' has no value type.
19:40:02 [INFO] Tests run: 1, Failures: 0, Errors: 0, Skipped: 0, Time elapsed: 0.51 s - in org.eclipse.scout.sdk.core.s.dto.TableFieldBeanTest
19:40:02 [INFO] Running org.eclipse.scout.sdk.core.s.dto.SimpleFormTest
19:40:02 [INFO] Tests run: 1, Failures: 0, Errors: 0, Skipped: 0, Time elapsed: 0.09 s - in org.eclipse.scout.sdk.core.s.dto.SimpleFormTest
19:40:02 [INFO] Running org.eclipse.scout.sdk.core.s.dto.ScopeTest
19:40:02 [INFO] Tests run: 1, Failures: 0, Errors: 0, Skipped: 0, Time elapsed: 0.228 s - in org.eclipse.scout.sdk.core.s.dto.ScopeTest
19:40:02 [INFO] Running org.eclipse.scout.sdk.core.s.dto.ReplacingPageTest
19:40:02 [INFO] Tests run: 1, Failures: 0, Errors: 0, Skipped: 0, Time elapsed: 0.074 s - in org.eclipse.scout.sdk.core.s.dto.ReplacingPageTest
19:40:02 [INFO] Running org.eclipse.scout.sdk.core.s.dto.ReplacingFormTest
19:40:02 [INFO] Tests run: 1, Failures: 0, Errors: 0, Skipped: 0, Time elapsed: 0.064 s - in org.eclipse.scout.sdk.core.s.dto.ReplacingFormTest
19:40:02 [INFO] Running org.eclipse.scout.sdk.core.s.dto.ReplaceWithTemplatesTest
19:40:02 [INFO] Tests run: 4, Failures: 0, Errors: 0, Skipped: 0, Time elapsed: 0.309 s - in org.eclipse.scout.sdk.core.s.dto.ReplaceWithTemplatesTest
19:40:02 [INFO] Running org.eclipse.scout.sdk.core.s.dto.ReplaceFormFieldTest
19:40:03 [INFO] Tests run: 1, Failures: 0, Errors: 0, Skipped: 0, Time elapsed: 0.639 s - in org.eclipse.scout.sdk.core.s.dto.ReplaceFormFieldTest
19:40:03 [INFO] Running org.eclipse.scout.sdk.core.s.dto.PageBeanDataTest
19:40:03 [INFO] Tests run: 6, Failures: 0, Errors: 0, Skipped: 0, Time elapsed: 0.483 s - in org.eclipse.scout.sdk.core.s.dto.PageBeanDataTest
19:40:03 [INFO] Running org.eclipse.scout.sdk.core.s.dto.NestedMultiLevelFormFieldTest
19:40:04 [INFO] Tests run: 1, Failures: 0, Errors: 0, Skipped: 0, Time elapsed: 0.347 s - in org.eclipse.scout.sdk.core.s.dto.NestedMultiLevelFormFieldTest
19:40:04 [INFO] Running org.eclipse.scout.sdk.core.s.dto.MixedValueFieldTest
19:40:04 [INFO] Tests run: 1, Failures: 0, Errors: 0, Skipped: 0, Time elapsed: 0.1 s - in org.eclipse.scout.sdk.core.s.dto.MixedValueFieldTest
19:40:04 [INFO] Running org.eclipse.scout.sdk.core.s.dto.MasterFieldFormDataTest
19:40:04 [INFO] Tests run: 1, Failures: 0, Errors: 0, Skipped: 0, Time elapsed: 0.075 s - in org.eclipse.scout.sdk.core.s.dto.MasterFieldFormDataTest
19:40:04 [INFO] Running org.eclipse.scout.sdk.core.s.dto.ListBoxFormTest
19:40:04 [INFO] Tests run: 1, Failures: 0, Errors: 0, Skipped: 0, Time elapsed: 0.066 s - in org.eclipse.scout.sdk.core.s.dto.ListBoxFormTest
19:40:04 [INFO] Running org.eclipse.scout.sdk.core.s.dto.IgnoredFieldsFormTest
19:40:04 [INFO] Tests run: 1, Failures: 0, Errors: 0, Skipped: 0, Time elapsed: 0.076 s - in org.eclipse.scout.sdk.core.s.dto.IgnoredFieldsFormTest
19:40:04 [INFO] Running org.eclipse.scout.sdk.core.s.dto.FormWithTemplateTest
19:40:04 [INFO] Tests run: 1, Failures: 0, Errors: 0, Skipped: 0, Time elapsed: 0.076 s - in org.eclipse.scout.sdk.core.s.dto.FormWithTemplateTest
19:40:04 [INFO] Running org.eclipse.scout.sdk.core.s.dto.FormWithGroupboxesTest
19:40:04 [INFO] Tests run: 1, Failures: 0, Errors: 0, Skipped: 0, Time elapsed: 0.077 s - in org.eclipse.scout.sdk.core.s.dto.FormWithGroupboxesTest
19:40:04 [INFO] Running org.eclipse.scout.sdk.core.s.dto.FormPropertiesTest
19:40:04 [INFO] Tests run: 1, Failures: 0, Errors: 0, Skipped: 0, Time elapsed: 0.108 s - in org.eclipse.scout.sdk.core.s.dto.FormPropertiesTest
19:40:04 [INFO] Running org.eclipse.scout.sdk.core.s.dto.FormFieldMenuTest
19:40:05 [INFO] Tests run: 1, Failures: 0, Errors: 0, Skipped: 0, Time elapsed: 0.064 s - in org.eclipse.scout.sdk.core.s.dto.FormFieldMenuTest
19:40:05 [INFO] Running org.eclipse.scout.sdk.core.s.dto.FormDataOrderTest
19:40:05 [INFO] Tests run: 1, Failures: 0, Errors: 0, Skipped: 0, Time elapsed: 0.094 s - in org.eclipse.scout.sdk.core.s.dto.FormDataOrderTest
19:40:05 [INFO] Running org.eclipse.scout.sdk.core.s.dto.ExternalTableFieldTest
19:40:05 [INFO] Tests run: 1, Failures: 0, Errors: 0, Skipped: 0, Time elapsed: 0.071 s - in org.eclipse.scout.sdk.core.s.dto.ExternalTableFieldTest
19:40:05 [INFO] Running org.eclipse.scout.sdk.core.s.dto.ExternalGroupboxTest
19:40:05 [INFO] Tests run: 1, Failures: 0, Errors: 0, Skipped: 0, Time elapsed: 0.067 s - in org.eclipse.scout.sdk.core.s.dto.ExternalGroupboxTest
19:40:05 [INFO] Running org.eclipse.scout.sdk.core.s.dto.ExternalCheckboxFieldTest
19:40:05 [INFO] Tests run: 1, Failures: 0, Errors: 0, Skipped: 0, Time elapsed: 0.06 s - in org.eclipse.scout.sdk.core.s.dto.ExternalCheckboxFieldTest
19:40:05 [INFO] Running org.eclipse.scout.sdk.core.s.dto.ExtensionFormDataTest
19:40:05 [INFO] Tests run: 5, Failures: 0, Errors: 0, Skipped: 0, Time elapsed: 0.373 s - in org.eclipse.scout.sdk.core.s.dto.ExtensionFormDataTest
19:40:05 [INFO] Running org.eclipse.scout.sdk.core.s.dto.AnnotationCopyTest
19:40:05 [INFO] Tests run: 1, Failures: 0, Errors: 0, Skipped: 0, Time elapsed: 0.072 s - in org.eclipse.scout.sdk.core.s.dto.AnnotationCopyTest
19:40:05 [INFO] Running org.eclipse.scout.sdk.core.s.derived.DtoUpdateHandlerTest
19:40:05 [INFO] Tests run: 3, Failures: 0, Errors: 0, Skipped: 0, Time elapsed: 0.046 s - in org.eclipse.scout.sdk.core.s.derived.DtoUpdateHandlerTest
19:40:05 [INFO] Running org.eclipse.scout.sdk.core.s.codetype.HugeCodeTypeTest
19:40:07 [INFO] Tests run: 1, Failures: 0, Errors: 0, Skipped: 0, Time elapsed: 1.46 s - in org.eclipse.scout.sdk.core.s.codetype.HugeCodeTypeTest
19:40:07 [INFO] Running org.eclipse.scout.sdk.core.s.codetype.CodeTypeNewOperationTest
19:40:07 [INFO] Tests run: 2, Failures: 0, Errors: 0, Skipped: 0, Time elapsed: 0.164 s - in org.eclipse.scout.sdk.core.s.codetype.CodeTypeNewOperationTest
19:40:07 [INFO] Running org.eclipse.scout.sdk.core.s.codetype.CodeTypeGeneratorTest
19:40:07 [INFO] Tests run: 1, Failures: 0, Errors: 0, Skipped: 0, Time elapsed: 0.156 s - in org.eclipse.scout.sdk.core.s.codetype.CodeTypeGeneratorTest
19:40:07 [INFO] Running org.eclipse.scout.sdk.core.s.annotation.OrderAnnotationTest
19:40:07 2020-08-06 23:40:07.682 [WARNING] The @Order value 100000000000000000 is very large and therefore may not be precise enough. It is recommended to use a lower value.
19:40:07 [INFO] Tests run: 2, Failures: 0, Errors: 0, Skipped: 0, Time elapsed: 0.043 s - in org.eclipse.scout.sdk.core.s.annotation.OrderAnnotationTest
19:40:07 [INFO] Running org.eclipse.scout.sdk.core.s.ScoutRuntimeTypesTest
19:40:07 [INFO] Tests run: 2, Failures: 0, Errors: 0, Skipped: 0, Time elapsed: 0.11 s - in org.eclipse.scout.sdk.core.s.ScoutRuntimeTypesTest
19:40:07 [INFO] Running org.eclipse.scout.sdk.core.s.ScoutModelHierarchyTest
19:40:07 [INFO] Tests run: 5, Failures: 0, Errors: 0, Skipped: 0, Time elapsed: 0.002 s - in org.eclipse.scout.sdk.core.s.ScoutModelHierarchyTest
19:40:08 [INFO] 
19:40:08 [INFO] Results:
19:40:08 [INFO] 
19:40:08 [ERROR] Errors: 
19:40:08 [ERROR]   WebServiceNewOperationTest.testNewWebServicesConsumerFirst:74->runCreateJaxWsModule:129->lambda$0:75->createWebServiceConsumer:170->createWebService:252 ? Sdk
19:40:08 [ERROR]   WebServiceNewOperationTest.testNewWebServicesProviderFirst:103->runCreateJaxWsModule:129->lambda$3:104->createWebServiceProvider:178->createWebService:252 ? Sdk
19:40:08 [ERROR]   WebServiceUpdateOperationTest.testUpdateWebServiceConsumer:55->lambda$0:81 ? Sdk
19:40:08 [ERROR]   WebServiceUpdateOperationTest.testUpdateWebServiceProvider:68->lambda$1:128 ? Sdk
19:40:08 [ERROR]   ScoutProjectNewTest.testHelloJsArchetype:48 ? Sdk 
19:40:08 [ERROR]   ScoutProjectNewTest.testHelloWorldArchetype:36 ? Sdk 
19:40:08 [INFO] 
19:40:08 [ERROR] Tests run: 249, Failures: 0, Errors: 6, Skipped: 0
19:40:08 [INFO] 
19:40:08 [INFO] ------------------------------------------------------------------------
19:40:08 [INFO] Reactor Summary for Eclipse Scout SDK 10.0.0-SNAPSHOT:
19:40:08 [INFO] 
19:40:08 [INFO] Scout Hello World Sample Application ............... SUCCESS [ 19.797 s]
19:40:08 [INFO] Scout JaxWs Module ................................. SUCCESS [  0.094 s]
19:40:08 [INFO] ScoutJS Sample Application ......................... SUCCESS [  0.525 s]
19:40:08 [INFO] Eclipse Scout SDK .................................. SUCCESS [  0.325 s]
19:40:08 [INFO] org.eclipse.scout.sdk:org.eclipse.scout.sdk.core ... SUCCESS [  6.953 s]
19:40:08 [INFO] org.eclipse.scout.sdk:org.eclipse.scout.sdk.core.ecj SUCCESS [  0.696 s]
19:40:08 [INFO] org.eclipse.scout.sdk:org.eclipse.scout.sdk.core.test SUCCESS [  9.515 s]
19:40:08 [INFO] org.eclipse.scout.sdk:org.eclipse.scout.sdk.core.s . SUCCESS [  1.108 s]
19:40:08 [INFO] org.eclipse.scout.sdk:org.eclipse.scout.sdk.core.s.test FAILURE [11:01 min]
19:40:08 [INFO] org.eclipse.scout.sdk.s2e:org.eclipse.scout.sdk.s2e  SKIPPED
19:40:08 [INFO] org.eclipse.scout.sdk.s2e:org.eclipse.scout.sdk.s2e.test SKIPPED
19:40:08 [INFO] org.eclipse.scout.sdk.s2e:org.eclipse.scout.sdk.s2e.doc SKIPPED
19:40:08 [INFO] org.eclipse.scout.sdk.s2e:org.eclipse.scout.sdk.s2e.ui SKIPPED
19:40:08 [INFO] org.eclipse.scout.sdk-settings ..................... SKIPPED
19:40:08 [INFO] ------------------------------------------------------------------------
19:40:08 [INFO] BUILD FAILURE
19:40:08 [INFO] ------------------------------------------------------------------------
19:40:08 [INFO] Total time:  11:50 min
19:40:08 [INFO] Finished at: 2020-08-06T23:40:08Z
19:40:08 [INFO] ------------------------------------------------------------------------
19:40:08 [ERROR] Failed to execute goal org.apache.maven.plugins:maven-surefire-plugin:2.22.1:test (default-test) on project org.eclipse.scout.sdk.core.s.test: There are test failures.
19:40:08 [ERROR] 
19:40:08 [ERROR] Please refer to /home/jenkins/agent/workspace/scout-integration-10.0-SDK-nightly/org.eclipse.scout.sdk.core.s.test/target/surefire-reports for the individual test results.
19:40:08 [ERROR] Please refer to dump files (if any exist) [date].dump, [date]-jvmRun[N].dump and [date].dumpstream.
19:40:08 [ERROR] -> [Help 1]
19:40:08 [ERROR] 
19:40:08 [ERROR] To see the full stack trace of the errors, re-run Maven with the -e switch.
19:40:08 [ERROR] Re-run Maven using the -X switch to enable full debug logging.
19:40:08 [ERROR] 
19:40:08 [ERROR] For more information about the errors and possible solutions, please read the following articles:
19:40:08 [ERROR] [Help 1] http://cwiki.apache.org/confluence/display/MAVEN/MojoFailureException
19:40:08 [ERROR] 
19:40:08 [ERROR] After correcting the problems, you can resume the build with the command
19:40:08 [ERROR]   mvn <args> -rf :org.eclipse.scout.sdk.core.s.test
19:40:08 Build step 'Invoke top-level Maven targets' marked build as failure
19:40:08 $ ssh-agent -k
19:40:08 unset SSH_AUTH_SOCK;
19:40:08 unset SSH_AGENT_PID;
19:40:08 echo Agent pid 60 killed;
19:40:08 [ssh-agent] Stopped.
19:40:08 Archiving artifacts
19:40:09 Recording test results
19:40:09 Not sending mail to unregistered user mvi@bsi-software.com
19:40:09 An attempt to send an e-mail to empty list of recipients, ignored.
19:40:09 Finished: FAILURE