FailedConsole Output

Skipping 27 KB.. Full Log
org/maven2/org/apache/maven/maven-settings/3.0/maven-settings-3.0.jar (46 KB at 303.8 KB/sec)
Downloading: http://repo1.maven.org/maven2/org/apache/maven/maven-repository-metadata/3.0/maven-repository-metadata-3.0.jar
Downloaded: http://repo1.maven.org/maven2/org/apache/maven/maven-model/3.0/maven-model-3.0.jar (161 KB at 741.1 KB/sec)
Downloading: http://repo1.maven.org/maven2/org/apache/maven/maven-artifact/3.0/maven-artifact-3.0.jar
Downloaded: http://repo1.maven.org/maven2/org/apache/maven/maven-settings-builder/3.0/maven-settings-builder-3.0.jar (37 KB at 256.2 KB/sec)
Downloading: http://repo1.maven.org/maven2/org/apache/maven/maven-model-builder/3.0/maven-model-builder-3.0.jar
Downloaded: http://repo1.maven.org/maven2/junit/junit/4.8.2/junit-4.8.2.jar (232 KB at 930.8 KB/sec)
Downloading: http://repo1.maven.org/maven2/org/apache/maven/maven-aether-provider/3.0/maven-aether-provider-3.0.jar
Downloaded: http://repo1.maven.org/maven2/org/apache/maven/maven-repository-metadata/3.0/maven-repository-metadata-3.0.jar (30 KB at 240.8 KB/sec)
Downloading: http://repo1.maven.org/maven2/org/sonatype/aether/aether-impl/1.7/aether-impl-1.7.jar
Downloaded: http://repo1.maven.org/maven2/org/apache/maven/maven-core/3.0/maven-core-3.0.jar (515 KB at 1628.8 KB/sec)
Downloading: http://repo1.maven.org/maven2/org/sonatype/aether/aether-spi/1.7/aether-spi-1.7.jar
Downloaded: http://repo1.maven.org/maven2/org/apache/maven/maven-artifact/3.0/maven-artifact-3.0.jar (51 KB at 347.2 KB/sec)
Downloading: http://repo1.maven.org/maven2/org/sonatype/aether/aether-api/1.7/aether-api-1.7.jar
Downloaded: http://repo1.maven.org/maven2/org/apache/maven/maven-aether-provider/3.0/maven-aether-provider-3.0.jar (50 KB at 335.5 KB/sec)
Downloading: http://repo1.maven.org/maven2/org/sonatype/aether/aether-util/1.7/aether-util-1.7.jar
Downloaded: http://repo1.maven.org/maven2/org/sonatype/aether/aether-spi/1.7/aether-spi-1.7.jar (14 KB at 129.7 KB/sec)
Downloading: http://repo1.maven.org/maven2/org/sonatype/sisu/sisu-inject-plexus/1.4.2/sisu-inject-plexus-1.4.2.jar
Downloaded: http://repo1.maven.org/maven2/org/apache/maven/maven-model-builder/3.0/maven-model-builder-3.0.jar (145 KB at 733.5 KB/sec)
Downloading: http://repo1.maven.org/maven2/org/sonatype/sisu/sisu-inject-bean/1.4.2/sisu-inject-bean-1.4.2.jar
Downloaded: http://repo1.maven.org/maven2/org/sonatype/aether/aether-impl/1.7/aether-impl-1.7.jar (104 KB at 535.0 KB/sec)
Downloading: http://repo1.maven.org/maven2/org/sonatype/sisu/sisu-guice/2.1.7/sisu-guice-2.1.7-noaop.jar
Downloaded: http://repo1.maven.org/maven2/org/sonatype/aether/aether-api/1.7/aether-api-1.7.jar (73 KB at 431.2 KB/sec)
Downloading: http://repo1.maven.org/maven2/org/codehaus/plexus/plexus-interpolation/1.14/plexus-interpolation-1.14.jar
Downloaded: http://repo1.maven.org/maven2/org/sonatype/aether/aether-util/1.7/aether-util-1.7.jar (106 KB at 540.6 KB/sec)
Downloading: http://repo1.maven.org/maven2/org/codehaus/plexus/plexus-classworlds/2.2.3/plexus-classworlds-2.2.3.jar
Downloaded: http://repo1.maven.org/maven2/org/sonatype/sisu/sisu-inject-plexus/1.4.2/sisu-inject-plexus-1.4.2.jar (197 KB at 879.4 KB/sec)
Downloading: http://repo1.maven.org/maven2/org/codehaus/plexus/plexus-component-annotations/1.5.5/plexus-component-annotations-1.5.5.jar
Downloaded: http://repo1.maven.org/maven2/org/sonatype/sisu/sisu-inject-bean/1.4.2/sisu-inject-bean-1.4.2.jar (150 KB at 704.7 KB/sec)
Downloading: http://repo1.maven.org/maven2/org/sonatype/plexus/plexus-sec-dispatcher/1.3/plexus-sec-dispatcher-1.3.jar
Downloaded: http://repo1.maven.org/maven2/org/codehaus/plexus/plexus-interpolation/1.14/plexus-interpolation-1.14.jar (60 KB at 411.3 KB/sec)
Downloading: http://repo1.maven.org/maven2/org/sonatype/plexus/plexus-cipher/1.4/plexus-cipher-1.4.jar
Downloaded: http://repo1.maven.org/maven2/org/codehaus/plexus/plexus-component-annotations/1.5.5/plexus-component-annotations-1.5.5.jar (5 KB at 40.7 KB/sec)
Downloading: http://repo1.maven.org/maven2/org/apache/maven/plugin-tools/maven-plugin-annotations/3.2/maven-plugin-annotations-3.2.jar
Downloaded: http://repo1.maven.org/maven2/org/codehaus/plexus/plexus-classworlds/2.2.3/plexus-classworlds-2.2.3.jar (46 KB at 263.3 KB/sec)
Downloaded: http://repo1.maven.org/maven2/org/sonatype/sisu/sisu-guice/2.1.7/sisu-guice-2.1.7-noaop.jar (461 KB at 1588.6 KB/sec)
Downloading: http://repo1.maven.org/maven2/org/codehaus/plexus/plexus-utils/3.0.8/plexus-utils-3.0.8.jar
Downloaded: http://repo1.maven.org/maven2/org/sonatype/plexus/plexus-cipher/1.4/plexus-cipher-1.4.jar (14 KB at 131.8 KB/sec)
Downloaded: http://repo1.maven.org/maven2/org/sonatype/plexus/plexus-sec-dispatcher/1.3/plexus-sec-dispatcher-1.3.jar (28 KB at 224.9 KB/sec)
Downloaded: http://repo1.maven.org/maven2/org/apache/maven/plugin-tools/maven-plugin-annotations/3.2/maven-plugin-annotations-3.2.jar (15 KB at 121.7 KB/sec)
Downloaded: http://repo1.maven.org/maven2/org/codehaus/plexus/plexus-utils/3.0.8/plexus-utils-3.0.8.jar (227 KB at 963.4 KB/sec)
[INFO] 
[INFO] --- maven-clean-plugin:2.4.1:clean (default-clean) @ org.eclipse.scout.maven.plugins.updatesite ---
Downloading: http://repo1.maven.org/maven2/org/apache/maven/maven-plugin-api/2.0.6/maven-plugin-api-2.0.6.pom
Downloaded: http://repo1.maven.org/maven2/org/apache/maven/maven-plugin-api/2.0.6/maven-plugin-api-2.0.6.pom (2 KB at 14.5 KB/sec)
Downloading: http://repo1.maven.org/maven2/org/apache/maven/maven/2.0.6/maven-2.0.6.pom
Downloaded: http://repo1.maven.org/maven2/org/apache/maven/maven/2.0.6/maven-2.0.6.pom (9 KB at 87.5 KB/sec)
Downloading: http://repo1.maven.org/maven2/org/apache/maven/maven-parent/5/maven-parent-5.pom
Downloaded: http://repo1.maven.org/maven2/org/apache/maven/maven-parent/5/maven-parent-5.pom (15 KB at 123.0 KB/sec)
Downloading: http://repo1.maven.org/maven2/org/apache/apache/3/apache-3.pom
Downloaded: http://repo1.maven.org/maven2/org/apache/apache/3/apache-3.pom (4 KB at 33.5 KB/sec)
Downloading: http://repo1.maven.org/maven2/org/codehaus/plexus/plexus-utils/2.0.5/plexus-utils-2.0.5.jar
Downloaded: http://repo1.maven.org/maven2/org/codehaus/plexus/plexus-utils/2.0.5/plexus-utils-2.0.5.jar (218 KB at 919.6 KB/sec)
[INFO] 
[INFO] --- maven-plugin-plugin:3.2:helpmojo (help-goal) @ org.eclipse.scout.maven.plugins.updatesite ---
Downloading: http://repo1.maven.org/maven2/org/apache/maven/plugin-tools/maven-plugin-tools-annotations/3.2/maven-plugin-tools-annotations-3.2.pom
Downloaded: http://repo1.maven.org/maven2/org/apache/maven/plugin-tools/maven-plugin-tools-annotations/3.2/maven-plugin-tools-annotations-3.2.pom (5 KB at 34.9 KB/sec)
Downloading: http://repo1.maven.org/maven2/org/apache/maven/maven-project/2.2.1/maven-project-2.2.1.pom
Downloaded: http://repo1.maven.org/maven2/org/apache/maven/maven-project/2.2.1/maven-project-2.2.1.pom (3 KB at 27.6 KB/sec)
Downloading: http://repo1.maven.org/maven2/org/apache/maven/maven/2.2.1/maven-2.2.1.pom
Downloaded: http://repo1.maven.org/maven2/org/apache/maven/maven/2.2.1/maven-2.2.1.pom (22 KB at 177.9 KB/sec)
Downloading: http://repo1.maven.org/maven2/org/apache/maven/maven-parent/11/maven-parent-11.pom
Downloaded: http://repo1.maven.org/maven2/org/apache/maven/maven-parent/11/maven-parent-11.pom (32 KB at 106.6 KB/sec)
Downloading: http://repo1.maven.org/maven2/org/apache/apache/5/apache-5.pom
Downloaded: http://repo1.maven.org/maven2/org/apache/apache/5/apache-5.pom (5 KB at 40.4 KB/sec)
Downloading: http://repo1.maven.org/maven2/org/apache/maven/maven-settings/2.2.1/maven-settings-2.2.1.pom
Downloaded: http://repo1.maven.org/maven2/org/apache/maven/maven-settings/2.2.1/maven-settings-2.2.1.pom (3 KB at 20.9 KB/sec)
Downloading: http://repo1.maven.org/maven2/org/apache/maven/maven-model/2.2.1/maven-model-2.2.1.pom
Downloaded: http://repo1.maven.org/maven2/org/apache/maven/maven-model/2.2.1/maven-model-2.2.1.pom (4 KB at 13.8 KB/sec)
Downloading: http://repo1.maven.org/maven2/org/codehaus/plexus/plexus-utils/3.0/plexus-utils-3.0.pom
Downloaded: http://repo1.maven.org/maven2/org/codehaus/plexus/plexus-utils/3.0/plexus-utils-3.0.pom (4 KB at 40.1 KB/sec)
Downloading: http://repo1.maven.org/maven2/org/sonatype/spice/spice-parent/16/spice-parent-16.pom
Downloaded: http://repo1.maven.org/maven2/org/sonatype/spice/spice-parent/16/spice-parent-16.pom (9 KB at 81.6 KB/sec)
Downloading: http://repo1.maven.org/maven2/org/sonatype/forge/forge-parent/5/forge-parent-5.pom
Downloaded: http://repo1.maven.org/maven2/org/sonatype/forge/forge-parent/5/forge-parent-5.pom (9 KB at 84.2 KB/sec)
Downloading: http://repo1.maven.org/maven2/org/codehaus/plexus/plexus-interpolation/1.11/plexus-interpolation-1.11.pom
Downloaded: http://repo1.maven.org/maven2/org/codehaus/plexus/plexus-interpolation/1.11/plexus-interpolation-1.11.pom (889 B at 8.7 KB/sec)
Downloading: http://repo1.maven.org/maven2/org/codehaus/plexus/plexus-components/1.1.14/plexus-components-1.1.14.pom
Downloaded: http://repo1.maven.org/maven2/org/codehaus/plexus/plexus-components/1.1.14/plexus-components-1.1.14.pom (6 KB at 57.1 KB/sec)
Downloading: http://repo1.maven.org/maven2/org/codehaus/plexus/plexus/2.0.2/plexus-2.0.2.pom
Downloaded: http://repo1.maven.org/maven2/org/codehaus/plexus/plexus/2.0.2/plexus-2.0.2.pom (12 KB at 112.3 KB/sec)
Downloading: http://repo1.maven.org/maven2/org/codehaus/plexus/plexus-container-default/1.0-alpha-9-stable-1/plexus-container-default-1.0-alpha-9-stable-1.pom
Downloaded: http://repo1.maven.org/maven2/org/codehaus/plexus/plexus-container-default/1.0-alpha-9-stable-1/plexus-container-default-1.0-alpha-9-stable-1.pom (4 KB at 38.6 KB/sec)
Downloading: http://repo1.maven.org/maven2/org/codehaus/plexus/plexus-containers/1.0.3/plexus-containers-1.0.3.pom
Downloaded: http://repo1.maven.org/maven2/org/codehaus/plexus/plexus-containers/1.0.3/plexus-containers-1.0.3.pom (492 B at 4.8 KB/sec)
Downloading: http://repo1.maven.org/maven2/org/codehaus/plexus/plexus/1.0.4/plexus-1.0.4.pom
Downloaded: http://repo1.maven.org/maven2/org/codehaus/plexus/plexus/1.0.4/plexus-1.0.4.pom (6 KB at 55.5 KB/sec)
Downloading: http://repo1.maven.org/maven2/junit/junit/3.8.1/junit-3.8.1.pom
Downloaded: http://repo1.maven.org/maven2/junit/junit/3.8.1/junit-3.8.1.pom (998 B at 9.8 KB/sec)
Downloading: http://repo1.maven.org/maven2/classworlds/classworlds/1.1-alpha-2/classworlds-1.1-alpha-2.pom
Downloaded: http://repo1.maven.org/maven2/classworlds/classworlds/1.1-alpha-2/classworlds-1.1-alpha-2.pom (4 KB at 29.9 KB/sec)
Downloading: http://repo1.maven.org/maven2/org/apache/maven/maven-profile/2.2.1/maven-profile-2.2.1.pom
Downloaded: http://repo1.maven.org/maven2/org/apache/maven/maven-profile/2.2.1/maven-profile-2.2.1.pom (3 KB at 21.0 KB/sec)
Downloading: http://repo1.maven.org/maven2/org/apache/maven/maven-artifact-manager/2.2.1/maven-artifact-manager-2.2.1.pom
Downloaded: http://repo1.maven.org/maven2/org/apache/maven/maven-artifact-manager/2.2.1/maven-artifact-manager-2.2.1.pom (4 KB at 27.3 KB/sec)
Downloading: http://repo1.maven.org/maven2/org/apache/maven/maven-repository-metadata/2.2.1/maven-repository-metadata-2.2.1.pom
Downloaded: http://repo1.maven.org/maven2/org/apache/maven/maven-repository-metadata/2.2.1/maven-repository-metadata-2.2.1.pom (2 KB at 17.1 KB/sec)
Downloading: http://repo1.maven.org/maven2/org/apache/maven/maven-artifact/2.2.1/maven-artifact-2.2.1.pom
Downloaded: http://repo1.maven.org/maven2/org/apache/maven/maven-artifact/2.2.1/maven-artifact-2.2.1.pom (2 KB at 6.8 KB/sec)
Downloading: http://repo1.maven.org/maven2/backport-util-concurrent/backport-util-concurrent/3.1/backport-util-concurrent-3.1.pom
Downloaded: http://repo1.maven.org/maven2/backport-util-concurrent/backport-util-concurrent/3.1/backport-util-concurrent-3.1.pom (880 B at 8.4 KB/sec)
Downloading: http://repo1.maven.org/maven2/org/apache/maven/maven-plugin-registry/2.2.1/maven-plugin-registry-2.2.1.pom
Downloaded: http://repo1.maven.org/maven2/org/apache/maven/maven-plugin-registry/2.2.1/maven-plugin-registry-2.2.1.pom (2 KB at 6.9 KB/sec)
Downloading: http://repo1.maven.org/maven2/org/apache/maven/maven-plugin-descriptor/2.2.1/maven-plugin-descriptor-2.2.1.pom
Downloaded: http://repo1.maven.org/maven2/org/apache/maven/maven-plugin-descriptor/2.2.1/maven-plugin-descriptor-2.2.1.pom (3 KB at 19.0 KB/sec)
Downloading: http://repo1.maven.org/maven2/org/apache/maven/maven-plugin-api/2.2.1/maven-plugin-api-2.2.1.pom
Downloaded: http://repo1.maven.org/maven2/org/apache/maven/maven-plugin-api/2.2.1/maven-plugin-api-2.2.1.pom (2 KB at 14.4 KB/sec)
Downloading: http://repo1.maven.org/maven2/org/apache/maven/plugin-tools/maven-plugin-tools-api/3.2/maven-plugin-tools-api-3.2.pom
Downloaded: http://repo1.maven.org/maven2/org/apache/maven/plugin-tools/maven-plugin-tools-api/3.2/maven-plugin-tools-api-3.2.pom (3 KB at 29.3 KB/sec)
Downloading: http://repo1.maven.org/maven2/asm/asm/3.3.1/asm-3.3.1.pom
Downloaded: http://repo1.maven.org/maven2/asm/asm/3.3.1/asm-3.3.1.pom (266 B at 2.6 KB/sec)
Downloading: http://repo1.maven.org/maven2/asm/asm-parent/3.3.1/asm-parent-3.3.1.pom
Downloaded: http://repo1.maven.org/maven2/asm/asm-parent/3.3.1/asm-parent-3.3.1.pom (5 KB at 42.7 KB/sec)
Downloading: http://repo1.maven.org/maven2/asm/asm-commons/3.3.1/asm-commons-3.3.1.pom
Downloaded: http://repo1.maven.org/maven2/asm/asm-commons/3.3.1/asm-commons-3.3.1.pom (417 B at 4.2 KB/sec)
Downloading: http://repo1.maven.org/maven2/asm/asm-tree/3.3.1/asm-tree-3.3.1.pom
Downloaded: http://repo1.maven.org/maven2/asm/asm-tree/3.3.1/asm-tree-3.3.1.pom (406 B at 4.0 KB/sec)
Downloading: http://repo1.maven.org/maven2/org/codehaus/plexus/plexus-archiver/2.1.1/plexus-archiver-2.1.1.pom
Downloaded: http://repo1.maven.org/maven2/org/codehaus/plexus/plexus-archiver/2.1.1/plexus-archiver-2.1.1.pom (3 KB at 27.2 KB/sec)
Downloading: http://repo1.maven.org/maven2/org/codehaus/plexus/plexus-io/2.0.3/plexus-io-2.0.3.pom
Downloaded: http://repo1.maven.org/maven2/org/codehaus/plexus/plexus-io/2.0.3/plexus-io-2.0.3.pom (2 KB at 17.3 KB/sec)
Downloading: http://repo1.maven.org/maven2/org/codehaus/plexus/plexus-components/1.1.19/plexus-components-1.1.19.pom
Downloaded: http://repo1.maven.org/maven2/org/codehaus/plexus/plexus-components/1.1.19/plexus-components-1.1.19.pom (3 KB at 26.6 KB/sec)
Downloading: http://repo1.maven.org/maven2/org/codehaus/plexus/plexus/3.0.1/plexus-3.0.1.pom
Downloaded: http://repo1.maven.org/maven2/org/codehaus/plexus/plexus/3.0.1/plexus-3.0.1.pom (19 KB at 150.2 KB/sec)
Downloading: http://repo1.maven.org/maven2/com/thoughtworks/qdox/qdox/1.12.1/qdox-1.12.1.pom
Downloaded: http://repo1.maven.org/maven2/com/thoughtworks/qdox/qdox/1.12.1/qdox-1.12.1.pom (18 KB at 139.7 KB/sec)
Downloading: http://repo1.maven.org/maven2/org/codehaus/codehaus-parent/4/codehaus-parent-4.pom
Downloaded: http://repo1.maven.org/maven2/org/codehaus/codehaus-parent/4/codehaus-parent-4.pom (5 KB at 47.6 KB/sec)
Downloading: http://repo1.maven.org/maven2/org/apache/maven/doxia/doxia-sink-api/1.2/doxia-sink-api-1.2.pom
Downloaded: http://repo1.maven.org/maven2/org/apache/maven/doxia/doxia-sink-api/1.2/doxia-sink-api-1.2.pom (2 KB at 16.2 KB/sec)
Downloading: http://repo1.maven.org/maven2/org/apache/maven/doxia/doxia/1.2/doxia-1.2.pom
Downloaded: http://repo1.maven.org/maven2/org/apache/maven/doxia/doxia/1.2/doxia-1.2.pom (19 KB at 113.5 KB/sec)
Downloading: http://repo1.maven.org/maven2/org/apache/maven/maven-parent/19/maven-parent-19.pom
Downloaded: http://repo1.maven.org/maven2/org/apache/maven/maven-parent/19/maven-parent-19.pom (25 KB at 201.8 KB/sec)
Downloading: http://repo1.maven.org/maven2/org/apache/apache/9/apache-9.pom
Downloaded: http://repo1.maven.org/maven2/org/apache/apache/9/apache-9.pom (15 KB at 116.6 KB/sec)
Downloading: http://repo1.maven.org/maven2/org/apache/maven/doxia/doxia-logging-api/1.2/doxia-logging-api-1.2.pom
Downloaded: http://repo1.maven.org/maven2/org/apache/maven/doxia/doxia-logging-api/1.2/doxia-logging-api-1.2.pom (2 KB at 16.1 KB/sec)
Downloading: http://repo1.maven.org/maven2/org/apache/maven/doxia/doxia-site-renderer/1.2/doxia-site-renderer-1.2.pom
Downloaded: http://repo1.maven.org/maven2/org/apache/maven/doxia/doxia-site-renderer/1.2/doxia-site-renderer-1.2.pom (7 KB at 61.5 KB/sec)
Downloading: http://repo1.maven.org/maven2/org/apache/maven/doxia/doxia-sitetools/1.2/doxia-sitetools-1.2.pom
Downloaded: http://repo1.maven.org/maven2/org/apache/maven/doxia/doxia-sitetools/1.2/doxia-sitetools-1.2.pom (16 KB at 129.7 KB/sec)
Downloading: http://repo1.maven.org/maven2/org/apache/maven/doxia/doxia-core/1.2/doxia-core-1.2.pom
Downloaded: http://repo1.maven.org/maven2/org/apache/maven/doxia/doxia-core/1.2/doxia-core-1.2.pom (4 KB at 37.9 KB/sec)
Downloading: http://repo1.maven.org/maven2/xerces/xercesImpl/2.9.1/xercesImpl-2.9.1.pom
Downloaded: http://repo1.maven.org/maven2/xerces/xercesImpl/2.9.1/xercesImpl-2.9.1.pom (2 KB at 13.2 KB/sec)
Downloading: http://repo1.maven.org/maven2/org/apache/apache/4/apache-4.pom
Downloaded: http://repo1.maven.org/maven2/org/apache/apache/4/apache-4.pom (5 KB at 29.1 KB/sec)
Downloading: http://repo1.maven.org/maven2/xml-apis/xml-apis/1.3.04/xml-apis-1.3.04.pom
Downloaded: http://repo1.maven.org/maven2/xml-apis/xml-apis/1.3.04/xml-apis-1.3.04.pom (2 KB at 17.4 KB/sec)
Downloading: http://repo1.maven.org/maven2/commons-lang/commons-lang/2.4/commons-lang-2.4.pom
Downloaded: http://repo1.maven.org/maven2/commons-lang/commons-lang/2.4/commons-lang-2.4.pom (14 KB at 137.9 KB/sec)
Downloading: http://repo1.maven.org/maven2/org/apache/commons/commons-parent/9/commons-parent-9.pom
Downloaded: http://repo1.maven.org/maven2/org/apache/commons/commons-parent/9/commons-parent-9.pom (22 KB at 166.0 KB/sec)
Downloading: http://repo1.maven.org/maven2/org/apache/httpcomponents/httpclient/4.0.2/httpclient-4.0.2.pom
Downloaded: http://repo1.maven.org/maven2/org/apache/httpcomponents/httpclient/4.0.2/httpclient-4.0.2.pom (8 KB at 73.2 KB/sec)
Downloading: http://repo1.maven.org/maven2/org/apache/httpcomponents/httpcomponents-client/4.0.2/httpcomponents-client-4.0.2.pom
Downloaded: http://repo1.maven.org/maven2/org/apache/httpcomponents/httpcomponents-client/4.0.2/httpcomponents-client-4.0.2.pom (9 KB at 87.6 KB/sec)
Downloading: http://repo1.maven.org/maven2/org/apache/httpcomponents/project/4.1/project-4.1.pom
Downloaded: http://repo1.maven.org/maven2/org/apache/httpcomponents/project/4.1/project-4.1.pom (16 KB at 132.2 KB/sec)
Downloading: http://repo1.maven.org/maven2/org/apache/httpcomponents/httpcore/4.0.1/httpcore-4.0.1.pom
Downloaded: http://repo1.maven.org/maven2/org/apache/httpcomponents/httpcore/4.0.1/httpcore-4.0.1.pom (5 KB at 47.7 KB/sec)
Downloading: http://repo1.maven.org/maven2/org/apache/httpcomponents/httpcomponents-core/4.0.1/httpcomponents-core-4.0.1.pom
Downloaded: http://repo1.maven.org/maven2/org/apache/httpcomponents/httpcomponents-core/4.0.1/httpcomponents-core-4.0.1.pom (10 KB at 91.3 KB/sec)
Downloading: http://repo1.maven.org/maven2/org/apache/httpcomponents/project/4.0/project-4.0.pom
Downloaded: http://repo1.maven.org/maven2/org/apache/httpcomponents/project/4.0/project-4.0.pom (13 KB at 128.1 KB/sec)
Downloading: http://repo1.maven.org/maven2/commons-logging/commons-logging/1.1.1/commons-logging-1.1.1.pom
Downloaded: http://repo1.maven.org/maven2/commons-logging/commons-logging/1.1.1/commons-logging-1.1.1.pom (18 KB at 143.5 KB/sec)
Downloading: http://repo1.maven.org/maven2/org/apache/commons/commons-parent/5/commons-parent-5.pom
Downloaded: http://repo1.maven.org/maven2/org/apache/commons/commons-parent/5/commons-parent-5.pom (16 KB at 128.4 KB/sec)
Downloading: http://repo1.maven.org/maven2/commons-codec/commons-codec/1.3/commons-codec-1.3.pom
Downloaded: http://repo1.maven.org/maven2/commons-codec/commons-codec/1.3/commons-codec-1.3.pom (6 KB at 60.2 KB/sec)
Downloading: http://repo1.maven.org/maven2/org/apache/maven/doxia/doxia-decoration-model/1.2/doxia-decoration-model-1.2.pom
Downloaded: http://repo1.maven.org/maven2/org/apache/maven/doxia/doxia-decoration-model/1.2/doxia-decoration-model-1.2.pom (3 KB at 29.3 KB/sec)
Downloading: http://repo1.maven.org/maven2/org/apache/maven/doxia/doxia-module-xhtml/1.2/doxia-module-xhtml-1.2.pom
Downloaded: http://repo1.maven.org/maven2/org/apache/maven/doxia/doxia-module-xhtml/1.2/doxia-module-xhtml-1.2.pom (2 KB at 16.7 KB/sec)
Downloading: http://repo1.maven.org/maven2/org/apache/maven/doxia/doxia-modules/1.2/doxia-modules-1.2.pom
Downloaded: http://repo1.maven.org/maven2/org/apache/maven/doxia/doxia-modules/1.2/doxia-modules-1.2.pom (3 KB at 24.2 KB/sec)
Downloading: http://repo1.maven.org/maven2/org/apache/maven/doxia/doxia-module-fml/1.2/doxia-module-fml-1.2.pom
Downloaded: http://repo1.maven.org/maven2/org/apache/maven/doxia/doxia-module-fml/1.2/doxia-module-fml-1.2.pom (6 KB at 56.1 KB/sec)
Downloading: http://repo1.maven.org/maven2/org/codehaus/plexus/plexus-i18n/1.0-beta-7/plexus-i18n-1.0-beta-7.pom
Downloaded: http://repo1.maven.org/maven2/org/codehaus/plexus/plexus-i18n/1.0-beta-7/plexus-i18n-1.0-beta-7.pom (2 KB at 10.3 KB/sec)
Downloading: http://repo1.maven.org/maven2/org/codehaus/plexus/plexus-components/1.1.12/plexus-components-1.1.12.pom
Downloaded: http://repo1.maven.org/maven2/org/codehaus/plexus/plexus-components/1.1.12/plexus-components-1.1.12.pom (3 KB at 28.2 KB/sec)
Downloading: http://repo1.maven.org/maven2/org/codehaus/plexus/plexus/1.0.10/plexus-1.0.10.pom
Downloaded: http://repo1.maven.org/maven2/org/codehaus/plexus/plexus/1.0.10/plexus-1.0.10.pom (9 KB at 82.2 KB/sec)
Downloading: http://repo1.maven.org/maven2/org/codehaus/plexus/plexus-velocity/1.1.8/plexus-velocity-1.1.8.pom
Downloaded: http://repo1.maven.org/maven2/org/codehaus/plexus/plexus-velocity/1.1.8/plexus-velocity-1.1.8.pom (2 KB at 18.4 KB/sec)
Downloading: http://repo1.maven.org/maven2/org/codehaus/plexus/plexus-components/1.1.15/plexus-components-1.1.15.pom
Downloaded: http://repo1.maven.org/maven2/org/codehaus/plexus/plexus-components/1.1.15/plexus-components-1.1.15.pom (3 KB at 26.7 KB/sec)
Downloading: http://repo1.maven.org/maven2/org/codehaus/plexus/plexus/2.0.3/plexus-2.0.3.pom
Downloaded: http://repo1.maven.org/maven2/org/codehaus/plexus/plexus/2.0.3/plexus-2.0.3.pom (16 KB at 124.8 KB/sec)
Downloading: http://repo1.maven.org/maven2/org/apache/velocity/velocity/1.7/velocity-1.7.pom
Downloaded: http://repo1.maven.org/maven2/org/apache/velocity/velocity/1.7/velocity-1.7.pom (11 KB at 103.9 KB/sec)
Downloading: http://repo1.maven.org/maven2/commons-collections/commons-collections/3.2.1/commons-collections-3.2.1.pom
Downloaded: http://repo1.maven.org/maven2/commons-collections/commons-collections/3.2.1/commons-collections-3.2.1.pom (13 KB at 119.7 KB/sec)
Downloading: http://repo1.maven.org/maven2/org/apache/maven/plugin-tools/maven-plugin-tools-generators/3.2/maven-plugin-tools-generators-3.2.pom
Downloaded: http://repo1.maven.org/maven2/org/apache/maven/plugin-tools/maven-plugin-tools-generators/3.2/maven-plugin-tools-generators-3.2.pom (5 KB at 41.2 KB/sec)
Downloading: http://repo1.maven.org/maven2/org/apache/maven/reporting/maven-reporting-api/3.0/maven-reporting-api-3.0.pom
Downloaded: http://repo1.maven.org/maven2/org/apache/maven/reporting/maven-reporting-api/3.0/maven-reporting-api-3.0.pom (3 KB at 23.2 KB/sec)
Downloading: http://repo1.maven.org/maven2/org/apache/maven/shared/maven-shared-components/15/maven-shared-components-15.pom
Downloaded: http://repo1.maven.org/maven2/org/apache/maven/shared/maven-shared-components/15/maven-shared-components-15.pom (10 KB at 92.1 KB/sec)
Downloading: http://repo1.maven.org/maven2/org/apache/maven/doxia/doxia-sink-api/1.0/doxia-sink-api-1.0.pom
Downloaded: http://repo1.maven.org/maven2/org/apache/maven/doxia/doxia-sink-api/1.0/doxia-sink-api-1.0.pom (2 KB at 13.3 KB/sec)
Downloading: http://repo1.maven.org/maven2/org/apache/maven/doxia/doxia/1.0/doxia-1.0.pom
Downloaded: http://repo1.maven.org/maven2/org/apache/maven/doxia/doxia/1.0/doxia-1.0.pom (10 KB at 93.2 KB/sec)
Downloading: http://repo1.maven.org/maven2/org/apache/maven/maven-parent/10/maven-parent-10.pom
Downloaded: http://repo1.maven.org/maven2/org/apache/maven/maven-parent/10/maven-parent-10.pom (31 KB at 243.3 KB/sec)
Downloading: http://repo1.maven.org/maven2/commons-collections/commons-collections/3.1/commons-collections-3.1.pom
Downloaded: http://repo1.maven.org/maven2/commons-collections/commons-collections/3.1/commons-collections-3.1.pom (6 KB at 59.4 KB/sec)
Downloading: http://repo1.maven.org/maven2/net/sf/jtidy/jtidy/r938/jtidy-r938.pom
Downloaded: http://repo1.maven.org/maven2/net/sf/jtidy/jtidy/r938/jtidy-r938.pom (10 KB at 90.1 KB/sec)
Downloading: http://repo1.maven.org/maven2/org/apache/maven/reporting/maven-reporting-impl/2.1/maven-reporting-impl-2.1.pom
Downloaded: http://repo1.maven.org/maven2/org/apache/maven/reporting/maven-reporting-impl/2.1/maven-reporting-impl-2.1.pom (5 KB at 38.4 KB/sec)
Downloading: http://repo1.maven.org/maven2/org/apache/maven/doxia/doxia-sink-api/1.1.2/doxia-sink-api-1.1.2.pom
Downloaded: http://repo1.maven.org/maven2/org/apache/maven/doxia/doxia-sink-api/1.1.2/doxia-sink-api-1.1.2.pom (2 KB at 15.5 KB/sec)
Downloading: http://repo1.maven.org/maven2/org/apache/maven/doxia/doxia/1.1.2/doxia-1.1.2.pom
Downloaded: http://repo1.maven.org/maven2/org/apache/maven/doxia/doxia/1.1.2/doxia-1.1.2.pom (18 KB at 143.0 KB/sec)
Downloading: http://repo1.maven.org/maven2/org/apache/maven/doxia/doxia-logging-api/1.1.2/doxia-logging-api-1.1.2.pom
Downloaded: http://repo1.maven.org/maven2/org/apache/maven/doxia/doxia-logging-api/1.1.2/doxia-logging-api-1.1.2.pom (2 KB at 15.9 KB/sec)
Downloading: http://repo1.maven.org/maven2/org/apache/maven/doxia/doxia-core/1.1.2/doxia-core-1.1.2.pom
Downloaded: http://repo1.maven.org/maven2/org/apache/maven/doxia/doxia-core/1.1.2/doxia-core-1.1.2.pom (4 KB at 36.3 KB/sec)
Downloading: http://repo1.maven.org/maven2/xerces/xercesImpl/2.8.1/xercesImpl-2.8.1.pom
Downloaded: http://repo1.maven.org/maven2/xerces/xercesImpl/2.8.1/xercesImpl-2.8.1.pom (3 KB at 21.6 KB/sec)
Downloading: http://repo1.maven.org/maven2/xml-apis/xml-apis/1.3.03/xml-apis-1.3.03.pom
Downloaded: http://repo1.maven.org/maven2/xml-apis/xml-apis/1.3.03/xml-apis-1.3.03.pom (738 B at 7.1 KB/sec)
Downloading: http://repo1.maven.org/maven2/org/apache/apache/1/apache-1.pom
Downloaded: http://repo1.maven.org/maven2/org/apache/apache/1/apache-1.pom (4 KB at 34.7 KB/sec)
Downloading: http://repo1.maven.org/maven2/commons-httpclient/commons-httpclient/3.1/commons-httpclient-3.1.pom
Downloaded: http://repo1.maven.org/maven2/commons-httpclient/commons-httpclient/3.1/commons-httpclient-3.1.pom (8 KB at 76.6 KB/sec)
Downloading: http://repo1.maven.org/maven2/commons-logging/commons-logging/1.0.4/commons-logging-1.0.4.pom
Downloaded: http://repo1.maven.org/maven2/commons-logging/commons-logging/1.0.4/commons-logging-1.0.4.pom (6 KB at 51.4 KB/sec)
Downloading: http://repo1.maven.org/maven2/commons-codec/commons-codec/1.2/commons-codec-1.2.pom
Downloaded: http://repo1.maven.org/maven2/commons-codec/commons-codec/1.2/commons-codec-1.2.pom (4 KB at 37.0 KB/sec)
Downloading: http://repo1.maven.org/maven2/org/apache/maven/doxia/doxia-site-renderer/1.1.2/doxia-site-renderer-1.1.2.pom
Downloaded: http://repo1.maven.org/maven2/org/apache/maven/doxia/doxia-site-renderer/1.1.2/doxia-site-renderer-1.1.2.pom (6 KB at 53.4 KB/sec)
Downloading: http://repo1.maven.org/maven2/org/apache/maven/doxia/doxia-sitetools/1.1.2/doxia-sitetools-1.1.2.pom
Downloaded: http://repo1.maven.org/maven2/org/apache/maven/doxia/doxia-sitetools/1.1.2/doxia-sitetools-1.1.2.pom (15 KB at 121.3 KB/sec)
Downloading: http://repo1.maven.org/maven2/org/apache/maven/doxia/doxia-decoration-model/1.1.2/doxia-decoration-model-1.1.2.pom
Downloaded: http://repo1.maven.org/maven2/org/apache/maven/doxia/doxia-decoration-model/1.1.2/doxia-decoration-model-1.1.2.pom (3 KB at 28.8 KB/sec)
Downloading: http://repo1.maven.org/maven2/org/apache/maven/doxia/doxia-module-xhtml/1.1.2/doxia-module-xhtml-1.1.2.pom
Downloaded: http://repo1.maven.org/maven2/org/apache/maven/doxia/doxia-module-xhtml/1.1.2/doxia-module-xhtml-1.1.2.pom (2 KB at 15.5 KB/sec)
Downloading: http://repo1.maven.org/maven2/org/apache/maven/doxia/doxia-modules/1.1.2/doxia-modules-1.1.2.pom
Downloaded: http://repo1.maven.org/maven2/org/apache/maven/doxia/doxia-modules/1.1.2/doxia-modules-1.1.2.pom (3 KB at 23.3 KB/sec)
Downloading: http://repo1.maven.org/maven2/org/apache/maven/doxia/doxia-module-fml/1.1.2/doxia-module-fml-1.1.2.pom
Downloaded: http://repo1.maven.org/maven2/org/apache/maven/doxia/doxia-module-fml/1.1.2/doxia-module-fml-1.1.2.pom (6 KB at 53.7 KB/sec)
Downloading: http://repo1.maven.org/maven2/commons-collections/commons-collections/3.2/commons-collections-3.2.pom
Downloaded: http://repo1.maven.org/maven2/commons-collections/commons-collections/3.2/commons-collections-3.2.pom (11 KB at 106.7 KB/sec)
Downloading: http://repo1.maven.org/maven2/commons-validator/commons-validator/1.2.0/commons-validator-1.2.0.pom
Downloaded: http://repo1.maven.org/maven2/commons-validator/commons-validator/1.2.0/commons-validator-1.2.0.pom (9 KB at 62.9 KB/sec)
Downloading: http://repo1.maven.org/maven2/commons-beanutils/commons-beanutils/1.7.0/commons-beanutils-1.7.0.pom
Downloaded: http://repo1.maven.org/maven2/commons-beanutils/commons-beanutils/1.7.0/commons-beanutils-1.7.0.pom (357 B at 3.5 KB/sec)
Downloading: http://repo1.maven.org/maven2/commons-logging/commons-logging/1.0.3/commons-logging-1.0.3.pom
Downloaded: http://repo1.maven.org/maven2/commons-logging/commons-logging/1.0.3/commons-logging-1.0.3.pom (866 B at 8.6 KB/sec)
Downloading: http://repo1.maven.org/maven2/commons-digester/commons-digester/1.6/commons-digester-1.6.pom
Downloaded: http://repo1.maven.org/maven2/commons-digester/commons-digester/1.6/commons-digester-1.6.pom (974 B at 9.8 KB/sec)
Downloading: http://repo1.maven.org/maven2/commons-beanutils/commons-beanutils/1.6/commons-beanutils-1.6.pom
Downloaded: http://repo1.maven.org/maven2/commons-beanutils/commons-beanutils/1.6/commons-beanutils-1.6.pom (3 KB at 22.3 KB/sec)
Downloading: http://repo1.maven.org/maven2/commons-logging/commons-logging/1.0/commons-logging-1.0.pom
Downloaded: http://repo1.maven.org/maven2/commons-logging/commons-logging/1.0/commons-logging-1.0.pom (163 B at 0.8 KB/sec)
Downloading: http://repo1.maven.org/maven2/commons-collections/commons-collections/2.0/commons-collections-2.0.pom
Downloaded: http://repo1.maven.org/maven2/commons-collections/commons-collections/2.0/commons-collections-2.0.pom (171 B at 1.7 KB/sec)
Downloading: http://repo1.maven.org/maven2/commons-collections/commons-collections/2.1/commons-collections-2.1.pom
Downloaded: http://repo1.maven.org/maven2/commons-collections/commons-collections/2.1/commons-collections-2.1.pom (4 KB at 32.3 KB/sec)
Downloading: http://repo1.maven.org/maven2/xml-apis/xml-apis/1.0.b2/xml-apis-1.0.b2.pom
Downloaded: http://repo1.maven.org/maven2/xml-apis/xml-apis/1.0.b2/xml-apis-1.0.b2.pom (3 KB at 22.0 KB/sec)
Downloading: http://repo1.maven.org/maven2/oro/oro/2.0.8/oro-2.0.8.pom
Downloaded: http://repo1.maven.org/maven2/oro/oro/2.0.8/oro-2.0.8.pom (140 B at 1.4 KB/sec)
Downloading: http://repo1.maven.org/maven2/xml-apis/xml-apis/2.0.2/xml-apis-2.0.2.pom
Downloaded: http://repo1.maven.org/maven2/xml-apis/xml-apis/2.0.2/xml-apis-2.0.2.pom (346 B at 3.3 KB/sec)
Downloading: http://repo1.maven.org/maven2/org/apache/maven/plugin-tools/maven-plugin-tools-java/3.2/maven-plugin-tools-java-3.2.pom
Downloaded: http://repo1.maven.org/maven2/org/apache/maven/plugin-tools/maven-plugin-tools-java/3.2/maven-plugin-tools-java-3.2.pom (4 KB at 35.9 KB/sec)
Downloading: http://repo1.maven.org/maven2/org/apache/maven/plugin-tools/maven-plugin-tools-beanshell/3.2/maven-plugin-tools-beanshell-3.2.pom
Downloaded: http://repo1.maven.org/maven2/org/apache/maven/plugin-tools/maven-plugin-tools-beanshell/3.2/maven-plugin-tools-beanshell-3.2.pom (3 KB at 20.4 KB/sec)
Downloading: http://repo1.maven.org/maven2/bsh/bsh/1.3.0/bsh-1.3.0.pom
Downloaded: http://repo1.maven.org/maven2/bsh/bsh/1.3.0/bsh-1.3.0.pom (210 B at 2.1 KB/sec)
Downloading: http://repo1.maven.org/maven2/org/apache/maven/plugin-tools/maven-plugin-tools-model/3.2/maven-plugin-tools-model-3.2.pom
Downloaded: http://repo1.maven.org/maven2/org/apache/maven/plugin-tools/maven-plugin-tools-model/3.2/maven-plugin-tools-model-3.2.pom (4 KB at 30.5 KB/sec)
Downloading: http://repo1.maven.org/maven2/org/apache/maven/plugin-tools/maven-plugin-tools-annotations/3.2/maven-plugin-tools-annotations-3.2.jar
Downloading: http://repo1.maven.org/maven2/junit/junit/3.8.1/junit-3.8.1.jar
Downloading: http://repo1.maven.org/maven2/asm/asm/3.3.1/asm-3.3.1.jar
Downloading: http://repo1.maven.org/maven2/asm/asm-commons/3.3.1/asm-commons-3.3.1.jar
Downloading: http://repo1.maven.org/maven2/asm/asm-tree/3.3.1/asm-tree-3.3.1.jar
Downloaded: http://repo1.maven.org/maven2/asm/asm-tree/3.3.1/asm-tree-3.3.1.jar (22 KB at 165.4 KB/sec)
Downloading: http://repo1.maven.org/maven2/org/codehaus/plexus/plexus-archiver/2.1.1/plexus-archiver-2.1.1.jar
Downloaded: http://repo1.maven.org/maven2/asm/asm-commons/3.3.1/asm-commons-3.3.1.jar (38 KB at 254.5 KB/sec)
Downloaded: http://repo1.maven.org/maven2/org/apache/maven/plugin-tools/maven-plugin-tools-annotations/3.2/maven-plugin-tools-annotations-3.2.jar (39 KB at 264.5 KB/sec)
Downloading: http://repo1.maven.org/maven2/org/codehaus/plexus/plexus-io/2.0.3/plexus-io-2.0.3.jar
Downloading: http://repo1.maven.org/maven2/com/thoughtworks/qdox/qdox/1.12.1/qdox-1.12.1.jar
Downloaded: http://repo1.maven.org/maven2/asm/asm/3.3.1/asm-3.3.1.jar (43 KB at 285.6 KB/sec)
Downloading: http://repo1.maven.org/maven2/org/apache/maven/doxia/doxia-sink-api/1.2/doxia-sink-api-1.2.jar
Downloaded: http://repo1.maven.org/maven2/junit/junit/3.8.1/junit-3.8.1.jar (119 KB at 606.3 KB/sec)
Downloading: http://repo1.maven.org/maven2/org/apache/maven/doxia/doxia-logging-api/1.2/doxia-logging-api-1.2.jar
Downloaded: http://repo1.maven.org/maven2/org/apache/maven/doxia/doxia-sink-api/1.2/doxia-sink-api-1.2.jar (11 KB at 110.9 KB/sec)
Downloading: http://repo1.maven.org/maven2/org/apache/maven/doxia/doxia-site-renderer/1.2/doxia-site-renderer-1.2.jar
Downloaded: http://repo1.maven.org/maven2/org/codehaus/plexus/plexus-io/2.0.3/plexus-io-2.0.3.jar (57 KB at 387.2 KB/sec)
Downloading: http://repo1.maven.org/maven2/org/apache/maven/doxia/doxia-core/1.2/doxia-core-1.2.jar
Downloaded: http://repo1.maven.org/maven2/org/apache/maven/doxia/doxia-logging-api/1.2/doxia-logging-api-1.2.jar (12 KB at 111.9 KB/sec)
Downloading: http://repo1.maven.org/maven2/xerces/xercesImpl/2.9.1/xercesImpl-2.9.1.jar
Downloaded: http://repo1.maven.org/maven2/org/codehaus/plexus/plexus-archiver/2.1.1/plexus-archiver-2.1.1.jar (181 KB at 773.8 KB/sec)
Downloading: http://repo1.maven.org/maven2/org/apache/httpcomponents/httpclient/4.0.2/httpclient-4.0.2.jar
Downloaded: http://repo1.maven.org/maven2/com/thoughtworks/qdox/qdox/1.12.1/qdox-1.12.1.jar (176 KB at 816.8 KB/sec)
Downloading: http://repo1.maven.org/maven2/org/apache/httpcomponents/httpcore/4.0.1/httpcore-4.0.1.jar
Downloaded: http://repo1.maven.org/maven2/org/apache/maven/doxia/doxia-site-renderer/1.2/doxia-site-renderer-1.2.jar (51 KB at 346.1 KB/sec)
Downloading: http://repo1.maven.org/maven2/commons-codec/commons-codec/1.3/commons-codec-1.3.jar
Downloaded: http://repo1.maven.org/maven2/org/apache/maven/doxia/doxia-core/1.2/doxia-core-1.2.jar (151 KB at 720.1 KB/sec)
Downloading: http://repo1.maven.org/maven2/org/apache/maven/doxia/doxia-decoration-model/1.2/doxia-decoration-model-1.2.jar
Downloaded: http://repo1.maven.org/maven2/commons-codec/commons-codec/1.3/commons-codec-1.3.jar (46 KB at 310.4 KB/sec)
Downloading: http://repo1.maven.org/maven2/org/apache/maven/doxia/doxia-module-xhtml/1.2/doxia-module-xhtml-1.2.jar
Downloaded: http://repo1.maven.org/maven2/org/apache/httpcomponents/httpcore/4.0.1/httpcore-4.0.1.jar (169 KB at 789.0 KB/sec)
Downloading: http://repo1.maven.org/maven2/org/apache/maven/doxia/doxia-module-fml/1.2/doxia-module-fml-1.2.jar
Downloaded: http://repo1.maven.org/maven2/org/apache/maven/doxia/doxia-decoration-model/1.2/doxia-decoration-model-1.2.jar (59 KB at 410.8 KB/sec)
Downloading: http://repo1.maven.org/maven2/org/codehaus/plexus/plexus-i18n/1.0-beta-7/plexus-i18n-1.0-beta-7.jar
Downloaded: http://repo1.maven.org/maven2/org/apache/httpcomponents/httpclient/4.0.2/httpclient-4.0.2.jar (287 KB at 993.1 KB/sec)
Downloading: http://repo1.maven.org/maven2/commons-collections/commons-collections/3.2.1/commons-collections-3.2.1.jar
Downloaded: http://repo1.maven.org/maven2/org/apache/maven/doxia/doxia-module-xhtml/1.2/doxia-module-xhtml-1.2.jar (15 KB at 122.9 KB/sec)
Downloading: http://repo1.maven.org/maven2/org/codehaus/plexus/plexus-interpolation/1.11/plexus-interpolation-1.11.jar
Downloaded: http://repo1.maven.org/maven2/xerces/xercesImpl/2.9.1/xercesImpl-2.9.1.jar (1201 KB at 2956.4 KB/sec)
Downloading: http://repo1.maven.org/maven2/org/apache/maven/plugin-tools/maven-plugin-tools-api/3.2/maven-plugin-tools-api-3.2.jar
Downloaded: http://repo1.maven.org/maven2/org/apache/maven/doxia/doxia-module-fml/1.2/doxia-module-fml-1.2.jar (37 KB at 258.5 KB/sec)
Downloading: http://repo1.maven.org/maven2/org/apache/maven/plugin-tools/maven-plugin-tools-generators/3.2/maven-plugin-tools-generators-3.2.jar
Downloaded: http://repo1.maven.org/maven2/org/codehaus/plexus/plexus-i18n/1.0-beta-7/plexus-i18n-1.0-beta-7.jar (11 KB at 103.7 KB/sec)
Downloading: http://repo1.maven.org/maven2/net/sf/jtidy/jtidy/r938/jtidy-r938.jar
Downloaded: http://repo1.maven.org/maven2/org/codehaus/plexus/plexus-interpolation/1.11/plexus-interpolation-1.11.jar (50 KB at 336.1 KB/sec)
Downloading: http://repo1.maven.org/maven2/backport-util-concurrent/backport-util-concurrent/3.1/backport-util-concurrent-3.1.jar
Downloaded: http://repo1.maven.org/maven2/org/apache/maven/plugin-tools/maven-plugin-tools-api/3.2/maven-plugin-tools-api-3.2.jar (23 KB at 183.0 KB/sec)
Downloading: http://repo1.maven.org/maven2/org/apache/maven/reporting/maven-reporting-impl/2.1/maven-reporting-impl-2.1.jar
Downloaded: http://repo1.maven.org/maven2/org/apache/maven/plugin-tools/maven-plugin-tools-generators/3.2/maven-plugin-tools-generators-3.2.jar (46 KB at 312.7 KB/sec)
Downloading: http://repo1.maven.org/maven2/commons-validator/commons-validator/1.2.0/commons-validator-1.2.0.jar
Downloaded: http://repo1.maven.org/maven2/org/apache/maven/reporting/maven-reporting-impl/2.1/maven-reporting-impl-2.1.jar (17 KB at 131.6 KB/sec)
Downloading: http://repo1.maven.org/maven2/commons-beanutils/commons-beanutils/1.7.0/commons-beanutils-1.7.0.jar
Downloaded: http://repo1.maven.org/maven2/net/sf/jtidy/jtidy/r938/jtidy-r938.jar (245 KB at 1016.9 KB/sec)
Downloaded: http://repo1.maven.org/maven2/commons-collections/commons-collections/3.2.1/commons-collections-3.2.1.jar (562 KB at 1672.3 KB/sec)
Downloading: http://repo1.maven.org/maven2/commons-digester/commons-digester/1.6/commons-digester-1.6.jar
Downloading: http://repo1.maven.org/maven2/commons-logging/commons-logging/1.0.4/commons-logging-1.0.4.jar
Downloaded: http://repo1.maven.org/maven2/commons-validator/commons-validator/1.2.0/commons-validator-1.2.0.jar (89 KB at 517.3 KB/sec)
Downloading: http://repo1.maven.org/maven2/oro/oro/2.0.8/oro-2.0.8.jar
Downloaded: http://repo1.maven.org/maven2/backport-util-concurrent/backport-util-concurrent/3.1/backport-util-concurrent-3.1.jar (324 KB at 1208.7 KB/sec)
Downloading: http://repo1.maven.org/maven2/xml-apis/xml-apis/1.0.b2/xml-apis-1.0.b2.jar
Downloaded: http://repo1.maven.org/maven2/commons-logging/commons-logging/1.0.4/commons-logging-1.0.4.jar (38 KB at 252.5 KB/sec)
Downloading: http://repo1.maven.org/maven2/org/apache/maven/reporting/maven-reporting-api/3.0/maven-reporting-api-3.0.jar
Downloaded: http://repo1.maven.org/maven2/commons-beanutils/commons-beanutils/1.7.0/commons-beanutils-1.7.0.jar (185 KB at 869.1 KB/sec)
Downloading: http://repo1.maven.org/maven2/org/apache/maven/plugin-tools/maven-plugin-tools-java/3.2/maven-plugin-tools-java-3.2.jar
Downloaded: http://repo1.maven.org/maven2/oro/oro/2.0.8/oro-2.0.8.jar (64 KB at 386.3 KB/sec)
Downloading: http://repo1.maven.org/maven2/org/apache/maven/plugin-tools/maven-plugin-tools-beanshell/3.2/maven-plugin-tools-beanshell-3.2.jar
Downloaded: http://repo1.maven.org/maven2/commons-digester/commons-digester/1.6/commons-digester-1.6.jar (165 KB at 754.6 KB/sec)
Downloading: http://repo1.maven.org/maven2/bsh/bsh/1.3.0/bsh-1.3.0.jar
Downloaded: http://repo1.maven.org/maven2/org/apache/maven/reporting/maven-reporting-api/3.0/maven-reporting-api-3.0.jar (11 KB at 106.8 KB/sec)
Downloading: http://repo1.maven.org/maven2/org/apache/maven/plugin-tools/maven-plugin-tools-model/3.2/maven-plugin-tools-model-3.2.jar
Downloaded: http://repo1.maven.org/maven2/xml-apis/xml-apis/1.0.b2/xml-apis-1.0.b2.jar (107 KB at 550.3 KB/sec)
Downloading: http://repo1.maven.org/maven2/org/codehaus/plexus/plexus-utils/3.0/plexus-utils-3.0.jar
Downloaded: http://repo1.maven.org/maven2/org/apache/maven/plugin-tools/maven-plugin-tools-java/3.2/maven-plugin-tools-java-3.2.jar (18 KB at 142.4 KB/sec)
Downloading: http://repo1.maven.org/maven2/org/codehaus/plexus/plexus-velocity/1.1.8/plexus-velocity-1.1.8.jar
Downloaded: http://repo1.maven.org/maven2/org/apache/maven/plugin-tools/maven-plugin-tools-beanshell/3.2/maven-plugin-tools-beanshell-3.2.jar (13 KB at 122.5 KB/sec)
Downloading: http://repo1.maven.org/maven2/org/apache/velocity/velocity/1.7/velocity-1.7.jar
Downloaded: http://repo1.maven.org/maven2/org/apache/maven/plugin-tools/maven-plugin-tools-model/3.2/maven-plugin-tools-model-3.2.jar (32 KB at 251.1 KB/sec)
Downloading: http://repo1.maven.org/maven2/commons-lang/commons-lang/2.4/commons-lang-2.4.jar
Downloaded: http://repo1.maven.org/maven2/org/codehaus/plexus/plexus-velocity/1.1.8/plexus-velocity-1.1.8.jar (8 KB at 77.0 KB/sec)
Downloaded: http://repo1.maven.org/maven2/bsh/bsh/1.3.0/bsh-1.3.0.jar (237 KB at 1006.3 KB/sec)
Downloaded: http://repo1.maven.org/maven2/org/codehaus/plexus/plexus-utils/3.0/plexus-utils-3.0.jar (221 KB at 935.5 KB/sec)
Downloaded: http://repo1.maven.org/maven2/org/apache/velocity/velocity/1.7/velocity-1.7.jar (439 KB at 1545.7 KB/sec)
Downloaded: http://repo1.maven.org/maven2/commons-lang/commons-lang/2.4/commons-lang-2.4.jar (256 KB at 979.6 KB/sec)
[WARNING] 

Goal prefix is specified as: 'org.eclipse.scout.maven.plugins.updatesite'. Maven currently expects it to be 'org.eclipse.scout..s.updatesite'.

[WARNING] Using platform encoding (UTF-8 actually) to read mojo metadata, i.e. build is platform dependent!
[INFO] Applying mojo extractor for language: java-annotations
[INFO] Mojo extractor for language: java-annotations found 0 mojo descriptors.
[INFO] Applying mojo extractor for language: java
[INFO] Mojo extractor for language: java found 2 mojo descriptors.
[INFO] Applying mojo extractor for language: bsh
[INFO] Mojo extractor for language: bsh found 0 mojo descriptors.
[INFO] 
[INFO] --- maven-plugin-plugin:3.2:descriptor (default-descriptor) @ org.eclipse.scout.maven.plugins.updatesite ---
[WARNING] 

Goal prefix is specified as: 'org.eclipse.scout.maven.plugins.updatesite'. Maven currently expects it to be 'org.eclipse.scout..s.updatesite'.

[WARNING] Using platform encoding (UTF-8 actually) to read mojo metadata, i.e. build is platform dependent!
[INFO] Applying mojo extractor for language: java-annotations
[INFO] Mojo extractor for language: java-annotations found 0 mojo descriptors.
[INFO] Applying mojo extractor for language: java
[INFO] Mojo extractor for language: java found 2 mojo descriptors.
[INFO] Applying mojo extractor for language: bsh
[INFO] Mojo extractor for language: bsh found 0 mojo descriptors.
[INFO] 
[INFO] --- maven-resources-plugin:2.4.3:resources (default-resources) @ org.eclipse.scout.maven.plugins.updatesite ---
Downloading: http://repo1.maven.org/maven2/org/apache/maven/maven-project/2.0.6/maven-project-2.0.6.pom
Downloaded: http://repo1.maven.org/maven2/org/apache/maven/maven-project/2.0.6/maven-project-2.0.6.pom (3 KB at 26.3 KB/sec)
Downloading: http://repo1.maven.org/maven2/org/apache/maven/maven-settings/2.0.6/maven-settings-2.0.6.pom
Downloaded: http://repo1.maven.org/maven2/org/apache/maven/maven-settings/2.0.6/maven-settings-2.0.6.pom (2 KB at 20.1 KB/sec)
Downloading: http://repo1.maven.org/maven2/org/apache/maven/maven-model/2.0.6/maven-model-2.0.6.pom
Downloaded: http://repo1.maven.org/maven2/org/apache/maven/maven-model/2.0.6/maven-model-2.0.6.pom (3 KB at 29.8 KB/sec)
Downloading: http://repo1.maven.org/maven2/org/codehaus/plexus/plexus-utils/1.4.1/plexus-utils-1.4.1.pom
Downloaded: http://repo1.maven.org/maven2/org/codehaus/plexus/plexus-utils/1.4.1/plexus-utils-1.4.1.pom (2 KB at 18.3 KB/sec)
Downloading: http://repo1.maven.org/maven2/org/codehaus/plexus/plexus-utils/1.0.4/plexus-utils-1.0.4.pom
Downloaded: http://repo1.maven.org/maven2/org/codehaus/plexus/plexus-utils/1.0.4/plexus-utils-1.0.4.pom (7 KB at 64.4 KB/sec)
Downloading: http://repo1.maven.org/maven2/org/apache/maven/maven-profile/2.0.6/maven-profile-2.0.6.pom
Downloaded: http://repo1.maven.org/maven2/org/apache/maven/maven-profile/2.0.6/maven-profile-2.0.6.pom (2 KB at 19.5 KB/sec)
Downloading: http://repo1.maven.org/maven2/org/apache/maven/maven-artifact-manager/2.0.6/maven-artifact-manager-2.0.6.pom
Downloaded: http://repo1.maven.org/maven2/org/apache/maven/maven-artifact-manager/2.0.6/maven-artifact-manager-2.0.6.pom (3 KB at 25.9 KB/sec)
Downloading: http://repo1.maven.org/maven2/org/apache/maven/maven-repository-metadata/2.0.6/maven-repository-metadata-2.0.6.pom
Downloaded: http://repo1.maven.org/maven2/org/apache/maven/maven-repository-metadata/2.0.6/maven-repository-metadata-2.0.6.pom (2 KB at 17.7 KB/sec)
Downloading: http://repo1.maven.org/maven2/org/apache/maven/maven-artifact/2.0.6/maven-artifact-2.0.6.pom
Downloaded: http://repo1.maven.org/maven2/org/apache/maven/maven-artifact/2.0.6/maven-artifact-2.0.6.pom (2 KB at 14.7 KB/sec)
Downloading: http://repo1.maven.org/maven2/org/apache/maven/maven-plugin-registry/2.0.6/maven-plugin-registry-2.0.6.pom
Downloaded: http://repo1.maven.org/maven2/org/apache/maven/maven-plugin-registry/2.0.6/maven-plugin-registry-2.0.6.pom (2 KB at 18.1 KB/sec)
Downloading: http://repo1.maven.org/maven2/org/apache/maven/maven-core/2.0.6/maven-core-2.0.6.pom
Downloaded: http://repo1.maven.org/maven2/org/apache/maven/maven-core/2.0.6/maven-core-2.0.6.pom (7 KB at 64.9 KB/sec)
Downloading: http://repo1.maven.org/maven2/org/apache/maven/maven-plugin-parameter-documenter/2.0.6/maven-plugin-parameter-documenter-2.0.6.pom
Downloaded: http://repo1.maven.org/maven2/org/apache/maven/maven-plugin-parameter-documenter/2.0.6/maven-plugin-parameter-documenter-2.0.6.pom (2 KB at 6.1 KB/sec)
Downloading: http://repo1.maven.org/maven2/org/apache/maven/reporting/maven-reporting-api/2.0.6/maven-reporting-api-2.0.6.pom
Downloaded: http://repo1.maven.org/maven2/org/apache/maven/reporting/maven-reporting-api/2.0.6/maven-reporting-api-2.0.6.pom (2 KB at 17.3 KB/sec)
Downloading: http://repo1.maven.org/maven2/org/apache/maven/reporting/maven-reporting/2.0.6/maven-reporting-2.0.6.pom
Downloaded: http://repo1.maven.org/maven2/org/apache/maven/reporting/maven-reporting/2.0.6/maven-reporting-2.0.6.pom (2 KB at 14.2 KB/sec)
Downloading: http://repo1.maven.org/maven2/org/apache/maven/doxia/doxia-sink-api/1.0-alpha-7/doxia-sink-api-1.0-alpha-7.pom
Downloaded: http://repo1.maven.org/maven2/org/apache/maven/doxia/doxia-sink-api/1.0-alpha-7/doxia-sink-api-1.0-alpha-7.pom (424 B at 4.2 KB/sec)
Downloading: http://repo1.maven.org/maven2/org/apache/maven/doxia/doxia/1.0-alpha-7/doxia-1.0-alpha-7.pom
Downloaded: http://repo1.maven.org/maven2/org/apache/maven/doxia/doxia/1.0-alpha-7/doxia-1.0-alpha-7.pom (4 KB at 39.0 KB/sec)
Downloading: http://repo1.maven.org/maven2/org/apache/maven/maven-error-diagnostics/2.0.6/maven-error-diagnostics-2.0.6.pom
Downloaded: http://repo1.maven.org/maven2/org/apache/maven/maven-error-diagnostics/2.0.6/maven-error-diagnostics-2.0.6.pom (2 KB at 17.0 KB/sec)
Downloading: http://repo1.maven.org/maven2/commons-cli/commons-cli/1.0/commons-cli-1.0.pom
Downloaded: http://repo1.maven.org/maven2/commons-cli/commons-cli/1.0/commons-cli-1.0.pom (3 KB at 20.6 KB/sec)
Downloading: http://repo1.maven.org/maven2/org/apache/maven/maven-plugin-descriptor/2.0.6/maven-plugin-descriptor-2.0.6.pom
Downloaded: http://repo1.maven.org/maven2/org/apache/maven/maven-plugin-descriptor/2.0.6/maven-plugin-descriptor-2.0.6.pom (2 KB at 19.9 KB/sec)
Downloading: http://repo1.maven.org/maven2/org/codehaus/plexus/plexus-interactivity-api/1.0-alpha-4/plexus-interactivity-api-1.0-alpha-4.pom
Downloaded: http://repo1.maven.org/maven2/org/codehaus/plexus/plexus-interactivity-api/1.0-alpha-4/plexus-interactivity-api-1.0-alpha-4.pom (7 KB at 66.0 KB/sec)
Downloading: http://repo1.maven.org/maven2/org/apache/maven/maven-monitor/2.0.6/maven-monitor-2.0.6.pom
Downloaded: http://repo1.maven.org/maven2/org/apache/maven/maven-monitor/2.0.6/maven-monitor-2.0.6.pom (2 KB at 12.5 KB/sec)
Downloading: http://repo1.maven.org/maven2/classworlds/classworlds/1.1/classworlds-1.1.pom
Downloaded: http://repo1.maven.org/maven2/classworlds/classworlds/1.1/classworlds-1.1.pom (4 KB at 31.8 KB/sec)
Downloading: http://repo1.maven.org/maven2/org/apache/maven/shared/maven-filtering/1.0-beta-4/maven-filtering-1.0-beta-4.pom
Downloaded: http://repo1.maven.org/maven2/org/apache/maven/shared/maven-filtering/1.0-beta-4/maven-filtering-1.0-beta-4.pom (5 KB at 46.4 KB/sec)
Downloading: http://repo1.maven.org/maven2/org/codehaus/plexus/plexus-utils/1.5.15/plexus-utils-1.5.15.pom
Downloaded: http://repo1.maven.org/maven2/org/codehaus/plexus/plexus-utils/1.5.15/plexus-utils-1.5.15.pom (7 KB at 66.9 KB/sec)
Downloading: http://repo1.maven.org/maven2/org/codehaus/plexus/plexus-interpolation/1.12/plexus-interpolation-1.12.pom
Downloaded: http://repo1.maven.org/maven2/org/codehaus/plexus/plexus-interpolation/1.12/plexus-interpolation-1.12.pom (889 B at 8.7 KB/sec)
Downloading: http://repo1.maven.org/maven2/org/sonatype/plexus/plexus-build-api/0.0.4/plexus-build-api-0.0.4.pom
Downloaded: http://repo1.maven.org/maven2/org/sonatype/plexus/plexus-build-api/0.0.4/plexus-build-api-0.0.4.pom (3 KB at 27.4 KB/sec)
Downloading: http://repo1.maven.org/maven2/org/sonatype/spice/spice-parent/10/spice-parent-10.pom
Downloaded: http://repo1.maven.org/maven2/org/sonatype/spice/spice-parent/10/spice-parent-10.pom (3 KB at 22.0 KB/sec)
Downloading: http://repo1.maven.org/maven2/org/sonatype/forge/forge-parent/3/forge-parent-3.pom
Downloaded: http://repo1.maven.org/maven2/org/sonatype/forge/forge-parent/3/forge-parent-3.pom (5 KB at 48.7 KB/sec)
Downloading: http://repo1.maven.org/maven2/org/codehaus/plexus/plexus-utils/1.5.8/plexus-utils-1.5.8.pom
Downloaded: http://repo1.maven.org/maven2/org/codehaus/plexus/plexus-utils/1.5.8/plexus-utils-1.5.8.pom (8 KB at 80.3 KB/sec)
Downloading: http://repo1.maven.org/maven2/org/codehaus/plexus/plexus-interpolation/1.13/plexus-interpolation-1.13.pom
Downloaded: http://repo1.maven.org/maven2/org/codehaus/plexus/plexus-interpolation/1.13/plexus-interpolation-1.13.pom (890 B at 8.6 KB/sec)
Downloading: http://repo1.maven.org/maven2/org/apache/maven/reporting/maven-reporting-api/2.0.6/maven-reporting-api-2.0.6.jar
Downloading: http://repo1.maven.org/maven2/org/apache/maven/doxia/doxia-sink-api/1.0-alpha-7/doxia-sink-api-1.0-alpha-7.jar
Downloading: http://repo1.maven.org/maven2/commons-cli/commons-cli/1.0/commons-cli-1.0.jar
Downloading: http://repo1.maven.org/maven2/org/codehaus/plexus/plexus-interactivity-api/1.0-alpha-4/plexus-interactivity-api-1.0-alpha-4.jar
Downloading: http://repo1.maven.org/maven2/org/apache/maven/shared/maven-filtering/1.0-beta-4/maven-filtering-1.0-beta-4.jar
Downloaded: http://repo1.maven.org/maven2/org/apache/maven/reporting/maven-reporting-api/2.0.6/maven-reporting-api-2.0.6.jar (10 KB at 96.1 KB/sec)
Downloading: http://repo1.maven.org/maven2/org/sonatype/plexus/plexus-build-api/0.0.4/plexus-build-api-0.0.4.jar
Downloaded: http://repo1.maven.org/maven2/org/apache/maven/doxia/doxia-sink-api/1.0-alpha-7/doxia-sink-api-1.0-alpha-7.jar (6 KB at 56.8 KB/sec)
Downloading: http://repo1.maven.org/maven2/org/codehaus/plexus/plexus-interpolation/1.13/plexus-interpolation-1.13.jar
Downloaded: http://repo1.maven.org/maven2/org/codehaus/plexus/plexus-interactivity-api/1.0-alpha-4/plexus-interactivity-api-1.0-alpha-4.jar (14 KB at 128.4 KB/sec)
Downloaded: http://repo1.maven.org/maven2/org/apache/maven/shared/maven-filtering/1.0-beta-4/maven-filtering-1.0-beta-4.jar (34 KB at 269.7 KB/sec)
Downloaded: http://repo1.maven.org/maven2/commons-cli/commons-cli/1.0/commons-cli-1.0.jar (30 KB at 231.6 KB/sec)
Downloaded: http://repo1.maven.org/maven2/org/sonatype/plexus/plexus-build-api/0.0.4/plexus-build-api-0.0.4.jar (7 KB at 67.9 KB/sec)
Downloaded: http://repo1.maven.org/maven2/org/codehaus/plexus/plexus-interpolation/1.13/plexus-interpolation-1.13.jar (60 KB at 411.2 KB/sec)
[WARNING] Using platform encoding (UTF-8 actually) to copy filtered resources, i.e. build is platform dependent!
[INFO] Copying 1 resource
[INFO] 
[INFO] --- maven-compiler-plugin:2.5.1:compile (default-compile) @ org.eclipse.scout.maven.plugins.updatesite ---
Downloading: http://repo1.maven.org/maven2/org/apache/maven/maven-plugin-api/2.0.9/maven-plugin-api-2.0.9.pom
Downloaded: http://repo1.maven.org/maven2/org/apache/maven/maven-plugin-api/2.0.9/maven-plugin-api-2.0.9.pom (2 KB at 14.7 KB/sec)
Downloading: http://repo1.maven.org/maven2/org/apache/maven/maven/2.0.9/maven-2.0.9.pom
Downloaded: http://repo1.maven.org/maven2/org/apache/maven/maven/2.0.9/maven-2.0.9.pom (19 KB at 152.6 KB/sec)
Downloading: http://repo1.maven.org/maven2/org/apache/maven/maven-parent/8/maven-parent-8.pom
Downloaded: http://repo1.maven.org/maven2/org/apache/maven/maven-parent/8/maven-parent-8.pom (24 KB at 194.8 KB/sec)
Downloading: http://repo1.maven.org/maven2/org/apache/maven/maven-artifact/2.0.9/maven-artifact-2.0.9.pom
Downloaded: http://repo1.maven.org/maven2/org/apache/maven/maven-artifact/2.0.9/maven-artifact-2.0.9.pom (2 KB at 16.0 KB/sec)
Downloading: http://repo1.maven.org/maven2/org/codehaus/plexus/plexus-utils/1.5.1/plexus-utils-1.5.1.pom
Downloaded: http://repo1.maven.org/maven2/org/codehaus/plexus/plexus-utils/1.5.1/plexus-utils-1.5.1.pom (3 KB at 22.6 KB/sec)
Downloading: http://repo1.maven.org/maven2/org/apache/maven/maven-core/2.0.9/maven-core-2.0.9.pom
Downloaded: http://repo1.maven.org/maven2/org/apache/maven/maven-core/2.0.9/maven-core-2.0.9.pom (8 KB at 73.1 KB/sec)
Downloading: http://repo1.maven.org/maven2/org/apache/maven/maven-settings/2.0.9/maven-settings-2.0.9.pom
Downloaded: http://repo1.maven.org/maven2/org/apache/maven/maven-settings/2.0.9/maven-settings-2.0.9.pom (3 KB at 20.1 KB/sec)
Downloading: http://repo1.maven.org/maven2/org/apache/maven/maven-model/2.0.9/maven-model-2.0.9.pom
Downloaded: http://repo1.maven.org/maven2/org/apache/maven/maven-model/2.0.9/maven-model-2.0.9.pom (4 KB at 31.3 KB/sec)
Downloading: http://repo1.maven.org/maven2/org/apache/maven/maven-plugin-parameter-documenter/2.0.9/maven-plugin-parameter-documenter-2.0.9.pom
Downloaded: http://repo1.maven.org/maven2/org/apache/maven/maven-plugin-parameter-documenter/2.0.9/maven-plugin-parameter-documenter-2.0.9.pom (2 KB at 19.2 KB/sec)
Downloading: http://repo1.maven.org/maven2/org/apache/maven/maven-profile/2.0.9/maven-profile-2.0.9.pom
Downloaded: http://repo1.maven.org/maven2/org/apache/maven/maven-profile/2.0.9/maven-profile-2.0.9.pom (3 KB at 20.9 KB/sec)
Downloading: http://repo1.maven.org/maven2/org/apache/maven/maven-repository-metadata/2.0.9/maven-repository-metadata-2.0.9.pom
Downloaded: http://repo1.maven.org/maven2/org/apache/maven/maven-repository-metadata/2.0.9/maven-repository-metadata-2.0.9.pom (2 KB at 18.6 KB/sec)
Downloading: http://repo1.maven.org/maven2/org/apache/maven/maven-error-diagnostics/2.0.9/maven-error-diagnostics-2.0.9.pom
Downloaded: http://repo1.maven.org/maven2/org/apache/maven/maven-error-diagnostics/2.0.9/maven-error-diagnostics-2.0.9.pom (2 KB at 17.4 KB/sec)
Downloading: http://repo1.maven.org/maven2/org/apache/maven/maven-project/2.0.9/maven-project-2.0.9.pom
Downloaded: http://repo1.maven.org/maven2/org/apache/maven/maven-project/2.0.9/maven-project-2.0.9.pom (3 KB at 26.7 KB/sec)
Downloading: http://repo1.maven.org/maven2/org/apache/maven/maven-artifact-manager/2.0.9/maven-artifact-manager-2.0.9.pom
Downloaded: http://repo1.maven.org/maven2/org/apache/maven/maven-artifact-manager/2.0.9/maven-artifact-manager-2.0.9.pom (3 KB at 26.9 KB/sec)
Downloading: http://repo1.maven.org/maven2/org/apache/maven/maven-plugin-registry/2.0.9/maven-plugin-registry-2.0.9.pom
Downloaded: http://repo1.maven.org/maven2/org/apache/maven/maven-plugin-registry/2.0.9/maven-plugin-registry-2.0.9.pom (2 KB at 19.4 KB/sec)
Downloading: http://repo1.maven.org/maven2/org/apache/maven/maven-plugin-descriptor/2.0.9/maven-plugin-descriptor-2.0.9.pom
Downloaded: http://repo1.maven.org/maven2/org/apache/maven/maven-plugin-descriptor/2.0.9/maven-plugin-descriptor-2.0.9.pom (3 KB at 20.3 KB/sec)
Downloading: http://repo1.maven.org/maven2/org/apache/maven/maven-monitor/2.0.9/maven-monitor-2.0.9.pom
Downloaded: http://repo1.maven.org/maven2/org/apache/maven/maven-monitor/2.0.9/maven-monitor-2.0.9.pom (2 KB at 12.8 KB/sec)
Downloading: http://repo1.maven.org/maven2/org/apache/maven/maven-toolchain/1.0/maven-toolchain-1.0.pom
Downloaded: http://repo1.maven.org/maven2/org/apache/maven/maven-toolchain/1.0/maven-toolchain-1.0.pom (4 KB at 33.3 KB/sec)
Downloading: http://repo1.maven.org/maven2/org/codehaus/plexus/plexus-compiler-api/1.9.1/plexus-compiler-api-1.9.1.pom
Downloaded: http://repo1.maven.org/maven2/org/codehaus/plexus/plexus-compiler-api/1.9.1/plexus-compiler-api-1.9.1.pom (867 B at 8.6 KB/sec)
Downloading: http://repo1.maven.org/maven2/org/codehaus/plexus/plexus-compiler/1.9.1/plexus-compiler-1.9.1.pom
Downloaded: http://repo1.maven.org/maven2/org/codehaus/plexus/plexus-compiler/1.9.1/plexus-compiler-1.9.1.pom (4 KB at 38.3 KB/sec)
Downloading: http://repo1.maven.org/maven2/org/codehaus/plexus/plexus-components/1.1.20/plexus-components-1.1.20.pom
Downloaded: http://repo1.maven.org/maven2/org/codehaus/plexus/plexus-components/1.1.20/plexus-components-1.1.20.pom (3 KB at 30.1 KB/sec)
Downloading: http://repo1.maven.org/maven2/org/codehaus/plexus/plexus/3.1/plexus-3.1.pom
Downloaded: http://repo1.maven.org/maven2/org/codehaus/plexus/plexus/3.1/plexus-3.1.pom (19 KB at 142.0 KB/sec)
Downloading: http://repo1.maven.org/maven2/org/codehaus/plexus/plexus-compiler-manager/1.9.1/plexus-compiler-manager-1.9.1.pom
Downloaded: http://repo1.maven.org/maven2/org/codehaus/plexus/plexus-compiler-manager/1.9.1/plexus-compiler-manager-1.9.1.pom (692 B at 6.9 KB/sec)
Downloading: http://repo1.maven.org/maven2/org/codehaus/plexus/plexus-compiler-javac/1.9.1/plexus-compiler-javac-1.9.1.pom
Downloaded: http://repo1.maven.org/maven2/org/codehaus/plexus/plexus-compiler-javac/1.9.1/plexus-compiler-javac-1.9.1.pom (688 B at 6.8 KB/sec)
Downloading: http://repo1.maven.org/maven2/org/codehaus/plexus/plexus-compilers/1.9.1/plexus-compilers-1.9.1.pom
Downloaded: http://repo1.maven.org/maven2/org/codehaus/plexus/plexus-compilers/1.9.1/plexus-compilers-1.9.1.pom (2 KB at 12.0 KB/sec)
Downloading: http://repo1.maven.org/maven2/org/codehaus/plexus/plexus-compiler-api/1.9.1/plexus-compiler-api-1.9.1.jar
Downloading: http://repo1.maven.org/maven2/org/codehaus/plexus/plexus-compiler-manager/1.9.1/plexus-compiler-manager-1.9.1.jar
Downloading: http://repo1.maven.org/maven2/org/codehaus/plexus/plexus-compiler-javac/1.9.1/plexus-compiler-javac-1.9.1.jar
Downloaded: http://repo1.maven.org/maven2/org/codehaus/plexus/plexus-compiler-manager/1.9.1/plexus-compiler-manager-1.9.1.jar (5 KB at 45.9 KB/sec)
Downloaded: http://repo1.maven.org/maven2/org/codehaus/plexus/plexus-compiler-api/1.9.1/plexus-compiler-api-1.9.1.jar (21 KB at 163.2 KB/sec)
Downloaded: http://repo1.maven.org/maven2/org/codehaus/plexus/plexus-compiler-javac/1.9.1/plexus-compiler-javac-1.9.1.jar (14 KB at 110.1 KB/sec)
[WARNING] File encoding has not been set, using platform encoding UTF-8, i.e. build is platform dependent!
[INFO] Compiling 5 source files to /jobs/genie.technology.scout/scout-release/workspace/org.eclipse.scout-aggregator/org.eclipse.scout.maven.plugins.updatesite/target/classes
[INFO] 
[INFO] --- maven-plugin-plugin:3.2:descriptor (mojo-descriptor) @ org.eclipse.scout.maven.plugins.updatesite ---
[WARNING] 

Goal prefix is specified as: 'org.eclipse.scout.maven.plugins.updatesite'. Maven currently expects it to be 'org.eclipse.scout..s.updatesite'.

[WARNING] Using platform encoding (UTF-8 actually) to read mojo metadata, i.e. build is platform dependent!
[INFO] Applying mojo extractor for language: java-annotations
[INFO] Mojo extractor for language: java-annotations found 1 mojo descriptors.
[INFO] Applying mojo extractor for language: java
[INFO] Mojo extractor for language: java found 2 mojo descriptors.
[INFO] Applying mojo extractor for language: bsh
[INFO] Mojo extractor for language: bsh found 0 mojo descriptors.
[INFO] 
[INFO] --- maven-resources-plugin:2.4.3:testResources (default-testResources) @ org.eclipse.scout.maven.plugins.updatesite ---
[WARNING] Using platform encoding (UTF-8 actually) to copy filtered resources, i.e. build is platform dependent!
[INFO] Copying 5 resources
[INFO] 
[INFO] --- maven-compiler-plugin:2.5.1:testCompile (default-testCompile) @ org.eclipse.scout.maven.plugins.updatesite ---
[INFO] Not compiling test sources
[INFO] 
[INFO] --- maven-surefire-plugin:2.7.2:test (default-test) @ org.eclipse.scout.maven.plugins.updatesite ---
Downloading: http://repo1.maven.org/maven2/org/apache/maven/surefire/surefire-booter/2.7.2/surefire-booter-2.7.2.pom
Downloaded: http://repo1.maven.org/maven2/org/apache/maven/surefire/surefire-booter/2.7.2/surefire-booter-2.7.2.pom (2 KB at 17.5 KB/sec)
Downloading: http://repo1.maven.org/maven2/org/apache/maven/surefire/surefire-api/2.7.2/surefire-api-2.7.2.pom
Downloaded: http://repo1.maven.org/maven2/org/apache/maven/surefire/surefire-api/2.7.2/surefire-api-2.7.2.pom (2 KB at 19.8 KB/sec)
Downloading: http://repo1.maven.org/maven2/org/apache/maven/surefire/maven-surefire-common/2.7.2/maven-surefire-common-2.7.2.pom
Downloaded: http://repo1.maven.org/maven2/org/apache/maven/surefire/maven-surefire-common/2.7.2/maven-surefire-common-2.7.2.pom (4 KB at 36.9 KB/sec)
Downloading: http://repo1.maven.org/maven2/org/apache/maven/reporting/maven-reporting-api/2.0.9/maven-reporting-api-2.0.9.pom
Downloaded: http://repo1.maven.org/maven2/org/apache/maven/reporting/maven-reporting-api/2.0.9/maven-reporting-api-2.0.9.pom (2 KB at 18.0 KB/sec)
Downloading: http://repo1.maven.org/maven2/org/apache/maven/reporting/maven-reporting/2.0.9/maven-reporting-2.0.9.pom
Downloaded: http://repo1.maven.org/maven2/org/apache/maven/reporting/maven-reporting/2.0.9/maven-reporting-2.0.9.pom (2 KB at 14.9 KB/sec)
Downloading: http://repo1.maven.org/maven2/org/apache/maven/maven-toolchain/2.0.9/maven-toolchain-2.0.9.pom
Downloaded: http://repo1.maven.org/maven2/org/apache/maven/maven-toolchain/2.0.9/maven-toolchain-2.0.9.pom (4 KB at 34.6 KB/sec)
Downloading: http://repo1.maven.org/maven2/org/apache/maven/shared/maven-common-artifact-filters/1.3/maven-common-artifact-filters-1.3.pom
Downloaded: http://repo1.maven.org/maven2/org/apache/maven/shared/maven-common-artifact-filters/1.3/maven-common-artifact-filters-1.3.pom (4 KB at 36.5 KB/sec)
Downloading: http://repo1.maven.org/maven2/org/apache/maven/shared/maven-shared-components/12/maven-shared-components-12.pom
Downloaded: http://repo1.maven.org/maven2/org/apache/maven/shared/maven-shared-components/12/maven-shared-components-12.pom (10 KB at 92.1 KB/sec)
Downloading: http://repo1.maven.org/maven2/org/apache/maven/maven-parent/13/maven-parent-13.pom
Downloaded: http://repo1.maven.org/maven2/org/apache/maven/maven-parent/13/maven-parent-13.pom (23 KB at 182.7 KB/sec)
Downloading: http://repo1.maven.org/maven2/org/codehaus/plexus/plexus-container-default/1.0-alpha-9/plexus-container-default-1.0-alpha-9.pom
Downloaded: http://repo1.maven.org/maven2/org/codehaus/plexus/plexus-container-default/1.0-alpha-9/plexus-container-default-1.0-alpha-9.pom (2 KB at 12.3 KB/sec)
Downloading: http://repo1.maven.org/maven2/org/apache/maven/surefire/surefire-booter/2.7.2/surefire-booter-2.7.2.jar
Downloading: http://repo1.maven.org/maven2/org/apache/maven/surefire/surefire-api/2.7.2/surefire-api-2.7.2.jar
Downloading: http://repo1.maven.org/maven2/org/apache/maven/surefire/maven-surefire-common/2.7.2/maven-surefire-common-2.7.2.jar
Downloading: http://repo1.maven.org/maven2/org/apache/maven/shared/maven-common-artifact-filters/1.3/maven-common-artifact-filters-1.3.jar
Downloading: http://repo1.maven.org/maven2/org/apache/maven/reporting/maven-reporting-api/2.0.9/maven-reporting-api-2.0.9.jar
Downloaded: http://repo1.maven.org/maven2/org/apache/maven/reporting/maven-reporting-api/2.0.9/maven-reporting-api-2.0.9.jar (10 KB at 97.1 KB/sec)
Downloaded: http://repo1.maven.org/maven2/org/apache/maven/shared/maven-common-artifact-filters/1.3/maven-common-artifact-filters-1.3.jar (31 KB at 246.6 KB/sec)
Downloaded: http://repo1.maven.org/maven2/org/apache/maven/surefire/surefire-booter/2.7.2/surefire-booter-2.7.2.jar (32 KB at 257.8 KB/sec)
Downloaded: http://repo1.maven.org/maven2/org/apache/maven/surefire/maven-surefire-common/2.7.2/maven-surefire-common-2.7.2.jar (60 KB at 399.2 KB/sec)
Downloaded: http://repo1.maven.org/maven2/org/apache/maven/surefire/surefire-api/2.7.2/surefire-api-2.7.2.jar (119 KB at 611.8 KB/sec)
[INFO] Tests are skipped.
[INFO] 
[INFO] --- maven-jar-plugin:2.3.1:jar (default-jar) @ org.eclipse.scout.maven.plugins.updatesite ---
Downloading: http://repo1.maven.org/maven2/org/apache/maven/maven-archiver/2.4.1/maven-archiver-2.4.1.pom
Downloaded: http://repo1.maven.org/maven2/org/apache/maven/maven-archiver/2.4.1/maven-archiver-2.4.1.pom (4 KB at 38.6 KB/sec)
Downloading: http://repo1.maven.org/maven2/org/codehaus/plexus/plexus-archiver/1.0/plexus-archiver-1.0.pom
Downloaded: http://repo1.maven.org/maven2/org/codehaus/plexus/plexus-archiver/1.0/plexus-archiver-1.0.pom (2 KB at 16.0 KB/sec)
Downloading: http://repo1.maven.org/maven2/org/codehaus/plexus/plexus-components/1.1.17/plexus-components-1.1.17.pom
Downloaded: http://repo1.maven.org/maven2/org/codehaus/plexus/plexus-components/1.1.17/plexus-components-1.1.17.pom (6 KB at 45.0 KB/sec)
Downloading: http://repo1.maven.org/maven2/org/codehaus/plexus/plexus-io/1.0/plexus-io-1.0.pom
Downloaded: http://repo1.maven.org/maven2/org/codehaus/plexus/plexus-io/1.0/plexus-io-1.0.pom (2 KB at 12.0 KB/sec)
Downloading: http://repo1.maven.org/maven2/commons-lang/commons-lang/2.1/commons-lang-2.1.pom
Downloaded: http://repo1.maven.org/maven2/commons-lang/commons-lang/2.1/commons-lang-2.1.pom (10 KB at 98.9 KB/sec)
Downloading: http://repo1.maven.org/maven2/org/apache/maven/maven-archiver/2.4.1/maven-archiver-2.4.1.jar
Downloading: http://repo1.maven.org/maven2/org/codehaus/plexus/plexus-archiver/1.0/plexus-archiver-1.0.jar
Downloading: http://repo1.maven.org/maven2/org/codehaus/plexus/plexus-io/1.0/plexus-io-1.0.jar
Downloading: http://repo1.maven.org/maven2/commons-lang/commons-lang/2.1/commons-lang-2.1.jar
Downloaded: http://repo1.maven.org/maven2/org/apache/maven/maven-archiver/2.4.1/maven-archiver-2.4.1.jar (20 KB at 159.6 KB/sec)
Downloaded: http://repo1.maven.org/maven2/org/codehaus/plexus/plexus-io/1.0/plexus-io-1.0.jar (50 KB at 337.5 KB/sec)
Downloaded: http://repo1.maven.org/maven2/org/codehaus/plexus/plexus-archiver/1.0/plexus-archiver-1.0.jar (174 KB at 793.6 KB/sec)
Downloaded: http://repo1.maven.org/maven2/commons-lang/commons-lang/2.1/commons-lang-2.1.jar (203 KB at 834.8 KB/sec)
[INFO] Building jar: /jobs/genie.technology.scout/scout-release/workspace/org.eclipse.scout-aggregator/org.eclipse.scout.maven.plugins.updatesite/target/org.eclipse.scout.maven.plugins.updatesite-3.10.0-SNAPSHOT.jar
[INFO] 
[INFO] --- maven-plugin-plugin:3.2:addPluginArtifactMetadata (default-addPluginArtifactMetadata) @ org.eclipse.scout.maven.plugins.updatesite ---
[INFO] 
[INFO] --- maven-install-plugin:2.3.1:install (default-install) @ org.eclipse.scout.maven.plugins.updatesite ---
Downloading: http://repo1.maven.org/maven2/org/codehaus/plexus/plexus-digest/1.0/plexus-digest-1.0.pom
Downloaded: http://repo1.maven.org/maven2/org/codehaus/plexus/plexus-digest/1.0/plexus-digest-1.0.pom (2 KB at 10.2 KB/sec)
Downloading: http://repo1.maven.org/maven2/org/codehaus/plexus/plexus-components/1.1.7/plexus-components-1.1.7.pom
Downloaded: http://repo1.maven.org/maven2/org/codehaus/plexus/plexus-components/1.1.7/plexus-components-1.1.7.pom (5 KB at 47.2 KB/sec)
Downloading: http://repo1.maven.org/maven2/org/codehaus/plexus/plexus/1.0.8/plexus-1.0.8.pom
Downloaded: http://repo1.maven.org/maven2/org/codehaus/plexus/plexus/1.0.8/plexus-1.0.8.pom (8 KB at 72.8 KB/sec)
Downloading: http://repo1.maven.org/maven2/org/codehaus/plexus/plexus-container-default/1.0-alpha-8/plexus-container-default-1.0-alpha-8.pom
Downloaded: http://repo1.maven.org/maven2/org/codehaus/plexus/plexus-container-default/1.0-alpha-8/plexus-container-default-1.0-alpha-8.pom (8 KB at 72.4 KB/sec)
Downloading: http://repo1.maven.org/maven2/org/codehaus/plexus/plexus-digest/1.0/plexus-digest-1.0.jar
Downloaded: http://repo1.maven.org/maven2/org/codehaus/plexus/plexus-digest/1.0/plexus-digest-1.0.jar (12 KB at 117.0 KB/sec)
[INFO] Installing /jobs/genie.technology.scout/scout-release/workspace/org.eclipse.scout-aggregator/org.eclipse.scout.maven.plugins.updatesite/target/org.eclipse.scout.maven.plugins.updatesite-3.10.0-SNAPSHOT.jar to /home/hudson/genie.technology.scout/.hudson/jobs/scout-release/workspace/.maven/repo/org/eclipse/scout/maven/plugins/org.eclipse.scout.maven.plugins.updatesite/3.10.0-SNAPSHOT/org.eclipse.scout.maven.plugins.updatesite-3.10.0-SNAPSHOT.jar
[INFO] Installing /jobs/genie.technology.scout/scout-release/workspace/org.eclipse.scout-aggregator/org.eclipse.scout.maven.plugins.updatesite/pom.xml to /home/hudson/genie.technology.scout/.hudson/jobs/scout-release/workspace/.maven/repo/org/eclipse/scout/maven/plugins/org.eclipse.scout.maven.plugins.updatesite/3.10.0-SNAPSHOT/org.eclipse.scout.maven.plugins.updatesite-3.10.0-SNAPSHOT.pom
[INFO] ------------------------------------------------------------------------
[INFO] BUILD SUCCESS
[INFO] ------------------------------------------------------------------------
[INFO] Total time: 1:01.050s
[INFO] Finished at: Tue Nov 12 04:14:09 EST 2013
[INFO] Final Memory: 16M/327M
[INFO] ------------------------------------------------------------------------
[DEBUG] Closing connection to remote
[DEBUG] Waiting for process to finish
[DEBUG] Result: 0
[INFO] Using bundled Maven 3 installation
[INFO] Checking Maven 3 installation environment
[workspace] $ /home/hudson/genie.technology.scout/.hudson/maven/slavebundle/bundled-maven/bin/mvn --help
[INFO] Checking Maven 3 installation version
[INFO] Detected Maven 3 installation version: 3.0.3
[workspace] $ /home/hudson/genie.technology.scout/.hudson/maven/slavebundle/bundled-maven/bin/mvn clean install -V -B -Dstage_target_dir=releases/3.10/3.10.0 -Dis_tag=false -Dbuild_prefix=M- -Dremote_branch=Luna_M2_3 -Dtag_or_branch=Luna_M2_3 -DstageTargetDir=releases/3.10/3.10.0 -DbuildType=M- -Dmaven.test.skip=true -Dmaven.ext.class.path=/home/hudson/genie.technology.scout/.hudson/maven/slavebundle/resources:/home/hudson/genie.technology.scout/.hudson/maven/slavebundle/lib/maven3-eventspy-3.0.jar:/home/hudson/genie.technology.scout/.hudson/war/webapp/WEB-INF/lib/hudson-remoting-3.0.0.jar -Dhudson.eventspy.port=44458 -Dmaven.repo.local=/home/hudson/genie.technology.scout/.hudson/jobs/scout-release/workspace/.maven/repo -f org.eclipse.scout-aggregator/pom.xml -P eclipse-sign -P eclipse-stage -P bree-libs
[DEBUG] Waiting for connection on port: 44458
Apache Maven 3.0.3 (r1075438; 2011-02-28 12:31:09-0500)
Maven home: /home/hudson/genie.technology.scout/.hudson/maven/slavebundle/bundled-maven
Java version: 1.6.0_45, vendor: Sun Microsystems Inc.
Java home: /opt/public/common/jdk1.6.0_45/jre
Default locale: en_US, platform encoding: UTF-8
OS name: "linux", version: "3.0.51-0.7.9-default", arch: "amd64", family: "unix"
[DEBUG] Connected to remote
[INFO] Scanning for projects...
Downloading: https://repo.eclipse.org/content/groups/snapshots/org/eclipse/scout/org.eclipse.scout.parent/3.9.1-SNAPSHOT/maven-metadata.xml
Downloaded: https://repo.eclipse.org/content/groups/snapshots/org/eclipse/scout/org.eclipse.scout.parent/3.9.1-SNAPSHOT/maven-metadata.xml (620 B at 0.4 KB/sec)
Downloading: https://repo.eclipse.org/content/groups/snapshots/org/eclipse/scout/org.eclipse.scout.parent/3.9.1-SNAPSHOT/org.eclipse.scout.parent-3.9.1-20131004.030527-89.pom
Downloaded: https://repo.eclipse.org/content/groups/snapshots/org/eclipse/scout/org.eclipse.scout.parent/3.9.1-SNAPSHOT/org.eclipse.scout.parent-3.9.1-20131004.030527-89.pom (30 KB at 372.7 KB/sec)
Downloading: ${eclipse-repo.url}/org/eclipse/scout/eclipse.scout-aggregator/3.9.1-SNAPSHOT/maven-metadata.xml
Downloading: https://repo.eclipse.org/content/groups/snapshots/org/eclipse/scout/eclipse.scout-aggregator/3.9.1-SNAPSHOT/maven-metadata.xml
Downloaded: https://repo.eclipse.org/content/groups/snapshots/org/eclipse/scout/eclipse.scout-aggregator/3.9.1-SNAPSHOT/maven-metadata.xml (620 B at 6.6 KB/sec)
Downloading: https://repo.eclipse.org/content/groups/snapshots/org/eclipse/scout/eclipse.scout-aggregator/3.9.1-SNAPSHOT/eclipse.scout-aggregator-3.9.1-20131004.030522-89.pom
Downloaded: https://repo.eclipse.org/content/groups/snapshots/org/eclipse/scout/eclipse.scout-aggregator/3.9.1-SNAPSHOT/eclipse.scout-aggregator-3.9.1-20131004.030522-89.pom (3 KB at 48.9 KB/sec)
Downloading: https://repo.eclipse.org/content/repositories/releases/org/eclipse/tycho/tycho-maven-plugin/0.19.0/tycho-maven-plugin-0.19.0.pom
Downloading: https://repo.eclipse.org/content/repositories/eclipse-staging/org/eclipse/tycho/tycho-maven-plugin/0.19.0/tycho-maven-plugin-0.19.0.pom
Downloading: http://repo1.maven.org/maven2/org/eclipse/tycho/tycho-maven-plugin/0.19.0/tycho-maven-plugin-0.19.0.pom
Downloaded: http://repo1.maven.org/maven2/org/eclipse/tycho/tycho-maven-plugin/0.19.0/tycho-maven-plugin-0.19.0.pom (3 KB at 10.5 KB/sec)
Downloading: https://repo.eclipse.org/content/repositories/releases/org/eclipse/tycho/tycho/0.19.0/tycho-0.19.0.pom
Downloading: https://repo.eclipse.org/content/repositories/eclipse-staging/org/eclipse/tycho/tycho/0.19.0/tycho-0.19.0.pom
Downloading: http://repo1.maven.org/maven2/org/eclipse/tycho/tycho/0.19.0/tycho-0.19.0.pom
Downloaded: http://repo1.maven.org/maven2/org/eclipse/tycho/tycho/0.19.0/tycho-0.19.0.pom (19 KB at 144.2 KB/sec)
Downloading: https://repo.eclipse.org/content/repositories/releases/org/eclipse/tycho/tycho-core/0.19.0/tycho-core-0.19.0.pom
Downloading: https://repo.eclipse.org/content/repositories/eclipse-staging/org/eclipse/tycho/tycho-core/0.19.0/tycho-core-0.19.0.pom
Downloading: http://repo1.maven.org/maven2/org/eclipse/tycho/tycho-core/0.19.0/tycho-core-0.19.0.pom
Downloaded: http://repo1.maven.org/maven2/org/eclipse/tycho/tycho-core/0.19.0/tycho-core-0.19.0.pom (5 KB at 44.8 KB/sec)
Downloading: https://repo.eclipse.org/content/repositories/releases/org/codehaus/plexus/plexus-utils/3.0.7/plexus-utils-3.0.7.pom
Downloading: https://repo.eclipse.org/content/repositories/eclipse-staging/org/codehaus/plexus/plexus-utils/3.0.7/plexus-utils-3.0.7.pom
Downloading: http://repo1.maven.org/maven2/org/codehaus/plexus/plexus-utils/3.0.7/plexus-utils-3.0.7.pom
Downloaded: http://repo1.maven.org/maven2/org/codehaus/plexus/plexus-utils/3.0.7/plexus-utils-3.0.7.pom (3 KB at 24.5 KB/sec)
Downloading: https://repo.eclipse.org/content/repositories/releases/org/sonatype/plexus/plexus-cipher/1.7/plexus-cipher-1.7.pom
Downloading: https://repo.eclipse.org/content/repositories/eclipse-staging/org/sonatype/plexus/plexus-cipher/1.7/plexus-cipher-1.7.pom
Downloading: http://repo1.maven.org/maven2/org/sonatype/plexus/plexus-cipher/1.7/plexus-cipher-1.7.pom
Downloaded: http://repo1.maven.org/maven2/org/sonatype/plexus/plexus-cipher/1.7/plexus-cipher-1.7.pom (5 KB at 38.1 KB/sec)
Downloading: https://repo.eclipse.org/content/repositories/releases/org/sonatype/spice/spice-parent/15/spice-parent-15.pom
Downloading: https://repo.eclipse.org/content/repositories/eclipse-staging/org/sonatype/spice/spice-parent/15/spice-parent-15.pom
Downloading: http://repo1.maven.org/maven2/org/sonatype/spice/spice-parent/15/spice-parent-15.pom
Downloaded: http://repo1.maven.org/maven2/org/sonatype/spice/spice-parent/15/spice-parent-15.pom (9 KB at 80.0 KB/sec)
Downloading: https://repo.eclipse.org/content/repositories/releases/org/codehaus/plexus/plexus-archiver/2.2/plexus-archiver-2.2.pom
Downloading: https://repo.eclipse.org/content/repositories/eclipse-staging/org/codehaus/plexus/plexus-archiver/2.2/plexus-archiver-2.2.pom
Downloading: http://repo1.maven.org/maven2/org/codehaus/plexus/plexus-archiver/2.2/plexus-archiver-2.2.pom
Downloaded: http://repo1.maven.org/maven2/org/codehaus/plexus/plexus-archiver/2.2/plexus-archiver-2.2.pom (4 KB at 31.7 KB/sec)
Downloading: https://repo.eclipse.org/content/repositories/releases/org/codehaus/plexus/plexus-io/2.0.5/plexus-io-2.0.5.pom
Downloading: https://repo.eclipse.org/content/repositories/eclipse-staging/org/codehaus/plexus/plexus-io/2.0.5/plexus-io-2.0.5.pom
Downloading: http://repo1.maven.org/maven2/org/codehaus/plexus/plexus-io/2.0.5/plexus-io-2.0.5.pom
Downloaded: http://repo1.maven.org/maven2/org/codehaus/plexus/plexus-io/2.0.5/plexus-io-2.0.5.pom (3 KB at 20.2 KB/sec)
Downloading: https://repo.eclipse.org/content/repositories/releases/org/codehaus/plexus/plexus-components/1.2/plexus-components-1.2.pom
Downloading: https://repo.eclipse.org/content/repositories/eclipse-staging/org/codehaus/plexus/plexus-components/1.2/plexus-components-1.2.pom
Downloading: http://repo1.maven.org/maven2/org/codehaus/plexus/plexus-components/1.2/plexus-components-1.2.pom
Downloaded: http://repo1.maven.org/maven2/org/codehaus/plexus/plexus-components/1.2/plexus-components-1.2.pom (3 KB at 21.6 KB/sec)
Downloading: https://repo.eclipse.org/content/repositories/releases/org/eclipse/tycho/org.eclipse.osgi/3.9.1.v20130814-1242/org.eclipse.osgi-3.9.1.v20130814-1242.pom
Downloading: https://repo.eclipse.org/content/repositories/eclipse-staging/org/eclipse/tycho/org.eclipse.osgi/3.9.1.v20130814-1242/org.eclipse.osgi-3.9.1.v20130814-1242.pom
Downloading: http://repo1.maven.org/maven2/org/eclipse/tycho/org.eclipse.osgi/3.9.1.v20130814-1242/org.eclipse.osgi-3.9.1.v20130814-1242.pom
Downloaded: http://repo1.maven.org/maven2/org/eclipse/tycho/org.eclipse.osgi/3.9.1.v20130814-1242/org.eclipse.osgi-3.9.1.v20130814-1242.pom (2 KB at 14.5 KB/sec)
Downloading: https://repo.eclipse.org/content/repositories/releases/org/eclipse/tycho/sisu-equinox-embedder/0.19.0/sisu-equinox-embedder-0.19.0.pom
Downloading: https://repo.eclipse.org/content/repositories/eclipse-staging/org/eclipse/tycho/sisu-equinox-embedder/0.19.0/sisu-equinox-embedder-0.19.0.pom
Downloading: http://repo1.maven.org/maven2/org/eclipse/tycho/sisu-equinox-embedder/0.19.0/sisu-equinox-embedder-0.19.0.pom
Downloaded: http://repo1.maven.org/maven2/org/eclipse/tycho/sisu-equinox-embedder/0.19.0/sisu-equinox-embedder-0.19.0.pom (2 KB at 18.0 KB/sec)
Downloading: https://repo.eclipse.org/content/repositories/releases/org/eclipse/tycho/sisu-equinox/0.19.0/sisu-equinox-0.19.0.pom
Downloading: https://repo.eclipse.org/content/repositories/eclipse-staging/org/eclipse/tycho/sisu-equinox/0.19.0/sisu-equinox-0.19.0.pom
Downloading: http://repo1.maven.org/maven2/org/eclipse/tycho/sisu-equinox/0.19.0/sisu-equinox-0.19.0.pom
Downloaded: http://repo1.maven.org/maven2/org/eclipse/tycho/sisu-equinox/0.19.0/sisu-equinox-0.19.0.pom (2 KB at 10.1 KB/sec)
Downloading: https://repo.eclipse.org/content/repositories/releases/org/eclipse/tycho/sisu-equinox-api/0.19.0/sisu-equinox-api-0.19.0.pom
Downloading: https://repo.eclipse.org/content/repositories/eclipse-staging/org/eclipse/tycho/sisu-equinox-api/0.19.0/sisu-equinox-api-0.19.0.pom
Downloading: http://repo1.maven.org/maven2/org/eclipse/tycho/sisu-equinox-api/0.19.0/sisu-equinox-api-0.19.0.pom
Downloaded: http://repo1.maven.org/maven2/org/eclipse/tycho/sisu-equinox-api/0.19.0/sisu-equinox-api-0.19.0.pom (2 KB at 16.4 KB/sec)
Downloading: https://repo.eclipse.org/content/repositories/releases/org/eclipse/tycho/tycho-metadata-model/0.19.0/tycho-metadata-model-0.19.0.pom
Downloading: https://repo.eclipse.org/content/repositories/eclipse-staging/org/eclipse/tycho/tycho-metadata-model/0.19.0/tycho-metadata-model-0.19.0.pom
Downloading: http://repo1.maven.org/maven2/org/eclipse/tycho/tycho-metadata-model/0.19.0/tycho-metadata-model-0.19.0.pom
Downloaded: http://repo1.maven.org/maven2/org/eclipse/tycho/tycho-metadata-model/0.19.0/tycho-metadata-model-0.19.0.pom (2 KB at 12.6 KB/sec)
Downloading: https://repo.eclipse.org/content/repositories/releases/de/pdark/decentxml/1.3/decentxml-1.3.pom
Downloading: https://repo.eclipse.org/content/repositories/eclipse-staging/de/pdark/decentxml/1.3/decentxml-1.3.pom
Downloading: http://repo1.maven.org/maven2/de/pdark/decentxml/1.3/decentxml-1.3.pom
Downloaded: http://repo1.maven.org/maven2/de/pdark/decentxml/1.3/decentxml-1.3.pom (7 KB at 61.2 KB/sec)
Downloading: https://repo.eclipse.org/content/repositories/releases/org/eclipse/tycho/tycho-embedder-api/0.19.0/tycho-embedder-api-0.19.0.pom
Downloading: https://repo.eclipse.org/content/repositories/eclipse-staging/org/eclipse/tycho/tycho-embedder-api/0.19.0/tycho-embedder-api-0.19.0.pom
Downloading: http://repo1.maven.org/maven2/org/eclipse/tycho/tycho-embedder-api/0.19.0/tycho-embedder-api-0.19.0.pom
Downloaded: http://repo1.maven.org/maven2/org/eclipse/tycho/tycho-embedder-api/0.19.0/tycho-embedder-api-0.19.0.pom (3 KB at 13.5 KB/sec)
Downloading: https://repo.eclipse.org/content/repositories/releases/org/eclipse/tycho/org.eclipse.tycho.embedder.shared/0.19.0/org.eclipse.tycho.embedder.shared-0.19.0.pom
Downloading: https://repo.eclipse.org/content/repositories/eclipse-staging/org/eclipse/tycho/org.eclipse.tycho.embedder.shared/0.19.0/org.eclipse.tycho.embedder.shared-0.19.0.pom
Downloading: http://repo1.maven.org/maven2/org/eclipse/tycho/org.eclipse.tycho.embedder.shared/0.19.0/org.eclipse.tycho.embedder.shared-0.19.0.pom
Downloaded: http://repo1.maven.org/maven2/org/eclipse/tycho/org.eclipse.tycho.embedder.shared/0.19.0/org.eclipse.tycho.embedder.shared-0.19.0.pom (2 KB at 10.3 KB/sec)
Downloading: https://repo.eclipse.org/content/repositories/releases/org/eclipse/tycho/tycho-bundles/0.19.0/tycho-bundles-0.19.0.pom
Downloading: https://repo.eclipse.org/content/repositories/eclipse-staging/org/eclipse/tycho/tycho-bundles/0.19.0/tycho-bundles-0.19.0.pom
Downloading: http://repo1.maven.org/maven2/org/eclipse/tycho/tycho-bundles/0.19.0/tycho-bundles-0.19.0.pom
Downloaded: http://repo1.maven.org/maven2/org/eclipse/tycho/tycho-bundles/0.19.0/tycho-bundles-0.19.0.pom (3 KB at 24.2 KB/sec)
Downloading: https://repo.eclipse.org/content/repositories/releases/org/eclipse/tycho/org.eclipse.tycho.core.shared/0.19.0/org.eclipse.tycho.core.shared-0.19.0.pom
Downloading: https://repo.eclipse.org/content/repositories/eclipse-staging/org/eclipse/tycho/org.eclipse.tycho.core.shared/0.19.0/org.eclipse.tycho.core.shared-0.19.0.pom
Downloading: http://repo1.maven.org/maven2/org/eclipse/tycho/org.eclipse.tycho.core.shared/0.19.0/org.eclipse.tycho.core.shared-0.19.0.pom
Downloaded: http://repo1.maven.org/maven2/org/eclipse/tycho/org.eclipse.tycho.core.shared/0.19.0/org.eclipse.tycho.core.shared-0.19.0.pom (2 KB at 10.0 KB/sec)
Downloading: https://repo.eclipse.org/content/repositories/releases/org/eclipse/tycho/tycho-p2-facade/0.19.0/tycho-p2-facade-0.19.0.pom
Downloading: https://repo.eclipse.org/content/repositories/eclipse-staging/org/eclipse/tycho/tycho-p2-facade/0.19.0/tycho-p2-facade-0.19.0.pom
Downloading: http://repo1.maven.org/maven2/org/eclipse/tycho/tycho-p2-facade/0.19.0/tycho-p2-facade-0.19.0.pom
Downloaded: http://repo1.maven.org/maven2/org/eclipse/tycho/tycho-p2-facade/0.19.0/tycho-p2-facade-0.19.0.pom (3 KB at 22.6 KB/sec)
Downloading: https://repo.eclipse.org/content/repositories/releases/org/eclipse/tycho/tycho-p2/0.19.0/tycho-p2-0.19.0.pom
Downloading: https://repo.eclipse.org/content/repositories/eclipse-staging/org/eclipse/tycho/tycho-p2/0.19.0/tycho-p2-0.19.0.pom
Downloading: http://repo1.maven.org/maven2/org/eclipse/tycho/tycho-p2/0.19.0/tycho-p2-0.19.0.pom
Downloaded: http://repo1.maven.org/maven2/org/eclipse/tycho/tycho-p2/0.19.0/tycho-p2-0.19.0.pom (2 KB at 11.0 KB/sec)
Downloading: https://repo.eclipse.org/content/repositories/releases/org/eclipse/tycho/org.eclipse.tycho.p2.resolver.shared/0.19.0/org.eclipse.tycho.p2.resolver.shared-0.19.0.pom
Downloading: https://repo.eclipse.org/content/repositories/eclipse-staging/org/eclipse/tycho/org.eclipse.tycho.p2.resolver.shared/0.19.0/org.eclipse.tycho.p2.resolver.shared-0.19.0.pom
Downloading: http://repo1.maven.org/maven2/org/eclipse/tycho/org.eclipse.tycho.p2.resolver.shared/0.19.0/org.eclipse.tycho.p2.resolver.shared-0.19.0.pom
Downloaded: http://repo1.maven.org/maven2/org/eclipse/tycho/org.eclipse.tycho.p2.resolver.shared/0.19.0/org.eclipse.tycho.p2.resolver.shared-0.19.0.pom (2 KB at 10.5 KB/sec)
Downloading: https://repo.eclipse.org/content/repositories/releases/org/eclipse/tycho/org.eclipse.tycho.p2.tools.shared/0.19.0/org.eclipse.tycho.p2.tools.shared-0.19.0.pom
Downloading: https://repo.eclipse.org/content/repositories/eclipse-staging/org/eclipse/tycho/org.eclipse.tycho.p2.tools.shared/0.19.0/org.eclipse.tycho.p2.tools.shared-0.19.0.pom
Downloading: http://repo1.maven.org/maven2/org/eclipse/tycho/org.eclipse.tycho.p2.tools.shared/0.19.0/org.eclipse.tycho.p2.tools.shared-0.19.0.pom
Downloaded: http://repo1.maven.org/maven2/org/eclipse/tycho/org.eclipse.tycho.p2.tools.shared/0.19.0/org.eclipse.tycho.p2.tools.shared-0.19.0.pom (2 KB at 10.5 KB/sec)
Downloading: https://repo.eclipse.org/content/repositories/releases/org/eclipse/tycho/tycho-maven-plugin/0.19.0/tycho-maven-plugin-0.19.0.jar
Downloading: https://repo.eclipse.org/content/repositories/releases/org/eclipse/tycho/tycho-core/0.19.0/tycho-core-0.19.0.jar
Downloading: https://repo.eclipse.org/content/repositories/releases/org/sonatype/plexus/plexus-cipher/1.7/plexus-cipher-1.7.jar
Downloading: https://repo.eclipse.org/content/repositories/releases/org/codehaus/plexus/plexus-utils/3.0.7/plexus-utils-3.0.7.jar
Downloading: https://repo.eclipse.org/content/repositories/releases/org/codehaus/plexus/plexus-archiver/2.2/plexus-archiver-2.2.jar
Downloading: https://repo.eclipse.org/content/repositories/releases/org/codehaus/plexus/plexus-io/2.0.5/plexus-io-2.0.5.jar
Downloading: https://repo.eclipse.org/content/repositories/releases/org/eclipse/tycho/org.eclipse.osgi/3.9.1.v20130814-1242/org.eclipse.osgi-3.9.1.v20130814-1242.jar
Downloading: https://repo.eclipse.org/content/repositories/releases/org/eclipse/tycho/sisu-equinox-embedder/0.19.0/sisu-equinox-embedder-0.19.0.jar
Downloading: https://repo.eclipse.org/content/repositories/releases/org/eclipse/tycho/sisu-equinox-api/0.19.0/sisu-equinox-api-0.19.0.jar
Downloading: https://repo.eclipse.org/content/repositories/releases/org/eclipse/tycho/tycho-metadata-model/0.19.0/tycho-metadata-model-0.19.0.jar
Downloading: https://repo.eclipse.org/content/repositories/releases/de/pdark/decentxml/1.3/decentxml-1.3.jar
Downloading: https://repo.eclipse.org/content/repositories/releases/org/eclipse/tycho/tycho-embedder-api/0.19.0/tycho-embedder-api-0.19.0.jar
Downloading: https://repo.eclipse.org/content/repositories/releases/org/eclipse/tycho/org.eclipse.tycho.embedder.shared/0.19.0/org.eclipse.tycho.embedder.shared-0.19.0.jar
Downloading: https://repo.eclipse.org/content/repositories/releases/org/eclipse/tycho/org.eclipse.tycho.core.shared/0.19.0/org.eclipse.tycho.core.shared-0.19.0.jar
Downloading: https://repo.eclipse.org/content/repositories/releases/org/eclipse/tycho/tycho-p2-facade/0.19.0/tycho-p2-facade-0.19.0.jar
Downloading: https://repo.eclipse.org/content/repositories/releases/org/eclipse/tycho/org.eclipse.tycho.p2.resolver.shared/0.19.0/org.eclipse.tycho.p2.resolver.shared-0.19.0.jar
Downloading: https://repo.eclipse.org/content/repositories/releases/org/eclipse/tycho/org.eclipse.tycho.p2.tools.shared/0.19.0/org.eclipse.tycho.p2.tools.shared-0.19.0.jar
Downloading: https://repo.eclipse.org/content/repositories/eclipse-staging/org/eclipse/tycho/tycho-maven-plugin/0.19.0/tycho-maven-plugin-0.19.0.jar
Downloading: https://repo.eclipse.org/content/repositories/eclipse-staging/org/eclipse/tycho/tycho-core/0.19.0/tycho-core-0.19.0.jar
Downloading: https://repo.eclipse.org/content/repositories/eclipse-staging/org/sonatype/plexus/plexus-cipher/1.7/plexus-cipher-1.7.jar
Downloading: https://repo.eclipse.org/content/repositories/eclipse-staging/org/codehaus/plexus/plexus-utils/3.0.7/plexus-utils-3.0.7.jar
Downloading: https://repo.eclipse.org/content/repositories/eclipse-staging/org/codehaus/plexus/plexus-archiver/2.2/plexus-archiver-2.2.jar
Downloading: https://repo.eclipse.org/content/repositories/eclipse-staging/org/codehaus/plexus/plexus-io/2.0.5/plexus-io-2.0.5.jar
Downloading: https://repo.eclipse.org/content/repositories/eclipse-staging/org/eclipse/tycho/org.eclipse.osgi/3.9.1.v20130814-1242/org.eclipse.osgi-3.9.1.v20130814-1242.jar
Downloading: https://repo.eclipse.org/content/repositories/eclipse-staging/org/eclipse/tycho/sisu-equinox-embedder/0.19.0/sisu-equinox-embedder-0.19.0.jar
Downloading: https://repo.eclipse.org/content/repositories/eclipse-staging/org/eclipse/tycho/sisu-equinox-api/0.19.0/sisu-equinox-api-0.19.0.jar
Downloading: https://repo.eclipse.org/content/repositories/eclipse-staging/org/eclipse/tycho/tycho-metadata-model/0.19.0/tycho-metadata-model-0.19.0.jar
Downloading: https://repo.eclipse.org/content/repositories/eclipse-staging/de/pdark/decentxml/1.3/decentxml-1.3.jar
Downloading: https://repo.eclipse.org/content/repositories/eclipse-staging/org/eclipse/tycho/tycho-embedder-api/0.19.0/tycho-embedder-api-0.19.0.jar
Downloading: https://repo.eclipse.org/content/repositories/eclipse-staging/org/eclipse/tycho/org.eclipse.tycho.embedder.shared/0.19.0/org.eclipse.tycho.embedder.shared-0.19.0.jar
Downloading: https://repo.eclipse.org/content/repositories/eclipse-staging/org/eclipse/tycho/org.eclipse.tycho.core.shared/0.19.0/org.eclipse.tycho.core.shared-0.19.0.jar
Downloading: https://repo.eclipse.org/content/repositories/eclipse-staging/org/eclipse/tycho/tycho-p2-facade/0.19.0/tycho-p2-facade-0.19.0.jar
Downloading: https://repo.eclipse.org/content/repositories/eclipse-staging/org/eclipse/tycho/org.eclipse.tycho.p2.resolver.shared/0.19.0/org.eclipse.tycho.p2.resolver.shared-0.19.0.jar
Downloading: https://repo.eclipse.org/content/repositories/eclipse-staging/org/eclipse/tycho/org.eclipse.tycho.p2.tools.shared/0.19.0/org.eclipse.tycho.p2.tools.shared-0.19.0.jar
Downloading: http://repo1.maven.org/maven2/org/eclipse/tycho/tycho-maven-plugin/0.19.0/tycho-maven-plugin-0.19.0.jar
Downloading: http://repo1.maven.org/maven2/org/eclipse/tycho/tycho-core/0.19.0/tycho-core-0.19.0.jar
Downloading: http://repo1.maven.org/maven2/org/sonatype/plexus/plexus-cipher/1.7/plexus-cipher-1.7.jar
Downloading: http://repo1.maven.org/maven2/org/codehaus/plexus/plexus-utils/3.0.7/plexus-utils-3.0.7.jar
Downloading: http://repo1.maven.org/maven2/org/codehaus/plexus/plexus-archiver/2.2/plexus-archiver-2.2.jar
Downloaded: http://repo1.maven.org/maven2/org/eclipse/tycho/tycho-maven-plugin/0.19.0/tycho-maven-plugin-0.19.0.jar (5 KB at 44.5 KB/sec)
Downloading: http://repo1.maven.org/maven2/org/codehaus/plexus/plexus-io/2.0.5/plexus-io-2.0.5.jar
Downloaded: http://repo1.maven.org/maven2/org/sonatype/plexus/plexus-cipher/1.7/plexus-cipher-1.7.jar (14 KB at 124.2 KB/sec)
Downloading: http://repo1.maven.org/maven2/org/eclipse/tycho/org.eclipse.osgi/3.9.1.v20130814-1242/org.eclipse.osgi-3.9.1.v20130814-1242.jar
Downloaded: http://repo1.maven.org/maven2/org/codehaus/plexus/plexus-archiver/2.2/plexus-archiver-2.2.jar (181 KB at 832.4 KB/sec)
Downloading: http://repo1.maven.org/maven2/org/eclipse/tycho/sisu-equinox-embedder/0.19.0/sisu-equinox-embedder-0.19.0.jar
Downloaded: http://repo1.maven.org/maven2/org/eclipse/tycho/tycho-core/0.19.0/tycho-core-0.19.0.jar (176 KB at 778.1 KB/sec)
Downloading: http://repo1.maven.org/maven2/org/eclipse/tycho/sisu-equinox-api/0.19.0/sisu-equinox-api-0.19.0.jar
Downloaded: http://repo1.maven.org/maven2/org/codehaus/plexus/plexus-utils/3.0.7/plexus-utils-3.0.7.jar (226 KB at 922.4 KB/sec)
Downloading: http://repo1.maven.org/maven2/org/eclipse/tycho/tycho-metadata-model/0.19.0/tycho-metadata-model-0.19.0.jar
Downloaded: http://repo1.maven.org/maven2/org/codehaus/plexus/plexus-io/2.0.5/plexus-io-2.0.5.jar (57 KB at 379.6 KB/sec)
Downloading: http://repo1.maven.org/maven2/de/pdark/decentxml/1.3/decentxml-1.3.jar
Downloaded: http://repo1.maven.org/maven2/org/eclipse/tycho/sisu-equinox-embedder/0.19.0/sisu-equinox-embedder-0.19.0.jar (13 KB at 124.5 KB/sec)
Downloading: http://repo1.maven.org/maven2/org/eclipse/tycho/tycho-embedder-api/0.19.0/tycho-embedder-api-0.19.0.jar
Downloaded: http://repo1.maven.org/maven2/org/eclipse/tycho/sisu-equinox-api/0.19.0/sisu-equinox-api-0.19.0.jar (4 KB at 29.8 KB/sec)
Downloading: http://repo1.maven.org/maven2/org/eclipse/tycho/org.eclipse.tycho.embedder.shared/0.19.0/org.eclipse.tycho.embedder.shared-0.19.0.jar
Downloaded: http://repo1.maven.org/maven2/org/eclipse/tycho/tycho-metadata-model/0.19.0/tycho-metadata-model-0.19.0.jar (29 KB at 224.9 KB/sec)
Downloading: http://repo1.maven.org/maven2/org/eclipse/tycho/org.eclipse.tycho.core.shared/0.19.0/org.eclipse.tycho.core.shared-0.19.0.jar
Downloaded: http://repo1.maven.org/maven2/org/eclipse/tycho/tycho-embedder-api/0.19.0/tycho-embedder-api-0.19.0.jar (7 KB at 68.0 KB/sec)
Downloading: http://repo1.maven.org/maven2/org/eclipse/tycho/tycho-p2-facade/0.19.0/tycho-p2-facade-0.19.0.jar
Downloaded: http://repo1.maven.org/maven2/org/eclipse/tycho/org.eclipse.tycho.embedder.shared/0.19.0/org.eclipse.tycho.embedder.shared-0.19.0.jar (7 KB at 53.2 KB/sec)
Downloading: http://repo1.maven.org/maven2/org/eclipse/tycho/org.eclipse.tycho.p2.resolver.shared/0.19.0/org.eclipse.tycho.p2.resolver.shared-0.19.0.jar
Downloaded: http://repo1.maven.org/maven2/de/pdark/decentxml/1.3/decentxml-1.3.jar (109 KB at 558.8 KB/sec)
Downloading: http://repo1.maven.org/maven2/org/eclipse/tycho/org.eclipse.tycho.p2.tools.shared/0.19.0/org.eclipse.tycho.p2.tools.shared-0.19.0.jar
Downloaded: http://repo1.maven.org/maven2/org/eclipse/tycho/org.eclipse.tycho.core.shared/0.19.0/org.eclipse.tycho.core.shared-0.19.0.jar (31 KB at 247.3 KB/sec)
Downloaded: http://repo1.maven.org/maven2/org/eclipse/tycho/org.eclipse.osgi/3.9.1.v20130814-1242/org.eclipse.osgi-3.9.1.v20130814-1242.jar (1360 KB at 3316.1 KB/sec)
Downloaded: http://repo1.maven.org/maven2/org/eclipse/tycho/org.eclipse.tycho.p2.tools.shared/0.19.0/org.eclipse.tycho.p2.tools.shared-0.19.0.jar (20 KB at 151.1 KB/sec)
Downloaded: http://repo1.maven.org/maven2/org/eclipse/tycho/org.eclipse.tycho.p2.resolver.shared/0.19.0/org.eclipse.tycho.p2.resolver.shared-0.19.0.jar (28 KB at 212.2 KB/sec)
Downloaded: http://repo1.maven.org/maven2/org/eclipse/tycho/tycho-p2-facade/0.19.0/tycho-p2-facade-0.19.0.jar (33 KB at 48.8 KB/sec)
Downloading: https://repo.eclipse.org/content/groups/releases/org/eclipse/tycho/tycho-maven-plugin/0.18.1/tycho-maven-plugin-0.18.1.pom
Downloading: https://repo.eclipse.org/content/groups/snapshots/org/eclipse/tycho/tycho-maven-plugin/0.18.1/tycho-maven-plugin-0.18.1.pom
Downloading: https://repo.eclipse.org/content/repositories/releases/org/eclipse/tycho/tycho-maven-plugin/0.18.1/tycho-maven-plugin-0.18.1.pom
Downloading: https://repo.eclipse.org/content/repositories/eclipse-staging/org/eclipse/tycho/tycho-maven-plugin/0.18.1/tycho-maven-plugin-0.18.1.pom
Downloading: http://repo1.maven.org/maven2/org/eclipse/tycho/tycho-maven-plugin/0.18.1/tycho-maven-plugin-0.18.1.pom
Downloaded: http://repo1.maven.org/maven2/org/eclipse/tycho/tycho-maven-plugin/0.18.1/tycho-maven-plugin-0.18.1.pom (3 KB at 20.3 KB/sec)
Downloading: https://repo.eclipse.org/content/groups/releases/org/eclipse/tycho/tycho/0.18.1/tycho-0.18.1.pom
Downloading: https://repo.eclipse.org/content/groups/snapshots/org/eclipse/tycho/tycho/0.18.1/tycho-0.18.1.pom
Downloading: https://repo.eclipse.org/content/repositories/releases/org/eclipse/tycho/tycho/0.18.1/tycho-0.18.1.pom
Downloading: https://repo.eclipse.org/content/repositories/eclipse-staging/org/eclipse/tycho/tycho/0.18.1/tycho-0.18.1.pom
Downloading: http://repo1.maven.org/maven2/org/eclipse/tycho/tycho/0.18.1/tycho-0.18.1.pom
Downloaded: http://repo1.maven.org/maven2/org/eclipse/tycho/tycho/0.18.1/tycho-0.18.1.pom (19 KB at 144.2 KB/sec)
Downloading: https://repo.eclipse.org/content/groups/releases/org/eclipse/tycho/tycho-core/0.18.1/tycho-core-0.18.1.pom
Downloading: https://repo.eclipse.org/content/groups/snapshots/org/eclipse/tycho/tycho-core/0.18.1/tycho-core-0.18.1.pom
Downloading: https://repo.eclipse.org/content/repositories/releases/org/eclipse/tycho/tycho-core/0.18.1/tycho-core-0.18.1.pom
Downloading: https://repo.eclipse.org/content/repositories/eclipse-staging/org/eclipse/tycho/tycho-core/0.18.1/tycho-core-0.18.1.pom
Downloading: http://repo1.maven.org/maven2/org/eclipse/tycho/tycho-core/0.18.1/tycho-core-0.18.1.pom
Downloaded: http://repo1.maven.org/maven2/org/eclipse/tycho/tycho-core/0.18.1/tycho-core-0.18.1.pom (5 KB at 44.4 KB/sec)
Downloading: https://repo.eclipse.org/content/groups/releases/org/eclipse/tycho/org.eclipse.osgi/3.9.0.v20130529-1710/org.eclipse.osgi-3.9.0.v20130529-1710.pom
Downloading: https://repo.eclipse.org/content/groups/snapshots/org/eclipse/tycho/org.eclipse.osgi/3.9.0.v20130529-1710/org.eclipse.osgi-3.9.0.v20130529-1710.pom
Downloading: https://repo.eclipse.org/content/repositories/releases/org/eclipse/tycho/org.eclipse.osgi/3.9.0.v20130529-1710/org.eclipse.osgi-3.9.0.v20130529-1710.pom
Downloading: https://repo.eclipse.org/content/repositories/eclipse-staging/org/eclipse/tycho/org.eclipse.osgi/3.9.0.v20130529-1710/org.eclipse.osgi-3.9.0.v20130529-1710.pom
Downloading: http://repo1.maven.org/maven2/org/eclipse/tycho/org.eclipse.osgi/3.9.0.v20130529-1710/org.eclipse.osgi-3.9.0.v20130529-1710.pom
Downloaded: http://repo1.maven.org/maven2/org/eclipse/tycho/org.eclipse.osgi/3.9.0.v20130529-1710/org.eclipse.osgi-3.9.0.v20130529-1710.pom (2 KB at 12.2 KB/sec)
Downloading: https://repo.eclipse.org/content/groups/releases/org/eclipse/tycho/sisu-equinox-embedder/0.18.1/sisu-equinox-embedder-0.18.1.pom
Downloading: https://repo.eclipse.org/content/groups/snapshots/org/eclipse/tycho/sisu-equinox-embedder/0.18.1/sisu-equinox-embedder-0.18.1.pom
Downloading: https://repo.eclipse.org/content/repositories/releases/org/eclipse/tycho/sisu-equinox-embedder/0.18.1/sisu-equinox-embedder-0.18.1.pom
Downloading: https://repo.eclipse.org/content/repositories/eclipse-staging/org/eclipse/tycho/sisu-equinox-embedder/0.18.1/sisu-equinox-embedder-0.18.1.pom
Downloading: http://repo1.maven.org/maven2/org/eclipse/tycho/sisu-equinox-embedder/0.18.1/sisu-equinox-embedder-0.18.1.pom
Downloaded: http://repo1.maven.org/maven2/org/eclipse/tycho/sisu-equinox-embedder/0.18.1/sisu-equinox-embedder-0.18.1.pom (2 KB at 17.9 KB/sec)
Downloading: https://repo.eclipse.org/content/groups/releases/org/eclipse/tycho/sisu-equinox/0.18.1/sisu-equinox-0.18.1.pom
Downloading: https://repo.eclipse.org/content/groups/snapshots/org/eclipse/tycho/sisu-equinox/0.18.1/sisu-equinox-0.18.1.pom
Downloading: https://repo.eclipse.org/content/repositories/releases/org/eclipse/tycho/sisu-equinox/0.18.1/sisu-equinox-0.18.1.pom
Downloading: https://repo.eclipse.org/content/repositories/eclipse-staging/org/eclipse/tycho/sisu-equinox/0.18.1/sisu-equinox-0.18.1.pom
Downloading: http://repo1.maven.org/maven2/org/eclipse/tycho/sisu-equinox/0.18.1/sisu-equinox-0.18.1.pom
Downloaded: http://repo1.maven.org/maven2/org/eclipse/tycho/sisu-equinox/0.18.1/sisu-equinox-0.18.1.pom (2 KB at 8.5 KB/sec)
Downloading: https://repo.eclipse.org/content/groups/releases/org/eclipse/tycho/sisu-equinox-api/0.18.1/sisu-equinox-api-0.18.1.pom
Downloading: https://repo.eclipse.org/content/groups/snapshots/org/eclipse/tycho/sisu-equinox-api/0.18.1/sisu-equinox-api-0.18.1.pom
Downloading: https://repo.eclipse.org/content/repositories/releases/org/eclipse/tycho/sisu-equinox-api/0.18.1/sisu-equinox-api-0.18.1.pom
Downloading: https://repo.eclipse.org/content/repositories/eclipse-staging/org/eclipse/tycho/sisu-equinox-api/0.18.1/sisu-equinox-api-0.18.1.pom
Downloading: http://repo1.maven.org/maven2/org/eclipse/tycho/sisu-equinox-api/0.18.1/sisu-equinox-api-0.18.1.pom
Downloaded: http://repo1.maven.org/maven2/org/eclipse/tycho/sisu-equinox-api/0.18.1/sisu-equinox-api-0.18.1.pom (2 KB at 6.1 KB/sec)
Downloading: https://repo.eclipse.org/content/groups/releases/org/eclipse/tycho/tycho-metadata-model/0.18.1/tycho-metadata-model-0.18.1.pom
Downloading: https://repo.eclipse.org/content/groups/snapshots/org/eclipse/tycho/tycho-metadata-model/0.18.1/tycho-metadata-model-0.18.1.pom
Downloading: https://repo.eclipse.org/content/repositories/releases/org/eclipse/tycho/tycho-metadata-model/0.18.1/tycho-metadata-model-0.18.1.pom
Downloading: https://repo.eclipse.org/content/repositories/eclipse-staging/org/eclipse/tycho/tycho-metadata-model/0.18.1/tycho-metadata-model-0.18.1.pom
Downloading: http://repo1.maven.org/maven2/org/eclipse/tycho/tycho-metadata-model/0.18.1/tycho-metadata-model-0.18.1.pom
Downloaded: http://repo1.maven.org/maven2/org/eclipse/tycho/tycho-metadata-model/0.18.1/tycho-metadata-model-0.18.1.pom (2 KB at 7.1 KB/sec)
Downloading: https://repo.eclipse.org/content/groups/releases/org/eclipse/tycho/tycho-embedder-api/0.18.1/tycho-embedder-api-0.18.1.pom
Downloading: https://repo.eclipse.org/content/groups/snapshots/org/eclipse/tycho/tycho-embedder-api/0.18.1/tycho-embedder-api-0.18.1.pom
Downloading: https://repo.eclipse.org/content/repositories/releases/org/eclipse/tycho/tycho-embedder-api/0.18.1/tycho-embedder-api-0.18.1.pom
Downloading: https://repo.eclipse.org/content/repositories/eclipse-staging/org/eclipse/tycho/tycho-embedder-api/0.18.1/tycho-embedder-api-0.18.1.pom
Downloading: http://repo1.maven.org/maven2/org/eclipse/tycho/tycho-embedder-api/0.18.1/tycho-embedder-api-0.18.1.pom
Downloaded: http://repo1.maven.org/maven2/org/eclipse/tycho/tycho-embedder-api/0.18.1/tycho-embedder-api-0.18.1.pom (3 KB at 20.0 KB/sec)
Downloading: https://repo.eclipse.org/content/groups/releases/org/eclipse/tycho/org.eclipse.tycho.embedder.shared/0.18.1/org.eclipse.tycho.embedder.shared-0.18.1.pom
Downloading: https://repo.eclipse.org/content/groups/snapshots/org/eclipse/tycho/org.eclipse.tycho.embedder.shared/0.18.1/org.eclipse.tycho.embedder.shared-0.18.1.pom
Downloading: https://repo.eclipse.org/content/repositories/releases/org/eclipse/tycho/org.eclipse.tycho.embedder.shared/0.18.1/org.eclipse.tycho.embedder.shared-0.18.1.pom
Downloading: https://repo.eclipse.org/content/repositories/eclipse-staging/org/eclipse/tycho/org.eclipse.tycho.embedder.shared/0.18.1/org.eclipse.tycho.embedder.shared-0.18.1.pom
Downloading: http://repo1.maven.org/maven2/org/eclipse/tycho/org.eclipse.tycho.embedder.shared/0.18.1/org.eclipse.tycho.embedder.shared-0.18.1.pom
Downloaded: http://repo1.maven.org/maven2/org/eclipse/tycho/org.eclipse.tycho.embedder.shared/0.18.1/org.eclipse.tycho.embedder.shared-0.18.1.pom (2 KB at 10.4 KB/sec)
Downloading: https://repo.eclipse.org/content/groups/releases/org/eclipse/tycho/tycho-bundles/0.18.1/tycho-bundles-0.18.1.pom
Downloading: https://repo.eclipse.org/content/groups/snapshots/org/eclipse/tycho/tycho-bundles/0.18.1/tycho-bundles-0.18.1.pom
Downloading: https://repo.eclipse.org/content/repositories/releases/org/eclipse/tycho/tycho-bundles/0.18.1/tycho-bundles-0.18.1.pom
Downloading: https://repo.eclipse.org/content/repositories/eclipse-staging/org/eclipse/tycho/tycho-bundles/0.18.1/tycho-bundles-0.18.1.pom
Downloading: http://repo1.maven.org/maven2/org/eclipse/tycho/tycho-bundles/0.18.1/tycho-bundles-0.18.1.pom
Downloaded: http://repo1.maven.org/maven2/org/eclipse/tycho/tycho-bundles/0.18.1/tycho-bundles-0.18.1.pom (3 KB at 18.6 KB/sec)
Downloading: https://repo.eclipse.org/content/groups/releases/org/eclipse/tycho/org.eclipse.tycho.core.shared/0.18.1/org.eclipse.tycho.core.shared-0.18.1.pom
Downloading: https://repo.eclipse.org/content/groups/snapshots/org/eclipse/tycho/org.eclipse.tycho.core.shared/0.18.1/org.eclipse.tycho.core.shared-0.18.1.pom
Downloading: https://repo.eclipse.org/content/repositories/releases/org/eclipse/tycho/org.eclipse.tycho.core.shared/0.18.1/org.eclipse.tycho.core.shared-0.18.1.pom
Downloading: https://repo.eclipse.org/content/repositories/eclipse-staging/org/eclipse/tycho/org.eclipse.tycho.core.shared/0.18.1/org.eclipse.tycho.core.shared-0.18.1.pom
Downloading: http://repo1.maven.org/maven2/org/eclipse/tycho/org.eclipse.tycho.core.shared/0.18.1/org.eclipse.tycho.core.shared-0.18.1.pom
Downloaded: http://repo1.maven.org/maven2/org/eclipse/tycho/org.eclipse.tycho.core.shared/0.18.1/org.eclipse.tycho.core.shared-0.18.1.pom (2 KB at 9.6 KB/sec)
Downloading: https://repo.eclipse.org/content/groups/releases/org/eclipse/tycho/tycho-p2-facade/0.18.1/tycho-p2-facade-0.18.1.pom
Downloading: https://repo.eclipse.org/content/groups/snapshots/org/eclipse/tycho/tycho-p2-facade/0.18.1/tycho-p2-facade-0.18.1.pom
Downloading: https://repo.eclipse.org/content/repositories/releases/org/eclipse/tycho/tycho-p2-facade/0.18.1/tycho-p2-facade-0.18.1.pom
Downloading: https://repo.eclipse.org/content/repositories/eclipse-staging/org/eclipse/tycho/tycho-p2-facade/0.18.1/tycho-p2-facade-0.18.1.pom
Downloading: http://repo1.maven.org/maven2/org/eclipse/tycho/tycho-p2-facade/0.18.1/tycho-p2-facade-0.18.1.pom
Downloaded: http://repo1.maven.org/maven2/org/eclipse/tycho/tycho-p2-facade/0.18.1/tycho-p2-facade-0.18.1.pom (3 KB at 21.9 KB/sec)
Downloading: https://repo.eclipse.org/content/groups/releases/org/eclipse/tycho/tycho-p2/0.18.1/tycho-p2-0.18.1.pom
Downloading: https://repo.eclipse.org/content/groups/snapshots/org/eclipse/tycho/tycho-p2/0.18.1/tycho-p2-0.18.1.pom
Downloading: https://repo.eclipse.org/content/repositories/releases/org/eclipse/tycho/tycho-p2/0.18.1/tycho-p2-0.18.1.pom
Downloading: https://repo.eclipse.org/content/repositories/eclipse-staging/org/eclipse/tycho/tycho-p2/0.18.1/tycho-p2-0.18.1.pom
Downloading: http://repo1.maven.org/maven2/org/eclipse/tycho/tycho-p2/0.18.1/tycho-p2-0.18.1.pom
Downloaded: http://repo1.maven.org/maven2/org/eclipse/tycho/tycho-p2/0.18.1/tycho-p2-0.18.1.pom (2 KB at 7.2 KB/sec)
Downloading: https://repo.eclipse.org/content/groups/releases/org/eclipse/tycho/org.eclipse.tycho.p2.resolver.shared/0.18.1/org.eclipse.tycho.p2.resolver.shared-0.18.1.pom
Downloading: https://repo.eclipse.org/content/groups/snapshots/org/eclipse/tycho/org.eclipse.tycho.p2.resolver.shared/0.18.1/org.eclipse.tycho.p2.resolver.shared-0.18.1.pom
Downloading: https://repo.eclipse.org/content/repositories/releases/org/eclipse/tycho/org.eclipse.tycho.p2.resolver.shared/0.18.1/org.eclipse.tycho.p2.resolver.shared-0.18.1.pom
Downloading: https://repo.eclipse.org/content/repositories/eclipse-staging/org/eclipse/tycho/org.eclipse.tycho.p2.resolver.shared/0.18.1/org.eclipse.tycho.p2.resolver.shared-0.18.1.pom
Downloading: http://repo1.maven.org/maven2/org/eclipse/tycho/org.eclipse.tycho.p2.resolver.shared/0.18.1/org.eclipse.tycho.p2.resolver.shared-0.18.1.pom
Downloaded: http://repo1.maven.org/maven2/org/eclipse/tycho/org.eclipse.tycho.p2.resolver.shared/0.18.1/org.eclipse.tycho.p2.resolver.shared-0.18.1.pom (2 KB at 10.5 KB/sec)
Downloading: https://repo.eclipse.org/content/groups/releases/org/eclipse/tycho/org.eclipse.tycho.p2.tools.shared/0.18.1/org.eclipse.tycho.p2.tools.shared-0.18.1.pom
Downloading: https://repo.eclipse.org/content/groups/snapshots/org/eclipse/tycho/org.eclipse.tycho.p2.tools.shared/0.18.1/org.eclipse.tycho.p2.tools.shared-0.18.1.pom
Downloading: https://repo.eclipse.org/content/repositories/releases/org/eclipse/tycho/org.eclipse.tycho.p2.tools.shared/0.18.1/org.eclipse.tycho.p2.tools.shared-0.18.1.pom
Downloading: https://repo.eclipse.org/content/repositories/eclipse-staging/org/eclipse/tycho/org.eclipse.tycho.p2.tools.shared/0.18.1/org.eclipse.tycho.p2.tools.shared-0.18.1.pom
Downloading: http://repo1.maven.org/maven2/org/eclipse/tycho/org.eclipse.tycho.p2.tools.shared/0.18.1/org.eclipse.tycho.p2.tools.shared-0.18.1.pom
Downloaded: http://repo1.maven.org/maven2/org/eclipse/tycho/org.eclipse.tycho.p2.tools.shared/0.18.1/org.eclipse.tycho.p2.tools.shared-0.18.1.pom (2 KB at 10.7 KB/sec)
Downloading: https://repo.eclipse.org/content/groups/releases/org/eclipse/tycho/tycho-maven-plugin/0.18.1/tycho-maven-plugin-0.18.1.jar
Downloading: https://repo.eclipse.org/content/groups/releases/org/eclipse/tycho/tycho-core/0.18.1/tycho-core-0.18.1.jar
Downloading: https://repo.eclipse.org/content/groups/releases/org/eclipse/tycho/org.eclipse.osgi/3.9.0.v20130529-1710/org.eclipse.osgi-3.9.0.v20130529-1710.jar
Downloading: https://repo.eclipse.org/content/groups/releases/org/eclipse/tycho/sisu-equinox-embedder/0.18.1/sisu-equinox-embedder-0.18.1.jar
Downloading: https://repo.eclipse.org/content/groups/releases/org/eclipse/tycho/sisu-equinox-api/0.18.1/sisu-equinox-api-0.18.1.jar
Downloading: https://repo.eclipse.org/content/groups/releases/org/eclipse/tycho/tycho-metadata-model/0.18.1/tycho-metadata-model-0.18.1.jar
Downloading: https://repo.eclipse.org/content/groups/releases/org/eclipse/tycho/tycho-embedder-api/0.18.1/tycho-embedder-api-0.18.1.jar
Downloading: https://repo.eclipse.org/content/groups/releases/org/eclipse/tycho/org.eclipse.tycho.embedder.shared/0.18.1/org.eclipse.tycho.embedder.shared-0.18.1.jar
Downloading: https://repo.eclipse.org/content/groups/releases/org/eclipse/tycho/org.eclipse.tycho.core.shared/0.18.1/org.eclipse.tycho.core.shared-0.18.1.jar
Downloading: https://repo.eclipse.org/content/groups/releases/org/eclipse/tycho/tycho-p2-facade/0.18.1/tycho-p2-facade-0.18.1.jar
Downloading: https://repo.eclipse.org/content/groups/releases/org/eclipse/tycho/org.eclipse.tycho.p2.resolver.shared/0.18.1/org.eclipse.tycho.p2.resolver.shared-0.18.1.jar
Downloading: https://repo.eclipse.org/content/groups/releases/org/eclipse/tycho/org.eclipse.tycho.p2.tools.shared/0.18.1/org.eclipse.tycho.p2.tools.shared-0.18.1.jar
Downloading: https://repo.eclipse.org/content/groups/snapshots/org/eclipse/tycho/tycho-maven-plugin/0.18.1/tycho-maven-plugin-0.18.1.jar
Downloading: https://repo.eclipse.org/content/groups/snapshots/org/eclipse/tycho/tycho-core/0.18.1/tycho-core-0.18.1.jar
Downloading: https://repo.eclipse.org/content/groups/snapshots/org/eclipse/tycho/org.eclipse.osgi/3.9.0.v20130529-1710/org.eclipse.osgi-3.9.0.v20130529-1710.jar
Downloading: https://repo.eclipse.org/content/groups/snapshots/org/eclipse/tycho/sisu-equinox-embedder/0.18.1/sisu-equinox-embedder-0.18.1.jar
Downloading: https://repo.eclipse.org/content/groups/snapshots/org/eclipse/tycho/sisu-equinox-api/0.18.1/sisu-equinox-api-0.18.1.jar
Downloading: https://repo.eclipse.org/content/groups/snapshots/org/eclipse/tycho/tycho-metadata-model/0.18.1/tycho-metadata-model-0.18.1.jar
Downloading: https://repo.eclipse.org/content/groups/snapshots/org/eclipse/tycho/tycho-embedder-api/0.18.1/tycho-embedder-api-0.18.1.jar
Downloading: https://repo.eclipse.org/content/groups/snapshots/org/eclipse/tycho/org.eclipse.tycho.embedder.shared/0.18.1/org.eclipse.tycho.embedder.shared-0.18.1.jar
Downloading: https://repo.eclipse.org/content/groups/snapshots/org/eclipse/tycho/org.eclipse.tycho.core.shared/0.18.1/org.eclipse.tycho.core.shared-0.18.1.jar
Downloading: https://repo.eclipse.org/content/groups/snapshots/org/eclipse/tycho/tycho-p2-facade/0.18.1/tycho-p2-facade-0.18.1.jar
Downloading: https://repo.eclipse.org/content/groups/snapshots/org/eclipse/tycho/org.eclipse.tycho.p2.resolver.shared/0.18.1/org.eclipse.tycho.p2.resolver.shared-0.18.1.jar
Downloading: https://repo.eclipse.org/content/groups/snapshots/org/eclipse/tycho/org.eclipse.tycho.p2.tools.shared/0.18.1/org.eclipse.tycho.p2.tools.shared-0.18.1.jar
Downloading: https://repo.eclipse.org/content/repositories/releases/org/eclipse/tycho/tycho-maven-plugin/0.18.1/tycho-maven-plugin-0.18.1.jar
Downloading: https://repo.eclipse.org/content/repositories/releases/org/eclipse/tycho/tycho-core/0.18.1/tycho-core-0.18.1.jar
Downloading: https://repo.eclipse.org/content/repositories/releases/org/eclipse/tycho/org.eclipse.osgi/3.9.0.v20130529-1710/org.eclipse.osgi-3.9.0.v20130529-1710.jar
Downloading: https://repo.eclipse.org/content/repositories/releases/org/eclipse/tycho/sisu-equinox-embedder/0.18.1/sisu-equinox-embedder-0.18.1.jar
Downloading: https://repo.eclipse.org/content/repositories/releases/org/eclipse/tycho/sisu-equinox-api/0.18.1/sisu-equinox-api-0.18.1.jar
Downloading: https://repo.eclipse.org/content/repositories/releases/org/eclipse/tycho/tycho-metadata-model/0.18.1/tycho-metadata-model-0.18.1.jar
Downloading: https://repo.eclipse.org/content/repositories/releases/org/eclipse/tycho/tycho-embedder-api/0.18.1/tycho-embedder-api-0.18.1.jar
Downloading: https://repo.eclipse.org/content/repositories/releases/org/eclipse/tycho/org.eclipse.tycho.embedder.shared/0.18.1/org.eclipse.tycho.embedder.shared-0.18.1.jar
Downloading: https://repo.eclipse.org/content/repositories/releases/org/eclipse/tycho/org.eclipse.tycho.core.shared/0.18.1/org.eclipse.tycho.core.shared-0.18.1.jar
Downloading: https://repo.eclipse.org/content/repositories/releases/org/eclipse/tycho/tycho-p2-facade/0.18.1/tycho-p2-facade-0.18.1.jar
Downloading: https://repo.eclipse.org/content/repositories/releases/org/eclipse/tycho/org.eclipse.tycho.p2.resolver.shared/0.18.1/org.eclipse.tycho.p2.resolver.shared-0.18.1.jar
Downloading: https://repo.eclipse.org/content/repositories/releases/org/eclipse/tycho/org.eclipse.tycho.p2.tools.shared/0.18.1/org.eclipse.tycho.p2.tools.shared-0.18.1.jar
Downloading: https://repo.eclipse.org/content/repositories/eclipse-staging/org/eclipse/tycho/tycho-maven-plugin/0.18.1/tycho-maven-plugin-0.18.1.jar
Downloading: https://repo.eclipse.org/content/repositories/eclipse-staging/org/eclipse/tycho/tycho-core/0.18.1/tycho-core-0.18.1.jar
Downloading: https://repo.eclipse.org/content/repositories/eclipse-staging/org/eclipse/tycho/org.eclipse.osgi/3.9.0.v20130529-1710/org.eclipse.osgi-3.9.0.v20130529-1710.jar
Downloading: https://repo.eclipse.org/content/repositories/eclipse-staging/org/eclipse/tycho/sisu-equinox-embedder/0.18.1/sisu-equinox-embedder-0.18.1.jar
Downloading: https://repo.eclipse.org/content/repositories/eclipse-staging/org/eclipse/tycho/sisu-equinox-api/0.18.1/sisu-equinox-api-0.18.1.jar
Downloading: https://repo.eclipse.org/content/repositories/eclipse-staging/org/eclipse/tycho/tycho-metadata-model/0.18.1/tycho-metadata-model-0.18.1.jar
Downloading: https://repo.eclipse.org/content/repositories/eclipse-staging/org/eclipse/tycho/tycho-embedder-api/0.18.1/tycho-embedder-api-0.18.1.jar
Downloading: https://repo.eclipse.org/content/repositories/eclipse-staging/org/eclipse/tycho/org.eclipse.tycho.embedder.shared/0.18.1/org.eclipse.tycho.embedder.shared-0.18.1.jar
Downloading: https://repo.eclipse.org/content/repositories/eclipse-staging/org/eclipse/tycho/org.eclipse.tycho.core.shared/0.18.1/org.eclipse.tycho.core.shared-0.18.1.jar
Downloading: https://repo.eclipse.org/content/repositories/eclipse-staging/org/eclipse/tycho/tycho-p2-facade/0.18.1/tycho-p2-facade-0.18.1.jar
Downloading: https://repo.eclipse.org/content/repositories/eclipse-staging/org/eclipse/tycho/org.eclipse.tycho.p2.resolver.shared/0.18.1/org.eclipse.tycho.p2.resolver.shared-0.18.1.jar
Downloading: https://repo.eclipse.org/content/repositories/eclipse-staging/org/eclipse/tycho/org.eclipse.tycho.p2.tools.shared/0.18.1/org.eclipse.tycho.p2.tools.shared-0.18.1.jar
Downloading: http://repo1.maven.org/maven2/org/eclipse/tycho/tycho-maven-plugin/0.18.1/tycho-maven-plugin-0.18.1.jar
Downloading: http://repo1.maven.org/maven2/org/eclipse/tycho/tycho-core/0.18.1/tycho-core-0.18.1.jar
Downloading: http://repo1.maven.org/maven2/org/eclipse/tycho/org.eclipse.osgi/3.9.0.v20130529-1710/org.eclipse.osgi-3.9.0.v20130529-1710.jar
Downloading: http://repo1.maven.org/maven2/org/eclipse/tycho/sisu-equinox-embedder/0.18.1/sisu-equinox-embedder-0.18.1.jar
Downloading: http://repo1.maven.org/maven2/org/eclipse/tycho/sisu-equinox-api/0.18.1/sisu-equinox-api-0.18.1.jar
Downloaded: http://repo1.maven.org/maven2/org/eclipse/tycho/tycho-maven-plugin/0.18.1/tycho-maven-plugin-0.18.1.jar (5 KB at 47.2 KB/sec)
Downloading: http://repo1.maven.org/maven2/org/eclipse/tycho/tycho-metadata-model/0.18.1/tycho-metadata-model-0.18.1.jar
Downloaded: http://repo1.maven.org/maven2/org/eclipse/tycho/sisu-equinox-embedder/0.18.1/sisu-equinox-embedder-0.18.1.jar (13 KB at 122.1 KB/sec)
Downloading: http://repo1.maven.org/maven2/org/eclipse/tycho/tycho-embedder-api/0.18.1/tycho-embedder-api-0.18.1.jar
Downloaded: http://repo1.maven.org/maven2/org/eclipse/tycho/sisu-equinox-api/0.18.1/sisu-equinox-api-0.18.1.jar (4 KB at 29.2 KB/sec)
Downloading: http://repo1.maven.org/maven2/org/eclipse/tycho/org.eclipse.tycho.embedder.shared/0.18.1/org.eclipse.tycho.embedder.shared-0.18.1.jar
Downloaded: http://repo1.maven.org/maven2/org/eclipse/tycho/org.eclipse.tycho.embedder.shared/0.18.1/org.eclipse.tycho.embedder.shared-0.18.1.jar (7 KB at 62.6 KB/sec)
Downloading: http://repo1.maven.org/maven2/org/eclipse/tycho/org.eclipse.tycho.core.shared/0.18.1/org.eclipse.tycho.core.shared-0.18.1.jar
Downloaded: http://repo1.maven.org/maven2/org/eclipse/tycho/tycho-core/0.18.1/tycho-core-0.18.1.jar (178 KB at 789.0 KB/sec)
Downloading: http://repo1.maven.org/maven2/org/eclipse/tycho/tycho-p2-facade/0.18.1/tycho-p2-facade-0.18.1.jar
Downloaded: http://repo1.maven.org/maven2/org/eclipse/tycho/tycho-embedder-api/0.18.1/tycho-embedder-api-0.18.1.jar (7 KB at 56.3 KB/sec)
Downloading: http://repo1.maven.org/maven2/org/eclipse/tycho/org.eclipse.tycho.p2.resolver.shared/0.18.1/org.eclipse.tycho.p2.resolver.shared-0.18.1.jar
Downloaded: http://repo1.maven.org/maven2/org/eclipse/tycho/tycho-metadata-model/0.18.1/tycho-metadata-model-0.18.1.jar (29 KB at 219.6 KB/sec)
Downloading: http://repo1.maven.org/maven2/org/eclipse/tycho/org.eclipse.tycho.p2.tools.shared/0.18.1/org.eclipse.tycho.p2.tools.shared-0.18.1.jar
Downloaded: http://repo1.maven.org/maven2/org/eclipse/tycho/org.eclipse.tycho.core.shared/0.18.1/org.eclipse.tycho.core.shared-0.18.1.jar (30 KB at 239.5 KB/sec)
Downloaded: http://repo1.maven.org/maven2/org/eclipse/tycho/org.eclipse.tycho.p2.resolver.shared/0.18.1/org.eclipse.tycho.p2.resolver.shared-0.18.1.jar (25 KB at 200.5 KB/sec)
Downloaded: http://repo1.maven.org/maven2/org/eclipse/tycho/org.eclipse.tycho.p2.tools.shared/0.18.1/org.eclipse.tycho.p2.tools.shared-0.18.1.jar (20 KB at 156.0 KB/sec)
Downloaded: http://repo1.maven.org/maven2/org/eclipse/tycho/tycho-p2-facade/0.18.1/tycho-p2-facade-0.18.1.jar (33 KB at 223.5 KB/sec)
Downloaded: http://repo1.maven.org/maven2/org/eclipse/tycho/org.eclipse.osgi/3.9.0.v20130529-1710/org.eclipse.osgi-3.9.0.v20130529-1710.jar (1358 KB at 3303.5 KB/sec)
Downloading: https://repo.eclipse.org/content/groups/releases/org/apache/maven/wagon/wagon-ftp/1.0-beta-6/wagon-ftp-1.0-beta-6.pom
Downloading: https://repo.eclipse.org/content/groups/snapshots/org/apache/maven/wagon/wagon-ftp/1.0-beta-6/wagon-ftp-1.0-beta-6.pom
Downloading: https://repo.eclipse.org/content/repositories/releases/org/apache/maven/wagon/wagon-ftp/1.0-beta-6/wagon-ftp-1.0-beta-6.pom
Downloading: https://repo.eclipse.org/content/repositories/eclipse-staging/org/apache/maven/wagon/wagon-ftp/1.0-beta-6/wagon-ftp-1.0-beta-6.pom
Downloading: http://repo1.maven.org/maven2/org/apache/maven/wagon/wagon-ftp/1.0-beta-6/wagon-ftp-1.0-beta-6.pom
Downloaded: http://repo1.maven.org/maven2/org/apache/maven/wagon/wagon-ftp/1.0-beta-6/wagon-ftp-1.0-beta-6.pom (3 KB at 25.1 KB/sec)
Downloading: https://repo.eclipse.org/content/groups/releases/org/apache/maven/wagon/wagon-providers/1.0-beta-6/wagon-providers-1.0-beta-6.pom
Downloading: https://repo.eclipse.org/content/groups/snapshots/org/apache/maven/wagon/wagon-providers/1.0-beta-6/wagon-providers-1.0-beta-6.pom
Downloading: https://repo.eclipse.org/content/repositories/releases/org/apache/maven/wagon/wagon-providers/1.0-beta-6/wagon-providers-1.0-beta-6.pom
Downloading: https://repo.eclipse.org/content/repositories/eclipse-staging/org/apache/maven/wagon/wagon-providers/1.0-beta-6/wagon-providers-1.0-beta-6.pom
Downloading: http://repo1.maven.org/maven2/org/apache/maven/wagon/wagon-providers/1.0-beta-6/wagon-providers-1.0-beta-6.pom
Downloaded: http://repo1.maven.org/maven2/org/apache/maven/wagon/wagon-providers/1.0-beta-6/wagon-providers-1.0-beta-6.pom (3 KB at 20.6 KB/sec)
Downloading: https://repo.eclipse.org/content/groups/releases/org/apache/maven/wagon/wagon/1.0-beta-6/wagon-1.0-beta-6.pom
Downloading: https://repo.eclipse.org/content/groups/snapshots/org/apache/maven/wagon/wagon/1.0-beta-6/wagon-1.0-beta-6.pom
Downloading: https://repo.eclipse.org/content/repositories/releases/org/apache/maven/wagon/wagon/1.0-beta-6/wagon-1.0-beta-6.pom
Downloading: https://repo.eclipse.org/content/repositories/eclipse-staging/org/apache/maven/wagon/wagon/1.0-beta-6/wagon-1.0-beta-6.pom
Downloading: http://repo1.maven.org/maven2/org/apache/maven/wagon/wagon/1.0-beta-6/wagon-1.0-beta-6.pom
Downloaded: http://repo1.maven.org/maven2/org/apache/maven/wagon/wagon/1.0-beta-6/wagon-1.0-beta-6.pom (13 KB at 121.0 KB/sec)
Downloading: https://repo.eclipse.org/content/groups/releases/commons-net/commons-net/2.0/commons-net-2.0.pom
Downloading: https://repo.eclipse.org/content/groups/snapshots/commons-net/commons-net/2.0/commons-net-2.0.pom
Downloading: https://repo.eclipse.org/content/repositories/releases/commons-net/commons-net/2.0/commons-net-2.0.pom
Downloading: https://repo.eclipse.org/content/repositories/eclipse-staging/commons-net/commons-net/2.0/commons-net-2.0.pom
Downloading: http://repo1.maven.org/maven2/commons-net/commons-net/2.0/commons-net-2.0.pom
Downloaded: http://repo1.maven.org/maven2/commons-net/commons-net/2.0/commons-net-2.0.pom (8 KB at 74.7 KB/sec)
Downloading: https://repo.eclipse.org/content/groups/releases/org/apache/commons/commons-parent/11/commons-parent-11.pom
Downloading: https://repo.eclipse.org/content/groups/snapshots/org/apache/commons/commons-parent/11/commons-parent-11.pom
Downloading: https://repo.eclipse.org/content/repositories/releases/org/apache/commons/commons-parent/11/commons-parent-11.pom
Downloading: https://repo.eclipse.org/content/repositories/eclipse-staging/org/apache/commons/commons-parent/11/commons-parent-11.pom
Downloading: http://repo1.maven.org/maven2/org/apache/commons/commons-parent/11/commons-parent-11.pom
Downloaded: http://repo1.maven.org/maven2/org/apache/commons/commons-parent/11/commons-parent-11.pom (25 KB at 198.9 KB/sec)
Downloading: https://repo.eclipse.org/content/groups/releases/org/apache/maven/wagon/wagon-provider-api/1.0-beta-6/wagon-provider-api-1.0-beta-6.pom
Downloading: https://repo.eclipse.org/content/groups/snapshots/org/apache/maven/wagon/wagon-provider-api/1.0-beta-6/wagon-provider-api-1.0-beta-6.pom
Downloading: https://repo.eclipse.org/content/repositories/releases/org/apache/maven/wagon/wagon-provider-api/1.0-beta-6/wagon-provider-api-1.0-beta-6.pom
Downloading: https://repo.eclipse.org/content/repositories/eclipse-staging/org/apache/maven/wagon/wagon-provider-api/1.0-beta-6/wagon-provider-api-1.0-beta-6.pom
Downloading: http://repo1.maven.org/maven2/org/apache/maven/wagon/wagon-provider-api/1.0-beta-6/wagon-provider-api-1.0-beta-6.pom
Downloaded: http://repo1.maven.org/maven2/org/apache/maven/wagon/wagon-provider-api/1.0-beta-6/wagon-provider-api-1.0-beta-6.pom (2 KB at 17.2 KB/sec)
Downloading: https://repo.eclipse.org/content/groups/releases/org/codehaus/plexus/plexus-utils/1.4.2/plexus-utils-1.4.2.pom
Downloading: https://repo.eclipse.org/content/groups/snapshots/org/codehaus/plexus/plexus-utils/1.4.2/plexus-utils-1.4.2.pom
Downloading: https://repo.eclipse.org/content/repositories/releases/org/codehaus/plexus/plexus-utils/1.4.2/plexus-utils-1.4.2.pom
Downloading: https://repo.eclipse.org/content/repositories/eclipse-staging/org/codehaus/plexus/plexus-utils/1.4.2/plexus-utils-1.4.2.pom
Downloading: http://repo1.maven.org/maven2/org/codehaus/plexus/plexus-utils/1.4.2/plexus-utils-1.4.2.pom
Downloaded: http://repo1.maven.org/maven2/org/codehaus/plexus/plexus-utils/1.4.2/plexus-utils-1.4.2.pom (2 KB at 15.7 KB/sec)
Downloading: https://repo.eclipse.org/content/groups/releases/org/apache/maven/wagon/wagon-ftp/1.0-beta-6/wagon-ftp-1.0-beta-6.jar
Downloading: https://repo.eclipse.org/content/groups/releases/commons-net/commons-net/2.0/commons-net-2.0.jar
Downloading: https://repo.eclipse.org/content/groups/releases/org/codehaus/plexus/plexus-utils/1.4.2/plexus-utils-1.4.2.jar
Downloading: https://repo.eclipse.org/content/groups/snapshots/org/apache/maven/wagon/wagon-ftp/1.0-beta-6/wagon-ftp-1.0-beta-6.jar
Downloading: https://repo.eclipse.org/content/groups/snapshots/commons-net/commons-net/2.0/commons-net-2.0.jar
Downloading: https://repo.eclipse.org/content/groups/snapshots/org/codehaus/plexus/plexus-utils/1.4.2/plexus-utils-1.4.2.jar
Downloading: https://repo.eclipse.org/content/repositories/releases/org/apache/maven/wagon/wagon-ftp/1.0-beta-6/wagon-ftp-1.0-beta-6.jar
Downloading: https://repo.eclipse.org/content/repositories/releases/commons-net/commons-net/2.0/commons-net-2.0.jar
Downloading: https://repo.eclipse.org/content/repositories/releases/org/codehaus/plexus/plexus-utils/1.4.2/plexus-utils-1.4.2.jar
Downloading: https://repo.eclipse.org/content/repositories/eclipse-staging/org/apache/maven/wagon/wagon-ftp/1.0-beta-6/wagon-ftp-1.0-beta-6.jar
Downloading: https://repo.eclipse.org/content/repositories/eclipse-staging/commons-net/commons-net/2.0/commons-net-2.0.jar
Downloading: https://repo.eclipse.org/content/repositories/eclipse-staging/org/codehaus/plexus/plexus-utils/1.4.2/plexus-utils-1.4.2.jar
Downloading: http://repo1.maven.org/maven2/org/apache/maven/wagon/wagon-ftp/1.0-beta-6/wagon-ftp-1.0-beta-6.jar
Downloading: http://repo1.maven.org/maven2/commons-net/commons-net/2.0/commons-net-2.0.jar
Downloading: http://repo1.maven.org/maven2/org/codehaus/plexus/plexus-utils/1.4.2/plexus-utils-1.4.2.jar
Downloaded: http://repo1.maven.org/maven2/org/apache/maven/wagon/wagon-ftp/1.0-beta-6/wagon-ftp-1.0-beta-6.jar (15 KB at 120.0 KB/sec)
Downloaded: http://repo1.maven.org/maven2/commons-net/commons-net/2.0/commons-net-2.0.jar (193 KB at 874.8 KB/sec)
Downloaded: http://repo1.maven.org/maven2/org/codehaus/plexus/plexus-utils/1.4.2/plexus-utils-1.4.2.jar (186 KB at 829.7 KB/sec)
[ERROR] Several versions of tycho plugins are configured [0.18.1, 0.19.0]:
[ERROR] 0.18.1:
[ERROR] 	MavenProject: org.eclipse.scout:org.eclipse.scout.target:3.9.1-SNAPSHOT @ /jobs/genie.technology.scout/scout-release/workspace/org.eclipse.scout-aggregator/org.eclipse.scout.rt/org.eclipse.scout.target/pom.xml
[ERROR] 	MavenProject: org.eclipse.scout.rt:org.apache.derby.jdbc_1091.fragment:10.9.1-SNAPSHOT @ /jobs/genie.technology.scout/scout-release/workspace/org.eclipse.scout-aggregator/org.eclipse.scout.rt/org.apache.derby.jdbc_1091.fragment/pom.xml
[ERROR] 	MavenProject: org.eclipse.scout.rt:org.eclipse.scout.commons:3.9.1-SNAPSHOT @ /jobs/genie.technology.scout/scout-release/workspace/org.eclipse.scout-aggregator/org.eclipse.scout.rt/org.eclipse.scout.commons/pom.xml
[ERROR] 	MavenProject: org.eclipse.scout.rt:org.eclipse.scout.service:3.9.1-SNAPSHOT @ /jobs/genie.technology.scout/scout-release/workspace/org.eclipse.scout-aggregator/org.eclipse.scout.rt/org.eclipse.scout.service/pom.xml
[ERROR] 	MavenProject: org.eclipse.scout.rt:org.eclipse.scout.http.servletfilter:3.9.1-SNAPSHOT @ /jobs/genie.technology.scout/scout-release/workspace/org.eclipse.scout-aggregator/org.eclipse.scout.rt/org.eclipse.scout.http.servletfilter/pom.xml
[ERROR] 	MavenProject: org.eclipse.scout.rt:org.eclipse.scout.jaxws216:2.1.6-SNAPSHOT @ /jobs/genie.technology.scout/scout-release/workspace/org.eclipse.scout-aggregator/org.eclipse.scout.rt/org.eclipse.scout.jaxws216/pom.xml
[ERROR] 	MavenProject: org.eclipse.scout.rt:org.eclipse.scout.net:3.9.1-SNAPSHOT @ /jobs/genie.technology.scout/scout-release/workspace/org.eclipse.scout-aggregator/org.eclipse.scout.rt/org.eclipse.scout.net/pom.xml
[ERROR] 	MavenProject: org.eclipse.scout.rt:org.eclipse.scout.rt.shared:3.9.1-SNAPSHOT @ /jobs/genie.technology.scout/scout-release/workspace/org.eclipse.scout-aggregator/org.eclipse.scout.rt/org.eclipse.scout.rt.shared/pom.xml
[ERROR] 	MavenProject: org.eclipse.scout.rt:org.eclipse.scout.rt.shared.legacy.texts.fragment:3.9.1-SNAPSHOT @ /jobs/genie.technology.scout/scout-release/workspace/org.eclipse.scout-aggregator/org.eclipse.scout.rt/org.eclipse.scout.rt.shared.legacy.texts.fragment/pom.xml
[ERROR] 	MavenProject: org.eclipse.scout.rt:org.eclipse.scout.rt.client:3.9.1-SNAPSHOT @ /jobs/genie.technology.scout/scout-release/workspace/org.eclipse.scout-aggregator/org.eclipse.scout.rt/org.eclipse.scout.rt.client/pom.xml
[ERROR] 	MavenProject: org.eclipse.scout.rt:org.eclipse.scout.rt.client.mobile:3.9.1-SNAPSHOT @ /jobs/genie.technology.scout/scout-release/workspace/org.eclipse.scout-aggregator/org.eclipse.scout.rt/org.eclipse.scout.rt.client.mobile/pom.xml
[ERROR] 	MavenProject: org.eclipse.scout.rt:org.eclipse.scout.rt.extension.client:3.9.1-SNAPSHOT @ /jobs/genie.technology.scout/scout-release/workspace/org.eclipse.scout-aggregator/org.eclipse.scout.rt/org.eclipse.scout.rt.extension.client/pom.xml
[ERROR] 	MavenProject: org.eclipse.scout.rt:org.eclipse.scout.svg.client:3.9.1-SNAPSHOT @ /jobs/genie.technology.scout/scout-release/workspace/org.eclipse.scout-aggregator/org.eclipse.scout.rt/org.eclipse.scout.svg.client/pom.xml
[ERROR] 	MavenProject: org.eclipse.scout.rt.feature:org.eclipse.scout.rt.client:3.9.1-SNAPSHOT @ /jobs/genie.technology.scout/scout-release/workspace/org.eclipse.scout-aggregator/org.eclipse.scout.rt/org.eclipse.scout.rt.client-feature/pom.xml
[ERROR] 	MavenProject: org.eclipse.scout.rt:org.eclipse.scout.rt.server:3.9.1-SNAPSHOT @ /jobs/genie.technology.scout/scout-release/workspace/org.eclipse.scout-aggregator/org.eclipse.scout.rt/org.eclipse.scout.rt.server/pom.xml
[ERROR] 	MavenProject: org.eclipse.scout.rt:org.eclipse.scout.rt.jdbc.derby:10.5.3-SNAPSHOT @ /jobs/genie.technology.scout/scout-release/workspace/org.eclipse.scout-aggregator/org.eclipse.scout.rt/org.eclipse.scout.rt.jdbc.derby/pom.xml
[ERROR] 	MavenProject: org.eclipse.scout.rt:org.eclipse.scout.rt.ui.swing:3.9.1-SNAPSHOT @ /jobs/genie.technology.scout/scout-release/workspace/org.eclipse.scout-aggregator/org.eclipse.scout.rt/org.eclipse.scout.rt.ui.swing/pom.xml
[ERROR] 	MavenProject: org.eclipse.scout.rt:org.eclipse.scout.rt.ui.swing.browser.swt.fragment:3.9.1-SNAPSHOT @ /jobs/genie.technology.scout/scout-release/workspace/org.eclipse.scout-aggregator/org.eclipse.scout.rt/org.eclipse.scout.rt.ui.swing.browser.swt.fragment/pom.xml
[ERROR] 	MavenProject: org.eclipse.scout.rt:org.eclipse.scout.svg.ui.swing:3.9.1-SNAPSHOT @ /jobs/genie.technology.scout/scout-release/workspace/org.eclipse.scout-aggregator/org.eclipse.scout.rt/org.eclipse.scout.svg.ui.swing/pom.xml
[ERROR] 	MavenProject: org.eclipse.scout.rt.feature:org.eclipse.scout.rt.swing:3.9.1-SNAPSHOT @ /jobs/genie.technology.scout/scout-release/workspace/org.eclipse.scout-aggregator/org.eclipse.scout.rt/org.eclipse.scout.rt.swing-feature/pom.xml
[ERROR] 	MavenProject: org.eclipse.scout.rt:org.eclipse.scout.rt.ui.swt:3.9.1-SNAPSHOT @ /jobs/genie.technology.scout/scout-release/workspace/org.eclipse.scout-aggregator/org.eclipse.scout.rt/org.eclipse.scout.rt.ui.swt/pom.xml
[ERROR] 	MavenProject: org.eclipse.scout.rt:org.eclipse.scout.svg.ui.swt:3.9.1-SNAPSHOT @ /jobs/genie.technology.scout/scout-release/workspace/org.eclipse.scout-aggregator/org.eclipse.scout.rt/org.eclipse.scout.svg.ui.swt/pom.xml
[ERROR] 	MavenProject: org.eclipse.scout.rt.feature:org.eclipse.scout.rt.swt:3.9.1-SNAPSHOT @ /jobs/genie.technology.scout/scout-release/workspace/org.eclipse.scout-aggregator/org.eclipse.scout.rt/org.eclipse.scout.rt.swt-feature/pom.xml
[ERROR] 	MavenProject: org.eclipse.scout.rt:org.eclipse.scout.rt.ui.svg.calendar:3.9.1-SNAPSHOT @ /jobs/genie.technology.scout/scout-release/workspace/org.eclipse.scout-aggregator/org.eclipse.scout.rt/org.eclipse.scout.rt.ui.svg.calendar/pom.xml
[ERROR] 	MavenProject: org.eclipse.scout.rt:org.eclipse.scout.rt.feature.about:3.9.1-SNAPSHOT @ /jobs/genie.technology.scout/scout-release/workspace/org.eclipse.scout-aggregator/org.eclipse.scout.rt/org.eclipse.scout.rt.feature.about/pom.xml
[ERROR] 	MavenProject: org.eclipse.scout.rt.feature:org.eclipse.scout.rt.core:3.9.1-SNAPSHOT @ /jobs/genie.technology.scout/scout-release/workspace/org.eclipse.scout-aggregator/org.eclipse.scout.rt/org.eclipse.scout.rt.core-feature/pom.xml
[ERROR] 	MavenProject: org.eclipse.scout.rt.feature:org.eclipse.scout.rt:3.9.1-SNAPSHOT @ /jobs/genie.technology.scout/scout-release/workspace/org.eclipse.scout-aggregator/org.eclipse.scout.rt/org.eclipse.scout.rt-feature/pom.xml
[ERROR] 	MavenProject: org.eclipse.scout.rt:org.eclipse.scout.rt.ui.rap:3.9.1-SNAPSHOT @ /jobs/genie.technology.scout/scout-release/workspace/org.eclipse.scout-aggregator/org.eclipse.scout.rt/org.eclipse.scout.rt.ui.rap/pom.xml
[ERROR] 	MavenProject: org.eclipse.scout.rt:org.eclipse.scout.rt.ui.rap.workbench:3.9.1-SNAPSHOT @ /jobs/genie.technology.scout/scout-release/workspace/org.eclipse.scout-aggregator/org.eclipse.scout.rt/org.eclipse.scout.rt.ui.rap.workbench/pom.xml
[ERROR] 	MavenProject: org.eclipse.scout.rt:org.eclipse.scout.rt.ui.rap.mobile:3.9.1-SNAPSHOT @ /jobs/genie.technology.scout/scout-release/workspace/org.eclipse.scout-aggregator/org.eclipse.scout.rt/org.eclipse.scout.rt.ui.rap.mobile/pom.xml
[ERROR] 	MavenProject: org.eclipse.scout.rt:org.eclipse.scout.rt.ui.rap.theme.rayo:3.9.1-SNAPSHOT @ /jobs/genie.technology.scout/scout-release/workspace/org.eclipse.scout-aggregator/org.eclipse.scout.rt/org.eclipse.scout.rt.ui.rap.theme.rayo/pom.xml
[ERROR] 	MavenProject: org.eclipse.scout.rt:org.eclipse.scout.rt.ui.rap.theme.rayo.mobile:3.9.1-SNAPSHOT @ /jobs/genie.technology.scout/scout-release/workspace/org.eclipse.scout-aggregator/org.eclipse.scout.rt/org.eclipse.scout.rt.ui.rap.theme.rayo.mobile/pom.xml
[ERROR] 	MavenProject: org.eclipse.scout.rt:org.eclipse.scout.svg.ui.rap:3.9.1-SNAPSHOT @ /jobs/genie.technology.scout/scout-release/workspace/org.eclipse.scout-aggregator/org.eclipse.scout.rt/org.eclipse.scout.svg.ui.rap/pom.xml
[ERROR] 	MavenProject: org.eclipse.scout.rt.feature:org.eclipse.scout.rt.rap:3.9.1-SNAPSHOT @ /jobs/genie.technology.scout/scout-release/workspace/org.eclipse.scout-aggregator/org.eclipse.scout.rt/org.eclipse.scout.rt.rap-feature/pom.xml
[ERROR] 	MavenProject: org.eclipse.scout.rt.feature:org.eclipse.scout.rt.rap.basic.target:3.9.1-SNAPSHOT @ /jobs/genie.technology.scout/scout-release/workspace/org.eclipse.scout-aggregator/org.eclipse.scout.rt/org.eclipse.scout.rt.rap.basic.target-feature/pom.xml
[ERROR] 	MavenProject: org.eclipse.scout.rt:org.eclipse.scout.commons.test:3.9.1-SNAPSHOT @ /jobs/genie.technology.scout/scout-release/workspace/org.eclipse.scout-aggregator/org.eclipse.scout.rt/org.eclipse.scout.commons.test/pom.xml
[ERROR] 	MavenProject: org.eclipse.scout.rt:org.eclipse.scout.jaxws216.test:3.9.1-SNAPSHOT @ /jobs/genie.technology.scout/scout-release/workspace/org.eclipse.scout-aggregator/org.eclipse.scout.rt/org.eclipse.scout.jaxws216.test/pom.xml
[ERROR] 	MavenProject: org.eclipse.scout.rt:org.eclipse.scout.rt.client.test:3.9.1-SNAPSHOT @ /jobs/genie.technology.scout/scout-release/workspace/org.eclipse.scout-aggregator/org.eclipse.scout.rt/org.eclipse.scout.rt.client.test/pom.xml
[ERROR] 	MavenProject: org.eclipse.scout.rt:org.eclipse.scout.rt.client.testenvironment:3.9.1-SNAPSHOT @ /jobs/genie.technology.scout/scout-release/workspace/org.eclipse.scout-aggregator/org.eclipse.scout.rt/org.eclipse.scout.rt.client.testenvironment/pom.xml
[ERROR] 	MavenProject: org.eclipse.scout.rt:org.eclipse.scout.rt.extension.client.test:3.9.1-SNAPSHOT @ /jobs/genie.technology.scout/scout-release/workspace/org.eclipse.scout-aggregator/org.eclipse.scout.rt/org.eclipse.scout.rt.extension.client.test/pom.xml
[ERROR] 	MavenProject: org.eclipse.scout.rt.feature:org.eclipse.scout.rt.rap.testing:3.9.1-SNAPSHOT @ /jobs/genie.technology.scout/scout-release/workspace/org.eclipse.scout-aggregator/org.eclipse.scout.rt/org.eclipse.scout.rt.rap.testing-feature/pom.xml
[ERROR] 	MavenProject: org.eclipse.scout.rt:org.eclipse.scout.rt.server.test:3.9.1-SNAPSHOT @ /jobs/genie.technology.scout/scout-release/workspace/org.eclipse.scout-aggregator/org.eclipse.scout.rt/org.eclipse.scout.rt.server.test/pom.xml
[ERROR] 	MavenProject: org.eclipse.scout.rt:org.eclipse.scout.rt.server.testenvironment:3.9.1-SNAPSHOT @ /jobs/genie.technology.scout/scout-release/workspace/org.eclipse.scout-aggregator/org.eclipse.scout.rt/org.eclipse.scout.rt.server.testenvironment/pom.xml
[ERROR] 	MavenProject: org.eclipse.scout.rt:org.eclipse.scout.rt.shared.test:3.9.1-SNAPSHOT @ /jobs/genie.technology.scout/scout-release/workspace/org.eclipse.scout-aggregator/org.eclipse.scout.rt/org.eclipse.scout.rt.shared.test/pom.xml
[ERROR] 	MavenProject: org.eclipse.scout.rt:org.eclipse.scout.rt.ui.rap.test:3.9.1-SNAPSHOT @ /jobs/genie.technology.scout/scout-release/workspace/org.eclipse.scout-aggregator/org.eclipse.scout.rt/org.eclipse.scout.rt.ui.rap.test/pom.xml
[ERROR] 	MavenProject: org.eclipse.scout.rt:org.eclipse.scout.rt.ui.swing.test:3.9.1-SNAPSHOT @ /jobs/genie.technology.scout/scout-release/workspace/org.eclipse.scout-aggregator/org.eclipse.scout.rt/org.eclipse.scout.rt.ui.swing.test/pom.xml
[ERROR] 	MavenProject: org.eclipse.scout.rt:org.eclipse.scout.rt.ui.swt.test:3.9.1-SNAPSHOT @ /jobs/genie.technology.scout/scout-release/workspace/org.eclipse.scout-aggregator/org.eclipse.scout.rt/org.eclipse.scout.rt.ui.swt.test/pom.xml
[ERROR] 	MavenProject: org.eclipse.scout.rt:org.eclipse.scout.service.test:3.9.1-SNAPSHOT @ /jobs/genie.technology.scout/scout-release/workspace/org.eclipse.scout-aggregator/org.eclipse.scout.rt/org.eclipse.scout.service.test/pom.xml
[ERROR] 	MavenProject: org.eclipse.scout.rt.feature:org.eclipse.scout.rt.testing:3.9.1-SNAPSHOT @ /jobs/genie.technology.scout/scout-release/workspace/org.eclipse.scout-aggregator/org.eclipse.scout.rt/org.eclipse.scout.rt.testing-feature/pom.xml
[ERROR] 	MavenProject: org.eclipse.scout.rt:org.eclipse.scout.rt.testing.client:3.9.1-SNAPSHOT @ /jobs/genie.technology.scout/scout-release/workspace/org.eclipse.scout-aggregator/org.eclipse.scout.rt/org.eclipse.scout.rt.testing.client/pom.xml
[ERROR] 	MavenProject: org.eclipse.scout.rt:org.eclipse.scout.rt.testing.client.test:3.9.1-SNAPSHOT @ /jobs/genie.technology.scout/scout-release/workspace/org.eclipse.scout-aggregator/org.eclipse.scout.rt/org.eclipse.scout.rt.testing.client.test/pom.xml
[ERROR] 	MavenProject: org.eclipse.scout.rt:org.eclipse.scout.rt.testing.common.ant.optional.junit.fragment:3.9.1-SNAPSHOT @ /jobs/genie.technology.scout/scout-release/workspace/org.eclipse.scout-aggregator/org.eclipse.scout.rt/org.eclipse.scout.rt.testing.common.ant.optional.junit.fragment/pom.xml
[ERROR] 	MavenProject: org.eclipse.scout.rt:org.eclipse.scout.rt.testing.commons:3.9.1-SNAPSHOT @ /jobs/genie.technology.scout/scout-release/workspace/org.eclipse.scout-aggregator/org.eclipse.scout.rt/org.eclipse.scout.rt.testing.commons/pom.xml
[ERROR] 	MavenProject: org.eclipse.scout.rt:org.eclipse.scout.rt.testing.server:3.9.1-SNAPSHOT @ /jobs/genie.technology.scout/scout-release/workspace/org.eclipse.scout-aggregator/org.eclipse.scout.rt/org.eclipse.scout.rt.testing.server/pom.xml
[ERROR] 	MavenProject: org.eclipse.scout.rt:org.eclipse.scout.rt.testing.server.test:3.9.1-SNAPSHOT @ /jobs/genie.technology.scout/scout-release/workspace/org.eclipse.scout-aggregator/org.eclipse.scout.rt/org.eclipse.scout.rt.testing.server.test/pom.xml
[ERROR] 	MavenProject: org.eclipse.scout.rt:org.eclipse.scout.rt.testing.shared:3.9.1-SNAPSHOT @ /jobs/genie.technology.scout/scout-release/workspace/org.eclipse.scout-aggregator/org.eclipse.scout.rt/org.eclipse.scout.rt.testing.shared/pom.xml
[ERROR] 	MavenProject: org.eclipse.scout.rt:org.eclipse.scout.rt.testing.shared.test:3.9.1-SNAPSHOT @ /jobs/genie.technology.scout/scout-release/workspace/org.eclipse.scout-aggregator/org.eclipse.scout.rt/org.eclipse.scout.rt.testing.shared.test/pom.xml
[ERROR] 	MavenProject: org.eclipse.scout.rt:org.eclipse.scout.rt.testing.ui.rap:3.9.1-SNAPSHOT @ /jobs/genie.technology.scout/scout-release/workspace/org.eclipse.scout-aggregator/org.eclipse.scout.rt/org.eclipse.scout.rt.testing.ui.rap/pom.xml
[ERROR] 	MavenProject: org.eclipse.scout.rt:org.eclipse.scout.rt.testing.ui.swing:3.9.1-SNAPSHOT @ /jobs/genie.technology.scout/scout-release/workspace/org.eclipse.scout-aggregator/org.eclipse.scout.rt/org.eclipse.scout.rt.testing.ui.swing/pom.xml
[ERROR] 	MavenProject: org.eclipse.scout.rt:org.eclipse.scout.rt.testing.ui.swt:3.9.1-SNAPSHOT @ /jobs/genie.technology.scout/scout-release/workspace/org.eclipse.scout-aggregator/org.eclipse.scout.rt/org.eclipse.scout.rt.testing.ui.swt/pom.xml
[ERROR] 	MavenProject: org.eclipse.scout.rt.feature:org.eclipse.scout.rt.testing.core:3.9.1-SNAPSHOT @ /jobs/genie.technology.scout/scout-release/workspace/org.eclipse.scout-aggregator/org.eclipse.scout.rt/org.eclipse.scout.rt.testing.core-feature/pom.xml
[ERROR] 	MavenProject: org.eclipse.scout.rt.feature:org.eclipse.scout.rt.testing.swing:3.9.1-SNAPSHOT @ /jobs/genie.technology.scout/scout-release/workspace/org.eclipse.scout-aggregator/org.eclipse.scout.rt/org.eclipse.scout.rt.testing.swing-feature/pom.xml
[ERROR] 	MavenProject: org.eclipse.scout.rt.feature:org.eclipse.scout.rt.testing.swt:3.9.1-SNAPSHOT @ /jobs/genie.technology.scout/scout-release/workspace/org.eclipse.scout-aggregator/org.eclipse.scout.rt/org.eclipse.scout.rt.testing.swt-feature/pom.xml
[ERROR] 	MavenProject: org.eclipse.scout.rt:org.eclipse.scout.rt-repository:3.9.1-SNAPSHOT @ /jobs/genie.technology.scout/scout-release/workspace/org.eclipse.scout-aggregator/org.eclipse.scout.rt/org.eclipse.scout.rt-repository/pom.xml
[ERROR] 	MavenProject: org.eclipse.scout.rt:org.eclipse.scout.rt.rap-repository:3.9.1-SNAPSHOT @ /jobs/genie.technology.scout/scout-release/workspace/org.eclipse.scout-aggregator/org.eclipse.scout.rt/org.eclipse.scout.rt.rap-repository/pom.xml
[ERROR] 	MavenProject: org.eclipse.scout.rt:org.eclipse.scout.rt.parent:3.9.1-SNAPSHOT @ /jobs/genie.technology.scout/scout-release/workspace/org.eclipse.scout-aggregator/org.eclipse.scout.rt/org.eclipse.scout.rt.parent/pom.xml
[ERROR] 	MavenProject: org.eclipse.scout:org.eclipse.scout.rt:3.9.1-SNAPSHOT @ /jobs/genie.technology.scout/scout-release/workspace/org.eclipse.scout-aggregator/org.eclipse.scout.rt/pom.xml
[ERROR] 	MavenProject: org.eclipse.scout.rt.incubator:org.eclipse.scout.rt.ui.rap.incubator.filechooser:3.9.1-SNAPSHOT @ /jobs/genie.technology.scout/scout-release/workspace/org.eclipse.scout-aggregator/org.eclipse.scout.rt.incubator/org.eclipse.scout.rt.ui.rap.incubator.filechooser/pom.xml
[ERROR] 	MavenProject: org.eclipse.scout.rt.feature:org.eclipse.scout.rt.ui.rap.incubator.filechooser:3.9.1-SNAPSHOT @ /jobs/genie.technology.scout/scout-release/workspace/org.eclipse.scout-aggregator/org.eclipse.scout.rt.incubator/org.eclipse.scout.rt.ui.rap.incubator.filechooser-feature/pom.xml
[ERROR] 	MavenProject: org.eclipse.scout.rt.incubator:org.eclipse.scout.rt.ui.rap.incubator.filechooser-repository:3.9.1-SNAPSHOT @ /jobs/genie.technology.scout/scout-release/workspace/org.eclipse.scout-aggregator/org.eclipse.scout.rt.incubator/org.eclipse.scout.rt.ui.rap.incubator.filechooser-repository/pom.xml
[ERROR] 	MavenProject: org.eclipse.scout.rt.incubator:org.eclipse.scout.rt.incubator.parent:3.9.1-SNAPSHOT @ /jobs/genie.technology.scout/scout-release/workspace/org.eclipse.scout-aggregator/org.eclipse.scout.rt.incubator/org.eclipse.scout.rt.incubator.parent/pom.xml
[ERROR] 	MavenProject: org.eclipse.scout:org.eclipse.scout.rt.incubator:3.9.1-SNAPSHOT @ /jobs/genie.technology.scout/scout-release/workspace/org.eclipse.scout-aggregator/org.eclipse.scout.rt.incubator/pom.xml
[ERROR] 	MavenProject: org.eclipse.scout.sdk:org.eclipse.scout.sdk.compatibility:3.9.1-SNAPSHOT @ /jobs/genie.technology.scout/scout-release/workspace/org.eclipse.scout-aggregator/org.eclipse.scout.sdk/org.eclipse.scout.sdk.compatibility/pom.xml
[ERROR] 	MavenProject: org.eclipse.scout.sdk:org.eclipse.scout.sdk.compatibility.v36.fragment:3.9.1-SNAPSHOT @ /jobs/genie.technology.scout/scout-release/workspace/org.eclipse.scout-aggregator/org.eclipse.scout.sdk/org.eclipse.scout.sdk.compatibility.v36.fragment/pom.xml
[ERROR] 	MavenProject: org.eclipse.scout.sdk:org.eclipse.scout.sdk.compatibility.v37v41.fragment:3.9.1-SNAPSHOT @ /jobs/genie.technology.scout/scout-release/workspace/org.eclipse.scout-aggregator/org.eclipse.scout.sdk/org.eclipse.scout.sdk.compatibility.v37v41.fragment/pom.xml
[ERROR] 	MavenProject: org.eclipse.scout.sdk:org.eclipse.scout.sdk.compatibility.v38v42.fragment:3.9.1-SNAPSHOT @ /jobs/genie.technology.scout/scout-release/workspace/org.eclipse.scout-aggregator/org.eclipse.scout.sdk/org.eclipse.scout.sdk.compatibility.v38v42.fragment/pom.xml
[ERROR] 	MavenProject: org.eclipse.scout.sdk:org.eclipse.scout.sdk.compatibility.v43.fragment:3.9.1-SNAPSHOT @ /jobs/genie.technology.scout/scout-release/workspace/org.eclipse.scout-aggregator/org.eclipse.scout.sdk/org.eclipse.scout.sdk.compatibility.v43.fragment/pom.xml
[ERROR] 	MavenProject: org.eclipse.scout.sdk:org.eclipse.scout.sdk.util:3.9.1-SNAPSHOT @ /jobs/genie.technology.scout/scout-release/workspace/org.eclipse.scout-aggregator/org.eclipse.scout.sdk/org.eclipse.scout.sdk.util/pom.xml
[ERROR] 	MavenProject: org.eclipse.scout.sdk:org.eclipse.scout.nls.sdk:3.9.1-SNAPSHOT @ /jobs/genie.technology.scout/scout-release/workspace/org.eclipse.scout-aggregator/org.eclipse.scout.sdk/org.eclipse.scout.nls.sdk/pom.xml
[ERROR] 	MavenProject: org.eclipse.scout.sdk:org.eclipse.scout.nls.sdk.simple:3.9.1-SNAPSHOT @ /jobs/genie.technology.scout/scout-release/workspace/org.eclipse.scout-aggregator/org.eclipse.scout.sdk/org.eclipse.scout.nls.sdk.simple/pom.xml
[ERROR] 	MavenProject: org.eclipse.scout.sdk:org.eclipse.scout.nls.sdk.services:3.9.1-SNAPSHOT @ /jobs/genie.technology.scout/scout-release/workspace/org.eclipse.scout-aggregator/org.eclipse.scout.sdk/org.eclipse.scout.nls.sdk.services/pom.xml
[ERROR] 	MavenProject: org.eclipse.scout.sdk:org.eclipse.scout.sdk:3.9.1-SNAPSHOT @ /jobs/genie.technology.scout/scout-release/workspace/org.eclipse.scout-aggregator/org.eclipse.scout.sdk/org.eclipse.scout.sdk/pom.xml
[ERROR] 	MavenProject: org.eclipse.scout.sdk:org.eclipse.scout.sdk.ui:3.9.1-SNAPSHOT @ /jobs/genie.technology.scout/scout-release/workspace/org.eclipse.scout-aggregator/org.eclipse.scout.sdk/org.eclipse.scout.sdk.ui/pom.xml
[ERROR] 	MavenProject: org.eclipse.scout.sdk:org.eclipse.scout.sdk.debug:3.9.1-SNAPSHOT @ /jobs/genie.technology.scout/scout-release/workspace/org.eclipse.scout-aggregator/org.eclipse.scout.sdk/org.eclipse.scout.sdk.debug/pom.xml
[ERROR] 	MavenProject: org.eclipse.scout.sdk:org.eclipse.scout.sdk.help:3.9.1-SNAPSHOT @ /jobs/genie.technology.scout/scout-release/workspace/org.eclipse.scout-aggregator/org.eclipse.scout.sdk/org.eclipse.scout.sdk.help/pom.xml
[ERROR] 	MavenProject: org.eclipse.scout.sdk:org.eclipse.scout.sdk.ws.jaxws:3.9.1-SNAPSHOT @ /jobs/genie.technology.scout/scout-release/workspace/org.eclipse.scout-aggregator/org.eclipse.scout.sdk/org.eclipse.scout.sdk.ws.jaxws/pom.xml
[ERROR] 	MavenProject: org.eclipse.scout.sdk:org.eclipse.scout.sdk.rap:3.9.1-SNAPSHOT @ /jobs/genie.technology.scout/scout-release/workspace/org.eclipse.scout-aggregator/org.eclipse.scout.sdk/org.eclipse.scout.sdk.rap/pom.xml
[ERROR] 	MavenProject: org.eclipse.scout.sdk:org.eclipse.scout.sdk.rap.ui:3.9.1-SNAPSHOT @ /jobs/genie.technology.scout/scout-release/workspace/org.eclipse.scout-aggregator/org.eclipse.scout.sdk/org.eclipse.scout.sdk.rap.ui/pom.xml
[ERROR] 	MavenProject: org.eclipse.scout.sdk:org.eclipse.scout.sdk.test:3.9.1-SNAPSHOT @ /jobs/genie.technology.scout/scout-release/workspace/org.eclipse.scout-aggregator/org.eclipse.scout.sdk/org.eclipse.scout.sdk.test/pom.xml
[ERROR] 	MavenProject: org.eclipse.scout.sdk.feature:org.eclipse.scout.sdk.test:3.9.1-SNAPSHOT @ /jobs/genie.technology.scout/scout-release/workspace/org.eclipse.scout-aggregator/org.eclipse.scout.sdk/org.eclipse.scout.sdk.test-feature/pom.xml
[ERROR] 	MavenProject: org.eclipse.scout.sdk:org.eclipse.scout.sdk.testing:3.9.1-SNAPSHOT @ /jobs/genie.technology.scout/scout-release/workspace/org.eclipse.scout-aggregator/org.eclipse.scout.sdk/org.eclipse.scout.sdk.testing/pom.xml
[ERROR] 	MavenProject: org.eclipse.scout.sdk.testing.feature:org.eclipse.scout.sdk.testing:3.9.1-SNAPSHOT @ /jobs/genie.technology.scout/scout-release/workspace/org.eclipse.scout-aggregator/org.eclipse.scout.sdk/org.eclipse.scout.sdk.testing-feature/pom.xml
[ERROR] 	MavenProject: org.eclipse.scout.sdk.feature:org.eclipse.scout.sdk:3.9.1-SNAPSHOT @ /jobs/genie.technology.scout/scout-release/workspace/org.eclipse.scout-aggregator/org.eclipse.scout.sdk/org.eclipse.scout.sdk-feature/pom.xml
[ERROR] 	MavenProject: org.eclipse.scout.sdk.rap.feature:org.eclipse.scout.sdk.rap:3.9.1-SNAPSHOT @ /jobs/genie.technology.scout/scout-release/workspace/org.eclipse.scout-aggregator/org.eclipse.scout.sdk/org.eclipse.scout.sdk.rap-feature/pom.xml
[ERROR] 	MavenProject: org.eclipse.scout.sdk:org.eclipse.scout.sdk-repository:3.9.1-SNAPSHOT @ /jobs/genie.technology.scout/scout-release/workspace/org.eclipse.scout-aggregator/org.eclipse.scout.sdk/org.eclipse.scout.sdk-repository/pom.xml
[ERROR] 	MavenProject: org.eclipse.scout.sdk:org.eclipse.scout.sdk.parent:3.9.1-SNAPSHOT @ /jobs/genie.technology.scout/scout-release/workspace/org.eclipse.scout-aggregator/org.eclipse.scout.sdk/org.eclipse.scout.sdk.parent/pom.xml
[ERROR] 	MavenProject: org.eclipse.scout:org.eclipse.scout.sdk:3.9.1-SNAPSHOT @ /jobs/genie.technology.scout/scout-release/workspace/org.eclipse.scout-aggregator/org.eclipse.scout.sdk/pom.xml
[ERROR] 0.19.0:
[ERROR] 	MavenProject: org.eclipse.scout:org.eclipse.scout.parent:3.10.0-SNAPSHOT @ /jobs/genie.technology.scout/scout-release/workspace/org.eclipse.scout-aggregator/org.eclipse.scout.parent/pom.xml
[ERROR] 	MavenProject: org.eclipse.scout:org.eclipse.scout:3.10.0-SNAPSHOT @ /jobs/genie.technology.scout/scout-release/workspace/org.eclipse.scout-aggregator/org.eclipse.scout-feature/pom.xml
[ERROR] 	MavenProject: org.eclipse.scout:org.eclipse.scout.repository:3.10.0-SNAPSHOT @ /jobs/genie.technology.scout/scout-release/workspace/org.eclipse.scout-aggregator/org.eclipse.scout.repository/pom.xml
[ERROR] 	MavenProject: org.eclipse.scout:org.eclipse.scout.rt.rap.target:3.10.0-SNAPSHOT @ /jobs/genie.technology.scout/scout-release/workspace/org.eclipse.scout-aggregator/org.eclipse.scout.rt.rap.target/pom.xml
[ERROR] 	MavenProject: org.eclipse.scout.rt.feature:org.eclipse.scout.rt.rap.target:3.10.0-SNAPSHOT @ /jobs/genie.technology.scout/scout-release/workspace/org.eclipse.scout-aggregator/org.eclipse.scout.rt.rap.target-feature/pom.xml
[ERROR] 	MavenProject: org.eclipse.scout:org.eclipse.scout.rap.repository:3.10.0-SNAPSHOT @ /jobs/genie.technology.scout/scout-release/workspace/org.eclipse.scout-aggregator/org.eclipse.scout.rap.repository/pom.xml
[INFO] o.h.m.e.h.MavenExecutionResultHandler - Build failed with exception(s)
[INFO] o.h.m.e.h.MavenExecutionResultHandler - [1] org.apache.maven.MavenExecutionException: All tycho plugins configured in one reactor must use the same version
Downloading: https://repo.eclipse.org/content/repositories/releases/org/eclipse/scout/org.eclipse.scout.parent/3.9.1-SNAPSHOT/maven-metadata.xml
[DEBUG] Closing connection to remote
[ERROR] All tycho plugins configured in one reactor must use the same version -> [Help 1]
[ERROR] 
[ERROR] To see the full stack trace of the errors, re-run Maven with the -e switch.
[ERROR] Re-run Maven using the -X switch to enable full debug logging.
[ERROR] 
[ERROR] For more information about the errors and possible solutions, please read the following articles:
[ERROR] [Help 1] http://cwiki.apache.org/confluence/display/MAVEN/MavenExecutionException
[DEBUG] Waiting for process to finish
[DEBUG] Result: 1
Finished: FAILURE